
##TITLE=UV1240_M8_1260-1248_70_7241129_3b9rnCdKow
##JCAMPDX= 6.0         $$ Bruker NMR JCAMP-DX V2.0
##DATA TYPE= NMR SPECTRUM
##DATA CLASS= NTUPLES
##ORIGIN= BRUKER
##OWNER= Administrator
$$ 1.72 TOPSPIN		Version 2.1
$$ 2013-01-18 23:24:25.844 -0500  Administrator@X
$$ Compression mode = diff/dup
##.OBSERVE FREQUENCY= 400.02188249412
##.OBSERVE NUCLEUS= ^1H
##.ACQUISITION MODE= SIMULTANEOUS (DQD)
##.ACQUISITION SCHEME= undefined
##.AVERAGES= 8
##.DIGITISER RES= 22
##SPECTROMETER/DATA SYSTEM= spect
##.PULSE SEQUENCE= zg30
##.SOLVENT NAME= COFFEE_meoh
##.SHIFT REFERENCE= INTERNAL, COFFEE_meoh, 1, 14.98509
##AUDIT TRAIL= $$ (NUMBER, WHEN, WHO, WHERE, PROCESS, VERSION, WHAT)
$$ ##TITLE= Audit trail, TOPSPIN		Version 2.1
$$ ##JCAMPDX= 5.01
$$ ##ORIGIN= Bruker BioSpin GmbH
$$ ##OWNER= Administrator
$$ $$ E:\/data/COFFEE/nmr/UV1240_M8_1260-1248_70_7241129_3b9rnCdKow/20/pdata/1/auditp.txt
$$ ##AUDIT TRAIL=  $$ (NUMBER, WHEN, WHO, WHERE, PROCESS, VERSION, WHAT)
(   1,<2013-01-18 23:24:17.844 -0500>,<Administrator>,<X>,<go>,<TOPSPIN 2.1>,
      <created by zg
	started at 2013-01-18 23:23:11.844 -0500,
	POWCHK enabled, PULCHK disabled,
       configuration hash MD5:
       86 BA 57 50 F2 9D 5C 9B 26 00 A9 28 5F 66 2E 89
       data hash MD5: 64K
       D5 A1 E8 0C AC 58 4C EE CA 85 15 9F 0D 91 23 2A>)
(   2,<2013-01-18 23:24:20.969 -0500>,<Administrator>,<X>,<proc1d>,<TOPSPIN 2.1>,
      <Start of raw data processing
       efp LB = 0 FT_mod = 6 PKNL = 1 PHC0 = 0 PHC1 = 0 SI = 32K 
       data hash MD5: 32K
       B3 82 F8 F6 CE 25 1F 50 75 E3 B5 FD 87 FD 61 AE>)
(   3,<2013-01-18 23:24:21.453 -0500>,<Administrator>,<X>,<proc1d>,<TOPSPIN 2.1>,
      <pk PHC0 = 93.09265 PHC1 = 0 
       data hash MD5: 32K
       9B F9 33 81 1D 36 AC F9 CD 65 1D 06 2C C6 AF C7>)
(   4,<2013-01-18 23:24:21.688 -0500>,<Administrator>,<X>,<proc1d>,<TOPSPIN 2.1>,
      <abs ABSG = 1 
       data hash MD5: 32K
       96 03 92 DE 0F FC B5 AB 7C A5 C5 AB 60 E1 EC 79>)
(   5,<2013-01-18 23:24:21.844 -0500>,<Administrator>,<X>,<proc1d>,<TOPSPIN 2.1>,
      <abs ABSG = 2 
       data hash MD5: 32K
       BC 0A 4D AC 97 AC 6E D8 3E 77 0F C7 2E A2 FE BE>)
(   6,<2013-01-18 23:24:21.985 -0500>,<Administrator>,<X>,<proc1d>,<TOPSPIN 2.1>,
      <abs ABSG = 3 
       data hash MD5: 32K
       45 9B 32 67 C1 F8 F7 71 93 F3 C5 F1 1E 1F 51 C4>)
(   7,<2013-01-18 23:24:22.141 -0500>,<Administrator>,<X>,<proc1d>,<TOPSPIN 2.1>,
      <abs ABSG = 4 
       data hash MD5: 32K
       73 B1 50 47 BE 85 CC A3 90 B5 B8 E9 2E 11 2D D2>)
(   8,<2013-01-18 23:24:22.297 -0500>,<Administrator>,<X>,<proc1d>,<TOPSPIN 2.1>,
      <abs ABSG = 5 
       data hash MD5: 32K
       F8 22 80 F8 29 29 D3 4F 95 46 40 22 7C 7A 5B 8C>)
$$ ##END=
$$ 
$$ $$ hash MD5
$$ $$ E4 DE 91 0A DB AC 7E 1C 4E 86 AC 42 D2 88 B7 73
##$RELAX= 
##$RELAX= 
##$RELAX= 
##$RELAX= 
##$RELAX= 
##$RELAX= 
##$RELAX= 
$$ Bruker specific parameters
$$ --------------------------
##$DU= <E:\>
##$EXPNO= 20
$$ [...]
150 150 150 150 150 150 150 150
##$TP07= 0
##$TPNAME0= <>
##$TPNAME1= <>
##$TPNAME2= <>
##$TPNAME3= <>
##$TPNAME4= <>
##$TPNAME5= <>
##$TPNAME6= <>
##$TPNAME7= <>
##$TPOAL= (0..7)
0.5 0.5 0.5 0.5 0.5 0.5 0.5 0.5
##$TPOFFS= (0..7)
0 0 0 0 0 0 0 0
##$TUNHIN= 0
##$TUNHOUT= 0
##$TUNXOUT= 0
##$USERA1= <user>
##$USERA2= <user>
##$USERA3= <user>
##$USERA4= <user>
##$USERA5= <user>
##$V9= 5
##$VALIST= <valist>
##$VCLIST= <CCCCCCCCCCCCCCC>
##$VD= 0
##$VDLIST= <DDDDDDDDDDDDDDD>
##$VPLIST= <PPPPPPPPPPPPPPP>
##$VTLIST= <TTTTTTTTTTTTTTT>
##$WBST= 1024
##$WBSW= 4
##$XGAIN= (0..3)
0 0 0 0
##$XL= 0
##$YL= 0
##$YMAX_a= 659799
##$YMIN_a= -559225
##$ZGOPTNS= <>
##$ZL1= 120
##$ZL2= 120
##$ZL3= 120
##$ZL4= 120
##$ABSF1= 14.98509
##$ABSF2= -5.573092
##$ABSG= 5
##$ABSL= 3
##$ALPHA= 0
##$AQORDER= 0
##$ASSFAC= 0
##$ASSFACI= 0
##$ASSFACX= 0
##$ASSWID= 0
##$AUNMP= <proc_prof1d_extract_pilot.lims>
##$AXLEFT= 0
##$AXNAME= <>
##$AXNUC= <1H>
##$AXRIGHT= 0
##$AXTYPE= 0
##$AXUNIT= <>
##$AZFE= 0.1
##$AZFW= 0.1
##$BCFW= 0
##$BC_mod= 0
##$BYTORDP= 0
##$COROFFS= 0
##$CY= 15
##$DATMOD= 1
##$DC= 0
##$DFILT= <>
##$DTYPP= 0
##$F1P= 0
##$F2P= 0
##$FCOR= 0.5
##$FTSIZE= 32768
##$FT_mod= 6
##$GAMMA= 0
##$GB= 0
##$INTBC= 1
##$INTSCL= 1
##$ISEN= 128
##$LB= 0
##$LEV0= 0
##$LPBIN= 0
##$MAXI= 10000
##$MC2= 0
##$MEAN= 0
##$ME_mod= 0
##$MI= 0
##$NCOEF= 0
##$NC_proc= -8
##$NLEV= 6
##$NOISF1= 0
##$NOISF2= 0
##$NSP= 0
##$NTH_PI= 0
##$NZP= 0
##$OFFSET= 14.98509
##$PC= 1
##$PHC0= 93.09265
##$PHC1= 0
##$PH_mod= 1
##$PKNL= yes
##$PPARMOD= 0
##$PPDIAG= 0
##$PPIPTYP= 0
##$PPMPNUM= 2147483647
##$PPRESOL= 1
##$PSCAL= 4
##$PSIGN= 0
##$PYNMP= <proc.py>
##$REVERSE= no
##$SF= 400.02
##$SI= 32768
##$SIGF1= 0
##$SIGF2= 0
##$SINO= 400
##$SIOLD= 32768
##$SPECTYP= <>
##$SREGLST= <1H.CDCl3>
##$SSB= 0
##$STSI= 32768
##$STSR= 0
##$SW_p= 8223.68421052631
##$SYMM= 0
##$S_DEV= 0
##$TDeff= 65536
##$TDoff= 0
##$TI= <>
##$TILT= no
##$TM1= 0
##$TM2= 0
##$TOPLEV= 0
##$USERP1= <user>
##$USERP2= <user>
##$USERP3= <user>
##$USERP4= <user>
##$USERP5= <user>
##$WDW= 1
##$XDIM= 32768
##$YMAX_p= 464645004
##$YMIN_p= -728166
##$CURPLOT= <Network HP LaserJet P1505>
##$CURPRIN= <$Network HP LaserJet P1505>
##$DFORMAT= <normdp>
##$LAYOUT= <+/1D_H.xwp>
##$LFORMAT= <normlp>
##$PFORMAT= <normpl>
##$SURQMSG= 1
$$ End of Bruker specific parameters
$$ ---------------------------------
##NTUPLES= NMR SPECTRUM
##VAR_NAME=  FREQUENCY,     SPECTRUM/REAL,   SPECTRUM/IMAG
##SYMBOL=    X,             R,               I
##VAR_TYPE=  INDEPENDENT,   DEPENDENT,       DEPENDENT
##VAR_FORM=  AFFN,          ASDF,            ASDF
##VAR_DIM=   32768,         32768,           32768
##UNITS=     HZ,            ARBITRARY UNITS, ARBITRARY UNITS
##FACTOR=    0.250966925370066, 1,           1
##FIRST=     8223.43324360094, -251792,      -144525
##LAST=      0,             -44038,          -15666
##MIN=       0,             -728166,         0
##MAX=       8223.43324360094, 464645004,    0
$$ Real data points
##PAGE= N=1
##DATA TABLE= (X++(R..R)), XYDATA
$$ [...]
$$ plain form
19519 -28848 14838 21878 -296780 194997 -353567 -120060 -235569 403769 -128930 -282664
19509 -282664 30119 -243876 -273681 -47941 195375 307268 -214751 176669 82342 -138743
19498 156815 213434 -146760 -19918 -47336 211795 -40719 -260537 56077 28269 -132184 -192508
19487 -192508 -219779 -382390 134129 111751 -180154 -45430 37260 -39768 21974 24782 349572
19476 349572 65394 2535 433123 -416377 124720 -148225 -49118 -105207 -76018 29499 61572
19465 61572 -24413 -226126 -219202 -29336 -25289 -196439 -42417 -235744 71782 206495 25974
19453 -231184 -25671 -109540 161410 -249326 41508 326865 59510 -46583 -3344 -56278 86704
19441 -23703 -277001 48371 173652 -39856 73664 -62438 -14885 -176961 137877 -168881 -279866
$$ packed form
19519b8848A4838P040b96780A94997c53567a20060j15509D03769a28930j53734
19509b82664C0119b43876k9805d7941A95375J11893b14751A76669H2342a38743
19498A56815N6619a46760a9918k7418B11795d0719k19818E6077k7808a32184o0324
19487a92508k7271j62611A34129k2378a80154d5430C7260c9768B1974K808L24790
19476C49572F5394B535M30588d16377A24720a48225d9118n6089K9189B9499L2073
19465F1572b4413k01713O924b9336M047j71150d2417j93327G1782J34713B5974
19453b31184b5671q3869A61410b49326D1508K85357E9510d6583c344n2934H6704
19441b3703k53298D8371J25281c9856G3664f2438a4885j62076A37877a68881j10985
$$ plain form
19430 -279866 -251950 15475 -95809 26582 64115 -111582 -105173 94806 -28989 70112 -179347
19418 -256047 -188738 30897 -148019 55691 225917 -165596 72321 -122926 65205 -176562
19407 101384 -199048 -236786 -69437 -185393 -118399 60406 -139166 -210285 -111844 -145442 -83951
19396 -83951 16711 461157 -54305 -290607 -66953 196851 3467 -53032 28581 -207303 -279388
19385 -279388 4852 -114782 -138635 -13259 -191944 -1372 -15904 26459 -212983 -1783 -109528
19374 -109528 -193330 82214 -6396 39138 115853 -8358 209125 -82010 -167472 -59667 -143882 -153958
19362 -153958 -25155 -95545 -376060 35813 -18227 -148585 -32983 -66812 -31041 -24737 -279423
19351 -279423 -34297 -165772 -136765 -388134 37915 -36437 -24296 19528 -294121 54534 -86624
$$ packed form
19430b79866K7916A5475i5809B6582L7533a11582O409I4806b8989G0112a79347
19418b56047O7309C0897a48019E5691J70226a65596G2321a22926F5205a76562
19407A01384a99048l7738f9437j15956O6994F0406a39166p1119R8441l3598O1491
19396h3951A6711M44446e4305k36302f6953A96851C467e3032B8581b07303p2085
19385b79388D852a14782k3853a3259j78685a372j4532B6459b12983a783j07745
19374a09528q3802H2214f396C9138P6715h358B09125h2010q5462e9667q4215j0076
19362a53958b5155p0390k80515C5813a8227j30358c2983l3829c1041O304k54686
19351b79423c4297j31475K9007k51369C7915c6437J2141A9528b94121E4534h6624
$$ plain form
19339 -115871 -39071 101860 42361 -6540 -79027 -359662 -10794 -185307 -203875 171991 11999
19327 209058 9332 -123829 -186992 -422759 -133877 36255 23698 -23071 -236890 162254 -61050
19315 110116 -330839 112138 362340 -101052 183356 236355 -39073 -24950 138501 -46472
19304 19051 158545 92643 -158539 7261 156441 -185795 -318726 -316737 -111966 -202509 233882
19292 -170226 -165256 -278592 -284439 -185088 -174477 -225342 -45559 -85010 -330308 325009 -205380
19280 -12898 -146718 -248907 -153146 242729 -35257 -335984 -150191 228480 166900 -20750
19269 113994 31347 -32782 -109186 -257606 103541 -120809 82954 286532 -360378 -16926
19258 -588 19446 35206 18114 -37727 -7258 18696 -99916 -243023 -3382 1176 90898 -24354
$$ packed form
19339a15871c9071A01860D2361f540p2487k80635a0794j74513j8568A71991A1999
19327B09058I332a23829o3163k35767a33877C6255j2557b3071k13819A62254f1050
19315A10116c30839A12138K50202a01052A83356N2999c9073J4123A38501d6472
19304A9051J39494o5902a58539G261J49180a85795j32931J989a11966r0543B33882
19292a70226M970j13336n847R9351J0611n0865d5559l9451k45298C25009b05380
19280a2898j33820j02189R5761B42729c5257l00727a50191B28480o1580b0750
19269A13994C1347c2782p6404j48420A03541a20809H2954K03578c60378a6926
19258e88A9446J5760j7092c7727g258A8696i9916j43107c382A176Q9722b4354
$$ plain form
19245 -267167 -84188 -190966 54302 -122821 -196096 -240411 -277509 -167188 -65847 -123267 -2912
19233 -113932 -134538 -93402 43793 -172092 -321279 -160819 -144375 -148169 -88444 -139083 56406
19221 -70905 -231012 95406 -143427 173236 -285230 -52550 -615863 -387200 -306145 -26560
19210 269601 -74647 -548663 -195595 11775 70800 -105627 51284 240364 281783 -288481
19199 -357533 -31707 49922 272663 -30250 -424646 117072 91389 -309968 -83021 252994
19188 -142526 -442105 200945 -84001 -182492 -306546 -137719 -43013 -112911 96313 -125016
19177 -273533 169281 -128903 -417480 -11425 -165494 133681 -550 -136170 97685 9819 67439
19166 67439 -201447 199942 5117 -197233 118639 25968 -128396 -53864 -285463 -288358 193539
$$ packed form
19245b67167h4188j06778E4302a22821p3275m4315l7098J10321f5847n7420b912
19233a13932k0606M1136D3793a72092j49187J60460J6444l794N9725n0639E6406
19221g0905j60107I5406a43427A73236b85230e2550n63313K28663Q1055b6560
19210B69601g4647m74016a95595A1775N9025a05627E1284J89080M1419b88481
19199c57533c1707D9922K22741c0250l94396A17072k5683c09968h3021B52994
19188a42526k99579B00945h4001r8491j24054a37719d3013o9898I6313a25016
19177b73533A69281a28903k88577a1425j54069A33681e50j35620I7685I819N7620
19166F7439b01447A99942E117a97233A18639B5968a28396e3864k31599k895A93539
$$ plain form
19154 -69464 -65982 -115988 -229798 -159349 -128627 -82754 -884 157473 -188271 -177042 6080 -238570
19141 116323 208738 211959 -396040 154893 -191218 304111 175117 115485 -164342 -173478 -279003
19130 -279003 -72229 -115442 220089 -57342 -102256 -25271 68932 41943 -165737 -149760 -557458
19119 -557458 -20255 -101525 68477 -25060 -59360 -61548 78357 286044 29905 -62361 344704
19107 9477 -455147 -85033 -73732 11186 -70255 5761 -33542 -39887 60563 53348 -171757 -13841
19094 -318688 -4318 105434 169026 -14583 -222731 -173094 -108696 233824 -451728 -119865 -368003
19083 -368003 21437 -236606 -53533 98983 193739 -111310 -432962 93923 -43098 -363575 -64105
19071 311026 -44110 80540 63657 -9002 212775 -79949 -254484 176088 122193 193073 -48688
$$ packed form
19154f9464L482n0006j13810P0449L0722M5873h84A57473a88271J1229F080b38570
19141A16323R2415L221c96040A54893a91218C04111j28994n9632a64342r136j05525
19130b79003g2229m3213B20089e7342m4914b5271F8932k6989a65737J5977m07698
19119e57458b0255q1270F8477b5060l4300k188G8357K07687B9905f2361C44704
19107I477d55147h5033J1301A1186g0255E761c3542o345F0563p215a71757a3841
19094c18688d318A05434O3592a4583k08148M9637O4398B33824d51728a19865k48138
19083c68003B1437b36606e3533I8983R4756a11310l21652I3923d3098l20477f4105
19071C11026d4110H0540j6883i002B12775g9949j74535A76088n3895P0880d8688
$$ plain form
19059 168365 213964 -251331 -130325 37972 -156656 -232157 -170021 -366921 -301340 -51172 -391190
19048 -391190 -291672 98986 -191696 -120522 -66133 202127 -230468 215983 -73558 -247613
19038 -247613 -362133 -31034 2907 -152859 -60718 45630 -139559 -135201 -201697 37319 -289958
19026 -14606 -91402 81546 127412 -31872 -145906 -218014 23669 175797 -274584 -178556 -316642
19015 -316642 8098 177755 6242 217083 -67860 119612 241150 222382 16161 -222091 -163082
19004 -163082 -38029 -79093 38676 -45253 -61716 7481 -117224 166053 167004 -53674 88121 -175997
18991 249503 -79041 11677 -82338 -207388 -178328 -311240 2743 10817 -204153 -186184 -120588
18980 -120588 163167 -192177 -76397 -210011 -227044 -338026 15724 -7149 -79400 -446713 -39688
$$ packed form
19059A68365M5599b51331J21006C7972a56656p5501O2136j96900O5581e1172l40018
19048c91190R9518I8986a91696P1174N4389B02127b30468B15983g3558j74055
19038b47613j14520c1034B907a52859f0718D5630a39559M358o6496C7319b89958
19026a4606p6796H1546M5866c1872j14034p2108B3669J52128b74584R6028j38086
19015c16642H098J69657F242K10841f7860A19612J21538j8768A6161b22091N9009
19004a63082c8029m1064C8676d5253j6463G481a17224A66053R51e3674H8121a75997
18991B49503g9041A1677h2338j25050K9060j32912B743Q074b04153J7969O5596
18980a20588A63167a92177g6397j33614j7033j10982A5724g149p2251l67313c9688
$$ plain form
18968 -113737 142969 -428881 203147 45148 -61327 -166936 -57205 51582 -17491 -191990
18958 -191990 374 181555 -282549 -11350 40900 154790 115513 -54407 -82343 47351 263068
18947 263068 23625 196498 341356 38020 -84702 -31573 254100 147351 -20582 -71518 309914
18935 -102093 14663 194951 26 -112703 -120303 -32559 5764 137386 -43130 6537 -135681 -117464
18923 -117464 -274436 -241401 -224698 -146330 -179113 -195434 -218510 56755 -144225 -89117 -111564
18912 -111564 -206632 326472 -312860 -149081 76118 131077 -37168 188538 -109333 29159
18901 -211371 -161160 -121513 -36660 -323839 -14443 -219610 31859 84775 191669 41697 -77744
18889 401302 -178588 210051 -101184 -124252 -266713 342091 -249404 -307069 -179831 18305
$$ packed form
18968a13737A42969d28881B03147D5148f1327j05609e7205E1582a7491j74499
18958a91990C74J81181b82549a1350D0900J13890l9277e4407k7936D7351K15717
18947B63068B3625J72873J44858C8020h4702c1573B54100j06749b0582n0936C09914
18935a02093A4663J80288B6a12703p600c2559E764J31622d3130F537a35681J8217
18923a17464j56972L3035J6703P8368l2783j6321k3076E6755a44225N5108k2447
18912a11564r5068C26472c12860a49081G6118N4959c7168A88538a09333B9159
18901b11371N0211L9647c6660k87179a4443k05167C1859N2916J06894D1697g7744
18889D01302a78588B10051a01184k3068j42461C42091b49404n7665J27238A8305
$$ plain form
18878 -231511 2123 -156632 198078 75663 60749 -41373 61514 105690 -132586 -299653 8771
18866 -256479 -27364 -251140 47188 -209513 -12498 -333802 -106407 127153 84869 -180218
18855 77240 -189903 4020 7804 -150027 -92198 23374 -65768 -169751 -259271 -292855 -173621
18844 -173621 -82822 16702 426163 -66485 55029 -141340 166263 -160677 144260 -165712
18833 -62779 -202928 -916 91966 144366 -182410 114560 -146191 -121902 14247 -258233 303744
18821 111301 -316453 852 319264 -90959 99825 -376663 268375 -42237 -67721 -85859 131088
18809 178952 163907 -323042 65517 -140393 284570 -250588 -71611 -192712 -189282 -79820 21715
18797 69913 -150660 4697 329132 -19980 170291 -274792 -364759 45708 -76745 129791 1876
$$ packed form
18878b31511B123a56632A98078G5663j4914d1373F1514M4176a32586j67067H771
18866b56479b7364k23776D7188b09513a2498l21304a06407A27153m2284a80218
18855G7240a89903D020L784a50027N7829B3374f5768j03983q9520l3584J19234
18844a73621h2822A6702M09461f6485E5029a41340A66263a60677A44260a65712
18833f2779j40149i16I1966N2400a82410A14560a46191K4289A4247b58233C03744
18821A11301c16453H52L18412i0959I9825c76663B68375d2237k5484j8138A31088
18809A78952j5045c23042F5517a40393B84570b50588g1611j21101L430g9820B1715
18797F9913a50660D697L24435a9980A70291b74792q9967D5708g6745A29791A876
$$ plain form
18785 35575 -50879 252666 320528 264469 68119 -135509 46188 -79019 -339056 130237 -46038
18773 -247194 -314629 19475 -146105 -118638 50931 -246806 -265998 -177809 -431219 -31020 -288172
18762 -288172 178792 34781 27977 -78447 139206 -211640 154960 -178007 -152344 -103290 28688
18750 -262034 -159004 -142179 32704 153243 -46752 -110575 -251635 -174999 -35367 106423 -62008
18738 -189938 -149807 -29714 16597 -185287 1932 -253949 27650 -101398 138919 135263 -334472
18726 -120852 51335 309395 98553 -65240 329022 -184156 24203 201173 -294969 -131892
18715 188432 182764 -130373 -339521 -89849 31529 -200442 -1043 -271898 -6444 -149594 -77652
18704 -77652 -54373 58686 100 -248120 -46122 -97200 73393 52270 189693 -67535 -186079
$$ packed form
18785C5575e0879B52666O7862n6059F8119a35509D6188g9019k60037A30237d6038
18773b47194o7435A9475a46105K7467E0931b46806j9192Q8189k53410c1020k57152
18762b88172A78792C4781o804g8447A39206b11640A54960a78007K5663M9054B8688
18750b62034J03030J6825C2704J20539d6752o3823j41060P6636c5367A06423f2008
18738a89938M0131b9714A6597a85287A932b53949B7650a01398A38919l656c34472
18726a20852E1335K58060I8553f5240C29022a84156B4203J76970b94969a31892
18715A88432n668a30373k09148h9849C1529b00442a043k70855f444j43150P1942
18704g7652K3279E8686A00b48120d6122n1078G3393k1123J37423f7535j18544
$$ plain form
18693 -186079 -80352 -137445 102142 69297 -173231 44066 -154959 -185907 -200032 247564 -136091
18681 -65342 -116751 -82647 -4926 -206238 -248186 62704 -225573 107851 -201738 139211 -73846
18669 -66888 -63373 -323911 144348 -130567 236299 101282 -227927 85303 89078 -264781 -85909
18657 -246566 -118894 -132513 -180447 318054 234296 -190033 -301669 283171 -15835 36350
18646 1608 -179965 164034 81200 -33259 -34762 12904 -68618 66437 160889 62038 -220238
18634 -284340 -101145 -22229 141684 149803 -235973 -142080 165091 -105932 234646 -482714
18623 -110553 -157151 -93302 182015 -247761 25012 34910 -54396 83038 -152785 -318175 -435383
18612 -435383 -198632 64229 85906 -135526 -19683 -78276 129544 -16038 -150530 -31337 -138378
$$ packed form
18693a86079h0352n7093A02142l2845a73231D4066a54959l0948j4125B47564a36091
18681f5342n1409L4104d926k01312m1948F2704b25573A07851b01738A39211g3846
18669f6888L515k60538A44348a30567B36299A01282b27927H5303L775b64781h5909
18657b46566a18894j3619m7934C18054q3758a90033j11636B83171a5835C6350
18646A608a79965A64034H1200c3259j503A2904f8618F6437R4452F2038b20238
18634b84340a01145b2229A41684Q119b35973R3893A65091a05932B34646d82714
18623a10553m6598O3849A82015b47761B5012R898e4396H3038a52785j65390j17208
18612d35383a98632F4229K1677a35526a9683n8593A29544a6038j34492c1337j07041
$$ plain form
18601 -138378 -122634 132925 107429 70062 56489 -345060 35053 1656 -246766 -377337 254714
18589 -123582 -46317 -280849 153834 135633 -269941 -157265 -38291 203333 -34830 -55591
18579 -55591 166881 -118201 221729 183710 233926 -2262 -134938 320532 17687 -8357 -7461
18568 -7461 -127875 -164903 -122124 192998 424320 -53188 91773 135618 144159 -116002 -102759
18557 -102759 -87292 -119194 -204258 -4848 308684 -77047 321276 -40817 248609 38589 48247
18546 48247 34238 -195704 -7162 -109628 40416 323048 163356 -213538 -344868 -3108 167825
18534 -103985 -92181 453169 -230982 258341 -363053 -361355 -180214 -178341 -160664 66878 8739
18522 120831 75413 -1216 173846 60955 -28803 127025 -215055 -22802 -210091 -182517 -228118
$$ packed form
18601a38378J5744A32925k5496l7367j3573c45060C5053A656b46766j30571B54714
18589a23582d6317k34532A53834j8201b69941J12676c8291B03333c4830k0761
18579e5591A66881a18201B21729l8019N0216b262j32676C20532A7687h357Q96
18568g461j20414l7028M2779A92998K31322e3188I1773M3845Q541a16002J3243
18557a02759J5467l1902q5064d848C08684g7047C21276d0817B48609C8589R658
18546D8247j4009a95704g162j02466D0416K82632j59692b13538j31330c108A67825
18534a03985J1804D53169b30982B58341c63053J698a80214J873J7677F6878H739
18522A20831m5418a216A73846F0955b8803A27025b15055b2802j87289K7574m5601
$$ plain form
18511 -228118 -329583 255104 -33991 63496 1513 -133972 39996 140556 -467254 61772 135432
18500 135432 -201347 -150508 240693 141929 -424210 147571 -214753 268605 -95891 -14012
18489 -163889 104220 230181 -97874 -215582 -281019 -19043 -319745 7891 -31217 -274361 28290
18477 -256968 133784 20240 -7058 -176658 125138 384287 213958 85024 -68371 -7518 31802
18465 -217763 181290 -278491 -231015 180399 -55300 -62308 -85671 -15999 -127332 209355 -52649
18453 -35985 -280390 -27279 -76226 -127146 30666 100398 -381984 16887 -26859 314118 -33295
18441 90218 -271118 214780 360072 113830 209124 -104036 -22019 -44823 28458 -135045
18430 -118066 166058 -209488 -190601 304065 -291680 -351121 54258 -297335 -207467 239818
$$ packed form
18511b28118j01465B55104c3991F3496A513a33972C9996J00560d67254F1772P3660
18500A35432b01347N0839B40693r8764d24210A47571b14753B68605i5891a4012
18489a63889A04220J25961i7874j17708o5437a9043l00702G891c1217k43144B8290
18477b56968A33784B0240g058j69600A25138K59149j70329H5024f8371g518C1802
18465b17763A81290b78491M7476A80399e5300p008k3363a5999j11333B09355e2649
18453c5985k44405b7279m8947n0920C0666O9732c81984A6887b6859C14118c3295
18441I0218b71118B14780J45292A13830R5294a04036b2019k2804B8458a35045
18430a18066A66058b09488J8887C04065b91680n9441E4258b97335Q9868B39818
$$ plain form
18419 -199078 203184 62099 -144675 100750 -139115 -248506 18103 14239 -114682 39717
18408 -145329 194462 -286822 -283106 81910 103541 -53605 -64040 158957 -1735 -197305 -159071
18397 -159071 -43044 4775 -173913 -83321 -250350 -129904 -275473 -177758 -205652 -117050 -421491
18386 -421491 -300704 153120 34905 150271 30797 4825 94536 -152310 -28182 -92277 93153
18374 155209 -74986 88104 -81856 -242334 37487 3728 291572 -68267 -28445 -228069 -104097
18362 -47980 -34067 139530 -84060 -90926 -104073 -199322 19362 -112225 101811 -42285 155493
18350 67272 104949 -250991 3930 -253514 -222256 198616 111517 -67221 136331 50085 -97868
18338 -164356 238662 -19126 -131069 -106457 27026 -118095 200325 164309 -59073 73448 -9901
$$ packed form
18419a99078B03184F2099a44675A00750a39115j09391A8103l864a14682C9717
18408a45329A94462b86822L716H1910K1631e3605j0435A58957a735j95570L8234
18397a59071d3044D775a73913h3321j67029J20446j45569R7715k7894Q8602l04441
18386d21491J20787A53120C4905J15366C0797D825Q9711a52310b8182o4095I3153
18374A55209g4986H8104h1856j60478C7487C728K87844f8267b8445j99624a04097
18362d7980J3913A39530h4060o866j3147r5249A9362a12225A01811d2285A55493
18350F7272L7677b50991C930b53514L1258A98616q7099f7221A36331E0085i7868
18338a64356B38662a9126j11943K4612B7026a18095B00325l6016e9073G3448i901
$$ plain form
18326 131284 -472623 87952 236151 63609 10689 -94730 -61116 -240811 132774 42504 159355
18315 159355 86483 21102 -218560 -114976 190130 -185720 -265117 -122728 -266317 98078
18304 -158583 -408812 -235961 212307 94244 150669 34675 341435 -155598 36412 38411 -208239
18292 18723 -217700 -46383 24481 -208384 129193 155641 277064 -118896 134141 -24454
18281 -271658 -63154 -99058 -358344 -69310 -307654 21767 -114445 -36733 -8133 -119592 162608
18269 -83966 -187000 -46039 10808 28863 -13273 -254244 19908 -204885 -58314 -36400 295285
18257 -32213 -347474 -59291 -224579 161407 115902 -47608 233333 180712 -195035 -24461 -185514
18246 -185514 -218652 -102314 263357 182791 -204167 -27017 -25352 -390356 33677 -77469 -8683
$$ packed form
18326A31284d72623H7952J48199F3609A0689i4730L3614j79695A32774D2504J16851
18315A59355p2872B1102b18560J03584A90130a85720p9397a22728j43589I8078
18304a58583k50229J72851B12307I4244N6425C4675L06760a55598C6412J999b08239
18292A8723b17700d6383B4481b08384A29193K6448J21423a18896A34141b4454
18281b71658f3154l5904k59286f9310k38344B1767a14445c6733h133j11459A62608
18269h3966j03034d6039A0808J8055a3273k40971A9908b04885e8314K1914B95285
18257c2213l15261e9291j65288A61407m5505d7608B33333n2621a95035b4461j61053
18246a85514l3138a02314B63357q0566b04167b7017J665l65004C3677g7469h683
$$ plain form
18234 282527 -134549 -77078 -178119 49930 -205157 -51865 141689 -305954 -131166 -8635
18223 -195118 -28362 -26503 -305646 79602 115159 -78904 269345 167472 -30663 91415 179151
18212 179151 475740 -246312 48674 101832 -440856 171375 107541 -56391 179384 -153795
18201 -7693 17642 -1266 -144634 -119320 78590 -61779 -262433 30904 -8212 -317820 76467 -41571
18188 -391766 -351681 234547 194950 -392314 125166 -104566 -301082 -243291 -106567 -153369
18178 -153369 158946 182686 65461 -15283 -14288 -61113 -33500 35131 -260529 48079 -28013
18166 403572 -214053 -69441 190863 -234038 22911 -221944 38781 -122202 -182605 9382 -50323
18154 -69835 -156893 -41937 171730 59413 -449036 -199852 -296880 -177617 99160 183770 -194559
$$ packed form
18234B82527a34549N7471j01041D9930b05157e1865A41689c05954a31166h635
18223a95118b8362J859k79143G9602L5557g8904B69345j01873c0663I1415Q7736
18212A79151K96589b46312D8674N3158d40856A71375o3834e6391A79384a53795
18201g693A7642a266j43368K5314G8590f1779k00654C0904h212l09608G6467d1571
18188c91766M0085B34547l9597c92314A25166a04566j96516N7791a06567m6802
18178a53369A58946K3740F5461a5283R95m6825K7613C5131b60529D8079b8013
18166D03572b14053f9441A90863b34038B2911b21944C8781a22202o0403I382e0323
18154f9835q7058d1937A71730E9413d49036a99852r7028J19263I9160Q4610a94559
$$ plain form
18142 43155 -135997 -243846 -80191 -250817 -119157 185579 -81136 -110910 89340 319212
18132 319212 -258248 166404 216035 -86730 -53720 180554 -5514 36661 -154558 20192 -266077
18120 -248179 209802 -168514 -338014 -259584 -195188 -211277 201912 888 -107433 129180 -29129
18108 -306167 -2495 -224818 260439 -258596 -61907 -32353 15392 177625 -77803 -339899 -92399
18096 -91708 -312982 -266525 183129 -398469 -1254 -90484 21593 -289470 209383 618 78130
18085 78130 3641 -300716 -87122 71633 -62845 -146669 -72344 100117 96877 216526 62042
18073 -103992 -123436 59229 -141347 217519 -14706 44556 -503449 169482 -298613 -275905
18063 -275905 -236449 -267149 71712 217523 -163128 -26591 363390 -89074 263605 21012 157228
$$ packed form
18142D3155a35997j07849h0191j70626a19157A85579h1136k9774H9340K29872
18132C19212b58248A66404M9631h6730L3010A80554e514C6661a54558B0192b66077
18120b48179B09802a68514j69500P8430O4396j6089B01912H88a07433A29180b9129
18108c06167b495k22323B60439b58596f1907K9554A5392J62233g7803k62096i2399
18096i1708k21274M6457A83129c98469a254q9230B1593b89470B09383F18P7512
18085G8130C641c00716h7122G1633f2845q3824g2344A00117l240J19649F2042
18073a03992j9444E9229a41347B17519a4706D4556e03449A69482b98613K2708
18063b75905L9456l0700G1712J45811a63128b6591C63390h9074B63605B1012J36216
$$ plain form
18052 157228 -116060 -68920 -75892 212244 -123753 20813 131036 108655 119620 -276495 -256605
18041 -256605 20754 121730 239958 137950 163169 84925 -152369 175308 44192 415488
18031 415488 -22329 141551 18022 -247243 -73671 98422 -54619 142855 -34694 -64530 66072
18019 -134884 -149216 58955 279638 -2331 -68972 -74788 111977 201073 105635 -86701 13128
18007 -49055 -67562 -100961 303712 315726 -247890 84880 193899 51419 58120 103458 -172951
17995 -14058 102194 -131751 50713 -147468 -81863 115930 -170431 -51175 269128 -18043
17984 232953 47471 -321852 111781 -85323 -6606 383336 -4732 276210 249309 -117597 -27211
17972 1378 -261332 -136836 -140614 104846 59657 77123 183397 -29338 254376 -309570 -99239
$$ packed form
18052A57228a16060M7140o972B12244a23753B0813J10223k2381J0965b76495J9890
18041b56605B0754J00976J18228j02008K5219p8244a52369A75308D4192L71296
18031D15488b2329A41551A8022b47243g3671I8422e4619A42855c4694k9836F6072
18019a34884j4332E8955K20683b331o6641n816A11977Q9096r5438h6701A3128
18007d9055j8507l3399C03712J2014b47890H4880J09019E1419O701M5338a72951
17995a4058A02194a31751E0713a47468O5605A15930a70431e1175B69128a8043
17984B32953D7471c21852A11781h5323f606C83336d732B76210k6901a17597b7211
17972A378b61332J24496l778A04846m5189J7466J06274b9338B54376c09570i9239
$$ plain form
17960 -197243 212881 20107 41061 157267 98316 334658 -165076 -153635 118828 -9609 142287
17948 58835 -150623 2013 -183851 43526 20182 99738 102961 -192952 39721 -179440 -12337
17936 -145200 5940 13878 -365454 -26194 220867 76659 -78121 -181906 125188 116231 183404
17925 183404 303169 39498 32094 362621 306563 -257661 -9994 41338 -188671 -60436 -139695
17914 -139695 -21963 182089 -184920 104849 -388878 -295472 -270854 46680 107021 -195025
17903 100697 264945 38898 -312431 47365 -246364 80971 224197 -183950 45440 -254916
17892 -203168 -244532 85960 -128112 393739 -489893 -109856 -46641 339340 32626 -204497
17881 2617 35689 -195792 -128273 69444 113147 -87854 231455 111285 -174041 -36238 -129737
$$ packed form
17960a97243B12881B0107K0954J16206n8951K36342a65076J1441A18828i609A42287
17948E8835a50623B013a83851D3526B0182P9556L223a92952C9721a79440a2337
17936a45200E940P938c65454b6194B20867G6659g8121j03785A25188q957O7173
17925A83404J19765C9498p404L30527n6058b57661i994D1338a88671f0436p9259
17914a39695b1963A82089a84920A04849c88878R3406K4618D6680O0341a95025
17903A00697J64248C8898c12431D7365b46364H0971J43226a83950D5440b54916
17892b03168m1364H5960a28112C93739d89893a09856d6641C39340C2626b04497
17881B617L3072a95792O7519F9444M3703h7854B31455A11285a74041c6238r3499
$$ plain form
17870 -129737 -184394 63402 247847 310451 -195891 98609 -300644 27318 -50997 83896 -171072
17858 324437 217143 -240919 -226630 -50354 -211528 15749 -69864 -41027 37608 -105791 197367
17846 -444393 160166 115772 21530 -247089 -113385 139371 -160879 -231966 31115 -322053
17835 -125814 -107392 -170994 116596 -175100 -189190 157864 -186888 119160 -6702 -71622 -394850
17824 -394850 93146 28802 109628 43717 63131 -4507 -40197 -153898 56984 216092 15677
17812 -122949 276584 -194503 -354828 76477 51634 147058 137492 6042 -106885 259029 -14813
17800 193799 162370 -121586 -129479 -148119 69117 -87181 226689 -82635 -126284 113188 221444
17789 221444 -83875 25049 -367126 -143818 55693 24640 -175056 -50774 23485 21660 159096
$$ packed form
17870a29737n4657F3402J84445O2604a95891I8609c00644B7318e0997H3896a71072
17858C24437j07294b40919J4289e0354j61174A5749f9864K8837C7608a05791A97367
17846d44393A60166m4394B1530b47089a13385A39371a60879p1087C1115c22053
17835a25814J8422o3602A16596a75100j4090A57864a86888A19160f702o4920l23228
17824c94850I3146B8802Q0826D3717J9414d507l5690j13701E6984J59108A5677
17812a22949B76584a94503j60325G6477k4843R5424r566F042a06885B59029a4813
17800A93799l1429a21586p893j8640F9117h7181B26689h2635m3649A13188J08256
17789B21444h3875B5049c67126a43818E5693B4640a75056e0774B3485j825J37436
$$ plain form
17778 159096 130619 -17767 -229437 -72470 178459 -347545 -183892 158520 32709 36991 163980
17767 163980 -97297 -32716 293893 390612 113664 149775 -365968 265125 186523 -69260 -243048
17756 -243048 38 -58520 -31881 3876 -60808 -110938 -6449 -77243 -232271 187208 -216090 137716
17743 105221 67608 270367 229485 -78062 -109749 98651 -15660 110295 -107623 -175842 209193
17731 127831 -110573 -208637 164373 -29873 115645 -32499 -93846 291296 -18907 -133272
17721 -133272 7418 18268 -37927 419453 -145976 203770 162625 46041 -132100 108339 -53087
17709 -23618 66139 -59876 -374109 59509 -27894 101262 -255161 -236317 96896 -1577 -70881
17698 -70881 111521 -56402 72428 432937 546696 -16591 -168951 -109848 107121 474657
$$ packed form
17778A59096k8477a7767k11670g2470A78459c47545J63653A58520C2709M282J26989
17767A63980i7297c2716B93893R6719A13664L6111c65968B65125p8602f9260j73788
17756b43048C8e8520K6639C876f0808n0130f449p0794j55028A87208b16090A37716
17743A05221l7613K02759m0882g8062l1687I8651a5660A10295a07623o8219B09193
17731A27831a10573r8064A64373b9873A15645c2499o1347B91296a8907j14365
17721a33272G418J0850c7927D19453a45976B03770m1145D6041a32100A08339e3087
17709b3618F6139e9876l14233E9509b7894A01262b55161J8844I6896a577o9304
17698g0881A11521e6402G2428L60509J13759a6591j52360N9103A07121L67536
$$ plain form
17688 474657 64697 -297417 -61402 16158 -150384 -188521 -16272 116914 -28055 253058 -208032
17676 -113969 -173499 3153 130661 86692 182583 -206977 50720 -102979 139977 126465 36189
17664 105531 17002 182992 89643 118615 192486 -203739 -116534 -116995 -67186 -25365 126558
17652 386987 167738 -158528 86199 -24937 198555 -32259 -221597 -99316 65902 -203359
17641 -62763 -90468 15698 -149179 44296 -78075 -112260 -163888 113710 -36804 -48385 2052
17629 -56779 66331 96532 286632 133672 -84652 15617 130478 -15258 -45785 179183 115626
17618 115626 193802 158202 85314 -61378 145007 190641 302482 -133458 76678 224284 308792
17607 308792 73646 236951 256039 -163400 127682 -76813 -63838 24558 27561 94177 114313
$$ packed form
17688D74657F4697b97417f1402A6158a50384l8137a6272A16914b8055B53058b08032
17676a13969n9530C153J27508m3969R5891b06977E0720a02979A39977j3512C6189
17664A05531A7002J65990H9643K8972P3871b03739Q7205m61M9809b5365A26558
17652C86987A67738a58528H6199b4937A98555c2259j89338i9316F5902b03359
17641f2763k7705A5698a49179D4296g8075l4185n1628A13710c6804j1581B052
17629e6779F6331L0201J90100A33672h4652A5617J14861a5258l0527A79183o3557
17618A15626P8176l5600p2888f1378A45007M5634J11841a33458G6678J47606Q4508
17607C08792G3646J63305J9088a63400A27682g6813J2975B4558L003O6616K0136
$$ plain form
17596 114313 132879 110613 126732 -58612 167002 120024 -69716 282464 237751 301143 -116165
17584 -317087 262447 -190835 -242301 32634 -345705 106772 -72347 227783 -307414 247092
17573 340478 -124157 46850 55572 -118847 243565 5439 -83164 -35331 -47296 502848 34776
17561 -103737 122493 111872 72149 23082 50480 -59215 108818 123531 -14917 21701 183370
17550 183370 4823 73390 87225 197311 -179192 -45833 -340400 -51823 61172 104870 99638
17539 99638 24140 217242 164709 137426 108034 169993 -113149 -105577 -53199 -107875 -31221
17527 164235 137192 162524 327800 -119117 235663 517696 354311 122976 -160042 -172697
17517 -172697 37494 199045 311929 300852 121671 96055 197011 17 91055 6494 153696
$$ packed form
17596A14313J8566k2266J6119e8612A67002m6978f9716B82464m4713O3392a16165
17584c17087B62447a90835n1466C2634c45705A06772g2347B27783c07414B47092
17573C40478a24157D6850Q722a18847B43565E439h3164c5331j1965E02848C4776
17561a03737A22493j0621l9723B3082K7398e9215A08818J4713a4917B1701J61669
17550A83370D823O8567J3835J10086a79192d5833k94567e1823F1172M3698n232
17539I9638B4140J93102n2533k7283k9392O1959a13149P572N2378n4676c1221
17527A64235k7043K5332J65276a19117B35663K82033j63385A22976a60042j2655
17517a72697C7494J61551J12884j1077A21671k5616J00956A7R1038F494J47202
$$ plain form
17506 153696 254556 -48164 141488 118287 72132 29856 201372 344766 118014 188508
17496 188508 186737 66562 44624 57731 -251549 134537 -20929 -22026 58785 398640 79142
17484 320871 -44066 68991 -10109 -12092 139487 184834 311607 41145 292061 -96114 78290
17472 68850 340200 338718 262947 -171509 157522 327600 157733 263692 412224 -43171
17461 38350 9538 -9113 401131 141724 468181 270224 319884 413033 -288554 244996 137166
17450 137166 202157 468663 395742 180871 686135 252667 158023 43849 257324 -22786
17439 1443 491052 253840 255167 192824 138301 472223 267072 -23373 161988 281807 237462
17428 237462 463486 557890 89973 49432 172725 -226930 10789 236950 138516 405832
$$ packed form
17506A53696J00860d8164A41488k3201m6155B9856J71516J43394A18014P0494
17496A88508j771F6562k1938J3107b51549A34537b0929j097E8785L39855G9142
17484C20871d4066F8991a0109j983A39487M5347J26773D1145K50916i6114G8290
17472F8850K71350j482p5771a71509A57522J70078A57733J05959J48532d3171
17461C8350I538i113D01131A41724L26457j97957M9660R3149b88554B44996j07830
17450A37166O4991K66506p2921A80871N05264B52667r4644D3849K13475b2786
17439A443M89609k37212J327o2343n4523L33922k05151b3373A61988J19819m4345
17428B37462K26024R4404H9973m0541J23293b26930A0789K26161r8434K67316
$$ plain form
17418 405832 357589 148827 205945 172882 531809 319418 209161 390014 92778 125655
17408 125655 283173 -23572 173295 283878 116793 151250 126971 189883 420146 57799
17397 233949 -530 69352 138737 -26135 36149 210570 -42632 463704 -43009 400402 119008
17385 438198 230881 115694 -163343 279095 220629 96023 207342 296712 178616 -106395
17374 13531 212358 115226 192805 -39317 354979 378612 75138 -48069 204934 105815 -20723
17362 -27217 -164698 143157 -29287 214683 420183 21610 305255 97916 268439 208133
17352 208133 214276 175412 124609 -66203 103895 339576 386515 88442 325259 -38506 299543
17340 211749 419244 90669 311828 272709 192506 -1543 288682 -2900 213660 176893 172552
$$ packed form
17418D05832m8243A48827N7118l3063L58927k12391j10257J80853I2778L2877
17408A25655J57518b3572A73295J10583A16793L4457k4279O2912K30263E7799
17397B33949e30F9352O9385b6135C6149J74421d2632D63704d3009D00402A19008
17385D38198k07317j15187a63343B79095n8466I6023J11319Q9370j18096a06395
17374A3531J98827r7132P7579c9317C54979K3633G5138d8069B04934r9119b0723
17362b7217j37481A43157b9287B14683K05500B1610K83645I7916J70523o0306
17352B08133O143l8864n0803f6203A03895K35681M6939H8442K36817c8506B99543
17340B11749K07495I0669K21159l9119q0203a543B88682b900B13660l6767m341
$$ plain form
17329 172552 252436 -25554 249712 226558 156467 215905 47820 164918 -119212 217308 -175849
17317 36225 -231802 332158 142711 34028 81063 12994 91938 5664 119010 195396 49314
17305 252236 -105730 118506 226625 -67472 422776 356523 364872 197239 -27085 207115
17294 208030 493396 -35084 304209 362032 132976 359823 212497 20620 131973 80839
17284 80839 70920 246570 199451 150586 157170 153031 33766 246787 210588 -14045 38309 169685
17272 169685 227166 -39382 283197 220061 8819 -27675 223438 173274 86956 -3962 339729
17260 61308 42496 14032 94326 121029 80443 232709 138936 105704 -104061 231541 -96305
17248 155078 460730 -27488 422281 515752 153283 139391 -41120 342187 430618 472855 497573
$$ packed form
17329A72552P9884b5554B49712k3154p0091N9438D7820J17098a19212B17308a75849
17317C6225b31802C32158A42711C4028M7035A2994P8944E664J13346P6386D9314
17305B52236a05730A18506J08119f7472D22776o6253Q349j67633b7085B07115
17294B08030K85366c5084C04209N7823A32976K26847j47326B0620J11353n1134
17284H0839r919J75650m7119m8865O584m139C3766K13021l6199a4045C8309J31376
17272A69685N7481c9382B83197o3136H819b7675B23438n0164q6318c962C39729
17260F1308j8812A4032Q0294K6703m0586J52266r3773l3232a04061B31541i6305
17248A55078L05652b7488D22281R3471A53283j3892d1120C42187Q8431M2237K4718
$$ plain form
17237 497573 288998 423207 360766 15371 158717 291762 110364 394864 -48849 547677
17226 94162 266968 137589 82409 252927 73665 242672 207473 347522 115612 96888
17216 96888 363790 427957 192295 345404 432828 201585 323223 116943 136300 69030
17206 69030 460506 257640 266279 339995 182445 640499 617914 251290 206705 272185 406823
17195 406823 -27462 307532 165491 177931 -8328 681438 284477 24461 64087 672244 387912
17184 387912 419980 496647 187232 393380 227994 138288 439294 553765 481161 417656
17174 417656 101363 383330 363060 157032 360772 450445 404444 164732 411847 580549
17164 580549 538888 514513 501623 84438 348412 625978 185963 459652 319007 197646
$$ packed form
17237D97573k08575J34209o2441A5371J43346J33045A10364K84500d8849E47677
17226I4162J72806j29379n5180J70518G3665J69007l5199J40049A15612j8724
17216I6888K66902O4167A92295J53109Q7424B01585J21638A16943J9357o7270
17206F9030L91476k02866Q639P3716j57550M58054k2585B51290m4585O5480J34638
17195D06823b7462C07532j42041J2440h328F81438B84477B4461L9626O08157k84332
17184C87912L2068P6667A87232K06148j65386q9706L01006J14471p2604o3505
17174D17656A01363K81967k0270A57032K03740Q9673m6001A64732K47115J68702
17164E80549m1661k4375j2890H4438K63974K77566A85963K73689j40645j21361
$$ plain form
17154 197646 328785 335354 124731 496399 621894 134097 300313 441935 363352 423011
17144 423011 199732 561470 251370 478915 153161 -50968 230859 324702 668168 727171
17134 727171 469908 427482 320219 112780 -27737 420366 348060 226281 97991 260341
17124 260341 441933 323753 447618 174122 339532 606998 599215 166006 543425 354339
17114 354339 466973 -28439 474072 674470 368521 482773 521149 652030 -80998 350709
17103 506116 781415 865347 456274 711788 473295 630717 395686 553743 380144 658068
17093 658068 619459 92430 478303 523931 428471 526480 589507 590436 351319 425026 495391
17082 495391 624236 524274 827478 632507 605341 422019 501893 616279 319918 608765
$$ packed form
17154A97646J31139O569A24731L71668J25495A34097J66216J41622p8583N9659
17144D23011A99732L61738B51370K27545A53161e0968B30859R3843L43466N9003
17134G27171k57263m2426j07263A12780b7737D20366p2306j21779I7991J62350
17124B60341J81592j18180J23865A74122J65410K67466p783A66006L77419j89086
17114C54339J12634b8439D74072K00398l05949J14252L8376J30881h0998C50709
17103E06116K75299Q3932m09073K55514k38493J57422k35031J58057j73599K77924
17093F58068l8609I2430L85873M5628r5460R8009O3027R29k39117P3707P0365
17082D95391J28845r9962L03204j94971k7166j83322P9874J14386k96361K88847
$$ plain form
17072 608765 413821 414142 513957 97886 749959 238817 626752 453705 664436 616289 825548
17061 825548 610632 655286 896203 518422 418689 204536 326910 701774 902127 815131
17051 815131 976296 549424 835010 704962 673828 586953 617814 393716 526449 826544
17041 826544 408480 224972 622809 369658 479662 345536 504566 928907 768528 1101713
17031 1101713 612085 942635 749842 871319 667614 449831 572794 580828 652636 606533
17021 606533 665710 1064786 835108 1171138 727075 656414 996495 718616 775387 656564
17011 656564 416212 894954 665213 876401 945523 572603 920269 874494 627281 931849
17001 931849 704214 808960 600117 715981 1052659 416487 639907 1093370 800889 1096592
$$ packed form
17072F08765j94944L21R9815I7886O52073B38817L87935j73047K10731m8147K09259
17061H25548k14916M4654K40917l77781r9733B04536J22374L74864K00353q6996
17051H15131J61165m26872K85586j30048l1134q6875L0861k24098J32733L00095
17041H26544D08480j83508L97837k53151J10004j34126J59030M24341j60379L33185
17031A101713m89628L30550j92793J21477k03705k17783J22963Q034P1808m6103
17021F06533N9177L99076k29678L36030m44063p0661L40081k77879N6771j18823
17011F56564k40352M78742k29741K11188O9122l72920L47666m5775k47213L04568
17001I31849k27635J04746k08843J15864L36678D16487K23420M53463k92481K95703
$$ plain form
16991 1096592 697827 1136724 862527 912038 951193 518659 389759 1037846 561541 895460
16981 895460 741792 954761 936748 905746 1010588 1077710 539251 991351 964140 921031
16971 921031 1069472 967428 1100616 1173836 1123603 1015325 1081267 1213595 1064969 990692
16961 990692 1368529 960789 1409128 783424 920968 1614585 1493988 1267920 1334776 826098
16951 826098 1261656 1086944 1427047 1627335 1181676 1435446 1414422 1320822 1227013 992186
16941 992186 1402581 1248106 1395385 1473374 1186663 1150652 1649866 1267415 1327316 1554588
16931 1554588 1570892 1346134 1863127 1616774 1284795 1616034 1763742 1251424 1406995 1389435
16921 1389435 1453348 1681725 2035770 1492644 1530127 1668043 1902087 1650243 1805292 1567512
$$ packed form
16991A096592l98765M38897k74197M9511L9155m32534j28900O48087m76305L33919
16981H95460j53668K12969j8013l1002J04842O7122n38459M52100k7211m3109
16971I21031J48441j02044J33188P3220n0233j08278O5942J32328j48626p4277
16961I90692L77837m07740M48339o25704J37544O93617j20597k26068O6856n08678
16951H26098M35558j74712L40103K00288m45659K53770k1024r3600r3809k34827
16941I92186M10395j54475J47279P7989k86711l6011M99214l82451N9901K27272
16931A554588J6304k24758N16993k46353l31979L31239J47708n12318J55571j7560
16921A389435O3913K28377L54045n43126L7483J37916K34044k51844J55049k37780
$$ plain form
16911 1567512 1954600 1800966 1815427 1940814 1697442 2003934 2103664 1916151 2029232 2042683
16901 2042683 1744997 2201832 2232525 2066624 1995641 1879754 2380323 2248994 2330744 2228478
16891 2228478 2017530 2310970 2133734 2166414 2148822 2166854 2652750 2093681 2218657 2278964
16881 2278964 2283504 2207091 2613297 2626014 2582250 2531995 2802007 2881991 2767503 3003687 2694399
16870 2694399 2644406 2878272 2603764 2919562 2861887 3038533 3237599 3001397 2880290 3060101
16860 3060101 3396035 3351552 3203309 3549503 3354152 3208899 3563478 3554053 3606333 3679767
16850 3679767 3917578 3941894 3750558 3959708 4026412 3816709 4102259 3853265 3908160 3917956
16840 3917956 4300488 4633759 4591879 4984777 4846072 4749856 4911584 4842871 4904257 5249820
$$ packed form
16911A567512L87088j53634J4461J25387k43372L06492R9730j87513J13081J3451
16901B042683k97686M56835L0693j65901p0983j15887N00569j31329Q1750j02266
16891B228478k10948K93440j77236L2680j7592J8032M85896n59069J24976O0307
16881B278964M540p6413M06206J2717m3764n0255K70012P9984j14488K36184l09288
16870B694399m9993K33866k74508L15798n7675J76646J99066k36202j21107J79811
16860C060101L35934m4483j48243L46194j95351j45253L54579r425N2280P3434
16850C679767K37811K4316j91336K09150O6704k09703K85550k48994N4895R796
16840C917956L82532L33271m1880L92898j38705r6216J61728o8713O1386L45563
$$ plain form
16830 5249820 5065495 5417967 4985313 5431955 5571789 5414179 5562543 5574869 5908208 5931765
16820 5931765 5952172 6223747 6228953 6462152 6346215 6720899 6778979 7036739 7017496 7203659
16810 7203659 7218377 7256362 7405754 7608748 8143654 8073511 8321127 8203924 8789506 8834252
16800 8834252 8834768 9060050 9344685 9757901 9941373 9980390 10638235 10660626 10811801 11476914
16790 11476914 11504677 11552274 11905506 12497621 12701922 13113096 13432009 13778434 14348300 14700344
16780 14700344 15123433 15558515 16048721 16248079 16973577 17749574 18086663 18711208 19323696
16771 19323696 19939570 20626487 21386950 21934710 22770400 23745935 24678051 25368163 26389235
16762 26389235 27465268 28600944 29670890 30684402 32313451 33511537 34965640 36123283
$$ packed form
16830E249820j84325L52472m32654M46642J39834j57610J48364J2326L33339K3557
16820E931765K0407K71575N206K33199j15937L74684N8080K57760j9243J86163
16810G203659J4718L7985J49392K02994N34906p0143K47616j17203N85582M4746
16800H834252N16K25282K84635M13216J83472L9017O57845K2391J51175O65113
16790A1476914K7763M7597L53232N92115K04301M11174L18913L46425N69866L52044
16780A4700344M23089M35082M90206J99358P25498P75997L37089O24545O12488
16771A9323696O15874O86917P60463N47760Q35690R75535R32116O90112J021072
16762B6389235J076033J135676J069946J013512J629049J198086J454103J157643
$$ plain form
16754 36123283 37482785 39508925 41620226 43189002 45236205 47310567 49491581 51792383
16746 51792383 54581610 57313173 60026698 63196382 66704668 70042760 73483895 77517563
16738 77517563 81599068 85802042 90659148 95591755 100414642 106184967 112055994 117600955
16730 117600955 123529363 129828916 136255736 142186411 148333314 154447323 160229429 165007419
16722 165007419 169928845 174020367 177554242 179966753 181457640 182041980 181331130 179643892
16714 179643892 177283795 174192221 169913114 165380597 160186347 154279559 147973692 141920404
16706 141920404 135291182 129174042 122766991 116850525 110989538 105196692 99308021 94295488
16698 94295488 89369956 84515233 80097992 75943666 72137771 67893197 64601862 61119138
$$ packed form
16754C6123283J359502K026140K111301J568776K047203K074362K181014K300802
16746E1792383K789227K731563K713525L169684L508286L338092L441135M033668
16738G7517563M081505M202974M857106M932607M822887N770325N871027N544961
16730A17600955N928408O299553O426820N930675O146903O114009N782106M777990
16722A65007419M921426M091522L533875K412511J490887N84340p10850j687238
16714A79643892k360097l091574m279107m532517n194250n906788o305867o053288
16706A41920404o629222o117140o407051n916466n860987n792846n888671n012533
16698I4295488m925532m854723m417241m154326l805895m244574l291335l482724
$$ plain form
16690 61119138 58009818 55254872 52462405 50019817 47500156 45563595 43295429 41107844
16682 41107844 39803261 37967996 35995008 34535303 33074054 31728709 30642450 29321717
16674 29321717 28033452 26823486 25984309 24648607 23895302 23071057 22570165 21247224 20667612
16665 20667612 20071817 19350738 18679438 18168528 17395161 17007982 16452511 15875514 15324009
16656 15324009 15129246 14505663 14054079 13708604 13276497 12742308 12453423 12122784 11657474
16647 11657474 11486184 10989243 11101553 10884662 10298163 9996463 9617269 9669735 9458978
16638 9458978 9163193 8913044 8462940 8318355 8024503 8111985 7824990 7857047 7769109 7332603
16628 7332603 7341540 7184621 6804973 6681032 6119263 6439995 6414371 5768585 6030917 5988973
$$ packed form
16690F1119138l109320k754946k792467k442588k519661j936561k268166k187585
16682D1107844j304583j835265j972988j459705j461249j345345j086259j320733
16674B9321717j288265j209966q39177j335702p53305q24245n00892j322941n79612
16665B0667612n95795p21079o71300n10910p73367l87179n55471n76997n51505
16656A5324009j94763o23583m51584l45475m32107n34189k88885l30639m65310
16647A1657474j71290m96941J12310k16891n86499l01700l79194N2466k10757
16638I458978k95785k50149m50104j44585k93852Q7482k86995L2057q7938m36506
16628G332603Q937j56919l79648j23941n61769L20732k5624o45786K62332m1944
$$ plain form
16618 5988973 5789539 5653533 5670890 5556433 5432579 5080396 5042072 4931987 4926973 4690979
16608 4690979 4789083 4692711 4326542 4258843 4539511 4649156 4067909 4175941 3927522 3767293
16598 3767293 3989079 3734116 3828977 3746522 3552966 3617319 3441069 3378731 3466431 3272867
16588 3272867 3059635 3306018 3317063 3316005 2844327 2788431 3010611 2903775 2641782 2935246
16578 2935246 2724804 2932585 2645831 2655955 2741624 2682268 2799497 2428410 2778051 2539199
16568 2539199 2469072 2207188 2562147 2325216 2607983 2411845 2063679 2060596 2347150 2291530
16558 2291530 2164985 2183554 2138193 2087164 2011258 1866658 2132056 1701360 2214199 1744565
16548 1744565 2071907 1727078 1895668 1998989 1708514 1696565 1549385 1637891 1241621 1581268
$$ packed form
16618E988973j99434j36006J7357j14457j23854l52183l8324j10085n014k35994
16608D690979R8104r6372l66169o7699K80668J09645n81247J08032k48419j60229
16598C767293K21786k54963R4861q2455j93556O4353j76250o2338Q7700j93564
16588C272867k13232K46383J1045j058m71678n5896K22180j06836k61993K93464
16578B935246k10442K07781k86754J0124Q5669n9356J17229l71087L49641k38852
16568B539199p0127k61884L54959k36931K82767j96138l48166l083K86554n5620
16558B291530j26545J8569m5361n1029p5906j44600K65398m30696N12839m69634
16548A744565L27342l44829J68590J03321k90475j1949j47180Q8506l96270L39647
$$ plain form
16538 1581268 1768595 1536575 1553741 1376704 1620104 1804253 1470356 1711399 1536975 1607527
16528 1607527 1331026 1584452 1582520 1542397 1280065 1359036 1251904 1447868 1519616 1332999
16518 1332999 1402360 1309536 1404221 1087367 1671833 1066350 1200129 1268077 1175321 1466914
16508 1466914 1358399 1567842 1530906 1133024 1276612 1244343 1088808 1138448 1131090 1250786
16498 1250786 918431 858915 1001275 1098451 1093612 866036 971545 1216116 966256 976239
16488 976239 1065574 765851 1026077 1118734 859559 1099203 983654 744025 821150 757654
16478 757654 1066971 912338 582930 848700 791575 649280 493342 793051 654762 660322
16468 660322 843766 799748 750190 710306 535158 564343 745899 695699 553063 958446
$$ packed form
16538A581268J87327k32020J7166j77037K43400J84149l33897K41043j74424P0552
16528A607527k76501K53426j932m0123k62332P8971j07132J95964P1748j86617
16518A332999O9361r2824R4685l16854N84466o05483J33779O7948r2756K91593
16508A466914j08515K09443l6936l97882J43588l2269j55535M9640p358J19696
16498A250786l32355n9516J42360R7176m839k27576J05509K44571k49860R983
16488I76239Q9335k99723K60226R2657k59175K39644j15549k39629P7125o3496
16478G57654L09317j54633l29408K65770n7125j42295j55938K99709j38289N560
16468F60322J83444m4018m9558l9884j75148K9185J81556n0200j42636M05383
$$ plain form
16458 958446 528869 768244 811632 596875 809112 751659 811815 453337 819352 548877
16448 548877 799406 807984 647269 414066 608190 758412 387243 769026 431912 623785
16438 623785 656500 544462 490305 762005 447585 770295 366587 475721 213091 597537
16428 597537 396127 578097 739592 823355 633793 344516 461924 444062 394944 639790
16418 639790 495864 632497 707651 832340 636033 736778 691540 494858 482095 586990
16408 586990 619588 352712 288310 436458 324600 229766 832154 327039 308220 473160
16398 473160 278977 455465 809577 551175 348799 679614 885223 610784 568996 133299
16387 541610 349615 39852 147745 279917 581861 214980 283145 323268 282686 343773
$$ packed form
16458I58446m29577K39375M3388k14757K12237n7453O0156l58478L66015k70475
16448E48877K50529Q578j60715k33203J94124J50222l71169L81783l37114J91873
16438F23785L2715j12038n4157K71700l14420L22710C66587J09134B13091L84446
16428E97537k01410J81970J61495Q3763j89562k89277J17408j7862m9118K44846
16418F39790j43926J36633P5154J24689j96307J00745m5238j96682j2763J04895
16408E86990L2598k66876o4402J48148j11858r4834O02388C27039j8819J64940
16398D73160j94183J76488L54112k58402k02376L30815K05609k74439m1788A33299
16387E41610j91995C9852J07893J32172L01944B14980O8165M0123m0582O1087
$$ plain form
16377 343773 426275 472439 9197 643512 382769 326846 96512 260724 239493 213377 516507
16366 516507 433500 63879 412201 294478 221463 622513 493618 617334 91996 280542
16356 280542 515854 246538 186194 635495 382591 495851 298607 431418 114475 185869
16346 185869 402591 47602 54598 508804 451898 308389 78716 298945 366028 284808 518085
16335 518085 178121 230844 54078 233269 473693 442809 326555 418601 591702 129013
16324 384126 356050 372268 133315 193814 157503 327021 360107 254309 336977 412636 235062
16313 235062 50712 52500 182685 419887 262668 231853 -78254 390227 214340 96675 324462
16302 324462 -69014 253422 312530 53831 103901 558111 42795 315882 361281 149797 310901
$$ packed form
16377C43773Q2502M6164I197O34315k60743n5923I6512J64212k1231k6116L03130
16366E16507q3007F3879L48322j17723p3015M01050j28895J23716I1996J88546
16356B80542K35312B46538o0344M49301k52904J13260j97244J32811A14475P1394
16346A85869K16722D7602O996M54206n6906j43509G8716K20229O7083q1220K33277
16335E18085A78121N2723E4078J79191K40424l0884j16254R2046J73101A29013
16324C84126k8076J6218A33315O0499l6311J69518L3086j05798Q2668P5659j77574
16313B35062E0712J788J30185K37202j57219l0815g8254C90227j75887I6675K27787
16302C24462f9014B53422N9108E3831N0070M54210D2795K73087M5399A49797J61104
$$ plain form
16291 310901 353998 -72842 142064 497717 -18414 406353 412867 556299 268541 263609 514829
16280 514829 211377 258603 221144 47110 441602 -18755 192225 274239 318103 172850 84589
16268 -11318 526317 346119 95124 -3440 -72680 -21840 420412 364013 124992 139775 213655
16257 213655 -192019 199366 698 106624 107791 43401 53471 105872 605531 -29134 316597
16245 138631 76782 17631 197645 98050 -221349 -132152 108509 -99952 272378 258174 202418
16234 202418 337066 175450 -8678 -33839 189820 158960 53547 86390 -10234 293091 -51608
16222 176052 380223 187274 -198470 483975 63564 164818 225319 262955 15738 420513
16212 420513 239407 15652 142969 39727 -363319 215993 139146 -26523 161833 43753
$$ packed form
16291C10901M3097g2842A42064L55653a8414D06353O514J43432B68541m932K51220
16280E14829B11377M7226l7459D7110L94492a8755A92225Q2014M3864j45253H4589
16268a1318E26317j80198I5124c440o9240b1840D20412n6399A24992J4783P3880
16257B13655a92019A99366F98J05926J167D3401J0070N2401M99659b9134C16597
16245A38631o1849A7631J80014I8050b21349Q9197A08509i9952B72378j4204n5756
16234B02418J34648j61616h678k5161A89820l0860E3547L2843a0234B93091e1608
16222A76052K04171A87274a98470D83975F3564J01254O0501L7636A5738M04775
16212D20513j81106A5652J27317C9727c63319B15993p6847b6523A61833D3753
$$ plain form
16201 257075 -103181 -38042 28195 282951 103132 254724 366699 -52785 -51974 183715 43574
16189 247196 -94574 98722 -82103 205069 209231 19284 35776 -77716 193895 267510 107911
16177 -91997 -245323 -44402 158917 328383 187409 95148 252995 76509 206749 -217030
16166 -30081 69537 131804 -24500 -95828 -172385 -131196 278226 21582 448492 119953 -128117
16154 23026 -23408 79017 130735 -336711 94748 134178 246602 132490 -107371 -66821 -214305
16143 -214305 179040 197214 -226004 -181032 60280 281353 359545 -5668 -37149 -155263 149545
16131 123427 206141 86180 -167145 140627 85145 -15391 -104605 184023 228578 85801 -299074
16119 -6734 -40744 167919 12171 -435014 48429 -228742 -31418 -53576 8898 171931 83640
$$ packed form
16201B57075a03181c8042B8195K54756A03132J51592J11975e2785Q11A83715D3574
16189B47196i4574I8722h2103B05069M162A9284J6492g7716A93895P3615A07911
16177i1997j53326d4402A58917J69466j40974r2261J57847G6509J30240b17030
16166c0081F9537O2267b4500p1328p6557M1189B78226B1582M26910A19953a28117
16154B3026b3408G9017N1718c36711I4748L9430J12424j14112a07371M0550j47484
16143b14305A79040J8174b26004M4972F0280K21073P8192e668l1481j18114A49545
16131A23427Q2714H6180a67145A40627n5482a5391q9214A84023M4555H5801b99074
16119f734l4010A67919A2171d35014D8429b28742c1418k2158H898J63033H3640
$$ plain form
16107 -108147 6800 226058 104702 375163 -39918 355246 49233 -292782 118646 188647
16097 188647 150888 -17850 -245318 -1361 212696 -101992 -58898 140237 77659 -129756 -138178
16086 -138178 93874 62134 -71798 -288156 -66894 -79975 423350 -35034 187949 10650 389947
16075 389947 61218 -87355 -434534 -39892 145442 -168343 235605 -311976 -199623 45632
16064 -47989 41242 70459 232771 86644 -267934 -81192 -138725 -264352 203947 -31212 104847
16052 360889 21484 41088 -165040 171001 91701 -57064 36272 56699 68454 67407 409741
16041 409741 39648 -257410 -74140 224761 122767 396086 222905 100593 400484 447845
16031 447845 237433 154091 -205525 -58297 23696 -159028 -57581 235815 534076 26526
$$ packed form
16107a08147F800K19258A04702K70461c9918C55246D9233b92782A18646P0001
16097A88647l7759a7850k27468a361B12696a01992M3094A40237o2578a29756q422
16086a38178I3874l1740g1798k16358f6894j3081D23350c5034A87949A0650L79297
16075C89947F1218h7355l47179c9892A45442a68343B35605c11976J12353D5632
16064d7989D1242K9217J62312H6644b67934h1192n7533j25627B03947c1212A04847
16052C60889B1484J9604a65040A71001p9300e7064C6272K0427J1755j047L42334
16041D09741C9648b57410g4140B24761j01994K73319j73181A00593K99891M7361
16031D47845k10412q3342b05525e8297B3696a59028e7581B35815K98261B6526
$$ plain form
16020 250326 -414349 29495 229064 235968 -394497 15096 -272512 331450 143752 -26385
16009 -213709 33086 58868 12720 -184913 -213646 155598 60659 219267 -278850 139658
15998 -235850 211249 -102183 -94722 150870 37464 -101951 -12809 -224585 -57710 -108245 84302
15986 -1588 160786 82789 312269 83683 189798 593942 378911 336066 92324 47510 165860
15975 165860 20169 9985 -98702 177553 386431 -293556 278644 -81923 -183271 102096
15964 68085 9161 -271161 195542 106906 -114516 -119133 171184 195172 83607 -220866 308346
15952 -66017 210929 230888 -81208 241703 119715 -60997 -72201 -67949 -188205 -77600 144785
15940 -38501 -274825 -28164 -43616 -61766 100646 72287 -59808 89062 -197350 -69238 70941
$$ packed form
16020B50326d14349B9495J99569O904c94497A5096b72512C31450A43752b6385
16009b13709C3086K5782A2720a84913k8733A55598F0659J58608b78850A39658
15998b35850B11249a02183P461A50870C7464a01951a2809k11776e7710n0535H4302
15986a588A60786p7997K29480H3683J06115M04144k15031m2845I2324m4814J18350
15975A65860B0169I985i8702A77553K08878b93556B78644h1923j01348A02096
15964F8085I161b71161A95542q8636a14516m617A71184K3988H3607b20866C08346
15952f6017B10929J9959h1208B41703A19715f0997j1204M252j20256g7600A44785
15940c8501k36324b8164j5452j8150A00646k8359e9808H9062a97350f9238G0941
$$ plain form
15928 69087 -36815 -31254 165238 -183366 -37558 -91342 -72214 -67543 -324221 67470 -243921
15916 166113 193390 89925 -470516 -15740 -34959 73242 -24697 160633 -244069 -164990 -112970
15905 -112970 3149 -388962 -133516 84188 128921 -161391 -85060 -240835 -65131 314312 73579
15893 -78608 264981 -308090 135236 -18627 -143256 78228 -69958 -130486 134318 -6262 -106854
15882 -106854 27172 283577 40074 212032 250493 74376 -51841 -226537 114299 49724 226728
15871 226728 74441 15600 88917 -12670 -182923 20098 -151580 -259142 -139003 23341 61428
15860 61428 -33681 -113799 -338981 -51481 -83582 -301667 8062 185408 -293786 -188312 -71058
15848 240983 21107 -322295 -198203 172801 -127301 -77416 12306 -205565 103638 -200274
$$ packed form
15928F9087c6815N561A65238a83366c7558n3784J9128M671k56678F7470b43921
15916A66113K7277H9925d70516a5740j9219G3242b4697A60633b44069P9079N2020
15905a12970C149c88962a33516H4188M4733a61391P6331j55775f5131C14312G3579
15893g8608B64981c08090A35236a8627j24629G8228f9958o0528A34318f262j00592
15882a06854B7172K56405D0074J71958L8461G4376e1841j74696A14299D9724J77004
15871B26728G4441A5600P3317a2670j70253B0098a51580j07562J20139B3341L8087
15860F1428c3681q0118k25182e1481l2101k18085H062J77346b93786J05474g1058
15848B40983B1107c22295J24092A72801a27301M9885A2306b05565A03638b00274
$$ plain form
15837 27543 185573 275312 71394 58908 -319129 -208313 -50950 92151 58260 422806 244164
15826 244164 -61977 -239109 68470 350815 -98500 57312 270264 -121931 -156437 -80365 -125336
15815 -125336 -73509 -86609 212805 -186485 197370 129505 -256883 -79579 79065 25762 284112
15804 284112 -392377 104856 -146613 189952 -270077 -170271 -217847 219693 -64847 92067
15793 -53664 -185545 -201886 181717 -67645 -169798 71319 51350 -54849 80502 -120913 16335
15781 137972 -17047 -84204 251926 246274 94170 235621 -111477 -52344 118462 146299 -192593
15769 8763 -160080 -281946 56255 -509249 -78375 -184941 -185359 -254545 -170927 -202899 34830
15757 -61827 -148210 -401666 54243 77034 137733 -11228 -89799 326313 -208760 231859 102409
$$ packed form
15837B7543J58030Q9739G1394j2486c19129J10816e0950I2151l3891L64546j78642
15826B44164f1977j77132F8470K82345i8500E7312K12952a21931l4506P6072m4971
15815a25336N1827j3100B12805a86485A97370o7865b56883g9579G9065B5762K58350
15804B84112c92377A04856a46613A89952b70077R9806m7576B19693f4847I2067
15793e3664j31881j6341A81717f7645j02153G1319j9969e4849H0502a20913A6335
15781A37972a7047o7157B51926n652I4170J41451a11477e2344A18462K7837a92593
15769H763a60080j21866E6255e09249g8375j06566m18o9186Q3618l1972C4830
15757f1827q6383k53456E4243K2791O0699a1228p8571C26313b08760B31859A02409
$$ plain form
15745 -201261 381737 23573 -7352 300466 -175661 -202218 -153076 291121 -239311 -42505 -131205
15734 -131205 181696 134078 187142 139724 3608 -101014 -105234 -122859 -115559 213001 -11462
15722 -405722 -54223 113880 -25460 -283106 192762 -331923 -258923 99576 -9516 25741 -252302
15710 129635 37812 204890 -127636 331959 -70535 -414692 -17293 -221054 -222159 170980
15699 -83923 -362622 167275 82683 -42853 -41330 -223070 63992 -234972 7608 -30932 -88686
15688 -88686 -196307 -131570 39809 125799 -462144 -45147 -53944 -139202 -83583 -244839 183585
15676 -264617 121812 -28388 -118899 88135 178679 450520 -81412 215195 -54296 39207 104217
15665 104217 62084 -338069 96862 -5490 -47411 34556 -234885 14799 -86619 -183217 43162
$$ packed form
15745b01261C81737B3573g352C00466a75661k6557M9142B91121b39311d2505q8700
15734a31205A81696m7618N3064m7418C608a01014m220j7625P300B13001a1462
15722d05722e4223A13880b5460k57646A92762c31923P3000I9576i516B5741b52302
15710A29635C7812J67078a27636C31959g0535l44157a7293k03761j105A70980
15699h3923k78699A67275H2683d2853J523j81740F3992b34972G608c0932n7754
15688h8686j07621O4737C9809Q5990d62144d5147q797q5258N5619j61256A83585
15676b64617A21812b8388r0511H8135R0544K71841h1412B15195e4296C9207O5010
15665A04217m2133c38069I6862e490m1921C4556b34885A4799h6619r6598D3162
$$ plain form
15653 15955 -247779 4055 83459 -28798 -172666 380466 109940 -17569 29128 55227 244044
15642 244044 -82417 -171201 24327 -80865 121325 205810 106054 -206251 -6077 120670 135347
15631 135347 34319 -127329 -184043 -102339 -81937 59434 96401 -49043 -204406 -163698 -83528
15620 -83528 -96936 81334 -37784 214653 179955 -124465 -62840 178236 -173591 159607 471
15608 -23223 286054 544 -134071 84778 -96420 -208481 178076 177803 171546 -290965 -211028 -295353
15596 -295353 -192353 -127795 101731 -44230 274874 -160739 262186 -72167 129786 -104545
15585 -226279 -108798 352438 46096 221284 14866 27644 -129928 -81967 -19737 -46635 108547
15573 193699 -216631 9136 316846 -211657 -996 -568 -8279 118061 227158 -136529 79399
$$ packed form
15653A5955b47779D055P9404b8798j43868C80466A09940a7569B9128K6099J88817
15642B44044h2417q8784B4327h0865A21325Q4485r9756b06251f077A20670J4677
15631A35347C4319a27329n6714Q1704K0402E9434L6967d9043j55363M0708Q0170
15620h3528j3408H1334c7784B14653l4698a24465O1625A78236a73591A59607D71
15608b3223B86054E44a34071H4778i6420j12061A78076k73o257b90965P9937q4325
15596b95353J03000O4558A01731d4230B74874a60739B62186g2167A29786a04545
15585b26279a08798C52438D6096J75188A4866J2778a29928M7961a9737k6898A08547
15573A93699b16631I136L07710b11657i96M28p711A18061J09097a36529G9399
$$ plain form
15561 -240070 -59461 104249 276706 77635 -317655 23763 246554 160044 269567 -155451
15550 -271929 24865 17993 234227 -7908 9741 -91560 91017 -193046 -210676 358432 271469
15539 271469 277826 -19835 -7722 -75360 109857 -92036 294230 251428 107387 317224 -306522
15527 -278909 -32581 140425 -115501 -198177 205690 -468364 -118542 -116869 -261572 95170
15516 -233400 55109 -145051 -86262 43213 3936 -172607 -26688 21149 -51839 -54488 -137468
15505 -137468 -109456 92464 101773 172272 -87179 418172 266700 126484 -98284 308005 187271
15494 187271 214330 -123055 -368716 -270129 377145 -194800 -37422 -313523 -122254 -144433
15484 -144433 94828 228892 28898 50110 88838 44042 309196 42518 127709 2028 390351
$$ packed form
15561b40070e9461A04249J72457G7635c17655B3763K22791q6510J09523a55451
15550b71929B4865o872K16234g908I741i1560I1017a93046j7630C58432q6963
15539B71469O357a9835g722o7638A09857i2036B94230m2802A07387K09837c06522
15527b78909c2581A40425a15501q2676B05690d68364a18542J673j44703I5170
15516b33400E5109a45051N8789D3213C936a72607b6688B1149e1839k649q2980
15505a37468K8012I2464R309P0499h7179D18172j51472A26484i8284C08005j20734
15494A87271K7059a23055k45661R8587C77145a94800c7422k76101a22254k2179
15484a44433I4828J34064B8898K1212L8728D4042K65154D2518Q5191B028L88323
$$ plain form
15473 390351 237438 -152954 38606 -182793 -92870 32913 82649 126328 -199450 -25363 291494
15461 -11543 -53461 68625 231641 40243 -134824 404744 153358 -242747 149593 -41336
15450 156711 -203601 -91525 47537 120986 188232 93363 324833 225390 48453 -448494 -113316
15438 -313482 -282741 41434 91387 -74429 46679 262877 -69896 -111584 -132001 -313023 -51365
15426 -260881 -137948 254302 240081 -69192 360100 -14976 12320 16474 -127949 99341 50748
15415 50748 236922 -435191 265857 -38061 139743 -208796 53031 -121616 -43100 -58033
15405 -58033 402170 147501 -152220 -59248 -15107 -75704 78668 -318089 -228112 -179177 -116592
15394 -116592 116162 -80160 87101 76190 56175 208786 2677 -20082 -235300 -191515 -224211
$$ packed form
15473C90351j52913a52954C8606a82793Q9923C2913M9736M3679a99450b5363B91494
15461a1543m1918F8625J63016D0243a34824D04744A53358b42747A49593d1336
15450A56711b03601i1525D7537P3449O7246I3363K31470r9443D8453d48494a13316
15438c13482L0741D1434M9953g4429D6679K16198f9896m1688k0417j81022e1365
15426b60881J22933B54302j4221f9192C60100a4976A2320M154a27949I9341m8593
15415E0748J86174d35191B65857c8061A39743b08796E3031a21616d3100j4933
15405e8033D02170A47501a52220e9248a5107o0597G8668c18089Q9977M8935O2585
15394a16592A16162h0160H7101j0911k0015J52611B677b0082k15218M3785l2696
$$ plain form
15383 -224211 89611 280326 261488 30777 -74177 156251 86701 -131561 -100677 236228 24352
15371 -110868 -256252 479668 -12054 -91567 -151565 -489345 393922 44701 20708 -286679
15360 -27184 4532 207279 -84360 78799 -174486 -220467 -290629 -73610 -8580 45126 280712
15349 280712 48020 -28720 107266 211310 15162 -259184 -76289 104208 27777 107304 -244291
15337 152635 -406340 -101103 242009 66937 -167062 -110688 -266634 -34547 -55056 86736
15326 106049 337888 146122 253925 151505 -48689 -54341 352722 -104183 163720 -44475
15315 219326 -59164 64556 -9393 139522 15720 82014 88137 -88755 138445 343094 -172966
15303 -84143 171123 191151 436806 -162685 170984 -148587 -19172 76168 -79333 79241 -79364
$$ packed form
15383b24211H9611J90715j8838C0777g4177A56251o9550a31561L0884B36228B4352
15371a10868j45384D79668a2054p9513n9998l37780C93922D4701B0708b86679
15360b7184D532K02747h4360G8799a74486m5981p0162g3610h580D5126K35586
15349B80712D8020b8720A07266J04044A5162b59184g6289A04208B7777P9527b44291
15337A52635d06340a01103B42009F6937a67062N6374j55946c4547k0509H6736
15326A06049K31839A46122J07803j02420d8689n652C52722a04183A63720d4475
15315B19326e9164F4556i393A39522A5720O6294O123h8755A38445K04649a72966
15303h4143A71123K0028K45655a62685A70984a48587a9172G6168g9333G9241g9364
$$ plain form
15291 60436 -305681 -8968 305823 -71472 105734 -10570 134858 164830 148142 9844 219028
15280 219028 123534 89000 -43854 -33553 -76271 304210 51619 -49148 -188290 71806 104643
15269 104643 -133049 42684 -97660 -32209 208833 28462 -58332 -11800 -56247 196963 193954
15258 193954 160337 -235951 -168647 -3636 175367 -56664 306686 399725 355071 851419 727766
15247 727766 1233385 1844825 1457834 1719729 1500920 599206 419490 376199 205875 189801
15237 189801 164489 377881 282860 346798 403922 48220 -13253 261356 -81755 367347 100252
15225 -65257 -86404 235494 180277 164011 227216 332083 160988 109580 243907 -105552 110722
15213 -45461 172164 58900 259857 85297 162143 186328 232513 202537 120952 -37784 104547
$$ packed form
15291F0436c05681h968C05823g1472A05734a0570A34858K9972j6688I844K09184
15280B19028r5494l4534d3854J0301m2718C04210E1619d9148j39142G1806L2837
15269A04643a33049D2684i7660c2209B08833B8462e8332a1800m4447A96963l009
15258A93954l3617b35951O7304c636A75367e6664C06686R3039m4654M96348j23653
15247G27766N05619O11440l86991K61895k18809E99206j79716m3291j70324j6074
15237A89801k5312K13392r5021O3938N7124D8220a3253B61356h1755C67347A00252
15225f5257k1147B35494n5217j6266O3205J04867A60988n1408J34327a05552A10722
15213d5461A72164E8900K00957H5297P6846K4185M6185k9976q1585c7784A04547
$$ plain form
15201 289367 152078 340911 -47178 121504 29146 100576 -178252 97545 62300 -182263
15190 282307 331369 240049 50070 388610 388919 326671 -250772 58841 -197914 124136 157327
15179 157327 269004 85875 381746 -186042 -7253 216871 324688 89605 -35855 108582
15168 -145142 160768 -15842 191102 114347 356550 194180 287535 337641 166981 267922
15158 267922 348462 122007 -137896 256169 478603 282957 214488 -71949 304578 110626
15147 294758 159219 227740 181127 203314 40271 121952 310046 60167 -118964 -57744 173118
15135 345789 252067 71725 472754 104430 178115 242545 278198 -11159 207353 -60400 40282
15123 204836 237332 -29613 -30700 197804 152390 210577 390028 -127667 240709 -1398 267570
$$ packed form
15201B89367j37289J88833d7178A21504B9146P1430a78252I7545l5245a82263
15190B82307M9062r1320E0070L38540L09o2248b50772E8841a97914A24136L3191
15179A57327J11677H5875K95871a86042g253B16871J07817H9605c5855A08582
15168a45142A60768a5842A91102p6755K42203j62370R3355N0106A66981J00941
15158B67922Q0540A22007a37896B56169K22434j95646o8469g1949C04578A10626
15147B94758j35539O8521m6613K2187D0271Q1681J88094F0167a18964e7744A73118
15135C45789r3722G1725M01029A04430P3685O4430L5653a1159B07353f0400D0282
15123B04836L2496b9613j087A97804m5414N8187J79451a27667B40709a398B67570
$$ plain form
15111 65909 -46526 166531 87272 170645 54854 255529 -234394 78362 88470 25311 172804
15100 172804 -57646 208689 267296 27398 268705 267368 -219249 266974 270074 39303 270819
15089 270819 -274498 -329005 463972 44713 390331 288794 41797 290356 123684 138059
15079 138059 384321 396053 136352 544705 313572 190182 287881 275623 69088 42264
15069 42264 475548 349360 333015 12383 230721 104042 -30552 96409 244060 181015 221505
15058 221505 -434 -12495 300238 120671 104482 385362 332629 475497 123134 347203 261642
15047 261642 230452 282094 305357 132077 301260 78975 546496 196727 466502 -2135 -21855
15036 -21855 261563 233268 127602 142296 102308 305422 174187 423623 190848 269813
$$ packed form
15111F5909d6526A66531p9259Q3373E4854K00675b34394G8362J0108B5311J47493
15100A72804e7646B08689N8607B7398K41307j337b19249B66974L100C9303K31516
15089B70819b74498n4507D63972D4713L45618j01537D1797K48559A23684J4375
15079A38059K46262J1732A36352M08353k31133j23390R7699j2258F9088k6824
15069D2264M33284j26188j6345A2383K18338A04042c0552I6409J47651o3045M0490
15058B21505d34j2061C00238A20671j6189K80880n2733J42868A23134K24069q5561
15047B61642l1190N1642K3263A32077J69183G8975M67521A96727K69775b135j9720
15036b1855B61563k8295j05666J4694l9988K03114j31235K49436A90848P8965
$$ plain form
15026 269813 20983 250494 34103 447312 -169044 102138 174125 246247 433773 -20816
15015 466499 198035 86878 175962 373581 -25927 242943 213409 325497 213010 -13690
15004 19609 90491 272292 13308 349200 98084 316509 -179905 391459 328564 188964
14994 188964 289594 311131 161975 298438 489531 27884 242444 323355 363106 367156 331410
14983 331410 233326 346151 345494 16396 252994 358755 154433 314477 319064 181321 285007
14972 285007 295529 205872 354519 282897 219728 367147 123316 23437 535629 340195
14962 340195 104574 173917 221104 415473 206861 217570 299583 449325 512310 258329
14952 258329 260502 173804 530047 318783 498227 109349 221164 337043 79918 152577
$$ packed form
15026B69813B0983K29511C4103M13209a69044A02138P1987P2122J87526b0816
15015D66499A98035H6878Q9084J97619b5927B42943k9534J12088j12487a3690
15004A9609P0882J81801A3308L35892I8084K18425a79905C91459o2895j39600
14994A88964J00630K1537j49156J36463J91093B7884K14560Q0911L9751M050l5746
14983C31410r8084J12825o57A6396K36598J05761A54433J60044M587j37743J03686
14972B85007J0522q9657J48647p1622o3169J47419A23316B3437N12192j95434
14962C40195A04574O9343M7187J94369B06861J0709Q2013J49742O2985k53981
14952B58329K173q6698L56243k11264J79444A09349J11815J15879G9918P2659
$$ plain form
14942 152577 56077 346049 312533 241677 488810 192153 25114 245776 563046 40875
14931 -44234 192682 392485 416008 197707 275030 544422 182578 -45807 299030 236572
14921 236572 349173 171539 397797 345748 140539 238892 226679 270617 230201 405346
14911 405346 363533 275937 585672 356964 259244 297948 162583 383237 279045 306582
14901 306582 617227 294594 445283 305486 257712 906838 410855 483701 199643 522777
14891 522777 33124 102551 444279 790401 383041 573009 474151 603255 176340 358033
14881 358033 561813 905481 396240 380818 511067 223558 329127 323336 475381 -22334
14870 330552 -33655 627327 596251 524435 321982 496424 759810 309080 607564 410209
$$ packed form
14942A52577E6077K89972l3516p0856K47133A92153B5114K20662L17270D0875
14931d4234A92682J99803K3523A97707P7323K69392A82578d5807B99030o2458
14921B36572J12601A71539K26258n2049A40539R8353j2213M3938m0416J75145
14911D05346m1813q7596L09735k28708r7720L8704j35365K20654j04192K7537
14901C06582L10645B94594J50689j39797m7774O49126D10855P2846A99643L23134
14891E22777C3124O9427L41728L46122C83041J89968r8858J29104A76340J81693
14881C58033K03780L43668C96240j5422J30249B23558J05569n791J52045b2334
14870C30552c3655F27327l1076p1816k02453J74442K63386C09080K98484j97355
$$ plain form
14860 410209 499639 254402 250743 254534 541610 566377 511478 521896 439112 360908 351072 531811
14848 531811 631223 422464 511020 431116 354162 669596 508316 337525 796959 424622
14838 424622 372988 294091 581386 522867 488409 423903 647686 589081 499414 406039 384697
14827 384697 242865 430835 252529 317423 563415 708583 665036 310924 582479 507859
14817 507859 657647 610637 531580 752632 836415 470172 351647 718543 838474 401546
14806 481990 726824 660699 384274 499206 316177 613431 359699 512098 882159 532688
14796 532688 401914 451132 413235 778134 756148 611368 730195 753428 442712 488177
14786 488177 730876 402448 848140 483968 504025 607171 607943 668322 669894 571770 441251
$$ packed form
14860D10209Q9430k45237l659L791K87076K4767n4899J0418q2784p8204r836J80739
14848E31811R9412k08759Q8556p9904p6954L15434j61280j70791M59434l72337
14838D24622n1634p8897K87295n8519l4458o4506K23783n8605q9667r3375k1342
14827C84697j41832J87970j78306O4894K45992J45168m3547C10924K71555p4620
14817E07859J49788m7010p9057K21052Q3783l66243j18525L66896J19931D01546
14806D81990K44834o6125k76425J14932j83029K97254k53732J52399L70061l49471
14796E32688j30774M9218l7897L64899k1986j44780J18827K3233l10716M5465
14786D88177K42699l28428M45692l64172K0057J03146P72O0379J572r8124j30519
$$ plain form
14775 441251 1034212 695558 375726 731366 667970 428492 809845 874604 634357 779625
14765 779625 801433 562460 925652 765973 729288 472983 676507 678151 723785 707203 850517
14754 850517 769747 696489 687098 1013357 956507 366698 1158352 686593 1103373 911098
14744 911098 747099 697359 748573 702866 653399 940086 650330 836365 1041017 637491
14734 637491 874645 1065379 970992 673639 861289 1120024 896926 773613 869208 833273
14724 833273 959322 746192 841751 756357 1027532 742904 809004 700204 722615 1021982
14714 1021982 966548 1005498 891362 794117 1072828 866615 990254 464582 908553 952653
14704 952653 845257 868459 935834 1188747 962272 883321 901588 1015615 1414520 1014064
$$ packed form
14775D41251N92961l38654l19832L55640o3396k39478L81353O4759k40247J45268
14765G79625K1808k38973L63192j59679l6685k56305K03524J644M5634j6582J43314
14754H50517q0770p3258r391L26259n6850C66698P91654m71759M16780j92275
14744I11098j63999m9740N1214m5707m9467K86687k89756J86035K04652m03526
14734F37491K37154J90734r4387k97353J87650K58735k23098j23313R5595l5935
14724H33273J26049k13130R5559q5394K71175k84628O6100j08800K2411K99367
14714A021982n5434L8950j14136r7245K78711k06213J23639D64582M43971M4100
14704I52653j07396K3202O7375K52913k26475p8951J8267J14027L98905m00456
$$ plain form
14694 1014064 1239859 1031008 1229141 1295542 920029 1255283 567812 1063961 1040665 1248243
14684 1248243 1164809 881705 1371191 1237988 820921 1113858 582657 1216509 847846 1283777
14674 1283777 1284778 1263231 1305225 1107380 1155764 1284908 1061922 1314358 1008303 1202605
14664 1202605 1266525 1213737 1305271 829706 925707 850554 1146340 1178714 1010713 1373720
14654 1373720 1027242 1537720 1112094 1424479 1588337 1150873 1435746 1250012 1574735
14645 1574735 1387954 1435087 1518551 1544670 1260618 1698524 1426685 1757653 1611913 1316251
14635 1316251 1153436 1282071 1022761 1365777 1266458 1570383 1333741 1481011 1643614 1455751
14625 1455751 1266659 1665540 1356475 1572516 1374291 1506879 1648404 1576066 1474169 1542865
$$ packed form
14694A014064K25795k08851J98133O6401l75513L35254E67812M96149k3296K07578
14684A248243q3434k83104M89486j33203m17067K92937n31201O33852l68663M35931
14674A283777J001k1547M1994j97845M8384J29144k22986K52436l06055J94302
14664A202605O3920n2788R1534m75565R6001p5153K95786L2374j68001L63007
14654A373720l46478N10478m25626L12385J63858m37464K84873j85734L24723
14645A574735j86781M7133Q3464K6119k84052M37906k71839L30968j45740k95662
14635A316251j62815J28635k59310L43016r9319L03925k36642J47270J62603j87863
14625A455751j89092L98881l09065K16041j98225J32588J41525p2338j01897O8696
$$ plain form
14615 1542865 1552497 1656134 1518589 1723442 1700575 1485021 1262873 1492438 1595129 1803481
14605 1803481 1786391 1724397 1891954 1577671 1970253 1654342 1601186 1882071 1896278 1970690
14595 1970690 1748607 1988027 1634043 1906836 1643200 2159884 2106731 2041219 1913497 1594998
14585 1594998 2279149 2123569 2160575 2288971 2166105 1988554 1884245 2264703 2102434 2258783
14575 2258783 2378258 2364302 2272306 2239588 2246087 2673870 2625452 2618592 3104130 2519355 2527770
14564 2527770 2677101 2687372 3066062 2673999 2873810 2983394 2998610 3568430 3397854 3524689
14554 3524689 3877937 3801625 4459551 4995000 5822504 7651251 11150082 18413079 37679044
14545 37679044 49260745 23015220 12295930 9141958 5056707 3404285 2936874 2427812
$$ packed form
14615A542865R632J03637j37545K04853k2867k15554k22148K29565J02691K08352
14605A803481j7090o1994J67557l14283L92582l15911n3156K80885J4207P4412
14595A970690k22083K39420l53984K72793k63636N16684n3153o5512j27722l18499
14585A594998O84151j55580L7006J28396j22866j77551j04309L80458j62269J56349
14575B258783J19475j3956r1996l2718O499M27783m8418o860M85538n84775Q415
14564B527770J49331J0271L78690l92063J99811J09584J5216N69820j70576J26835
14554C524689L53248p6312O57926N35449Q27504J828747L498831P262997J9265965
14545C7679044J1581701B3015220j0719290l153972m085251j652422m67411n09062
$$ plain form
14537 2427812 2536783 2280030 2229182 2341855 2432139 2350206 2586238 2342623 2487937 2638792
14527 2638792 2536546 2589381 2614182 2591518 2728658 2798452 2653378 2962871 2747240 2859374
14517 2859374 3075016 3078047 3088973 2680349 2962614 3111105 3141127 2997544 3001390 3127783
14507 3127783 2956469 2990884 2965020 3305291 3057368 2930937 3358219 3386284 3346866 3645638
14497 3645638 3615652 3613943 3783673 3852784 3576903 3804207 3518110 3551195 3916833 3758626
14487 3758626 3928502 3815542 4381172 3900685 4063262 3911634 4345663 4015689 4401371
14478 4401371 4267229 4085139 4317511 4551838 4444488 4482174 4403430 4826695 4574940 4885189
14468 4885189 4665262 4672235 4787206 4916461 4825457 5117406 5039875 4924042 5223775 5331840
$$ packed form
14537B427812J08971k56753n0848J12673R0284q1933K36032k43615J45314J50855
14527B638792j02246N2835K4801k2664J37140O9794j45074L09493k15631J12134
14517B859374K15642L031J0926m08624K82265J48491L0022j43583L846J26393
14507C127783j71314L4415k5864L40271k47923j26431M27282K8065l9418K98772
14497C645638k9986j709J69730O9111k75881K27304k86097L3085L65638j58207
14487C758626J69876j12960N65630m80487J62577j51628M34029l29974L85682
14478D401371j34142j82090K32372K34327j07350L7686p8744M23265k51755L10249
14468D885189k19927O973J14971J29255r1004K91949p7531j15833K99733J08065
$$ plain form
14458 5331840 5504062 5598745 5442792 5700735 5648882 5824134 5425590 5661551 5964554 5937741
14448 5937741 6047054 6032725 6159306 5986414 6362875 6515439 6594070 6221814 6950982 6673072
14438 6673072 6699382 6786640 7061704 6950202 7275495 7316822 7065866 7336559 7287331 7462493
14428 7462493 7729246 7863732 7912209 8160477 8171484 8102171 8453158 8458358 8241134 9093970
14418 9093970 8909577 9030630 8852870 9401174 9266008 9011784 9500185 10037899 9834357
14409 9834357 9970895 10348886 10474861 10755111 10520533 10930452 11018934 11445481 11282252 11797267
14399 11797267 11796478 11822699 12402354 12300895 12490504 12968457 12869713 12860872 13219114 13401242
14389 13401242 13705543 13916350 14115353 14319957 14823332 14912770 14964081 15309619 15892248 16170693
$$ packed form
14458E331840J72222R4683j55953K57943n1853J75252l98544K35961L03003k6813
14448E937741J09313j4329J26581j72892L76461J52564P8631l72256P29168k77910
14438F673072K6310Q7258K75064j11502L25293M1327k50956K70693m9228J75162
14428G462493K66753J34486M8477K48268J1007o9313L50987N200k17224Q52836
14418I093970j84393J21053j77760N48304j35166k54224M88401N37714k03542
14409I834357J36538L77991J25975K80250k34578M09919Q8482M26547j63229N15015
14399A1797267p89K6221N79655j01459J89609M77953r8744q841L58242J82128
14389A3401242L04301K10807J99003K04604N03375Q9438N1311L45538N82629K78445
$$ plain form
14379 16170693 16236268 16560941 16560649 17058676 17566370 17731667 18182649 18560941 18761381 19056482
14369 19056482 19631550 19904954 20311640 20962879 21149086 21886174 21896512 22480332 23018928
14360 23018928 23618435 23993889 24681383 25195960 25474027 26090854 26805610 27474226 28060570
14351 28060570 29116342 29581978 30336350 30824613 31796941 32906535 33496027 34102506 35437460
14342 35437460 36110071 37374476 38212030 39398812 40742932 41493382 42984330 44096854
14334 44096854 45251859 46611589 48144534 49791729 51112299 52694485 54570800 56206789
14326 56206789 58008965 60162338 62008671 63971248 66458879 68682526 71289175 73457840
14318 73457840 76468450 79378726 82548033 85762975 88846175 92704435 96133009 99814535
$$ packed form
14379A6170693O5575L24673k92M98027N07694J65297M50982L78292K00440K95101
14369A9056482N75068K73404M06686O51239J86207P37088J0338N83820N38596
14360B3018928N99507L75454O87494N14577K78067O16827P14756O68616N86344
14351B8060570J055772M65636P54372M88263R72328J109594N89492O06479J334954
14342C5437460O72611J264405Q37554J186782J344120P50450J490948J112524
14334D4096854J155005J359730J532945J647195J320570J582186J876315J635989
14326E6206789J802176K153373J846333J962577K487631K223647K606649K168665
14318G3457840L010610K910276L169307L214942L083200L858260L428574L681526
$$ plain form
14310 99814535 104114853 108679767 113044207 117986645 123034841 128335694 134646400 140227783
14302 140227783 146977733 153513221 160478523 168291217 176655947 184811737 193665704 203458642
14294 203458642 213411756 224369782 235039912 246550969 258718888 271475822 284372884
14287 284372884 298045586 311868569 326394591 340746360 355344171 369732941 384135457
14280 384135457 398019076 411465611 424120940 435380396 445632285 454348323 461003925
14273 461003925 464633762 464645004 464148863 462733808 458865278 453358654 446423411 438061662
14265 438061662 428798985 418460319 406292797 392940549 379092499 364202503 349302599
14258 349302599 333909870 318689857 303902154 289538729 275360438 263022610 250892451
$$ packed form
14310I9814535M300318M564914M364440M942438N048196N300853O310706N581383
14302A40227783O749950O535488O965302P812694Q364730Q155790Q853967R792938
14294B03458642R953114J0958026J0670130J1511057J2167919J2756934J2897062
14287B84372884J3672702J3822983J4526022J4351769J4597811J4388770J4402516
14280C84135457J3883619J3446535J2655329J1259456J0251889Q716038O655602
14273D61003925L629837J1242m96141j415055l868530n506624o935243q361749
14265D38061662r262677j0338666j2167522j3352248j3848050j4889996j4899904
14258C49302599j5392729j5220013j4787703j4363425j4178291j2337828j2130159
$$ plain form
14251 250892451 238812888 226994977 216033116 205644355 195785744 186286393 177572843
14244 177572843 169516125 161888487 154138686 147358480 140641081 134586575 129229110 123655249
14236 123655249 118217140 113274488 108834556 104319157 100100237 96926147 92862040 88894228
14228 88894228 85834682 82118972 79280568 76451484 73970646 71100172 68903774 66555272
14220 66555272 64507877 61938326 60059067 58014748 56168929 54578723 52993969 51999644
14212 51999644 50011385 48196736 46850936 45133499 44501438 43716364 42432983 41138476
14204 41138476 39977436 38602017 37894539 36568053 36499912 34858489 34088253 32900797 32540300
14195 32540300 31533819 30706383 30132410 29041132 28864210 27594287 27147969 26840834 26295665
$$ packed form
14251B50892451j2079563j1817911j0961861j0388761r858611r499351q713550
14244A77572843q056718p627638p749801o780206o717399o054506n357465n573861
14236A23655249n438109m942652m439932m515399m218920l174090m064107l967812
14228H8894228l059546l715710k838404k829084k480838k870474k196398k348502
14220F6555272k047395k569551j879259k044319j845819j590206j584754r94325
14212E1999644j988259j814649j345800j717437o32061p85074j283381j294507
14204D1138476j161040j375419p07478j326486o8141j641423p70236j187456l60497
14195C2540300j006481q27436n73973j091278j76922j269923m46318l07135n45169
$$ plain form
14186 26295665 25341568 24912465 24185412 23527525 23614571 22654343 22058918 21631287 21530135
14177 21530135 20761114 20598783 19964487 20132708 18838624 18701184 18511552 18158814 17882184
14168 17882184 17401845 17022674 16710095 16608634 15895918 15920232 15468541 15386801 14792678 14661905
14158 14661905 14334055 14157387 13986948 13951383 13686444 13064597 12925103 12973745 12770132 12417169
14148 12417169 12286520 11835583 11916955 11407082 11380325 10893138 10954315 10976570 10676350 10402235
14138 10402235 10496760 9985202 10005628 10279157 9731284 9307448 9450267 9167423 9439704 9078340
14128 9078340 8746091 8832142 8879491 8480111 8751831 8260064 8360433 7995989 8265542 8108993
14118 8108993 7709198 7839482 7587733 7658728 7624280 7358182 7287776 7322089 7353964 6969063
$$ packed form
14186B6295665r54097m29103p27053o57887Q7046r60228n95425m27631j01152
14177B1530135p69021j62331o34296J68221j294084j37440j89632l52738k76630
14168A7882184m80339l79171l12579j01461p12716K4314m51691q1740n94123j30773
14158A4661905l27850j76668j70439l5565k64939o21847j39494M8642k03613l52963
14148A2417169j30649m50937Q1372n09873k6757m87187O1177K2255l00220k74115
14138A0402235R4525n11558K0426K73529n47873m23836J42819k82844K72281l61364
14128I078340l32249Q6051M7349l99380K71720m91767J00369l64444K69553j56549
14118H108993l99795J30284k51749P0995l4448k66098p0406L4313L1875l84901
$$ plain form
14108 6969063 7047948 6631617 6846045 6824374 6758806 6628450 6626118 6494637 6371133 6318949
14098 6318949 6408189 6289993 5936604 6102473 5864425 5702208 5984437 5542027 5598043 5668227
14088 5668227 5890873 5607214 5421779 5299905 5410966 5549054 5222235 5181865 5121633 5293347
14078 5293347 4899526 4876648 5063481 4800153 4543454 4779590 4544860 4789660 4641793 4258248
14068 4258248 4389682 4357661 4548591 4248684 4147808 4318381 3890323 4140753 4373296 4371623
14058 4371623 4114683 4141878 4337479 4138663 4209496 3729562 3816999 3876334 3553973 3779558
14048 3779558 3614166 3587450 3653627 2956310 3291370 3700735 3519139 3436135 3348984 3514746
14038 3514746 3302198 3043254 3228107 3032438 3454376 2980514 3098098 3310922 2992149
$$ packed form
14108F969063P8885m16331K14428k1671o5568j30356k332j31481j23504n2184
14098F318949Q9240j18196l53389J65869k38048j62217K82229m42410N6016P0184
14088E668227K22646k83659j85435j21874J11061J38088l26819m0370o0232J71714
14078E293347l93821k2878J86833k63328k56699K36136k34730K44800j47867l83545
14068D258248J31434l2021J90930k99907j00876J70573m28058K50430K32543j673
14058D371623k56940K7195J95601j98816P0833m79934Q7437N9335l22361K25585
14048C779558j65392k6716O6177o97317L35060M09365j81596q3004q7151J65762
14038C514746k12548k58944J84853j95669M21938m73862J17584K12824l18773
$$ plain form
14029 2992149 2745937 3217695 3141282 3008598 2974834 3246112 3058806 2656949 2699698 2457553
14019 2457553 2613333 2857755 2578142 2336137 2653545 2598073 2534270 2614064 2493800 2340888
14009 2340888 2677975 2523210 2513248 2571902 2277178 2677890 2193830 2135714 2097499 2299750
13999 2299750 2157644 2221553 2272787 2125369 2166655 2146050 1956637 1870173 2158766 2496281
13989 2496281 3664965 5605100 10970456 27715274 50615944 28932437 15256925 9352543
13981 9352543 6648873 5341363 4525686 4027183 3680176 3373865 3222867 2993946 2938886
13972 2938886 2900506 2816506 2664625 2497648 2632319 2536094 2223255 2532021 2400116 2427538
13962 2427538 2504103 2454022 2040091 1969318 2393568 2018722 2126530 1908798 2211556 1896250
$$ packed form
14029B992149k46212M71758p6413j32684l3764K71278j87306m01857M2749k42145
14019B457553J55780K44422k79613k42005L17408n5472o3803P9794j20264j52912
14009B340888L37087j54765r962N8654k94724M00712m84060n8116l8215K02251
13999B299750j42106O3909N1234j47418M1286k0605j89413q6464K88593L37515
13989B496281J168684J940135N365356J6744818K2900670k1683507j3675512n904382
13981I352543k703670j307510q15677m98503l47007l06311j50998k28921n5060
13972B938886l8380q4000j51881j66977J34671r6225l12839L08766j31905K7422
13962B427538P6565n0081m13931p0773M24250l74846J07808k17732L02758l15306
$$ plain form
13952 1896250 1569696 2219295 2269415 2021291 2020531 2068923 1986775 2056789 2213325 1861691 1963733
13941 1963733 2054237 1765106 1685201 1983459 2079850 1827980 1830999 1572570 1548572 1549820 1627446
13930 1627446 1941565 1589025 1882301 1486882 1705601 1827983 1729586 1936455 1458567 1567620
13920 1567620 1870768 1813905 1511949 1511488 1619547 1730541 1731989 1428321 1375932 1247401 1433977
13909 1433977 1503034 1406514 1258236 1526962 1366267 1416704 976289 1147163 1271298 1550060
13899 1550060 1446207 1202808 1328182 1305771 1606835 1493760 1239996 1157496 1194173 1319853
13889 1319853 1363679 934755 1340028 1402611 974374 1004730 1366952 1359934 1232669 1188958
13879 1188958 1002995 1158350 1127361 914105 1025383 1462318 1187880 1131846 1280763 986562
$$ packed form
13952A896250l26554O49599N0120k48124p60M8392q2148P0014J56536l51634J02042
13941A963733R0504k89131p9905K98258R6391k51870L019k58429k3998J248P7626
13930A627446L14119l52540K93276l95419K18719J22382r8397K06869m77888J09053
13920A567620L03148n6863l01956m61J08059J10994J448l03668n2389j28531J86576
13909A433977O9057r6520j48278K68726j60695N0437m40415J70874J24135K78762
13899A550060j03853k43399J25374k2411L01064j13075k53764q2500L6677J25680
13889A319853M3826m28924M05273O2583m28237L0356L62222p018j27265m3711
13879A188958j85963J55355l0989k13256J11278M36935k74438n6034J48917k94201
$$ plain form
13869 986562 1342985 895567 1291421 1185876 937523 1373838 1258804 887811 1081316 941801
13859 941801 1374347 871208 786400 1344312 1398935 1080499 1414535 1252653 1010859 856287
13849 856287 888648 1009196 1059012 785320 966650 1377802 1029633 1008534 1043264 1127899
13839 1127899 845275 1094390 1197898 1099649 1038030 1035025 1117234 1273937 1008534 749422
13829 749422 746629 714144 663979 784291 1082242 1174684 978218 1049428 874429 1090791 802567
13818 802567 877374 1171932 979717 962798 410433 929195 904781 860151 517680 894279
13808 894279 921927 794110 910604 946810 750073 881923 680467 1007923 950305 931412
13798 931412 1242252 708724 1106270 614928 823669 1068038 839265 806239 647860 831829
$$ packed form
13869I86562L56423m47418L95854j05545k48353M36315j15034l70993J93505j39515
13859I41801M32546n03139q4808N57912N4623l18436L34036j61882k41794j54572
13849H56287L2361J20548M9816k73692J81330M11152l48169k1099L4730Q4635
13839A127899k82624K49115J03508r8249o1619l005Q2209J56703k65403k59112
13829G49422k793l2485n0165J20312K97951R2442j96466P1210j74999K16362k88224
13818H02567P4807K94558j92215j6919D10433N18762k4414m4630l42471L76599
13808H94279K7648j27817J16494L6206j96737J31850k01456L27456n7618j8893
13798I31412L10840n33528L97546m91342K08741K44369k28773l3026j58379J83969
$$ plain form
13788 831829 989575 675447 884877 512318 830407 906288 852422 881009 603896 675564
13778 675564 692479 983408 870120 669481 792247 551986 829579 757590 536742 1158124
13768 1158124 1008310 674933 665929 809190 451550 605274 493139 908693 607234 1008096
13758 1008096 557824 779076 920120 789143 637562 653269 926480 469323 668340 786568
13748 786568 802097 697957 544342 682002 685364 425296 581749 664264 513970 706146
13738 706146 840408 563356 693904 454151 930569 504476 719682 411895 764291 605863
13728 605863 482776 753219 928909 621420 377261 688430 635036 564641 663310 594255
13718 594255 398009 324138 679433 658093 688710 571225 546053 327489 667464 862810
$$ packed form
13788H31829J57746l14128K09430l72559L18089P5881n3866K8587k77113P1668
13778F75564J6915K90929j13288k00639J22766k40261K77593p1989k20848O21382
13768A158124j49814l33377r004J43261l57640J53724j12135M15554l01459M00862
13758A008096m50272K21252J41044j30977j51581J5707K73211m57157J99017J18228
13748G86568J5529j04140j53615J37660L362k60068J56453Q2515j50294J92176
13738G06146J34262k77052J30548k39753M76418m26093K15206l07787L52396j58428
13728F05863j23087K70443J75690l07489k44159L11169n3394p0395R8669o9055
13718E94255j96246p3871L55295k1340L0617j17485k5172k18564L39975J95346
$$ plain form
13708 862810 356978 665401 560321 495848 405198 254038 420836 853404 463897 245168
13698 245168 294996 416715 420649 659627 470545 482951 487368 535903 607827 556770 232844
13686 602615 313276 493413 828135 540836 630353 287376 493132 387012 447868 471130
13676 471130 498010 678942 531219 422806 541106 306332 306371 538830 544049 549301 629552
13665 629552 386419 634391 436895 397701 252897 737005 366226 400420 731285 500975
13655 500975 349215 430106 247730 386441 305055 648640 338979 203149 416488 573366
13645 573366 386164 140322 638237 448160 429744 319963 308755 271824 302735 282850
13635 282850 270208 585869 816993 563912 624020 148706 440060 312016 167038 123232
$$ packed form
13708H62810C56978L08423j05080o4473r0650j51160J66798M32568l89507k18729
13698B45168M9828J21719L934K38978j89082J2406M417M8535P1924n1057B32844
13686F02615k89339J80137L34722k87299Q9517B87376K05756j06120O0856K3262
13676D71130K6880J80932j47723j08413J18300k34774L9K32459N219N252Q0251
13665F29552k43133K47972j97496l9194j44804M84108C66226L4194L30865k30310
13655E00975j51760Q0891j82376J38711q1386L43585l09661j35830K13339J56878
13645E73366j87202A40322M97915j90077j8416j09781j1208l6931L0911j9885
13635B82850j2642L15661K31124k53081O0108A48706K91354j28044j44978m3806
$$ plain form
13625 123232 606942 550734 332590 644580 646717 313536 351002 165132 312388 349446
13615 349446 427190 432557 473388 326545 418750 552018 567786 268335 322401 450474 326035
13604 326035 623653 419520 230329 683209 181898 343665 283619 317938 335890 301194
13594 301194 236965 263012 666301 335485 447185 111194 423596 418893 217495 374832
13584 374832 267448 214878 395907 686537 285365 513079 638557 410273 396219 307061
13574 307061 278389 117457 533243 196501 334137 490534 414892 457932 334667 537130
13564 537130 311378 403086 386684 295362 364291 133701 42175 301916 187889 277030 498548
13553 498548 134058 74267 272055 473592 147571 370061 289967 281208 581138 309714
$$ packed form
13625A23232M83710n6208k18144L11990K137C13536L7466A65132J47256L7058
13615C49446P7744N367M0831j46843R2205J33268J5768B68335N4066J28073j24439
13604C26035K97618k04133j89191M52880A81898J61767o0046L4319J7952l4696
13594C01194o4229K6047M03289l30816J11700A11194L12402m703k01398J57337
13584C74832j07384n2570J81029K90630B85365K27714J25478k28284j4054q9158
13574C07061k8672A17457M15786A96501J37636J56397p5642M3040j23265K02463
13564E37130k25752R1708j6402r1322O8929A33701D2175K59741j14027Q9141K21518
13553D98548A34058n9791J97788K01537A47571K22490q0094q759K99930k71424
$$ plain form
13543 309714 332046 169651 316988 146326 274368 306599 253518 71621 30682 569344
13533 569344 330814 166813 256328 212782 447908 470936 -706 328456 390164 295659 313110
13522 313110 240058 279088 220981 237708 331709 433994 438431 430832 263392 271886 -64468 311015
13509 275100 497269 170387 305330 480758 -84683 302330 276697 130432 395692 142869
13498 496174 387587 199782 185616 614866 78881 478107 502720 180474 213357 35029
13487 320163 139619 253956 394486 63472 340425 78965 -113034 354167 135856 313624
13477 313624 94661 227643 119307 467101 187387 15477 61841 189195 249554 25216
13466 335844 -14962 425763 188404 214442 190137 206983 301914 -119450 110116 162931 268656
$$ packed form
13543C09714K2332j62395J47337A46326J28042L2231n3081G1621C0682N38662
13533E69344k38530j64001Q9515m3546K35126K3028g06C28456O1708r4505J7451
13522C13110p3052L9030n8107J6727R4001J02285M437p599j67440Q494f4468C11015
13509B75100K22169A70387J34943J75428h4683C02330k5633A30432K65260A42869
13498D96174j08587j87805j4166M29250G8881L99226K4613A80474L2883C5029
13487C20163A39619J14337J40530F3472K76953G8965a13034C54167A35856J77768
13477C13624I4661J32982j08336L47794A87387A5477M6364J27354O0359B5216
13466C35844a4962D25763A88404K6038k4305J6846R4931a19450A10116N2815J05725
$$ plain form
13455 268656 187472 56855 369566 211185 -144255 125100 -53581 54041 365423 455992
13445 455992 445701 101781 127898 354179 -40891 14673 100415 253514 92064 323064 239324
13434 239324 96235 286757 339876 -173556 263608 171912 396619 66581 71782 238919 55676
13422 199853 295823 243168 205924 241778 17916 477589 113708 83190 266853 -42459 151828
13410 81725 378919 202613 125976 179826 107821 312540 153927 154565 69822 155728 341954
13399 341954 -21040 144732 274089 387147 249766 -4035 314193 345589 172090 97415
13389 97415 157140 261025 83084 -224360 35564 269296 192583 358279 189409 66387 95424
13378 95424 241586 685762 99225 326770 -75402 96252 454244 146967 285868 59952
$$ packed form
13455B68656q1184E6855L12711j58381a44255A25100e3581E4041L11382R0569
13445D55992j0291A01781K6117K26281d0891A4673Q5742J53099I2064K31000q3740
13434B39324I6235J90522N3119a73556B63608r1696K24707F6581N201J67137E5676
13422A99853R5970n2655l7244L5854A7916M59673A13708l0518J83663d2459A51828
13410H1725K97194j76306p6637N3850p2005K04719A53927O38F9822Q5906J86226
13399C41954b1040A44732J29357J13058j37381d035C14193L1396A72090p4675
13389I7415N9725J03885H3084b24360C5564K33732p6713J65696j68870F6387K9037
13378I5424J46162M44176I9225K27545g5402I6252L57992A46967J38901E9952
$$ plain form
13367 258068 390500 306772 485313 547029 268146 468882 197925 161161 441849 -190987
13356 -154551 -32389 381783 16852 441501 114491 280556 177829 31997 270493 437499
13346 437499 201999 119204 384958 247578 384025 119669 444717 136980 330349 390732
13336 390732 50016 297230 -539 453564 381228 98545 483618 412207 256304 184074 -144547
13324 10043 190577 323360 276134 309959 297842 331916 86425 85110 311560 189341 295474
13313 295474 325027 223450 77744 258945 193631 372626 174164 107932 67343 344618
13303 344618 298313 310903 150670 191139 142793 43981 242094 374135 -100270 52207 166096
13292 166096 55692 399438 -159879 215299 -23519 332277 402916 -209392 309755 -53063
$$ packed form
13367B58068J32432q3728J78541O1716B68146K00736A97925l6764K80688a90987
13356a54551c2389C81783A6852M24649A14491J66065j02727C1997K38496J67006
13346D37499B01999q2795K65754j37380J36447A19669L25048A36980J93369O0383
13336C90732E0016K47214e39D53564p2336I8545L85073p1411j55903p2230a44547
13324A0043J80534J32783m7226L3825j2117L4074H6425j315K26450j22219J06133
13313B95474K9553j01577G7744J81201o5314J78995A74164o6232m0589K77275
13303C44618m6305J2590A50670M0469m8346D3981J98113J32041a00270E2207J13889
13292A66096E5692L43746a59879B15299b3519C32277P0639b09392C09755e3063
$$ plain form
13281 -36438 281163 138951 49135 68495 127694 -22382 252414 -82393 27640 33996 184646
13270 184646 12844 356177 73438 48656 -15099 106115 11305 29164 -164403 212447 225884
13259 225884 203837 450481 -209189 -165406 -44707 317319 166123 129603 286417 229503
13249 229503 452459 292713 248261 -2740 7958 83391 -23203 33979 162842 458841 -30691
13237 106306 460364 201314 -132964 49947 11158 265419 300749 130688 -2302 30373 -107385
13225 151012 -53711 251162 128149 40128 -158137 -149563 158770 210639 -59476 162765 67588
13213 -77751 -71460 397352 370484 -36641 31790 229929 38558 347143 101453 287823 67719
13201 213229 14368 51518 280293 -78634 -101793 128248 411837 180367 340008 26360
$$ packed form
13281c6438B81163A38951D9135J9360N9199b2382B52414h2393B7640O356J50650
13270A84646A2844L43333G3438k4782a5099A06115A1305J7859a64403B12447J3437
13259B25884k2047K46644b09189M3783d4707C17319j51196l6520J56814n6914
13249B29503K22956j59746m4452b740G958P5433b3203C3979J28863K95999c0691
13237A06306L54058B01314a32964D9947A1158K54261L5330A30688b302C0373a07385
13225A51012e3711B51162j23013D0128a58137Q574A58770N1869e9476A62765F7588
13213g7751O291C97352k6868c6641C1790J98139C8558L08585A01453J86370F7719
13201B13229A4368L7150K28775g8634k3159A28248K83589A80367J59641B6360
$$ plain form
13190 47577 52813 -35743 185908 -96124 -185179 470320 -89740 81459 106988 35932 268872
13179 268872 136406 180680 -202269 185414 12128 286769 -42419 493141 85473 213153
13169 213153 65637 113588 262225 -238971 79321 72626 109247 138247 -48535 -2350 109481
13157 -22314 -177569 165633 70232 256375 214683 250172 54423 60864 191247 189376 101389
13146 101389 -53927 122563 305234 185130 -45937 -156556 251385 97550 91526 216956
13136 216956 51921 -120032 -139173 135930 -21549 246380 162471 116434 -309898 292540
13125 366817 142841 -196256 124529 -141275 140233 124316 269230 90710 -211982 12069
13114 -131659 108351 -164007 -169473 -222299 -187637 -49962 87270 -103263 393494 119383 46821
$$ packed form
13190D7577N236c5743A85908i6124q9055D70320h9740H1459K5529C5932K32940
13179B68872j32466M4274b02269A85414A2128K74641d2419D93141H5473J27680
13169B13153F5637M7951J48637b38971G9321o695L6621K9000d8535b350A09481
13157b2314j55255A65633G0232J86143m1692L5489E4423O441J30383j871q7987
13146A01389e3927A22563J82671j20104d5937j10619B51385I7550o024J25430
13136B16956E1921a20032j9141A35930b1549B46380q3909m6037c09898B92540
13125C66817A42841a96256A24529a41275A40233j5917J44914I0710b11982A2069
13114a31659A08351a64007n466n2826L4662d9962H7270a03263C93494A19383D6821
$$ plain form
13102 221336 277046 11894 -108428 541441 242419 38453 -146026 -94393 -6261 148424 290107
13091 290107 291069 173508 85269 159463 280573 -37470 118848 64154 -235811 57652 217671
13080 217671 241597 -273382 -130868 -134689 157730 -11796 282542 220001 179902 128967 100590
13069 100590 211101 203706 -76787 116214 -141412 442179 43700 -4863 94067 111628 72052
13058 72052 214655 74695 353 -110790 -199538 156676 358480 625152 77326 197789 205223
13047 205223 112121 -135748 89087 -44739 131698 -537 461349 -30338 366342 -26374 -305146
13036 -305146 475749 -117861 60286 -41800 37566 -180768 220874 -80938 -1239 -68614 59025
13024 157293 254783 277184 39558 -122856 76680 86854 114859 82249 37111 12488 51287
$$ packed form
13102B21336N5710A1894a08428E41441B42419C8453a46026N1633f261A48424J41683
13091B90107R62j17561H5269P4194J21110c7470A18848n4694b35811E7652J60019
13080B17671K3926b73382a30868l821A57730a1796B82542o2541m0099n0935k8377
13069A00590J10511p395g6787A16214a41412D42179D3700d863I4067J7561l9576
13058G2052J42603G4695C53a10790q8748A56676K01804K66672G7326J20463P434
13047B05223r3102a35748H9087d4739A31698e37D61349c0338C66342b6374k78772
13036c05146D75749a17861F0286d1800C7566a80768B20874h0938a239o7375E9025
13024A57293R7490K2401C9558a22856G6680J0174K8005l2610C7111A2488L8799
$$ plain form
13013 51287 78858 244988 -44870 92466 -75269 199065 246268 57861 227157 191109 13997
13001 105350 -50833 54679 110721 -239733 6616 163002 -130519 350986 199846 -115595
12990 143827 100601 209505 -121912 149949 18263 -326572 200497 250702 203324 -4416 66512
12978 -263226 -183331 -135768 74999 208052 45860 188530 9728 327167 -197201 75616 44827
12967 44827 137170 9404 402280 -108318 -9376 265298 98063 66935 345154 149593 111538
12956 111538 -94132 -26237 64858 129206 164224 289952 -4264 -234474 -28755 97023 26514
12944 -12801 72446 60547 5444 99394 -50234 58674 -61184 44310 220393 -214259 -54576
12932 127039 -23748 132553 213240 67460 -182514 -168078 173516 -24440 -169973 -49574 209911
$$ packed form
13013E1287K7571J66130d4870I2466g5269A99065M7203E7861J69296l6048A3997
13001A05350e0833E4679N6042b39733F616J56386a30519C50986j51140a15595
12990A43827m3226J08904a21912A49949A8263c26572B00497N0205m7378d416F6512
12978b63226P9895M7563G4999J33053D5860J42670I728L17439a97201G5616l0789
12967D4827R2343I404L92876a08318i376B65298I8063l1128K78219A49593l8055
12956A11538i4132b6237F4858O4348L5018J25728d264k30210b8755I7023B6514
12944a2801G2446j1899E444R3950e0234E8674f1184D4310J76083b14259e4576
12932A27039b3748A32553Q0687F7460a82514J4436A73516b4440j45533d9574B09911
$$ plain form
12920 248321 -52144 -136173 123517 78776 108974 -106172 -345171 -169297 58446 336211
12910 336211 12999 130255 -334955 184449 -45390 -4424 63841 29162 176258 -10039 94438
12898 141524 64548 -113197 115131 -46858 -11977 13717 -268320 -172557 182720 79145 -4188
12886 -86258 208357 -58628 -101963 -228526 -109884 -27580 141129 11754 49115 21387 9519
12874 -111121 -255870 87417 154773 302484 16116 -251158 42683 73469 -39383 46386 -342126
12862 -22402 51185 97564 -64031 30679 146049 -5765 289596 -11731 -9560 -127844 211155
12850 309693 74706 131232 105522 339460 237425 172739 -23861 -218111 57113 150975 -181682
12838 73599 142188 -147109 155222 324808 -130072 112506 -64135 -48980 -282796 -110585
$$ packed form
12920B48321e2144q4029A23517m4741L0198a06172k38999a69297E8446K77765
12910C36211A2999J17256c34955A84449d5390d424F3841B9162J47096a0039I4438
12898A41524F4548a13197A15131d6858a1977A3717b68320R5763A82720G9145d188
12886h6258B08357e8628m3335j26563a09884b7580A41129A1754L7361B1387I519
12874a11121j44749H7417O7356J47711A6116b51158D2683L0786c9383D6386c42126
12862b2402E1185M6379f4031C0679J15370e765B89596a1731K171j18284B11155
12850C09693G4706N6526k5710K33938j02035o4686b3861j94250E7113R3862a81682
12838G3599O8589a47109A55222J69586a30072A12506f4135J5155k33816a10585
$$ plain form
12827 -273928 182559 406586 -41606 407963 115653 102749 -294775 84897 214017 322576
12817 322576 324838 38551 -60596 -202068 32455 -52446 -144497 -82205 -74999 6095 -100722 310251
12804 205718 -47362 -180622 505981 -154292 212917 60759 -214884 700 155505 -46600 8098
12792 -163707 201039 -12874 -637 -156625 -16578 31437 80113 -48240 -4642 170885 55569
12780 63300 -153300 -18696 -143589 830 -44703 22403 -280714 -23404 -209682 -15347 -51348
12769 -51348 -234367 333665 118358 175039 68320 -79691 50256 -44935 -338127 11894 -13800
12757 -137271 213191 39968 -20332 12688 -150893 -17873 -21208 -24732 -131679 -213646 -71432
12745 54248 125070 118677 -211088 79361 48332 -170467 -12779 58429 46368 -236772 -273433
$$ packed form
12827b73928A82559K24027d1606D07963A15653j2904b94775H4897J29120J08559
12817C22576K262C8551f0596j41472C2455e2446r2051O2292P206F095a00722C10251
12804B05718d7362j33260E05981a54292B12917F0759b14884G00J54805d6600H098
12792a63707B01039a2874f37j55988a6578C1437M8676d8240d642A70885E5569
12780F3300a53300a8696j24893H30d4703B2403b80714b3404j86278a5347l6001
12769e1348j83019C33665A18358N6681F8320g9691E0256d4935k93192A1894a3800
12757a37271B13191C9968b0332A2688a50893a7873l335l524j06947q1967g1432
12745E4248P0822o393b11088G9361l1029a70467a2779E8429j2061b36772l6661
$$ plain form
12734 -273433 84428 137449 48129 -70683 335330 91350 208764 45750 36142 -252382 190898
12722 124601 -37473 -34145 -187668 176805 -235065 -119252 47903 82417 16019 38507 147997
12711 147997 80433 -233516 395026 432286 170598 -177309 529515 -162477 178481 138001
12701 138001 239151 91774 -121395 -38918 -99537 282221 75759 34953 -24857 24926 39446
12690 39446 -77339 11656 -87254 -172531 -196023 236837 180440 -83224 18560 -101520 354271
12678 -225606 101035 -36624 85002 105042 239527 -42268 2593 185385 -159627 -80058 -96677
12667 -96677 -119365 324664 249954 -56330 177701 69191 68182 241618 223167 367519 -202087
12655 283467 61529 266158 -250703 274962 47764 242220 294919 -2254 207528 177691 9249
$$ packed form
12734b73433H4428N3021D8129g0683C35330I1350J17414D5750r608b52382A90898
12722A24601c7473L328j53523A76805b35065J15813D7903L4514A6019K2488J09490
12711A47997o7564b33516C95026L7260A70598a77309E29515a62477A78481m0480
12701A38001J01150I1774a21395c8918o0619B82221G5759C4953b4857B4926J4520
12690C9446g7339A1656h7254q5277k3492B36837n6397h3224A8560a01520C54271
12678b25606A01035c6624H5002K0040J34485d2268B593J82792a59627P9569j6619
12667i6677k2688C24664p4710e6330A77701F9191j009J73436j8451J44352b02087
12655B83467F1529K04629b50703B74962D7764J94456N2699b254B07528k9837I249
$$ plain form
12643 636 -69825 3438 -80692 18375 145384 13917 170148 38281 163841 -17765 256456
12631 205406 322827 -6588 340548 19133 235130 328190 308387 214516 381050 67853 -27660
12619 383707 323055 38434 257095 91365 143353 -317838 159563 -3366 -50918 -74332 -20368
12607 74988 -48124 120289 133040 204205 36623 263621 -300285 141229 235081 -79888 336628
12595 114021 334212 105416 -8933 28294 74351 182694 -125882 113896 68854 -345058
12584 -16875 -43102 27552 -153418 153443 330044 108636 20781 -86349 245050 -174816
12573 -200261 121327 -97668 -206902 239857 25346 384102 38831 -116589 62467 -73846
12562 -110559 -195304 -285915 -188803 -30115 -61526 -139717 -130084 61783 242445 311170 62238
$$ packed form
12643F36f9825C438h0692A8375J27009A3917J56231C8281J25560a7765B56456
12631B05406J17421f588C40548A9133K15997R3060j9803r3871J66534F7853b7660
12619C83707o0652C8434K18661I1365N1988c17838A59563c366m7552k3414b0368
12607G4988d8124A20289J2751P1165C6623K26998c00285A41229R3852g9888C36628
12595A14021K20191A05416h933B8294M6057J08343a25882A13896m5042c45058
12584a6875k6227B7552a53418A53443J76601A08636B0781h6349B45050a74816
12573b00261A21327i7668j09234B39857B5346L58756C8831a16589F2467g3846
12562a10559q4745r0611R7112c0115l1411p8191R633F1783J80662O8725F2238
$$ plain form
12550 -48965 88710 -220336 33789 -39558 -2102 -239478 334346 -239336 -200891 -43348 -51950
12539 -51950 50498 323610 1788 -4538 134416 -114471 -153782 73771 -166796 116612 -158835
12527 85707 152057 215688 -53024 -58602 -24408 189531 71433 -282048 -4523 225083 -71620
12515 97844 -78778 -168698 132346 -201953 -238324 -23265 213757 132905 -82093 -148042 11174
12503 -70718 63644 -40512 196181 -188985 -26894 127480 -161853 130363 25897 -203880
12492 121833 59012 201759 -182971 -281162 -34459 -38484 88703 -27987 -13193 -83078 135789
12480 46120 202935 -229963 223276 -149398 -189046 86412 258090 148180 -21603 107868
12469 -390427 -67866 106728 -230667 152890 -303067 245014 -22907 -167559 72225 -92695
$$ packed form
12550d8965H8710b20336C3789c9558b102k37376C34346b39336L8445d3348q602
12539e1950E0498K73112A788d538A34416a14471l9311G3771a66796A16612a58835
12527H5707O6350O3631e3024n578b4408A89531G1433b82048d523B25083g1620
12515I7844g8778q9920A32346b01953l6371b3265B13757q0852h2093o5949A1174
12503g0718F3644d0512A96181a88985b6894A27480a61853A30363B5897b03880
12492A21833E9012J42747a82971r8191c4459m025H8703b7987a3193o9885A35789
12480D6120J56815b29963B23276a49398l9648H6412J71678j09910b1603A07868
12469c90427f7866A06728b30667A52890c03067B45014b2907j44652G2225i2695
$$ plain form
12458 -32617 -191670 143864 69133 -233562 53842 -33516 253990 -82277 40841 328398 -367548
12446 19688 -61389 133722 -16199 -10633 137879 -129006 27016 209096 -108209 -127311 -110047
12435 -110047 80064 -148036 56109 -178208 -75887 238149 258336 -79619 70192 285603 175698
12424 175698 19976 52345 148013 -157119 -97757 -44725 988 -41740 -111687 133785 89208
12413 89208 -79625 162075 233248 153319 257406 140506 -38568 -24091 219917 257847 -38820
12401 -47129 64601 214913 -275612 23530 3021 -273080 208827 -321525 -121071 79840 248386
12390 248386 -5315 -167114 -29225 -6515 -54049 -418146 177654 -6237 -193985 -130483 -25820
12378 -18799 338577 46050 165618 -10571 -136401 -432591 46655 -72885 -25707 66519 231757
$$ packed form
12458c2617j59053A43864F9133b33562E3842c3516B53990h2277D0841K87557c67548
12446A9688f1389A33722a6199N566A37879a29006B7016J82080a08209j9102J7264
12435a10047H0064a48036E6109a78208g5887B38149K0187g9619G0192K15411j09905
12424A75698A9976L2369R5668a57119N9362d4725I88d1740o9947A33785m4577
12413H9208g9625A62075P1173p9929J04087j16900c8568J4477B19917L7930c8820
12401d7129F4601J50312b75612B3530C021b73080B08827c21525a21071G9840J68546
12390B48386e315j61799b9225f515m7534l64097A77654f237j87748O3502b5820
12378a8799C38577D6050J19568a0571j25830k96190D6655g2885b5707F6519J65238
$$ plain form
12367 231757 -62726 106559 -228499 -77951 -89716 491249 -245303 166578 -316394 177487
12356 29330 -270846 49177 -35964 -130821 -78601 52160 -273484 40894 170493 -113495 -21652
12344 -164637 -75488 303980 276901 373628 -162498 14251 -121941 137800 -46736 -119524 -216660
12333 -216660 176641 -145819 -163585 -172995 181793 -84726 -42582 245197 -23176 381053 155872
12321 -187406 -220761 210414 9174 -71404 81101 -365430 -111064 -49144 133173 -26155 -108351
12310 -108351 231038 137511 257932 49376 -70537 -45061 176963 -158055 82826 -235889
12299 136418 -40301 106319 -319273 80134 25507 -172243 265617 -81560 7426 348469 -93626
12287 163287 -448959 -98934 134966 -271270 147010 184716 223600 349121 71508 249117
$$ packed form
12367B31757f2726A06559b28499g7951j1765D91249b45303A66578c16394A77487
12356B9330b70846D9177c5964r4857N2220E2160b73484D0894J29599a13495b1652
12344a64637g5488C03980k7079R6727a62498A4251a21941A37800d6736p2788r7136
12333b16660A76641a45819j7766r410A81793h4726M2144B45197b3176C81053A55872
12321a87406l3355B10414I174g1404H1101c65430a11064d9144A33173b6155q2196
12310a08351B31038r3527J20421D9376g0537K5476A76963a58055H2826b35889
12299A36418d0301A06319c19273H0134B5507a72243B65617h1560G426L41043i3626
12287A63287d48959i8934A34966b71270A47010L7706L8884J25521G1508J77609
$$ plain form
12277 249117 79092 -261975 119474 -220659 38907 -12972 -69270 -140003 -88105 -120341 324293
12265 88275 401276 73780 -17056 250711 -1955 360879 251885 44683 205622 151693 20037
12253 193623 218224 131046 136021 -69368 -98537 54863 40902 -27423 261627 251297 1813 90344
12241 90344 215936 81068 -77589 -168636 221947 66551 250558 -31457 317884 -171820 68724
12229 -195102 339629 245740 -11360 290131 215489 323847 298537 139908 -7381 370966 347327
12218 347327 44070 207784 3178 99737 656 -244832 152315 112958 32618 328832 31855
12206 -72174 321191 87464 181108 -19786 29401 256481 308083 338290 -51359 300355 90538
12194 221060 -242862 380585 281976 173393 210633 121157 -156336 146545 24934 106426
$$ packed form
12277B49117G9092b61975A19474b20659C8907a2972n6298p0733N1898l2236C24293
12265H8275L13001G3780a7056B50711a955C60879j08994D4683J60939n3929B0037
12253A93623K4601q7178M975f9368k9169E4863j3961b7423B61627j0330A813Q8531
12241I0344J25592H1068g7589r1047B21947F6551J84007c1457C17884a71820F8724
12229a95102C39629r3889a1360B90131p4642J08358k5310A39908g381C70966k3639
12218C47327D4070J63714C178R6559F56b44832A52315l9357C2618K96214C1855
12206g2174C21191H7464R3644a9786B9401K27080N1602L0207e1359C00355I0538
12194B21060b42862C80585r8609j08583L7240q9476a56336A46545B4934Q1492
$$ plain form
12184 106426 9622 323309 -304061 -89745 77967 27638 172126 -145345 107757 60716 55787
12173 55787 98776 -49421 -28947 243323 -92394 17360 288768 114866 -60276 -115843 411960
12161 -160380 150004 11727 58674 -121263 303985 -221365 50049 -217854 -245814 48447
12150 161388 175215 237119 68100 160433 -14076 -215690 -41910 -179942 132894 20743 137830
12139 137830 -263831 -127726 -188800 202495 378877 -37689 66061 -102834 247365 58247
12128 84763 -316308 -25237 144114 25775 -118937 137916 252415 -143042 -111142 275655
12117 -267064 -41510 56459 -87229 239081 -291898 72388 -203991 51040 8781 83475 45493
12106 45493 114077 315783 227654 -95905 253852 192858 -135618 -80178 -103071 -292433 252465
$$ packed form
12184A06426I622L13687c04061h9745G7967B7638J44488a45345A07757m7041m929
12173E5787M2989d9421K0474B43323i2394A7360K71408A14866f0276n5567D11960
12161a60380A50004A1727M6947a21263C03985b21365E0049b17854k7960D8447
12150A61388J3827O1904F8100R2333a4076k01614d1910j38032A32894B0743J17087
12139A37830b63831a27726o1074B02495J76382c7689F6061a02834B47365E8247
12128H4763c16308b5237A44114B5775a18937A37916J14499a43042L1900B75655
12117b67064d1510E6459h7229B39081b91898G2388b03991E1040H781P4694l7982
12106D5493O8584K01706q8129i5905B53852o0994a35618N5440k2893j89362B52465
$$ plain form
12094 -461109 103335 -478130 -40553 102905 -399854 193448 49836 23013 -108497 74619
12083 149309 51748 -44849 -17173 -220045 -10598 -105560 387256 -48980 273079 -146834 388078
12071 -72209 -18371 -7595 -140220 305206 224779 989513 1905567 868762 198676 117156 -68534
12059 23639 -224695 -7394 305020 -357032 -82496 -454969 46788 -61454 -189788 260040 -85861
12047 -209009 -63901 -16017 -23381 141177 104817 -1069 70013 8739 -360776 -19879 -253293
12036 -253293 -307245 326265 -35986 17171 -199614 -240722 -40615 -79015 10265 86183 28589
12024 -157276 -368131 112296 -164668 330877 -325067 173514 81254 72656 79090 -136977
12013 129830 174893 433428 217426 -63360 -211019 38036 -218178 164196 -5771 120351
$$ packed form
12094d61109A03335d78130d0553A02905c99854A93448D9836B3013a08497G4619
12083A49309E1748d4849a7173k02872a0598r4962C87256d8980B73079a46834C88078
12071g2209a8371g595j32625C05206q0427P64734R16054H68762A98676q1520f8534
12059B3639b24695g394C05020c57032h2496l72473D6788f1454j28334B60040h5861
12047b09009f3901a6017p364A41177l6360a069G0013H739c60776a9879k33414
12036b53293n3952C26265c5986A7171a99614m1108d0615l8400A0265P5918B8589
12024a57276k10855A12296a64668C30877c25067A73514H1254q598O434a36977
12013A29830M5063K58535k16002f3360j47659C8036b18178A64196e771A20351
$$ plain form
12002 -69268 24608 84905 -168579 75669 -81646 -119732 -183247 -71997 79745 -24327 -256940
11991 -256940 28759 92340 -226851 -42114 -95706 25648 -378264 46415 -157925 118327 -261706
11979 16359 -26105 123369 -61221 17961 68446 283672 -11293 -206114 -214744 260312 -103392
11967 113934 2945 -216403 -46105 -194750 -201526 -29924 -11971 191174 126714 -152363 121393
11955 -70128 -37285 -357876 -25995 -103979 -53452 445609 250588 -57090 98080 64062 72223
11944 72223 281711 55143 -32454 70139 -297092 -29285 -20758 -68187 -149515 -316357 -94948
11932 501418 75361 62097 -65626 -90987 150254 63662 28139 106613 155774 -115204 -308231
11921 -308231 130861 -191411 -299149 -252623 16876 158539 330985 -126677 91588 38262
$$ packed form
12002f9268B4608O0297a68579G5669h1646l8086o3515g1997G9745b4327k32613
11991b56940B8759O3581b26851d2114n3592B5648c78264D6415a57925A18327b61706
11979A6359b6105A23369f1221A7961N0485K15226a1293j94821q630B60312a03392
11967A13934B945b16403d6105j48645o776b9924a1971A91174o4460a52363A21393
11955g0128L2843l20591b5995p7984N0527D45609j95021e7090I8080l4018Q161
11944G2223K09488E5143c2454G0139b97092b9285Q527m7429q1328j66842i4948
11932E01418G5361j3264f5626k5361A50254F3662B8139P8474M9161a15204j93027
11921c08231A30861a91411j07738M6526A6876J41663J72446a26677I1588C8262
$$ plain form
11910 33667 -66551 28338 85067 -639 229820 -7539 176273 226796 61508 -94519 -313572 165360
11897 -267602 -3985 -175697 130790 142856 -51953 -121393 91803 -376722 42114 -21150 -177351
11886 -177351 -134073 -19786 330551 -574551 59469 -145371 -151499 38848 -242010 -70818 -274533
11875 -274533 -2321 -264009 20935 -1101 -293442 158011 -149978 -138868 -265826 232025 -131962
11863 -202719 -142150 -234793 1116 -236699 -73153 -190254 104382 -349391 230220 -87366 -202826
11852 -202826 -257597 -122543 -82262 163409 191527 -34022 98325 300379 -282363 -331277 134944
11840 -45670 351537 72692 -115259 -112416 -2543 -363435 13074 -187862 151882 -344417 76994
11828 36255 -61038 -141045 -203216 200910 -207904 -119214 -195434 -81952 -314891 -161155 -33691
$$ packed form
11910C3667f6551B8338N6729f39B29820g539A76273N0523F1508i4519k19053A65360
11897b67602c985j71712A30790J2066e1953o9440I1803c76722D2114b1150j56201
11886a77351M3278a9786C30551e74551E9469a45371o128C8848b42010g0818k03715
11875b74533b321k61688B0935a101k92341A58011a49978J1110j26958B32025a31962
11863b02719O0569r2643A116b36699g3153j17101A04382c49391B30220h7366j15460
11852b02826n4771a22543M0281A63409K8118c4022I8325K02054b82363m8914A34944
11840d5670C51537G2692a15259K843b543l60892A3074a87862A51882c44417G6994
11828C6255f1038q0007o2171B00910b07904Q8690p6220h1952k32939J53736c3691
$$ plain form
11816 115671 -318217 -453575 35525 -86541 -167473 47235 -21178 268209 -181853 -108940 105614
11804 352552 -150491 64457 -53561 88171 -113408 175835 61107 -180568 -90664 277900
11793 -179184 -92308 55535 -99016 -255892 -135032 -172890 -225025 83448 -59069 -49783 132421
11781 -182213 21732 -85115 -148346 42103 -114879 201371 8525 -297194 -117113 -8767 -205985
11770 -205985 195320 -115904 230168 331355 21238 -178296 36588 -214856 77600 70595
11760 70595 -160791 75689 247882 62370 -86772 88963 -68567 130034 -343773 1689 -200227
11748 -158444 1801 -57939 -122074 -30538 -54573 -105067 -62873 -272705 -298939 85462 -49232
11736 -27161 108263 -154285 167906 -31584 78183 110597 -119701 -176061 148047 89509 104406
$$ packed form
11816A15671c18217j35358C5525h6541q0932D7235b1178B68209a81853P2913A05614
11804C52552a50491F4457e3561H8171a13408A75835F1107a80568Q9904B77900
11793a79184Q6876E5535i9016j56876J20860l7858n2135H3448e9069R286A32421
11781a82213B1732h5115o3231D2103a14879B01371H525b97194a17113h767j97218
11770b05985A95320a15904B30168J01187B1238a78296C6588b14856G7600p005
11760G0595a60791G5689J72193F2370h6772H8963f8567A30034c43773A689b00227
11748a58444A801e7939o4135c0538k4035n0494M2194k09832k6234H5462d9232
11736b7161A08263a54285A67906c1584G8183L2414a19701n6360A48047n8538J4897
$$ plain form
11725 104406 -72011 -242284 -60601 -29631 42863 232163 18635 170131 91780 -157460 -47955
11713 -112551 -66236 446026 265442 312584 -163402 129654 -110490 199728 -51933 -203153
11703 -203153 -36183 200955 -71020 46450 200573 238668 -97069 -47688 181753 -147754 119616
11691 236756 130623 50027 -156636 -269738 -47705 29077 52462 -131825 224808 147647
11681 147647 103046 -125199 104287 -100383 -43863 155079 -322984 8273 333386 -35629
11670 -45318 178441 -9816 -134957 -81584 -174788 156220 4155 -401081 212663 97711 -184960
11658 314225 141185 53199 24219 -158032 157460 189259 -91538 -71811 -340519 -71267 -421666
11647 -421666 -105320 -179545 -28633 178388 -110691 393013 -98250 265406 -46746 -45619 -397121
$$ packed form
11725A04406g2011j70273f0601b9631D2863J89300A8635J51496p8351a57460d7955
11713a12551M6315D46026j80584M7142a63402A29654a10490A99728e1933j51220
11703b03153c6183B00955g1020D6450J54123L8095i7069d7688A81753a47754A19616
11691B36756j06133E0027a56636j13102d7705B9077K3385a31825B24808p7161
11681A47647m4601a25199A04287a00383d3863A55079c22984H273L25113c5629
11670d5318A78441i816j25141N3373r3204A56220D155d01081B12663I7711a84960
11658C14225A41185E3199B4219a58032A57460L1799i1538J9727k68708g1267l50399
11647d21666a05320p4225b8633A78388a10691C93013i8250B65406d6746J127l51502
$$ plain form
11636 -397121 25737 -18873 -245603 49104 -175719 353397 195613 28471 -341149 81775
11625 -104946 -281039 85680 -331580 35537 -179114 194161 -19123 -90302 152647 -114569
11614 65084 23751 -451386 -179169 -175212 71256 -215104 157804 -213 77107 -157141 104637
11602 -197564 49897 113943 130559 55359 6577 -70209 67462 2855 -461661 164041 -72069
11590 -55136 179285 256783 -53431 -383321 240245 39800 180172 181978 44670 -101751 -122890
11579 -122890 37670 35622 34344 -189697 57066 -29460 -93827 -87145 1468 115021 201381 90066
11566 50182 -15377 -235858 -93401 182845 -158630 227823 251650 -257861 -152687 -24467
11555 -62863 -290509 277372 159068 55918 141800 -306281 -194853 -87746 -115643 -76552 -9054
$$ packed form
11636c97121B5737a8873k26730D9104a75719C53397j57784B8471c41149H1775
11625a04946j76093H5680c31580C5537a79114A94161a9123p1179A52647a14569
11614F5084B3751d51386a79169L957G1256b15104A57804b13G7107a57141A04637
11602a97564D9897O4046J6616E5359F577g0209F7462B855d61661A64041g2069
11590e5136A79285P7498e3431l29890B40245C9800J40372J806D4670a01751k1139
11579a22890C7670k048j278a89697E7066b9460o4367O682A468J13553Q6360I0066
11566E0182a5377k20481i3401A82845a58630B27823K3827b57861J05174b4467
11555f2863k27646B77372j18304E5918Q5882c06281J11428h7746k7897L9091i054
$$ plain form
11543 -161224 15645 -9145 73855 -28568 140791 -74226 -278805 -183341 407905 -127208 398376
11531 168323 396907 -372589 37945 72335 79285 73013 74871 -249551 52435 51261 201179
11520 201179 292647 271560 398908 16376 246770 -144067 76550 126451 296495 109728
11509 8150 50695 114365 -99034 39084 43353 130190 138742 308095 57690 -404186 53991 -126983
11496 6326 -139204 75161 116021 103948 149599 263326 130235 -83657 70335 105559 216095
11485 216095 276782 243 -28419 72296 94502 58455 -328235 23272 138459 322445 -179166
11473 -31476 50979 172886 395667 70285 50369 223100 284366 273197 -282129 135218 305922
11462 305922 39327 8572 311980 -215098 221591 113524 -14546 -153083 -117512 100783
$$ packed form
11543a61224A5645i145G3855b8568A40791g4226k04579R5464D07905a27208C98376
11531A68323K28584c72589C7945L4390O950o272J858b49551E2435j174J49918
11520B01179R1468k1087J27348A6376K30394a44067G6550M9901J70044A09728
11509H150M2545O3670i9034C9084M269Q6837Q552J69353E7690d04186E3991a26983
11496F326a39204G5161M0860j2073M5651J13727A30235h3657G0335L5224J10536
11485B16095O0687B43b8419G2296K2206l6047c28235B3272J15187J83986a79166
11473c1476E0979J21907K22781G0285j9916J72731O1266j1169b82129A35218J70704
11462C05922C9327H572L03408b15098B21591j08067a4546j38537L5571A00783
$$ plain form
11451 155544 456945 -43578 129359 250288 244427 46847 9924 8192 -142252 -317756 -104806
11439 203451 -37557 237629 -3483 351593 -213008 -117480 -225101 9699 323377 357737 119833
11427 -222649 100910 35546 -264225 -94464 -86431 -95465 -33569 -305817 125296 -134478 -6786
11415 -269069 205589 -119832 -49011 -61087 -224798 75087 136666 -146775 -25534 23103 113194
11404 113194 -18736 16100 95920 -225795 -59692 82052 4420 135727 171214 -191471 -178041
11393 -178041 149785 -36858 -341199 98884 -146501 -360726 6112 -161745 26979 173113
11383 173113 -155040 372313 -119045 -76921 22145 127860 -129541 127804 -166466 85827
11372 -264857 41976 120494 48289 308835 75685 95190 -120240 60241 170027 -12444 119244
$$ packed form
11451A55544L01401d3578A29359J20929n861D6847I924j732a42252j75504a04806
11439B03451c7557B37629c483C51593b13008R5528j07621I699L13678L4360A19833
11427b22649A00910C5546b64225i4464Q033r034c3569k72248A25296a34478f786
11415b69069B05589a19832d9011j2076j63711G5087O1579a46775b5534B3103R0091
11404A13194a8736A6100P9820b25795e9692H2052D420J31307L5487a91471J3430
11393a78041A49785c6858l04341I8884a46501k14225F112a61745B6979J46134
11383A73113a55040C72313a19045M2124B2145J05715a29541A27804a66466H5827
11372b64857D1976P8518D8289K60546G5685J9505a20240F0241J09786a2444A19244
$$ plain form
11360 -214404 79982 -8120 86633 123590 -33260 97295 -128828 -93545 -4237 92343 -167637
11348 -82382 360475 73061 -40235 -93536 85804 228990 -396282 111061 -90847 -69985 305352
11336 -16951 -15818 8158 -240689 -243375 -135236 262532 -213701 -112419 280265 -42468 178156
11324 15391 45378 194935 216012 96258 -125170 -212240 -17064 107304 -81100 -194478 136040
11312 -114906 -31246 -396547 49252 -145408 276717 -30212 -203976 -100098 22328 -186188
11301 -131670 249342 -288770 -424255 -70165 41283 90259 72852 -224916 105254 252638
11291 252638 218025 175017 167879 102873 -79103 -152320 -87622 203713 -65897 -76905 -262860
11280 -262860 245145 100187 -84347 -99253 -272384 137739 38841 -298797 -233730 10817
$$ packed form
11360b14404G9982h120H6633L6957c3260I7295a28828L5283d237I2343a67637
11348h2382C60475G3061d0235n3301H5804J43186c96282A11061i0847K0862C05352
11336a6951J133H158b40689k686J08139B62532b13701J01282B80265d2468A78156
11324A5391K9987J49557K1077I6258a25170q7070a7064A07304h1100j13378A36040
11312a14906c1246l65301D9252a45408B76717c0212j73764a00098B2328a86188
11301a31670B49342b88770j35485g0165D1283M8976j7407b24916A05254J47384
11291B52638l4613m3008p138o5006g9103p3217O4698B03713f5897j1008j85955
11280b62860B45145A00187h4347j4906j73131A37739C8841b98797O5067A0817
$$ plain form
11269 -86324 -100871 236837 -111856 -25937 52542 5101 266225 -65441 -328998 -32753 -297762
11258 -297762 -402937 -188686 -198135 107824 44869 165595 168374 -257142 -235584 32859 -175565
11246 369864 113695 -69492 -40961 215290 -238522 -154208 -313294 -297317 -262016 -85927 -155839
11235 -155839 -60251 -307402 -124876 -112188 -230993 -146726 117052 -6927 62654 -473223 -147063
11223 -198205 -142772 177034 106139 -187208 90643 -218002 -106176 -131804 195025 49099
11212 -5858 -178242 61378 -4066 -399454 144752 68796 -125711 -11457 -77143 -77548 -40539 -52723
11200 -52723 -101472 -11181 -212847 -106534 -166793 -253692 -33002 -258354 176500 -176309 79654
11188 44571 -205148 187151 288456 259684 -243199 256426 -173144 52531 153618 142905
$$ packed form
11269h6324j4547B36837a11856b5937E2542E101K61124f5441k63557c2753k65009
11258b97762j05175a88686r449A07824D4869J20726K779b57142K1558C2859a75565
11246C69864A13695f9492K8531B15290b38522Q4314j59086J5977L5301h5927o9912
11235a55839f0251k47151a24876J2688j18805Q4267A17052f927F2654d73223a47063
11223a98205N5433A77034p0895a87208I0643b18002a06176k5628A95025D9099
11212e858j72384F1378d066l95388A44752F8796a25711a1457o5686m05L7009j2184
11200e2723m8749a1181k01666J06313o0259q6899c3002k25352A76500a76309G9654
11188D4571b05148A87151J01305k8772b43199B56426a73144E2531J01087j0713
$$ plain form
11178 142905 120651 247687 -131121 -32993 302914 -64228 60601 -176841 75540 87499 50634
11167 50634 -119654 142729 -47201 300733 -81188 -36258 -87433 102495 164166 66425 238233
11156 238233 418090 75233 -128000 -276124 -67786 -237004 -36431 -137548 310597 -65759
11145 -209740 -41399 13762 -52500 66967 -171031 -31059 -307519 105636 164852 5919 -4757
11133 181814 19502 -81961 -87808 38786 416356 28324 -126841 -80459 -377121 242641 34625
11121 -120856 170793 -133778 400079 159849 249798 -86416 -188134 21658 121914 159619
11111 159619 57323 -198464 481731 79958 79945 49218 38955 -301245 211035 -17107 26275
11099 -52755 179112 195070 376426 266062 136935 20777 -40514 344194 6687 -206119 179815
$$ packed form
11178A42905k2254J27036a31121c2993C02914f4228F0601a76841G5540J1959l6865
11167E0634a19654A42729d7201C00733h1188c6258n1175A02495O1671F6425J71808
11156B38233J79857G5233a28000j48124f7786j69218c6431j01117C10597f5759
11145b09740d1399A3762e2500F6967a71031c1059k76460A05636N9216E919d757
11133A81814A9502h1961n847C8786L77570B8324a26841M6382k96662B42641C4625
11121a20856A70793a33778D00079A59849Q9949h6416j01718B1658J00256L7705
11111A59619E7323a98464D81731G9958j3l0727j0263c01245B11035a7107B6275
11099e2755A79112J5958J81356j10364j29127B0777d0514C44194F687b06119A79815
$$ plain form
11087 110870 80302 185342 344995 374563 430729 22267 440475 450469 14621 190553 378111
11076 378111 47222 363476 401665 135403 215057 440084 303324 75580 229191 367000
11066 367000 400917 185755 364642 268163 687310 349679 509529 553810 592928 507048
11056 507048 337916 509552 163301 241232 400300 625078 413901 578330 495095 653168
11046 653168 789917 733637 500645 619783 214354 575385 853730 816467 745279 649166
11036 649166 694245 491481 431559 761633 429231 441031 704167 513091 637660 870042
11026 870042 753643 618346 506836 713458 368152 1144797 630917 484454 665594 268029
11015 616666 371707 412444 319333 449083 478455 1015878 504498 649653 385332 536485
$$ packed form
11087A10870l0568J05040J59653K9568N6166B2267M18208R994A4621J75932J87558
11076C78111D7222L16254L8189A35403P9654K25027j36760G5580J53611J37809
11066C67000L3917A85755J78887r6479M19147l37631J59850M4281L9118q5880
11056E07048j69132J71636A63301P7931J59068K24778k11177J64429q3235J58073
11046F53168J36749n6280k32992J19138B14354L61031K78345l7263p1188r6113
11036F49166M5079k02764n9922L30074l32402J1800K63136j91076J24569K32382
11026H70042j16399j35297j11510K06622l45306P76645n13880j46463J81140B68029
11015F16666k44959M0737r3111J29750K9372N37423E04498J45155k64321J51153
$$ plain form
11005 536485 377200 376558 321433 619567 1018471 543695 432752 656960 511880 299551
10995 299551 751378 777478 416871 684236 746217 727062 494232 803533 387591 745318
10985 745318 943005 966864 809143 767306 995763 1069581 1203539 1279436 1380758 1822173
10975 1822173 1507154 2038441 1940242 2437758 2525959 2510077 2326320 2693892 2025601 2080839
10965 2080839 1708018 1653888 1597169 1528362 867814 1193370 1201568 1235691 1126978 1205637 1195171
10954 1195171 1005945 1028588 663378 593453 539177 590737 343923 654562 440837 107289
10943 147351 578757 242664 271516 -106066 161370 501681 -50455 238237 -162436 79285
10932 70448 158140 -230067 -170982 1125 123531 -181367 -81007 -190987 150099 2375 83328
$$ packed form
11005E36485j59285o42n5125K98134L98904m74776j10943K24208j45080k12329
10995B99551M51827K6100l60607K67365O1981j9155k32830L09301C87591L57727
10985G45318J97687K3859j57721m1837K28457P3818J33958P5897J01322M41415
10975A822173l15019N31287r8199M97516Q8201j5882j83757L67572o68291N5238
10965B080839l72821n4130n6719o8807o60548L25556Q198L4123j08713P8659j0466
10954A195171j89226K2643l65210o9925n4276N1560k46814L10639k13725A07289
10943A47351M31406B42664K8852a06066A61370L40311e0455B38237a62436G9285
10932G0448Q7692b30067N9085A125J22406a81367h1007j09980A50099B375Q0953
$$ plain form
10921 83328 284930 -7671 -203092 69718 -198258 3613 -156845 87368 -10029 -39318 -198580
10910 -198580 -57310 151990 144056 64793 -5533 448083 -57245 -237032 161740 264216 -44869
10898 -77405 -14197 -105666 -189782 217523 -213435 73348 -41845 275568 318555 -35613 109133
10886 -285009 -45295 -120980 48008 -207078 72741 48801 -149809 -136104 -311558 -16785 -196188
10875 -196188 -2556 15231 54000 -165477 173763 -192089 -205703 323808 90952 129566 -68681
10863 -222475 -245682 -345867 -133443 28832 245979 149628 65166 74102 -141403 -254699 152930
10851 222196 277515 -58112 -2023 -288063 -457913 58751 128220 86027 -2751 28619 94768
10840 94768 103331 -190968 -358296 -138043 -105744 -184447 -50039 57406 -353836 105726 -170526
$$ packed form
10921H3328K01602g671j95421F9718a98258C613a56845H7368a0029k9289j59262
10910a98580e7310A51990p934F4793e533D48083e7245j79787A61740J02476d4869
10898g7405a4197r1469q4116B17523b13435G3348d1845B75568M2987c5613A09133
10886b85009d5295p5685D8008b07078G2741k3940a49809J3705j75454a6785j79403
10875a96188b556A5231L8769a65477A73763a92089j3614C23808I0952L8614f8681
10863b22475k3207j00185a33443B8832K17147r6351F5166Q936a41403j13296A52930
10851B22196N5319e8112b023k86040j69850E8751O9469m2193b751B8619O6149
10840I4768Q563a90968j67328a38043L2299p8703e0039E7406c53836A05726a70526
$$ plain form
10828 189170 -82907 114583 66924 -221864 -344740 93286 -224795 -205406 -366856 96735
10817 133062 -17165 182378 -89091 -144581 45237 329646 33400 -175001 -224754 196318 87542
10805 -27192 31794 -101582 148575 -25592 227882 23483 -50171 242765 110266 -117784
10794 61064 40560 8782 -221916 283778 -133691 24389 10034 -5032 66481 -133290 -68432
10783 -68432 -255361 238425 140193 -265047 -209492 -193644 69498 -232300 -133751 -62410 124859
10771 -12933 -112603 230419 189539 -40148 -153624 -90274 -271454 -112077 -166516 -345017 -179357
10760 -179357 -168898 -120445 -23717 11242 -70805 387890 169928 211271 -37250 -384277 48104
10748 -23581 253343 211860 193922 -100751 79866 121555 -89328 119263 -237526 -335354 11413
$$ packed form
10828A89170h2907A14583m7659b21864j22876I3286b24795J9389j61450I6735
10817A33062a7165A82378h9091n5490D5237K84409C3400a75001m9753A96318H7542
10805b7192C1794a01582A48575b5592B27882B3483e0171B42765A10266a17784
10794F1064k0504H782b21916B83778a33691B4389A0034e032F6481a33290O4858
10783f8432j86929B38425r8232b65047N5555J5848F9498b32300R8549f2410A24859
10771a2933r9670B30419m0880d0148j13476O3350j81180a12077n4439j78501J65660
10760a79357J0459M8453b3717A1242g0805C87890A69928M1343c7250l47027D8104
10748b3581B53343m1483j7938a00751G9866M1689h9328A19263b37526r7828A1413
$$ plain form
10736 -205220 103725 -218722 -77971 31880 -281903 -84789 -39230 -225801 183588 51110
10725 -341973 -68191 -58850 -151967 78405 -29768 -135097 -191652 -20853 -473717 278608 104819
10713 -183377 9247 -21504 -80834 -83864 -74060 -108485 -242982 128458 -174050 152699 -100870
10701 -124089 73687 -56149 -247580 -295309 110852 246234 -274863 -166889 -109166 -86027
10691 -86027 27568 -323308 -82283 127038 -67992 -59250 -201900 -191430 -221811 -83907 -74292
10680 -74292 -2863 58443 -38895 -71836 -63684 8395 -171279 -101800 269283 291667 -1477 -246029
10668 -246029 -58066 -10698 44870 -227294 188670 71395 -151763 -253330 -207641 -464425
10658 -464425 40968 112418 -298419 -292047 43361 -166740 216194 197831 -514478 -325096 -210145
$$ packed form
10736b05220A03725b18722g7971C1880b81903h4789c9230j86571A83588E1110
10725c41973f8191R341r3117G8405b9768j05329n6555b0853m52864B78608A04819
10713a83377I247b1504n9330l030R804l4425j34497A28458a74050A52699a00870
10701a24089G3687e6149j91431m7729A10852J35382b74863J07974N7723K3139
10691h6027B7568c23308h2283A27038f7992Q742j42650J0470l0381h3907R615
10680g4292b863E8443c8895l2941Q152H395a71279O9479B69283K2384a477k44552
10668b46029e8066a0698D4870b27294A88670G1395a51763j01567M5689k56784
10658d64425D0968P1450b98419O372D3361a66740B16194j8363e14478J89382J14951
$$ plain form
10647 -210145 -47918 -41560 -15097 -104195 -155602 -256658 -145689 -70196 -207690 -6733 140120
10635 128590 -371977 -423387 -355951 -170131 51004 -47397 37356 77488 -28996 -69915 67158
10623 161998 -10207 53067 -129480 48799 125746 -62821 -130984 76221 -427048 294213 -23630
10611 71228 -11473 72130 -445547 -349642 -81701 120395 -119139 340642 124822 115530 -64090
10599 -504553 92821 -347832 39345 208457 -206076 -211205 20469 114693 -161013 -108450 178544
10587 -112053 -7755 113255 -365957 242892 -252726 -202670 -291836 -140791 -67785 -196202
10577 -196202 -102243 -145917 -172627 -135987 54877 56069 -229286 -168797 -26322 -302879 8595
10565 -11879 21997 -86446 -22854 19757 -260110 -177763 51470 243493 67778 27861 -143134
$$ packed form
10647b10145d7918O358a5097q9098n1407j01056J10969g0196j37494f733A40120
10635A28590c71977n1410O7436a70131E1004d7397C7356M0132b8996m0919F7158
10623A61998a0207E3067a29480D8799P6947f2821o8163G6221d27048B94213b3630
10611G1228a1473G2130d45547R5905h1701A20395a19139C40642A24822r292f4090
10599e04553I2821c47832C9345J69112b06076n129B0469R4224a61013N2563A78544
10587a12053g755A13255c65957B42892b52726N0056q9166a40791f7785j28417
10577a96202R3959m3674k6710L6640E4877J192b29286O0489b6322k76557H595
10565a1879B1997h6446b2854A9757b60110Q2347E1470J92023F7778B7861a43134
$$ plain form
10553 28923 12160 -55299 -13949 9173 -74040 -17684 -2242 73282 93409 -146291 -245778 -130656
10541 -130656 94839 -130656 25893 19807 -42634 118524 131679 -331494 -159498 -278769 26051
10529 342867 25739 -254369 -345312 195437 -115813 -362754 -182538 -94237 -20644 212938
10518 283834 -265753 85245 -75817 -30470 68443 98835 246538 64679 -193286 -189489 -100516
10507 -100516 -393031 -149850 259162 -79499 229635 136217 -89441 -216403 16173 54780
10497 54780 14435 296009 -146680 251414 160035 -112344 -86925 105300 211623 -256717
10486 -44389 198243 -143632 11509 68979 -231393 409683 87945 56721 155997 187684 -245170
10474 211292 22594 317257 -84253 -54061 134826 -142791 -204944 -103509 39511 20018 -148469
$$ packed form
10553B8923A2160e5299a3949I173g4040a7684b242G3282K0127a46291r9487J15122
10541a30656I4839a30656B5893o086d2634A18524J3155c31494a59498j19271B6051
10529C42867B5739b54369r0943A95437a15813k46941J80216Q8301b0644B12938
10518B83834b65753H5245g5817c0470F8443L0392J47703F4679a93286L797Q8973
10507a00516k92515a49850B59162g9499B29635r3418h9441j26962A6173L8607
10497E4780A4435K81574a46680B51414r1379a12344K5419A05300J06323b56717
10486d4389A98243a43632A1509N7470b31393D09683H7945l1224R9276L1687b45170
10474B11292B2594K94663h4253L0192A34826a42791o2153J01435C9511j9493a48469
$$ plain form
10462 -44171 -137770 13894 142215 75791 -167043 -168671 -417014 304434 22852 -109064 230951
10450 -306599 -27742 -52482 45582 -5017 301374 -349510 -94304 -49551 83230 -216013 -120873
10439 -120873 -407911 50726 88774 32052 67452 -173297 -209503 -58495 215082 195041 20759
10427 -148564 164612 17443 -203923 73029 -21752 38007 -150781 615 207804 -112234 151996
10415 -127002 -96275 -45992 -53778 7660 -217232 -58865 52608 49769 275984 2145 173161 33117
10402 -269150 393002 211882 -464713 -21667 -256103 -19676 4574 -92706 -172902 -181714 202939
10390 -21533 73701 -157970 -15703 -81463 140697 272841 -84129 32298 -190632 126628 79261
10379 79261 -150923 466738 -1488 84236 626530 362235 396744 260134 156400 -50634 85367
$$ packed form
10462d4171r3599A3894J28321o6424a67043j628k48343C04434B2852a09064B30951
10450c06599b7742k4740D5582e017C01374c49510i4304M4753H3230b16013R5140
10439a20873k87038E0726L8048C2052L5400a73297l6206e8495B15082k0041B0759
10427a48564A64612A7443b03923G3029b1752C8007a50781F15K07189a12234A51996
10415a27002L0727d5992p786G660b17232e8865E2608k839K26215B145J71016C3117
10402b69150C93002j81120d64713b1667k34436a9676D574i2706q0196q812B02939
10390b1533G3701a57970a5703o5760A40697J32144h4129C2298a90632A26628m7367
10379G9261a50923D66738a488H4236N42294k64295L4509j36610j03734e0634H5367
$$ plain form
10367 94147 339281 791204 170077 300450 292876 251507 92710 76204 287917 43806 355945
10356 355945 -45391 170592 222713 320784 95432 605830 568335 162306 645560 290107
10345 192309 217988 490776 195416 391876 -32949 170127 -28221 88143 206450 31958
10334 284351 72219 34709 -355662 39353 167617 311124 334253 50014 -200109 -62336 490060
10322 143098 428028 -339423 -49732 435335 232753 373212 497020 269296 280397 -206244
10311 175910 102722 -360304 -48744 173057 329366 5675 -213464 -122557 336065 127435
10300 156880 -229801 -257409 337654 -258637 -250469 -134138 -200628 50055 144661 -287070 -233192
10289 -233192 -411784 -361815 -326546 -323500 -165656 12274 65726 159018 -196996 -101081 60226
$$ packed form
10367I4147K45134M51923A70077J30373p574m1369I2710j6506K11713D3806L12139
10356C55945d5391A70592N2121R8071I5432N10398l7495A62306M83254B90107
10345A92309K5679K72788A95416J96460c2949A70127b8221H8143J18307C1958
10334B84351G2219C4709c55662C9353J28264J43507K3129E0014b00109f2336D90060
10322A43098K84930c39423d9732D35335k02582J40459J23808k27724J1101b06244
10311A75910p3188c60304d8744A73057J56309E675b13464R0907C36065A27435
10300A56880b29801k7608C37654b58637Q168J16331o6490E0055R4606b87070N3878
10289b33192j78592M9969L5269L046J57844A2274N3452R3292a96996R5915F0226
$$ plain form
10277 -44596 41614 131822 -16725 -211163 -100094 275802 -271620 122591 -38686 -142861
10267 -142861 9556 -136049 416168 -125851 -215347 -175674 -197429 -163792 150035 97356 417391
10256 417391 328840 211054 282882 -6942 -236309 338353 151646 297213 255112 -22924 -251
10244 89491 40280 -12681 -187684 231896 -341671 135203 262399 6784 139340 -370156
10233 -21113 -54581 -35473 -169022 -173121 -127595 -158345 50879 -263679 -90879 46226 -53715
10221 35305 272666 27860 -180137 -23060 27996 -14473 -39742 -811 9839 92052 40150 11204
10208 -66204 1667 -123206 -92389 108384 176470 157766 86486 -275789 141397 107386 91239
10197 91239 -254214 168398 34614 -67861 -222092 -33740 -176734 -230749 -28101 47663 -61021
$$ packed form
10277d4596D1614R0208a6725j94438a00094B75802b71620A22591c8686j04175
10267a42861I556a36049D16168a25851q9496L9673k1755L3637A50035n2679L20035
10256D17391q8551j17786P1828f942k29367C38353A51646J45567m2101b2924b51
10244H9491D0280a2681j75003B31896c41671A35203J27196F784J32556c70156
10233b1113l3468J9108j33549m099M5526l0750E0879b63679i0879D6226e3715
10221C5305K37361B7860a80137b3060B7996a4473k5269h11I839Q2213D0150A1204
10208f6204A667a23206L0817A08384O8086j8704p1280b75789A41397l4011j6147
10197I1239b54214A68398C4614f7861j54231c3740j42994n4015b8101D7663f1021
$$ plain form
10185 -81859 495551 -84918 -184896 22073 -221611 9456 44861 17121 -198527 -287907 -167293
10174 -167293 -88879 -241251 10879 -131084 -54388 383988 -320223 -52792 -65836 56540 -361232
10162 -120922 -172871 -86779 5607 -203789 -32229 85202 -229077 -301 293679 -246111 -153462
10151 -153462 -420196 -67644 -16909 142192 -92732 -211136 -118837 -367527 26406 -70405 -158690
10140 -158690 -5859 -31412 -212736 -347494 453210 -392371 -185629 97311 6219 -122165 -138473
10129 -138473 -243148 -27508 -216095 -145453 -10421 140994 -178322 -49913 -152142 -47341
10118 39975 -156330 25746 -280648 496975 -221554 -234437 -115737 96300 -4773 -129350 115856
10106 -16645 78416 -167000 76094 -4624 -139043 69413 -410197 -133331 -234620 273827 -277202
$$ packed form
10185h1859D95551h4918r9978B2073b21611I456L5405A7121a98527q9380J20614
10174a67293P8414j52372A0879a31084e4388C83988c20223e2792j3044E6540c61232
10162a20922n1949Q6092E607b03789c2229H5202b29077c01B93679b46111R2649
10151a53462k66734f7644a6909A42192i2732j18404R2299k48690B6406g0405q8285
10140a58690e859k5553j81324j34758D53210c92371a85629I7311F219a22165j6308
10129a38473j04675b7508j88587P0642a0421A40994a78322d9913j02229d7341
10118C9975a56330B5746b80648D96975b21554j2883a15737I6300d773j24577A15856
10106a6645G8416a67000G6094d624j34419F9413d10197a33331j01289B73827b77202
$$ plain form
10094 -209612 244403 -9200 -177716 -184106 -138173 12248 -315260 17457 32702 -432863 -197380
10082 -96448 144601 -9687 256899 66308 -276013 -102285 156184 -6100 -180448 -157750 -240642
10071 -240642 -284761 -94247 38288 -437512 -119873 -197323 -133670 14244 -58564 210797 92380
10059 -31681 -112136 80387 -92540 79555 33110 -273897 90502 -406769 -145715 127204 -13621
10047 235510 -74837 -409362 191679 52487 30713 78765 -422596 -174776 14169 317611
10037 317611 82462 59469 16896 -438111 -109511 163262 -83041 -504 -196528 -204925 -123930
10026 -123930 148949 206873 1300 153286 -206946 -133953 -115410 -344170 -259874 -293552 -250325
10015 -250325 36897 135121 101951 -196197 -78768 -113714 60230 -112087 -337317 -332214 154377
$$ packed form
10094b09612B44403i200j68516o390M5933A2248c15260A7457J5245d32863a97380
10082i6448A44601i687B56899F6308b76013a02285A56184f100j74348K2698q2892
10071b40642m4119i4247C8288d37512a19873p7450O3653A4244e8564B10797I2380
10059c1681q0455H0387i2540G9555C3110b73897I0502d06769a45715A27204a3621
10047B35510g4837l34525A91679E2487k1774M8052d22596a74776A4169L03442
10037C17611H2462k2993A6896d38111a09511A63262h3041e04j96024q397Q0995
10026a23930A48949N7924A300J51986b06946P2993J8543k28760Q4296l3678M3227
10015b50325C6897R8224l3170a96197g8768l4946F0230a12087k25230N103A54377
$$ plain form
10003 -94565 -188661 69527 66234 -183658 -484856 -66118 114435 -148497 49365 -60101 -380682
9992 -380682 -90612 -13548 191068 271642 -51227 11375 178452 -30622 20784 -111117 53157
9980 -61167 -570935 -141568 -91555 150502 205436 -12386 -1971 -173817 -126347 -2537 79090
9968 -180981 4741 -200718 -88191 110831 -57505 125115 -72784 -260543 89367 -145286 -124978
9957 -124978 -20918 145580 86138 -93515 178834 319167 -861 -394214 -288425 -55926 113079
9945 -15431 19810 256684 88806 275719 -168682 202358 17638 -51743 -211271 147373 -125753
9933 -63519 1211 -14082 198156 13582 287456 -298723 198458 -103573 -65860 -223589 -122848
9922 -122848 57292 -268191 64271 -76114 -192264 37044 -79577 -126620 37523 -392908 -88473
$$ packed form
10003i4565r4096F9527l293a83658l01198f6118A14435a48497D9365f0101l20581
9992c80682i0612a3548A91068Q0574e1227A1375J67077c0622B0784a11117E3157
9980f1167n09768a41568N0013A50502N4934a2386a971j71846M7470b537G9090
9968a80981D741b00718h8191A10831e7505A25115g2784j87759H9367a45286K0308
9957a24978b0918A45580n9442i3515A78834J40333h61l93353J05789e5926A13079
9945a5431A9810K36874H8806J86913a68682B02358A7638e1743j59528A47373a25753
9933f3519A211a4082A98156A3582K73874b98723A98458a03573L7713j57729J00741
9922a22848E7292b68191F4271g6114j16150C7044g9577m7043C7523c92908h8473
$$ plain form
9910 -248957 -125597 -96944 -92179 -317956 -167104 -142160 -149562 -204597 -69121 31512 5792 -85742
9897 140151 13530 -251760 -42597 -49918 -17729 232616 191732 146064 -227102 97310 286687
9886 286687 -372553 -60448 -227250 -2531 -40863 32662 184734 39533 -45048 -20964 166959
9874 -123412 92442 -141139 -91724 -526634 -165522 -1426 -3467 -221474 139636 44730 -313327
9862 -223103 8618 -83439 -94447 -84299 -133210 -71648 40457 -228845 44321 -93759 140715
9850 -41989 -70906 19001 -52509 -444388 -9416 -94114 -190546 -112872 104578 85497 72968 -118902
9837 -192779 -93102 -258139 -53238 -254096 221758 -202612 -209998 -113432 -397727 119262 -550002
9825 119529 -161189 -136275 -255618 -195618 -326977 -137156 -125399 -13421 -39481 -248571 155510
$$ packed form
9910b48957J23360K8653M765k25777J50852K4944p402n5035f9121C1512E792h5742
9897A40151A3530b51760d2597p321a7729B32616m0884m5668b27102I7310J89377
9886B86687c72553f0448j66802b531l8332C2662J52072C9533d5048b0964A66959
9874a23412I2442a41139M9415m34910a65522a426k041k18007A39636D4730c13327
9862b23103H618h3439j1008J0148m8911O1562D0457b28845D4321i3759A40715
9850d1989k8917A9001e2509l91879i416q4698r6432P7674A04578j9081j2529a18902
9837a92779i3102j65037e3238k00858B21758b02612p386R6566k84295A19262e50002
9825A19529a61189K4914j19343O0000j31359a37156J1757a3421k6060k09090A55510
$$ plain form
9813 25873 -123875 -163675 -67705 -289023 -152019 -133578 126639 -53459 -95850 -93158 62781
9801 57306 -148635 -151087 -189977 -156329 39238 -147215 65831 -152412 4680 15131 -156577
9789 63676 -17080 179710 73413 -129011 -188128 -197745 96127 -39612 -109786 -34819 -114642 56139
9776 36788 -183112 -361 -172985 44502 269329 -256018 43920 -323890 206442 -153171 -17347
9764 -234797 1245 -242973 -102455 74902 35216 -20084 75855 -99878 -197583 399154 -29554
9752 -317823 -2828 322861 -22356 -206034 -188030 -227319 -147388 -294496 -17258 51951 -253709
9740 -192984 42186 -216467 18696 20079 -106482 85723 48794 321458 -172774 142646 -151796
9728 -160824 85068 50373 -28200 -55222 -92540 1129 193496 -374042 -133557 -96300 281035
$$ packed form
9813B5873a23875l9800f7705k21318J37004J8441A26639e3459m2391K692F2781
9801E7306a48635k452l8890L3648C9238a47215F5831a52412D680J0451a56577
9789F3676a7080A79710G3413a29011n9117r617I6127c9612p0174c4819p9823E6139
9776C6788a83112c61j72624D4502K24827b56018D3920c23890B06442a53171a7347
9764b34797A245b42973a02455G4902C5216b0084G5855i9878r7705C99154b9554
9752c17823b828C22861b2356j83678J8004l9289P9931j47108a7258E1951b53709
9740a92984D2186b16467A8696J383a06482H5723l6929K72664a72774A42646a51796
9728a60824H5068l4695b8200k7022l7318A129J92367c74042a33557L7257B81035
$$ plain form
9716 -236194 -85221 -218632 -62615 -5755 -71042 16754 -227264 111516 -261471 265273 292621
9705 292621 -34901 171809 153572 -125399 126312 -61397 -107677 -28918 -81713 14360 -23709
9693 -84036 -173644 135097 104486 -145697 43546 -9111 -27671 -34495 -121027 -104819 -85691 95005
9680 -309370 56175 87774 108888 -4955 -189231 -134219 -194271 -5133 -24141 -22657 -220843 -17853
9667 -32178 -79677 -215487 -139161 -44515 -210844 -62560 112812 -185199 179292 -91457 -189502
9656 -189502 -77975 -109022 -105165 20895 -14757 -728166 54407 26731 -290452 -98404 91184
9644 -111555 -23084 -152008 -85493 13938 -34068 16693 -231081 -53883 -244962 -360426 43188
9632 3373 -283138 -46510 -285349 -259461 47783 -178674 -135099 244344 -61713 -304090 -54870
$$ packed form
9716b36194h5221j33411f2615e755o5287A6754b27264A11516b61471B65273K7348
9705B92621c4901A71809j8237a25399A26312f1397m6280b8918n2795A4360b3709
9693h4036q9608A35097l0611a45697D3546i111j8560o824q6532J6208J9128I5005
9680c09370E6175L1599K1114d955j84276N5012o0052e133j9008J484j98186a7853
9667c2178m7499j35810P6326d4515j66329f2560A12812a85199A79292i1457r8045
9656a89502g7975l1047L857B0895a4757p13409E4407B6731b90452i8404I1184
9644a11555b3084j28924O6515A3938c4068A6693b31081e3883j91079j15464D3188
9632C373b83138d6510k38839K5888D7783a78674M3575B44344f1713k42377e4870
$$ plain form
9620 -193144 -77975 -298025 -67175 93082 -503324 -162713 37388 -177123 -321443 -271450 -378323
9609 -378323 136798 -104774 -375989 94800 -281790 -277224 -160475 -191980 -170385 161939 -270456
9597 23872 -258214 -122595 -6437 38950 279880 207796 130829 230499 -406758 4401 -102542
9585 31006 161386 120959 22093 85708 -141761 -406180 -531945 -192213 54178 76340 -109008
9573 226666 164528 169110 -1172 -95536 -96312 16223 102725 -141006 247521 -171132 176959 -50849
9560 -196742 -89250 -126763 -145342 -211261 -414701 -96713 -83908 -59898 10492 -78003 122977
9548 -313724 158320 -72145 -40115 44782 116391 -272317 -265688 256646 54379 183939 -261289
9536 -87223 71659 284571 -295355 -139484 -278725 197090 -87953 40772 120519 -90690 -147473
$$ packed form
9620a93144g7975k20050f7175I3082e03324a62713C7388a77123j44320M9993j06873
9609c78323A36798a04774k71215I4800b81790M566J16749l1505K1595A61939b70456
9597B3872b58214a22595f437C8950K40930p2084p6967R9670d06758D401a02542
9585C1006J30380m0427B2093O3615a41761k64419j25765a92213E4178K2162a09008
9573B26666o2138M582a172r4364p76A6223Q6502a41006B47521a71132A76959e0849
9560a96742h9250l7513j8579o5919k03440i6713J2805K4010A0492g8003A22977
9548c13724A58320g2145L2030D4782P1609b72317O629B56646E4379J29560b61289
9536h7223G1659K12912b95355a39484j39241A97090h7953D0772P9747i0690n6783
$$ plain form
9525 -147473 -390302 -92601 -260142 471330 -4671 85581 282021 -111350 410006 143255
9514 -118634 43344 117264 -358211 -190511 -171958 140505 -376251 -299082 -122152 -86148 -70245
9503 -70245 -84791 -155147 -215040 71055 -53721 131953 143126 194989 -126394 -258570 -224942
9492 -224942 -10871 -459360 193538 -234488 66677 123002 2958 80273 164845 -22747 -304076
9481 -304076 8689 -77299 -57008 -226071 -324126 -240488 -201767 -90495 -194600 -37267 42553
9469 126348 59305 -297007 63670 -71876 114757 -136203 125349 125568 -149313 201690 102852
9458 102852 -357765 11951 -177427 22612 46939 -340612 -366826 -202891 83366 -93161 -231765
9447 -231765 -101682 30956 -54162 -12050 -32603 -45376 5236 60233 20301 -313342 137582
$$ packed form
9525a47473k42829i2601j67541D71330d671H5581J96440a11350D10006A43255
9514a18634D3344P3920c58211J67700J8553A40505c76251P7169a22152L6004J5903
9503g0245j4546p0356n9893G1055e3721A31953J1173N1863a26394j32176L3628
9492b24942a0871m48489A93538b34488F6677N6325B958P7315Q4572b2747k81329
9481c04076H689g7299K0291j69063r8055Q3638L8721i0495j04105c7267D2553
9469A26348E9305b97007F3670g1876A14757a36203A25349K19a49313B01690r8838
9458A02852c57765A1951a77427B2612K4327c40612k6214J63935H3366i3161j38604
9447b31765a01682C0956e4162a2050k0553j2773E236N4997B0301c13342A37582
$$ plain form
9435 -225198 154860 267656 -243617 18510 -7556 350220 37759 -196575 -208109 -216679 -45970
9423 -70713 -123506 37157 -51496 307878 -119116 83629 -7525 -105929 150856 -359316 -184257
9412 -184257 103221 -50806 -100467 4679 -72155 -104827 -11193 52014 24969 51660 127976 -231050
9399 -272332 -195277 -58756 -72569 274904 -19056 -311550 -162304 68766 -85663 -3576 -165679
9388 -165679 -7174 -336316 -133016 -8248 -27514 328592 -44132 240490 -16748 -106187 36201
9376 -143 -69673 55555 15035 280852 -63572 -48659 134042 -113523 -347655 -32590 27277
9364 -198157 47532 191684 79824 80719 -177210 -187987 -138458 -347746 -138385 -68994 222190
9352 -149211 -53965 -34406 2545 -137627 -94846 -103825 263276 38286 -65152 131046 -300234
$$ packed form
9435b25198A54860J12796b43617A8510g556C50220C7759a96575j1534q570d5970
9423g0713n2793C7157e1496C07878a19116H3629g525r8404A50856c59316J75059
9412a84257A03221e0806m9661D679g2155l2672a1193E2014B4969K6691P6316b31050
9399b72332P7055e8756j3813B74904a9056k92494J49246F8766h5663c576j62103
9388a65679g174l29142a33016h248j9266C28592d4132B40490a6748q9439C6201
9376a43o9530E5555A5035K65817f3572J4913A34042a13523k34132c2590B7277
9364a98157D7532J44152G9824Q95a77210j0777M9529k09288a38385f8994B22190
9352a49211e3965J9559B545a37627M2781q979B63276C8286f5152A31046c00234
$$ plain form
9340 -246933 -385339 108332 -1818 -159877 48891 -123659 49843 -109564 -360496 85364 82072
9329 82072 -95219 139972 -258612 -219217 -268393 -3480 45546 190501 -130163 -108920 -136529
9318 -136529 201854 -95084 2511 -236555 40499 67449 90845 147474 259072 -374295 18727
9306 -338706 213149 208107 39245 -108259 17118 -218365 -275760 -196752 -125860 -137347 -74774
9295 -74774 -267897 124618 12897 -360242 76976 -30228 35393 36304 -42279 -81775 -181983
9284 -181983 232526 73944 114984 -175108 -58171 -203010 120747 -151442 19743 81141 -34425
9272 155114 -296846 -378857 -35340 -375120 -103085 -43452 242145 36154 -116572 -394786
9262 -394786 -255771 107362 20532 -193074 72265 -96847 56926 219726 295930 -63862 -43094
$$ packed form
9340b46933j38406A08332a818j58059D8891a23659D9843a09564k50932H5364l292
9329H2072i5219A39972b58612L9395m9176c480D5546J44955a30163K1243k7609
9318a36529B01854i5084B511b36555D0499K6950K3396N6629J11598c74295A8727
9306c38706B13149n042C9245a08259A7118b18365n7395P9008P0892j1487O2573
9295g4774j93123A24618A2897c60242G6976c0228C5393R11d2279l9496j00208
9284a81983B32526G3944M1040a75108e8171j44839A20747a51442A9743O1398c4425
9272A55114b96846q2011c5340l39780a03085d3452B42145C6154a16572k78214
9262c94786J39015A07362B0532a93074G2265i6847E6926J62800P6204f3862K0768
$$ plain form
9251 -43094 -166804 13423 166220 50222 -49788 186589 -104084 -140940 -27939 -79367 167462
9239 -209030 -177694 -299810 -205862 -123371 200577 -154719 -100597 -200756 -126967 -7582 -12998
9228 -12998 76597 -41327 83383 3187 -307403 -107620 52453 -247751 -361797 -154882 -86358
9217 -86358 85693 -499921 -71616 -133877 -232845 98260 -218588 187679 -67536 -159981 145882
9205 -361084 -68512 -263726 -356675 137732 77961 -85166 -2431 -70606 -55134 328696 -295381
9193 -197789 56192 90882 -202047 -114094 -284642 81451 -34379 -94859 -27683 227051 -23072
9181 229147 -174299 167923 -183594 -339137 -224550 27943 21651 -525613 32578 -145 -112585
9170 -112585 -290844 -74753 -66623 75651 -141299 -332790 -367206 -360623 -247160 44712 176312
$$ packed form
9251d3094j23710A3423J52797E0222d9788A86589a04084l6856b7939n1428A67462
9239b09030L1336j22116R3948Q2491B00577a54719N4122j00159P3789g582n416
9228a2998G6597d1327H3383C187c07403a07620E2453b47751j14046a54882O8524
9217h6358H5693d99921g1616o2261r8968I8260b18588A87679f7536r2445A45882
9205c61084f8512j95214r2949A37732n9771h5166b431o8175J5472C28696b95381
9193a97789E6192L4690b02047Q7953j70548H1451c4379o0480b7683B27051b3072
9181B29147a74299A67923a83594j55543J14587B7943o292e25613C2578a45j12440
9170a12585j78259g4753Q130G5651a41299j91491l4416O583J13463D4712J31600
$$ plain form
9159 176312 16707 -170701 -159265 36234 -16454 -77051 214622 -85679 10179 -504229 -247470
9147 -125030 319408 222440 -87731 167690 -118189 -124144 -14996 -129440 -135372 -26559 168799
9135 62051 -99022 -247201 -56217 -390894 -276639 -70004 255197 -292599 -347932 362633 -365753
9123 45105 -11734 -18839 352663 -35388 117828 -106031 -73523 -303890 -10075 54943 32269
9112 32269 -285389 -151858 187310 101501 6835 -320009 53984 2316 -154006 -523039 65069
9100 -26921 31561 136080 33085 430521 -126449 -187502 216183 -64906 -65547 -230388 135020
9088 -9152 129568 -203327 -17365 28741 -31453 -399982 -45717 -40931 -207654 166360 65316
9076 -280529 14677 28186 -176818 -173593 -350464 -207713 -283083 -243379 -264429 11734 2526
$$ packed form
9159A76312A6707a70701J1436C6234a6454o0597B14622h5679A0179e04229b47470
9147a25030C19408r6968h7731A67690a18189n955a4996j14444n932b6559A68799
9135F2051i9022j48179e6217l34677J14255g0004B55197b92599n5333C62633c65753
9123D5105a1734p105C52663c5388A17828a06031L2508k30367a0075E4943k2674
9112C2269b85389J33531A87310q5809F835c20009E3984B316a54006l69033F5069
9100b6921C1561J04519C3085L97436a26449o1053B16183f4906o41j64841A35020
9088i152A29568b03327a7365B8741c1453l68529d5717M786j66723A66360F5316
9076b80529A4677J3509a76818L225j76871J42751p5370L9704k1050A1734B526
$$ plain form
9064 -105286 -204622 131549 270281 -41800 121769 220490 95373 -3326 -128045 89766 -190947
9052 -149068 -156096 44751 -143838 98735 210223 227690 -90809 -101875 25961 -898 -220005 -159263
9040 -159263 -55113 -190642 -100183 13791 144382 -254020 -81813 -114993 -219434 139034 -175173
9028 -312730 41249 -102978 188698 -39435 -156175 -258707 -81847 -130743 -312163 65788 162113
9017 162113 -44640 -194431 2479 81252 -293699 -125552 -345390 -19417 255773 -57862 28678
9005 229309 -222648 -88085 180421 -458110 192664 -39387 80083 -120399 -41634 123315
8994 -146306 67379 16435 -146634 -214167 183720 -131658 154434 -128721 231253 69812
8983 -302740 -219090 19790 -7469 -388404 254379 130686 -9968 -158055 134554 -57655 -92711
$$ packed form
9064a05286r9336A31549J38732d1800A21769R8721I5373c326j24719H9766a90947
9052a49068p028D4751a43838I8735J11488J7467i0809j1066B5961h98k19107O0742
9040a59263e5113j35529R0459A3791J30591b54020h1813l3180j04441A39034a75173
9028c12730D1249a02978A88698c9435j16740j02532h1847m8896j81420F5788R6325
9017A62113d4640j49791B479P8773b93699a25552k19838a9417B55773e7862B8678
9005B29309b22648h8085A80421d58110A92664c9387H0083a20399d1634A23315
8994a46306F7379A6435a46634o7533A83720a31658A54434a28721B31253F9812
8983c02740Q3650A9790g469l80935B54379j23693i968j48087A34554e7655l5056
$$ plain form
8972 -92711 -31152 -184909 -8293 321466 -184340 -213155 -220565 -252820 -124705 -193361 -273966
8961 -273966 -2873 1507 -167317 -239765 -51271 -120172 148951 -41566 -171135 -156447 17125
8949 36154 -4126 -185202 -116822 -231226 -76693 12124 -4316 -191344 48791 29709 -200510
8937 -163971 13423 142102 -84958 650977 241300 79372 11852 -34429 -188398 -24520 166842
8925 330298 742165 1157871 2175456 5755446 24299533 9524325 3600283 1395102 988532
8916 988532 682508 456094 510283 43536 169811 147325 -67740 416759 481216 433101 -9926
8904 52420 -44200 -161749 -195322 54194 -137628 -79593 -165725 133372 -160448 154938 -19970
8892 266434 5109 59363 -188795 -168585 197252 28173 -212067 273324 -286822 218912 -217140
$$ packed form
8972i2711c1152j53757h293C21466a84340k8815p410l2255a24705o8656q0605
8961b73966b873A507a67317p2448e1271o8901A48951d1566j29569J4688A7125
8949C6154d126j81076O8380j14404g6693A2124d316j87028D8791j9082b00510
8937a63971A3423J28679h4958F50977B41300G9372A1852c4429j53969b4520A66842
8925C30298M11867M15706J017585L579990J8544087I524325C600283A395102m06570
8916I88532l06024k26414N4189D3536J26275k2486f7740D16759O4457m8115i926
8904E2420d4200j17549l3573E4194a37628N8035q6132A33372a60448A54938a9970
8892B66434E109N4254a88795K0210A97252B8173b12067B73324b86822B18912b17140
$$ plain form
8880 -198435 176896 -125322 -118521 -9322 212484 -193301 47190 -58434 -110440 -308229 -12715
8868 159413 -68362 -231288 -137757 200131 -8768 -110760 -13606 -306392 183886 -210771 -256918
8857 -256918 -24437 -195703 36798 111733 284320 1225 -102206 177039 -121262 -219656 12244
8845 -138604 114683 29151 -167853 -101300 88141 30030 -258131 37586 -130825 -75695 -144161
$$ packed form
8880a98435A76896a25322O801i322B12484a93301D7190e8434n2006j97789a2715
8868A59413f8362j62926R3531B00131h768j01992a3606k92786A83886b10771m6147
8857b56918b4437j71266C6798P4935J72587A225a02206A77039a21262r8394A2244
8845a38604A14683B9151a67853O6553H8141C0030b58131C7586a30825N5130o8466
$$ [...]
##END NTUPLES=NMR SPECTRUM
##END=
