
##TITLE=UV1240_M8_1260-1248_70_7241129_3b9rnCdKow
##JCAMPDX= 6.0         $$ Bruker NMR JCAMP-DX V2.0
##DATA TYPE= NMR SPECTRUM
##DATA CLASS= NTUPLES
##ORIGIN= BRUKER
##OWNER= Administrator
$$ 1.72 TOPSPIN		Version 2.1
$$ 2013-01-18 23:37:28.485 -0500  Administrator@X
$$ Compression mode = diff/dup
##.OBSERVE FREQUENCY= 400.02188249412
##.OBSERVE NUCLEUS= ^1H
##.ACQUISITION MODE= SIMULTANEOUS (DQD)
##.ACQUISITION SCHEME= undefined
##.AVERAGES= 64
##.DIGITISER RES= 22
##SPECTROMETER/DATA SYSTEM= spect
##.PULSE SEQUENCE= noesygpps1d.comp
##.SOLVENT NAME= COFFEE_meoh
##.SHIFT REFERENCE= INTERNAL, COFFEE_meoh, 1, 14.96122
##AUDIT TRAIL= $$ (NUMBER, WHEN, WHO, WHERE, PROCESS, VERSION, WHAT)
$$ ##TITLE= Audit trail, TOPSPIN		Version 2.1
$$ ##JCAMPDX= 5.01
$$ ##ORIGIN= Bruker BioSpin GmbH
$$ ##OWNER= Administrator
$$ $$ E:\/data/COFFEE/nmr/UV1240_M8_1260-1248_70_7241129_3b9rnCdKow/22/pdata/1/auditp.txt
$$ ##AUDIT TRAIL=  $$ (NUMBER, WHEN, WHO, WHERE, PROCESS, VERSION, WHAT)
(   1,<2013-01-18 23:37:22.594 -0500>,<Administrator>,<X>,<go>,<TOPSPIN 2.1>,
      <created by zg
	started at 2013-01-18 23:25:52.657 -0500,
	POWCHK enabled, PULCHK disabled,
       configuration hash MD5:
       86 BA 57 50 F2 9D 5C 9B 26 00 A9 28 5F 66 2E 89
       data hash MD5: 64K
       B7 7E 15 6C 72 61 61 06 50 75 97 A2 DD 80 75 FA>)
(   2,<2013-01-18 23:37:25.672 -0500>,<Administrator>,<X>,<proc1d>,<TOPSPIN 2.1>,
      <Start of raw data processing
       efp LB = 0.3 FT_mod = 6 PKNL = 1 PHC0 = 0 PHC1 = 0 SI = 128K 
       data hash MD5: 128K
       41 D6 CC DF 45 EE 3D FA 0E 42 B5 F9 7D E1 81 C3>)
(   3,<2013-01-18 23:37:26.719 -0500>,<Administrator>,<X>,<proc1d>,<TOPSPIN 2.1>,
      <pk PHC0 = -84.8584 PHC1 = 0 
       data hash MD5: 128K
       F9 A3 DD DB 1A 11 15 8A 59 25 BE 4B E4 FF 32 AA>)
(   4,<2013-01-18 23:37:27.438 -0500>,<Administrator>,<X>,<proc1d>,<TOPSPIN 2.1>,
      <abs ABSG = 1 
       data hash MD5: 128K
       99 FB DE F3 87 5A 4A 6C 2F A5 17 BE 8A 5D A6 3F>)
(   5,<2013-01-18 23:37:27.610 -0500>,<Administrator>,<X>,<proc1d>,<TOPSPIN 2.1>,
      <abs ABSG = 2 
       data hash MD5: 128K
       06 C3 BA CB 97 49 29 A2 BB 58 A7 85 86 F3 56 89>)
(   6,<2013-01-18 23:37:27.782 -0500>,<Administrator>,<X>,<proc1d>,<TOPSPIN 2.1>,
      <abs ABSG = 3 
       data hash MD5: 128K
       27 A0 B3 E0 02 B7 37 12 86 45 2F 2A 99 F8 69 05>)
(   7,<2013-01-18 23:37:27.953 -0500>,<Administrator>,<X>,<proc1d>,<TOPSPIN 2.1>,
      <abs ABSG = 4 
       data hash MD5: 128K
       BA 28 AF E4 85 43 AC C2 42 06 A5 9C 2E 1F 43 32>)
(   8,<2013-01-18 23:37:28.125 -0500>,<Administrator>,<X>,<proc1d>,<TOPSPIN 2.1>,
      <abs ABSG = 5 
       data hash MD5: 128K
       3C 7C B8 A9 57 D7 06 CA 7E E1 B0 28 BD 17 15 49>)
$$ ##END=
$$ 
$$ $$ hash MD5
$$ $$ E9 22 D0 B1 FD AC CD CF 5F 56 33 7D EC 51 95 22
##$RELAX= 
##$RELAX= 
##$RELAX= 
##$RELAX= 
##$RELAX= 
##$RELAX= 
##$RELAX= 
##$RELAX= 
$$ Bruker specific parameters
$$ --------------------------
##$DU= <E:\>
##$EXPNO= 22
$$ [...]
150 150 150 150 150 150 150 150
##$TP07= 0
##$TPNAME0= <>
##$TPNAME1= <>
##$TPNAME2= <>
##$TPNAME3= <>
##$TPNAME4= <>
##$TPNAME5= <>
##$TPNAME6= <>
##$TPNAME7= <>
##$TPOAL= (0..7)
0.5 0.5 0.5 0.5 0.5 0.5 0.5 0.5
##$TPOFFS= (0..7)
0 0 0 0 0 0 0 0
##$TUNHIN= 0
##$TUNHOUT= 0
##$TUNXOUT= 0
##$USERA1= <user>
##$USERA2= <user>
##$USERA3= <user>
##$USERA4= <user>
##$USERA5= <user>
##$V9= 5
##$VALIST= <valist>
##$VCLIST= <CCCCCCCCCCCCCCC>
##$VD= 0
##$VDLIST= <DDDDDDDDDDDDDDD>
##$VPLIST= <PPPPPPPPPPPPPPP>
##$VTLIST= <TTTTTTTTTTTTTTT>
##$WBST= 1024
##$WBSW= 4
##$XGAIN= (0..3)
0 0 0 0
##$XL= 0
##$YL= 0
##$YMAX_a= 6179835
##$YMIN_a= -12021384
##$ZGOPTNS= <>
##$ZL1= 120
##$ZL2= 120
##$ZL3= 120
##$ZL4= 120
##$ABSF1= 14.96122
##$ABSF2= -5.596962
##$ABSG= 5
##$ABSL= 3
##$ALPHA= 0
##$AQORDER= 0
##$ASSFAC= 0
##$ASSFACI= 0
##$ASSFACX= 0
##$ASSWID= 0
##$AUNMP= <proc_prof1d_extract.lims>
##$AXLEFT= 0
##$AXNAME= <>
##$AXNUC= <1H>
##$AXRIGHT= 0
##$AXTYPE= 0
##$AXUNIT= <>
##$AZFE= 0.1
##$AZFW= 0.1
##$BCFW= 0
##$BC_mod= 0
##$BYTORDP= 0
##$COROFFS= 0
##$CY= 15
##$DATMOD= 1
##$DC= 0
##$DFILT= <>
##$DTYPP= 0
##$F1P= 0
##$F2P= 0
##$FCOR= 0.5
##$FTSIZE= 131072
##$FT_mod= 6
##$GAMMA= 0
##$GB= 0
##$INTBC= 1
##$INTSCL= 1
##$ISEN= 128
##$LB= 0.3
##$LEV0= 0
##$LPBIN= 0
##$MAXI= 10000
##$MC2= 0
##$MEAN= 0
##$ME_mod= 0
##$MI= 0
##$NCOEF= 0
##$NC_proc= -2
##$NLEV= 6
##$NOISF1= 0
##$NOISF2= 0
##$NSP= 0
##$NTH_PI= 0
##$NZP= 0
##$OFFSET= 14.96122
##$PC= 1
##$PHC0= -84.8584
##$PHC1= 0
##$PH_mod= 1
##$PKNL= yes
##$PPARMOD= 0
##$PPDIAG= 0
##$PPIPTYP= 0
##$PPMPNUM= 2147483647
##$PPRESOL= 1
##$PSCAL= 4
##$PSIGN= 0
##$PYNMP= <proc.py>
##$REVERSE= no
##$SF= 400.020009550954
##$SI= 131072
##$SIGF1= 0
##$SIGF2= 0
##$SINO= 400
##$SIOLD= 131072
##$SPECTYP= <>
##$SREGLST= <1H.CDCl3>
##$SSB= 0
##$STSI= 131072
##$STSR= 0
##$SW_p= 8223.68421052631
##$SYMM= 0
##$S_DEV= 0
##$TDeff= 65536
##$TDoff= 0
##$TI= <>
##$TILT= no
##$TM1= 0
##$TM2= 0
##$TOPLEV= 0
##$USERP1= <user>
##$USERP2= <user>
##$USERP3= <user>
##$USERP4= <user>
##$USERP5= <user>
##$WDW= 1
##$XDIM= 131072
##$YMAX_p= 439826139
##$YMIN_p= -11137
##$CURPLOT= <Network HP LaserJet P1505>
##$CURPRIN= <$Network HP LaserJet P1505>
##$DFORMAT= <normdp>
##$LAYOUT= <+/1D_H.xwp>
##$LFORMAT= <normlp>
##$PFORMAT= <normpl>
##$SURQMSG= 1
$$ End of Bruker specific parameters
$$ ---------------------------------
##NTUPLES= NMR SPECTRUM
##VAR_NAME=  FREQUENCY,     SPECTRUM/REAL,   SPECTRUM/IMAG
##SYMBOL=    X,             R,               I
##VAR_TYPE=  INDEPENDENT,   DEPENDENT,       DEPENDENT
##VAR_FORM=  AFFN,          ASDF,            ASDF
##VAR_DIM=   131072,        131072,          131072
##UNITS=     HZ,            ARBITRARY UNITS, ARBITRARY UNITS
##FACTOR=    0.0627417313425164, 1,          1
##FIRST=     8223.62146879497, -829,         -57096
##LAST=      0,             673,             -57321
##MIN=       0,             -11137,          0
##MAX=       8223.62146879497, 439826139,    0
$$ Real data points
##PAGE= N=1
##DATA TABLE= (X++(R..R)), XYDATA
$$ [...]
$$ plain form
63877 554993 549134 543887 539745 537212 536607 538365 542694 548933 556110 564309 574701 587983 603608 620951
63863 620951 640429 662928 688771 717664 749061 782044 815452 848736 882204 915814 948228
63852 948228 977845 1004483 1029326 1053377 1076513 1097895 1116587 1131795 1143049 1150349 1153848 1153421
63840 1153421 1148730 1139553 1125812 1107473 1084789 1058451 1029177 997346 963350 928062 892467 856956
63828 856956 821416 785916 750896 716787 683942 652931 624342 598126 573553 550092 528042
63817 528042 508064 490290 474171 459109 445005 432127 420634 410362 401047 392528 384596 376842
63805 376842 368999 361387 354649 348945 343748 338618 333804 329731 326156 322356 318012 313491 309172 304980
63791 304980 300814 297033 294054 291557 288556 284480 279918 276060 273542 272089 271096 270126 268829 266890 264391
$$ packed form
63877E54993n859n247m142k533o05J758M329O239P177Q199J0392J3282J5625J7343
63863F20951J9478K2499K5843K8893L1397L2983L3408L3284L3468L3610L2414
63852I48228K9617K6638K4843K4051K3136K1382J8692J5208J1254P300L499m27
63840A153421m691r177j3741j8339k2684k6338k9274l1831l3996l5288l5595l5511
63828H56956l5540l5500l5020l4109l2845l1011k8589k6216k4573k3461k2050
63817E28042j9978j7774j6119j5062j4104j2878j1493j0272r315q519p932p754
63805C76842p843p612o738n704n197n130m814m073l575l800m344m521m319m192
63791C04980m166l781k979k497l001m076m562l858k518j453r93r70j297j939k499
$$ plain form
63776 264391 261925 260055 258845 258087 257690 257513 257145 256341 255488 255214 255583 255994 255777 254616 252655 250604 249421
63759 249421 249348 249446 248651 247086 245662 244597 243229 241319 239651 239049 239560 240889 242879 245174 247060 248225
63743 248225 249228 250758 252760 254657 256166 257574 259478 262399 266240 269967 272295 272969 272969 273294 274131 275432
63727 275432 277561 280768 284596 288447 292408 296913 301933 307092 312361 318024 324066 330053 335558 340271
63713 340271 343786 345735 346204 345762 345000 344086 342672 340245 336818 333271 330589 328748 326904 324794 323277
63698 323277 323091 323740 324228 324382 324793 325811 327280 329066 331167 333416 335580 337656 339626 341123 341869 342240
63682 342240 342821 343476 343447 342430 340997 339856 339153 338714 338627 339289 340971 343507 346432 349495 352974 357321
63666 357321 362475 367784 372617 376731 379985 382090 382842 382172 379828 375534 369742 363636 357958 352392 346575
$$ packed form
63776B64391k466j870j210p58l97j77l68q04q53k74L69M11k17j161j961k051j183
63759B49421p3R8p95j565j424j065j368j910j668o02N11J329J990K295J886J165
63743B48225J003J530K002J897J509J408J904K921L841L727K328O74%L25Q37J301
63727B75432K129L207L828L851L961M505N020N159N269N663O042N987N505M713
63713C40271L515J949M69m42p62r14j414k427l427l547k682j841j844k110j517
63698C23277j86O49M88J54M11J018J469J786K101K249K164K076J970J497P46L71
63682C42240N81O55k9j017j433j141p03m39q7O62J682K536K925L063L479M347
63666C57321N154N309M833M114L254K105P52o70k344m294n792o106n678n566n817
$$ plain form
63651 346575 341123 336887 333668 330550 327281 324467 322521 321190 320115 319132 318021 316739 316009 316887 319492
63636 319492 322757 325716 328449 331476 334873 338460 342433 347156 352513 357962 363271 368846 375215 382486
63622 382486 390439 399025 408528 419243 431194 444362 459036 475605 493964 513466 533682 554989
63610 554989 578189 603680 631235 660429 690970 722470 753971 783769 809860 830752 845911
63599 845911 855423 859531 858833 854667 848634 841605 833641 824868 815804 806620 796713 785324 772084 756744
63585 756744 739084 719506 699151 678989 659270 640281 622875 607635 594151 581922 571456
63574 571456 563624 558281 554485 551878 550980 552137 554947 558721 562865 566866 570638 574933 580717 587988
63560 587988 595744 603149 610213 617353 624986 633679 644095 656425 670306 685617 703126 724147 749680
$$ packed form
63651C46575n452m236l219l118l269k814j946j331j075r83j111j282p30Q78K605
63636C19492L265K959K733L027L397L587L973M723N357N449N309N575O369P271
63622C82486P953Q586R503J0715J1951J3168J4674J6569J8359J9502K0216K1307
63610E54989K3200K5491K7555K9194L0541L1500L1501K9798K6091K0892J5159
63599H45911R512M108o98m166o033p029p964q773r064r184r907j1389j3240j5340
63585G56744j7660j9578k0355k0162j9719j8989j7406j5240j3484j2229j0466
63574E71456p832n343l796k607q98J157K810L774M144M001L772M295N784P271
63560E87988P756P405P064P140P633Q693J0416J2330J3881J5311J7509K1021K5533
$$ plain form
63547 749680 780027 815141 855143 900014 948001 994192 1031649 1055115 1063828 1060689 1049328 1032640
63535 1032640 1013302 994004 976536 961262 947868 936164 925973 916661 907040 895582 880878 862335
63523 862335 840473 816277 790410 763354 735943 709073 683020 657679 633381 610785 590053
63512 590053 570826 553092 537324 523586 511163 499417 488468 478768 470429 463243 456995 451501
63500 451501 446549 441976 437663 433477 429443 425872 423037 420826 419034 417754 417019 416240 414589 411979 409190
63485 409190 407075 406028 406152 407378 409432 412101 415507 419738 424404 429049 433811 439046 444429 449081
63471 449081 452424 454318 454502 452794 449807 446608 443458 439657 434762 429221 423603 417999 412535 407787
63457 407787 404206 401578 399400 397413 395587 394002 392977 392956 394085 396194 399183 403041 407618 412931 419624
$$ packed form
63547G49680L0347L5114M0002M4871M7987M6191L7457K3466Q713l139j1361j6688
63535A032640j9338j9298j7468j5274j3394j1704j0191r312r621j1458j4704j8543
63523H62335k1862k4196k5867k7056k7411k6870k6053k5341k4298k2596k0732
63512E90053j9227j7734j5768j3738j2423j1746j0949r700q339p186o248n494
63500D51501m952m573m313m186m034l571k835k211j792j280p35p79j651k610k789
63485D09190k115j047J24J226K054K669L406M231M666M645M762N235N383M652
63471D49081L343J894J84j708k987l199l150l801m895n541n618n604n464m748
63457D07787l581k628k178j987j826j585j025k1J129K109K989L858M577N313O693
$$ plain form
63442 419624 428395 438911 450061 461505 474334 490010 509343 532860 561475 596036 636096 679052
63430 679052 720388 755258 780813 797297 806657 810466 809889 807131 805318 806561 811216 819508 832774
63417 832774 852357 878008 908070 940632 973787 1005277 1032757 1054456 1069381 1077214 1078351 1073883
63405 1073883 1065356 1054651 1043692 1033500 1023445 1012153 999178 985039 969583 951439 929504
63394 929504 904094 876181 846405 815480 784761 755610 728611 703876 681552 661547 643386
63383 643386 626926 612740 601241 591946 584066 577388 572197 568837 567732 569203 572780 577310 582235
63370 582235 588206 595976 605381 615939 627763 641192 656086 672165 689621 708774 729600 752117
63358 752117 776804 804133 834159 866851 902018 938345 973285 1004594 1031346 1052908 1067998
$$ packed form
63442D19624Q771J0516J1150J1444J2829J5676J9333K3517K8615L4561M0060M2956
63430F79052M1336L4870K5555J6484R360L809n77k758j813J243M655Q292J3266
63417H32774J9583K5651L0062L2562L3155L1490K7480K1699J4925P833J137m468
63405A073883q527j0705j0959j0192j0055j1292j2975j4139j5456j8144k1935
63394I29504k5410k7913k9776l0925l0719k9151k6999k4735k2324k0005j8161
63383F43386j6460j4186j1499r295p880o678n191l360j105J471L577M530M925
63370E82235N971P770R405J0558J1824J3429J4894J6079J7456J9153K0826K2517
63358G52117K4687K7329L0026L2692L5167L6327L4940L1309K6752K1562J5090
$$ plain form
63347 1067998 1075781 1077186 1074106 1067802 1058979 1048678 1037855 1026430 1013824 1000014 985040 967983
63335 967983 947757 924678 900037 874280 846950 818391 790242 763888 739428 716460 695129
63324 695129 676151 660467 649005 642292 640299 642992 650253 660105 667576 667123 656783 639046 617691
63311 617691 595065 572532 551602 533232 516913 501690 487667 475619 465610 456960 449368 443083
63299 443083 437902 432761 426702 419806 412946 406836 401587 396995 392857 388912 384805 380514 376688 373995
63285 373995 372026 369457 365677 361712 358988 357596 356469 354962 353403 352181 351138 350054 349074 348374 347929
63270 347929 347810 348259 349149 349745 349328 347927 346333 345450 345625 346394 346878 346607 345882 345226 344748 344342 344225 344803
63252 344803 346121 347891 349919 352134 354360 356521 358863 361456 363734 365151 366168 367873 370648 373924
$$ packed form
63347A067998P783J405l080o304q823j0301j0823j1425j2606j3810j4974j7057
63335I67983k0226k3079k4641k5757k7330k8559k8149k6354k4460k2968k1331
63324F95129j8978j5684j1462o713j993K693P261R852P471m53j0340j7737k1355
63311F17691k2626k2533k0930j8370j6319j5223j4023j2048j0009q650p592o285
63299D43083n181n141o059o896o860o110n249m592m138l945m107m291l826k693
63285C73995j969k569l780l965k724j392j127j507j559j222j043j084r80p00m45
63270C47929j19M49Q90N96m17j401j594q83J75P69M84k71p25o56m78m06j17N78
63252C44803J318J770K028K215K226K161K342K593K278J417J017J705K775L276
$$ plain form
63238 373924 377284 381005 385347 390070 395014 400565 407121 414536 422415 430561 438844 447076 455338 464014
63224 464014 473177 482263 490761 498877 507074 515234 522833 529859 537097 545363 554714 564522 574111 583178
63210 583178 591673 599412 605940 610826 613990 615579 615501 613270 608484 601412 592943 583860 574348 564404 554605
63195 554605 545989 539010 533096 527684 523253 520737 520151 520649 521841 524161 527828 532494 538287 546120 556246
63180 556246 567359 577996 588231 599036 610550 621989 632960 643855 655058 666618 678604
63169 678604 690907 702773 713360 722764 731742 740398 747901 753459 756820 757781 756041 751666 744935 735570
63155 735570 722861 706860 688765 669893 650834 631867 613550 596457 580724 566149 552491
63144 552491 539554 527382 516430 507169 499462 492831 487292 483307 480781 478805 476726 474870 473843
$$ packed form
63238C73924L360L721M342M723M944N551O556P415P879Q146Q283Q232Q262Q676
63224D64014R163R086Q498Q116Q197Q160P599P026P238Q266R351R808R589R067
63210E83178Q495P739O528M886L164J589p8k231m786p072q469r083r512r944r799
63195E54605q616o979n914n412m431k516n86M98J192K320L667M666N793P833J0126
63180E56246J1113J0637J0235J0805J1514J1439J0971J0895J1203J1560J1986
63169F78604J2303J1866J0587R404Q978Q656P503N558L361R61j740m375o731r365
63155G35570j2709j6001j8095j8872j9059j8967j8317j7093j5733j4575j3658
63144E52491j2937j2172j0952r261p707o631n539l985k526j976k079j856j027
$$ plain form
63131 473843 473561 473405 473050 472808 473303 475009 477965 481809 486218 491216 496823 502549 507722 512209 516401
63116 516401 520495 524362 528128 532282 537023 541988 546815 551513 556133 560520 564545 568225 571458 574052
63102 574052 576141 578242 580821 584104 588207 592918 597418 600939 603893 607750 613563 621012 629036 636790
63088 636790 643806 649855 655055 659763 664018 667414 669635 670697 670512 668761 665443 661058 656005 650314
63074 650314 644250 638572 633711 629164 624276 619298 615071 611827 608921 605797 602815 600939 600853 602585 605845
63059 605845 610440 616182 622681 629747 638031 648649 661811 676353 691183 706694 724043 743401
63047 743401 763847 784805 806594 829458 852976 876674 900469 924233 947611 970561 993421
63036 993421 1016210 1038465 1059969 1080974 1101455 1120937 1139356 1157297 1174802 1190624 1203249
$$ packed form
63131D73843k82j56l55k42M95J706K956L844M409M998N607N726N173M487M192
63116E16401M094L867L766M154M741M965M827M698M620M387M025L680L233K594
63102E74052K089K101K579L283M103M711M500L521K954L857N813P449Q024P754
63088F36790P016O049N200M708M255L396K221J062j85j751l318m385n053n691
63074F50314o064n678m861m547m888m978m227l244k906l124k982j876q6J732L260
63059F05845M595N742O499P066Q284J0618J3162J4542J4830J5511J7349J9358
63047G43401K0446K0958K1789K2864K3518K3698K3795K3764K3378K2950K2860
63036I93421K2789K2255K1504K1005K0481J9482J8419J7941J7505J5822J2625
$$ plain form
63025 1203249 1212094 1217127 1217786 1213137 1202960 1188094 1169713 1148673 1125523 1100808 1075200 1049293
63013 1049293 1023195 996548 969328 942622 918188 897300 880332 867288 858050 852120 848935 848607
63001 848607 851690 858076 866842 877410 890144 905469 923120 942569 963445 985088 1006411 1026820
62989 1026820 1046799 1067078 1087670 1108146 1128339 1148236 1167519 1185640 1202045 1216054 1226851
62978 1226851 1233791 1236386 1233989 1226179 1213519 1197098 1177128 1152908 1124522 1093515 1061358 1028316
62966 1028316 994615 961647 930833 901926 873596 845382 818118 792712 769430 748140 728444
62955 728444 709715 691740 675126 660450 647223 634317 621133 607734 594183 580480 566941
62944 566941 553951 541552 529848 519444 510743 503137 495701 488427 481978 476490 471528 467075 463537
$$ packed form
63025A203249Q845N033O59m649j0177j4866j8381k1040k3150k4715k5608k5907
63013A049293k6098k6647k7220k6706k4434k0888j6968j3044r238n930l185l28
63001H48607L083O386Q766J0568J2734J5325J7651J9449K0876K1643K1323K0409
62989A026820J9979K0279K0592K0476K0193J9897J9283J8121J6405J4009J0797
62978A226851O940K595k397p810j2660j6421j9970k4220k8386l1007l2157l3042
62966A028316l3701l2968l0814k8907k8330k8214k7264k5406k3282k1290j9696
62955G28444j8729j7975j6614j4676j3227j2906j3184j3399j3551j3703j3539
62944E66941j2990j2399j1704j0404q701p606p436p274o449n488m962m453l538
$$ plain form
62931 463537 460695 457587 453641 449283 445245 441878 439242 437255 435511 433504 431224 429228 428063 427894
62917 427894 428538 429388 429492 428316 426380 424613 423211 421828 420716 420763 422144 423807 424763 425259 426142 427541
62901 427541 428904 430178 432314 436286 441923 448018 453609 458886 464625 470951 477114 482432 486981 491216
62887 491216 495425 499773 504342 508760 512271 514584 516206 517529 518089 517298 515362 512789 509420 504847 499541
62872 499541 494623 490467 486313 481337 475482 469130 462561 455914 449270 442625 436104 430112 424920 420240
62858 420240 415673 411485 408429 406899 406699 407494 408833 409856 409705 408395 406761 405441 404425 403537 402782
62843 402782 402018 400936 399624 398716 398696 399320 399940 400096 399652 398651 397302 395971 395071 394954 395789 397365 399115
62826 399115 400496 401269 401370 400853 400170 400054 400723 401518 401825 401991 402844 404559 406605 408522 410165 411378 412137
$$ packed form
62931D63537k842l108l946m358m038l367k636j987j744k007k280j996j165j69
62917D27894O44Q50J04j176j936j767j402j383j112M7J381J663R56M96Q83J399
62901D27541J363J274K136L972N637O095N591N277N739O326O163N318M549M235
62887D91216M209M348M569M418L511K313J622J323N60p91j936k573l369m573n306
62872D99541m918m156m154m976n855o352o569o647o644o645o521n992n192m680
62858D20240m567m188l056j530k00P95J339J023j51j310j634j320j016q88p55
62843D02782p64j082j312r08k0O24O20J56m44j001j349j331r00j17Q35J576J750
62826C99115J381P73J01n17o83j16O69P95L07J66Q53J715K046J917J643J213P59
$$ plain form
62809 412137 412870 414041 415566 417259 419591 423182 427584 431487 434244 436475 439052 442240 445930 449908
62795 449908 453628 456448 458481 460638 463610 467391 471988 477853 485218 493676 502966 513690 526699 542124
62781 542124 559535 578725 599858 623022 648098 674938 703319 732800 762973 793771 825297
62770 825297 857358 889350 920572 950436 978322 1003276 1024030 1039468 1049139 1053156 1051540 1044005
62758 1044005 1030585 1012168 990015 964976 937537 908355 878103 846908 814550 781397 748656
62747 748656 717577 688764 662310 638087 615682 594452 574022 554664 537072 521752 508611
62736 508611 497068 486680 477695 470669 465391 460622 455272 449469 444064 439486 435661 432661 430650 429372
62722 429372 428432 428000 428510 429764 431113 432505 434612 437817 441832 446445 451849 458100 464958 472515 481301
$$ packed form
62809D12137P33J171J525J693K332L591M402L903K757K231K577L188L690L978
62795D49908L720K820K033K157K972L781M597N865P365Q458R290J0724J3009J5425
62781E42124J7411J9190K1133K3164K5076K6840K8381K9481L0173L0798L1526
62770H25297L2061L1992L1222K9864K7886K4954K0754J5438R671M017j616p535
62758A044005j3420j8417k2153k5039k7439k9182l0252l1195l2358l3153l2741
62747G48656l1079k8813k6454k4223k2405k1230k0430j9358j7592j5320j3141
62736E08611j1543j0388q985p026n278m769n350n803n405m578l825l000k011j278
62722D29372r40m32N10J254J349J392K107L205M015M613N404O251O858P557Q786
$$ plain form
62707 481301 491518 502808 515035 528645 544024 561098 579800 600262 622240 645074 668684
62696 668684 694036 722188 753357 787242 823687 862526 903295 945578 989093 1032871 1074748
62685 1074748 1112325 1144263 1170209 1189805 1202381 1207434 1204826 1194555 1176832 1152471 1122812 1089068
62673 1089068 1051948 1011991 970143 927796 886170 845718 806344 768259 732325 699364 669466
62662 669466 642372 618194 597092 578455 561116 544526 529085 515276 503057 492206 482615 473997
62650 473997 465852 457989 450627 443868 437588 431943 427331 423648 420225 416773 413749 411524 409903 408826
62636 408826 408755 409727 410698 410600 409621 408708 408098 407101 405255 403032 401311 400545 400470 400371 399639 398287 396863 395775
62618 395775 394947 394216 393733 393743 394235 395073 396185 397413 398463 399249 400006 400911 401899 403045 404655 406720 408731
$$ packed form
62707D81301J0217J1290J2227J3610J5379J7074J8702K0462K1978K2834K3610
62696F68684K5352K8152L1169L3885L6445L8839M0769M2283M3515M3778M1877
62685A074748L7577L1938K5946J9596J2576N053k608j0271j7723k4361k9659l3744
62673A089068l7120l9957m1848m2347m1626m0452l9374l8085l5934l2961k9898
62662F69466k7094k4178k1102j8637j7339j6590j5441j3809j2219j0851r591q618
62650D73997q145p863p362o759o280n645m612l683l423l452l024k225j621j077
62636D08826p1R72R71r8r79r13o10r97j846k223j721p66p5r9p32j352j424j088
62618C95775q28p31m83J0M92Q38J112J228J050P86P57R05R88J146J610K065K011
$$ plain form
62601 408731 410465 412603 416080 421081 427128 433961 441840 451033 461392 472496 484063 496256 509689
62588 509689 524933 541824 559363 576409 592330 606983 620331 632159 641889 648608 651568 650812
62576 650812 647044 640922 632839 623330 613020 602009 589869 576533 562668 548885 535113 521115
62564 521115 507214 494069 482109 471520 462416 454657 447813 441632 436283 431907 428283 425102 422137
62551 422137 418936 414951 410394 406388 403790 402285 401085 400047 399565 399771 400457 401538 403021 404733 406490
62536 406490 408260 409812 410618 410578 410467 411073 412258 413426 414541 415968 417645 419257 421178 424360 429191
62521 429191 435115 441611 448974 457846 468387 480204 492899 506514 521558 538651 558010 579266
62509 579266 601840 625436 650096 675919 702857 730568 758275 784879 809344 830917 849051
$$ packed form
62601D08731J734K138L477N001O047O833P879R193J0359J1104J1567J2193J3433
62588E09689J5244J6891J7539J7046J5921J4653J3348J1828R730O719K960p56
62576F50812l768o122q083r509j0310j1011j2140j3336j3865j3783j3772j3998
62564E21115j3901j3145j1960j0589r104p759o844o181n349m376l624l181k965
62551D22137l201l985m557m006k598j505j200j038m82K06O86J081J483J712J757
62536D06490J770J552Q06m0j11O06J185J168J115J427J677J612J921L182M831
62521D29191N924O496P363Q872J0541J1817J2695J3615J5044J7093J9359K1256
62509E79266K2574K3596K4660K5823K6938K7711K7707K6604K4465K1573J8134
$$ plain form
62498 849051 863473 874366 882119 886772 888207 887072 885028 883684 883676 885036 887994 892947 900032 909244
62484 909244 920765 934878 951830 971984 995434 1020836 1045026 1064616 1078058 1085910 1089424 1089287
62472 1089287 1085222 1075962 1059635 1035031 1002873 965715 926473 886980 847574 807707 767177 727004
62460 727004 688942 654030 622054 592634 566185 543330 523974 507629 494199 483636 475167 467705
62448 467705 460929 455243 450760 447077 444040 442004 441217 441475 442512 444208 446255 448071 449226 449757 450017
62433 450017 450400 451040 451477 450837 448727 445803 443064 440771 438495 436033 433661 431505 429221 426441 423203
62418 423203 419843 416687 413843 411151 408482 406147 404607 403565 401883 398958 395748 393764 393302 393378 393175
62403 393175 392799 392665 392900 393500 394497 395765 397144 398854 401406 404999 409319 413972 418782 423672 428549
$$ packed form
62498H49051J4422J0893P753M653J435j135k044j344qJ360K958M953P085R212
62484I09244J1521J4113J6952K0154K3450K5402K4190J9590J3442P852L514j37
62472A089287m065r260j6327k4604l2158l7158l9242l9493l9406l9867m0530m0173
62460G27004l8062l4912l1976k9420k6449k2855j9356j6345j3430j0563q469p462
62448D67705o776n686m483l683l037k036p87K58J037J696K047J816J155N31K60
62433D50017L83O40M37o40k110k924k739k293k276k462k372k156k284k780l238
62418D23203l360l156k844k692k669k335j540j042j682k925l210j984m62P6k03
62403C93175l76j34K35O00R97J268J379J710K552L593M320M653M810M890M877
$$ plain form
62388 428549 433336 437934 442304 446771 452026 458516 466060 474285 483058 492181 501166 509875 518955 528985
62374 528985 539549 549860 559959 570520 581702 593017 604200 615411 626739 638405 651470
62363 651470 667506 687332 710719 737303 767132 800344 837204 878536 925224 976892 1031677
62352 1031677 1087531 1143176 1197665 1249694 1297602 1339481 1373211 1397165 1411343 1417330 1416887 1410964
62340 1410964 1400026 1384495 1364450 1339533 1309626 1275281 1237368 1196883 1155357 1114691 1076035
62329 1076035 1039265 1004006 970633 939720 910889 882951 855134 827751 801648 777345 754696
62318 754696 733114 712096 691577 671784 652849 634713 617409 601175 586244 572773 560987
62307 560987 551109 543033 536210 529944 523794 517868 512882 509676 508368 508165 508304 508909 510512 513017 515747
$$ packed form
62388D28549M787M598M370M467N255O490P544Q225Q773R123Q985Q709R080J0030
62374E28985J0564J0311J0099J0561J1182J1315J1183J1211J1328J1666J3065
62363F51470J6036J9826K3387K6584K9829L3212L6860M1332M6688N1668N4785
62352A031677N5854N5645N4489N2029M7908M1879L3730K3954J4178N987m43n923
62340A410964j0938j5531k0045k4917k9907l4345l7913m0485m1526m0666l8656
62329A076035l6770l5259l3373l0913k8831k7938k7817k7383k6103k4303k2649
62318G54696k1582k1018k0519j9793j8935j8136j7304j6234j4931j3471j1786
62307E60987r878q076o823o266o150n926m986l206j308k03J39O05J603K505K730
$$ plain form
62292 515747 518348 521068 524180 527685 531560 535752 539915 543668 547172 550943 555062 558998 562209 564565
62278 564565 566344 568245 571186 575442 580097 583950 586829 589421 592164 595222 599420 606102 615890 628431
62264 628431 643436 661082 681338 703901 729105 757963 791077 828401 870245 917336 969381
62253 969381 1024629 1081477 1139544 1198442 1256311 1310283 1357722 1396449 1424790 1442465 1450819 1451297
62241 1451297 1444086 1428931 1406465 1377722 1342854 1301549 1254467 1203311 1149678 1094858 1040570
62230 1040570 988794 940608 895950 854648 816977 783101 752744 725689 702012 681533 663502
62219 663502 647102 631931 617789 604439 591859 580495 570865 563000 556388 550442 544868 539631 534709
62206 534709 530040 525745 522280 520146 519431 519829 521091 523252 526372 530353 535125 540809 547588 555590 564918
$$ packed form
62292E15747K601K720L112L505L875M192M163L753L504L771M119L936L211K356
62278E64565J779J901K941M256M655L853K879K592K743L058M198O682R788J2541
62264F28431J5005J7646K0256K2563K5204K8858L3114L7324M1844M7091N2045
62253I69381N5248N6848N8067N8898N7869N3972M7439L8727K8341J7675Q354M78
62241A451297p211j5155k2466k8743l4868m1305m7082n1156n3633n4820n4288
62230A040570n1776m8186m4658m1302l7671l3876l0357k7055k3677k0479j8031
62219F63502j6400j5171j4142j3350j2580j1364r630p865o612n946n574n237m922
62206E34709m669m295l465k134p15L98J262K161L120L981M772N684O779Q002R328
$$ plain form
62191 564918 575553 587136 599164 611501 624494 638571 654001 671002 689619 709388 729501
62180 729501 749440 769111 788270 806386 823223 839089 854214 868344 881338 893833 906957
62169 906957 921585 938042 956270 976123 997874 1022555 1051361 1084440 1120562 1158074 1195566
62158 1195566 1231384 1263177 1288607 1306388 1316404 1319219 1315836 1307516 1295224 1279221 1259300 1235219
62146 1235219 1206862 1174477 1138995 1101735 1063668 1025416 988046 953092 921379 892529 866057
62135 866057 842295 821656 803683 787592 773264 760972 750511 741340 733297 726406 720288 714502
62123 714502 709251 705099 702137 700127 699261 700017 702367 705852 710456 716758 725171 735686 748357 763255
62109 763255 779598 795409 808406 817137 821371 821898 820147 817662 815605 814569 814567 814936 814475 812126 807590
$$ packed form
62191E64918J0635J1583J2028J2337J2993J4077J5430J7001J8617J9769K0113
62180G29501J9939J9671J9159J8116J6837J5866J5125J4130J2994J2495J3124
62169I06957J4628J6457J8228J9853K1751K4681K8806L3079L6122L7512L7492
62158A195566L5818L1793K5430J7781J0016K815l383q320j2292j6003j9921k4081
62146A235219k8357l2385l5482l7260l8067l8252l7370l4954l1713k8850k6472
62135H66057k3762k0639j7973j6091j4328j2292j0461r171q043o891o118n786
62123G14502n251m152k962k010q66P56K350L485M604O302Q413J0515J2671J4898
62109G63255J6343J5811J2997Q731M234N27j751k485k057j036kL69m61k349m536
$$ plain form
62094 807590 801197 793439 784937 776581 769265 763571 759886 758558 759566 762375 766576 772405 780214 789757
62080 789757 800640 813182 828108 845408 864214 883850 904419 926262 949398 973632 998758
62069 998758 1024465 1050409 1076506 1102879 1129574 1156695 1184720 1214143 1244697 1275360 1305206
62058 1305206 1333743 1360207 1382945 1399917 1409860 1412960 1410526 1403920 1393609 1379288 1360910 1339143
62046 1339143 1314474 1286358 1254001 1217827 1179496 1140518 1101556 1063058 1025661 989597 954387
62035 954387 919682 886104 854898 827019 802747 781774 763312 746452 730824 716761 704613
62024 704613 694169 685038 677190 670674 665006 659361 653383 647353 641519 635660 629478 623062 616656 610215
62010 610215 603608 597213 591919 588344 586374 585686 586374 588603 591841 595113 598222 602155 607851 614876 621690
$$ packed form
62094H07590o393p758q502q356p316n694l685j328J008K809M201N829P809R543
62080G89757J0883J2542J4926J7300J8806J9636K0569K1843K3136K4234K5126
62069I98758K5707K5944K6097K6373K6695K7121K8025K9423L0554L0663K9846
62058A305206K8537K6464K2738J6972R943L100k434o606j0311j4321j8378k1767
62046A339143k4669k8116l2357l6174l8331l8978l8962l8498l7397l6064l5210
62035I54387l4705l3578l1206k7879k4272k0973j8462j6860j5628j4063j2148
62024G04613j0444r131p848o516n668n645n978o030n834n859o182o416o406o441
62010F10215o607o395n294l575j970o88O88K229L238L272L109L933N696P025O814
$$ plain form
61995 621690 626981 630334 631845 631708 630280 628109 625563 622505 618358 612434 604323 594238 583071 571911
61981 571911 561369 551416 541824 532646 524236 516895 510584 505023 500023 495586 491491 487059 481803 476349
61967 476349 472160 469963 468835 467228 464641 461891 459915 458838 458219 457755 457561 458045 459672 462686 466893
61952 466893 471641 476090 479699 482768 486534 492379 500766 511155 523047 536679 552437 570036 588874
61939 588874 609026 631336 656466 684213 713748 744102 774334 803661 831816 859186 886340
61928 886340 913335 939428 963456 984491 1002165 1016392 1026864 1032960 1034178 1030635 1023190 1013145
61916 1013145 1001751 989880 978273 968130 961054 957986 958459 961469 966973 975924 988871 1005222 1023968
61903 1023968 1044313 1065195 1084842 1101344 1113350 1119994 1120673 1115357 1104693 1089503 1070602 1049320
$$ packed form
61995F21690N291L353J511j37j428k171k546l058m147n924q111j0085j1167j1160
61981E71911j0542r953r592r178q410p341o311n561n000m437m095m432n256n454
61967D76349m189k197j128j607k587k750j976j077o19m64j94M84J627L014M207
61952D66893M748M449L609L069L766N845Q387J0389J1892J3632J5758J7599J8838
61939E88874K0152K2310K5130K7747K9535L0354L0232K9327K8155K7370K7154
61928H86340K6995K6093K4028K1035J7674J4227J0472O096J218l543p445j0045
61916A013145j1394j1871j1607j0143p076l068M73L010N504Q951J2947J6351J8746
61903A023968K0345K0882J9647J6502J2006O644O79n316j0664j5190j8901k1282
$$ plain form
61891 1049320 1027444 1005969 984401 961894 938708 915898 894016 872947 852868 834594 818784
61880 818784 805205 792819 780391 767220 753602 740472 728473 717635 708016 699978 693534 688099
61868 688099 683468 680433 679717 680818 682706 685275 689263 695017 702259 710859 721001 732653 745752 760967
61854 760967 779433 801599 826982 855197 886603 921736 960603 1002705 1047287 1093378 1139900
61843 1139900 1185810 1229935 1270811 1306993 1337411 1361094 1376858 1383877 1382540 1374330 1361001 1344180
61831 1344180 1325456 1306293 1288017 1272303 1261294 1256541 1258019 1264744 1276090 1291738 1310559 1330418
61819 1330418 1349060 1364557 1374973 1378421 1373685 1360410 1338873 1310059 1275604 1236847 1194188 1148181
61807 1148181 1100949 1055350 1012698 972397 933860 897658 864502 834300 806798 782213 760559
$$ packed form
61891A049320k1876k1475k1568k2507k3186k2810k1882k1069k0079j8274j5810
61880H18784j3579j2386j2428j3171j3618j3130j1999j0838r619q038o444n435
61868F88099m631l035p16J101J888K569L988N754P242Q600J0142J1652J3099J5215
61854G60967J8466K2166K5383K8215L1406L5133L8867M2102M4582M6091M6522
61843A139900M5910M4125M0876L6182L0418K3683J5764P019j337q210j3329j6821
61831A344180j8724j9163j8276j5714j1009m753J478O725J1346J5648J8821J9859
61819A330418J8642J5497J0416L448m736j3275k1537k8814l4455l8757m2659m6007
61807A148181m7232m5599m2652m0301l8537l6202l3156l0202k7502k4585k1654
$$ plain form
61796 760559 741139 723406 707719 694563 683476 673459 664169 656107 649754 644996 641364 638531 636498
61783 636498 635352 634809 634138 632775 630894 629083 627665 626732 626559 627327 628510 629217 629208 628993 628911 628753 628382 628099
61765 628099 628216 628839 630085 631937 633813 635053 636031 638091 642068 647427 653088 658461 663397 667733 671274
61750 671274 673803 674864 674003 671418 667944 664236 660452 656782 653548 650524 646868 642161 637052 632523
61736 632523 628968 626281 624293 622706 621049 619193 617652 617068 617595 618951 620751 622679 624639 626925 629857
61721 629857 633159 636033 637917 638838 639091 639092 639503 640838 642839 644752 646266 647560 648385 647903 645662 642134
61705 642134 638028 633629 628935 623843 618101 611735 605613 600777 597050 593122 588257 583136 578770 575489
61691 575489 573316 572243 571561 569818 566331 562159 558922 557150 556300 555769 555211 554387 553404 552801 552887 553352 553890
$$ packed form
61796G60559j9420j7733j5687j3156j1087j0017r290q062o353m758l632k833k033
61783F36498j146n43o71j363j881j811j418r33j73P68J183P07rk15q2j58l71k83
61765F28099J17O23J246J852J876J240R78K060L977N359N661N373M936M336L541
61750F71274K529J061q61k585l474l708l784l670l234l024l656m707n109m529
61736F32523l555k687j988j587j657j856j541n84N27J356J800J928J960K286K932
61721F29857L302K874J884R21K53JM11J335K001J913J514J294Q25m82k241l528
61705F42134m106m399m694n092n742o366o122m836l727l928m865n121m366l281
61691E75489k173j073o82j743l487m172l237j772q50n31n58q24r83o03Q6M65N38
$$ plain form
61674 553890 554643 555558 555943 555303 554120 553185 552588 552001 551523 551483 551679 551501 550678 549435 547984 546323 544491
61657 544491 542719 541403 540978 541517 542445 543141 543873 545541 548321 551312 553798 556070 558619 561307 563974
61642 563974 567141 571413 576629 582138 587372 591614 593854 593612 591520 588528 585017 581206 577692 574768
61628 574768 571732 567791 563284 559224 555936 552989 550163 547558 544870 541546 537794 534790 533582 534115
61614 534115 535306 535773 534632 532027 528868 525815 522632 518694 513753 507905 501211 493847 486398 479535
61600 479535 473492 468103 463146 458436 453854 449461 445244 440679 435097 428724 422764 418121 414548 411343
61586 411343 408198 404990 401450 397640 394196 391567 389491 387686 386392 385699 384947 383443 381288 378940 376532
61571 376532 374164 372254 370955 369760 368258 366690 365263 363658 361854 360658 360581 360971 361046 361054 361521 362126 362335
$$ packed form
61674E53890P53R15L85o40j183r35n97n87m78m0J96j78q23j243j451j661j832
61657E44491j772j316m25N39R28O96P32J668K780K991K486K272K549K688K667
61642E63974L167M272N216N509N234M242K240k42k092k992l511l811l514k924
61628E74768l036l941m507m060l288k947k826k605k688l324l752l004j208N33
61614E34115J191M67j141k605l159l053l183l938m941n848o694p364p449o863
61600D79535o043n389m957m710m582m393m217m565n582o373n960m643l573l205
61586D11343l145l208l540l810l444k629k076j805j294o93p52j504k155k348k408
61571C76532k368j910j299j195j502j568j427j605j804j196p7L90P5QM67O05K09
$$ plain form
61554 362335 362432 362820 363013 362514 362080 362796 364344 365497 365953 366413 367147 367872 368825 370570 372787 374563 375877
61537 375877 377577 379811 381741 383009 384312 386298 388886 391842 395035 397912 399703 400353 400443 400098 398875
61522 398875 396778 394452 392184 389631 386732 384070 382123 380888 380256 380011 379507 378262 376837 376204 376248 375919
61506 375919 374843 373622 372474 370874 368865 367476 367337 367896 368491 369171 369972 370378 370143 369781 369615 369139 368011
61489 368011 366900 366567 366654 366192 365022 364109 364533 366471 369003 370773 371140 370737 370553 370639 370374 369804 369775 370563
61471 370563 371321 371237 370507 369805 369547 370032 371566 373944 376342 378117 379224 379684 379330 378391 377543 377000 376220
61454 376220 374930 373823 373728 374686 376260 378166 380141 381700 382595 383157 383849 384836 386234 388271 390904 393752
61438 393752 396588 399415 401985 404023 406150 409634 414720 420041 424309 427814 431560 435653 439485 442958
$$ packed form
61554C62335R7L88J93m99m34P16J548J153M56M60P34P25R53J745K217J776J314
61537C75877J700K234J930J268J303J986K588K956L193K877J791O50R0l45j223
61522C98875k097k326k268k553k899k662j947j235o32k45n04j245j425o33M4l29
61506C75919j076j221j148j600k009j389j39N59N95O80Q01M06k35l62j66m76j128
61489C68011j111l33Q7m62j170r13M24J938K532J770L67m03j84Q6k65n70k9P88
61471C70563P58q4p30p02k58M85J534K378K398J775J107M60l54r39q48n43p80
61454C76220j290j107r5R58J574J906J975J559Q95N62O92R87J398K037K633K848
61438C93752K836K827K570K038K127L484N086N321M268L505L746M093L832L473
$$ plain form
61424 442958 446528 450175 453275 455575 457640 460183 463355 466826 470248 473487 476525 479241 481420 483000
61410 483000 484075 484370 483109 479895 475542 471340 467646 463867 459719 455633 451891 448431 445675 444472
61396 444472 444706 444906 443841 441798 439743 438068 436783 436171 436406 437064 437714 438562 439847 441090 441630 441542 441369
61379 441369 441359 441575 442399 444241 447011 450366 454191 458371 462458 466087 469350 472327 474712 476421 478032
61364 478032 479966 481765 482939 484132 486558 490557 495529 500993 506791 512398 517078 520973 525184 530537
61350 530537 536923 544158 552789 563505 576089 589500 602963 616565 630618 644597 657083 666925
61338 666925 674246 679959 684440 687195 687864 686866 684759 681499 676757 670641 663700 656529 649607 643149 636840
61323 636840 630181 623448 617813 613998 611332 608701 605989 603876 602591 601756 601317 601755 603168 604861 606166
$$ packed form
61424D42958L570L647L100K300K065K543L172L471L422L239L038K716K179J580
61410D83000J075K95j261l214m353m202l694l779m148m086l742l460k756j203
61396D44472K34K00j065k043k055j675j285o12K35O58O50Q48J285J243N40q8j73
61379D41369j0K16Q24J842K770L355L825M180M087L629L263K977K385J709J611
61364D78032J934J799J174J193K426L999M972N464N798N607M680L895M211N353
61350E30537O386P235Q631J0716J2584J3411J3463J3602J4053J3979J2486R842
61338F66925P321N713M481K755O69r98k107l260m742o116o941p171o922o458o309
61323F36840o659o733n635l815k666k631k712k113j285q35m39M38J413J693J305
$$ plain form
61308 606166 607311 609230 612728 617954 624517 632043 640701 651118 663620 677672 692141 705868 717810
61295 717810 726883 732109 733012 729870 723682 715806 707260 698255 688721 679252 670977 664372 658916 654273
61281 654273 651094 650016 650489 651407 652569 654701 658211 662746 667911 673682 679980 686561 693529 701417 710422
61266 710422 719970 729285 738098 746509 754477 761913 769222 777381 787260 799020 812449 827721 845296
61253 845296 864680 883721 899709 911192 918272 921410 920674 916227 908658 898395 885425 870062 853523
61240 853523 837217 821792 807248 793630 781190 770204 761044 754030 748787 744114 739031 733754 729200
61227 729200 725824 723436 721911 721522 722612 725246 729123 733567 737839 741676 745367 749045 752269 754501
61213 754501 755668 756018 755998 756585 759064 763763 769366 774138 777515 779965 781749 782698 783117 784020 786346 790489
$$ packed form
61308F06166J145J919L498N226O563P526Q658J0417J2502J4052J4469J3727J1942
61295G17810R073N226R03l142o188p876q546r005r534r469q275o605n456m643
61281F54273l179j078M73R18J162K132L510M535N165N771O298O581O968P888R005
61266G10422R548R315Q813Q411P968P436P309Q159R879J1760J3429J5272J7575
61253H45296J9384J9041J5988J1483P080L138p36m447p569j0263j2970j5363j6539
61240H53523j6306j5425j4544j3618j2440j0986r160p014n243m673n083n277m554
61227G29200l376k388j525l89J090K634L877M444M272L837L691L678L224K232
61213G54501J167L50k0N87K479M699N603M772L377K450J784R49M19R03K326M143
$$ plain form
61197 790489 796661 805196 816306 829853 845452 862741 881714 902963 927179 953990 981568 1007726
61185 1007726 1031102 1051012 1066859 1078547 1087155 1094238 1100407 1105188 1108122 1109268 1108623 1105858 1100829
61172 1100829 1093855 1085333 1075503 1064578 1052648 1039407 1024541 1008400 991737 974713 956710 937282
61160 937282 916824 896112 875669 855812 836907 819322 803298 788994 776419 765371 755790 748193
61148 748193 743331 741234 740981 741648 743220 746299 750961 755977 759177 758715 754254 747027 738645 729925 720929
61133 720929 711892 703771 697906 695250 695718 698135 701152 704590 709699 717759 728739 741758 756436 773058
61119 773058 791624 811709 833382 857332 883543 910489 936410 961183 986299 1012946 1040571
61108 1040571 1067453 1092331 1115117 1136124 1155104 1171361 1184629 1195391 1204281 1211515 1216893 1219891
$$ packed form
61197G90489O172Q535J1110J3547J5599J7289J8973K1249K4216K6811K7578K6158
61185A007726K3376J9910J5847J1688Q608P083O169M781K934J146o45k765n029
61172A100829o974q522r830j0925j1930j3241j4866j6141j6663j7024j8003j9428
61160I37282k0458k0712k0443j9857j8905j7585j6024j4304j2575j1048r581p597
61148G48193m862k097k53O67J572L079M662N016L200m62m461p227q382q720q996
61133G20929r037q121n865k656M68K417L017L438N109Q060J0980J3019J4678J6622
61119G73058J8566K0085K1673K3950K6211K6946K5921K4773K5116K6647K7625
61108A040571K6882K4878K2786K1007J8980J6257J3268J0762Q890P234N378K998
$$ plain form
61096 1219891 1219514 1214517 1204141 1188533 1168327 1144258 1117409 1089200 1060555 1031458 1001913 972895
61084 972895 945570 919838 894630 869753 846546 826393 809220 793880 779532 766191 754249
61073 754249 743983 735414 728372 722663 718229 715094 713128 712038 711628 711875 712720 713992 715624 717787 720708
61058 720708 724493 729150 734614 740762 747612 755516 764928 775910 788155 801617 816877 834575 854667
61045 854667 876498 899541 923656 948616 973829 998987 1024764 1052316 1081955 1112676 1143214
61034 1143214 1173249 1203327 1233893 1264875 1296091 1327641 1359820 1392921 1427223 1463050 1500831
61023 1500831 1541136 1584465 1630817 1679581 1729979 1781462 1833733 1886930 1942228 2001941 2068793
61012 2068793 2145325 2233996 2336964 2455127 2587964 2734973 2897080 3076943 3279510 3513194
$$ packed form
61096A219891l77m997j0376j5608k0206k4069k6849k8209k8645k9097k9545k9018
61084I72895k7325k5732k5208k4877k3207k0153j7173j5340j4348j3341j1942
61073G54249j0266q569p042n709m434l135j966j090m10K47Q45J272J632K163K921
61058G20708L785M657N464O148O850P904R412J0982J2245J3462J5260J7698K0092
61045H54667K1831K3043K4115K4960K5213K5158K5777K7552K9639L0721L0538
61034A143214L0035L0078L0566L0982L1216L1550L2179L3101L4302L5827L7781
61023A500831M0305M3329M6352M8764N0398N1483N2271N3197N5298N9713O6852
61012B068793P6532Q8671J02968J18163J32837J47009J62107J79863K02567K33684
$$ plain form
61002 3513194 3789196 4118525 4510834 4977102 5531745 6191448 6976014 7914838 9051658
60993 9051658 10441345 12146312 14234544 16752128 19645565 22677605 25441102 27520286
60985 27520286 28702521 29072433 28925604 28605554 28400321 28513269 29024455 29815005 30545595
60976 30545595 30779297 30198122 28752393 26638335 24154041 21564145 19047672 16708221
60968 16708221 14596766 12728369 11097574 9691180 8492098 7478054 6623884 5906576
60960 5906576 5306215 4803277 4378465 4015601 3702613 3429924 3189975 2978003 2790911
60951 2790911 2624990 2476262 2342704 2224096 2119664 2027551 1946358 1874985 1810708 1749429
60941 1749429 1688436 1627401 1566460 1505124 1443596 1383417 1325956 1271487 1220255 1173095 1130318
$$ packed form
61002C513194K76002L29329L92309M66268N54643O59703P84566R38824J136820
60993I051658J389687J704967K088232K517584K893437L032040K763497K079184
60985B7520286J182235L69912j46829l20050k05233J12948N11186P90550P30590
60976C0545595K33702n81175j445729k114058k484294k589896k516473k339451
60968A6708221k111455j868397j630795j406394j199082j014044q54170p17308
60960E906576o00361n02938m24812l62864l12988k72689k39949k11972j87092
60951B790911j65921j48728j33558j18608j04432r2113q1193p1373o4277o1279
60941A749429o0993o1035o0941o1336o1528o0179n7461n4469n1232m7160m2777
$$ plain form
60930 1130318 1091155 1054968 1022037 992665 966475 943020 922179 903600 886645 871173 857482
60919 857482 845359 834185 824044 815556 808505 801907 795577 790268 785993 781665 776858 772476 769069
60906 769069 765817 761876 757518 753217 748727 743877 739195 735025 730882 726316 721472 716242 709876 702129
60892 702129 693802 685542 677118 668512 660650 654222 648698 643352 638420 634494 631590 629541 628472 628130
60878 628130 627582 626334 625074 624592 624812 625537 627237 630279 634224 638668 643911 649952 655740 660415 664479
60863 664479 668752 673033 676983 681585 688272 696929 705950 714131 721503 728495 735296 742019 748621 754614
60849 754614 759503 763465 767120 770840 774745 779048 783815 788665 793276 797839 802408 806120 807842 807585
60835 807585 806697 806743 808500 811904 816618 822749 831105 842441 856367 871545 887154 903597 921534
$$ packed form
60930A130318l9163l6187l2931k9372k6190k3455k0841j8579j6955j5472j3691
60919H57482j2123j1174j0141q488p051o598o330n309m275m328m807m382l407
60906G69069l252l941m358m301m490m850m682m170m143m566m844n230o366p747
60892G02129q327q260q424q606p862o428n524n346m932l926k904k049j069l42
60878F28130n48j248j260m82K20P25J700L042L945M444N243O041N788M675M064
60863F64479M273M281L950M602O687Q657R021Q181P372O992O801O723O602N993
60849G54614M889L962L655L720L905M303M767M850M611M563M569L712J722k57
60835H07585q88M6J757L404M714O131Q356J1336J3926J5178J5609J6443J7937
$$ plain form
60822 921534 940969 961652 983614 1006702 1030123 1052968 1074678 1094616 1111843 1125811 1136606
60811 1136606 1144035 1147282 1146077 1141424 1134401 1124984 1112834 1098550 1083135 1066726 1048876 1029786
60799 1029786 1010339 991096 972052 953204 934746 916808 899557 883278 867901 852837 837796
60788 837796 823369 810294 798553 787696 777525 767868 758211 748275 738525 729446 720769 712017 703328
60775 703328 695000 686721 678012 669056 660262 651393 641875 631734 621539 611704 602490 594283 587177 580588
60761 580588 573957 567536 561825 556617 551297 545768 540413 535409 530747 526578 522930 519406 515816 512717
60747 512717 510670 509370 508184 507115 506521 506305 506159 506118 506074 505188 502779 499553 497064 496135 496529 497822 499695
60730 499695 501622 503119 504250 505270 506061 506542 507167 508194 508908 508444 506958 505061 502550 498836 494345
$$ packed form
60822I21534J9435K0683K1962K3088K3421K2845K1710J9938J7227J3968J0795
60811A136606P429L247j205m653p023r417j2150j4284j5415j6409j7850j9090
60799A029786j9447j9243j9044j8848j8458j7938j7251j6279j5377j5064j5041
60788H37796j4427j3075j1741j0857j0171r657r657r936r750r079q677q752q689
60775G03328q328q279q709q956q794q869r518j0141j0195r835r214q207p106o589
60761E80588o631o421n711n208n320n529n355n004m662m169l648l524l590l099
60747E12717k047j300j186j069n94k16j46m1m4q86k409l226k489r29L94J293J873
60730D99695J927J497J131J020P91M81O25J027P14m64j486j897k511l714m491
$$ plain form
60715 494345 490261 486962 483688 479735 475074 469946 464746 460107 456092 451603 445689 439223 433983 430201
60701 430201 426492 422320 418945 417414 416985 416348 415312 414402 413576 412331 410625 408913 407489 406361 405647
60686 405647 405616 406393 407852 409759 411924 414275 416754 419142 421257 423489 426733 431383 436782 442086 447238
60671 447238 452464 457323 461129 464075 467019 470231 473173 475457 477208 478507 479327 480110 481620 484102 487207
60656 487207 490774 494952 499528 503913 507934 511974 516250 520671 525422 530816 536339 540728 543309 544563
60642 544563 544993 544084 540899 535287 528100 520576 513702 507802 502422 496852 490909 485053 479838 475576 472413
60627 472413 470175 468135 465523 462430 459787 458373 458179 458752 459623 460292 460261 459329 457688 455750 454065 453234
60611 453234 453521 454540 455623 456335 456502 456109 455565 455617 456452 457258 457267 456833 456757 456948 456666 455908 455652 456679 458914
$$ packed form
60715D94345m084l299l274l953m661n128n200m639m015m489n914o466n240l782
60701D30201l709m172l375j531m29o37j036r10q26j245j706j712j424j128p14
60686D05647l1P77J459J907K165K351K479K388K115K232L244M650N399N304N152
60671D47238N226M859L806K946K944L212K942K284J751J299Q20P83J510K482L105
60656D87207L567M178M576M385M021M040M276M421M751N394N523M389K581J254
60642E44563M30r09l185n612p187p524o874n900n380n570n943n856n215m262l163
60627D72413k238k040k612l093k643j414j94N73Q71O69l1r32j641j938j685q31
60611D53234K87J019J083P12J67l93n44N2Q35Q06Rm34p6J91k82p58k56J027K235
$$ plain form
60592 458914 461908 465228 468394 471187 474100 477782 482006 485806 488618 490645 492162 493202 493960 494796 495715
60577 495715 496424 496968 497810 499344 501842 505665 510928 517173 524074 532173 542126 553552 565691 579019
60563 579019 595019 614291 635960 659055 683237 707760 730758 750207 764888 774114 777340 774677
60551 774677 767243 756584 744118 731286 719554 709913 702768 698498 697599 700148 705742 714204 725820
60538 725820 740790 759039 780821 806951 838112 874094 913532 953859 991669 1023898 1048933
60527 1048933 1066312 1075684 1076780 1070264 1057778 1041127 1022051 1002562 984470 968354 953715 940126
60515 940126 927556 915779 904517 894312 886334 881169 878561 878255 880120 883504 887644 892953 900809
60502 900809 911931 926035 943359 965261 992879 1026396 1066203 1113670 1170024 1235326 1309221
$$ packed form
60592D58914K994L320L166K793K913L682M224L800K812K027J517J040P58Q36R19
60577D95715P09N44Q42J534K498L823N263O245O901Q099R953J1426J2139J3328
60563E79019J6000J9272K1669K3095K4182K4523K2998J9449J4681R226L226k663
60551G74677p434j0659j2466j2832j1732r641p145m270q99K549N594Q462J1616
60538G25820J4970J8249K1782K6130L1161L5982L9438M0327L7810L2229K5035
60527A048933J7379R372J096o516j2486j6651j9076j9489j8092j6116j4639j3589
60515I40126j2570j1777j1262j0205p978n165k608l06J865L384M140N309P856
60502I00809J1122J4104J7324K1902K7618L3517L9807M7467N6354O5302P3895
$$ plain form
60491 1309221 1391704 1482222 1578538 1677222 1774858 1868303 1954348 2029788 2091607 2136839 2162675
60480 2162675 2167103 2149225 2109124 2048150 1969410 1877238 1775984 1669833 1563446 1461325 1366034
60469 1366034 1277968 1197103 1123981 1058715 1000354 947956 901350 860273 823837 791536 763781
60458 763781 740540 720328 701493 683801 667898 653833 641040 629285 618719 609219 600431 592228
60446 592228 584577 577230 570089 563635 558596 555285 553401 552134 550455 547874 545066 543151 542233 541375 540091
60431 540091 538905 538206 537546 536532 535458 534509 533155 530961 528332 525897 523832 522119 520701 519010 516298
60416 516298 512928 510422 509634 509819 510043 510484 511615 513090 514405 515804 517578 519178 520002 520429 521187 522236
60400 522236 523093 523760 524513 525287 525950 526664 527310 527273 526530 526252 527478 529768 531984 533804 535573 537280 538640
$$ packed form
60491A309221Q2483R0518R6316R8684R7636R3445Q6045P5440O1819M5232K5836
60480B162675M428j7878m0101o0974p8740r2172j01254j06151j06387j02121r5291
60469A366034q8066q0865p3122o5266n8361n2398m6606m1077l6436l2301k7755
60458G63781k3241k0212j8835j7692j5903j4065j2793j1755j0566r500q788q203
60446E92228p651p347p141o454n039l311j884j267j679k581k808j915r18q58j284
60431E40091j186o99o60j014j074r49j354k194k629k435k065j713j418j691k712
60416E16298l370k506p88J85K24M41J131J475J315J399J774J600Q24M27P58J049
60400E22236Q57O67P53P74O63P14O46l7p43k78J226K290K216J820J769J707J360
$$ plain form
60383 538640 539726 540685 541299 541638 542595 544843 547652 549628 550272 550056 549488 549002 549324 550905 553153 555005
60367 555005 556102 556843 557656 558867 560763 563006 564420 564260 563352 563247 564558 566818 569542 572575 575651
60352 575651 578448 580964 583321 585482 587678 590661 594914 599982 605122 610125 615021 619570 623696 627727
60338 627727 631495 633838 633819 631834 628817 625077 620782 616797 613913 611760 609513 607188 605273 603691 602162
60323 602162 601078 600873 600956 600419 599428 598878 599052 599671 600811 602664 604773 606703 609077 612822 617822 623520
60307 623520 630423 639574 650876 663432 677446 694394 715503 741514 773624 812481 855668 897860
60295 897860 934391 963593 985078 997175 997417 985029 962059 932221 899110 865202 831945 800477
60283 800477 771891 746661 724378 704699 688169 675320 665334 656561 648183 640463 633539 627063 620988
$$ packed form
60383E38640J086R59O14L39R57K248K809J976O44k16n68m86L22J581K248J852
60367E55005J097P41Q13J211J896K243J414j60r08j05J311K260K724L033L076
60352E75651K797K516K357K161K196K983M253N068N140N003M896M549M126M031
60338F27727L768K343j9j985l017l740m295l985k884k153k247k325j915j582j529
60323F02162j084k05Q3n37r91n50J74O19J140J853K109J930K374L745N000N698
60307F23520O903R151J1302J2556J4014J6948K1109K6011L2110L8857M3187M2192
60295H97860L6531K9202K1485J2097K42j2388k2970k9838l3111l3908l3257l1468
60283H00477k8586k5230k2283j9679j6530j2849r986q773q378p720o924o476o075
$$ plain form
60270 620988 615619 610768 605851 600988 597061 594476 592762 591568 591094 591226 591124 590163 588646 587211 586070
60255 586070 585203 584846 585363 586773 588533 589760 589959 589665 589888 590561 590274 588185 585447 583770 583232 582640 581549
60238 581549 580479 579497 578131 576736 576444 577480 578758 579503 580161 581432 583492 586456 590518 595285 599927
60223 599927 604311 608933 613545 617036 619087 620788 623065 625576 627835 630418 634203 639106 644321 649253
60209 649253 653620 657225 660278 663467 667207 671169 674946 678668 682596 686566 690196 693244 695488 696782
60195 696782 697454 698133 698898 699131 698433 697098 695428 693196 690129 686379 682220 677808 673479 669703 666428
60180 666428 663041 659275 655604 652512 649971 647892 646370 645148 643551 641503 639986 639943 641173 642840 644522
60165 644522 646135 647203 647038 645661 643997 642999 642812 642850 642560 642033 641838 642276 643014 643634 644246 645254 646811
$$ packed form
60270F20988n369m851m917m863l927k585j714j194m74J32j02r61j517j435j141
60255E86070q67l57N17J410J760J227J99k94K23O73k87k089k738j677n38n92j091
60238E81549j070r82j366j395k92J036J278P45O58J271K060K964M062M767M642
60223E99927M384M622M612L491K051J701K277K511K259K583L785M903N215M932
60209F49253M367L605L053L189L740L962L777L722L928L970L630L048K244J294
60195F96782O72O79P65K33o98j335j670k232l067l750m159m412m329l776l275
60180F66428l387l766l671l092k541k079j522j222j597k048j517m3J230J667J682
60165F44522J613J068j65j377j664r98j87L8k90n27j95M38P38O20O12J008J557
$$ plain form
60148 646811 648970 652180 657022 663493 671009 678966 686890 694321 701284 708708 717568 727539 737224 745837
60134 745837 754014 762836 772639 782799 792084 799160 803406 805401 806101 805578 803155 798725 793224 787763
60120 787763 782996 779313 776863 775213 773709 772337 771583 771473 771508 771621 772351 773905 775816 777688 779475 780821
60104 780821 781019 779931 778241 776470 774362 771495 767828 763417 758318 753071 748613 745423 743326 742328 742954
60089 742954 745484 749490 754359 759665 764862 769374 773313 777553 782766 788732 794588 799232 801643 801618 800156
60074 800156 798262 795354 789816 781159 770633 759625 748623 737942 728186 719416 710900 702311 694258
60061 694258 687139 680443 673764 667484 661762 655816 649046 642089 635911 630565 625679 621533 618697 617013
60047 617013 615866 615230 615680 617460 620079 622807 625288 627839 631309 636234 641934 646881 650122 651876 652594
$$ packed form
60148F46811K159L210M842O471P516P957P924P431O963P424Q860R971R685Q613
60134G45837Q177Q822R803J0160R285P076M246J995P00n23k423m430n501n461
60120G87763m767l683k450j650j504j372p54j10L5J13P30J554J911J872J787J346
60104G80821J98j088j690j771k108k867l667m411n099n247m458l190k097r98O26
60089G42954K530M006M869N306N197M512L939M240N213N966N856M644K411k5j462
60074H00156j894k908n538q657j0526j1008j1002j0681r756q770q516q589q053
60061F94258p119o696o679o280n722n946o770o957o178n346m886m146k836j684
60047F17013j147o36M50J780K619K728K481K551L470M925N700M947L241J754P18
$$ plain form
60032 652594 652126 650181 647006 643163 639013 634731 630346 625519 619750 613024 605830 598437 590701 582683
60018 582683 574777 567137 559696 552886 547485 543512 540086 536670 533720 531806 530878 530690 531196 532215 533430
60003 533430 534953 537081 539341 540770 541349 542101 543416 544455 544707 544997 546257 548281 550404 552543 554918
59988 554918 557587 560840 565158 570194 574749 578392 582091 586505 590697 593404 594667 595325 595743 595927 596072
59973 596072 596100 595443 594151 593379 593888 594937 595685 596748 599193 602722 606161 609176 612278 615609 618977 622729
59957 622729 627348 632367 636729 640086 642812 644957 646165 646458 646188 645326 643577 641095 638313 635235 631590
59942 631590 627589 623867 620723 617901 614895 611140 606326 600985 596275 592677 589463 585986 582852 581112
59928 581112 580962 581981 583982 586733 589437 591547 593688 596819 600802 604724 608235 611708 615428 619595
$$ packed form
60032F52594m68j945l175l843m150m282m385m827n769o726p194p393p736q018
60018E82683p906p640p441o810n401l973l426l416k950j914r28j88N06J019J215
60003E33430J523K128K260J429N79P52J315J039K52K90J260K024K123K139K375
59988E54918K669L253M318N036M555L643L699M414M192K707J263O58M18J84J45
59973E96072K8o57j292p72N09J049P48J063K445L529L439L015L102L331L368L752
59957F22729M619N019M362L357K726K145J208K93k70q62j749k482k782l078l645
59942F31590m001l722l144k822l006l755m814n341m710l598l214l477l134j740
59928E81112j50J019K001K751K704K110K141L131L983L922L511L473L720M167
$$ plain form
59914 619595 624783 631367 638644 645435 651483 657513 664066 671030 678154 685228 691876 697781 702988 707444
59900 707444 710517 711542 710527 707837 703667 698450 693251 688927 685352 682194 679902 679023 679110 679364 679977
59885 679977 681730 684520 687403 689977 692719 696024 699888 704466 709983 716026 721794 727097 732291 737203
59871 737203 740942 742918 743340 742589 740757 737918 734329 730230 725866 721644 717864 714369 710894 707668 705226
59856 705226 703707 702685 701552 699844 697464 694876 692811 691607 691243 692075 694788 699336 704824 710885 718287
59841 718287 727546 737910 748444 759106 769631 778253 782910 783481 781853 780247 780276 782921 788067 794210
59827 794210 799507 802887 803577 800450 793052 782690 771276 759508 747230 734961 723648 713339 703527
59814 703527 694645 687848 683363 680261 677740 675479 672914 669491 665697 662706 660932 659876 659198 658769 657788
$$ packed form
59914F19595N188O584P277O791O048O030O553O964P124P074O648N905N207M456
59900G07444L073J025j015k690m170n217n199m324l575l158k292q79Q7K54O13
59885F79977J753K790K883K574K742L305L864M578N517O043N768N303N194M912
59871G37203L739J976M22p51j832k839l589m099m364m222l780l495l475l226k442
59856G05226j519j022j133j708k380k588k065j204l64Q32K713M548N488O061P402
59841G18287R259J0364J0534J0662J0525Q622M657N71j628j606K9K645N146O143
59827G94210N297L380O90l127p398j0362j1414j1768j2278j2269j1313j0309r812
59814G03527q882o797m485l102k521k261k565l423l794k991j774j056o78m29r81
$$ plain form
59799 657788 655148 650837 645944 641220 636549 631741 626763 621228 614779 608056 602222 597505 593152 588755
59785 588755 584617 580844 577184 573756 570943 568559 566155 563999 562668 561781 560341 558334 556784 556236 556346
59770 556346 556957 558231 559633 560139 559802 559929 561389 563766 566322 568672 570322 570836 570828 571685 573964 577042
59754 577042 580472 584495 588997 593258 597188 601582 606661 611469 615297 618605 621975 625131 627670 629912
59740 629912 632340 634827 636932 638365 638911 638591 638136 638513 639663 640538 640569 640269 640164 640096 639930 639953 640161 640023
59722 640023 639373 638731 638376 637941 637293 636911 636982 636896 636151 635037 634098 633577 633616 634250 635013 635379 635780 637276 639942
59703 639942 642606 644487 646055 647935 650035 652243 654924 658110 661185 664016 667457 672021 676897 680959
59689 680959 683973 686096 686992 686312 684550 682677 681268 680461 680241 680274 679929 679006 678022 677398 676845 675859 674234
$$ packed form
59799F57788k640m311m893m724m671m808m978n535o449o723n834m717m353m397
59785E88755m138l773l660l428k813k384k404k156j331q87j440k007j550n48J10
59770E56346O11J274J402N06l37J27J460K377K556K350J650N14qQ57K279L078
59754E77042L430M023M502M261L930M394N079M808L828L308L370L156K539K242
59740F29912K428K487K105J433N46l20m55L77J150Q75L1l00j05o8j66K3K08j38
59722F40023o50o42l55m35o48l82P1q6p45j114r39n21L9O34P63L66M01J496K666
59703F39942K664J881J568J880K100K208K681L186L075K831L441M564M876M062
59689F80959L014K123Q96o80j762j873j409q07k20L3l45r23r84o24n53r86j625
$$ plain form
59672 674234 671727 667925 662929 657620 652770 648339 644018 639931 636389 633457 631135 629573 628800 628621 628995
59657 628995 630025 631469 632794 633901 635273 637264 639830 643013 646988 651457 655640 658974 661192 661735
59643 661735 659974 656137 651180 645614 639360 632801 626915 622055 617617 613279 609638 607271 606141 606276
59629 606276 607954 610665 612862 613387 612379 610372 607490 604134 601458 600284 600135 599971 599283 597969 595879
59614 595879 593140 590329 587805 585388 583110 581570 581059 581071 581210 581954 583921 586899 590100 592858 594722
59599 594722 595517 595719 596127 596754 596664 595291 593258 591504 590279 589394 588772 588237 587389 586132 584837 583683 582382
59582 582382 580784 579130 577502 575743 574020 572661 571231 568776 565263 561841 559353 557547 556032 554893
59568 554893 553889 552221 549866 548178 548382 550146 552255 553939 555004 555344 554984 554097 552693 550922 549795
$$ packed form
59672F74234k507l802m996n309m850m431m321m087l542k932k322j562p73j79L74
59657F28995J030J444J325J107J372J991K566L183L975M469M183L334K218N43
59643F61735j761l837m957n566o254o559n886m860m438m338l641k367j130J35
59629F06276J678K711K197N25j008k007k882l356k676j174j49j64o88j314k090
59614E95879k739k811k524k417k278j540n11J2J39P44J967K978L201K758J864
59599E94722P95K02M08O27r0j373k033j754j225q85o22n35q48j257j295j154j301
59582E82382j598j654j628j759j723j359j430k455l513l422k488j806j515j139
59568E54893j004j668k355j688K04J764K109J684J065L40l60q87j404j771j127
$$ plain form
59553 549795 550626 553422 556779 559634 562111 564414 566252 567890 570450 574378 578750 582845 587381 593428
59539 593428 601172 610600 622530 638157 658115 682097 708021 731150 745878 749889 745857 738431
59527 738431 730728 724313 720553 720040 721684 724149 727659 732971 739129 743695 744963 742911 738349 732219
59513 732219 725441 718417 710781 702162 692873 683365 673653 663843 654570 646304 638906 632322 626882 622397
59499 622397 618021 613591 610032 607724 605739 603513 601935 601659 601634 600643 599146 598212 597646 596754 596109 596947
59483 596947 599367 602557 606250 610623 615298 619838 624746 630769 637687 644976 652966 662001 671001 678297
59469 678297 683449 686996 688940 688962 687736 686587 686013 685784 686146 687613 689889 692402 695756 701379 709803
59454 709803 720390 732505 745798 759513 772765 785499 798207 810835 822859 834059 844056 851377
$$ packed form
59553E49795Q31K796L357K855K477K303J838J638K560L928M372M095M536O047
59539E93428P744R428J1930J5627J9958K3982K5924K3129J4728M011m032p426
59527G38431p703o415l760n13J644K465L510N312O158M566J268k052m562o130
59513G32219o778p024p636q619r289r508r712r810r273q266p398o584n440m485
59499F22397m376m430l559k308j985k226j578k76k5r91j497r34n66q92o45Q38
59483E96947K420L190L693M373M675M540M908O023O918P289P990R035R000P296
59469F78297N152L547J944K2j226j149n74k29L62J467K276K513L354N623Q424
59454G09803J0587J2115J3293J3715J3252J2734J2708J2628J2024J1200R997P321
$$ plain form
59442 851377 854210 852091 845911 836531 824445 810615 796379 782471 768984 756283 745065 735548
59430 735548 727303 719803 712619 705499 698923 694181 692222 692822 695502 700552 708431 718895 731610 746824
59416 746824 764514 783617 803152 823443 845504 870109 898003 929099 959656 981812 988550 979160
59404 979160 958631 932833 906099 882014 863339 850933 844931 846733 857066 871678 881683 879694
59392 879694 864621 840359 811797 782787 755851 731971 711034 693098 678633 667476 658604 651240
59380 651240 645271 640425 636230 632988 631631 632254 633868 635838 638485 641956 645676 649391 653767 659436
59366 659436 666162 673262 680180 686524 692301 698249 705185 713040 721242 729869 739440 749744 760079 770673
59352 770673 782736 796891 812542 828974 846119 864131 883085 903230 924674 946725 968289
$$ packed form
59442H51377K833k119o180r380j2086j3830j4236j3908j3487j2701j1218r517
59430G35548q245p500p184p120o576m742j959O00K680N050P879J0464J2715J5214
59416G46824J7690J9103J9535K0291K2061K4605K7894L1096L0557K2156O738r390
59404I79160k0529k5798k6734k4085j8675j2406o002J802J0333J4612J0005j989
59392H79694j5073k4262k8562k9010k6936k3880k0937j7936j4465j1157q872p364
59380F51240n969m846m195l242j357O23J614J970K647L471L720L715M376N669
59366F59436O726P100O918O344N777N948O936P855Q202Q627R571J0304J0335J0594
59352G70673J2063J4155J5651J6432J7145J8012J8954K0145K1444K2051K1564
$$ plain form
59341 968289 988847 1008260 1025876 1040831 1052920 1062057 1067141 1066833 1061418 1052562 1041176 1026803 1009237
59328 1009237 989424 968487 947028 925739 905578 887031 870017 854599 840835 828026 815274
59317 815274 802942 792373 784095 777407 771823 767574 764415 761282 757707 754524 752645 751951 751800 751934
59303 751934 752519 753839 756161 759413 763161 767411 773091 781008 790806 801995 815493 832960 854813
59290 854813 879878 906214 930704 948473 955064 949808 935930 917401 896981 876853 858824 843259
59278 843259 829464 817692 809417 805277 804281 805530 809245 815569 823761 833213 843978 855721 867377
59265 867377 878380 888984 898771 906107 909716 909788 906946 901237 892705 881959 869523 855426 839884
59252 839884 823648 807407 791632 777067 764458 753692 744201 736151 730140 725893 722691 721024 722152
$$ packed form
59341I68289K0558J9413J7616J4955J2089R137N084l08n415q856j1386j4373j7566
59328A009237j9813k0937k1459k1289k0161j8547j7014j5418j3764j2809j2752
59317H15274j2332j0569q278o688n584m249l159l133l575l183j879o94j51J34
59303G51934N85J320K322L252L748M250N680P917R798J1189J3498J7467K1853
59290H54813K5065K6336K4490J7769O591n256j3878j8529k0420k0128j8029j5565
59278H43259j3795j1772q275m140r96J249L715O324Q192R452J0765J1743J1656
59265H67377J1003J0604R787P336L609P2k842n709q532j0746j2436j4097j5542
59252H39884j6236j6241j5775j4565j2609j0766r491q050o011m247l202j667J128
$$ plain form
59239 722152 725822 730110 733925 738062 743301 749112 754880 760880 767175 772875 777301 780749 783356 784333
59225 784333 782942 779197 773134 764589 754286 743983 734841 726628 718919 711946 705810 700134 695018 691213
59211 691213 688876 687319 686380 686728 688324 689972 691023 692222 694230 696553 698668 700989 704051 707776 712073
59196 712073 716972 721713 725043 727037 729359 733114 737690 742252 746958 751993 756781 760979 765048 769169
59182 769169 772830 776070 779700 783568 786085 786368 785483 784771 784316 783983 784576 786778 790066 793691 797762 802603
59166 802603 808136 814690 823132 833343 843700 852926 861259 869036 875453 879625 881592 881325 878054 871702
59152 871702 863764 855717 847589 839020 830495 822510 814641 806571 799023 792770 787672 783472 780314 777658
59138 777658 774048 768969 763680 759264 755175 750738 746642 743697 741426 739183 737478 736894 736862 736804 737401 739425
$$ packed form
59239G22152L670M288L815M137N239N811N768O000O295N700M426L448K607R77
59225G84333j391l745o063q545j0303j0303r142q213p709o973o136n676n116l805
59211F91213k337j557r39L48J596J648J051J199K008K323K115K321L062L725M297
59196G12073M899M741L330J994K322L755M576M562M706N035M788M198M069M121
59182G69169L661L240L630L868K517K83q85p12m55l33N93K202L288L625M071M841
59166H02603N533O554Q442J0211J0357R226Q333P777O417M172J967k67l271o352
59152H71702p938q047q128q569q525p985p869q070p548o253n098m200l158k656
59138G77658l610n079n289m416m089m437m096k945k271k243j705n84l2n8N97K024
$$ plain form
59122 739425 742371 745600 749792 755932 763788 772695 782877 794675 807366 820064 832968 846517 860163
59109 860163 873208 886016 899111 911821 922944 932086 939418 944941 948963 952326 955142 956231 954708
59096 954708 951094 946061 939430 931470 923752 917394 911713 905963 901033 897888 895532 892217 887696 882666
59082 882666 876856 869299 859808 848772 836242 822571 809157 797170 786300 775926 766561 758805
59070 758805 751923 744892 738014 732093 726968 722196 718193 715273 712593 709565 707238 706673 706926 706366 705042
59055 705042 703988 703002 700998 697966 694889 692237 690027 688696 688389 688061 686826 685515 685439 686381 687331 688322
59039 688322 689898 691562 692443 692813 693338 693665 693427 693776 696071 699815 703731 708114 714124 721503 729129 737383
59023 737383 747853 760985 775875 792002 809194 826140 840870 852671 861892 868177 870615 869433
$$ packed form
59122G39425K946L229M192O140P856Q907J0182J1798J2691J2698J2904J3549J3646
59109H60163J3045J2808J3095J2710J1123R142P332N523M022L363K816J089j523
59096I54708l614n033o631p960p718o358n681n750m930l145k356l315m521n030
59082H82666n810p557r491j1036j2530j3671j3414j1987j0870j0374r365p756
59070G58805o882p031o878n921n125m772m003k920k680l028k327n65K53n60j324
59055G05042j054r86k004l032l077k652k210j331l07l28j235j311p6R42R50R91
59039F88322J576J664Q81L70N25L27k38L49K295L744L916M383O010P379P626Q254
59023G37383J0470J3132J4890J6127J7192J6946J4730J1801R221O285K438j182
$$ plain form
59011 869433 865830 860470 853704 846845 841318 836826 832180 827780 825487 826249 829522 834818 841991 850136
58997 850136 858036 865767 874169 882777 889867 894630 897774 899939 900944 900581 898790 895095 889089 881340
58983 881340 872736 863415 853468 843960 835816 828398 820821 813962 809423 807174 806120 806381 809021 813913
58969 813913 819970 827160 836310 847190 858785 871237 885499 901212 916897 932084 947234 961725
58957 961725 973945 983297 990064 993434 991820 985193 975070 962141 946076 927741 909333 891887
58945 891887 874629 857205 840640 825827 812928 802540 795526 791248 787803 784307 781292 778773 775951
58932 775951 773075 771404 770762 769133 765368 760463 755532 750344 744579 738798 733286 727428 721005 714802
58918 714802 709381 704544 700506 698204 697905 698759 700191 702482 705685 709296 713302 718297 724260 730533 737208
$$ packed form
59011H69433l603n360o766o859n527m492m646m400k293P62L273N296P173Q145
58997H50136P900P731Q402Q608P090M763L144K165J005l63j791l695o006p749
58983H81340q604r321r947r508q144p418p577o859m539k249j054K61K640M892
58969H13913O057P190R150J0880J1595J2452J4262J5713J5685J5187J5150J4491
58957I61725J2220R352O767L370j614o627j0123j2929j6065j8335j8408j7446
58945H91887j7258j7424j6565j4813j2899j0388p014m278l445l496l015k519k822
58932G75951k876j671o42j629l765m905m931n188n765n781n512n858o423o203
58918G14802n421m837m038k302k99Q54J432K291L203L611M006M995N963O273O675
$$ plain form
58903 737208 745222 754879 765643 777538 791313 807023 823793 841114 858983 876731 893267 908687
58891 908687 924305 940995 958939 978898 1002106 1028726 1057775 1088401 1119639 1149142 1174163
58880 1174163 1193940 1209420 1220715 1226710 1227135 1222916 1214252 1200466 1182117 1161303 1139458 1116734
58868 1116734 1093909 1072874 1054620 1038566 1024311 1012224 1001837 991534 980418 968808 956540
58857 956540 942600 926925 910726 894616 878231 862036 847495 834879 822876 810888 799789
58846 799789 789875 780155 770314 761286 753097 744222 733989 723714 714485 705719 696918 688995 682681 677255
58832 677255 672001 667432 663999 660980 657699 654638 652407 650689 648892 646874 644619 642360 641190 642142
58818 642142 644536 646760 648746 651804 655922 659425 661691 663938 666599 668214 667956 667269 667772 669176 670369
$$ packed form
58903G37208Q014R657J0764J1895J3775J5710J6770J7321J7869J7748J6536J5420
58891I08687J5618J6690J7944J9959K3208K6620K9049L0626L1238K9503K5021
58880A174163J9777J5480J1295N995M25m219q664j3786j8349k0814k1845k2724
58868A116734k2825k1035j8254j6054j4255j2087j0387j0303j1116j1610j2268
58857I56540j3940j5675j6199j6110j6385j6195j4541j2616j2003j1988j1099
58846G99789r914r720r841r028q189q875j0233j0275r229q766q801p923o314n426
58832F77255n254m569l433l019l281l061k231j718j797k018k255k259j170R52
58818F42142K394K224J986L058M118L503K266K247K661J615k58o87N03J404J193
$$ plain form
58803 670369 671096 671653 672203 673097 674516 675344 673893 670179 665890 661921 657824 653914 651666 651355 651411 650945
58787 650945 650925 652161 654086 656354 659648 664140 669017 674229 680676 688047 694709 700498 707261 715628 723465
58772 723465 728666 731323 732050 730427 726452 721576 716877 711904 706340 701000 696212 691167 685862 681703
58758 681703 679206 677163 675038 673985 674469 675166 675432 676515 679067 681770 683849 686622 691035 695944 700447
58743 700447 705662 712463 719639 726175 733374 742804 753877 765258 776958 789360 801881 814224 827296
58730 827296 841394 855188 867858 880354 893122 904695 914150 922830 931829 939865 945648 950511 956642
58717 956642 964371 973064 983012 994433 1006107 1016802 1026635 1035518 1041900 1044636 1044415 1041799 1035729 1025592
58703 1025592 1012849 998818 982653 963219 941070 916890 890132 861152 832618 806650 782428
$$ packed form
58803F70369P27N57N50Q94J419Q28j451l714m289l969m097l910k248l11N6m66
58787F50945k0J236J925K268L294M492M877N212O447P371O662N789O763Q367P837
58772G23465N201K657P27j623l975m876m699m973n564n340m788n045n305m159
58758F81703k497k043k125j053M84O97K66J083K552K703K079K773M413M909M503
58743G00447N215O801P176O536P199R430J1073J1381J1700J2402J2521J2343J3072
58730H27296J4098J3794J2670J2496J2768J1573R455Q680Q999Q036N783M863O131
58717I56642P729Q693R948J1421J1674J0695R833Q883O382K736k21k616o070j0137
58703A025592j2743j4031j6165j9434k2149k4180k6758k8980k8534k5968k4222
$$ plain form
58692 782428 758697 736664 718187 702951 689737 678742 670293 662898 654915 646734 639174 631384 622553
58679 622553 614067 607640 602806 598481 595439 594851 595867 597065 598993 602929 608381 614079 620315 628223
58665 628223 637906 649211 662995 679540 696942 712860 726458 737049 742839 743190 740318 736500 731277
58652 731277 723612 714845 706939 699505 691206 682632 675244 668871 662766 657702 654580 652419 650099 648618
58638 648618 649160 650577 651310 652161 654460 657017 657700 656611 654985 652476 648367 644035 641308 639651 637922
58623 637922 637621 641324 648917 658264 668532 680062 692004 702996 713365 724049 734334 743161 751404
58610 751404 760143 767914 772483 774135 774455 773188 769269 763707 758332 752736 745513 737497 730715 725101
58596 725101 719259 713530 709292 706145 702793 699816 698667 698982 699888 702832 709912 720359 731816 744100
$$ packed form
58692G82428k3731k2033j8477j5236j3214j0995q449p395p983q181p560p790q831
58679F22553q486o427m834m325l042n88J016J198J928L936N452N698O236P908
58665F28223R683J1305J3784J6545J7402J5918J3598J0591N790L51k872l818n223
58652G31277p665q767p906p434q299q574p388o373o105n064l122k161k320j481
58638F48618N42J417P33Q51K299K557O83j089j626k509m109m332k727j657j729
58623F37922l01L703P593R347J0268J1530J1942J0992J0369J0684J0285Q827Q243
58610G51404Q739P771M569J652L20j267l919n562n375n596p223q016o782n614
58596G25101n842n729m238l147l352k977j149L15R06K944P080J0447J1457J2284
$$ plain form
58582 744100 758407 773864 788339 801963 816344 830863 843140 852789 861449 869523 876034 881384
58570 881384 887196 893726 900336 908187 919653 935443 954792 977769 1004743 1034341 1064598 1095180
58558 1095180 1125943 1154570 1178502 1197885 1213640 1224302 1228163 1227067 1224342 1220201 1212895 1203081
58546 1203081 1192955 1182152 1168714 1153355 1138582 1124140 1107459 1088138 1067994 1047124 1023991
58535 1023991 999147 974912 951696 928570 907012 889909 877009 865424 854485 846089 840387 835371
58523 835371 830848 828776 829405 830909 832963 836907 842308 847068 850986 855483 860010 862620 863957 866565
58509 866565 870180 871728 870095 867011 863218 857876 851823 847315 844181 840124 834863 830160 825885 820230
58495 820230 813694 808571 804565 799335 793359 789670 788701 788071 787653 789920 794849 799499 803428 809693 819596
$$ packed form
58582G44100J4307J5457J4475J3624J4381J4519J2277R649Q660Q074O511N350
58570H81384N812O530O610P851J1466J5790J9349K2977K6974K9598L0257L0582
58558A095180L0763K8627K3932J9383J5755J0662L861j096k725m141p306r814
58546A203081j0126j0803j3438j5359j4773j4442j6681j9321k0144k0870k3133
58535A023991k4844k4235k3216k3126k1558j7103j2900j1585j0939q396n702n016
58523H35371m523k072O29J504K054L944N401M760L918M497M527K610J337K608
58509H66565L615J548j633l084l793n342o053m508l134m057n261m703m275n655
58495H20230o536n123m006n230n976l689r69o30m18K267M929M650L929O265R903
$$ plain form
58480 819596 831125 843549 858768 876943 895305 912492 929646 946133 958662 965869 969514 970036
58468 970036 965408 955599 943825 932079 919570 906642 895808 887659 880091 872841 868492 867815 868497
58455 868497 869768 873930 881897 891410 900929 911050 920884 927414 929819 930272 929349 925011 917154 908674
58441 908674 900888 892467 883920 878276 876003 874091 871597 871156 873549 875826 876608 878380 882683 887852 893280
58426 893280 901036 911382 921532 930844 942387 957282 972225 984668 995748 1006105 1013615 1017452
58414 1017452 1019740 1021104 1019158 1013308 1006300 999153 989481 976768 964271 953678 942949 931489 922191
58401 922191 916153 910695 904956 902074 903341 905567 906779 909179 913808 917808 919771 922344 926525 928865
58387 928865 927474 925484 925331 924880 922448 920376 920183 919298 916086 913235 912932 913602 914468 918186 925708 933685
$$ packed form
58480H19596J1529J2424J5219J8175J8362J7187J7154J6487J2529P207L645N22
58468I70036m628r809j1774j1746j2509j2928j0834q149p568p250m349o77O82
58455H68497J271M162P967R513R519J0121R834O530K405M53r23m338p857q480
58441I08674p786q421q547n644k273j912k494m41K393K277P82J772M303N169N428
58426H93280P756J0346J0150R312J1543J4895J4943J2443J1080J0357P510L837
58414A017452K288J364j946n850p008p147r672j2713j2497j0593j0729j1460r298
58401I22191o038n458n739k882J267K226J212K400M629M000J963K573M181K340
58387I28865j391j990j53m51k432k072j93q85l212k851l03O70Q66L718P522P977
$$ plain form
58371 933685 940202 947927 958502 969242 978626 989451 1003069 1016117 1026644 1037966 1052641 1068099
58359 1068099 1081953 1096078 1111550 1125069 1134514 1142731 1151882 1159354 1163116 1165703 1169077 1171080 1170782
58346 1170782 1171686 1175703 1179659 1181626 1184808 1191337 1198448 1204812 1214184 1228435 1243532 1256983 1272560
58333 1272560 1292818 1313636 1331317 1348472 1367503 1384904 1397642 1408753 1420899 1430670 1435093 1437548
58321 1437548 1441552 1444903 1445662 1447476 1453047 1458724 1461571 1465378 1473705 1483515 1491755 1501607 1515875 1530860
58307 1530860 1543246 1556457 1573736 1591692 1607151 1623478 1643412 1662767 1678114 1693597 1713158
58296 1713158 1733226 1750184 1767623 1788916 1810167 1828111 1847299 1871672 1896843 1918670 1941440
58285 1941440 1969323 1997925 2022970 2049067 2080887 2113960 2143492 2173961 2210401 2248542 2283463
$$ packed form
58371I33685O517P725J0575J0740R384J0825J3618J3048J0527J1322J4675J5458
58359A068099J3854J4125J5472J3519R445Q217R151P472L762K587L374K003k98
58346A170782R04M017L956J967L182O529P111O364R372J4251J5097J3451J5577
58333A272560K0258K0818J7681J7155J9031J7401J2738J1111J2146R771M423K455
58321A437548M004L351P59J814N571N677K847L807Q327R810Q240R852J4268J4985
58307A530860J2386J3211J7279J7956J5459J6327J9934J9355J5347J5483J9561
58296A713158K0068J6958J7439K1293K1251J7944J9188K4373K5171K1827K2770
58285A941440K7883K8602K5045K6097L1820L3073K9532L0469L6440L8141L4921
$$ plain form
58274 2283463 2319563 2361838 2405764 2446290 2488302 2537464 2589192 2637672 2687153 2743178 2801472
58263 2801472 2857111 2915650 2983222 3054559 3122951 3192781 3269573 3347190 3418054 3486735 3559990
58252 3559990 3633106 3700006 3767114 3842883 3923413 4002904 4087910 4186053 4291203 4395639 4505962
58241 4505962 4630638 4763070 4894296 5031070 5183473 5346356 5511682 5687135 5882837
58232 5882837 6091818 6304132 6527937 6775374 7040467 7313320 7603044 7923260 8268444
58223 8268444 8628989 9015520 9442517 9902532 10383856 10898706 11465540 12079694 12732042
58214 12732042 13439834 14226531 15088828 16018669 17039619 18184387 19456428 20854811 22417016
58205 22417016 24194297 26208239 28481438 31089733 34134295 37690520 41844654 46753288
$$ packed form
58274B283463L6100M2275M3926M0526M2012M9162N1728M8480M9481N6025N8294
58263B801472N5639N8539O7572P1337O8392O9830P6792P7617P0864O8681P3255
58252C559990P3116O6900O7108P5769Q0530P9491Q5006R8143J05150J04436J10323
58241D505962J24676J32432J31226J36774J52403J62883J65326J75453J95702
58232E882837K08981K12314K23805K47437K65093K72853K89724L20216L45184
58223H268444L60545L86531M26997M60015M81324N14850N66834O14154O52348
58214A2732042P07792P86697Q62297R29841J020950J144768J272041J398383J562205
58205B2417016J777281K013942K273199K608295L044562L556225M154134M908634
$$ plain form
58197 46753288 52601244 59533013 67704478 77378549 88905594 102679570 119242215 139402328
58189 139402328 164145580 194472206 231309103 274993347 323800611 372439308 412606034
58182 412606034 436320336 439826139 424943144 397154372 362546920 325918601 290478591
58175 290478591 258221551 230217489 206691132 187043758 170041377 154328678 139065149
58168 139065149 124180974 110061730 97069885 85365087 74988609 65919441 58051894
58161 58051894 51233213 45345074 40300824 35985645 32265590 29046870 26272792 23873797
58153 23873797 21771802 19924244 18315230 16908835 15653035 14522282 13515175 12615164
58145 12615164 11790751 11029430 10336183 9702489 9109269 8555964 8055498 7604018 7184346
$$ packed form
58197D6753288N847956O931769Q171465R674071J1527045J3773976J6562645K0160113
58189A39402328K4743252L0326626L6836897M3684244M8807264M8638697M0166726
58182D12606034K3714302L505803j4882995k7788772l4607452l6628319l5440010
58175B90478591l2257040k8004062k3526357j9647374j7002381j5712699j5263529
58168A39065149j4884175j4119244j2991845j1704798j0376478r069168p867547
58161E8051894o818681n888139n044250m315179l720055l218720k774078k398995
58153B3873797k101995j847558j609014j406395j255800j130753j007107r00011
58145A2615164q24413p61321o93247o33694n93220n53305n00466m51480m19672
$$ plain form
58136 7184346 6794920 6447109 6137809 5851836 5587585 5353649 5143079 4936790 4730539
58127 4730539 4534661 4349687 4165903 3985032 3819067 3668403 3522580 3381457 3254713
58118 3254713 3141405 3030450 2920805 2821664 2733219 2646204 2560148 2483667 2416652 2349838 2282027
58107 2282027 2220652 2165257 2107211 2045977 1989536 1938362 1884771 1828505 1777454 1732331 1685588
58096 1685588 1636321 1591792 1553406 1515180 1476792 1444387 1417675 1389724 1360353 1336576 1318937
58085 1318937 1300393 1279711 1263026 1250929 1236564 1217980 1200288 1184153 1164022 1139400 1116362
58074 1116362 1096260 1073937 1048638 1025719 1006071 984675 961283 941937 928056 914247 898680
58063 898680 885687 876337 866255 854634 845945 840866 834572 825635 817725 811182 801892 789887 780120
$$ packed form
58136G184346l89426l47811l09300k85973k64251k33936k10570k06289k06251
58127D730539j95878j84974j83784j80871j65965j50664j45823j41123j26744
58118C254713j13308j10955j09645r9141q8445q7015q6056p6481o7015o6814o7811
58107B282027o1375n5395n8046o1234n6441n1174n3591n6266n1051m5123m6743
58096A685588m9267m4529l8386l8226l8388l2405k6712k7951k9371k3777j7639
58085A318937j8544k0682j6685j2097j4365j8584j7692j6135k0131k4622k3038
58074A116362k0102k2323k5299k2919j9648k1396k3392j9346j3881j3809j5567
58063H98680j2993r350j0082j1621q689n079o294q937p910o543r290j2005r767
$$ plain form
58050 780120 773373 765153 754827 746966 742328 736392 728205 721881 717905 711804 703035 696405 692895 687694
58036 687694 679234 671624 666223 659238 649781 641995 636925 630333 620832 612273 605851 597702 586749 577195
58022 577195 570756 563917 555315 548477 544695 540395 534121 529062 526235 522167 515785 510740 508400 505461
58008 505461 500892 498354 499114 499334 497115 495608 496532 497163 496415 497380 501048 503904 504569 506477 511176 515283
57992 515283 516985 519219 523372 526060 525420 524617 525775 526201 523999 521725 521103 519538 515284 510796 507677
57977 507677 503451 496679 490158 485761 481094 474594 468991 466380 464618 461913 460251 460916 461282 459486 457845
57962 457845 458267 458696 457490 457058 459586 463118 465254 466935 469337 470865 470466 470334 472169 474255 475084 476394
57946 476394 479690 483348 485935 488970 493688 498507 502324 506875 513330 520036 526011 533002 541773 550126
$$ packed form
58050G80120o747q220j0326p861m638n936q187o324l976o101q769o630l510n201
58036F87694q460p610n401o985r457p786n070o592r501q559o422q149j0953r554
58022E77195o439o839q602o838l782m300o274n059k827m068o382n045k340k939
58008E05461m569k538P60K20k219j507R24O31p48R65L668K856O65J908M699M107
57992E15283J702K234M153K688o40q03J158M26k202k274o22j565m254m488l119
57977E07677m226o772o521m397m667o500n603k611j762k705j662O65L66j796j641
57962D57845M22M29j206m32K528L532K136J681K402J528l99j32J835K086Q29J310
57946D76394L296L658K587L035M718M819L817M551O455O706N975O991Q771Q353
$$ plain form
57932 550126 557088 565127 575592 585842 593580 600171 606912 611895 613553 613594 613420 611258 605805 599089
57918 599089 592681 584655 573437 561188 550191 539271 527036 515329 506102 497937 489032 480747 475030
57905 475030 471109 467731 465850 466054 466194 464521 462389 461068 458919 454799 451151 450349 450747 449717 448032
57890 448032 447893 449009 449909 451016 453295 455869 457752 459869 462835 464985 465101 464671 465005 464752 462781 460657
57874 460657 459424 456795 450655 442695 435496 428577 420541 412568 406356 400867 394506 388484 384696 382241
57860 382241 379274 376493 375588 376022 376409 377421 380340 384358 388085 392065 397139 402122 405832 409552 414816
57845 414816 420617 425475 430215 435882 440966 443670 444999 446662 447824 446992 445236 444360 443570 441057 437353
57830 437353 434096 431045 427323 424071 422889 423051 423169 424091 427235 431574 435258 438836 443912 449986 455471
$$ packed form
57932E50126O962Q039J0465J0250P738O591O741M983J658M1j74k162n453o716
57918E99089o408q026j1218j2249j0997j0920j2235j1707r227q165q905q285n717
57905D75030l921l378j881K04J40j673k132j321k149m120l648q02L98j030j685
57890D48032j39J116R00J107K279K574J883K117K966K150J16m30L34k53j971k124
57874D60657j233k629o140p960p199o919q036p973o212n489o361o022l788k455
57860C82241k967k781r05M34L87J012K919M018L727L980N074M983L710L720N264
57845D14816N801M858M740N667N084K704J329J663J162q32j756q76p90k513l704
57830D37353l257l051l722l252j182J62J18R22L144M339L684L578N076O074N485
$$ plain form
57815 455471 460492 465868 470697 473741 475795 478007 479411 478833 477425 476299 473496 466627 456924 447323
57801 447323 438036 427552 416584 407229 399196 390589 381754 374778 369754 364901 359992 356444 354381 352675
57787 352675 351524 351956 353122 353025 351697 350975 351509 352661 354854 359238 365354 371754 378589 387095 396991
57772 396991 406916 416835 427426 437667 445758 451985 458048 463947 468081 469907 469955 467732 462305 454475
57758 454475 445829 436148 424387 411665 400470 391307 382920 375477 370650 368639 367874 367679 368648 370401
57744 370401 371456 371361 370634 368736 364482 358400 352319 346754 340923 335046 330242 326404 322557 319126 317457
57729 317457 317246 316860 316057 315999 316737 317086 316856 316856 316914 316235 315531 316285 318074 319067 318993 319092 319250 317949 315135 312532
57709 312532 310842 309146 307334 306599 307108 307477 307014 306396 305857 304843 303669 303383 303802 303723 303191 303406 304344
$$ packed form
57815D55471N021N376M829L044K054K212J404n78j408j126k803o869r703r601
57801D47323r287j0484j0968r355q033q607q835o976n024m853m909l548k063j706
57787C52675j151M32J166r7j328p22N34J152K193M384O116O400O835Q506R896
57772C96991R925R919J0591J0241Q091O227O063N899M134J826M8k223n427p830
57758D54475q646r681j1761j2722j1195r163q387p443m827k011p65j95R69J753
57744C70401J055r5p27j898m254o082o081n565n831n877m804l838l847l431j669
57729C17457k11l86q03n8P38L49k30%N8o79p04P54J789R93p4R9J58j301k814k603
57709C12532j690j696j812p35N09L69m63o18n39j014j174k86M19p9n32K15R38
$$ plain form
57692 304344 304701 304360 304573 305526 305980 305663 305777 306822 308051 309437 312007 315897 320172 324961 331709 340946
57676 340946 351824 364192 379158 397324 418602 444217 476893 518596 570034 632853 710213
57665 710213 803788 910315 1020164 1117810 1185430 1210414 1191763 1138867 1064444 979591 893295
57654 893295 812065 738468 672145 612992 561813 518288 480998 449739 425239 406288 389833
57643 389833 374522 361624 351807 343543 335553 328332 322297 316709 311452 307692 305733 304257 302664 302155
57629 302155 303373 304914 305355 305057 304911 304818 304308 303244 301244 297906 294170 291810 291090 290542 289451 288683
57613 288683 288566 287985 286338 284547 283367 282408 281479 281173 281509 281757 282091 283574 286009 287753 288222 288608 289555
57596 289555 290243 290332 290644 291181 290658 288790 286861 285266 282822 279427 276845 275721 274292 271559 269311 269255
$$ packed form
57692C04344L57l41K13R53M54l17J14J045J229J386K570L890M275M789O748R237
57676C40946J0878J2368J4966J8166K1278K5615L2676M1703N1438O2819P7360
57665G10213R3575J06527J09849R7646O7620K4984j8651n2896p4423q4853q6296
57654H93295q1230p3597o6323n9153n1179m3525l7290l1259k4500j8951j6455
57643C89833j5311j2898r817q264p990p221o035n588n257l760j959j476j593n09
57629C02155J218J541M41k98j46r3n10j064k000l338l736k360p20n48j091p68
57613B88683j17n81j647j791j180r59r29l06L36K48L34J483K435J744M69L86R47
57596B89555O88Q9L12N37n23j868j929j595k444l395k582j124j429k733k248n6
$$ plain form
57580 269255 270221 270101 268821 267525 266369 264946 263591 262627 261399 259426 257373 255803 254273 252709 252170
57565 252170 253034 253916 253620 252702 251951 250982 249679 249367 251001 253598 255904 258206 261010 263448 264768 266135
57549 266135 269055 272973 276166 278272 280375 283214 286693 290588 294567 298112 301372 305419 310765 316451
57535 316451 321371 325481 328972 331484 333103 334929 337490 339728 340601 340678 341041 341703 342147 342430 342626 342127
57519 342127 340566 338591 336857 335153 333243 331425 329532 326616 322434 318020 314039 309981 305724 302289
57505 302289 300085 298067 295702 293973 293243 291981 289201 286392 285215 284751 283004 279892 276818 274339 272092
57490 272092 270148 268673 267069 265083 263869 264339 265291 264876 263170 261673 261028 260864 261177 262144 263136 263491
57474 263491 263848 265297 267701 270150 272485 275062 277621 279678 281416 283015 283833 283465 282821 282875 283236 283317
$$ packed form
57580B69255R66j20j280j296j156j423j355r64j228j973k053j570j530j564n39
57565B52170Q64Q82k96r18p51r69j303l12J634K597K306K302K804K438J320J367
57549B66135K920L918L193K106K103K839L479L895L979L545L260M047N346N686
57535C16451M920M110L491K512J619J826K561K238Q73P7L63O62M44K83J96m99
57519C42127j561j975j734j704j910j818j893k916m182m414l981m058m257l435
57505C02289k204k018k365j729p30j262k780k809j177m64j747l112l074k479k247
57490B72092j944j475j604j986j214M70R52m15j706j497o45j64L13R67R92L55
57474B63491L57J449K404K449K335K577K559K057J738J599Q18l68o44N4L61Q1
$$ plain form
57458 283317 283931 286077 288907 290567 290554 289791 289013 288518 288833 290030 290932 290503 289512 289392 290067 290455 290499 291073
57440 291073 292329 293738 295397 297751 300324 302200 303477 304911 306514 307863 309312 311451 313737 315102
57426 315102 315585 315989 316361 316260 316123 316798 317978 318642 318902 319969 322328 325228 327910 330153 331797 332831
57410 332831 333779 334998 336021 336532 337363 339307 341635 343145 344059 345395 347105 348471 349783 351844 354146
57395 354146 355385 355612 356175 357556 358877 359583 360096 360792 361777 363663 367089 371439 375387 378665 381901 384900
57379 384900 386703 387456 388643 391176 394567 398113 401562 404455 406224 407216 408435 410100 411606 412950 414905
57364 414905 417594 420214 422404 424662 427163 429370 431197 433445 436701 440666 444846 449073 453174 456917
57350 456917 460388 463780 466885 469557 472420 476212 480617 484655 487963 490775 493034 494657 496361 499053
$$ packed form
57458B83317O14K146K830J660j3p63p78m95L15J197R02m29r91j20O75L88M4N74
57440B91073J256J409J659K354K573J876J277J434J603J349J449K139K286J365
57426C15102M83M04L72j01j37O75J180O64K60J067K359K900K682K243J644J034
57410C32831R48J219J023N11Q31J944K328J510R14J336J710J366J312K061K302
57395C54146J239K27N63J381J321P06N13O96R85J886L426M350L948L278L236K999
57379C84900J803P53J187K533L391L546L449K893J769R92J219J665J506J344J955
57364D14905K689K620K190K258K501K207J827K248L256L965M180M227M101L743
57350D56917L471L392L105K672K863L792M405M038L308K812K259J623J704K692
$$ plain form
57336 499053 502526 505878 508925 512093 515293 518206 521399 525768 531036 536114 540734 545392 549876 553308
57322 553308 555634 557697 559935 562311 565291 569387 573849 577427 580419 584374 589646 594807 598730 601768
57308 601768 604679 607796 611551 616439 622158 627921 633683 639814 645798 650876 655928 662859 671872 681077
57294 681077 689182 696813 704732 712524 719808 727178 735099 743215 751487 760801 771739 783850 796711
57281 796711 810579 825442 840590 855585 870577 885250 898822 911608 925304 940999 957944
57270 957944 974810 991032 1006426 1020663 1033830 1046565 1059197 1071634 1084323 1098041 1112401
57259 1112401 1125910 1138024 1149953 1162949 1177023 1191739 1206848 1221594 1234851 1246720 1258787
57248 1258787 1272133 1286295 1300758 1316107 1332968 1351091 1370225 1390581 1411689 1432156 1451455
$$ packed form
57336D99053L473L352L047L168L200K913L193M369N268N078M620M658M484L432
57322E53308K326K063K238K376K980M096M462L578K992L955N272N161L923L038
57308F01768K911L117L755M888N719N763N762O131N984N078N052O931R013R205
57294F81077Q105P631P919P792P284P370P921Q116Q272R314J0938J2111J2861
57281G96711J3868J4863J5148J4995J4992J4673J3572J2786J3696J5695J6945
57270I57944J6866J6222J5394J4237J3167J2735J2632J2437J2689J3718J4360
57259A112401J3509J2114J1929J2996J4074J4716J5109J4746J3257J1869J2067
57248A258787J3346J4162J4463J5349J6861J8123J9134K0356K1108K0467J9299
$$ plain form
57237 1451455 1470714 1490915 1511619 1532408 1554185 1577893 1603109 1629124 1656276 1684951 1714231
57226 1714231 1742944 1771423 1800997 1832206 1864409 1896654 1928104 1958205 1987215 2016147 2045613
57215 2045613 2075361 2105287 2135998 2167824 2200353 2233616 2268645 2306010 2344772 2383677 2422359
57204 2422359 2460549 2497278 2531923 2565076 2597296 2627892 2656064 2682412 2708169 2733638 2758471
57193 2758471 2782787 2806980 2831084 2855343 2880716 2907787 2935903 2964429 2994103 3026000 3059788
57182 3059788 3094256 3129014 3164507 3200789 3237448 3274436 3311824 3348985 3385029 3419893 3454195
57171 3454195 3488327 3522441 3556966 3592253 3627934 3663283 3697944 3731823 3764773 3796969 3828996
57160 3828996 3860879 3891752 3921189 3950229 3980248 4011477 4043394 4075742 4108123 4139259 4167854
$$ packed form
57237A451455J9259K0201K0704K0789K1777K3708K5216K6015K7152K8675K9280
57226A714231K8713K8479K9574L1209L2203L2245L1450L0101K9010K8932K9466
57215B045613K9748K9926L0711L1826L2529L3263L5029L7365L8762L8905L8682
57204B422359L8190L6729L4645L3153L2220L0596K8172K6348K5757K5469K4833
57193B758471K4316K4193K4104K4259K5373K7071K8116K8526K9674L1897L3788
57182C059788L4468L4758L5493L6282L6659L6988L7388L7161L6044L4864L4302
57171C454195L4132L4114L4525L5287L5681L5349L4661L3879L2950L2196L2027
57160C828996L1883L0873K9437K9040L0019L1229L1917L2348L2381L1136K8595
$$ plain form
57149 4167854 4193802 4217712 4239830 4260396 4280339 4300304 4319366 4335960 4349870 4362215 4373665
57138 4373665 4383782 4392140 4399156 4405760 4412911 4421383 4431528 4443429 4457676 4475444 4497267 4522368
57126 4522368 4549919 4580277 4614133 4651066 4689833 4729473 4769201 4808010 4845673 4883798 4924739
57115 4924739 4969860 5019982 5077092 5144310 5224210 5318095 5426642 5550308 5689636 5846550
57105 5846550 6025453 6232314 6473269 6755372 7088393 7484787 7958588 8526216 9208418
57096 9208418 10030032 11017807 12199640 13605016 15263147 17199057 19431571 21972989
57088 21972989 24825428 27973722 31382161 34998120 38754969 42568061 46331057 49923150
57080 49923150 53222147 56107069 58448300 60106630 60959779 60943971 60076864 58444348 56167114
$$ packed form
57149D167854K5948K3910K2118K0566J9943J9965J9062J6594J3910J2345J1450
57138D373665J0117Q358P016O604P151Q472J0145J1901J4247J7768K1823K5101
57126D522368K7551L0358L3856L6933L8767L9640L9728L8809L7663L8125M0941
57115D924739M5121N0122N7110O7218P9900R3885J08547J23666J39328J56914
57105E846550J78903K06861K40955K82103L33021L96394M73801N67628O82202
57096I208418Q21614R87775J181833J405376J658131J935910K232514K541418
57088B1972989K852439L148294L408439L615959L756849L813092L762996L592093
57080D9923150L298997K884922K341231J658330Q53149j5808q67107j632516k277234
$$ plain form
57071 56167114 53374068 50191755 46740863 43132351 39465040 35826459 32293206 28928426
57063 28928426 25779416 22878101 20242422 17876879 15774251 13919740 12294630 10877329
57055 10877329 9644098 8571609 7639110 6827915 6120300 5500363 4955164 4473848 4046443
57046 4046443 3664629 3322716 3016394 2741098 2492781 2269366 2069713 1891391 1730888
57037 1730888 1585706 1454834 1337298 1231628 1136771 1052354 977891 912604 856040 808050
57027 808050 768330 736765 714017 701102 698745 707983 731074 771081 830808 911887 1012326 1122020
57015 1122020 1221282 1287353 1305401 1274687 1205769 1113322 1010563 906878 807666 715568 631998
57004 631998 557669 492433 435650 386746 344903 308596 276299 247535 222548 201290 183398
$$ packed form
57071E6167114k793046l182313l450892l608512l667311l638581l533253l364780
57063B8928426l149010k901315k635679k365543k102628j854511j625110j417301
57055A0877329j233231j072489r32499q11195p07615o19937n45199m81316m27405
57046D046443l81814l41913l06322k75296k48317k23415j99653j78322j60503
57037A730888j45182j30872j17536j05670r4857q4417p4463o5287n6564m7990
57027H08050l9720l1565k2748j2915k357R238K3091M0007N9727Q1079J00439J09694
57015A122020R9262O6071J8048l0714o8918r2447j02759j03685r9212r2098q3570
57004F31998p4329o5236n6783m8904m1843l6307l2297k8764k4987k1258j7892
$$ plain form
56993 183398 168717 156972 147263 138795 131700 126339 122452 120109 120893 126706 137544 151521 166599
56980 166599 180925 191894 196739 194512 186494 174651 160683 146272 132754 120326 108623 98130
56968 98130 89961 84392 80825 79120 79696 82340 86299 91779 100163 112500 128862 149077 172693 197772
56954 197772 220789 238168 247446 247377 238382 222991 204518 184960 164983 145706 128970 115704
56942 115704 105440 97768 92974 90904 90618 91773 95386 102726 114384 130695 152187 179222 211686
56929 211686 248520 286205 317947 336399 338287 325817 303712 276064 245913 215753 187185 160848
56917 160848 137247 116882 99506 84356 71319 60738 52007 43807 35978 29709 25493 22341 19490
56904 19490 17345 16123 15069 13841 13338 14326 16378 18892 21974 25634 29347 33279 38784 46863 57167
$$ packed form
56993A83398j4681j1745r709q468p095n361l887k343P84N813J0838J3977J5078
56980A66599J4326J0969M845k227q018j1843j3968j4411j3518j2428j1703j0493
56968I8130q169n569l567j705N76K644L959N480Q384J2337J6362K0215K3616K5079
56954A97772K3017J7379R278o9q995j5391j8473j9558j9977j9277j6736j3266
56942A15704j0264p672m794k070k86J155L613P340J1658J6311K1492K7035L2464
56929B11686L6834L7685L1742J8452J888j2470k2105k7648l0151l0160k8568k6337
56917A60848k3601k0365j7376j5150j3037j0581q731q200p829o269m216l152k851
56904A9490k145j222j054j228n03R88K052K514L082L660L713L932N505Q079J0304
$$ plain form
56889 57167 69284 83935 102092 123926 149245 177596 206905 233078 252157 262440 264120 258234
56877 258234 246888 233285 220046 207941 196991 187966 181873 178824 178476 181092 187385 197840 212824
56864 212824 232771 257799 287999 324689 370386 426426 490638 557126 617311 661558 682473
56853 682473 678786 655725 620865 580194 537986 497981 462678 432468 407117 387499 374729 368630
56841 368630 368580 375289 390313 414397 447788 491793 548782 620757 708523 810701 920869 1025325
56829 1025325 1106034 1148401 1147817 1110165 1047126 970535 889143 808605 732848 664586 604930 553843
56817 553843 511548 478813 455700 441204 434710 436892 448604 469977 501437 544639 601142 670031
56805 670031 746455 821125 881227 914487 915165 886540 837234 775921 709491 643579 581984 525823
$$ packed form
56889E7167J2117J4651J8157K1834K5319K8351K9309K6173J9079J0283J680n886
56877B58234j1346j3603j3239j2105j0950r025o093l049l48K616O293J0455J4984
56864B12824J9947K5028L0200L6690M5697N6040O4212O6488O0185M4247K0915
56853F82473l687k3061l4860m0671m2208m0005l5303l0210k5351j9618j2770o099
56841C68630n0O709J5024K4084L3391M4005N6989P1975Q7766J02178J10168J04456
56829A025325Q0709M2367n84l7652o3039p6591q1392q0538p5757o8262n9656n1087
56817E53843m2295l2735k3113j4496o494K182J1712K1373L1460M3202N6503O8889
56805F70031P6424P4670O0102L3260O78k8625m9306o1313o6430o5912o1595n6161
$$ plain form
56793 525823 474943 430082 392554 362426 338562 320352 308184 302351 302549 308483 320236 338252
56781 338252 363462 396575 435927 476075 509333 528954 531260 516286 487633 450914 410942 370288
56769 370288 330562 293733 261134 232239 205860 181954 161224 143718 129036 117131 107665 99281
56757 99281 90914 83186 77188 72494 67785 62799 58143 53683 48789 43873 40051 37425 35141 33006
56743 33006 31585 30765 29659 28086 26866 26477 26514 26521 26379 25903 25046 24451 24791 25641 25963 25562 25118 25064 25439
56724 25439 26569 28702 31122 32759 33608 34513 35688 36497 36645 36561 36663 37127 38194 39819 41248 41852 42074
56707 42074 42658 43404 43705 43833 44480 45430 45938 46054 46284 46296 45385 44018 43516 44205 45182 45796 46137 46206 45898
56688 45898 45733 46339 47294 47682 47605 47813 48048 47279 45596 44343 44189 44439 44473 44510 44723 44859 45058 45872 47111
$$ packed form
56793E25823n0880m4861l7528l0128k3864j8210j2168n833J98N934J1753J8016
56781C38252K5210L3113L9352M0148L3258J9621K306j4974k8653l6719l9972m0654
56769C70288l9726l6829l2599k8895k6379k3906k0730j7506j4682j1905r466q384
56757I9281q367p728n998m694m709m986m656m460m894m916l822k626k284k135
56743C3006j421q20j106j573j220l89L7Pj42m76q57n95L40Q50L22m01m44n4L75
56724B5439J130K133K420J637Q49R05J175Q09J48q4J02M64J067J625J429O04K22
56707D2074N84P46L01J28O47R50N08J16K30J2r11j367n02O89R77O14L41O9l08
56688D5898j65O06R55L88p7K08K35p69j683j253j54K50L4L7K13J36J99Q14J239
$$ plain form
56669 47111 47726 47141 45854 44622 43934 44243 45726 47821 49887 52142 54997 57819 59608 60670 62271
56654 62271 64814 67745 71075 75478 80789 85921 90425 94795 99125 102827 105842 108831 111926 114538
56640 114538 116480 118059 119005 118657 117281 115889 114724 113292 111830 111178 111116 110465 109029 107862 107359 106707
56624 106707 105558 104616 104115 103286 101855 100610 99937 99198 98070 97113 96498 95558 94077 92707 91610 90112
56608 90112 88182 86846 86516 86267 85394 84374 83697 83029 82194 81744 81950 82352 82729 83332 83854 83613 83169 84203
56590 84203 87123 90257 92096 92847 93125 92704 91556 90698 90886 91544 91950 92434 93562 95128 96785 98678
56574 98678 100719 102260 103200 104466 106702 109402 111912 114293 116686 118893 121105 123977 127571 131383 135848
56559 135848 142458 151812 162797 174170 185570 196410 205403 212065 217366 222102 225906 228607 231103
$$ packed form
56669D7111O15n85j287j232o88L09J483K095K066K255K855K822J789J062J601
56654F2271K543K931L330M403N311N132M504M370M330L702L015K989L095K612
56640A14538J942J579R46l48j376j392j165j432j462o52o2o51j436j167n03o52
56624A06707j149r42n01q29j431j245o73p39j128r57o15r40j481j370j097j498
56608I0112j930j336l30k49q73j020o77o68q35m50K06M02L77O03N22k41m44J034
56590H4203K920L134J839P51K78m21j148q58J88O58M06M84J128J566J657J893
56574I8678K041J541R40J266K236K700K510K381K393K207K212K872L594L812M465
56559A35848O610R354J0985J1373J1400J0840Q993O662N301M736L804K701K496
$$ plain form
56546 231103 234019 236839 239291 242183 245828 248934 250173 249743 248359 245880 242009 237289 232394 227345
56532 227345 222313 218122 215013 211825 207357 201827 196297 191498 187729 184950 182466 179536 176609 174812
56518 174812 174061 173113 171624 170304 168752 165363 160236 155955 154313 154196 153893 153461 153346 152702 150880 149012
56502 149012 148275 147901 146511 144201 141846 139609 137595 136597 136684 136361 134666 132786 132129 132264 132393 133252 135581
56485 135581 138033 138728 137872 136912 136108 134906 133792 133675 134089 133888 133235 133180 133841 134594 135470 136866 138472
56468 138472 139906 141670 144070 146073 146717 146752 147349 148175 148431 148788 150340 152363 153139 152514 151839 151756 151818 151915
56450 151915 152489 153532 154788 156538 158896 160850 161392 161049 161003 161248 160964 160091 159264 158776 158825 159962 162073
56433 162073 163803 164343 164771 166247 167988 168612 168345 168142 167706 166400 165161 165399 166645 167298 167198 167481 168381
$$ packed form
56546B31103K916K820K452K892L645L106J239m30j384k479l871m720m895n049
56532B27345n032m191l109l188m468n530n530m799l769k779k484k930k927j797
56518A74812p51r48j489j320j552l389n127m281j642j17l03m32j15o44j822j868
56502A49012p37l74j390k310k355k237k014r98Q7l23j695j880o57J35J29Q59K329
56485A35581K452O95q56r60q04j202j114j17M14k01o53n5O61P53Q76J396J606
56468A38472J434J764K400K003O44L5N97Q26K56L57J552K023P76o25o75q3O2R7
56450A51915N74J043J256J750K358J954N42l43m6K45k84q73q27m88M9J137K111
56433A62073J730N40M28J476J741O24k67k03m36j306j239K38J246O53j00K83R00
$$ plain form
56416 168381 169069 169305 169467 169367 168699 168212 168740 169569 169440 168599 168257 168573 168887 169379 170747 172722 174525 176242
56398 176242 178210 179779 180373 180966 182669 184604 185090 184176 183054 181727 179403 176615 174797 174160 174051 174966
56382 174966 178205 183848 190980 199403 209173 218942 226808 232490 236812 239648 240387 239835 239435 239014 237403
56367 237403 234815 232505 230537 228158 225961 225396 226333 227292 227791 228404 228854 228314 227314 227127 227535 227347 226728
56350 226728 226773 227166 226673 225677 225788 227115 228290 229009 230075 231163 231068 230139 229976 230701 230970 230719 231401 233374
56332 233374 235486 237404 239935 242865 244861 245763 246694 247792 248160 248132 249151 251179 252584 252896 253395 254760
56316 254760 256315 257837 259894 262204 263805 264903 266505 268367 269536 270639 273092 276259 278105 278630
56302 278630 279876 282519 285286 287930 291816 297116 302135 305931 309051 311345 311746 310710 310243 311019 311814
$$ packed form
56416A68381O88K36J62j00o68m87N28Q29j29q41l42L16L14M92J368J975J803J717
56398A76242J968J569N94N93J703J935M86r14j122j327k324k788j818o37j09R15
56382A74966L239N643P132Q423R770R769P866N682M322K836P39n52m00m21j611
56367B37403k588k310j968k379k197n65R37R59M99O13M50n40j000j87M08j88o19
56350B26728M5L93m93r96J11J327J175P19J066J088r5r29j63P25K69k51O82J973
56332B33374K112J918K531K930J996R02R31J098L68k8J019K028J405L12M99J365
56316B54760J555J522K057K310J601J098J602J862J169J103K453L167J846N25
56302B78630J246K643K767K644L886N300N019L796L120K294M01j036m67P76P95
$$ plain form
56287 311814 312069 312522 313174 313320 313792 316411 320971 325487 329498 334221 339369 343090 345452 348685 353376
56272 353376 357622 360620 363920 368365 372952 377533 383499 390891 397939 404347 411951 421255 430516 439313
56258 439313 449807 463183 477869 492592 508451 526831 547925 572204 600540 632037 664674
56247 664674 698818 737017 779705 824585 871098 921681 977236 1034994 1092447 1149836 1206980
56236 1206980 1261043 1309479 1352225 1389188 1418432 1438537 1449985 1452746 1445458 1428475 1404725 1376097
56224 1376097 1341984 1302744 1261236 1219346 1176260 1131776 1088012 1046136 1004822 963755 925262
56213 925262 890490 857348 824302 792921 764623 738186 712712 689818 670583 653344 636704
56202 636704 621756 609251 597644 586003 575791 567720 560001 551708 544649 539858 535522 530446 526165
$$ packed form
56287C11814K55M53O52J46M72K619M560M516M011M723N148L721K362L233M691
56272C53376M246K998L300M445M587M581N966P392P048O408P604R304R261Q797
56258D39313J0494J3376J4686J4723J5859J8380K1094K4279K8336L1497L2637
56247F64674L4144L8199M2688M4880M6513N0583N5555N7758N7453N7389N7144
56236A206980N4063M8436M2746L6963K9244K0105J1448K761p288j6983k3750k8628
56224A376097l4113l9240m1508m1890m3086m4484m3764m1876m1314m1067l8493
56213I25262l4772l3142l3046l1381k8298k6437k5474k2894j9235j7239j6640
56202F36704j4948j2505j1607j1641j0212q071p719q293p059m791m336n076m281
$$ plain form
56189 526165 523588 521122 518275 517366 519253 521147 521216 521532 523757 525793 525748 525446 526801 528236 528030 527768
56173 527768 529146 530633 530647 530852 533035 535840 537827 540549 545267 549865 552433 554838 559388 565055 570363
56158 570363 576757 585609 594972 602949 611282 622171 634503 646663 659934 675652 692127 707939
56146 707939 725146 745681 767810 789770 813603 841601 872318 904062 939244 981498 1031755
56135 1031755 1091037 1163647 1253249 1358698 1477464 1609514 1753421 1901875 2045560 2178792
56125 2178792 2298012 2399128 2481577 2551736 2617133 2679452 2736560 2787211 2828987 2855760 2863280
56114 2863280 2854987 2837773 2815004 2787865 2759077 2729096 2691501 2637836 2564913 2473455 2363832
56103 2363832 2238937 2107665 1979314 1856905 1740813 1635116 1544308 1467053 1399392 1341256
$$ packed form
56189E26165k577k466k847r09J887J894O9L16K225K036m5l02J355J435k06k62
56173E27768J378J487J4K05K183K805J987K722M718M598K568K405M550N667N308
56158E70363O394Q852R363P977Q333J0889J2332J2160J3271J5718J6475J5812
56146G07939J7207K0535K2129K1960K3833K7998L0717L1744L5182M2254N0257
56135A031755N9282P2610Q9602J05449J18766J32050J43907J48454J43685J33232
56125B178792J19220J01116Q2449P0159O5397O2319N7108N0651M1776K6773P520
56114B863280q293j7214k2769k7139k8788k9981l7595n3665p2923r1458j09623
56103B363832j24895j31272j28351j22409j16092j05697r0808p7255o7661n8136
$$ plain form
56093 1341256 1294009 1254892 1220188 1190920 1169294 1152588 1136830 1123359 1115225 1110181 1103918 1097368
56081 1097368 1094053 1093067 1091479 1090904 1094699 1101229 1106784 1112578 1121937 1133245 1142715 1151606 1163597 1177572
56067 1177572 1190107 1202578 1218648 1237279 1255226 1273659 1295073 1316600 1333878 1348669 1365160
56056 1365160 1381831 1394810 1406066 1420079 1435432 1448050 1459796 1475393 1493805 1511215 1529397
56045 1529397 1552234 1577036 1598533 1618514 1642345 1668998 1693989 1719018 1748833 1781535 1811985
56034 1811985 1841779 1875784 1912008 1945381 1978290 2016517 2058025 2096957 2135388 2179401 2226761
56023 2226761 2270654 2312716 2360002 2411924 2462771 2514178 2572108 2634408 2694711 2755776 2825201
56012 2825201 2900872 2974881 3048908 3130990 3219952 3308355 3398053 3496924 3602901 3707745 3814086
$$ packed form
56093A341256m7247l9117l4704k9268k1626j6706j5758j3471q134n044o263o550
56081A097368l315r86j588n75L795O530N555N794R359J1308R470Q891J1991J3975
56067A177572J2535J2471J6070J8631J7947J8433K1414K1527J7278J4791J6491
56056A365160J6671J2979J1256J4013J5353J2618J1746J5597J8412J7410J8182
56045A529397K2837K4802K1497J9981K3831K6653K4991K5029K9815L2702L0450
56034A811985K9794L4005L6224L3373L2909L8227M1508L8932L8431M4013M7360
56023B226761M3893M2062M7286N1922N0847N1407N7930O2300O0303O1065O9425
56012B825201P5671P4009P4027Q2082Q8962Q8403Q9698R8871J05977J04844J06341
$$ plain form
56001 3814086 3931716 4059404 4188005 4319229 4463063 4618811 4777648 4942014 5122776
55992 5122776 5318964 5520504 5729278 5956526 6201134 6452492 6713359 6997326 7305210
55983 7305210 7627570 7968786 8343703 8752017 9182263 9639661 10142542 10693109 11281229
55974 11281229 11915396 12618463 13394347 14232791 15146033 16165123 17301671 18552616 19942382
55965 19942382 21519046 23310773 25333483 27642967 30331625 33476963 37151548 41484718
55957 41484718 46652118 52805374 60087006 68723050 79033984 91377590 106204541 124191282
55949 124191282 146217827 173224064 206148522 245626978 290793405 337608434 378643084
55942 378643084 405672362 413657103 402935241 378068657 344888416 308270081 271540251
$$ packed form
56001C814086J17630J27688J28601J31224J43834J55748J58837J64366J80762
55992E122776J96188K01540K08774K27248K44608K51358K60867K83967L07884
55983G305210L22360L41216L74917M08314M30246M57398N02881N50567N88120
55974A1281229O34167P03067P75884Q38444R13242J019090J136548J250945J389766
55965A9942382J576664J791727K022710K309484K688658L145338L674585M333170
55957D1484718N167400O153256P281632Q636044J0310934J2343606J4826951J7986741
55949A24191282K2026545K7006237L2924458L9478456M5166427M6815029M1034650
55942C78643084K7029278P984741j0721862k4866584l3180241l6618335l6729830
$$ plain form
55935 271540251 236744201 204977806 176682399 151947497 130678168 112605086 97324822
55928 97324822 84427874 73566436 64415739 56660053 50047674 44405662 39582869 35425325
55920 35425325 31815893 28685854 25970084 23589751 21487823 19639856 18016856 16572155
55912 16572155 15273755 14114896 13082674 12147576 11292454 10521356 9830742 9199926 8617793
55903 8617793 8091538 7620542 7187186 6781611 6411233 6077817 5768284 5475991 5208969
55894 5208969 4969278 4745135 4530985 4335253 4160798 3996981 3838602 3694339 3569083
55885 3569083 3455373 3349358 3258354 3185546 3123468 3069713 3033746 3021354 3026877 3046726 3085268
55874 3085268 3139909 3193785 3230155 3242240 3224613 3169335 3077577 2962733 2835625 2697476 2551574
$$ packed form
55935B71540251l4796050l1766395k8295407k4734902k1269329j8073082j5280264
55928I7324822j2896948j0861438r150697p755686o612379n642012m822793m157544
55920C5425325l609432l130039k715770k380333k101928j847967j623000j444701
55912A6572155j298400j158859j032222r35098q55122p71098o90614o30816n82133
55903H617793n26255m70996m33356m05575l70378l33416l09533k92293k67022
55894E208969k39691k24143k14150j95732j74455j63817j58379j44263j25256
55885C569083j13710j06015r1004p2808o2078n3755l5967j2392N523J9849L8542
55874C085268N4641N3876L6370J2085j7627n5278r1758j14844j27108j38149j45902
$$ plain form
55863 2551574 2408804 2275747 2149184 2027956 1918553 1823402 1735296 1649598 1571233 1503842
55853 1503842 1442616 1383807 1331213 1287244 1247015 1206959 1170305 1138785 1107767 1074595 1043169
55842 1043169 1015656 988356 960024 935376 915913 896197 873677 853358 838192 823708 806811
55831 806811 791117 778697 765216 748393 733044 722596 713478 702781 693489 687126 679136 666794
55819 666794 654240 644559 634237 620565 607259 597504 588487 578018 569743 566514 565082 562510 561521
55806 561521 564548 568782 571998 577105 586110 595739 603855 613838 627653 640705 648687 653480 657182 656376
55792 656376 647901 634798 621046 605617 586977 568275 552709 538601 524266 512943 507510 504712
55780 504712 499773 492562 484495 473892 459527 444809 433560 425300 418855 416475 419965 426907 434927
$$ packed form
55863B551574j42770j33057j26563j21228j09403r5151q8106q5698p8365o7391
55853A503842o1226n8809n2594m3969m0229m0056l6654l1520l1018l3172l1426
55842A043169k7513k7300k8332k4648j9463j9716k2520k0319j5166j4484j6897
55831H06811j5694j2420j3481j6823j5349j0448r118j0697r292o363p990j2342
55819F66794j2554r681j0322j3672j3306r755r017j0469q275l229j432k572r89
55806E61521L027M234L216N107R005R629Q116R983J3815J3052P982M793L702q06
55792F56376q475j3103j3752j5429j8640j8702j5566j4108j4335j1323n433k798
55780E04712m939p211q067j0603j4365j4718j1249q260o445k380L490O942Q020
$$ plain form
55767 434927 445305 457876 466881 466993 459772 449642 437447 422600 407495 394581 382331 368843
55755 368843 356270 347247 340166 332343 324647 318790 313286 306250 299021 292976 286167 277122 268500 262823
55741 262823 258128 252132 247071 245801 246473 245779 244360 244297 244272 242092 239303 238569 238881 237902 236615 237070 237809
55724 237809 236018 232192 228484 224526 219047 213553 210247 208196 205434 202828 202049 201820 200123 198175 198372
55709 198372 200275 202286 205196 210223 215580 218885 221033 223885 226024 224637 219921 213957 207022 198711
55695 198711 190836 185345 180912 175181 168897 164383 161587 159090 157295 157165 157434 156509 155578 156545 158655
55680 158655 160410 162924 167849 173755 178106 181093 184034 185844 184820 182269 180570 179117 175868 171489
55666 171489 168318 166504 164761 163623 164365 165889 166333 166663 169274 174012 178890 183642 189373 195799 202011
$$ packed form
55767D34927J0378J2571R005J12p221j0130j2195j4847j5105j2914j2250j3488
55755C68843j2573r023p081p823p696n857n504p036p229o045o809r045q622n677
55741B62823m695n996n061j270O72o94j419o3k5k180k789p34L12r79j287M55P39
55724B37809j791l826l708l958n479n494l306k051k762k606p79k29j697j948J97
55709A98372J903K011K910N027N357L305K148K852K139j387m716n964o935q311
55695A98711p875n491m433n731o284m514k796k497j795j30K69r25r31R67K110
55680A58655J755K514M925N906M351K987K941J810j024k551j699j453l249m379
55666A71489l171j814j743j138P42J524M44L30K611M738M878M752N731O426O212
$$ plain form
55651 202011 208751 216765 224143 228512 230572 232219 232545 229229 222710 215497 208329 200347 192163 185293
55637 185293 179321 172687 165577 159181 153178 146826 141360 138267 136385 133666 130522 128411 126643 123941
55623 123941 121644 121708 122746 121756 118810 116414 115127 113470 111470 110592 110641 110106 109129 108946 108988 107721 105682
55606 105682 104543 103901 102213 100111 99464 99837 99259 97882 97531 98166 98092 97190 96739 96530 95367 93803 93185
55589 93185 92648 90367 87086 84993 83821 81718 79427 79714 82828 86228 88769 91540 94543 96191 96403
55574 96403 96833 97776 98039 98005 99531 102516 104791 105763 107119 109587 111970 113610 114951 115463 114005 111445
55558 111445 109960 109539 108045 104875 101587 98801 95588 92180 90207 89804 89413 88761 89134 90428 90919 90422
55542 90422 90640 91877 92339 91354 90453 90555 90724 90346 89972 89381 87398 84240 81640 80123 78523 76543 75304
$$ packed form
55651B02011O740Q014P378M369K060J647L26l316o519p213p168p982q184o870
55637A85293n972o634p110o396o003o352n466l093j882k719l144k111j768k702
55623A23941k297O4J038r90k946k396j287j657k000q78M9n35r77j83M2j267k039
55606A05682j139o42j688k102o47L73n78j377l51O35p4r02m51k09j163j564o18
55589I3185n37k281l281k093j172k103k291K87L114L400K541K771L003J648K12
55574I6403M30R43K63l4J526K985K275R72J356K468K383J640J341N12j458k560
55558A11445j485m21j494l170l288k786l213l408j973m03l91o52L73J294M91m97
55542I0422K18J237M62r85r01J02J69l78l74n91j983l158k600j517j600j980j239
$$ plain form
55525 75304 74974 74360 73257 72716 72631 71544 69267 67194 65641 63318 59855 56451 53754 51520 50439 51709
55509 51709 54599 57120 59250 62677 67178 70355 71445 72304 73889 74720 73689 71650 69362 66547 63791
55494 63791 62685 63143 63183 62226 62028 63444 64921 65273 65432 66273 67022 66953 66558 66072 64972 63761 64105 66376
55476 66376 69118 71513 74110 76538 77096 75502 73675 72879 72360 71595 71453 72204 72712 72600 72933 73876 73989
55459 73989 72794 71713 71476 70907 69326 67830 67144 66456 65488 65453 66804 68251 69141 70635 73347 75939
55443 75939 77277 78011 78858 79314 79158 79217 79567 78948 77051 75388 74875 74492 73307 71854 70585 69075 67664
55426 67664 67682 69070 70004 69877 70324 72215 74068 74758 75364 76868 78389 79321 81029 84593 88799 92066
55410 92066 94616 97196 99378 100683 101647 102277 101144 97562 93091 89495 86728 84216 82411 81645 81070
$$ packed form
55525G5304l30o14j103n41q5j087k277k073j553k323l463l404k697k234j081J270
55509E1709K890K521K130L427M501L177J090Q59J585Q31j031k039k288k815k756
55494F3791j106M58M0r57j98J416J477L52J59Q41P49o9l95m86j100j211L44K271
55476F6376K742K395K597K428N58j594j827p96n19p65j42P51N08j12L33R43J13
55459G3989j195j081k37n69j581j496o86o88r68l5J351J447Q90J494K712K592
55443G5939J338P34Q47M56j56N9L50o19j897j663n13l83j185j453j269j510j411
55426F7664J8J388R34j27M47J891J853O90O06J504J521R32J708L564M206L267
55410I2066K550K580K182J305R64O30j133l582m471l596k767k512j805p66n75
$$ plain form
55395 81070 80112 79468 79481 79136 77887 76786 76612 76542 75843 75087 74595 73536 71825 70942 71512 71984 71153 70090
55377 70090 70125 70768 71147 71646 72560 72937 72364 72144 73127 74100 73957 73681 74475 75647 76046 75936 75774 74840 72890
55358 72890 71548 72146 73647 74432 74705 75363 76043 76142 76373 77428 78418 78393 78085 78430 78703 77962 76963 76842 77043
55339 77043 76418 75264 74559 74281 74055 74317 75283 75989 75882 76058 77391 78836 79180 79027 79320 79418 78581 77935
55321 77935 78909 80804 81888 81873 81562 81134 80557 80547 81361 81712 80586 78990 78262 78021 77536 77589 78880 79991
55303 79991 79244 77484 76816 77514 78331 78882 79547 79888 79362 78872 79554 80794 81377 81685 82748 84078 84579 84725
55285 84725 85532 86225 85383 83760 83465 84725 85851 86142 86489 87188 87450 87253 87640 88865 89861 89799 88838 87374
55267 87374 85821 84872 84779 84756 84221 83941 84631 85354 84936 84115 84457 85826 86773 86896 86939 87054 86807 86470 86586
$$ packed form
55395H1070r58o44J3l45j249j101j74p0o99p56m92j059j711q83N70M72q31j063
55377G0090L5O43L79M99R14L77n73k20R83R73j43k76P94J172L99j10j62r34j950
55358G2890j342N98J501P85K73O58O80R9K31J055R90k5l08L45K73p41r99j21K01
55339G7043o25j154p05k78k26K62R66P06j07J76J333J445L44j53K93R8q37o46
55321G7935R74J895J084j5l11m28n77j0Q14L51j126j596p28k41m85N3J291J111
55303G9991p47j760o68O98Q17N51O65L41n26m90O82J240N83L08J063J330N01J46
55285H4725Q07O93q42j623k95J260J126K91L47O99K62j97L87J225R96o2r61j464
55267H7374j553r49r3k3n35k80O90P23m18q21L42J369R47J23M3J15k47l37J16
$$ plain form
55248 86586 86637 85819 84604 83852 83034 81174 78967 77967 78178 78393 78442 79072 80013 80220 79838 79919 80455 80618 80657
55229 80657 81472 82558 82507 81490 81044 81365 80987 79438 78147 78164 78763 78808 78015 76501 74556 73154 73323 74706
55211 74706 75981 76727 77601 78769 79614 80025 80553 81185 81310 80913 80554 80235 79539 78712 78274 77826 76683 75446
55193 75446 75438 76713 78082 78917 79434 79468 78608 77436 77032 77359 77601 77904 79069 80719 81558 81422 81344 81548 81195
55174 81195 80255 79889 80660 81929 83227 84674 85911 86139 85541 85192 85370 85340 84940 84960 85754 86859 88055 89451
55156 89451 90503 90428 89675 89611 90616 91839 92748 93513 93993 93932 94064 95310 96924 97182 95987 94956 94738 94140
55138 94140 92345 90224 88836 88204 88116 88676 89514 89737 89187 88604 88285 87812 87243 87228 87736 88025 88087 88754 90198
55119 90198 91677 92836 93798 93990 92585 90288 88952 89084 89358 88933 88524 88750 89126 89297 89726 90554 91212
$$ packed form
55248H6586N1q18j215p52q18j860k207j000K11K15M9O30R41K07l82Q1N36J63L9
55229H0657Q15J086n1j017m46L21l78j549j291J7N99M5p93j514j945j402J69J383
55211G4706J275P46Q74J168Q45M11N28O32J25l97l59l19o96q27m38m48j143j237
55193G5446qJ275J369Q35N17L4q60j172m04L27K42L03J165J650Q39j36p8K04l53
55174H1195r40l66P71J269J298J447J237K28n98l49J78l0m00K0P94J105J196J396
55156H9451J052p5p53o4J005J223R09P65M80o1J32J246J614K58j195j031k18n98
55138I4140j795k121j388o32q8N60Q38K23n50n83l19m73n69j5N08K89O2O67J444
55119I0198J479J159R62J92j405k297j336J32K74m25m09K26L76J71M29Q28O58
$$ plain form
55102 91212 91645 92463 93477 93660 93094 93304 94970 96805 97475 97201 96686 95847 94512 93178 92274 91602 91143
55085 91143 91428 92623 94235 96012 98064 99847 100362 99652 98820 98261 97333 96043 95456 95858 96113 95552 95046
55068 95046 95388 96010 96118 95842 95454 94621 93281 92186 91841 91855 91906 92287 92982 93293 92991 92729 92852 92901 92747
55049 92747 93002 93796 94377 94391 94394 94623 94626 94528 95260 96933 98376 98935 99290 99852 99834 98784 97618 97193 97135 96991
55029 96991 97265 98335 99510 100115 100445 100736 100353 98958 97466 96824 96814 96951 97554 98911 100263 100660 100150
55012 100150 99346 98523 97809 97540 97747 98060 98558 99836 101712 102931 102776 102030 101773 102160 102934 104080 105337
54995 105337 106062 106164 106271 106578 106633 106548 107097 108148 108478 107708 106925 106725 106290 105302 105079 106624 108975 110742
54977 110742 111936 113067 113763 113678 113605 114204 114652 114034 113161 113548 115252 117074 118282 118898 118926 118536 118484 119216
$$ packed form
55102I1212M33Q18J014J83n66K10J666J835O70k74n15q39j335j334r04o72m59
55085I1143K85J195J612J777K052J783N15p10q32n59r28j290n87M02K55n61n06
55068I5046L42O22J08k76l88q33j340j095l45J4N1L81O95L11l02k62J23M9j54
55049I2747K55P94N81J4LK29Lr8P32J673J443N59L55N62j8j050j166m25n8j44
55029I6991K74J070J175O05L30K91l83j395j492o42j0J37O03J357J352L97n10
55012A00150q04q23p14k69K07L13M98J278J876J219j55p46k57L87P74J146J257
54995A05337P25J02J07L07N5q5N49J051L30p70p83k00m35r88k23J545K351J767
54977A10742J194J131O96q5p3N99M48o18q73L87J704J822J208O16K8l90n2P32
$$ plain form
54959 119216 120001 119902 119106 118409 118064 118020 118604 119972 121401 122088 122140 122070 121975 121874 122052 122315 121752 120142 118769
54940 118769 118869 120040 121046 121458 121581 121586 121708 122618 124612 127032 129232 131508 134368 137717 141503 146207
54924 146207 151881 157713 163492 170478 179689 190191 200200 208968 216481 222156 225183 225546 223611 219276
54910 219276 212610 204655 196493 188100 179128 170188 162346 155935 150785 146951 144290 142018 139643 137641
54896 137641 136325 134978 133097 131512 131053 130988 130178 129053 129090 130856 133805 137457 141529 145432 148874 152615
54880 152615 157610 163917 171276 179969 189964 199967 208548 215544 221202 224761 225275 223138 219407 214198
54866 214198 207173 199030 191034 183511 176175 169459 164043 159473 154720 149814 145502 141663 137542 133335
54852 133335 130001 127599 125259 122745 120734 119496 118555 117663 116938 116070 114552 112742 111620 111445 111615 111767
$$ packed form
54959A19216P85r9p96o97l45m4N84J368J429O87N2p0r5j01J78K63n63j610j373
54940A18769J00J171J006M12J23NJ22R10J994K420K200K276K860L349L786M704
54924A46207N674N832N779O986R211J0502J0009Q768P513N675L027L63j935m335
54910B19276o666p955q162q393q972q940p842o411n150l834k661k272k375k002
54896A37641j316j347j881j585m59o5q10j125L7J766K949L652M072L903L442L741
54880A52615M995O307P359Q693R995J0003Q581O996N658L559N14k137l731n209
54866B14198p025q143p996p523p336o716n416m570m753m906m312l839m121m207
54852A33335l334k402k340k514k011j238r41q92p25q68j518j810j122j75J70J52
$$ plain form
54836 111767 112056 112459 112831 113525 114949 116586 117393 117129 116435 115756 115056 114370 113809 113211 112559 112416 113181 114331
54818 114331 115206 116008 117085 117875 117662 116778 115924 114933 113516 112582 113269 115024 116204 116398 116693 117752 119079
54801 119079 120202 121179 121882 121981 121765 121864 122189 122178 121933 121972 122044 121456 120435 119927 120120 120447 120932 122165 123923
54782 123923 125200 125767 126483 127825 129324 130677 132312 134546 137080 139614 142238 145205 149025 154536 162032
54767 162032 170601 179274 188365 198571 209131 218262 225154 230200 233446 234270 232543 228736 222956 215223
54753 215223 206602 198557 191159 183426 175478 168792 164124 160700 157713 155172 152997 150761 148668 147413
54739 147413 146772 145799 144718 145019 147145 149625 151107 151865 152615 153328 154048 155593 158488 162249 166539 172003
54723 172003 179142 187269 195398 203262 210682 216763 220570 221985 221253 218378 213565 207595 201114 194177
$$ packed form
54836A11767K89M03L72O94J424J637Q07k64o94o79p00o86n61n98o52j43P65J150
54818A14331Q75Q02J077P90k13q84q54r91j417r34O87J755J180J94K95J059J327
54801A19079J123R77P03R9k16R9L25j1k45L9P2n88j021n08J93L27M85J233J758
54782A23923J277N67P16J342J499J353J635K234K534K534K624K967L820N511P496
54767A62032Q569Q673R091J0206J0560R131O892N046L246Q24j727l807n780p733
54753B15223q621q045p398p733p948o686m668l424k987k541k175k236k093j255
54739A47413o41r73j081L01K126K480J482P58P50P13P20J545K895L761M290N464
54723A72003P139Q127Q129P864P420O081L807J415p32k875m813n970o481o937
$$ plain form
54709 194177 186921 180018 173929 168379 163109 158468 154759 151609 148496 145416 142577 139947 137487 135387
54695 135387 133794 132725 132351 132774 133422 133365 132368 131031 129873 129008 128656 129030 129604 129493 128733 128274 128578 129170
54677 129170 129710 130359 130853 130429 129070 127713 126742 125429 123385 121409 120207 119357 118340 117663 118044 119212
54661 119212 120341 121092 121456 121163 120010 118443 117251 116963 117839 119844 122296 124155 125114 125897 127102 128397
54645 128397 129163 129310 129039 128442 127784 127552 127837 128180 128370 128748 129419 129822 129489 128611 127445 125874 123992 122555
54627 122555 122320 123319 125027 126825 128138 128729 128999 129419 129620 128839 127372 126584 127159 128255 128790 128721 128582
54610 128582 128616 128896 129576 130454 130923 130792 130589 130675 130717 130368 129790 129207 128636 128366 128948 130303 131604 132386 133071
54591 133071 134093 135271 136334 137244 137713 137293 136254 135486 135209 134820 134310 134600 135872 136865 136681 136195 136713
$$ packed form
54709A94177p256o903o089n550n270m641l709l150l113l080k839k630k460k100
54695A35387j593j069l74M23O48n7r97j337j158q65l52L74N74j11p60m59L04N92
54677A29170N40O49M94m24j359j357r71j313k044j976j202q50j017o77L81J168
54661A19212J129P51L64k93j153j567j192k88Q76K005K452J859R59P83J205J295
54645A28397P66J47k71n97o58k32K85L43J90L78O71M03l33q78j166j571j882j437
54627A22555k35R99J708J798J313N91K70M20K01p81j467p88N75J096N35o9j39
54610A28582L4K80O80Q78M69j31k03Q6M2l49n78n83n71k70N82J355J301P82O85
54591A33071J022J178J063R10M69m20j039p68k77l89n10K90J272R93j84m86N18
$$ plain form
54574 136713 138108 139317 139961 140400 140771 140839 140457 139457 137594 135231 133530 133303 134202 135534 137218 139286
54558 139286 141154 142206 142571 142680 142550 142104 141606 141127 140241 138926 138070 138333 139129 139571 139844 140760 142449
54541 142449 144391 146373 148584 150993 153318 155359 156844 157355 157022 156840 157584 158811 159535 159543 159393 159484 159768
54524 159768 160143 160512 160704 160715 160713 160515 159540 157660 155506 153576 151753 150144 149490 150007 150633 150374 149694 149581
54506 149581 149800 149280 147905 146783 146745 147485 148223 148462 148058 147274 146849 147463 149009 150741 152077 152919 153281
54489 153281 153032 152095 150783 149870 150181 151689 153229 153730 153664 154422 156241 157827 158370 158736 160016 161961 163762
54472 163762 165423 167334 169154 170348 171357 173086 175400 177119 177473 176874 176329 176670 178134 180140 181617
54457 181617 182048 181909 181822 181776 181639 181737 182189 182222 181006 178825 176668 175034 173823 173030 172667 172266 171320 170161
$$ packed form
54574A36713J395J209O44M39L71O8l82j000j863k363j701k27Q99J332J684K068
54558A39286J868J052L65J09j30m46m98m79q86j315q56K63P96M42K73R16J689
54541A42449J942J982K211K409K325K041J485N11l33j82P44J227P24Qj50R1K84
54524A59768L75L69J92J1kj98r75j880k154j930j823j609o54N17O26k59o80j13
54506A49581K19n20j375j122l8P40P38K39m04p84m25O14J546J732J336Q42L62
54489A53281k49r37j312r13L11J508J540N01o6P58J819J586N43L66J280J945J801
54472A63762J661J911J820J194J009J729K314J719L54n99n45L41J464K006J477
54457A81617M31j39q7m6j37R8M52L3j216k181k157j634j211p93l63m01r46j159
$$ plain form
54439 170161 169674 170125 170822 170884 169939 168247 166540 165543 165298 165201 165019 165380 166791 168598 169560 169211 168195 167436
54421 167436 167345 167615 167555 166851 166102 166135 166805 167159 166806 166214 165545 164333 162707 161737 161902 162385 162603 163258 164938
54402 164938 166895 168313 169716 171832 174018 175235 175782 176589 177479 177685 177568 178156 179256 179594 178783 177721
54386 177721 177044 176538 176091 175955 175919 175378 174335 173310 172293 170902 169603 169442 170384 171118 170925 170618 171135
54369 171135 172174 172856 173034 173303 174083 175215 176258 176909 177177 177157 176682 175548 174239 173806 174524 175227 174664
54352 174664 173003 171300 170003 168897 168081 167890 168063 167957 167522 167216 167116 166967 166858 166969 166835 165905 164649
54335 164649 164136 164564 165227 165908 167222 169339 171361 172302 172067 171281 170713 170814 171284 171146 169886 168282 167460
54318 167460 167370 167010 165891 164394 162896 161456 160255 159420 158576 157486 156880 157568 158922 159445 158797 158021 157741
$$ packed form
54439A70161m87M51O97O2r45j692j707r97k45r7j82L61J411J807R62l49j016p59
54421A67436r1K70o0p04p49L3O70L54l53n92o69j212j626r70J65M83K18O55J680
54402A64938J957J418J403K116K186J217N47Q07Q90K06j17N88J100L38q11j062
54386A77721o77n06m47j36l6n41j043j025j017j391j299j61R42P34j93l07N17
54369A71135J039O82J78K69P80J132J043O51K68k0m75j134j309m33P18P03n63
54352A74664j661j703j297j106q16j91J73j06m35l06j00j49j09J11j34r30j256
54335A64649n13M28O63O81J314K117K022R41k35p86n68J01M70j38j260j604q22
54318A67460r0l60j119j497j498j440j201q35q44j090o06O88J354N23o48p76k80
$$ plain form
54301 157741 157491 157022 156932 157544 158314 158900 159778 161215 162515 162882 162303 161083 159214 156806 154586 153419 153594
54284 153594 154766 156212 157040 156718 155609 154568 153978 153638 153493 153756 154366 155034 155856 157101 158381 158868 158460
54267 158460 157934 157780 157704 157470 157408 157796 158451 159206 160187 161365 162412 163183 163806 164268 164496 164810 165573 166400 166512
54248 166512 165902 165357 165208 164946 164171 163105 162014 160982 160392 160767 161919 163023 163607 163672 162858 160636 157551
54231 157551 155142 154215 154109 154050 154219 154999 156105 157039 157617 157623 156826 155806 155851 157365 159092 159533 158540 156986
54213 156986 155591 154620 154066 153530 152449 150965 149998 150046 150574 151035 151704 152921 154169 154705 154566 154273 153968
54196 153968 153526 153115 152999 153078 153127 153230 153486 153624 153366 152907 152589 152443 152442 152904 154143 155898 157534 158641 159230
54177 159230 159495 159585 159418 158636 157048 155117 153652 152915 152462 151900 151273 150618 149752 148712 147859 147311 146800 146286
$$ packed form
54301A57741k50m69r0O12P70N86Q78J437J300L67n79j220j869k408k220j167J75
54284A53594J172J446Q28l22j109j041n90l40j45K63O10O68Q22J245J280M87m08
54267A58460n26j54p6k34o2L88O55P55R81J178J047P71O23M62K28L14P63Q27J12
54248A66512o10n45j49k62p75j066j091j032n90L75J152J104N84O5q14k222l085
54231A57551k409r27j06n9J69P80J106R34N78Op97j020M5J514J727M41r93j554
54213A56986j395r71n54n36j081j484r67M8N28M61O69J217J248N36j39k93l05
54196A53968m42m11j16P9M9J03K56J38k58m59l18j46jM62J239J755J636J107N89
54177A59230K65R0j67p82j588j931j465p37m53n62o27o55q66j040q53n48n11n14
$$ plain form
54159 146286 146197 146780 147712 148538 149020 148970 148282 147360 146926 147148 147429 147246 146686 146094 145775 146125 147405 149217 150841
54140 150841 152201 153767 155453 156521 156782 156938 157355 157427 156700 155759 155410 155681 156199 156887 157660 158034 157680 156901
54122 156901 156110 155341 154718 154763 155686 156912 157805 158405 159010 159619 160257 161231 162516 163457 163645 163561 163786 164114 164118
54103 164118 164095 164661 165724 166570 166796 166646 166495 166423 166174 165353 163889 162384 161622 161591 161527 161053 160652 160779 161249
54084 161249 161860 162850 164270 165560 166289 166716 167150 167438 167606 168314 169952 171850 173078 173615 174097 174828 175657
54067 175657 176409 176908 176937 176718 176948 177834 178538 178193 177107 176410 176857 178445 180722 182955 184420 185097 185733
54050 185733 186813 187984 188926 190139 192221 194919 197629 200432 203974 208732 215026 223222 233267 244483
54036 244483 256586 270321 286195 302900 317906 329385 336789 339947 338801 334164 327780 321239 315224
$$ packed form
54159A46286q9N83R32Q26M82n0o88r22m34K22K81j83n60n92l19L50J280J812J624
54140A50841J360J566J686J068K61J56M17P2p27r41l49K71N18O88P73L74l54p79
54122A56901p91p69o23M5R23J226Q93O00O05O09O38R74J285R41J88q4K25L28M
54103A64118k3N66J063Q46K26j50j51p2k49q21j464j505p62l1o4m74m01J27M70
54084A61249O11R90J420J290P29M27M34K88J68P08J638J898J228N37M82P31Q29
54067A75657P52M99K9k19K30Q86P04l45j086o97M47J588K277K233J465O77O36
54050A85733J080J171R42J213K082K698K710K803L542M758O294Q196J0045J1216
54036B44483J2103J3735J5874J6705J5006J1479P404L158j146m637o384o541o015
$$ plain form
54023 315224 309840 305128 301152 297983 295688 294137 292875 291424 289595 287443 285205 283405 282464 281897 280417
54008 280417 277282 273077 268765 264519 260054 255530 251404 247743 244333 241134 238037 234615 230823 227617
53994 227617 226040 225874 225901 225369 224552 223910 223388 222628 221458 220035 218700 217644 216612 215214 213570 212160
53978 212160 210943 209289 207069 205004 203517 202068 200296 198976 198958 199811 200418 200442 200234 199803 198933 198019 197763
53961 197763 198185 198820 199668 201018 202499 203286 203289 203249 203657 204329 205053 205924 206996 208278 210045 212473 215014
53944 215014 216869 218088 219558 221877 224903 228368 232211 236203 239918 243286 246692 250421 254448 258742
53930 258742 263310 267879 271977 275397 278237 280632 282815 285233 288123 291150 294053 297478 302544 309556
53916 309556 317677 325915 333922 341834 349716 357297 364009 369373 373535 377229 380987 384611 387623 389811
$$ packed form
54023C15224n384m712l976l169k295j551j262j451j829k152k238j800r41n67j480
54008B80417l135m205m312m246m465m524m126l661l410l199l097l422l792l206
53994B27617j577j66K7n32q17o42n22p60j170j423j335j056j032j398j644j410
53978B12160j217j654k220k065j487j449j772j320j8Q53O07K4k08m31q70r14k56
53961A97763M22O35Q48J350J481P87Lm0M08O72P24Q71J072J282J767K428K541
53944B15014J855J219J470K319L026L465L843L992L715L368L406L729M027M294
53930B58742M568M569M098L420K840K395K183K418K890L027K903L425N066P012
53916C09556Q121Q238Q007P912P882P581O712N364M162L694L758L624L012K188
$$ plain form
53902 389811 391083 391293 390609 389530 388068 385564 381868 378073 375349 373608 372043 370369 368615 366247 362630
53887 362630 358066 353420 349040 345019 342055 340861 340932 341192 341791 344110 349065 356668 367182 381130 397498
53872 397498 413027 424002 428218 425171 415534 401066 384121 366417 348573 330970 314415 299637
53860 299637 286826 276033 267381 260547 254652 249144 244286 240435 237360 234617 232092 229828 227735 225848
53846 225848 224402 223356 222206 220629 218949 217686 216948 216498 216086 215443 214265 212565 210899 210025 210294 211380
53830 211380 212495 212984 212892 212796 212925 212773 211929 210889 210459 210613 210635 210262 209959 210091 210512 211069 211821 212650 213210
53811 213210 213431 213588 213778 213827 213771 213942 214538 215656 217770 221538 226942 233121 239193 244806 249856 254239
53795 254239 258116 261966 266254 271279 277233 283881 290226 295107 298237 300199 301529 302401 303112 304031 304890
$$ packed form
53902C89811J272K10o84j079j462k504l696l795k724j741j565j674j754k368l617
53887C62630m564m646m380m021k964j194P1K60N99K319M955P603J0514J3948J6368
53872C97498J5529J0975M216l047r637j4468j6945j7704j7844j7603j6555j4778
53860B99637j2811j0793q652o834n895n508m858l851l075k743k525k264k093j887
53846B25848j446j046j150j577j680j263p38m50m12o43j178j700j666q74K69J086
53830B11380J115M89r2r6J29j52q44j040m30J54K2l73l03J32M21N57P52Q29N60
53811B13210K21J57J90M9n6J71N96J118K114L768N404O179O072N613N050M383
53795B54239L877L850M288N025N954O648O345M881L130J962J330Q72P11R19Q59
$$ plain form
53780 304890 304857 303606 301698 299664 297319 294271 290562 286435 282028 277684 274114 271742 270126 268365 265932
53765 265932 262921 259736 256789 254333 252336 250489 248371 245646 242250 238518 234975 231851 229011 226440
53751 226440 224420 222940 221462 219702 218195 217534 217458 217307 216975 216702 216297 215392 214215 213271 212515 211669 211084
53734 211084 211284 211842 211811 211286 211430 212802 214700 216386 217916 219378 220304 220388 220082 219975 220185 220665 221496 222513
53716 222513 223224 223480 223708 224212 224799 225338 226150 227467 228972 230172 230902 231331 231875 233152 235487 238329 240664
53699 240664 242124 243264 244786 247030 250107 253861 257659 260898 263764 266756 269549 271170 271381 270965 270491
53684 270491 269704 268462 267388 267131 267633 268451 269211 269555 269302 268851 268751 268804 268399 267802 268057 269309 270285 269929
53666 269929 268616 267200 265810 264276 262941 262263 262129 262200 262401 262592 262349 261664 261300 261823 262753 263287 263405
$$ packed form
53780C04890l3j251j908k034k345l048l709m127m407m344l570k372j616j761k433
53765B65932l011l185k947k456j997j847k118k725l396l732l543l124k840k571
53751B26440k020j480j478j760j507o61p6j51l32k73m05r05j177r44p56q46n85
53734B11084K00N58l1n25J44J372J898J686J530J462R26Q4l06j07K10M80Q31J017
53716B22513P11K56K28N04N87N39Q12J317J505J200P30M29N44J277K335K842K335
53699B40664J460J140J522K244L077L754L798L239K866K992K793J621K11m16m74
53684B70491p87j242j074k57N02Q18P60L44k53m51j00N3m05n97K55J252R76l56
53666B69929j313j416j390j534j335o78j34P1K01J91k43o85l64N23R30N34J18
$$ plain form
53649 263405 263640 264089 264281 263872 263024 262175 261705 261704 261915 262064 262195 262451 262745 263054 263764 264975 265782 265239 263952
53630 263952 263637 264905 266606 267561 267842 267994 268224 268878 270631 273417 276069 277756 279008 280706 282876 285154
53614 285154 287675 290698 293968 297128 300246 303410 306401 309234 312342 315803 319160 322444 326433 331280
53600 331280 335828 339010 341107 342893 344423 345489 346402 347424 348197 348557 349134 350235 350980 350562 349523 348707
53584 348707 347746 345914 343770 342480 341926 340951 339302 337994 337752 338260 339009 339801 340361 340430 340361 340792 341658 342299
53566 342299 342572 343043 344043 345286 346542 347945 349485 350767 351380 351155 350059 348235 346082 343986 342198
53551 342198 341185 341542 343023 344327 344583 344570 345541 347288 348438 348460 348308 349044 350817 353279 356119 359006
53535 359006 361783 364950 369267 374632 380019 384759 389409 395040 402119 410314 419034 427876 436744 445791
$$ packed form
53649B63405K35M49J92m09q48q49m70jK11J49J31K56K94L09P10J211Q07n43j287
53630B63952l15J268J701R55K81J52K30O54J753K786K652J687J252J698K170K278
53614B85154K521L023L270L160L118L164K991K833L108L461L357L284L989M847
53600C31280M548L182K097J786J530J066R13J022P73L60N77J101P45m18j039q16
53584C48707r61j832k144j290n54r75j649j308k42N08P49P92N60O9o9M31Q66O41
53566C42299K73M71J000J243J256J403J540J282O13k25j096j824k153k096j788
53551C42198j013L57J481J304K56j3R71J747J150K2j52P36J773K462K840K887
53535C59006K777L167M317N365N387M740M650N631P079Q195Q720Q842Q868R047
$$ plain form
53521 445791 455264 465396 476383 488262 500748 513526 526810 541242 557079 573900 591321 609487
53509 609487 628578 648452 669158 691219 714819 739136 763016 786036 808463 830657 852876
53498 852876 875198 897136 917891 937442 956772 976529 996216 1015270 1034104 1053191 1071913
53487 1071913 1089407 1105970 1122606 1139613 1156729 1174186 1192357 1210564 1227440 1242550 1256718
53476 1256718 1270757 1284726 1298311 1311040 1322168 1331145 1338148 1343579 1347347 1349383 1350332 1350635 1349252
53463 1349252 1344480 1335910 1324535 1311184 1296118 1280041 1264067 1248379 1232063 1214520 1195989 1176505
53451 1176505 1155584 1133373 1110984 1089174 1067585 1045833 1024444 1004035 984371 964960 946063
53440 946063 928449 912404 897513 883215 869392 856601 845818 837626 831583 826713 822538 819203
$$ packed form
53521D45791R473J0132J0987J1879J2486J2778J3284J4432J5837J6821J7421J8166
53509F09487J9091J9874K0706K2061K3600K4317K3880K3020K2427K2194K2219
53498H52876K2322K1938K0755J9551J9330J9757J9687J9054J8834J9087J8722
53487A071913J7494J6563J6636J7007J7116J7457J8171J8207J6876J5110J4168
53476A256718J4039J3969J3585J2729J1128Q977P003N431L768K036R49L03j383
53463A349252m772q570j1375j3351j5066j6077j5974j5688j6316j7543j8531j9484
53451A176505k0921k2211k2389k1810k1589k1752k1389k0409j9664j9411j8897
53440I46063j7614j6045j4891j4298j3823j2791j0783q192o043m870m175l335
$$ plain form
53428 819203 816845 815465 815382 817043 820380 824992 830997 838941 848782 859778 871595 884828 900165 917641
53414 917641 936876 957435 978765 1000406 1022567 1046006 1071194 1097983 1126070 1155205 1185021
53403 1185021 1215397 1247001 1280750 1316698 1354307 1393815 1436291 1482024 1529853 1578561 1628083
53392 1628083 1678808 1730554 1782942 1836089 1890174 1944690 1998771 2051941 2104010 2154533 2202931
53381 2202931 2248947 2292619 2333992 2373154 2410228 2445026 2476937 2505504 2530889 2553486 2573232
53370 2573232 2589565 2601928 2610103 2614125 2613937 2608949 2598006 2580036 2554835 2522989 2485162 2441844
53358 2441844 2393784 2342193 2288272 2232796 2176242 2119127 2062142 2006055 1951312 1897589 1844079
53347 1844079 1790620 1738179 1687743 1639027 1590939 1543009 1495619 1449065 1403403 1359236 1317614
$$ packed form
53428H19203k358j380q3J661L337M612O005P944R841J0996J1817J3233J5337J7476
53414I17641J9235K0559K1330K1641K2161K3439K5188K6789K8087K9135K9816
53403A185021L0376L1604L3749L5948L7609L9508M2476M5733M7829M8708M9522
53392A628083N0725N1746N2388N3147N4085N4516N4081N3170N2069N0523M8398
53381B202931M6016M3672M1373L9162L7074L4798L1911K8567K5385K2597J9746
53370B573232J6333J2363Q175M022j88m988j0943j7970k5201l1846l7827m3318
53358B441844m8060n1591n3921n5476n6554n7115n6985n6087n4743n3723n3510
53347A844079n3459n2441n0436m8716m8088m7930m7390m6554m5662m4167m1622
$$ plain form
53336 1317614 1278791 1241866 1206020 1171515 1139138 1109262 1081802 1056650 1033814 1013388 995560
53325 995560 980303 967113 955486 945586 937777 931499 925341 918458 911293 904724 899168 894786 891889
53312 891889 890664 890907 892353 894944 898623 903306 909122 916236 924292 932616 941085 950258 960545 971917
53298 971917 984595 999292 1016363 1035293 1055380 1076441 1098553 1121641 1145711 1171027 1197672
53287 1197672 1225270 1253410 1281837 1309961 1336679 1361142 1383371 1403787 1422519 1439511 1454959
53276 1454959 1469166 1482002 1492778 1500655 1505215 1506747 1505958 1503214 1498212 1490618 1480681 1468784 1454698
53263 1454698 1437961 1418757 1397632 1374541 1349104 1321798 1293820 1265577 1236286 1205462 1173867
53252 1173867 1142472 1111263 1079752 1048096 1017074 987207 958412 930336 902777 875899 850056
$$ packed form
53336A317614l8823l6925l5846l4505l2377k9876k7460k5152k2836k0426j7828
53325I95560j5257j3190j1627r900p809o278o158o883p165o569n556m382k897
53312H91889j225K43J446K591L679M683N816P114Q056Q324Q469R173J0287J1372
53298I71917J2678J4697J7071J8930K0087K1061K2112K3088K4070K5316K6645
53287A197672K7598K8140K8427K8124K6718K4463K2229K0416J8732J6992J5448
53276A454959J4207J2836J0776P877M560J532p89k744n002p594r937j1897j4086
53263A454698j6737j9204k1125k3091k5437k7306k7978k8243k9291l0824l1595
53252A173867l1395l1209l1511l1656l1022k9867k8795k8076k7559k6878k5843
$$ plain form
53241 850056 825140 800322 774967 749590 725185 701777 678679 656141 635543 617496 600858
53230 600858 584262 567825 552691 539614 528583 519197 510694 502167 493376 485025 477801 471560 465774
53217 465774 460114 454152 447161 438818 429653 420321 410972 401771 393383 386260 379935 373675 367450 361721
53203 361721 356683 352244 348321 344630 340570 335842 330846 326050 321417 316917 313039 310131 307699 305026
53189 305026 302158 299616 297417 295066 292346 289534 286924 284610 282596 280729 278700 276423 274214 272339
53175 272339 270694 269245 268332 268094 267988 267398 266437 265631 265065 264307 263090 261674 260646 260545 261392 262450 262742
53158 262742 261981 260589 258759 256252 253392 251426 251197 252000 252448 252027 251151 250110 248781 247203 245717 244561
53142 244561 243803 243531 243648 243630 242943 241654 240300 239348 239031 239441 240365 241224 241581 241538 241388 241156 240835 240775 241373
$$ packed form
53241H50056k4916k4818k5355k5377k4405k3408k3098k2538k0598j8047j6638
53230F00858j6596j6437j5134j3077j1031r386q503q527q791q351p224o241n786
53217D65774n660n962o991q343r165r332r349r201q388p123o325o260o225n729
53203C61721n038m439l923l691m060m728m996m796m633m500l878k908k432k673
53189C05026k868k542k199k351k720k812k610k314k014j867k029k277k209j875
53175B72339j645j449r13k38j06n90r61q06n66p58j217j416j028j01Q47J058K92
53158B62742p61j392j830k507k860j966k29Q03M48m21q76j041j329j578j486j156
53142B44561p58k72J17j8o87j289j354r52l17M10R24Q59L57m3j50k32l21o0N98
$$ plain form
53123 241373 242508 243652 244499 245240 246286 247842 249566 250665 250639 249989 249779 250419 251368 252027 252371 252545 252563
53106 252563 252696 253445 254680 255381 254692 252737 250037 246665 242544 238118 234214 231466 230076 229735 229590 228912
53090 228912 228018 227927 228813 229607 229494 228958 228851 229274 230038 231417 233562 235754 237073 237441 237385 237248 237220 237583
53072 237583 238231 238504 238187 238141 239132 240545 241085 240356 238985 237641 236741 236766 237891 239456 240545 240991 241283
53055 241283 241694 242040 242063 241537 240286 238483 236624 234937 233327 232133 232064 232904 233231 232182 230601 229619 228955
53038 228955 227674 225820 224092 222562 220938 219594 219062 218919 218389 217719 217738 218352 218698 218547 218368 218213 217789
53021 217789 217471 217923 218795 219047 218593 218355 218659 218852 218738 219079 220275 221635 222393 222520 222154 221170 219795 218840
53003 218840 218788 219138 219005 218029 216585 215515 215576 216685 217831 218274 218562 219639 221323 222616 223289 224051 225188
$$ packed form
53123B41373J135J144Q47P41J046J556J724J099k6o50k10O40R49O59L44J74J8
53106B52563J33P49J235P01o89j955k700l372m121m426l904k748j390l41j45o78
53090B28912q94r1Q86P94j13n36j07M23P64J379K145K192J319L68n6j37k8L63
53072B37583O48K73l17m6R91J413N40p29j371j344r00K5J125J565J089M46K92
53055B41283M11L46K3n26j251j803j859j687j610j194o9Q40L27j049j581r82o64
53038B28955j281j854j728j530j624j344n32j43n30o70J9O14L46j51j79j55m24
53021B17789l18M52Q72K52m54k38L04J93j14L41J196J360P58J27l66r84j375r55
53003B18840n2L50j33r76j444j070O1J109J146M43K88J077J684J293O73P62J137
$$ plain form
52986 225188 226174 226732 227213 227740 227963 227937 228273 229122 229920 230380 230924 231802 232678 233408 234442 236020 237621 238626
52968 238626 238965 238885 238630 238495 238578 238383 237346 235881 235161 235756 237133 238572 239698 239963 238672 235961 233037
52951 233037 230982 229871 229273 228916 228570 227985 227251 226669 226040 224807 223093 221826 221497 221532 221250 220776 220578
52934 220578 220750 221156 221737 222311 222556 222519 222623 222954 223104 222938 222895 223253 223678 223801 223621 223147 222239 221134 220482
52915 220482 220541 220891 221157 221408 221559 221127 219990 218770 218038 217629 217122 216479 215859 215267 214746 214519 214690 215169
52897 215169 216024 217376 218866 219870 220398 221114 222260 223337 224103 225081 226587 228001 228536 228214 227604 227087
52881 227087 226770 226635 226349 225415 223870 222397 221444 220755 220034 219517 219519 219981 220735 221730 222708 223345 223950 225363
52863 225363 227738 230141 231773 232913 234163 235478 236600 237836 239654 241854 243730 244724 244517 242887 240015
$$ packed form
52986B25188R86N58M81N27K23k6L36Q49P98M60N44Q78Q76P30J034J578J601J005
52968B38626L39q0k55j35Q3j95j037j465p20N95J377J439J126K65j291k711k924
52951B33037k055j111n98l57l46n85p34n82o29j233j714j267l29L5k82m74j98
52934B20578J72M06N81N74K45l7J04L31J50j66m3L58M25J23j80m74r08j105o52
52915B20482N9L50K66K51J51m32j137j220p32m09n07o43o20n92n21k27J71M79
52897B15169Q55J352J490J004N28P16J146J077P66R78J506J414N35l22o10n17
52881B27087l17j35k86r34j545j473r53o89p21n17KM62P54R95R78O37O05J413
52863B25363K375K403J632J140J250J315J122J236J818K200J876R94k07j630k872
$$ plain form
52848 240015 236606 233290 230226 227509 225440 223992 222563 220712 218656 216681 214647 212574 211047 210420
52834 210420 210163 209631 209013 208822 208908 208795 208685 209290 210758 212427 213623 214198 214305 214090 213607 212792 211607 210356
52816 210356 209565 209339 209251 209124 209524 211058 213647 216890 220763 225405 230426 234878 237744 238281 236342 232768
52800 232768 229072 226217 223921 221503 218985 216900 215385 214096 212791 211486 210136 208648 207158 205970
52786 205970 205251 204980 205008 204999 204592 203843 203194 202823 202407 201795 201399 201576 202089 202654 203566 205190 207150 208659 209510
52767 209510 210235 211314 212614 213600 213810 213185 212147 211278 210805 210566 210476 210642 210966 211082 210919 210892 211280 211844
52749 211844 212289 212644 212949 213096 213243 213849 214915 215779 216103 216518 217688 219256 220385 221022 221882 223292 224694
52732 224694 225313 224950 224096 223547 223846 224924 226353 227905 229566 230990 231553 231131 230346 229759 229279 228552 227407
$$ packed form
52848B40015l409l316l064k717k069j448j429j851k056j975k034k073j527o27
52834B10420k57n32o18j91Q6j13j10O05J468J669J196N75J07k15m83q15j185j251
52816B10356p91k26q8j27M00J534K589L243L873M642N021M452K866N37j939l574
52800B32768l696k855k296k418k518k085j515j289j305j305j350j488j490j188
52786B05970p19k71K8rm07p49o49l71m16o12l96J77N13N65R12J624J960J509Q51
52767B09510P25J079J300R86K10o25j038q69m73k39r0J66L24J16j63k7L88N64
52749B11844M45L55L05J47J47O06J066Q64L24M15J170J568J129O37Q60J410J402
52732B24694O19l63q54n49K99J078J429J552J661J424N63m22p85n87m80p27j145
$$ plain form
52715 227407 225699 223429 221365 220739 221770 223173 223749 223802 224238 224925 224923 223975 222716 221496 219925 217686 215180
52698 215180 213195 212344 212783 214033 215085 215134 214294 213409 213196 213725 214548 215129 215374 215827 217113 219063 220840
52681 220840 221997 222874 223754 224332 224384 224299 224394 224352 223889 223427 223414 223529 223271 222964 223358 224463 225484 225747 225160
52662 225160 224029 222929 222532 222983 223703 224263 225089 226779 229125 231471 233768 236567 240130 244101 247861
52647 247861 250683 251807 251007 248987 246763 244868 243458 242701 242409 241715 239936 237547 235627 234558 233958
52632 233958 233688 234136 235493 237439 239612 241907 244289 246656 248805 250267 250447 249291 247475 245557 243399
52617 243399 240907 238737 237517 236811 235757 234445 233702 233604 233158 231583 229229 227085 225934 226048 227124 228409
52601 228409 229275 229749 230249 230940 231688 232375 232909 233173 233356 234055 235547 237266 238430 238881 238918 238715 238421 238381
$$ packed form
52715B27407j708k270k064o26J031J403N76N3M36O87kr48j259j220j571k239k506
52698B15180j985q51M39J250J052M9q40q85k13N29Q23N81K45M53J286J950J777
52681B20840J157Q77Q80N78N2q5R5m2m63m62j3J15k58l07L94J105J021K63n87
52662B25160j131j100l97M51P20N60Q26J690K346K346K297K799L563L971L760
52647B47861K822J124q00k020k224j895j410p57k92o94j779k389j920j069o00
52632B33958k70M48J357J946K173K295K382K367K149J462J80j156j816j918k158
52617B43399k492k170j220p06j054j312p43r8m46j575k354k144j151J14J076J285
52601B28409Q66M74N00O91P48O87N34K64J83O99J492J719J164M51L7k03k94m0
$$ plain form
52583 238381 238725 239162 239704 241005 243342 245878 247673 248833 249774 250053 249076 247471 246520 246511 246832 247367 248488
52566 248488 249769 250096 249193 247883 246646 245085 243052 241160 239801 238682 237724 237436 237894 238231 237748 236889
52550 236889 236513 236730 236933 236660 236027 235536 235660 236447 237521 238608 239816 241044 241528 240707 239202 238166 237845
52533 237845 237664 237606 238393 240150 241823 242309 241496 239958 238274 236900 236152 236012 236355 237328 239010 240834 242006
52516 242006 242444 242652 242764 242529 242208 242678 244569 247909 252517 257861 262632 265435 266096 265509 264252 262253
52500 262253 259770 257492 255467 253003 249949 247137 245248 244269 244274 245567 247574 248729 248202 246895 246145 246238
52484 246238 246735 247348 247845 247903 247811 248546 250443 252465 253602 254300 255629 257610 259355 260544 261737 263243
52468 263243 264589 265308 265706 266527 268087 269975 271600 272944 274568 276722 278731 279626 279134 277658 275562
$$ packed form
52583B38381L44M37N42J301K337K536J795J160R41K79r77j605r51rL21N35J121
52566B48488J281L27r03j310j237j561k033j892j359j119r58k88M58L37m83q59
52550B36889l76K17K03k73o33m91J24P87J074J087J208J228M84q21j505j036l21
52533B37845j81n8P87J757J673M86q13j538j684j374p48j40L43R73J682J824J172
52516B42006M38K08J12k35l21M70J891L340M608N344M771K803O61n87j257j999
52500B62253k483k278k025k464l054k812j889r79NJ293K007J155n27j307p50R3
52484B46238M97O13M97N8r2P35J897K022J137O98J329J981J745J189J193J506
52468B63243J346P19L98Q21J560J888J625J344J624K154K009Q95m92j476k096
$$ plain form
52453 275562 273106 270791 268964 267231 265066 262805 261124 259728 257783 255577 254294 253907 252848 250440
52439 250440 248224 247897 249084 250216 250643 250735 250681 250441 250348 250630 250614 249484 247603 246192 245860 246229 246802 247418
52421 247418 247982 248509 249303 250498 251574 251976 252063 252825 254711 257331 260245 263476 267194 271348 275656 279754
52405 279754 283484 287357 292536 299925 309279 319345 328660 336031 340613 342060 340550 336458 330141 322225
52391 322225 313719 305605 298452 292605 288353 285608 283756 282151 280594 279172 277933 276940 276349 276250 276708
52376 276708 277969 280162 282757 284935 286668 288751 291555 294512 297202 300116 303664 307117 309311 309976
52362 309976 309646 308680 307131 305319 303759 302566 301456 300319 299347 298715 298474 298627 299000 299249 299297 299484 299965
52345 299965 300323 300187 299984 300558 302184 304259 305876 306561 306668 307225 309068 311976 315025 317834 320929 324740
$$ packed form
52453B75562k456k315j827j733k165k261j681j396j945k206j283l87j059k408
52439B50440k216l27J187J132M27R2n4k40r3K82j6j130j881j411l32L69N73O16
52421B47418N64N27P94J195J076M02Q7P62J886K620K914L231L718M154M308M098
52405B79754L730L873N179P389R354J0066R315P371M582J447j510m092o317p916
52391C22225q506q114p153n847m252k745j852j605j557j422j239r93n91r9M58
52376B76708J261K193K595K178J733K083K804K957K690K914L548L453K194O65
52362C09976l30r66j549j812j560j193j110j137r72o32k41J53L73K49M8J87M81
52345B99965L58j36k03N74J626K075J617O85J07N57J843K908L049K809L095L811
$$ plain form
52329 324740 328959 333285 338110 343953 350679 357840 365242 372740 379913 386501 392726 398715 404109 408789
52315 408789 413440 418766 424537 430082 435337 440734 446435 452385 458891 466412 474877 483697 492309 500375
52301 500375 507830 515243 523693 533673 544362 554522 563744 572239 579865 586140 590943 594436 596534 597208
52287 597208 597153 597332 597872 598094 597661 597003 596519 596020 595154 594033 593257 593505 595033 597281 599137 599870 599733 599504
52269 599504 599774 600928 603368 607206 611969 616959 621667 625615 628396 630361 632732 636350 640740 645044
52255 645044 649443 654839 661486 668848 676640 685094 694083 702728 710044 715581 719466 722260 724698 727150
52241 727150 729443 731535 734001 737292 740841 743532 744868 745172 744984 744865 745428 746758 748031 748458 748341 748403
52225 748403 748457 747766 746578 746139 746998 748305 748984 748725 747604 745739 743815 743090 744192 746330 748129 748898
$$ packed form
52329C24740M219M326M825N843O726P161P402P498P173O588O225N989N394M680
52315D08789M651N326N771N545N255N397N701N950O506P521Q465Q820Q612Q066
52301E00375P455P413Q450R980J0689J0160R222Q495P626O275M803L493K098O74
52287E97208n5J79N40K22m33o58m84m99q66j121p76K48J528K248J856P33j37k29
52269E99504K70J154K440L838M763M990M708L948K781J965K371L618M390M304
52255F45044M399N396O647P362P792Q454Q989Q645P316N537L885K794K438K452
52241G27150K293K092K466L291L549K691J336L04j88j19N63J330J273M27j17O2
52225G48403N4o91j188m39Q59J307O79k59j121j865j924p25J102K138J799P69
$$ plain form
52209 748898 748890 748885 749935 752976 758067 764105 769666 774028 777222 779419 780695 781447 782714 785704 790796 797088
52193 797088 803301 809129 815200 821580 827102 830768 833187 835690 838318 839757 839252 837615 835959 834224
52179 834224 831466 827185 821905 816576 811683 806934 801809 796435 791685 788236 785903 784236 783367 783567 784290
52164 784290 784469 783834 783240 783567 784884 786809 789061 791347 793136 793935 793639 792561 791264 790323 789999 790178
52148 790178 790816 792201 794464 797149 799757 802458 805679 809192 812238 814397 815663 815765 814314 811721 809198
52133 809198 807530 806444 805498 805021 805764 808010 811428 815643 820671 826854 834451 843298 852974 863352 874693
52118 874693 886928 899238 910803 921597 931868 941142 948567 954125 958665 962676 965793 967803 969491
52105 969491 972147 976620 983078 991274 1000769 1011069 1021670 1031944 1041291 1049728 1057915 1066031 1072837
$$ packed form
52209G48898qnJ050L041N091O038N561M362L194K197J276P52J267K990N092O292
52193G97088O213N828O071O380N522L666K419K503K628J439n05j637j656j735
52179H34224k758m281n280n329m893m749n125n374m750l449k333j667q69K00P23
52164G84290J79o35n94L27J317J925K252K286J789P99k96j078j297r41l24J79
52148G90178O38J385K263K685K608K701L221L513L046K159J266J02j451k593k523
52133H09198j668j086r46m77P43K246L418M215N028O183P597Q847R676J0378J1341
52118H74693J2235J2310J1565J0794J0271R274P425N558M540M011L117K010J688
52105I69491K656M473O458Q196R495J0300J0601J0274R347Q437Q187Q116O806
$$ plain form
52092 1072837 1076576 1076712 1074079 1069475 1062995 1054818 1045791 1036890 1028715 1021695 1016111 1011651 1007593 1003743
52078 1003743 1000612 998409 996476 994122 991423 988748 986019 983049 980260 978438 977877 978152 978694 979221 979681
52063 979681 980110 980704 981829 983768 986396 989252 992146 995564 1000144 1005697 1011189 1015836 1019722 1023078 1025580
52048 1025580 1026822 1026935 1026130 1024138 1020916 1017417 1014752 1012742 1010270 1006980 1003729 1001318 999642 998204
52034 998204 996653 994635 991856 988610 985677 983509 981887 980283 977991 974134 968368 961707 955798 951256
52020 951256 947371 943491 939807 936538 933273 929596 925795 922565 920367 919229 918695 917957 916584 915120 914174
$$ packed form
52092A072837L739J36k633m604o480q177r027q901q175p020n584m460m058l850
52078A003743l131k203j933k354k699k675k729k970k789j822n61K75N42N27M60
52063I79681M29N94J125J939K628K856K894L418M580N553N492M647L886L356K502
52048A025580J242J13q05j992l222l499k665k010k472l290l251k411j676j438
52034I98204j551k018k779l246k933k168j622j604k292l857n766o661n909m542
52020I51256l885l880l684l269l265l677l801l230k198j138n34p38j373j464r46
$$ [...]
##END NTUPLES=NMR SPECTRUM
##END=
