
##TITLE=UV1241_M8_1260-1248_90_7241437_K57V22cx5a
##JCAMPDX= 6.0         $$ Bruker NMR JCAMP-DX V2.0
##DATA TYPE= NMR SPECTRUM
##DATA CLASS= NTUPLES
##ORIGIN= BRUKER
##OWNER= Administrator
$$ 1.72 TOPSPIN		Version 2.1
$$ 2013-01-19 00:13:35.752 -0500  Administrator@X
$$ Compression mode = diff/dup
##.OBSERVE FREQUENCY= 400.02188249412
##.OBSERVE NUCLEUS= ^1H
##.ACQUISITION MODE= SIMULTANEOUS (DQD)
##.ACQUISITION SCHEME= undefined
##.AVERAGES= 64
##.DIGITISER RES= 22
##SPECTROMETER/DATA SYSTEM= spect
##.PULSE SEQUENCE= noesygpps1d.comp
##.SOLVENT NAME= COFFEE_meoh
##.SHIFT REFERENCE= INTERNAL, COFFEE_meoh, 1, 14.96143
##AUDIT TRAIL= $$ (NUMBER, WHEN, WHO, WHERE, PROCESS, VERSION, WHAT)
$$ ##TITLE= Audit trail, TOPSPIN		Version 2.1
$$ ##JCAMPDX= 5.01
$$ ##ORIGIN= Bruker BioSpin GmbH
$$ ##OWNER= Administrator
$$ $$ E:\/data/COFFEE/nmr/UV1241_M8_1260-1248_90_7241437_K57V22cx5a/22/pdata/1/auditp.txt
$$ ##AUDIT TRAIL=  $$ (NUMBER, WHEN, WHO, WHERE, PROCESS, VERSION, WHAT)
(   1,<2013-01-19 00:13:30.002 -0500>,<Administrator>,<X>,<go>,<TOPSPIN 2.1>,
      <created by zg
	started at 2013-01-19 00:02:00.221 -0500,
	POWCHK enabled, PULCHK disabled,
       configuration hash MD5:
       86 BA 57 50 F2 9D 5C 9B 26 00 A9 28 5F 66 2E 89
       data hash MD5: 64K
       68 58 FF 78 93 24 1A F2 33 09 05 9C F5 A4 68 44>)
(   2,<2013-01-19 00:13:32.986 -0500>,<Administrator>,<X>,<proc1d>,<TOPSPIN 2.1>,
      <Start of raw data processing
       efp LB = 0.3 FT_mod = 6 PKNL = 1 PHC0 = 0 PHC1 = 0 SI = 128K 
       data hash MD5: 128K
       44 C1 BF DE 0D EA B6 06 8D C1 E3 E7 46 3C F1 01>)
(   3,<2013-01-19 00:13:34.033 -0500>,<Administrator>,<X>,<proc1d>,<TOPSPIN 2.1>,
      <pk PHC0 = -81.97998 PHC1 = 0 
       data hash MD5: 128K
       FD 48 3E 5B A2 CE 85 99 35 40 8B C5 68 2E 69 59>)
(   4,<2013-01-19 00:13:34.721 -0500>,<Administrator>,<X>,<proc1d>,<TOPSPIN 2.1>,
      <abs ABSG = 1 
       data hash MD5: 128K
       44 5D 59 0F 63 AE D6 AD 09 C9 1D 9D CA 65 98 E7>)
(   5,<2013-01-19 00:13:34.877 -0500>,<Administrator>,<X>,<proc1d>,<TOPSPIN 2.1>,
      <abs ABSG = 2 
       data hash MD5: 128K
       67 41 AD 6C B8 A9 7A D0 5C D5 9D 04 DD 98 EA C9>)
(   6,<2013-01-19 00:13:35.065 -0500>,<Administrator>,<X>,<proc1d>,<TOPSPIN 2.1>,
      <abs ABSG = 3 
       data hash MD5: 128K
       6A F3 FB 46 2D A2 3F 9A 2E D2 4A AA 59 7C 16 BB>)
(   7,<2013-01-19 00:13:35.236 -0500>,<Administrator>,<X>,<proc1d>,<TOPSPIN 2.1>,
      <abs ABSG = 4 
       data hash MD5: 128K
       4D B8 5D C1 79 B7 35 7F 4F A5 32 4A 11 53 04 2D>)
(   8,<2013-01-19 00:13:35.424 -0500>,<Administrator>,<X>,<proc1d>,<TOPSPIN 2.1>,
      <abs ABSG = 5 
       data hash MD5: 128K
       A1 74 AF 6C 88 EA F6 FA A4 4A 41 1B 1E 13 1F A4>)
$$ ##END=
$$ 
$$ $$ hash MD5
$$ $$ 4E 9A 0A 7C 6A 6D DF CA 0A CA 16 62 2A 4F 3C 48
##$RELAX= 
##$RELAX= 
##$RELAX= 
##$RELAX= 
##$RELAX= 
##$RELAX= 
##$RELAX= 
##$RELAX= 
$$ Bruker specific parameters
$$ --------------------------
##$DU= <E:\>
##$EXPNO= 22
$$ [...]
##$TP07= 0
##$TPNAME0= <>
##$TPNAME1= <>
##$TPNAME2= <>
##$TPNAME3= <>
##$TPNAME4= <>
##$TPNAME5= <>
##$TPNAME6= <>
##$TPNAME7= <>
##$TPOAL= (0..7)
0.5 0.5 0.5 0.5 0.5 0.5 0.5 0.5
##$TPOFFS= (0..7)
0 0 0 0 0 0 0 0
##$TUNHIN= 0
##$TUNHOUT= 0
##$TUNXOUT= 0
##$USERA1= <user>
##$USERA2= <user>
##$USERA3= <user>
##$USERA4= <user>
##$USERA5= <user>
##$V9= 5
##$VALIST= <valist>
##$VCLIST= <CCCCCCCCCCCCCCC>
##$VD= 0
##$VDLIST= <DDDDDDDDDDDDDDD>
##$VPLIST= <PPPPPPPPPPPPPPP>
##$VTLIST= <TTTTTTTTTTTTTTT>
##$WBST= 1024
##$WBSW= 4
##$XGAIN= (0..3)
0 0 0 0
##$XL= 0
##$YL= 0
##$YMAX_a= 5855953
##$YMIN_a= -12588314
##$ZGOPTNS= <>
##$ZL1= 120
##$ZL2= 120
##$ZL3= 120
##$ZL4= 120
##$ABSF1= 14.96143
##$ABSF2= -5.596752
##$ABSG= 5
##$ABSL= 3
##$ALPHA= 0
##$AQORDER= 0
##$ASSFAC= 0
##$ASSFACI= 0
##$ASSFACX= 0
##$ASSWID= 0
##$AUNMP= <proc_prof1d_extract.lims>
##$AXLEFT= 0
##$AXNAME= <>
##$AXNUC= <1H>
##$AXRIGHT= 0
##$AXTYPE= 0
##$AXUNIT= <>
##$AZFE= 0.1
##$AZFW= 0.1
##$BCFW= 0
##$BC_mod= 0
##$BYTORDP= 0
##$COROFFS= 0
##$CY= 15
##$DATMOD= 1
##$DC= 0
##$DFILT= <>
##$DTYPP= 0
##$F1P= 0
##$F2P= 0
##$FCOR= 0.5
##$FTSIZE= 131072
##$FT_mod= 6
##$GAMMA= 0
##$GB= 0
##$INTBC= 1
##$INTSCL= 1
##$ISEN= 128
##$LB= 0.3
##$LEV0= 0
##$LPBIN= 0
##$MAXI= 10000
##$MC2= 0
##$MEAN= 0
##$ME_mod= 0
##$MI= 0
##$NCOEF= 0
##$NC_proc= -2
##$NLEV= 6
##$NOISF1= 0
##$NOISF2= 0
##$NSP= 0
##$NTH_PI= 0
##$NZP= 0
##$OFFSET= 14.96143
##$PC= 1
##$PHC0= -81.97998
##$PHC1= 0
##$PH_mod= 1
##$PKNL= yes
##$PPARMOD= 0
##$PPDIAG= 0
##$PPIPTYP= 0
##$PPMPNUM= 2147483647
##$PPRESOL= 1
##$PSCAL= 4
##$PSIGN= 0
##$PYNMP= <proc.py>
##$REVERSE= no
##$SF= 400.020009463704
##$SI= 131072
##$SIGF1= 0
##$SIGF2= 0
##$SINO= 400
##$SIOLD= 131072
##$SPECTYP= <>
##$SREGLST= <1H.CDCl3>
##$SSB= 0
##$STSI= 131072
##$STSR= 0
##$SW_p= 8223.68421052631
##$SYMM= 0
##$S_DEV= 0
##$TDeff= 65536
##$TDoff= 0
##$TI= <>
##$TILT= no
##$TM1= 0
##$TM2= 0
##$TOPLEV= 0
##$USERP1= <user>
##$USERP2= <user>
##$USERP3= <user>
##$USERP4= <user>
##$USERP5= <user>
##$WDW= 1
##$XDIM= 131072
##$YMAX_p= 434878617
##$YMIN_p= -19504
##$CURPLOT= <Network HP LaserJet P1505>
##$CURPRIN= <$Network HP LaserJet P1505>
##$DFORMAT= <normdp>
##$LAYOUT= <+/1D_H.xwp>
##$LFORMAT= <normlp>
##$PFORMAT= <normpl>
##$SURQMSG= 1
$$ End of Bruker specific parameters
$$ ---------------------------------
##NTUPLES= NMR SPECTRUM
##VAR_NAME=  FREQUENCY,     SPECTRUM/REAL,   SPECTRUM/IMAG
##SYMBOL=    X,             R,               I
##VAR_TYPE=  INDEPENDENT,   DEPENDENT,       DEPENDENT
##VAR_FORM=  AFFN,          ASDF,            ASDF
##VAR_DIM=   131072,        131072,          131072
##UNITS=     HZ,            ARBITRARY UNITS, ARBITRARY UNITS
##FACTOR=    0.0627417313425164, 1,          1
##FIRST=     8223.62146879497, -1005,        -56436
##LAST=      0,             453,             -57076
##MIN=       0,             -19504,          0
##MAX=       8223.62146879497, 434878617,    0
$$ Real data points
##PAGE= N=1
##DATA TABLE= (X++(R..R)), XYDATA
$$ [...]
67805 94477 93611 93132 93252 93507 93167 92046 90644 89562 88992 88739 88525 88255 88071 88056 87851 86828 84857 82604
67787 82604 80810 79476 78132 76688 75520 74774 74133 73416 73044 73613 75190 77198 78895 79870 80184 80131 79898
67770 79898 79515 79165 79306 80265 81800 83374 84809 86327 87957 89301 90030 90353 90794 91712 93180 95089
67754 95089 97207 99222 100932 102255 102926 102388 100308 97213 94379 92908 92881 93382 93331 92389 91207 90846 91879
67737 91879 93934 96020 97244 97268 96264 94623 92767 91076 89755 88675 87511 86165 84937 84072 83311
67722 83311 82182 80710 79475 78865 78592 78136 77369 76482 75568 74628 73825 73388 73332 73480 73676 73734 73412 72743 72238
67703 72238 72359 72897 73251 73237 73138 73024 72595 71816 71191 71106 71282 71172 70642 69957 69345 68863 68545 68457 68688 69418
67683 69418 70794 72551 73977 74503 74238 73759 73512 73605 73998 74561 74956 74788 74034 73185 72827 73071 73531 73848
67665 73848 74135 74643 75083 74690 73275 71878 71847 73335 75200 76400 76894 77035 76777 75953 74914 74259 74076
67648 74076 73882 73258 72221 71085 70297 70285 71084 72095 72552 72276 71723 71381 71388 71727 72417 73356 74272 74997 75672
67629 75672 76534 77588 78554 79103 79165 79073 79338 80135 81032 81383 80976 80162 79385 78784 78288 77908 77764 77897 78144
67610 78144 78240 78062 77787 77755 78144 78785 79344 79618 79613 79394 78964 78223 77046 75462 73769 72336 71182 69947
67592 69947 68358 66662 65455 65206 65953 67282 68502 69093 69169 69323 69852 70381 70502 70454 70767 71405 71756 71463
67574 71463 70885 70679 71230 72462 73866 74688 74462 73488 72491 71764 70915 69541 67835 66379 65627 65710 66420 67197
67556 67197 67396 66843 65994 65409 65259 65464 66016 66859 67679 68109 68108 67920 67759 67721 67915 68394 68973 69308 69228 68865
67536 68865 68465 68175 68018 67945 67913 67934 68038 68196 68316 68341 68237 67924 67385 66846 66592 66482 65981 64870 63693 63171
67516 63171 63400 63987 64787 65967 67319 68187 68331 68436 69237 70455 71106 70798 70145 69806 69650 69222 68640 68509
67498 68509 69014 69577 69556 68952 68269 67935 68021 68324 68527 68446 68328 68683 69578 70312 70211 69639 69684 70770 72049 72435
67478 72435 71822 70894 70064 69120 67889 66748 66228 66392 66801 67016 67012 67125 67627 68334 68707 68450 67972 68076 69148
67459 69148 70826 72491 73814 74665 74781 73940 72451 71043 70093 69269 68212 67285 67232 68183 69416 70217 70555
67442 70555 70787 71070 71391 71898 72770 73872 74888 75732 76541 77252 77571 77382 76942 76572 76387 76350 76330 76121 75697
67423 75697 75512 76179 77643 78970 79161 78003 76006 73819 71960 70814 70475 70663 71081 71733 72618 73273 73072
67406 73072 72022 70907 70462 70665 71029 71324 71721 72248 72474 71935 70790 69772 69436 69643 69894 69943 69827 69572
67388 69572 69257 69319 70249 71870 73410 74430 75154 75622 75230 73658 71811 71015 71419 71915 71654 70937 70518 70694
67370 70694 71325 72198 73016 73395 73209 72673 71900 70785 69553 68962 69512 70725 71679 72068 72326 72837 73497 74013
67352 74013 74204 73977 73369 72684 72321 72393 72759 73442 74611 76071 77109 77131 76258 75120 74237 73814 73935 74613
67334 74613 75621 76554 77109 77190 76807 76128 75709 76329 78305 80987 83152 83986 83634 82906 82587 82968 83752 84314
67316 84314 84201 83538 82830 82366 82005 81622 81466 81764 82214 82329 82217 82565 83707 85112 86037 86362 86470 86568 86562
67297 86562 86567 87063 88375 90202 91878 93019 93719 94139 94126 93390 91998 90436 89102 87951 86841 86014 85845
67280 85845 86169 86338 86095 86017 86768 88205 89485 89884 89284 88145 87323 87655 89190 90964 91974 92323 92905
67263 92905 94033 95047 95385 95378 95608 96020 96161 95972 95779 95732 95701 95644 95619 95508 95179 94904 95141 95868 96534 96843
67243 96843 97140 97796 98549 98824 98504 98024 97734 97497 97053 96549 96484 97117 98043 98509 98177 97457 97022 97119 97529 98049
67223 98049 98665 99237 99397 99070 98866 99587 101371 103515 105213 106260 106973 107635 108188 108388 108102 107448 106750 106420
67205 106420 106683 107288 107508 106700 104946 103028 101727 101282 101595 102608 104172 105778 106919 107727 108794 110279
67189 110279 111612 112242 112329 112376 112537 112631 112572 112349 111760 110645 109380 108706 108992 109904 110814 111222 110816 109563 107949
67170 107949 106874 107030 108429 110595 113010 115304 117188 118462 119089 119249 119322 119700 120438 121124 121348 121233 121285
67153 121285 121721 122274 122706 123171 123874 124697 125371 125811 126079 126250 126543 127385 129008 131055 132762 133549 133391 132815
67135 132815 132655 133532 135275 136969 137795 137741 137329 136898 136462 136112 136118 136601 137351 138009 138312 138227 138074 138414 139539
67116 139539 141093 142436 143329 144061 145022 146475 148620 151415 154256 156261 157091 157238 157378 157736 158209 158811
67100 158811 159705 160964 162518 164270 166043 167548 168554 169141 169669 170470 171543 172524 173060 173270 173669 174525
67084 174525 175484 176138 176773 178084 180219 182623 184868 187079 189382 191529 193404 195343 197487 199206 199791
67069 199791 199478 199274 199917 201465 203721 206448 209188 211496 213504 215779 218486 221126 223277 225181 227343
67054 227343 229872 232492 234966 237241 239341 241294 243034 244291 244838 244970 245482 246935 249155 251687 254500
67039 254500 257885 261757 265459 268330 270271 271739 273359 275559 278404 281580 284558 286876 288430 289669
67025 289669 291395 294045 297086 299492 301042 302837 306120 310851 315902 320493 324845 329371 333902 337999
67011 337999 341592 344936 348247 351697 355485 359575 363607 367494 371872 377449 383969 390323 395710 400270
66997 400270 404495 408558 412477 416550 421196 426482 432083 437656 443159 448848 455085 461913 468728 474612
66983 474612 479266 483506 488592 495104 502588 510101 516916 522891 528502 534471 541109 548039 554854 561885
66969 561885 569927 579188 588936 598362 607430 616659 626345 636324 646362 656481 666910 677850 689290
66956 689290 700949 712480 723820 735301 747297 759835 772609 785352 798094 811127 824697
66945 824697 838710 852744 866515 880359 895029 910899 927562 944384 961271 978635 996773
66934 996773 1015580 1034802 1054241 1073669 1092912 1112175 1131997 1152579 1173387 1193800 1214067
66923 1214067 1235258 1258130 1282395 1307309 1332607 1358508 1385004 1411676 1438216 1464726 1491361
66912 1491361 1518150 1545305 1573246 1601971 1630822 1659334 1687976 1717491 1747655 1777313 1805603
66901 1805603 1832648 1859117 1885677 1912879 1940918 1969280 1997153 2024381 2051506 2078745 2105569
66890 2105569 2131538 2156841 2181595 2205276 2227443 2248446 2268741 2287939 2305237 2320491 2334129
66879 2334129 2346356 2357196 2367059 2376371 2384694 2391054 2395183 2397621 2398577 2397548 2394237 2389006 2382121 2373368
66865 2373368 2362818 2351163 2338749 2324976 2309272 2291997 2273624 2253505 2230521 2204872 2178347
66854 2178347 2152600 2127734 2102781 2077074 2050817 2024570 1998550 1972424 1945650 1917868 1888978
66843 1888978 1859022 1828295 1797522 1767477 1738180 1708770 1678431 1647232 1615874 1584920 1554597
66832 1554597 1525028 1496218 1467947 1440065 1412798 1386422 1360722 1335168 1309637 1284578 1260433
66821 1260433 1237101 1214035 1190692 1166992 1143487 1120889 1099195 1077508 1055147 1032702 1011458
66810 1011458 991848 973067 954332 935857 918276 901553 884979 868035 850882 834051 817981
66799 817981 802873 788776 775632 763238 751143 738714 725524 711762 698135 685304 673392
66788 673392 661989 650517 638662 626697 615333 605041 595505 585972 576131 566331 556910 547686 538370
66775 538370 529125 520379 512220 504382 496794 489755 483383 477064 469799 461229 452221 444240 438079 433274
66761 433274 428739 423741 418137 412017 405588 399418 394297 390515 387380 383604 378253 371444 364336 358359
66747 358359 354137 351024 347822 343956 339738 335579 331442 327232 323262 319864 316686 312829 307791 302100
66733 302100 296961 293303 291101 289514 287673 285347 282819 280264 277521 274502 271465 268690 266057 263133
66719 263133 259598 255538 251511 248374 246731 246342 246220 245484 243880 241420 237935 233368 228289 223710 220393
66704 220393 218449 217386 216325 214483 211825 209116 207029 205434 203879 202442 201557 201206 200884 200222 199071
66689 199071 197052 193812 189878 186565 184725 184066 183872 183738 183318 182121 180148 178204 176929 175875 174258
66674 174258 172289 170941 170491 170058 168739 166550 164097 161885 160218 159264 158814 158309 157435 156477 155848 155520
66658 155520 155160 154533 153499 151852 149599 147220 145278 143789 142380 141002 140045 139649 139358 138776 138248 138464
66642 138464 139477 140489 140717 140143 139280 138368 137132 135310 133185 131411 130374 129901 129590 129270 129057 129092 129423
66625 129423 130122 131251 132554 133284 132623 130412 127424 124822 123318 122852 122918 123027 122862 122256 121295 120380 119934
66608 119934 119945 119905 119324 118202 116946 115965 115372 114938 114161 112613 110482 108648 107900 108100 108397 108261 107984 108147
66590 108147 108936 110061 110979 111057 109876 107666 105212 103193 101867 101428 102034 103155 103567 102696 101550 101516 102563
66573 102563 103473 103648 103564 103375 102321 100118 97959 97287 98100 99222 99802 99779 99265 98339 97375 96789 96431 95794
66555 95794 94896 94378 94648 95394 96093 96551 96845 97095 97490 98166 98899 99164 98685 97724 96791 96164 95743 95177 94132
66536 94132 92661 91245 90321 89841 89534 89329 89206 88847 87947 86780 85942 85624 85611 85856 86408 86829 86538 85869
66518 85869 85916 86977 87970 87920 87303 87227 87858 88432 88488 88300 88326 88914 90375 92547 94365 94656 93528 92309 91884
66499 91884 91709 90750 88918 87115 86136 85952 86011 85895 85636 85516 85680 85923 85846 85173 83962 82615 81668 81377
66481 81377 81408 81134 80349 79502 79091 79088 79151 79137 79075 78876 78421 77817 77228 76579 75777 75116 75121 76000 77511 79218 80581
66460 80581 81059 80613 79946 79708 79579 78749 77294 76321 76517 77201 77218 76305 75148 74440 74327 74622 75128 75786 76684
66441 76684 77924 79367 80654 81489 81735 81252 79976 78235 76666 75600 74813 74047 73507 73634 74609 76233
66425 76233 78041 79454 80104 80159 80058 79812 78989 77558 76234 75664 75714 75977 76552 77757 79311 80410 80586
66408 80586 80073 79391 78889 78583 78110 77031 75535 74575 74820 75715 76159 75963 75928 76553 77448 78174 78827 79418 79325
66389 79325 78010 75909 74063 73087 72946 73524 74802 76460 77804 78370 78399 78534 79091 79725 79771 78912 77514
66372 77514 76321 75823 75954 76279 76388 76133 75723 75572 75892 76404 76645 76557 76489 76607 76631 76340 76010 76014 76244 76314 76197
66351 76197 76296 76866 77670 78319 78675 78809 78798 78738 78826 79207 79714 79892 79301 77908 76212 74943 74480 74537 74535 74284
66331 74284 74161 74579 75445 76292 76760 76779 76366 75540 74507 73664 73260 73132 72943 72670 72727 73553 75071 76562 77148
66312 77148 76561 75442 74780 74957 75465 75554 74964 73913 72705 71674 71318 72024 73603 75453 77160 78607 79508
66295 79508 79423 78442 77366 76799 76421 75629 74586 74072 74386 74997 75333 75415 75548 75801 76101 76579 77430 78478 79098
66276 79098 78678 77231 75554 74637 74793 75418 75728 75547 75168 74697 74001 73247 73006 73616 74803 76053 77030 77535
66258 77535 77488 77251 77559 78717 80052 80518 79768 78384 77173 76560 76546 76973 77708 78751 80143 81683 82881
66241 82881 83410 83524 83852 84796 86237 87686 88555 88452 87566 86688 86575 87261 88151 88712 88757 88165 86845 85128
66223 85128 83805 83399 83632 83938 84372 85610 87971 90695 92465 92613 91654 90612 90036 89822 89851 90350 91421
66206 91421 92506 92759 91921 90569 89460 88927 88915 89250 89699 90028 90289 90830 91788 92701 92921 92331 91357 90402
66188 90402 89603 89167 89432 90336 91209 91455 91267 91277 91626 91870 91816 91944 92746 94016 95166 95987 96725 97528 98216
66169 98216 98553 98414 97690 96387 94916 93947 93825 94339 95151 96146 97216 98098 98686 99224 99833 100094 99536 98457
66151 98457 97799 98135 99122 100000 100341 100221 99966 99939 100336 101002 101557 101852 102128 102593 103011 102974 102601 102704 104076
66132 104076 106568 108965 109965 109378 108310 107999 108529 108840 107994 106187 104423 103467 103357 103756 104417 105231 106035
66115 106035 106633 107033 107561 108666 110512 112717 114568 115555 115726 115548 115524 115978 117047 118623 120284 121471
66099 121471 121899 121796 121679 121937 122626 123564 124473 125108 125436 125736 126418 127623 129034 130097 130347 129593 128033
66082 128033 126282 125065 124570 124263 123563 122625 122093 122190 122434 122350 122009 121704 121522 121533 122022 123129 124458 125417
66064 125417 125809 125776 125368 124570 123597 122739 122019 121446 121450 122456 124025 125087 125234 125201 125794 126899 127960 128840
66046 128840 129621 129926 129239 127875 126974 127307 128488 129542 129967 130040 130312 131018 131984 132960 133979 135335 137215
66029 137215 139461 141749 143893 145881 147772 149639 151478 153041 153965 154200 154153 154231 154453 154669 154902 155199 155443
66012 155443 155698 156454 158009 159813 161077 162003 163693 166652 170020 172651 174452 176216 178562 181533 184962
65997 184962 188652 192220 195221 197549 199488 201303 202942 204143 204746 204907 205037 205367 205554 204975 203539 201945
65981 201945 200901 200301 199456 197913 195758 193306 190879 188794 187163 185712 184042 182038 179805 177423 175134
65966 175134 173524 172948 172855 172272 171044 170035 169965 170652 171564 172501 173402 174087 174624 175403 176367 176759 176324 176241 177927
65947 177927 181187 184527 187270 190282 194285 198465 201435 202943 203914 205203 206992 209210 211795 214451
65933 214451 216661 218163 219187 220137 221270 222673 224384 226421 228842 231696 234837 237885 240632 243383
65919 243383 246602 250213 253548 256104 258101 260164 262618 265256 267695 269804 271690 273298 274119 273534 271571
65904 271571 269128 267217 266073 265269 264579 264249 264389 264546 264139 262935 260835 257528 252803 247107 241376 236233
65888 236233 231578 226941 222007 216774 211447 206235 201148 196082 191211 187109 184170 181990 179791 177487
65874 177487 175865 175471 175792 175915 175683 175650 176010 176135 175357 173809 172210 171075 170351 169701 168835 167612 166081
65857 166081 164549 163534 163519 164661 166663 168922 170929 172597 174229 176142 178415 181012 183922 186982 189617
65842 189617 191044 190863 189418 187488 185707 184252 183006 181920 181179 180987 181179 181259 181024 181097 182481 185500
65826 185500 189462 193528 197553 201758 205917 209475 212454 215619 219429 223224 225874 227030 227319 227358 227001
65811 227001 225720 223423 220616 217808 214955 211627 207678 203612 200220 197898 196437 195392 194463 193499 192404
65796 192404 191224 190149 189181 187918 185991 183706 182025 181784 183035 185204 187721 190422 193425 196787 200357
65781 200357 203995 207929 212696 218598 225304 232142 238735 245117 251302 256985 261724 265237 267404 268157
65767 268157 267403 264994 260822 255186 248967 243132 237944 232987 228061 223737 220903 220083 221402 224761 229698
65752 229698 235413 241487 248455 257206 267861 279667 292000 305010 319112 334105 348889 361874
65740 361874 371746 378208 382065 384264 384741 382429 376406 366721 354108 339431 323623 307702 292355
65727 292355 277697 263686 250631 238967 228722 219522 211056 203260 196093 189426 183186 177482 172536
65714 172536 168523 165357 162605 159771 156811 154151 152082 150386 148733 147178 145968 145125 144586 144509 144998
65699 144998 145610 145637 144962 144253 144240 145086 146487 148036 149395 150446 151432 152737 154427 156241 158073 160153
65683 160153 162674 165530 168589 172004 176095 181142 187327 194627 202638 210896 219565 229548 241620 255664
65669 255664 271025 287383 304932 323765 343343 362514 379922 394604 406479 416150 423974 429491
65657 429491 432109 432232 431238 430269 429440 428414 427329 426840 427444 429112 431540 434404 437247 439357 439943 438413
65641 438413 434443 427918 418939 407828 394912 380277 363908 346089 327509 308917 290829 273605
65629 273605 257489 242426 228171 214986 203931 195913 190435 185793 180683 175204 170168 165913 162133
65616 162133 158542 155278 152716 151087 150202 149368 147809 145399 142851 140946 139749 138838 138098 137924 138571 139667
65600 139667 140571 141133 141876 143326 145239 146762 147478 147963 148951 150249 151109 151567 152621 154907 157984 161282
65584 161282 165033 169695 175057 180655 186673 193692 201850 210913 220956 232319 245083 259243 275112
65571 275112 292738 311086 328657 344811 359639 372642 382613 389037 392547 393610 391680 386168 377436
65558 377436 366215 352770 337244 320271 302611 284697 267112 250951 236981 224830 213709
65547 213709 203601 194974 187674 180960 174577 168933 164145 159636 154954 150464 146997 145070 144612 145177
65533 145177 146325 147941 150144 152757 155125 156696 157548 157952 157725 156557 154810 153327 152425 151589 150244
65518 150244 148310 145972 143505 141436 140311 139998 139703 138992 138407 138730 139980 141472 142608 143201 143218 142616
65502 142616 141474 140047 138647 137544 136848 136393 135890 135383 135453 136769 139427 142805 146060 148738 151000 153328
65486 153328 155988 158779 161386 163806 166216 168451 169962 170419 170070 169405 168679 167969 167374 166863 166077 164650
65470 164650 162692 160659 158714 156502 153671 150450 147577 145679 144785 144416 144088 143741 143635 143835 143935 143479
65454 143479 142654 142261 142819 143856 144413 144213 144001 144586 145862 147095 147936 148694 149591 150279 150300 149769 149328 149604
65436 149604 150830 152752 154670 155816 156009 155914 156462 158053 160366 162664 164076 163986 162563 160822 159796 159760
65420 159760 160447 161636 163031 163872 163484 162223 161221 161047 161206 161121 160884 160669 160071 158631 156731 155352 155035
65403 155035 155490 156122 156577 156837 157138 157854 159185 160931 162739 164581 166790 169571 172557 174988 176356 176885
65387 176885 177177 177285 176433 174005 170639 167758 166024 164863 163663 162694 162462 162804 163292 164118 165782 168082
65371 168082 170132 171394 172109 172701 173326 174098 175213 176666 178214 179824 181832 184591 188224 192773 198180
65356 198180 204098 210216 216892 224956 234600 244873 254593 263270 270777 276595 280066 281244 280855 279427
65342 279427 276980 273608 269743 265553 260548 254249 247043 239941 233549 227626 221715 215881 210625 206291
65328 206291 202797 199886 197406 195272 193356 191571 189949 188496 187050 185437 183679 181842 179678 176784
65314 176784 173226 169739 167005 164882 162693 160147 157563 155192 152798 150233 148005 146806 146606 146672 146515
65299 146515 146373 146659 147369 148299 149493 151099 152949 154706 156338 158058 159773 160965 161280 160980 160596 160351
65283 160351 160138 159944 160048 160703 161772 162763 163230 163091 162514 161564 160179 158591 157559 157853 159516 161842 164081
65266 164081 165931 167375 168379 168911 169044 168956 169008 169781 171682 174352 176837 178540 179704 180703 181263 180817 179308
65249 179308 177145 174522 171354 167810 164339 161078 157766 154447 151795 150458 150361 150905 151535 151884 151741 151295
65233 151295 151191 151879 152962 153592 153491 153160 153018 152815 152121 151071 150247 149944 149907 149793 149549 149214 148680 147872
65215 147872 147052 146613 146589 146612 146438 146294 146544 147184 147874 148379 148725 148931 148857 148484 148174 148395 149144 149774 149538 148276
65195 148276 146533 145025 144117 143848 144286 145506 147199 148589 149113 149077 149367 150446 151869 152845 153038 152665 152046
65178 152046 151402 151033 151323 152330 153522 154126 153746 152590 151185 150011 149387 149449 150146 151323 152910 154905
65162 154905 157136 159184 160690 161695 162464 163034 163122 162552 161577 160707 160335 160664 161871 164057 166931 169749
65146 169749 171869 173527 175914 180173 186321 193331 200318 207318 214714 222294 229357 235603 241431 247353
65132 247353 253582 260274 267620 275357 282587 288520 293232 297360 301252 304761 307703 310050 311654 312184
65118 312184 311493 309758 307020 302802 296427 287761 277529 266906 256863 247860 239889 232584 225343 217710
65104 217710 209842 202416 195850 189812 183816 178122 173581 170563 168515 166656 164689 162730 160988 159797
65090 159797 159486 159914 160479 160891 161556 162850 164426 165699 166617 167419 167947 167837 167165 166267 165093 163473 161968
65073 161968 161652 162803 164452 165500 165763 165732 165799 166101 166706 167574 168572 169751 171381 173475 175565 177148 178094
65056 178094 178498 178423 178065 177827 177894 177913 177411 176427 175437 174708 173982 172851 171335 169982 169313 169102 168428 166693
65038 166693 164482 162963 162453 162007 160622 158393 156220 154675 153520 152227 150674 149331 148818 149194 149711
65023 149711 149528 148682 148009 148079 148620 149103 149444 149872 150518 151434 152681 154100 155302 156253 157562 159809 162854
65006 162854 166160 169524 173078 176783 180338 183426 185731 186949 187237 187355 187888 188490 188442 187775 187220 187139 187231
64989 187231 187345 187893 189194 191005 193080 195668 199061 202953 206733 210175 213408 216287 218219 218727 217906
64974 217906 216207 213867 210719 206576 201734 196968 192971 189861 187352 185284 183797 183025 182784 182615 182025
64959 182025 180795 179184 177789 177028 176801 176789 176888 177068 176961 176055 174360 172508 171066 170066 169314 168797 168604
64942 168604 168701 168996 169363 169443 168753 167323 165967 165561 166183 167277 168450 169676 170821 171481 171441 170904 170146 169277
64924 169277 168497 168161 168266 168222 167577 166788 166700 167334 167733 167215 166245 165784 166181 167153 168554 170535 172979 175308
64906 175308 177108 178608 180362 182666 185509 188936 193244 198783 205597 213303 221439 229972 239226 249105
64892 249105 258722 267254 274951 282678 290492 297424 302872 307453 311977 316120 318669 318749 316227 311277 304236
64877 304236 295818 286956 278371 270563 263907 258377 253498 249172 246275 245657 246696 247661 247571 246837 245906 244239
64861 244239 241217 237331 233649 230378 226677 221872 216319 210958 206302 202060 197666 193092 189011 186051
64847 186051 184050 182379 180908 180129 180219 180537 180387 179857 179500 179520 179744 180163 180906 181738 182113 181849 181395 181268
64829 181268 181533 182038 182863 184279 186260 188322 189948 191143 192450 194437 197255 200691 204450 208217 211630
64814 211630 214566 217495 221199 225998 231471 237061 242673 248483 254295 259325 262566 263294 261412 257507
64800 257507 252536 247299 242196 237372 232854 228583 224621 221489 219902 219941 220749 221359 221588 221865 222473 223378
64784 223378 224573 226011 227248 227699 227420 227211 227714 228744 229669 230156 230313 230433 230951 232460 235274 238964
64768 238964 242708 246221 250064 254904 260738 267106 273783 280864 288246 295523 302547 309669 317156 324651
64754 324651 331600 338031 344537 351523 358816 365881 371935 375821 376364 373250 367267 359409 349974 338869
64740 338869 326505 313935 302079 291168 281069 271948 264448 259283 256736 256512 257932 260188 262474
64727 262474 264108 264787 264716 264380 264246 264799 266626 270123 275111 281071 287726 295044 302729 310170 317023 323353
64711 323353 328979 333156 335240 335235 333258 328903 321738 312256 301794 291521 281892 272908 264441 256296
64697 256296 248449 241331 235519 231040 227308 223840 220753 218408 216803 215528 214255 213178 212914 213894 215846
64682 215846 218070 220293 222935 226348 230230 234207 238675 244413 251449 258898 265942 272411 278247 283002
64668 283002 286133 287441 286909 284441 280096 274417 268319 262719 258281 255206 253134 251528 250284 249708 249888
64653 249888 250464 251188 252212 253570 254804 255551 256165 257281 259048 261274 264061 267636 271637 275414 279216
64638 279216 284396 291917 301058 310069 317811 324291 329915 334997 339985 345313 350551 354231 355178 353762
64624 353762 351212 347857 342794 335489 326878 318308 309896 300709 290470 280331 271808 265419 260635 256744
64610 256744 253366 250310 247368 244376 241399 238764 236826 235566 234418 232750 230608 228840 228252 228738 229393
64595 229393 229546 229515 230258 232341 235426 238845 242472 246810 252328 259070 266982 276202 286715 298009 309485
64580 309485 321087 333157 345738 358343 370387 381511 391493 400199 407582 413383 416896 417494 415499
64567 415499 412021 407771 402403 395284 386496 376736 366590 356346 346336 337000 328536 320751 313289
64554 313289 305939 298763 292110 286462 282138 279048 276689 274339 271507 268498 266476 266485 268302 270637 272569
64539 272569 274372 276707 279537 282223 284227 285150 284373 281427 276744 271451 266260 260936 255044 248893 243513
64524 243513 239878 238254 238080 238338 238165 237306 236061 234878 234090 233929 234567 236044 238200 240704 243136 245192
64508 245192 246892 248489 250104 251662 253318 255724 259545 264816 270982 277453 283811 289647 294596 298535
64494 298535 301414 302916 302718 301171 299306 297925 296984 296032 294982 294187 294035 294740 296415 299023 302256 305649
64478 305649 308789 311314 312845 313161 312369 310671 307951 303892 298614 292983 288043 284171 280974 278093 275940
64463 275940 275556 277744 282395 288551 294968 300633 304963 307747 308950 308599 306844 304069 300748 297135 293194
64448 293194 288971 284930 281792 280029 279599 280195 281661 284086 287498 291591 295930 300511 305911 312626 320362
64433 320362 328309 336161 344567 354528 366689 381339 398672 418671 441037 465697 493371 525329
64421 525329 562691 606225 656741 715337 783228 861548 951003 1051034 1158995 1270452 1380630
64410 1380630 1485818 1583838 1673807 1755564 1828713 1891634 1941386 1974829 1990003 1986714 1966279
64399 1966279 1930977 1883284 1824843 1755727 1674855 1581606 1477421 1366015 1252068 1139730
64389 1139730 1032274 932636 843387 765685 698652 640417 589815 546712 510857 481090 455958
64378 455958 434654 416964 402536 390634 380538 371870 364416 357810 351559 345327 339092 332897 326576
64365 326576 319856 312720 305414 298063 290634 283446 277261 272475 268609 265098 262245 260717 260310 260098 259854
64350 259854 260468 262625 265796 268966 271729 274214 276427 278199 279425 279943 279476 278043 276016 273434 269841
64335 269841 265286 260878 257605 255123 252517 249877 248119 247496 247417 247734 249010 251215 253344 254925 256997
64320 256997 260745 265782 270645 274600 278070 281478 284584 287036 288875 290162 290600 289892 288180 285830 282859
64305 282859 278837 273423 266900 260074 253622 247528 241299 234712 228241 222703 218648 216135 214817 214098
64291 214098 213442 212841 212822 213762 215339 216922 218306 219674 220962 221855 222477 223543 225519 228053 230608 233302
64275 233302 236727 241186 246590 252861 259782 266419 271432 274305 275890 277432 279396 281473 283284 284561
64261 284561 284988 284509 283808 283907 285123 286753 287855 287993 287139 285280 282403 278642 274210 269327 264268 259271
64245 259271 254323 249320 244530 240572 237794 236031 235150 235384 236742 238484 239739 240432 241166 242258 243501
64230 243501 244876 246951 250279 254686 259375 263619 267292 270879 275104 280427 286835 294056 301861 310044
64216 310044 318313 326409 334263 341860 349146 356279 363738 371772 379867 387191 393504 399184 404326 408296
64202 408296 410316 410100 407819 403824 398573 392473 385587 377732 369038 360146 351754 344293 338167 333883
64188 333883 331680 331283 332296 334591 338041 342142 346197 349700 352295 353494 352733 349619 344032 336173 326698
64173 326698 316584 306608 297045 287989 279654 272157 265230 258469 251775 245333 239377 234195 230145 227330
64159 227330 225403 223924 222775 221979 221344 220587 219645 218624 217682 217286 218263 221057 225075 229237 233098 236978
64143 236978 241043 244812 247695 249573 250696 251292 251399 250819 249225 246537 243195 239809 236643 233731 231343
64128 231343 229869 229317 229395 230018 231225 232683 233950 235307 237626 241140 244999 248328 251138 253888 256830
64113 256830 260277 264875 270896 277595 283906 289500 294613 299174 302810 305504 307564 309037 309817 310274 311107
64098 311107 312543 314312 316450 319357 322836 325749 327076 326805 325449 323157 319809 315607 310958 305886
64084 305886 300053 293415 286526 280161 274799 270429 266623 262815 258724 254551 250770 247801 245935 245308
64070 245308 245718 246607 247464 248205 248947 249571 249747 249375 248723 248126 247716 247400 246969 246296 245628 245536 246276 247306 247860
64051 247860 247974 248428 249575 250818 251569 252205 253481 255314 256837 257616 258198 259318 261062 263077 265154 267251
64035 267251 269229 270960 272563 274284 276190 278210 280378 282775 285330 287915 290599 293549 296724 300011
64021 300011 303665 308224 313756 319353 323635 325735 325674 323933 320923 316948 312456 308081 304369 301519 299376
64006 299376 297598 295811 293734 291339 288880 286635 284663 282948 281718 281299 281605 282135 282662 283619 285490
63991 285490 288134 291097 294328 298053 302055 305696 308733 311594 314635 317652 320446 323446 327302 332072
63977 332072 337181 342049 346463 350484 354303 358189 362333 366800 371744 377501 384216 391559 399123 407009
63963 407009 415746 425686 436784 448950 462319 477026 492870 509321 525953 542979 561418 582546
63951 582546 607038 634887 666183 701609 741959 787701 839547 899088 968176 1047843 1138557
63940 1138557 1241527 1358869 1492153 1641317 1805214 1982613 2172234 2372438 2581489
63931 2581489 2797719 3018716 3240356 3457044 3662868 3852266 4020047 4161630 4273721
63922 4273721 4354631 4403908 4421686 4408029 4362382 4283731 4171933 4029218 3860287 3670976
63912 3670976 3467045 3253952 3036834 2819963 2606365 2398349 2198359 2009026 1832503
63903 1832503 1670064 1522307 1389420 1271134 1166737 1075361 996159 928101 869742 819426
63893 819426 775722 737520 703792 673542 646156 621562 599873 580886 564118 549154 535730
63882 535730 523492 512003 501088 490930 481712 473436 466232 460538 456594 453924 451737 449915 449273
63869 449273 450713 454384 459813 466583 474566 483705 493989 505775 519753 536282 554918 574918 596228
63856 596228 619678 646068 675318 706675 739457 773320 807963 843022 878340 913945 949594
63845 949594 984538 1017890 1049091 1077900 1104043 1126905 1145501 1158831 1166538 1169199 1167654 1161974
63833 1161974 1151490 1135853 1115549 1091048 1062026 1028017 989551 948120 905169 861656 818461
63822 818461 776535 736478 698417 662421 628638 596985 567153 539186 513708 491299 471836
63811 471836 454590 438811 424173 410840 399176 389163 380082 371113 362236 354181 347429 341671 336367
63798 336367 331349 326598 321835 316696 311086 305164 299277 294103 290370 288034 286082 283589 280726 278293
63784 278293 276490 274718 272495 270091 268191 267241 267055 266834 265740 263766 261861 260859 260540 260146 259526 259148
63768 259148 259152 259109 258730 258163 257530 256774 256056 255613 255087 253727 251541 249545 248475 247911 247204 246567 246518 246710 246229
63749 246229 244926 243674 243269 243721 244714 246179 248126 250298 252312 254043 255743 257809 260392 263167 265643
63734 265643 267798 270155 272982 275729 277661 278889 280280 282482 285448 288851 292417 295894 299265 303133
63720 303133 308359 315037 322229 328926 334865 340200 344834 348536 351367 353456 354475 353809 351300 347503
63706 347503 343152 338622 333985 329373 325157 321817 319674 318688 318491 318628 318824 319095 319725 321037 323041 325333
63690 325333 327517 329677 332165 334883 337080 338068 337867 337020 336007 335086 334482 334408 334893 335831 337167 338883
63674 338883 340887 343093 345649 348925 353177 358184 363253 367742 371743 376086 381335 386849 391314 394250
63660 394250 396362 398148 398817 397261 393670 389331 384937 379914 373605 366413 359382 353137 347688 343001
63646 343001 339238 336440 334250 332120 329751 327396 325697 325104 325449 326220 327210 328681 330893 333768 337106
63631 337106 340848 344939 349107 353066 356921 361255 366738 373631 381542 389730 397790 406063 415333 426185
63617 426185 438827 453352 469795 487904 507213 527497 548931 571761 596068 621903 649268
63606 649268 677802 706815 735817 764593 792445 817640 838120 852682 861265 864408 862900 857869
63594 857869 850623 842150 832954 823374 813720 803948 793463 781486 767606 751911 734717 716301 696914
63581 696914 676997 657342 638868 622142 607157 593745 582144 573021 566863 563495 562213 562334 563563
63568 563563 565879 569205 573259 577761 582603 587706 592840 597858 603070 609086 616118 623734 631461 639421
63554 639421 648211 658432 670570 685120 702452 722618 745577 771585 801253 835370 874724 919533
63542 919533 968173 1016252 1057456 1086007 1098940 1096815 1083011 1062311 1039338 1017391 998199 982325
63530 982325 969548 959014 949541 940055 929705 917679 903176 885588 864528 839834 811932 782211
63518 782211 752573 724386 697974 673044 649254 626426 604693 584645 566947 551629 538054
63507 538054 525729 514766 505407 497553 490970 485468 480525 475226 469092 462728 457205 453032 450115 448323
63493 448323 447458 446826 445550 443385 440799 438272 435970 434054 432713 431810 431040 430595 431148 433013 435770 438966
63477 438966 442710 447220 452259 457437 462736 468179 473142 476586 478073 478162 477638 476553 474181 469804 463469
63462 463469 456003 448370 441070 434197 427900 422453 417832 413616 409586 406189 404046 403155 402967 403204 404242
63447 404242 406554 410127 414596 419765 425794 432985 441532 451450 462650 475139 489237 505541 524704
63434 524704 547402 574571 607362 646315 690071 734813 775287 807024 828133 839336 842614 840142
63422 840142 834424 828646 825950 828150 835592 848326 866849 891314 920469 952001 983839 1014536
63410 1014536 1042422 1065098 1080389 1087704 1088157 1083406 1074609 1062515 1048157 1033000 1018212 1003903
63398 1003903 989270 973434 955975 936682 915168 891052 864419 835912 806474 777197 749212
63387 749212 723288 699443 677294 656897 638942 624014 611971 602293 594717 589242 585690 583655
63375 583655 582864 583354 585309 588918 594342 601553 610153 619552 629409 639830 651140 663610 677445 692924
63361 692924 710453 730394 752696 776697 801580 827264 854690 884883 917709 951703 984987
63350 984987 1015976 1043231 1065186 1080494 1088654 1090167 1086131 1077817 1066516 1053552 1040168 1027132
63338 1027132 1014324 1000817 985572 968087 948295 926090 901333 874353 846075 817504 789373
63327 789373 762351 737213 714510 694352 676825 662481 652077 645997 644296 647242 655051 666400
63315 666400 677279 682099 676835 661543 639812 615791 591892 569011 547905 529405 513594 499839
63303 499839 487831 477839 469689 462302 454795 447430 440806 434700 428512 422440 417185 412614 407753 402297
63289 402297 397175 393271 390354 387678 384927 381954 378329 373933 369670 366718 365149 363951 362376 360621
63275 360621 359158 358024 357044 356230 355639 355170 354723 354296 353726 352630 350866 348828 347071 345843 345145 344918
63259 344918 344815 344086 342199 339587 337322 336044 335515 335262 335200 335406 335712 335916 336246 337193 338851 340683 342060
63242 342060 342887 343631 344810 346530 348555 350771 353427 356726 360235 363048 364765 366103 368212 371474 375242
63227 375242 378784 382125 385794 389977 394224 397986 401235 404408 407768 410999 413617 415686 417842 420536
63213 420536 423525 426384 429222 432506 436290 440114 443670 447104 450494 453489 455736 457313 458402 458778
63199 458778 458022 456191 453890 451689 449690 447738 445867 444455 443982 444659 446281 448539 451433 455241 460123
63184 460123 466073 473293 482166 492585 503690 514650 525481 536674 548283 559893 571342 582838
63172 582838 594329 605307 615416 624787 633604 641805 649452 657010 664908 673011 680699 687114 691156
63159 691156 691740 688608 682675 675073 665910 654453 640483 624994 609353 594082 578688 562555 545877
63146 545877 529789 515570 503599 493152 483355 474293 466918 461889 458807 456668 454821 453263 452206
63133 452206 451635 451274 450874 450516 450668 451863 454244 457462 461034 464724 468586 472850 477838 483791 490591
63118 490591 497749 504786 511539 518014 524153 529903 535332 540378 544691 548087 551127 554776 559351 564135
63104 564135 568191 571341 574209 577510 581406 585352 588513 590641 592623 595828 600757 606668 612657 618682
63090 618682 625261 632740 641230 650711 660563 669442 676425 682014 687168 691609 694022 693946 692357 690142 686940
63075 686940 681921 674847 665945 655586 644695 634611 625756 617114 607852 598794 591324 585386 579780
63062 579780 574211 569829 567619 567292 568006 569313 571152 573603 576892 581056 585547 589898 594870 602049 611943
63047 611943 623311 634727 645998 657551 669287 680899 692701 705207 718124 730587 742347
63036 742347 754014 766071 778109 789140 798418 806015 812853 820061 828061 836345 844137 850840 855653
63023 855653 857514 856098 852452 847853 842227 834413 823829 811128 797296 782979 768823 755545 743259
63010 743259 731372 719675 709025 700517 694435 690562 689104 690574 694828 700910 708028 716262 726136
62997 726136 737882 751381 766572 783460 801680 820371 838712 856530 874213 892098 910173
62986 910173 928379 946870 965698 984450 1002483 1019412 1035051 1048892 1060038 1067717 1071618 1071670
62974 1071670 1067819 1060186 1049072 1034519 1016116 993683 968057 940809 913127 885288 857367 830127
62962 830127 804788 781914 760829 740364 720095 700707 683134 667512 653046 638792 624391
62951 624391 610111 596309 582978 569782 556494 543394 531154 520208 510202 500218 489696 479124
62939 479124 469662 462036 455881 450238 444595 439239 434611 430597 426666 422522 418326 414311 410501 406912
62925 406912 403756 401287 399538 398332 397327 396013 393976 391433 389311 388450 388769 389426 389712 389564 389301 389220
62909 389220 389467 390020 390687 391294 391953 392987 394597 396764 399430 402557 406041 409835 414172 419355 425316
62894 425316 431704 438463 445898 453956 461848 468774 474794 480692 487158 494432 502431 510676 518156 523860
62880 523860 527634 530107 531601 531627 529725 526357 522423 518091 512691 505722 497441 488352 478736 469005 460068
62865 460068 452676 446500 440353 433422 425976 418790 412295 406453 401137 396332 392104 388582 385901 383969
62851 383969 382406 380865 379290 377777 376381 375276 374817 375054 375299 374670 373133 371667 371290 372212 373996 376085
62835 376085 377899 378832 378665 377883 377222 376905 376603 376081 375509 375073 374728 374592 375205 376936 379194 380705 380744 379855
62817 379855 379141 379070 379297 379541 380133 381496 383350 384851 385469 385411 385121 384671 383933 383209 383274 384611 386818 388983
62799 388983 390630 392067 393813 395938 398069 399804 400875 401093 400560 399995 400470 402544 405812 409463 413154
62784 413154 417209 422172 428439 436176 445235 455121 465311 475708 486593 498052 509686 521018 532075
62771 532075 543422 555659 568901 582588 595733 607470 617561 626324 634004 640288 644591 646705
62759 646705 646875 645238 641466 635178 626527 616125 604435 591540 577542 562894 548162 533637 519429
62746 519429 505842 493375 482259 472147 462309 452210 442006 432542 424661 418294 412460 406438 400792
62733 400792 396752 394588 393068 390731 387348 383898 381434 380242 379862 379563 378905 378092 377769 378404 379993 382300
62717 382300 385041 387768 390093 392368 395699 400788 407027 413281 419372 426233 434699 444760 456007 468195
62703 468195 481102 494336 507712 521632 536859 553970 573085 594010 616555 640808 667047
62692 667047 695323 725253 756424 788846 822714 857856 893653 929219 963182 993462 1017995
62681 1017995 1035856 1047248 1052382 1050970 1042933 1028938 1009832 986008 957815 926174 892363 857385
62669 857385 821986 787009 753252 720973 689902 659760 630664 603165 578047 555863 536418
62658 536418 518943 503013 489060 477599 468136 459317 450165 440821 432072 424463 417997 412311 406941
62645 406941 401569 396270 391534 387938 385659 384275 383126 381982 381264 381434 382255 382949 383074 382862 382589 382003
62629 382003 380683 378644 376229 373655 371042 368701 366892 365336 363424 361001 358635 357034 356463 356759 357533
62614 357533 358197 358131 357194 355962 355221 355244 355720 356316 356995 357746 358268 358213 357660 357113 356991 357380 358320 360089 362923
62595 362923 366612 370617 374506 378125 381535 385063 389297 394669 401025 407827 414699 421429 427643 432984
62581 432984 437622 442009 446012 448814 449917 449759 449060 447952 446013 442762 437878 431405 424094 417114 411040
62566 411040 405452 399856 394475 389702 385302 380862 376683 373503 371507 370295 369699 369911 370785 371613 371740
62551 371740 370997 369579 367950 366763 366325 366167 365660 365013 365040 365902 366744 366761 366090 365473 365532 366538 368339 370258
62533 370258 371514 372026 372481 373432 374802 376400 378406 380960 383717 386280 388842 392044 396355 401813 408183
62518 408183 415159 422608 430810 440269 451164 463271 476482 491040 507116 524520 543103 563054
62506 563054 584573 607558 631818 657145 682850 707671 730561 751255 769714 785484 798146
62495 798146 808050 815971 822224 826750 829934 832733 836030 840458 846835 856033 868174 882503 898397
62482 898397 916128 936245 958410 981000 1001643 1018068 1028933 1034317 1035328 1032817 1026313 1014247
62470 1014247 995213 969046 936974 900928 862645 823189 783138 743087 703823 666040 630165
62459 630165 596670 566396 540206 518243 499685 483397 468813 456108 445588 437125 430297 424895
62447 424895 421009 418580 417123 416035 415060 414287 413836 413762 414136 414922 415776 416274 416468 416933 417993 419065 419106
62430 419106 417708 415511 413429 411709 409975 407976 405923 404037 402142 399983 397700 395667 393898 391996
62416 391996 389812 387785 386360 385301 383952 382165 380611 380005 380227 380479 380217 379677 379380 379359 379131 378430 377726
62399 377726 377886 379332 381666 384093 386152 388090 390608 394297 399206 404834 410419 415360 419583 423693
62385 423693 428571 434583 441232 447876 454711 462602 471914 482007 492128 502279 512796 523536 534071
62372 534071 544405 554848 565320 575474 585539 596401 608703 622426 637518 654349 673344
62361 673344 694690 718765 746440 778609 815697 857765 904638 955664 1009835 1066463 1125265
62350 1125265 1185365 1244607 1300316 1350324 1392827 1425918 1448378 1460926 1465793 1464795 1458209 1445581
62338 1445581 1426900 1402694 1373497 1339708 1301894 1260999 1218319 1175304 1133128 1092268 1052591
62327 1052591 1013930 976479 940665 906781 874748 844162 814626 786191 759385 734623 711728
62316 711728 690198 669773 650453 632120 614618 598206 583507 570869 560030 550499 542002 534494
62304 534494 528002 522510 517828 513561 509518 506150 504200 503797 504168 504421 504432 504831 506302 509000 512441 515917
62288 515917 519173 522694 527067 532089 536826 540628 543664 546296 548328 549292 549336 549437 550685 553437 557203
62273 557203 561285 565563 570537 576558 583258 590082 597251 605756 616405 629367 644712 662779 683791
62260 683791 707683 734712 765738 801421 841572 885775 934311 987714 1045549 1106221 1167913
62249 1167913 1229072 1287894 1341884 1388267 1424763 1450131 1464394 1468595 1463913 1450884 1429709 1401174
62237 1401174 1366745 1327654 1284341 1237012 1186408 1133841 1080864 1029079 979880 933975 891334
62226 891334 851862 815968 784258 756788 732901 711664 692397 674928 659506 646256 634597
62215 634597 623452 612269 601532 591926 583306 574957 566690 559056 552391 546214 539892 533592 528255
62202 528255 524731 523110 522745 522735 522447 521812 521224 521146 521876 523622 526671 531344 537784 545804 554928 564630
62186 564630 574611 584851 595399 606308 617883 630746 645246 660819 676240 690504 703163 713825
62174 713825 722003 727799 732434 737614 744511 753656 765609 781249 801382 826411 856421 891294 930658
62161 930658 973963 1020537 1069325 1118607 1166259 1210346 1249194 1281102 1304702 1320001 1328637 1332617
62149 1332617 1332793 1328654 1319281 1304203 1283605 1258247 1229239 1197583 1163878 1128601 1092594 1056953
62137 1056953 1022480 989563 958569 929966 903901 879956 857561 836471 816666 797993 780224
62126 780224 763457 748159 734696 722910 712317 702726 694583 688608 685030 683292 682646 683015 685036
62113 685036 689257 695547 703505 713159 724951 739119 755395 773205 791579 808634 821750 829019
62101 829019 830679 828886 826040 823663 822701 824058 828069 833555 838008 839037 835661 828438 818819 808583
62087 808583 799418 792529 788447 787312 789257 794418 802599 813211 825648 839705 855556 873385 893174
62074 893174 914819 938305 963654 990687 1018890 1047482 1075603 1102664 1128795 1154926 1182137
62063 1182137 1210722 1240063 1269483 1298943 1328668 1358255 1386353 1411055 1430507 1443500 1449981
62052 1449981 1450914 1447310 1439513 1427668 1412460 1394597 1373688 1348467 1318408 1284491 1248179 1210373
62040 1210373 1171736 1133254 1095741 1059288 1023878 990132 958714 929365 901464 875379 852290
62029 852290 832555 815154 799121 784711 772654 762812 754264 746403 739287 732965 726967 720572 713302
62016 713302 705063 696019 686451 676627 666693 656708 646845 637578 629596 623369 618764 615236 612511 610934
62002 610934 611037 612961 616476 621283 626995 633005 638879 644718 650643 655941 659353 660366 659658 658004 655259
61987 655259 650821 644672 637428 629613 621353 612618 603354 593468 583156 573163 564290 556602 549525 542771
61973 542771 536811 532285 529317 527563 526606 526030 525361 524287 522939 521771 521189 521393 522404 523982 525664
61958 525664 527156 528657 530475 532348 533651 534493 536107 539655 544891 550533 555865 561377 567867 575638
61944 575638 584872 596139 609902 625909 643693 663502 686148 711894 739992 769362 799342 829734
61932 829734 860541 891739 922951 953215 981467 1007347 1031226 1053293 1072886 1088867 1100349
61921 1100349 1106949 1108670 1105809 1098837 1088240 1074613 1058965 1042739 1027441 1014452 1005048 1000188
61909 1000188 1000157 1004732 1013765 1027182 1044406 1064384 1086417 1110328 1135377 1159432 1179769 1194456
61897 1194456 1202630 1203956 1198478 1186824 1169936 1148628 1123856 1097167 1070222 1043764 1017567 991479
61885 991479 966099 942302 920520 900717 882748 866447 851409 836800 821515 804760 786714
61874 786714 768536 751556 736510 723601 712847 704024 696563 690033 684614 680772 678651 678203 679607
61861 679607 682949 687753 693676 701629 713270 729209 748490 770219 794868 823460 856201 892648
61849 892648 932779 976983 1025131 1076304 1129447 1183769 1238434 1292244 1343714 1391299 1433639
61838 1433639 1469774 1498937 1519998 1531558 1533092 1525801 1511908 1493343 1471716 1449294 1429045 1413408
61826 1413408 1403572 1400102 1403526 1413796 1429667 1449211 1470715 1492615 1512796 1528620 1537718 1538463
61814 1538463 1529766 1511002 1482391 1445119 1400862 1351356 1298404 1243877 1189328 1135758 1083972
61803 1083972 1034900 989242 946982 907792 871945 840332 813364 790253 769653 750777 733604
61792 733604 718343 705121 693973 684616 676262 668167 660420 653670 647957 642404 636342 630236 624936
61779 624936 620461 616157 611846 608063 605062 602260 599026 595594 592766 590894 589532 588080 586502 585342
61765 585342 585096 585642 586342 586828 587650 589911 594145 599632 604934 609085 612297 615636 620111 625942 632536
61750 632536 639079 645081 650389 654922 658649 661701 664199 666051 667226 668133 669227 670146 669892 668136 665903
61735 665903 664529 664358 664903 665884 667432 669457 671506 673269 674696 675656 675991 675989 676207 676754 677236 677545 678162
61718 678162 679504 681476 683854 686544 689174 691001 691669 691582 691150 690140 688289 685999 683720 680969 676774
61703 676774 671066 664950 659547 655097 651248 647709 644448 641630 639438 637650 635475 632237 628289 624861
61689 624861 622939 622565 623126 623842 623966 623092 621519 619964 618791 617849 617014 616392 615827 614767 612939 610788
61673 610788 608994 607810 607088 606641 606310 605934 605427 604782 603945 602998 602385 602532 603206 603837 604542 606157 608890
61656 608890 611618 613050 613163 613028 613596 615148 617485 620077 622306 624093 626066 628680 631526 634104 636920
61641 636920 640980 646282 651519 655349 657420 658138 658038 657500 656590 654916 651938 647503 641852 635233 627888
61626 627888 620364 613368 607242 601867 597026 592557 588301 584327 581077 578786 576994 575211 573899 573985 575431
61611 575431 577109 578187 578705 578428 576170 571008 563605 555542 547702 539958 532176 524780 518317 512959 508497
61596 508497 504481 500439 496218 492078 488273 484727 481331 478244 475488 472523 468724 464184 459610 455455
61582 455455 451660 448265 445710 444237 443311 441939 439553 436430 433352 430943 429273 427991 426734 425348
61568 425348 423765 421933 419969 418165 416650 415177 413513 411851 410544 409518 408351 406957 405796 405197
61554 405197 404821 404076 402902 401832 401319 401268 401266 401092 400892 400940 401333 401914 402457 402942 403584 404507 405479 406126 406455
61535 406455 406871 407581 408277 408769 409725 412167 416110 420197 423024 424435 425180 425629 425438 424338 422626 420690
61519 420690 418487 415721 412350 408735 405436 402925 401294 400171 399049 397726 396343 395091 394100 393497 393212
61504 393212 392749 391514 389470 387178 385184 383630 382539 381996 381943 382145 382566 383445 384748 385865 386172 385633
61488 385633 384691 383774 383185 383117 383459 383718 383495 382933 382499 382465 382826 383559 384610 385756 386726 387444 388003 388480 388954
61469 388954 389529 390135 390433 390137 389358 388477 387763 387258 386842 386255 385239 383882 382676 382090 382287 383305 385149
61452 385149 387379 389013 389360 388797 388329 388517 389198 390041 390869 391519 391948 392516 393728 395668 398071 400985 404831
61435 404831 409708 415098 420467 425771 431111 436244 440767 444538 447687 450411 452993 455785 458874 461911
61421 461911 464617 467380 471035 475904 481253 485826 488887 490643 491669 492107 491575 489792 486995 483595 479708
61406 479708 475400 471226 468057 466164 464769 462701 459412 455245 450968 447251 444467 442630 441402 440268
61392 440268 438871 437261 435803 434855 434523 434646 434948 435142 435026 434620 434197 434023 434066 434170 434515 435582 437486
61375 437486 439631 441357 442762 444563 447181 450344 453549 456592 459504 462267 464844 467380 470112 473061
61361 473061 475959 478589 481144 484095 487654 491541 495422 499415 503939 509194 515211 522321 531088 541624
61347 541624 553484 566483 581161 598098 617159 637667 658751 678997 696377 709445 718508 724917
61335 724917 729376 731655 731769 730385 727827 723553 717099 708900 699765 690076 680005 670058 660880 652776
61321 652776 645860 640350 636230 632860 629467 625921 622602 619588 616495 613180 610183 608187 607297 607087 607291
61306 607291 608186 610274 613753 618485 624409 631716 640546 650778 662214 674645 687387 699069 708306
61293 708306 714465 717386 716668 711925 703706 693445 682392 671295 661173 653414 648489 645302 642525
61280 642525 640106 638805 638715 639199 640109 642109 645651 650317 655539 661416 668473 676890 686329 696404 707095
61265 707095 718717 731473 744984 758346 770825 782480 794025 806260 819869 835598 854143
61254 854143 875631 899343 924006 948234 970679 990045 1005136 1014912 1018541 1015550 1006096 991156
61242 991156 972434 951854 930832 909925 889311 869584 851740 836269 822660 810183 798906
61231 798906 789558 782475 777105 772568 768362 764440 760896 757778 755171 753360 752861 754029 756513 759241
61217 759241 761204 762222 762806 763390 763874 763757 762520 760041 756958 754483 753503 753888 754971 756567 759083 762653
61201 762653 766681 770427 773757 777138 781205 786532 793596 802697 814069 828112 845353 865961 889514
61188 889514 915419 943343 972948 1003254 1032625 1059497 1083016 1102861 1118742 1130434 1138397 1143966
61176 1143966 1148457 1152117 1154268 1154528 1153336 1151057 1147055 1140235 1130337 1118163 1104511 1089371 1072258
61163 1072258 1052912 1031517 1008570 984810 961056 937938 915807 894878 875304 857128 840545
61152 840545 826235 815036 807050 801338 796759 792977 790493 789923 791574 795550 801877 810235 819605 828266
61138 828266 834289 836334 834246 828949 821757 813678 805253 796859 789070 782746 778702 777192 777805 780041
61124 780041 783990 790266 799338 811199 825681 842789 862557 884788 909056 934744 960958 986750
61112 986750 1011809 1036804 1062643 1089237 1115218 1138987 1159886 1178252 1194501 1208506 1219924
61101 1219924 1228835 1235752 1241023 1244500 1245826 1244759 1240970 1233691 1221904 1204995 1183229 1157621 1129444
61088 1129444 1099755 1069300 1038760 1008879 980176 952709 926555 902438 881263 862878 845934
61077 845934 829430 813830 800150 788487 778181 768975 761048 754082 747380 741042 736111 733248 731974
61064 731974 731530 731736 732620 733898 735378 737407 740385 744145 748233 752581 757615 763888 771817 781495 792638
61049 792638 805011 818922 834882 852777 872009 892505 914850 939191 964862 991442 1019296
61038 1019296 1048490 1077962 1106571 1134395 1162250 1190420 1218604 1246672 1274657 1302335 1329481
61027 1329481 1356314 1383123 1409889 1436857 1465032 1495450 1528421 1564195 1603748 1648053 1696973
61016 1696973 1749607 1805209 1863027 1922162 1982864 2047527 2119252 2200085 2291906 2398128 2522504
61005 2522504 2666395 2828888 3009600 3210149 3433996 3687582 3981772 4329830 4743829
60996 4743829 5235434 5820283 6519058 7355046 8355336 9556008 11003761 12755405 14883098
60987 14883098 17468822 20546707 23991911 27446298 30395783 32397315 33298706 33284436
60979 33284436 32741257 32086260 31671525 31737639 32335774 33240826 33978249 34022244 33051552 31077504
60969 31077504 28373701 25302593 22177607 19213976 16534707 14190047 12180102 10479871
60961 10479871 9057059 7877103 6903582 6102041 5443779 4904500 4461235 4092777 3781906
60952 3781906 3515347 3282517 3075768 2890723 2724508 2573924 2436151 2310197 2196173
60943 2196173 2093583 2001260 1918177 1842917 1772726 1704318 1635579 1565883 1495392 1425042 1356750
60932 1356750 1292395 1232590 1177133 1126226 1080331 1039126 1001673 967607 937222 910435 886463
60921 886463 864628 844745 826698 810265 795476 782569 771527 762120 754405 748717 745178 743612
60909 743612 743814 745488 748070 751104 754647 758848 763254 767057 769864 771753 772702 772484 770942 767823 762542
60894 762542 754693 744688 733345 721066 707990 694647 681637 668845 655776 642619 630166 618736
60882 618736 608109 598524 590660 584336 578250 571515 564682 558673 553475 548523 543792 539756 536549 533888
60868 533888 531621 529884 528839 528686 529849 532706 537144 542620 548659 555213 562576 570929 579806 588177
60854 588177 595444 602287 609988 618811 627619 635252 641659 647384 652582 657142 661253 665155 668607 671183
60840 671183 672984 674441 675460 675298 673334 669570 664282 657590 649540 640466 631073 622092 613724 605382
60826 605382 596275 586400 576693 567974 560053 552254 544505 537365 531024 524918 518488 511933 505952 500968
60812 500968 496835 493114 489439 485727 482227 479358 477394 476323 475996 476285 477008 477855 478671 479794 481808
60797 481808 484791 488075 491046 493997 497739 502383 507113 511363 515655 520804 526795 533099 539819 547647
60783 547647 556673 566061 575165 584288 593935 603837 613256 621944 630292 638680 647082 655281 663225 671112
60769 671112 679225 687608 695914 703825 711681 720422 730737 742500 755107 768064 781096 794078 807194
60756 807194 821013 836125 852709 870479 888871 907290 925583 944379 964635 986663 1009908
60745 1009908 1033706 1057782 1081797 1104876 1125906 1143926 1158079 1167743 1173000 1174378 1171696 1163785
60733 1163785 1149953 1131177 1109183 1084855 1058300 1030011 1000959 971754 942673 914456 888146
60722 888146 864034 841608 820666 801690 784899 769737 755626 742570 730732 720050 710568 702514
60710 702514 695626 688940 681616 673537 664826 655372 645288 635251 625738 616270 606016 594908 583628
60697 583628 572716 562210 552022 542140 532527 523242 514601 506837 499687 492723 486019 480125 475400
60684 475400 471762 468985 466780 464597 461919 458946 456572 455468 455521 456304 457704 459725 462007 463993 465509
60669 465509 466868 468433 470328 472511 474825 476920 478370 478970 478819 478073 476819 475226 473658 472490 471915
60654 471915 471975 472734 474388 477294 481797 487786 494450 500821 506748 513022 520249 527892 534781 540346 544874
60639 544874 548664 551488 553026 553395 553059 552550 552380 552818 553511 553650 552698 550800 548370 545697 543092 540864
60623 540864 538770 535959 531957 527393 523246 519654 516061 512271 508606 505087 501229 496884 492653 489200
60609 489200 486624 484728 483439 482605 481812 480838 480026 479797 479959 479909 479415 478770 478255 477835 477512 477569 478210 479146
60591 479146 479855 480214 480650 481654 483344 485556 488073 490588 492659 494048 495086 496352 498030 499828 501537
60576 501537 503248 504989 506690 508747 512062 517066 523092 529330 536157 544875 556233 569828 584995
60563 584995 601610 619821 639622 661126 684877 711298 739755 768344 794645 816635 833056
60552 833056 843167 846453 842859 833389 820190 805617 791200 777646 765654 756311 750648 749200 752108
60539 752108 759408 771079 787090 807605 833100 864118 900822 942595 987834 1034047 1078190 1116961
60527 1116961 1147099 1166069 1172978 1168752 1155375 1135247 1111314 1086926 1064575 1044827 1027055 1011036
60515 1011036 997203 985562 975289 965577 956279 947689 940388 935413 933744 935337 939217 944856 952776
60502 952776 963559 977006 992764 1011230 1033296 1059728 1091391 1129780 1176770 1233963 1302452
60491 1302452 1382709 1474162 1575230 1684117 1799168 1917946 2036375 2149416 2252366 2340957
60481 2340957 2410557 2456259 2474220 2462798 2422569 2355702 2265407 2155746 2031822 1899938 1766871
60470 1766871 1638348 1518052 1407933 1308882 1220804 1142740 1073696 1013209 960711 914828 874027
60459 874027 837698 805847 777943 752898 730135 709883 692283 676931 663404 651545 640989
60448 640989 631081 621588 612965 605534 598887 592496 586513 581537 577769 574781 571988 569088 566147 563425
60434 563425 561068 558938 556923 555395 554943 555526 556263 556271 555426 554058 552276 549900 546840 543185 539103 534975
60418 534975 531439 528920 527213 525858 524875 524736 525599 526995 528293 529153 529408 528932 527950 527123 526941 527152 527149
60401 527149 526865 526853 527475 528459 529455 530657 532509 534964 537395 539219 540324 540925 541267 541514 541757 542112 542880
60384 542880 544442 546756 549117 550827 552012 553359 555004 556205 556352 555891 555896 556898 558439 559638 560039 559986
60368 559986 560251 561175 562226 562682 562731 563413 565346 567987 570445 572557 574732 577127 579560 581971 584418 586662
60352 586662 588240 589030 589401 589823 590624 591989 593807 595520 596596 597279 598546 601118 604688 608286 611324
60337 611324 614073 617089 620271 622762 623905 624017 623790 623097 621118 617759 614212 611617 609762 607742 605450
60322 605450 603650 602861 602942 603746 605359 607582 609795 611625 613351 615514 618485 622485 627616 633717 640506
60307 640506 647942 656209 665409 675714 687822 702781 721286 743616 770495 803394 843354 889318
60295 889318 937644 983350 1022045 1051106 1069248 1075301 1067993 1047373 1016066 978436 938523 899106
60283 899106 862260 829579 801446 776849 754555 734219 716157 700543 687193 675723 665551
60272 665551 656079 647194 639271 632386 625919 619422 613493 609202 606740 605166 603505 601630 600015 599032
60258 599032 598745 599107 600043 601316 602510 603279 603623 603836 604150 604430 604256 603291 601573 599630 598291 598096 598697
60241 598697 599052 598452 597221 596174 595613 595190 594591 593873 593273 593152 594067 596399 599747 603171 606130 608847
60225 608847 611708 614712 617746 621001 624909 629773 635422 641047 645505 648246 649910 651635 653888 656471
60211 656471 659468 663346 668094 673066 677927 682900 687764 691493 693525 694658 695942 697295 698032 698229 698590
60196 698590 699192 699390 698988 698631 698783 698986 698465 696988 694810 692173 689166 685883 682414 678736 674836 670895
60180 670895 667255 664138 661415 658678 655668 652611 650058 648413 647742 647915 648657 649474 649944 650197 650765 651783
60164 651783 652766 653362 653953 655113 656789 658419 659621 660415 660935 661322 661796 662492 663322 664241 665511 667451 670151
60147 670151 673722 678587 685099 693001 701707 711044 721255 732227 743127 752965 761319 768414 774680
60134 774680 780341 785399 789945 794384 799155 804195 808880 812519 814649 814883 812976 809273 804651 799747
60120 799747 794611 789417 784939 781834 779838 778259 776930 776055 775439 774635 773688 773047 772779 772582 772563 773255 774766
60103 774766 776600 778544 780997 784061 786811 787989 787144 784823 781935 779193 776895 774954 773254 772129
60089 772129 772275 774048 777073 780687 784550 788755 793593 799317 805898 812871 819605 825756 831223 835675
60075 835675 838515 839356 838111 834440 827614 817319 804327 790062 775671 761784 748848 737240 727085
60062 727085 718269 710653 704083 698285 692956 687871 682762 677192 670898 664193 657743 651874 646336 640797
60048 640797 635379 630550 626692 623986 622639 622906 624748 627687 631176 635034 639243 643418 646848 649128
60034 649128 650445 651079 650959 649958 648272 646141 643445 639977 635900 631460 626452 620559 614096 607763 601655
60019 601655 595229 588372 581690 575408 568851 561687 555060 550513 548096 546412 544461 542575 541389 540771
60005 540771 540234 539826 540045 541183 543156 545811 549067 552940 557665 563522 570182 576544 581760 586289 591330
59990 591330 597169 602784 607311 611267 615777 621005 625966 629776 632547 635071 638089 641897 646179 650048
59976 650048 652568 653440 652997 651555 649150 645943 642471 639243 636430 634121 632471 631281 629831 627604 625006
59961 625006 623000 622150 622350 623255 624491 625505 625772 625323 624793 624751 625163 625544 625567 625423 625636 626475 627530 628080
59943 628080 628000 628083 629215 631374 633636 634939 634662 632780 629962 627369 625843 625277 625070 625047 625488 626301 626807
59926 626807 626559 625922 625567 625691 626006 626281 626691 627632 629283 631278 632940 633985 634858 636076 637413 638205 638385
59909 638385 638693 639765 641514 643550 645719 647953 650019 651771 653392 655055 656577 657717 658682 660167 663016
59894 663016 667862 674721 682685 690330 696754 702042 706609 710453 713439 715932 718620 721833 725484 729585
59880 729585 734280 739384 744423 749299 754435 759958 765132 768948 771031 771594 770695 768077 763753 758272 752144
59865 752144 745438 738245 731167 724854 719209 713664 708187 703387 699427 695576 691259 687047 683933 682008
59851 682008 680559 679323 678913 679937 682289 685410 688768 691984 695090 698925 704816 713576 725071 738798
59837 738798 754420 771502 789177 806289 821510 833253 840237 842737 842862 843016 844248 846364 848991
59824 848991 851617 852713 849833 841136 826674 808123 787595 766741 746577 727699 710575 695590
59812 695590 682767 671630 661617 652633 644951 638562 632919 627479 622333 618115 615286 613596 612204
59799 612204 610334 607845 605202 602972 601399 600389 599701 599032 598083 596704 594905 592693 589989 586792 583232
59784 583232 579377 575136 570547 566025 562082 558831 555989 553316 550878 548881 547446 546559 546093 545788 545414
59769 545414 545084 545313 546539 548536 550467 551693 552454 553548 555399 557705 560117 562785 565909 569070 571606
59754 571606 573590 575887 579149 583172 587374 591416 595114 598218 600729 603204 606358 610365 614657 618249
59740 618249 620205 620189 618862 617524 617085 617473 618068 618355 618003 616857 615296 614238 614194 614585 614510 613999 613837 614178
59722 614178 614043 612445 609606 606765 605014 604484 604486 604274 603760 603473 603866 604852 606137 607692 609575 611627 613835
59705 613835 616744 620813 625454 629471 632590 635766 639708 643901 647640 651368 656099 661834 667421 672043
59691 672043 676063 680093 683828 686272 686872 686000 684407 682591 680793 679289 678388 678130 678232 678429 678743 679222
59675 679222 679537 679122 677823 676079 674251 671937 668334 663288 657678 652582 648249 644157 639950 635990 632864
59660 632864 630677 629135 628184 628123 629003 630328 631679 633338 635891 639302 642898 646271 649703 653421 656873
59645 656873 659175 660026 659711 658282 655297 650564 644738 638827 633286 627914 622608 617851 614358 612363 611448
59630 611448 610991 610649 610399 610168 609587 608184 605856 603122 600819 599498 599111 599257 599729 600747 602577 604948
59614 604948 606967 607740 607038 605284 603013 600588 598414 596982 596431 596318 596168 596134 596708 597840 598799 599022 598682
59597 598682 598188 597524 596450 595171 594320 594231 594504 594420 593680 592676 592071 592117 592416 592373 591805 590875 589535 587419
59579 587419 584453 581234 578459 576209 573979 571226 567704 563577 559549 556559 554912 553825 552185 549660
59565 549660 546795 544292 542669 542313 543199 544539 545324 545347 545311 545892 547174 548992 551271 553852 556442 558892
59549 558892 561217 563345 565331 567700 570957 574703 578008 580841 584367 589490 595926 603207 611845 622946
59535 622946 637386 655928 679101 705463 730351 747919 755161 753608 747258 739679 733025 728467 726562
59522 726562 727409 730863 736405 742726 748047 751345 752904 753275 752053 748285 741831 733649 724632 714787 703821
59507 703821 692082 680481 669746 660237 652351 646446 642143 638199 633550 628285 623280 619103 615712
59494 615712 613025 611173 610117 609556 609423 609990 611235 612489 613041 612880 612608 612902 614232 616795 620428 624808
59478 624808 629889 635865 642574 649443 656337 663914 672624 681756 690085 697139 703133 707904 710761 711440
59464 711440 710461 708441 705738 703084 701750 702521 704968 708376 713114 720414 730853 743690 757852 772979
59450 772979 789058 805486 821163 835576 849242 862819 876091 887978 897110 902024 901300 894349
59438 894349 882173 866813 849950 832472 815247 799466 785820 773932 763072 753031 743915 735594
59426 735594 727894 721043 715486 711526 709556 710318 714417 721784 732015 744969 760550 778205 797173
59413 797173 817035 837647 859006 881771 907166 934912 961019 978757 982671 971796 949456 920978
59401 920978 891639 865434 844594 830230 823558 825689 835416 847617 854910 851593 836389 812049
59389 812049 782995 753183 725203 700344 678978 660884 645561 632652 622208 614425 609140 605781
59377 605781 603822 603031 603213 603991 605093 606615 608738 611300 613953 616748 620176 624386 628620 631829 633900
59362 633900 635938 639178 643906 649712 656396 664022 672247 680384 688393 697255 707879 720122 733357
59349 733357 747695 764057 783048 804236 826561 849215 872072 895416 919224 942706 964675
59338 964675 984338 1001393 1015351 1025369 1031047 1032857 1031362 1026435 1017774 1005799 991532 975911
59326 975911 959679 943560 927878 912346 896859 882182 869133 857405 845989 834637 823984
59315 823984 814318 805167 796253 787988 780730 774269 768325 762967 758216 753810 749675 746199 743753 742291
59301 742291 741642 741803 742775 744501 747089 750773 755604 761535 768827 777892 788771 801310 816035 834401
59287 834401 857828 886466 918339 949071 972885 985288 985523 976316 961458 944216 927441 913426
59275 913426 902870 894989 889397 887185 889490 895818 904542 914457 925027 935656 945678 954816 962787
59262 962787 968541 970643 968429 962267 952772 940321 925442 909099 892305 875618 859035 842293
59250 842293 825325 808577 792829 778650 766160 755314 746172 738837 733463 730380 729872 731685 735124
59237 735124 739713 745308 751514 757646 763590 770026 777265 784313 789670 792712 793779 793191 790778 786245
59223 786245 779442 770378 759384 747275 735012 723169 711941 701502 692075 683751 676539 670502 665637
59210 665637 661689 658258 655005 651758 648638 646136 644727 644270 644190 644376 645362 647385 649843 652250 655223
59195 655223 659776 665830 672153 677851 683360 689755 697452 705843 714065 721839 729513 737330 744902 751628
59181 751628 757484 763078 768927 774994 780942 786434 791213 795363 799663 805194 812338 820481 828803 836940
59167 836940 844843 852619 860794 870127 880743 891778 902127 911062 917974 922236 923835 923558 921993 918766
59153 918766 913243 905511 896109 885243 872961 859776 846553 833902 822120 811428 801855 793230
59141 793230 785680 779641 774939 770457 765424 760543 757050 755082 753843 753026 753087 754203 755968 758156 760964
59126 760964 764397 768204 772576 778163 785201 793271 802172 812351 824178 837316 851165 865512 880445
59113 880445 895993 912137 928891 946036 962946 978935 993645 1007004 1018906 1029045 1036983 1042375
59101 1042375 1045260 1046045 1045065 1042239 1037378 1030758 1023125 1015097 1006778 997947 988490 978653 969013 960176
59087 960176 952432 945696 939711 934112 928294 921566 913538 904151 893292 880754 866720 851837 836683
59074 836683 821558 807055 794213 783658 774942 767131 759757 752915 746880 742027 738718 736711 734996
59061 734996 732710 729963 727464 725688 724734 724453 724146 722701 719756 716337 713600 711308 708376 704626 701072
59046 701072 698528 696851 695663 694989 694967 695542 696695 698543 701053 704046 707557 711723 716210 720101 722584
59031 722584 723665 724276 725785 729213 734625 741404 749273 758760 770458 784214 799348 815285 831531
59018 831531 847450 862476 876153 887627 895630 899560 900096 898192 894087 887998 881128 874946 869806
59005 869806 865266 861515 859545 860038 862965 868090 875053 883110 891657 900799 910546 919778 927069 932342
58991 932342 936633 940328 942839 943872 943607 941364 935499 925257 911786 896850 881462 866271 852276
58978 852276 840343 830591 822750 816661 812046 808460 805968 805404 807501 812086 818386 825769 834048 843514
58964 843514 854808 868326 883699 900268 917891 936491 954880 970975 983354 991843 996467 996808
58952 996808 992690 984545 972646 956825 937512 916290 894828 873854 853575 834487 817251 802334
58940 802334 790221 781413 775720 772078 769523 767857 766942 765960 764003 761020 757608 754076 750139 745287
58926 745287 739229 732216 725125 718853 713435 708197 702900 698244 695019 693231 692331 691819 691394 691044 691249
58911 691249 692637 695180 698178 701250 704858 709675 715923 723520 732331 742098 752673 764484 778202
58898 778202 793772 810404 827664 845844 865034 884562 903698 922264 940402 958562 978038
58887 978038 1000650 1027314 1057433 1089787 1123100 1155395 1183974 1206975 1224372 1236876 1244579 1247220
58875 1247220 1244949 1237928 1225760 1208156 1185819 1160192 1132861 1105742 1080985 1059730 1041317 1024526
58863 1024526 1009179 995786 984094 972905 961173 948529 934895 920262 904779 888573 871651
58852 871651 854381 837785 822766 809295 796800 785029 774049 763720 753761 744170 735096 726465
58840 726465 718106 710004 702103 694166 686155 678438 671291 664572 658259 652835 648733 645791 643657 642225
58826 642225 641260 640115 638415 636582 635177 634127 633144 632463 632585 633567 635085 636905 638872 640811 642822
58811 642822 645228 647782 649491 649795 649451 649657 650707 652096 653430 654565 655211 655154 654674 654202 653795 653382 653058
58794 653058 652633 651383 648991 646346 644725 644485 645224 646883 649865 654243 659567 665454 671826 678570 685409
58779 685409 692068 698374 704428 710804 718112 726038 733374 739311 744077 747807 749508 747927 742964 735614
58765 735614 726992 718037 709608 701987 694599 686924 679436 673086 668291 664988 663185 662783 663336 664629 667040
58750 667040 670699 674886 678960 683247 688227 693547 698816 704700 712081 720650 729502 738714 749109 760714
58736 760714 772724 784830 797363 810286 823273 836795 851861 868460 885302 901307 916383
58725 916383 930613 943664 955278 965482 974101 980946 986758 993118 1001125 1010749 1021593 1033441 1045799
58712 1045799 1057717 1068504 1078030 1085934 1091087 1092256 1089015 1081826 1071521 1058747 1043481 1024960
58700 1024960 1002467 976288 947635 917693 887094 856235 825678 796213 768814 744422 723424
58689 723424 705522 690343 677835 667686 658810 650072 641268 632886 625211 618250 612099 606771 601953
58676 601953 597667 594738 593820 594268 594892 595611 597405 600762 605185 610305 616642 625122 636514 651278 669137
58661 669137 688577 707371 723773 736817 745705 749668 748616 743407 735406 726086 716755 708030 699639
58648 699639 691159 682782 674967 667760 661049 655100 650205 646146 642680 640106 638688 638028 637902 639132 642473
58633 642473 646938 650478 652251 653128 653998 654631 654384 653070 650942 648526 646587 645630 645441 645642 646500 648617
58617 648617 652184 657286 664501 674243 685791 697954 710424 723449 736388 747661 756080 761349 763463
58604 763463 762603 759451 754703 748456 740943 733339 726720 720660 714181 707723 702691 699322 696609 694295
58590 694295 693336 694235 696583 700484 706885 716026 727028 739546 754387 771816 790428 808465 825283
58577 825283 840895 855023 867294 877748 886629 894190 900944 907523 914259 921576 930670 942838 958184
58564 958184 975990 996281 1019846 1046680 1075633 1105696 1136301 1166126 1192925 1214993 1231809
58553 1231809 1243066 1248332 1248002 1243389 1235402 1224160 1210135 1194444 1177659 1159503 1140136 1120547
58541 1120547 1101189 1081287 1060011 1037426 1014006 990203 966816 944757 924136 904485 885953
58530 885953 869192 854101 840072 827583 818000 811428 806298 801637 798313 797411 798683 801237 804508
58517 804508 807978 811134 814323 818488 823577 828360 832217 835839 839732 843392 846402 848975 850966 851817
58503 851817 851930 852494 853348 852669 849455 844649 839157 832626 825177 818370 813077 808089 802319 796885 793382
58488 793382 791431 789653 788134 788193 790421 794393 799743 806303 813808 822636 834269 849815 868462 888117
58474 888117 906895 923334 936148 944865 949991 951705 949180 942014 931425 919103 905742 891636
58462 891636 877783 865287 854393 845148 838328 834723 834071 835547 838734 843397 849023 855317 862535 870555
58448 870555 878212 884016 886913 886165 881603 874498 866996 860139 853462 846847 841373 837785 835723 835205 837152
58433 837152 841432 845951 849002 851233 854143 858001 862560 868488 876592 886555 897686 909969 923242
58420 923242 936316 948087 958540 967673 974590 978881 981835 985031 988568 991639 993696 994016 991286 984912
58406 984912 975903 965595 954575 943639 934232 926722 919639 911931 904729 899681 896907 895818 896451 898478
58392 898478 900274 900630 900319 900513 900798 900182 898856 897482 895872 893799 891999 891004 890179 889220 889319 891406 894588
58375 894588 897743 901303 905990 911192 916243 921921 929086 937156 945510 954910 965865 977143 987705
58362 987705 998627 1011211 1024654 1037540 1050192 1063450 1076452 1087712 1097199 1105378 1111477 1114853
58350 1114853 1116846 1119214 1121846 1123888 1125803 1128270 1130443 1131556 1132996 1136656 1142419 1149359 1158056 1169515
58336 1169515 1183096 1197780 1214131 1232743 1252016 1269851 1286317 1302452 1317817 1331548 1344333
58325 1344333 1356817 1367420 1374297 1378182 1380871 1382378 1382157 1381620 1382649 1384901 1387337 1391005 1397535 1406233
58311 1406233 1415477 1425588 1437494 1450082 1461913 1474083 1488289 1503540 1517936 1532211 1548212
58300 1548212 1565276 1581573 1597658 1615190 1633352 1650059 1665640 1681893 1698690 1714905 1731470
58289 1731470 1750092 1770248 1790806 1812989 1838128 1864224 1888743 1913199 1940790 1971008 2000944
58278 2000944 2030497 2061780 2094686 2127656 2161667 2198839 2238139 2277105 2316696 2359826 2406233
58267 2406233 2453637 2502747 2556041 2612686 2669852 2728177 2790702 2857230 2924856 2993103 3063236
58256 3063236 3133567 3200989 3266340 3332780 3399989 3465639 3531384 3601253 3675213 3750698 3829479
58245 3829479 3916269 4011224 4110656 4214614 4326878 4447949 4575057 4708726 4852273 5005207
58235 5005207 5164250 5330481 5508353 5698350 5898107 6109828 6338562 6584008 6842418
58226 6842418 7115735 7410079 7726233 8061046 8417563 8804013 9223494 9674793 10162692
58217 10162692 10696771 11280713 11914112 12604188 13364029 14200227 15115099 16120575 17236807
58208 17236807 18478451 19857542 21399956 23144493 25127621 27387071 29981328 32989930
58200 32989930 36497863 40599616 45416052 51087376 57759764 65614857 74919039 86024061
58192 86024061 99334018 115312969 134521844 157620870 185369228 218613156 257932689
58185 257932689 302581205 349140785 391239297 421326241 433770785 427187216 404474222
58178 404474222 370944689 332134558 292489858 255033479 221530589 192793296 169024779
58171 169024779 150133593 135870168 125700910 118578298 112951153 107205063 100289026
58164 100289026 92035265 82946752 73718265 64901332 56834497 49686016 43487491 38175167
58156 38175167 33653014 29827855 26601175 23866887 21534924 19541846 17833554 16356205
58148 16356205 15069353 13949477 12972468 12106364 11326241 10621801 9984312 9398453 8852228
58139 8852228 8343092 7869063 7424121 7006660 6622101 6272453 5952079 5657111 5389807
58130 5389807 5150173 4932327 4732584 4552307 4389002 4232996 4077099 3922277 3770644
58121 3770644 3620508 3471921 3329729 3196973 3071467 2952125 2842309 2743560 2652131 2565104
58111 2565104 2484249 2410691 2341455 2274538 2212069 2155137 2100454 2045261 1990909 1938703 1886766
58100 1886766 1833911 1782394 1734037 1687634 1642574 1600985 1563883 1529022 1494847 1462885 1434248
58089 1434248 1407567 1382327 1360383 1342180 1325193 1308000 1292221 1278601 1264859 1249222 1232437
58078 1232437 1214554 1193573 1169221 1144413 1120959 1097345 1072613 1048801 1027463 1007213 986870
58067 986870 967735 950748 934549 918343 903528 890611 877726 864257 852715 844860 838899 832603
58055 832603 826258 820402 813590 804787 795448 787020 778687 769514 760387 751959 743050 733075 723746 716462
58041 716462 710126 703270 696216 689575 682802 675809 669772 664831 659262 652323 645569 639862 633601 625512
58027 625512 616709 608308 599438 589390 579419 570609 562170 553531 545824 539569 533338 526510 520939 517868
58013 517868 515512 511856 507638 504368 501527 498186 495514 495120 496290 497141 497320 497539 497689 497352 497119 497662
57997 497662 498550 499391 500851 503270 505720 507836 510980 516024 521585 526005 529565 533134 536157 537720 538274
57982 538274 538661 538637 537754 536404 534720 531907 527991 524546 522299 519748 515751 511696 509318 508091 506720
57967 506720 505664 506067 507486 508737 509930 511764 513837 515479 517257 519883 522592 524260 525212 526243 526809
57952 526809 525829 523397 520207 516110 510778 504905 499401 494286 489579 486131 484244 482680 480467 478539
57938 478539 478199 479225 480993 484083 489127 495358 502022 509962 519993 530914 541038 550539 560348 569821
57924 569821 577589 583837 589645 594891 598793 601754 604600 606581 606189 603409 599230 593559 585710 576563
57910 576563 568056 560646 553157 545064 537139 529847 522837 516015 509631 503228 495849 487249 477717 467080
57896 467080 455246 443407 433186 424743 417066 409905 403983 399412 395357 391283 387399 383952 381224
57883 381224 380059 381147 383905 387081 390279 393862 397636 400837 403281 405443 407487 409109 410105 410270 409082
57868 409082 406365 402808 399052 394826 389868 384980 381053 377706 374097 370502 367906 366566 366155 366791 368728
57853 368728 371557 374924 379448 385781 393362 401309 409843 419524 429835 439950 450219 461282 472333
57840 472333 481885 489737 496528 501878 504809 505730 506129 506390 505552 503129 499507 494584 487802 479709 471996
57825 471996 465680 460440 455741 451359 446910 442166 437819 434703 432534 430741 430098 431790 435046 437581
57811 437581 438447 438712 439184 439351 438913 438506 438285 437289 434933 431702 427755 422121 414110 404495 394695 385659
57795 385659 377946 371897 367306 363756 361478 360928 361460 361655 361183 361076 361817 362507 362445 362253 362748 363786 364954
57778 364954 366454 368559 370996 373544 376549 380257 384278 388232 392358 396993 402017 407187 412450 417564
57764 417564 421939 425221 427580 429176 429762 428953 426462 422084 415953 408803 401357 393506 384654 374795 364532
57749 364532 354247 344046 334424 326111 319307 313930 310438 309345 309934 310526 310169 309113 307638 305593
57735 305593 303300 301707 301145 300852 300115 299089 298177 297412 296847 296814 297459 298627 300392 302928 305761 307949
57719 307949 309270 310460 312046 313677 314828 315457 315710 315604 315153 314303 312789 310684 308893 308223 308120 307280
57703 307280 305443 303532 302091 300781 299515 298817 298706 298405 297613 297107 297621 299028 301000 303535 306345 308519
57687 308519 309349 308998 308175 307724 308557 311111 314779 318659 322901 328521 335981 345040 355973 369694 386625
57672 386625 406777 431211 462085 500854 547776 603740 671378 753562 851128 961129 1074762
57661 1074762 1176237 1246553 1271955 1250259 1189857 1104000 1006011 906890 813968 730729 658294
57650 658294 596910 545991 504024 469599 442124 420898 404230 390285 378251 367963 359045 351122
57638 351122 344323 338812 334280 330415 327273 324678 321933 318747 315782 313660 312134 310765 309699 309107
57624 309107 308617 307919 307226 306516 305232 303424 302192 302074 301901 300349 297874 295962 295040 294299 293104 291441
57608 291441 289330 286885 284696 283217 282077 280862 280152 280730 282110 282971 282890 282596 282628 282832 283199 284072 285247
57591 285247 285753 284948 283268 281576 280186 278726 276670 273933 271092 268930 267499 265896 263280 259871 256580
57576 256580 253938 251816 249899 247945 245809 243625 241816 240550 239489 238399 237599 237334 237074 236069 234386
57561 234386 232833 231950 231488 230797 229442 227600 226082 225631 226035 226367 226291 226514 227585 228999 230056 230982 232462
57544 232462 234556 236824 239112 241427 243368 244468 244980 245697 247200 249701 253199 257076 259933 260689 259732
57529 259732 258351 257169 255845 254110 252357 251171 250831 251271 252046 252473 252316 252211 252914 254339 255851 257320
57513 257320 259208 261714 264478 267185 269887 272652 275333 277780 279941 281693 282790 283040 282423 281176 279797
57498 279797 278679 277613 276062 274044 272293 271341 270980 270881 271015 271108 270417 268677 266657 265158 264067 263060
57482 263060 262522 262850 263446 263415 262877 262626 262773 262730 262356 262104 262104 261965 261519 260962 260278 259235 257931 256691 255497
57463 255497 254205 253210 253142 253978 255096 256155 257248 258392 259613 261340 263860 266449 267961 268295 268429 268966
57447 268966 269521 269617 269268 268490 267176 265753 265135 265588 266375 266937 267749 269444 271585 272975 273009 272347 272273 273532
57429 273532 275682 277545 278385 278528 278655 278850 278824 278740 279085 279788 280212 280111 279953 280183 280767 281599 282744 284077
57411 284077 285207 285952 286445 286661 286362 285700 285335 285710 286620 287659 288637 289339 289417 288909 288531 289004 290261 291603
57393 291603 292572 293488 295043 297395 299720 300940 300995 301096 302438 305004 307996 311001 314137 317305 320114
57378 320114 322493 324710 326762 328357 329527 330693 332012 333245 334334 335574 337116 338820 340648 342601
57364 342601 344247 344994 345084 345730 347862 351220 354859 358063 360454 361768 362063 361911 362003 362676 363999 366081
57348 366081 369017 372625 376419 379800 382376 384263 386059 388256 390701 392856 394536 396075 397884 400172
57334 400172 402994 406208 409413 412324 415189 418454 422033 425286 427692 429263 430404 431754 433996 437281
57320 437281 440880 443893 446218 448334 450306 451743 452784 454344 457046 460466 463710 466334 468461 470410
57306 470410 472490 474902 477617 480505 483656 487321 491491 495779 499688 502838 505095 506838 508914 511895
57292 511895 515527 519327 523430 528229 533368 537847 541113 543471 545423 547343 549788 553348 557936 562847
57278 562847 567695 572754 578284 584203 590587 597750 605599 613564 621568 630397 640705 652085 663547
57265 663547 674524 685020 695158 704964 714374 723230 731451 739282 747112 755030 762910 770884 779136
57252 779136 787177 793995 799296 804120 809984 817676 827014 837279 847620 857426 866694 875862 885289 895104
57238 895104 905491 916665 928537 940843 953623 967147 981377 995972 1010794 1025958 1041425
57227 1041425 1057108 1073239 1090058 1107298 1124654 1142561 1161580 1181131 1199894 1217608 1235431
57216 1235431 1254297 1273925 1293791 1313991 1334617 1355260 1375779 1396721 1418381 1440160 1461441
57205 1461441 1482444 1503645 1525075 1546794 1569338 1592993 1617238 1641626 1666676 1693261 1721583
57194 1721583 1751361 1782432 1814530 1846964 1879247 1911604 1944259 1976680 2008166 2038706 2068636
57183 2068636 2097979 2126839 2155962 2186046 2216898 2248059 2279943 2313491 2348940 2385749 2423530
57172 2423530 2462243 2501564 2540985 2580544 2620726 2661510 2702202 2742359 2782308 2822403 2862199
57161 2862199 2900739 2937554 2973187 3008675 3044524 3080304 3115446 3150248 3185600 3221647 3257326
57150 3257326 3291550 3324389 3356730 3389206 3421799 3454115 3485634 3515990 3545316 3574077 3602433
57139 3602433 3630187 3657503 3685041 3713186 3741797 3771062 3801877 3834890 3869927 3907006 3947321
57128 3947321 3992481 4043228 4099505 4161220 4228157 4299516 4374362 4452408 4533932 4619292 4709094
57117 4709094 4804525 4907033 5018146 5140094 5276090 5429332 5602093 5796333 6014651 6259982
57107 6259982 6535042 6843169 7189901 7583614 8035466 8559727 9173999 9898884 10758452
57098 10758452 11782336 13007451 14477322 16240101 18347147 20851585 23805928 27259650
57090 27259650 31256880 35831974 41002935 46766767 53097051 59935695 67173773 74632213
57082 74632213 82060810 89161052 95621394 101152744 105520720 108570772 110235628 110519833
57074 110519833 109473182 107172548 103719468 99244669 93908130 87892237 81392364 74608269
57066 74608269 67735956 60958309 54434644 48291748 42619428 37471133 32867748 28802807
57058 28802807 25249015 22165683 19505419 17218618 15256230 13571914 12123752 10875064
57050 10875064 9794362 8854893 8033990 7312636 6675435 6110496 5608556 5161693 4762729
57041 4762729 4405453 4084769 3796448 3536936 3303363 3093274 2904290 2734150 2580931
57032 2580931 2442865 2318055 2204752 2101729 2008074 1922891 1845746 1777198 1718285 1669571
57022 1669571 1631142 1603360 1587195 1584211 1596953 1629214 1685723 1772045 1894063 2053281 2237386
57011 2237386 2414623 2542236 2586486 2538496 2413869 2240020 2043708 1845391 1658435 1489884
57001 1489884 1342046 1214480 1105393 1012366 933123 866044 809744 762437 722198 687790 658797
56990 658797 634993 615829 600395 587737 577407 569940 566543 568038 574135 583390 593180 599666 598933
56977 598933 589116 571302 548091 521757 494073 466925 441958 419792 400381 384035 371359 362280
56965 362280 355898 351500 349241 349710 353378 360675 372216 388577 409954 436043 465729 496334 523159
56952 523159 540502 544101 533346 511324 482685 451346 419833 389913 363050 340238 321871 307946
56940 307946 298204 292151 289333 289684 293472 301135 313407 331263 355297 385291 420690 460687 502692
56927 502692 540902 567810 577974 570251 546938 512036 470451 427231 386028 348347 314525 284934
56915 284934 259862 239026 221871 207944 196537 186486 176980 168142 160373 153528 147224 141582 137050
56902 137050 133768 131515 130060 129251 129126 130184 133117 137968 144126 151501 161101 173923 189891 208505
56888 208505 229960 254910 283528 315448 350066 385891 419705 447262 465104 471601 466908 452893
56876 452893 433039 411364 390798 372589 357110 344732 335994 331371 331063 334950 342899 355273 372937
56863 372937 396601 426561 463417 508597 563491 627672 697477 765506 821594 855945 863333 845182
56851 845182 807784 758847 705445 653388 606532 566329 532850 506427 487931 477850 476060 482567
56839 482567 497846 522446 556921 602265 660071 732249 820598 925383 1042273 1159749 1260446
56828 1260446 1326921 1348216 1323336 1260418 1172701 1073558 973107 877784 791651 717264 655653
56817 655653 606534 569059 542338 525494 517940 519769 531586 553957 587393 632824 691437 763372
56805 763372 845823 931373 1007809 1060893 1079775 1061669 1012179 941568 860480 777609 698964
56794 698964 627876 565620 512493 468548 433672 407457 389151 377697 372107 372126 378257 390901
56782 390901 409978 435853 469730 511598 557426 599225 628441 639413 630479 603474 562928 514779
56770 514779 464497 415787 370700 330379 295355 265514 240193 218498 199676 183427 169747
56759 169747 158313 148284 139054 130925 124496 119604 115457 111648 108311 105378 102481 99679 97498 96028
56745 96028 94633 92870 91092 89770 88762 87684 86625 86028 86019 86199 86038 85294 84120 82834 81544 80170
56729 80170 78885 78214 78333 78593 78280 77612 77369 77729 78190 78605 79459 80917 82336 83086 83378 83971 85426 87809
56711 87809 90754 93620 95916 97675 99160 100324 100984 101418 102176 103312 104362 105095 105619 105730 104931 103287
56695 103287 101574 100256 98985 97373 95625 94028 92423 90638 88994 87890 87213 86543 85707 84889 84378
56680 84378 84374 84754 85005 84675 83868 82933 81841 80461 79304 79204 80189 81458 82570 83830 85322 86513 87133
56663 87133 87565 87946 87785 86998 86418 86655 87191 87280 86979 86586 85825 84461 83087 82362 81998 81433 81022 81482 82478
56644 82478 82888 82484 82415 83909 87161 91485 95903 99642 102745 106192 110813 116134 120983 125118 129470
56629 129470 134691 140264 145243 149150 151807 153009 152916 152343 152093 152172 152061 151634 151425 151921 152859 153395 152968
56612 152968 151895 151009 150735 150711 150410 149886 149650 149899 150147 149626 147916 145231 142219 139499 137266 135352 133627
56595 133627 132244 131457 131339 131747 132466 133351 134411 135687 136994 137949 138475 139033 139983 140922 141147 140634 139998
56578 139998 139618 139545 140176 142016 144526 146266 146704 147004 148354 150351 151902 153015 154658 157242 160347 163795
56562 163795 168005 173215 179128 185503 192509 200462 209711 220639 233061 245593 256400 264853 271948
56549 271948 278895 285832 292141 297507 302175 306475 310480 314084 317101 319312 320556 320883 320539 319706 318166
56534 318166 315341 310908 305332 299509 293773 287653 280720 273203 265489 257468 248855 239889 231192 223134
56520 223134 215789 209337 203928 199155 194170 188463 182247 176035 170098 164440 159035 153990 149520 145838
56506 145838 143035 141104 139982 139389 138772 137826 137067 137339 138607 139784 140075 139914 140234 141316 142896 144883
56490 144883 147302 149794 151885 153624 155414 157368 159275 161062 162764 164157 164910 165076 165030 165058 165253 165624
56474 165624 165952 165860 165481 165656 166946 168748 170078 170957 172306 174603 177399 180114 182501 184225 184807 184317
56458 184317 183608 183555 184395 185937 187970 190236 192389 194226 195780 197072 197989 198440 198464 198184 197844 197794 198165
56441 198165 198664 198975 199201 199548 199694 199011 197496 196059 195722 196694 198312 199666 200254 200157 199734 199242 198872 198970
56423 198970 199786 200922 201521 201228 200599 200331 200532 200979 201530 201921 201742 201146 201094 202290 204253 205977 207080
56406 207080 207691 207721 207031 206040 205378 205092 204848 204704 204996 205652 206361 207330 209160 211965 215097 217768 219652
56389 219652 221068 222861 225688 229116 231985 234051 236515 240262 244429 247650 249882 251803 253084 252769
56375 252769 251025 249061 247433 245786 244208 243416 243436 243435 243077 242817 242663 241943 240689 240061 240832 242382 243612
56358 243612 244043 243698 242851 242217 242523 243521 244184 244101 243850 243863 243947 244113 244765 245708 246012 245331 244378 243736 243213 242809
56338 242809 243237 244891 247214 249669 252403 255463 258382 261129 264456 268533 272201 274339 275147 275279 274618
56323 274618 272909 270914 269856 270080 271108 272632 274624 276728 278312 279090 279266 279231 279355 279706 279795 279045 277739
56306 277739 276963 277431 279025 281564 285035 288761 291452 292777 294059 296667 300378 303984 306712 308325 308579
56291 308579 307604 306413 306150 307030 308500 310055 311445 312560 313636 315108 316845 318146 318910 320087 322371
56276 322371 325168 327486 329179 330537 331359 331353 331042 331399 332899 335531 339306 344032 348996 353644 358292 363570
56260 363570 369476 375622 382076 389266 397280 405876 415026 424995 435993 448143 461565 476274 492169
56247 492169 509197 527230 545912 565274 586433 610694 637789 666011 694340 723311 753299
56236 753299 783201 811636 838304 863171 885170 902861 915822 924445 928794 928542 923698 914676 901940
56223 901940 886069 867712 847126 824403 800495 777113 755033 733412 711441 689802 669776
56212 669776 651761 635433 620512 606591 593021 579848 568096 558368 549967 542084 534868 528514
56200 528514 522440 516439 511622 508963 507698 506361 504735 503607 503321 503690 504736 506380 507948 508947 509752
56185 509752 510755 511627 512234 513286 515082 516665 517336 517935 519434 521391 523077 524952 527527 529875 531007
56170 531007 531746 533499 536016 538163 540092 542741 545875 548617 551426 555586 561113 566945 572875 579496
56156 579496 586635 593710 601323 610627 621326 632083 642733 654297 667005 680187 694032 709618
56144 709618 727115 745735 765586 787991 813802 842806 874791 909889 948122 990167 1038403
56133 1038403 1095801 1164131 1244781 1340602 1454773 1587765 1737019 1898927 2068635 2237961
56123 2237961 2396311 2535110 2650737 2743887 2818427 2880898 2938184 2993571 3045249 3088443 3118036
56112 3118036 3130108 3123759 3102472 3072423 3038781 3003846 2967178 2924975 2869682 2793195 2691859
56101 2691859 2567684 2425598 2271796 2114366 1962163 1821450 1694847 1583573 1488619 1409342
56091 1409342 1343230 1288158 1243439 1208292 1180915 1159633 1143449 1131183 1121543 1114271 1109653 1106892
56079 1106892 1104652 1103122 1103642 1106301 1109895 1114212 1120176 1127704 1135650 1144089 1154355 1166595 1179595
56066 1179595 1193377 1209500 1228230 1247640 1266164 1283943 1301112 1316926 1331192 1344651 1357418
56055 1357418 1368824 1379051 1389067 1398944 1408306 1418250 1430479 1444654 1459137 1474218 1491872 1512349
56043 1512349 1533852 1555679 1578760 1603057 1627513 1652712 1680345 1709886 1739140 1768341 1800089
56032 1800089 1834860 1870267 1905417 1942157 1981207 2020850 2060522 2102000 2145953 2190910 2236596
56021 2236596 2284608 2334880 2385414 2436551 2491520 2551568 2614579 2679605 2748469 2821598 2896753
56010 2896753 2973512 3054658 3141433 3231754 3324739 3422494 3525700 3632021 3740828 3854964
56000 3854964 3975994 4102335 4233898 4373762 4523381 4680962 4846355 5022449 5210109
55991 5210109 5407294 5614921 5837735 6077544 6331737 6600168 6886762 7192418 7513946
55982 7513946 7852662 8216461 8610752 9035368 9493326 9993777 10542827 11140598 11791397
55973 11791397 12507443 13298459 14167682 15122994 16181917 17361309 18673892 20140857 21796832
55964 21796832 23678181 25820735 28276416 31119973 34435768 38315226 42873287 48249865
55956 48249865 54594076 62078367 70945386 81523825 94199302 109409693 127683771
55949 127683771 149657875 176073847 207797160 245618563 289387160 336585381 381529354
55942 381529354 416532598 434878617 433677815 414648681 382639920 343345481 301666504
55935 301666504 261094821 223735737 190587167 161903402 137521593 117062099 100031430
55928 100031430 85905360 74198213 64485513 56397647 49624043 43920259 39093148 34979844
55920 34979844 31446705 28394685 25748040 23439380 21411781 19625231 18048524 16649098
55912 16649098 15398039 14277568 13274271 12370344 11548989 10802177 10124934 9507199 8938647
55903 8938647 8416248 7939477 7502483 7097897 6724114 6382080 6068538 5778495 5510659
55894 5510659 5264680 5036537 4822258 4622847 4440372 4272490 4115799 3971143 3840618
55885 3840618 3722678 3615244 3520562 3442027 3379100 3330121 3297325 3284300 3291127 3316619 3362445
55874 3362445 3429586 3512121 3598660 3678007 3739427 3770102 3758278 3699387 3596541 3456685 3289370
55863 3289370 3106882 2920743 2737981 2562870 2400288 2254023 2123504 2005699 1899367
55854 1899367 1804779 1720956 1646344 1580924 1524638 1474910 1428555 1385031 1345233 1308360 1272661
55843 1272661 1238082 1205601 1175064 1145987 1119197 1095273 1072666 1049700 1027154 1006656 988015
55832 988015 970340 954110 939637 925105 908851 892179 877350 864169 851148 838580 827522
55821 827522 816906 804633 790753 776903 763409 749532 735906 724151 714542 706249 699265 694073
55809 694073 690188 687128 685989 687973 692299 697704 705022 715958 730101 745390 760738 775952 789737
55796 789737 800092 806184 807901 804318 794659 780006 762005 740761 716192 690568 667200 647145
55784 647145 629504 614387 603108 595652 590186 584973 578901 570589 559197 546046 533567 522827
55772 522827 513786 507351 505015 506743 511326 518557 528807 540313 548993 551531 547388 537832 524551
55759 524551 509268 493235 476827 460412 445167 432002 420413 409634 400171 392725 386530 380419
55747 380419 374681 370031 365496 359418 352001 344866 338503 332233 326323 321951 319162 316796 314484 312888
55733 312888 311972 310813 309176 307684 306470 305202 304218 303975 303544 301331 297272 292701 288271 283589 278733
55718 278733 274414 270730 267358 264827 263956 264231 264423 264601 265848 268158 270443 272480 275070 278324 281555
55703 281555 284671 287857 289986 289334 285926 281274 275810 268628 259923 251554 244729 238993 233918 229935
55689 229935 227023 224305 221463 218998 216806 214185 211579 210539 211452 212993 214264 215752 217679 219246
55675 219246 220208 221478 223372 224790 224914 224278 223399 221774 219051 215954 213302 211232 209894 209673 210242 210702
55659 210702 211208 213137 217096 222103 227300 233131 240169 248128 256643 265726 274660 281722 285739 286912
55645 286912 285600 281622 275328 267962 260159 251337 241362 231560 223219 216215 209902 204200 198984 193633
55631 193633 188103 183465 180409 178188 175868 173636 172010 170691 169156 167545 166088 164472 162568 160987
55617 160987 160122 159405 158281 157106 156327 155615 154624 153807 153621 153656 153332 152827 152486 151967 150783 149108 147389
55600 147389 145727 144221 143307 143045 142714 141704 140268 138832 137266 135392 133564 132123 130885 129709 128913
55585 128913 128595 128277 127748 127562 128087 128822 129260 129708 130625 131846 133080 134522 136314 138003 139116 139756 140252
55568 140252 140871 142136 144566 147700 150405 152529 155062 158019 159532 158092 154536 150655 146881 142749
55554 142749 138723 135901 134262 132693 130732 129087 128386 128393 128552 128532 128168 127393 126224 124491 121963 119117
55538 119117 117209 116932 117475 117641 117439 117763 118876 120049 120551 120274 119537 118856 118716 119017 118956 117986 116602 115670
55520 115670 115308 114988 114435 113807 113181 112416 111391 109947 107829 105049 102066 99279 96643 94107 91988 90546
55504 90546 89694 89467 90230 91921 93707 94997 96209 97918 99745 100909 101496 102313 103671 105055 105858 105866 105110
55487 105110 103866 102790 102561 103343 104783 106416 107876 108971 109746 110245 110164 109191 107801 107074 107463 108334 109003
55470 109003 109503 109994 110199 110011 109951 110306 110448 109749 108693 108301 108811 109623 110225 110521 110494 110216 110096 110652 112058
55451 112058 114082 116177 117547 117670 116983 116459 116313 115825 114686 113589 113028 112492 111501 110558 110310 110529 110757
55434 110757 111137 111742 111840 110933 109930 110170 111654 113224 114129 114494 114629 114810 115467 116661 117663 117851 117730
55417 117730 118208 119257 120205 121001 122220 124050 126271 129026 132594 136432 139370 140807 141054 140607 139763 138789
55401 138789 137701 135991 133278 130069 127227 124972 123036 121494 120569 119909 118905 117547 116176 114720 113048
55386 113048 111728 111394 111572 111256 110513 110363 111074 111730 111706 111488 111677 112145 112525 112716 112501 111410 109451 107522
55368 107522 106639 107041 108175 109251 109686 109383 108606 107478 105824 103847 102476 102392 102984 103067 102438 101949 102189
55351 102189 102866 103467 103792 103762 103416 103135 103313 103786 104138 104404 104861 105378 105660 105976 106837 108107 109230 110184
55333 110184 111284 112168 111945 110401 108245 106174 104545 103848 104398 105489 105954 105789 106153 107541 109048 109823
55317 109823 110229 110983 112029 112894 113365 113308 112523 111297 110432 110145 109672 108547 107569 107727 108692 109238 108816 107946
55299 107946 107203 106592 105960 105403 104975 104351 103077 101144 99267 98458 99223 101164 103429 105479 107305 109118
55283 109118 111054 112966 114238 114082 112413 110179 108364 106967 105480 104079 103557 104234 105715 107690 110142
55268 110142 112663 114411 115029 114967 114655 114031 113195 112841 113561 115124 116827 118219 119142 119434 118994 118040 117050
55251 117050 116491 116598 117208 117816 117964 117568 116759 115675 114652 114268 114700 115320 115403 115032 114732 114526 114034 113351
55233 113351 113053 113359 113930 114470 114914 115112 114964 114773 114853 114971 114819 114758 115199 115572 114987 113811 113368 113975 114476
55214 114476 113991 112993 112253 111809 111502 111612 112382 113621 115156 116881 118151 118124 117134 116660 117352 118095 117722 116677
55196 116677 116104 116186 116410 116735 117387 117935 117640 116535 115298 114295 113508 113212 113821 115086 116183 116639 116685 116675
55178 116675 116700 116807 117114 117557 117809 117587 116959 116335 116153 116456 116762 116599 116149 116062 116583 117279 117640 117577 117287 117139
55158 117139 117738 119438 121614 123026 123200 122884 122867 123006 122796 122216 121444 120275 118512 116650 115540 115504 116177
55141 116177 117043 117759 118161 118296 118356 118392 118256 117901 117454 116953 116380 116056 116493 117672 118903 119573 119641 119290 118641
55122 118641 117996 117733 117738 117469 116870 116589 117031 117805 118460 119110 119928 120630 120974 121194 121488 121561 121202 120821 120919 121401
55102 121401 121875 122247 122571 122760 122833 123098 123696 124375 124987 125703 126445 126736 126487 126315 126601 126861 126504 125633 124579
55083 124579 123345 122063 121346 121510 122016 122333 122739 123604 124508 124870 124866 124952 124997 124771 124703 125200 125678 125343 124551 124317
55063 124317 124675 124648 123804 122784 122210 121966 121772 121655 121662 121734 121974 122472 122836 122511 121647 121034 121116 121559 121815 121595
55043 121595 120796 119566 118517 118323 118944 119639 119843 119668 119521 119624 119935 120255 120436 120679 121442 122833 124320
55026 124320 125392 126116 126680 126789 126137 125145 124488 124176 123770 123351 123430 123948 124156 123682 123023 122798 123032 123393 123689
55007 123689 123921 124142 124500 125164 126165 127366 128497 129125 128878 127959 127159 127028 127286 127408 127420 127761 128663 130072
54989 130072 131787 133268 133806 133442 133203 133727 134213 133585 132221 131446 131619 131935 132059 132647 134013 135393 136063
54972 136063 136298 136689 137221 137579 137818 138171 138553 138811 139186 140074 141371 142413 142683 142471 142707 143932 145450
54955 145450 145883 144755 143133 142399 142818 143730 144597 145206 145259 144665 144058 144243 145139 145972 146426 146838 147362 147762
54937 147762 148112 148886 150188 151486 152323 152761 153104 153715 155080 157439 160381 163484 167306 173007 180950 190393
54921 190393 200582 211338 222448 233328 243505 252681 260108 264599 265440 262708 256696 247864 237460
54908 237460 227118 217413 207703 197794 188823 181884 176641 172066 167950 164891 163300 163029 163608 164232 163976
54893 163976 162659 161198 160554 160674 160948 161262 161929 162964 164242 166235 169805 175182 181693 188598 195773
54878 195773 203464 211799 220715 230131 239877 249380 257469 262700 264130 261780 256248 248145 238291 228183
54864 228183 219372 212108 205266 197919 190467 183847 178290 173474 169406 166319 163865 161178 157918 154736
54850 154736 152517 151412 150742 149723 148158 146493 145220 144286 143225 141833 140402 139252 138342 137553 137047
54835 137047 137037 137337 137406 136829 135723 134774 134824 136169 138105 139437 139557 138915 138367 138358 138823 139558 140435 141380 142271
54816 142271 142801 142497 141159 139303 137854 137347 137622 138305 139125 139729 139740 139272 139034 139565 140660 141783 142749
54799 142749 143686 144574 145225 145616 145918 146234 146511 146703 146841 146960 147051 147086 147061 146989 146824 146416 145679 144928 144802 145588
54779 145588 146875 148211 149905 152630 156379 160397 164285 168591 174042 180625 187737 195024 202810 211773
54765 211773 222308 234051 245967 256904 265963 272261 274882 273558 269245 263436 256955 249830 242056
54752 242056 233835 225255 216521 208444 201795 196143 190286 184187 179479 177516 177600 177819 177069 175668 174433
54737 174433 173868 174089 174968 176275 177883 179744 181676 183544 185714 188858 193136 198033 203194 208916 215613
54722 215613 223350 232100 241783 251565 259745 264903 266850 266060 262708 256797 248814 239613 229845 219956
54708 219956 210495 201963 194470 187904 182254 177533 173688 170809 169123 168470 168146 167521 166501 165197 163611
54693 163611 161940 160627 159715 158647 157156 155826 155246 155062 154484 153335 152044 150899 149970 149494 149707 150377
54677 150377 150908 150819 149883 148189 146445 145734 146411 147577 148147 148067 147940 147941 147813 147542 147233 146514 144988 143198
54659 143198 142356 142963 144263 145167 145211 144576 143714 143081 142896 143068 143521 144385 145579 146529 146777 146677 147000 148050
54641 148050 149615 151539 153715 155713 157095 157980 158740 159255 159100 158353 157496 156583 155216 153427 151846 150867
54625 150867 150302 150039 150352 151312 152478 153477 154385 155260 155824 155925 155868 155877 155625 154735 153472 152506 152109 152008 152008 152430
54605 152430 153760 155938 158148 159434 159583 159277 159244 159454 159372 158789 158033 157453 157186 157458 158622 160586 162492
54588 162492 163333 162888 161882 161239 161331 161929 162714 163609 164533 165050 164603 163173 161519 160629 160980 162246 163485
54571 163485 163706 162653 161150 160373 160642 161258 161501 161286 160781 160057 159429 159506 160379 161315 161763 162208 163375 165011
54553 165011 166204 166651 166882 167350 168022 168819 169759 170576 170822 170561 170533 171417 173186 175244 176996 178287 179509
54536 179509 181173 183243 185058 186095 186473 186519 186310 186016 186196 187139 188272 188822 188750 188478 188101 187625 187609 188588
54518 188588 189974 190465 189597 188100 186679 185260 183632 182033 180833 180211 180376 181500 183183 184474 184660
54503 184660 183735 182095 180267 178881 178262 177978 177410 176756 176821 177724 178603 178801 178609 178553 178713 179108 180024 181483
54485 181483 182939 184028 185155 186867 189052 191227 193201 194999 196467 197501 198393 199494 200709 201742
54471 201742 202741 204235 206420 208779 210520 211357 211855 212937 214903 217048 218477 219135 219655 220324 220798 220872
54455 220872 220852 220900 220593 219529 217962 216459 215235 214139 212995 211630 209847 207736 205814 204568 203955 203605
54439 203605 203309 203084 202887 202546 201953 201194 200478 199959 199589 199286 199332 200322 202314 204251 204778 203659 201902 200496
54421 200496 199558 198804 198202 197832 197609 197489 197629 198106 198782 199598 200604 201517 201754 201193 200501 200374 200807 201412
54403 201412 202060 202825 203621 204298 204880 205342 205417 204952 204290 203955 204084 204494 205100 205939 206817 207282 207007 206134 205167
54384 205167 204584 204393 204139 203456 202587 202118 202246 202608 202804 202755 202564 202423 202709 203674 204904 205516 205162 204456 204204
54365 204204 204560 205145 205603 205752 205490 204906 204339 204100 204253 204726 205332 205644 205174 203906 202358 201030 200073 199571
54347 199571 199639 200032 200061 199178 197372 194882 191936 188962 186613 185222 184541 184234 184295 184724 185227 185571 185910 186394
54329 186394 186775 186733 186373 186081 186090 186436 187059 187735 188179 188538 189531 191723 194744 197394 198472 197508 195070 192447
54311 192447 190727 190002 189675 189458 189578 190025 190299 190187 190135 190478 190890 191050 191324 192183 193280 193784 193442 192804
54293 192804 192390 192044 191166 189437 187320 185828 185565 186070 186378 186068 185241 183710 181175 178338 176776 177110
54277 177110 178141 178408 177891 177467 177340 176940 175922 174439 172672 170897 169796 169996 171376 173378 175763 178495
54261 178495 181192 183328 184816 185877 186515 186680 186631 186579 186255 185445 184639 184445 184637 184540 184115 183824 183588 182778
54243 182778 181283 179776 178836 178506 178792 179843 181434 182899 183812 184237 184188 183428 182014 180512 179417 178766
54227 178766 178423 178335 178310 177991 177287 176560 176201 176219 176290 176028 175275 174377 174072 174759 175957 176783 176882 176537 176102 175738
54207 175738 175577 175641 175655 175382 175002 174720 174214 173074 171689 171033 171557 172834 174284 175666 176810 177512 177856
54190 177856 178232 178897 179849 181055 182319 183066 182787 181681 180287 178645 176501 174254 172871 172727 173277 173953
54174 173953 174584 174875 174467 173830 174115 175569 176918 176944 176004 175371 175705 176863 178570 180378 181346 180751 179079
54157 179079 177615 176984 176681 176008 174918 173835 173043 172454 171786 170947 170306 170403 171217 171967 171976 171497 171354 171948 172957
54138 172957 173868 174354 174251 173661 173105 173161 173835 174645 175404 176497 178145 179805 180716 180841 180865 181239 181604 181331
54120 181331 180297 178919 177659 176831 176747 177568 178934 180129 180824 181344 182070 182884 183483 183842 184055 184065 183938 184119
54102 184119 184823 185423 185068 183867 182874 182813 183387 183884 183935 183525 182778 181968 181316 180586 179341 177767 176725 176707
54084 176707 177208 177499 177602 178075 179145 180497 181692 182428 182604 182589 183235 185147 187925 190424 191744 191773 190953
54067 190953 189932 189342 189478 190087 190765 191558 192842 194590 196180 197124 197595 197970 198187 197979 197541 197409 197635
54050 197635 197645 197159 196761 197111 197949 198448 198445 198696 199879 201944 204623 207955 211937 216146 220179 224131 228233
54033 228233 232352 236331 240493 245194 250091 254484 258335 262320 266850 271595 276060 280112 283785 287038
54019 287038 289965 292880 296013 299325 302732 306259 309892 313563 317373 321566 326257 331464 337460 344784
54005 344784 353818 364478 376085 387155 395362 398364 395053 386033 373075 358330 343720 330353
53993 330353 318309 307328 297579 289307 281972 274610 267206 260803 255944 251797 247402 243063 239768 237653
53979 237653 235816 233498 230761 228015 225501 223410 222069 221750 222318 223139 223396 222691 221456 220592 220544 220920
53963 220920 221073 220785 220175 219287 218183 217296 217257 218272 219838 221194 221958 222350 222862 223784 225050 226548 228373
53946 228373 230611 233006 235144 236974 238885 241267 244208 247618 251396 255433 259656 264045 268419 272379
53932 272379 275777 279183 283409 288531 293742 298170 301491 303755 305083 305694 305892 305966 306339 307654 310220
53917 310220 313470 316525 319307 322436 326107 329815 333354 337207 341658 346285 350820 355808 361859 368789
53903 368789 375941 382774 388661 392728 394604 394874 394267 392849 390619 388328 386886 386216 385424 383897 381536
53888 381536 378241 373937 369043 364162 359319 354107 348488 342856 337362 331829 326368 321381 316907 312567
53874 312567 308310 304605 301714 299279 296885 294549 292385 290201 287778 285266 283013 281146 279503 277833
53860 277833 275932 273784 271687 270088 269153 268672 268450 268562 269070 269737 270284 270912 272261 274768 278267 282442
53844 282442 287519 294222 302996 313665 326097 340859 358790 380017 403662 428081 450609 467282
53832 467282 474053 469222 454541 433768 410444 387025 365069 345254 327423 311320 297226 285603
53820 285603 276347 268886 262781 257785 253596 250080 247551 246274 245833 245503 245139 245135 245608 246213 246824 247804 249450
53803 249450 251550 253668 255583 257412 259573 262592 266574 270902 274787 278188 281827 286260 291254 296099
53789 296099 300204 303305 305477 307175 309026 311389 314046 316329 317530 317388 316388 315439 315043 314888 314393
53774 314393 313381 311919 309762 306464 301994 296830 291497 286348 281764 278089 275230 272646 269966 267456
53760 267456 265686 264771 263974 262196 259077 255589 253202 252308 251820 250529 248434 246411 245015 244124 243434 242689
53744 242689 241610 240112 238565 237419 236692 236221 236173 236768 237667 238250 238390 238447 238612 238821 239160 239673 239869 239180
53726 239180 237968 237282 237425 237539 236893 235941 235692 236530 238050 239607 240630 240724 239968 238937 238222 238008 238194
53709 238194 238656 239272 239953 240826 242162 244019 246154 248246 249967 250985 251403 252171 254425 258195 262255 265475
53693 265475 267875 270138 272587 275066 277458 279804 282033 283890 285122 285632 285573 285342 285267 285258 284977 284363 283694
53676 283694 283176 282832 282782 283159 283708 283909 283632 283164 282578 281682 280759 280583 281279 281774 280978 279068 277099 275731
53658 275731 274954 274732 275184 276168 277239 278077 278646 278962 279033 278997 279011 279056 279067 279127 279337 279638 279999 280520 281098 281276
53638 281276 280791 280096 279917 280419 281167 281826 282425 283066 283787 284753 286182 287994 289844 291545 293154 294589 295532
53621 295532 295886 296108 296916 298671 301036 303131 304157 304154 304142 305255 307679 310655 313488 316237 319280 322550
53605 322550 325514 327844 329824 331979 334369 336388 337394 337546 337830 339125 341340 343661 345515 346964 348178
53590 348178 348954 348992 348348 347364 346289 345313 344783 345022 345874 346739 347177 347224 347028 346469 345356 343733 341760 339532
53572 339532 337328 335797 335413 335811 336131 336017 335773 335503 334785 333500 332366 332139 332647 333192 333619 334333 335370
53555 335370 336179 336477 336774 337732 339287 340722 341502 341865 342648 344565 347623 351230 354829 358245 361498 364673
53539 364673 368208 372863 378988 386005 393006 399548 405468 410324 413735 416133 418409 420839 423121 425578
53525 425578 429473 435752 444045 453302 462895 472767 482996 493661 504794 516077 526965 537529 548844
53512 548844 562112 577620 594887 613513 633383 654332 676190 699088 723191 748086 772843
53501 772843 796817 820117 843238 866479 889718 912466 934006 953797 972003 989524 1007363
53490 1007363 1026019 1045557 1066066 1087669 1109974 1131921 1152636 1172425 1192438 1213160 1233579
53479 1233579 1252143 1268227 1282403 1295624 1308618 1321791 1335041 1347647 1358884 1368791 1377853 1385940
53467 1385940 1392145 1395821 1397184 1396629 1393974 1388787 1381098 1371344 1359752 1346130 1330228 1312214 1292831
53454 1292831 1273028 1253249 1233171 1212400 1191184 1169918 1148133 1124824 1099964 1074957 1051261
53443 1051261 1029161 1008220 988195 968912 949820 930471 911254 893066 876444 861479 848364
53432 848364 837482 828987 822678 818178 814952 812355 810115 808728 809100 811883 817274 825086 834673 845112
53418 845112 855983 867870 881754 898033 916439 936603 958246 981035 1004766 1029620 1055788
53407 1055788 1082964 1110666 1139051 1168949 1201032 1235249 1271086 1308078 1346114 1385524 1426885
53396 1426885 1470541 1516472 1564770 1615915 1670046 1726139 1782500 1838081 1892933 1947456 2001790
53385 2001790 2056051 2110554 2165399 2220104 2273806 2325623 2374670 2420118 2461586 2499397 2534153
53374 2534153 2566125 2595197 2621299 2644540 2664767 2681223 2693092 2700446 2704304 2705375 2702900 2695111
53362 2695111 2680696 2659312 2630726 2594255 2549598 2497769 2440753 2380418 2318117 2254941 2191697
53351 2191697 2128618 2065583 2002725 1940623 1879932 1821047 1764017 1708513 1653992 1600110 1546970
53340 1546970 1494810 1443690 1393663 1345011 1298034 1252846 1209691 1169165 1131682 1096951 1064492
53329 1064492 1034482 1007537 983678 962138 942346 924613 909606 897413 887359 878565 870564 863521
53317 863521 857944 854095 851596 849702 847905 846296 845445 846073 848686 853290 859496 866902 875213 884043 893030
53302 893030 902388 912987 925519 939855 955541 972631 991574 1012495 1035001 1058576 1082839 1107606
53290 1107606 1133101 1159910 1188329 1217868 1247751 1277649 1307439 1336543 1364151 1390011 1414295
53279 1414295 1436691 1456375 1473170 1488112 1502445 1516298 1528670 1538457 1545200 1548962 1549820 1547683
53267 1547683 1542613 1535095 1525677 1514341 1500628 1484498 1466517 1446881 1424794 1399440 1371204 1341227
53255 1341227 1310033 1277347 1243185 1208288 1173314 1138254 1102913 1067468 1032371 998067 964903
53244 964903 932997 902121 872032 842878 814888 787777 761008 734578 708936 684056 659189
53233 659189 633815 608375 583882 561217 540958 523356 508164 494708 482384 470939 460381
53222 460381 450930 442977 436622 431215 425866 420395 415266 410570 405710 400283 394636 389197 383781 377993
53208 377993 372033 366728 362900 360738 359545 358060 355398 351759 347960 344449 341201 338379 336244 334341
53194 334341 331632 327781 323656 320204 317429 314825 312176 309496 306731 304017 301708 299730 297420 294473
53180 294473 291499 289074 286784 283891 280611 278020 276869 277024 277825 278442 278147 276902 275579 275100 275465 276043
53164 276043 276532 277043 277460 277461 277181 277177 277574 277834 277513 276781 275935 274852 273223 271103 268943 267182 265947 265100
53146 265100 264507 264255 264511 265114 265476 265112 264146 263074 262195 261530 261155 261190 261436 261383 260713 259592 258367 257181
53128 257181 256034 255056 254628 255175 256825 259145 261294 262585 262953 262857 262797 263025 263587 264402 265291 266068 266655 267066
53110 267066 267295 267349 267346 267414 267464 267176 266224 264486 262018 258981 255721 252863 251060 250465 250536 250594 250547 250792 251394
53091 251394 251744 251300 250293 249345 248617 247833 246989 246450 246276 245999 245279 244399 243832 243675 243730 243872 244022 243953 243441
53072 243441 242593 241797 241336 241141 240948 240672 240568 240944 241729 242568 243403 244580 246191 247684 248532 248905 249151 248979
53054 248979 247975 246727 246516 247772 249619 251138 252267 253166 253542 253158 252385 251643 250736 249263 247343 245460
53038 245460 243875 242591 241591 240712 239538 237837 235892 234181 232921 232055 231286 229936 227396 224076 221393
53023 221393 220344 220484 220769 220900 221288 222068 222852 223299 223422 223430 223608 224140 224775 224985 224762 224826 225625 226584 226868
53004 226868 226444 225806 225112 224282 223639 223619 224036 224350 224507 224857 225384 225713 225804 225952 226171 226236 226283 226699 227424 228026
52984 228026 228420 228870 229304 229371 229222 229456 230114 230484 230149 229591 229437 229706 230148 230823 231963 233598 235611 237877
52966 237877 240108 241946 243295 244201 244279 242894 240263 237877 237298 238703 240930 242649 243159 242384 240630 238403
52950 238403 236172 234230 232818 232157 232086 231832 230528 228085 225394 223502 222656 222182 221333 220057 218834 217951
52934 217951 217236 216541 216093 216199 216877 217947 219211 220279 220599 219971 218811 217594 216337 214990 213962 213692
52918 213692 213943 214120 214112 214219 214379 214178 213634 213312 213513 213912 214136 214194 214246 214470 215238 216828 218819 220271 220774
52899 220774 220806 220930 221171 221430 221924 222800 223830 224914 226471 228823 231451 233344 233998 233760 233283 232949 232759
52882 232759 232518 232023 231160 229863 228168 226443 225284 224811 224273 222891 221044 219931 220014 220473 220479 220294 220673
52865 220673 221780 223320 225324 228038 231192 233930 235598 236292 236665 237413 238849 240737 242571 244138 245666
52850 245666 247386 249203 250858 252054 252236 250741 247511 243334 239029 234724 230316 226221 223052 220810
52836 220810 219002 217466 216470 216044 215851 215850 216506 218040 219932 221490 222610 223651 224833 226048 227116 227886
52820 227886 228136 227714 226861 226172 226111 226638 227405 228190 229073 230256 231939 234325 237588 241636 246000 249990 252939
52803 252939 254265 253532 250693 246279 241178 236164 231658 227839 224811 222618 221193 220304 219593 218777 217898
52788 217898 217180 216627 215978 215173 214578 214465 214540 214330 213812 213296 212898 212577 212552 213126 214134 215070 215820 216755 218024
52769 218024 219263 220169 220901 221670 222345 222663 222488 221729 220406 218964 218106 218061 218407 218792 219348 220156 220812 220984
52751 220984 220969 221199 221557 221669 221606 221717 221945 221959 221953 222699 224585 226986 228907 230025 230834 231804 232639 232546 231241
52732 231241 229477 228348 228185 228449 228665 228971 229586 230175 230158 229455 228614 228298 228785 229749 230337 229711 227843 225673
52714 225673 224283 224003 224398 224823 224784 224081 222965 222021 221568 221357 221052 220782 220851 221134 221215 221037 221022 221487 222237
52695 222237 222727 222435 221198 219463 218132 217825 218303 218838 219065 219230 219710 220669 222165 224198 226522 228621
52679 228621 230045 230692 230788 230658 230465 230051 229161 227971 227176 227271 227925 228424 228617 228963 229710 230543 231207 231983 233198
52660 233198 234551 235340 235263 234703 234193 233856 233449 232871 232522 233156 235332 238875 242903 246371 248713 249981 250491
52643 250491 250412 249758 248600 247091 245231 242843 239944 236998 234588 232942 231941 231530 231835 232874 234448
52628 234448 236348 238518 240963 243656 246507 249200 251179 252077 252082 251561 250476 248605 246209 243893 241793
52613 241793 239588 237394 235860 235138 234523 233571 232755 232434 231994 230911 229973 230347 231748 232667 232407 231748 231555
52596 231555 231757 232025 232512 233401 234411 235280 236239 237520 238836 239806 240445 240825 240669 239850 238961 238823 239523 240471
52578 240471 241237 241862 242454 243025 243816 245206 247068 248553 248911 248356 247834 248012 248724 249397 249750 249930 250131 250349
52560 250349 250521 250656 250665 250251 249200 247698 246123 244559 242875 241290 240405 240363 240347 239373 237534 235980 235615
52543 235615 236244 237099 237775 238274 238505 238300 237855 237677 238051 238948 240443 242646 245010 246374 246215 245436 245262
52526 245262 245662 245594 244696 243841 243870 244542 245214 245844 246779 247926 248828 249369 249863 250517 251329 252559 254752 258045
52508 258045 261733 264834 267032 268858 270855 272676 273216 271752 268850 265868 263621 261788 259613 256842
52494 256842 253867 251283 249500 248503 247838 247072 246410 246553 247753 249371 250630 251471 252355 253554 254967 256384
52478 256384 257588 258528 259643 261607 264301 266529 267409 267638 268608 270497 272158 272894 273302 274174 275498 277068
52462 277068 279223 282170 285073 286739 287115 287382 288463 289959 290761 290244 288580 286167 283226 279986 276924
52447 276924 274555 272979 271788 270462 268837 267186 265894 265110 264671 264338 264062 263891 263596 262630 260765 258640
52431 258640 257290 257068 257314 257197 256525 255654 254968 254729 255076 255802 256324 256215 255698 255395 255702 256538 257519 258219
52413 258219 258497 258706 259364 260491 261681 262969 265097 268542 272775 277040 281517 287154 294626 304038 315260
52398 315260 327691 339672 348961 354001 354487 350876 344055 335452 326587 318066 309476 300551 292052 285246
52384 285246 280863 278812 278559 279413 280630 281667 282486 283558 285415 288015 290578 292284 293204 294199 295817
52369 295817 297803 299904 302444 305486 308090 309296 309439 309502 309385 307991 305022 301565 298659 296374 294669
52354 294669 294079 294840 296115 296881 297031 297044 297076 297078 297359 298297 299718 301188 302727 304652 306830 308630 309654
52337 309654 310155 310733 311887 313750 315979 317921 319170 320009 321260 323758 327883 333310 339141 344596 349776
52322 349776 355502 362264 369568 376400 382044 386361 389655 392500 395384 398309 400974 403368 405880 408723
52308 408723 411744 414936 418651 423043 427774 432556 437524 442777 448021 453084 458349 464253 470669 477185
52294 477185 483558 489443 494089 496943 498348 499050 499198 498385 496600 494598 493298 493177 494179 495808 497350
52279 497350 498411 499333 500786 502867 504884 506073 506415 506720 508017 510757 514512 518437 522030 525296 528337
52264 528337 531191 534110 537499 541311 544905 547793 550203 552591 554966 557098 559148 561769 565725 571558
52250 571558 579204 587618 595162 600800 604717 607568 609589 610818 611685 612771 614235 616006 618233 620979
52236 620979 623751 626021 628079 630764 634371 638363 642164 645741 649351 653128 656970 660596 663714 666349
52222 666349 668812 671189 673201 674892 677012 680178 684013 687667 690910 694093 697288 700231 703022 706157
52208 706157 709834 713826 717979 722309 726659 730873 735214 739938 744486 747838 749814 751422 753815 757414
52194 757414 762054 767321 772634 777620 782581 788075 793982 799509 804097 807673 810029 810784 810062 808417 805844
52179 805844 801748 796230 790571 785942 782336 779172 776209 773310 770112 766670 763867 762418 761851 761184 760227
52164 760227 759493 759200 759196 759700 761282 764023 767242 770126 772199 773274 773434 773117 772800 772571 772325 772283 772927 774433
52146 774433 776539 778930 781455 784020 786539 788954 791017 792261 792531 792356 792331 792265 791441 789690 787640 785871
52130 785871 784420 783315 783102 784471 787626 792320 798301 805449 813632 822648 832292 842330 852459 862347
52116 862347 871646 879994 887100 892844 897158 899901 901110 901377 901659 902510 903651 904409 904434 903929 903433 903620
52100 903620 905208 908747 914362 921682 929960 938231 945483 950918 954142 955119 953961 950796 945828 939502
52086 939502 932551 925813 919869 914857 910657 907311 905133 904366 904804 905834 906813 907375 907461 907217 906906 906753
52070 906753 906722 906484 905736 904569 903416 902595 902111 901973 902522 904131 906603 909157 911184 912845 914768 917290
52054 917290 920184 922967 925202 926537 926749 925889 924178 921690 918288 913988 909171 904261 899356 894442 889810
52039 889810 885944 882975 880630 878762 877574 877095 876858 876484 876360 877218 879075 881045 882266 882588 882229 881229
52023 881229 879590 877665 876020 875014 874713 875052 875767 876418 876816 877435 879023 881834 885574 890030 895285 901112
52007 901112 906550 910413 912016 911087 907178 899643 888396 874423 859299 844262 829910 816659 805057
51994 805057 795386 787104 779015 770099 760123 749508 738812 728285 717641 706225 693689 680621
51982 680621 668227 657172 646981 636692 625760 614078 601555 588297 575088 563125 553142 545116
51970 545116 538866 534526 532362 532497 535051 540237 548046 557939 569012 580368 591245 600987 609076 615108
51956 615108 618660 619287 616874 611987 605712 598986 592013 584450 576269 568378 562182 558534 557369 558353 561515
51941 561515 567051 574985 585324 598171 613129 628878 643921 657657 670215 681348 690153 695928
51929 695928 698706 698831 696503 691921 685328 676708 665855 652963 638771 623934 608724 593471 578749
51916 578749 564876 551739 539424 528448 519004 510593 503015 497222 494382 494368 495974 498557 502677 508983
51902 508983 517157 526251 535560 544700 553006 559276 562245 561347 557037 550340 542082 532609 522169 511259
51888 511259 500441 490171 481098 474162 469975 468264 468386 470308 474638 481778 491583 503923 519045
51875 519045 537085 557626 580018 603921 629220 655502 681832 707093 730547 752265 773040
51864 773040 793627 813620 830905 842260 844759 837024 819674 794872 765446 734177 703515 675423
51852 675423 651046 630443 612808 597091 582553 568946 556308 544554 533205 521647 509739
51841 509739 497997 487023 476963 467763 459731 453433 449038 446141 444282 443404 443732 445442 448437 452198
51827 452198 455846 458618 460363 461331 461536 460712 458922 456770 454772 452908 451094 449776 449704 451274 454391
51812 454391 458754 463897 469044 473315 476100 477070 475953 472726 468014 462912 458196 453869 449581 445288
51798 445288 441483 438913 438110 438964 440720 442545 444166 445726 447090 447764 447607 447189 447042 446913 446216 445047
51782 445047 444160 443816 443141 440832 436360 430462 424716 420637 418826 418824 419963 422366 426733 433163 440757 448692
51766 448692 457201 466943 477673 488029 496450 501864 503703 501984 497462 491210 483879 475734 467387 459802
51752 459802 453294 447115 440479 433603 427333 422095 417833 414683 412973 412526 412596 412765 413499 415511 418914
51737 418914 423285 428344 434135 440562 447147 453450 459541 465752 471942 477214 480585 481842 481634 480806 479929
51722 479929 479571 480644 484001 489563 495953 501129 503476 502540 499090 494633 490718 488342 487639 487933 488195
51707 488195 487786 486983 486686 487521 489433 492332 496752 503277 511191 518263 522307 522801 520763 517423 513555
51692 513555 509957 507823 508167 511097 515787 520863 524575 525126 521589 514630 505973 497078 488602 481003 474960
51677 474960 470922 468666 467664 467551 467840 467565 465814 462660 459124 456151 453910 452133 450877 450860 453217
51662 453217 458869 467842 479037 490760 501428 509705 514299 514267 509809 502514 494599 487894 483394 481320
51648 481320 481354 482981 485860 489948 495173 500868 505399 506474 502379 493301 481290 468567 456017 443592
51634 443592 431691 421337 413026 406242 400395 395646 392436 390682 389790 389138 388301 387217 386470 387024 389284
51619 389284 392598 395865 398316 399490 399027 396958 393857 390254 386181 381740 377728 375046 373653 372725 371772
51604 371772 371074 371080 371969 373838 376692 380112 383458 386709 390742 396497 404095 413008 422908 434109 447180
51589 447180 462162 478009 492723 504154 510883 512579 509862 504129 497289 491228 487258 486056 487973
51576 487973 493230 501893 513919 529178 547218 567121 587911 609257 631662 655933 682463 710762
51564 710762 739335 766151 789814 810624 830549 852185 877785 908962 946709 991238 1041609
51553 1041609 1095275 1147919 1194196 1229528 1251705 1260840 1257843 1243278 1217586 1181871 1138037 1088276
51541 1088276 1034610 978724 921982 865586 810870 759407 712713 671781 636813 607262 582161
51530 582161 560649 542358 527250 515041 504908 495942 487819 480929 475777 472307 469842 467601 465135
51517 465135 462308 459081 455549 452095 449174 446896 444949 442983 440845 438443 435687 432663 429516 426052
51503 426052 421815 416905 412311 409027 407005 405417 403826 402630 402329 402793 403410 403705 403705 403886 404809 406699
51487 406699 409317 412223 414997 417070 417689 416416 413613 410118 406518 402963 399514 396295 393353 390766
51473 390766 388867 388028 388163 388799 389621 390653 391905 393237 394716 396797 399896 403949 408440 412732 416366
51458 416366 419180 421227 422462 422559 421166 418291 414369 410111 406390 403897 402626 402001 401919 403365 407415
51443 407415 413897 421814 431059 442823 457873 474916 491029 503446 510862 513648 513447 512520 512963 516025
51429 516025 521608 528029 532582 533001 528667 520357 509181 496298 483274 471625 461725 452892 444823
51416 444823 438286 434081 432035 431398 431585 432099 432418 432572 433226 434584 435723 435730 434980 434461 434314 434027 433817 434662
51398 434662 436843 439518 442072 445034 449143 454203 459524 465104 471738 480108 490244 501814 514562
51385 514562 528503 544052 562024 583270 608254 637242 670929 710566 757131 810407 869144
51374 869144 932134 998874 1068931 1140669 1210630 1274132 1326592 1364824 1387605 1395135 1387861 1365934
51362 1365934 1329934 1281845 1224814 1161943 1095579 1027636 959949 894133 831565 773661 721745
51351 721745 676323 636912 602830 573804 549429 528561 509857 492778 477546 464197 452223
51340 452223 441214 431385 423208 416708 411300 406257 401312 396837 393407 391156 389660 388471 387520 386845
51326 386845 386251 385542 384955 384963 385578 386113 385819 384658 383383 382854 383281 384152 384881 385394 386009 386952 388309 390267
51308 390267 392926 395862 398286 399711 400112 399474 397840 395926 394915 395123 395388 394329 391710 388068 383536
51293 383536 377918 371698 366059 361756 358584 356076 354188 353186 353203 354046 355167 355933 356323 357246 359724 363797
51277 363797 368749 374243 380543 387511 394129 399479 403750 407894 412582 417710 422586 426327 428371 428912
51263 428912 428726 428422 428028 427373 426470 425315 423626 421069 417592 413353 408561 403633 399243 395893 393537
51248 393537 391764 390212 388622 386802 384794 382900 381236 379434 377178 374942 373724 373966 375012 375751 375626
51233 375626 374946 374433 374598 375425 376469 377317 378024 379092 380972 383599 386430 388817 390305 390716 390185 389187
51217 389187 388338 387978 388001 388253 389014 390832 393806 397326 400722 403925 407199 410355 412771 414321 415897 418586
51201 418586 422495 426718 430437 433659 436690 439246 440544 440254 438962 437520 436211 434794 433191 431713
51187 431713 430603 429689 428651 427432 426280 425537 425476 426156 427299 428424 429263 429949 430765 431825 433149 434816
51171 434816 436831 438862 440263 440400 438994 436263 432801 429151 425407 421351 416999 412830 409371 406754
51157 406754 404771 403209 401991 401143 400759 400803 400886 400470 399446 398279 397421 396811 396136 395310 394444 393625 393002 392881
51139 392881 393442 394501 395810 397373 399197 400974 402325 403182 403620 403537 402834 401760 400741 400062 399984 400838 402566
51122 402566 404468 405975 407505 409976 413675 418138 422976 428121 433300 438000 442061 445642 448556 450336
51108 450336 451164 451967 453245 454403 454580 453560 451531 448633 445335 442746 441757 442015 442355 442154 441780 441700 441626
51091 441626 440744 438602 435650 432937 431255 430606 430566 431027 432208 433963 435650 436943 438395 440795 444199
51076 444199 447868 450952 452953 453753 453603 453002 452349 451718 451074 450495 450027 449617 449480 450253 452415 455662 459196
51059 459196 462515 465740 469377 474141 480838 489814 500344 510773 519369 525088 527899 528931 530273 534052
51045 534052 541256 551354 563017 575111 587152 599203 611404 623389 634046 642074 646958 649320
51033 649320 650382 651165 652064 652684 651883 648279 641126 630753 618014 603505 587647 571480 556796 545100
51019 545100 536579 530427 526026 523370 522372 522448 523141 524700 527492 531115 534719 538071 541694 545971 550759
51004 550759 556016 562049 568768 575277 580759 585394 589919 594556 598880 602549 605646 608363 610817 613216
50990 613216 615893 619239 623803 630255 638825 648882 659593 670933 683577 697745 712686 727537
50978 727537 742232 757117 771818 784808 794117 798346 797096 790715 779968 766121 751119 737055
50966 737055 725010 714600 705064 696684 690673 687752 687473 689142 692803 698877 707207 717014 727710 739257
50952 739257 751695 764677 777700 790628 803773 817483 831789 846568 862105 879303 899124
50941 899124 921857 947266 975540 1007545 1043412 1080803 1115124 1141990 1159680 1169318 1173099 1172692
50929 1172692 1169116 1163404 1156663 1149333 1140705 1129508 1115033 1097593 1077982 1056742 1034080 1010212
50917 1010212 985371 959566 932803 905773 879970 856692 836020 817075 799150 782166 766130
50906 766130 750828 736386 723530 712681 703023 693143 682625 672526 664186 657969 653346 649697 646666
50893 646666 643990 641444 638990 636737 634681 632588 630172 627387 624581 622362 621173 620960 621273 621673 621925
50878 621925 621942 621832 622061 623225 625460 628228 630856 633155 635372 637781 640511 643651 647275 651435 656269
50863 656269 661943 668329 674891 681204 687552 694764 703438 713495 724454 735952 747965 760746 774607
50850 774607 789695 805948 823301 841837 861680 882829 905297 929290 955026 982421 1011192
50839 1011192 1041276 1072820 1105625 1138793 1171149 1201915 1230846 1257837 1282786 1305992 1328430
50828 1328430 1351215 1374672 1398208 1421371 1444855 1470164 1498319 1529326 1562903 1599213 1638447
50817 1638447 1679941 1722080 1762964 1800816 1833863 1860333 1878839 1888686 1889845 1882789 1868296 1847035
50805 1847035 1819199 1784794 1744499 1700137 1654123 1608472 1564340 1522375 1483310 1448122 1417609
50794 1417609 1391881 1370482 1353143 1340272 1332500 1329820 1331529 1337049 1346480 1360112 1377548 1397448
50782 1397448 1418008 1437564 1454957 1469611 1481337 1490023 1495581 1498214 1498472 1496759 1492884 1486312 1476730
50769 1476730 1464023 1447770 1427259 1402234 1373343 1341563 1307414 1271035 1232848 1193780 1154846
50758 1154846 1116824 1080293 1045673 1013138 982729 954592 928913 905727 885110 867534 853487
50747 853487 842675 834149 827510 823437 822568 824346 827581 831839 837559 844986 853799 863832 875415 888749
50733 888749 903496 919242 935968 953866 973159 994266 1017581 1042732 1068469 1093642 1117953
50722 1117953 1141500 1164102 1185525 1205987 1225795 1244590 1261436 1275528 1286488 1294101 1298318 1299564
50710 1299564 1298751 1297002 1295515 1295465 1297704 1302643 1310696 1322571 1338685 1358536 1381186 1406233 1433671
50697 1433671 1462720 1491496 1518111 1541641 1561776 1578073 1590071 1597957 1602688 1605501 1607565 1609995
50685 1609995 1613753 1619312 1626468 1634553 1642852 1650902 1658547 1665834 1672931 1680178 1688233 1698186 1711662 1730663
50671 1730663 1756996 1791484 1833753 1882852 1937815 1997353 2059218 2120455 2178537 2232054 2280344
50660 2280344 2322944 2359727 2391340 2418976 2443597 2465466 2484384 2500095 2512286 2520391 2523745 2522132
50648 2522132 2516024 2506157 2492978 2476840 2458811 2441009 2425914 2415414 2410541 2411805 2419389 2433067
50636 2433067 2452226 2475998 2503244 2532536 2562410 2591691 2619383 2644373 2665561 2682412 2695179
50625 2695179 2704597 2711680 2717893 2724872 2732915 2739095 2737008 2719314 2681724 2625551 2556994 2484075 2413866
50612 2413866 2351438 2299981 2260986 2234413 2219194 2213745 2216035 2223555 2233719 2244260 2252936 2256901
50600 2256901 2252945 2238791 2214110 2180152 2138364 2089442 2033720 1972344 1907796 1842927 1779452
50589 1779452 1717673 1657740 1600652 1547676 1499201 1454819 1414409 1378593 1348100 1323173 1303663
50578 1303663 1289239 1279297 1273131 1270495 1271790 1277465 1287359 1300705 1316510 1333765 1351551 1369182
50566 1369182 1386172 1401919 1415554 1426268 1433800 1438645 1441985 1445389 1450330 1457868 1468920 1484770
50554 1484770 1506912 1536232 1572629 1615608 1664950 1720426 1781008 1844696 1909160 1972313 2032405
50543 2032405 2088017 2138393 2183810 2225580 2265634 2306024 2348531 2394378 2444044 2497292 2553480
50532 2553480 2612016 2672680 2735737 2801902 2872172 2947517 3028620 3115926 3209797 3310350 3417092
50521 3417092 3528955 3644734 3763254 3882900 4001148 4114650 4219597 4312007 4388166 4445287
50511 4445287 4481708 4496299 4487903 4455676 4399854 4321963 4224447 4110418 3983673 3848627 3710141
50500 3710141 3573316 3443007 3323151 3216639 3125908 3053245 3000305 2967720 2955457 2962892 2987944
50489 2987944 3026613 3073973 3125219 3175120 3217251 3245181 3254488 3242852 3208637 3150989 3071640
50478 3071640 2975267 2867318 2752168 2633462 2514743 2398639 2286230 2178097 2075374 1978940
50468 1978940 1888343 1802694 1722273 1648235 1580857 1519123 1462065 1409707 1362465 1320338 1282985
50457 1282985 1250174 1221817 1197686 1177261 1159794 1144638 1131572 1120642 1111646 1104098 1097752 1092678
50445 1092678 1088629 1084992 1081845 1080364 1081441 1084323 1087488 1090614 1094778 1100809 1108303 1116393 1124727 1133521
50431 1133521 1143284 1154754 1168526 1184467 1201924 1220652 1241133 1263883 1288965 1316340 1346146
50420 1346146 1378396 1412860 1449534 1488810 1530941 1575809 1623537 1674816 1730066 1788631 1849405
50409 1849405 1912157 1977707 2046769 2119067 2193585 2269255 2345070 2419790 2491843 2559591 2621628
50398 2621628 2676763 2723786 2761266 2787516 2800676 2798851 2780499 2745152 2693990 2629615 2555083
50387 2555083 2473131 2386223 2297002 2208354 2122963 2043050 1970651 1907845 1856306 1816477 1787471
50376 1787471 1768034 1757505 1755601 1761461 1773375 1789405 1807689 1825833 1840488 1848179 1846582 1834814
50364 1834814 1812760 1780719 1739737 1691776 1639207 1584194 1528573 1474000 1421808 1372657 1326455
50353 1326455 1282802 1241566 1203004 1167252 1133872 1102132 1071726 1042946 1016126 991256 968184
50342 968184 946816 926919 908189 890856 875777 863377 852757 842433 831851 821675 812638 804706
50330 804706 797399 790413 783757 777674 772561 768584 765303 762062 758895 756663 756111 757115 759004 761292
50316 761292 763946 767277 771815 777969 785623 794291 803812 814521 826569 839502 852835 866702 881490
50303 881490 897056 912805 928520 944723 962176 981241 1001724 1023163 1045206 1067697 1090137
50292 1090137 1110847 1126916 1135451 1135084 1126393 1111258 1092206 1072135 1053990 1040288 1032796 1032093 1036648
50279 1036648 1042279 1043505 1036580 1021671 1002151 981911 963361 947405 934360 924491 917921 914476
50267 914476 913713 914987 917555 920771 924242 927709 930864 933397 935269 936831 938629 941211 945075 950542
50253 950542 957440 964937 971945 977767 982356 986003 988898 990969 991896 991181 988362 983440 977117 970464 964135
50238 964135 957970 951467 944659 938325 933220 929296 925920 922776 920223 918673 917983 917705 917688 918164 919359
50223 919359 921351 924255 928278 933558 940177 948340 958302 970099 983590 998847 1016358 1036782 1060674
50210 1060674 1088449 1120438 1156826 1197634 1242671 1291138 1341172 1390089 1435399 1475575 1509944
50199 1509944 1538281 1560952 1579242 1595006 1609737 1624003 1637505 1649178 1657037 1658317 1650201 1630738
50187 1630738 1599405 1557271 1506839 1451386 1393981 1336933 1282047 1231069 1185574 1146572 1114534
50176 1114534 1089742 1072206 1061143 1054830 1051081 1047666 1042341 1033153 1019312 1001679 982005 961796
50164 961796 942171 924442 910022 899440 891846 885832 880574 876027 872311 869316 866895 865220 864778
50151 864778 866036 869018 873251 878123 883180 887885 891289 892385 890942 887662 883371 878315 872403 865764
50137 865764 858842 852220 846691 843215 842330 843631 846188 849526 853916 859627 866144 872258 876870 879710
50123 879710 881415 882940 884843 887126 889581 892018 894177 895881 897575 900357 905051 911409 918637 926465
50109 926465 935225 944945 955091 965519 977199 991502 1008868 1028559 1049716 1072479 1097953 1127226
50097 1127226 1160567 1197645 1238469 1283984 1335755 1395266 1463425 1540325 1624972 1715260 1808443
50086 1808443 1901558 1991419 2074733 2149185 2214772 2273723 2328693 2381091 2431054 2478368 2522536
50075 2522536 2561688 2591877 2608049 2606134 2584537 2544111 2487157 2416592 2335588 2247307 2154584
50064 2154584 2059779 1964890 1871640 1781458 1695653 1615627 1542647 1477281 1419369 1368672 1325189
50053 1325189 1288564 1257518 1230410 1206214 1184516 1164644 1145473 1126341 1107767 1090859 1076135
50042 1076135 1063208 1051594 1041479 1033443 1027537 1023005 1019080 1015798 1013721 1012977 1013062 1013549 1014516 1016120
50028 1016120 1018241 1020749 1023637 1026512 1028389 1028527 1027284 1025696 1024425 1023489 1022742 1022044 1021054 1019310 1016517
50013 1016517 1012422 1006574 998690 989223 979266 969909 961929 955677 950753 946019 940589 934828 929959 926899
49999 926899 926020 927793 932726 940537 950049 960079 969848 978530 985301 990186 994172 997999 1001308 1003295
49985 1003295 1003648 1002426 999566 995138 989844 984816 981124 979790 981962 988562 999896 1016016 1037412
49972 1037412 1065030 1099654 1141464 1189988 1244085 1301808 1360492 1417205 1469454 1515828 1556202
49961 1556202 1591333 1622380 1650864 1678664 1707407 1737563 1768205 1797339 1822036 1838491 1842959
49950 1842959 1833313 1809621 1773275 1726011 1669901 1607663 1542438 1477255 1414661 1356319 1302614
49939 1302614 1252815 1205801 1160614 1116654 1073976 1033401 995743 960765 927458 895404 865247
49928 865247 837738 813156 791840 774304 760233 748159 736880 726634 718283 711981 707397 704635
49916 704635 703933 704793 706358 708497 711676 715841 720280 724614 729222 734592 740945 748662 758488 770935
49902 770935 785720 801895 818378 834484 850181 865697 880562 893355 902805 908942 912696 914524
49890 914524 913914 909995 902117 890049 874288 856128 836846 816930 796653 777141 759921 745371
49878 745371 732464 720202 708498 697454 686763 676405 667174 659741 653681 648142 643152 639563 637887
49865 637887 637862 639127 641658 645436 650216 655888 662725 671048 680900 692286 705463 720631 737372 754648
49851 754648 771354 786633 799695 809819 816954 822090 826499 830465 832967 832663 828885 821639 811182
49838 811182 798028 783194 767972 753344 739695 727106 715807 706364 699383 694904 692156 690199
49826 690199 688830 688545 689570 691466 693869 697182 702138 709072 718005 729091 742399 757349 772837
49813 772837 787871 801755 813796 823324 830130 834709 838021 840952 843655 845175 844032 839498 832094
49800 832094 822730 811864 799915 787934 777086 767627 758946 750401 741608 732293 722667 713788 706705
49787 706705 701199 696102 690914 686357 683259 681654 681199 681705 682811 683780 684160 684297 684854 686160 688327 691709
49771 691709 696897 704455 714712 727438 741482 755122 767072 776908 784546 789819 792887 794572 795740
49758 795740 796485 796163 794025 789571 782580 773181 761783 748771 734369 719023 703699 689475 676926
49745 676926 666102 656962 649584 643906 639574 636223 633927 633155 634026 635651 636606 636335 635754 636127 637681
49730 637681 639884 642726 646832 652269 658123 663635 669103 675223 682152 689831 698809 709984 723516 738412
49716 738412 753189 766689 778361 788138 796221 802832 808032 811633 813083 811519 806213 797125 785005
49703 785005 771093 756871 743808 732770 723671 716089 710164 706310 704122 702369 700345 698504 697358
49690 697358 696523 695466 694601 694900 696747 699859 704064 709380 715558 722309 729977 739275 750263 762242
49676 762242 774801 788407 803790 821317 841119 862961 885271 904707 917677 922667 920916 914901
49664 914901 906656 897564 888957 881992 876889 872926 869488 866605 864007 860046 852315 839488 822184 802086
49650 802086 780889 760226 741730 726281 713359 701761 691022 681748 674572 669348 665511 662840
49638 662840 661511 661571 662688 664385 666249 667814 668468 667792 665961 663606 661180 658628 655719 652428 648842
49623 648842 644967 640925 637107 633737 630468 626835 623033 619745 617285 615445 614194 613859 614431 615345 616353
49608 616353 618036 620951 624678 628209 630991 633045 634340 634753 634650 634919 636180 638216 640286 641831 642835
49593 642835 643696 644808 646197 647607 648980 650632 652732 654796 656050 656311 656278 656919 658713 661437 664420
49578 664420 666986 668821 670141 671575 673852 677475 682485 688527 695198 702364 710040 718102 726515 735831
49564 735831 747035 760574 775764 791342 806346 820206 832327 842084 849186 853666 855457 854313
49552 854313 850256 843918 836272 828127 819946 812075 805005 799299 795306 792992 792031 791879 791803 791176 790016
49537 790016 788955 788358 787734 786490 785068 784625 785593 787286 789115 791546 795518 801488 809475 819560 831849
49522 831849 846410 863744 884880 910262 938476 966420 990745 1009136 1020885 1026904 1029095 1029242
49510 1029242 1028602 1028560 1030946 1036801 1045068 1053227 1059158 1061836 1060482 1054169 1042670 1027067 1009032 989827
49496 989827 970193 950777 932255 915235 900235 887560 877066 868192 860400 853414 847027 841041
49484 841041 835557 831074 828047 826474 826046 826475 827487 828637 829430 829675 829557 829405 829474 829939 830878 832173 833576
49467 833576 835048 837022 840051 844147 848706 853265 857993 863097 868013 871786 874173 875771 876895 876999
49453 876999 875445 872267 867765 861913 854751 846944 839305 831951 824490 816851 809344 802063 794913 788313
49439 788313 783218 780225 778966 778592 778600 779094 780401 782561 785173 787945 791447 796869 804634 813678 822704
49424 822704 831857 842408 855040 869518 886145 906170 929584 952904 970233 976999 972704 960457
49412 960457 944524 928291 913754 901987 893674 889244 888760 891871 897940 906201 915962 926815 938744
49399 938744 951955 966564 982430 999279 1016971 1035542 1054799 1073894 1091606 1107352 1121588
49388 1121588 1134779 1146242 1154681 1159675 1161728 1160814 1156006 1147163 1135975 1124394 1112706 1100116 1086816
49375 1086816 1074376 1064314 1057188 1052911 1050895 1049939 1049058 1048691 1050290 1054545 1060808 1068269 1076618 1085199
49361 1085199 1092568 1097594 1100303 1101090 1099827 1096334 1091006 1084169 1075360 1064186 1051637 1039749 1029987
49348 1029987 1022601 1017334 1013938 1011883 1010406 1009293 1009217 1010925 1014261 1018243 1021893 1024691 1026298 1026240 1024124
49333 1024124 1020080 1014759 1008812 1002556 996196 990144 984880 980658 977544 975570 974580 974112 973844 974043 975168
49318 975168 977087 979173 981124 983035 984610 985058 984201 983145 983203 984399 985520 985566 984753 984091 984331 985409
49302 985409 986776 988205 990190 993439 998037 1003376 1008909 1014565 1020244 1025293 1028937 1031146 1032731 1034575
49288 1034575 1036884 1039130 1040598 1040990 1040590 1039916 1039341 1039145 1039710 1041356 1044047 1047641 1052481 1059369 1068929
49273 1068929 1081221 1095976 1112776 1130870 1149246 1167072 1183851 1199197 1212977 1225807 1238776
49262 1238776 1252275 1265492 1277377 1287724 1296992 1305608 1314005 1322841 1332266 1340914 1346447 1347629 1345730
49249 1345730 1343576 1343108 1343671 1342479 1336750 1325556 1309800 1290760 1269151 1245668 1221764 1199225 1178948
49236 1178948 1160546 1143168 1126416 1110520 1096040 1083694 1074253 1068203 1065306 1064644 1065386 1067524 1071609
49223 1071609 1077600 1084329 1090371 1095198 1099069 1102062 1103857 1104421 1104189 1103336 1101364 1097743 1092571 1086491 1080350
49208 1080350 1075128 1071718 1070559 1071811 1075975 1083704 1094789 1107963 1122066 1136697 1151224 1163953
49196 1163953 1173216 1178989 1182672 1185498 1187868 1189921 1191746 1192905 1192551 1190350 1186860 1182827 1178554 1174060
49182 1174060 1169508 1165347 1162317 1161331 1163001 1167238 1173665 1182333 1193707 1208145 1226097 1248925 1278809
49169 1278809 1317253 1363641 1415005 1466508 1511993 1545209 1562066 1562487 1550119 1530111 1506950 1483680
49157 1483680 1462076 1442846 1425637 1409307 1392677 1375280 1357518 1340189 1323911 1308925 1295191
49146 1295191 1282515 1270730 1259919 1250448 1242642 1236444 1231457 1227284 1223824 1221342 1220379 1221443 1224599
49133 1224599 1229365 1235144 1241722 1249252 1257805 1267088 1276624 1286146 1295781 1305873 1316639 1328090 1340350
49120 1340350 1353868 1369100 1386009 1404171 1423363 1443816 1465874 1489815 1516097 1545466 1578582
49109 1578582 1615876 1658154 1707315 1766319 1838207 1924280 2021779 2122876 2217654 2300758 2376300
49098 2376300 2454863 2543025 2633942 2708182 2745545 2738656 2697074 2638898 2577689 2515679 2447207
49087 2447207 2366976 2275362 2177951 2081971 1993237 1915097 1848780 1794028 1749522 1713426 1684197
49076 1684197 1660933 1642667 1627555 1613365 1598841 1584082 1569638 1555878 1543293 1532481 1523362
49065 1523362 1515080 1507143 1500108 1494695 1490813 1488036 1486420 1486212 1487165 1488808 1491077 1494166 1498129 1503094
49051 1503094 1509358 1516719 1524267 1531449 1538748 1546647 1554655 1562263 1570229 1579778 1591008 1603182 1616213
49038 1616213 1630555 1645950 1661680 1678112 1696699 1718287 1742443 1768289 1794703 1819634 1840767
49027 1840767 1857400 1870612 1881377 1889767 1896224 1901980 1907529 1912106 1915503 1919031 1923688 1928689 1933110
49014 1933110 1937828 1944340 1952409 1960527 1968221 1976393 1985521 1995013 2004489 2014464 2025473 2037498 2050554
49001 2050554 2065031 2081043 2097996 2115036 2131505 2146899 2160900 2173594 2185316 2196241 2206411
48990 2206411 2216059 2225419 2234367 2242667 2250463 2258043 2265274 2271864 2278053 2284355 2290563 2295692 2299067 2300883
48976 2300883 2301499 2300687 2297933 2293120 2286675 2279248 2271367 2263175 2254394 2244698 2234168 2223254 2212442 2202206
48962 2202206 2193090 2185392 2178886 2173267 2168842 2166369 2166277 2168440 2172569 2178316 2185169 2192972 2202582 2215227
48948 2215227 2230982 2248484 2266404 2284462 2302657 2320278 2336500 2351631 2367051 2384037 2403136
48937 2403136 2424474 2448101 2473957 2501946 2532129 2564572 2599014 2634945 2671969 2709785 2747920
48926 2747920 2785967 2824282 2864011 2906076 2950230 2995429 3041099 3087734 3136074 3185877 3235776
48915 3235776 3284351 3331098 3376346 3420553 3463994 3506928 3549535 3591651 3632893 3673170 3712740
48904 3712740 3751632 3789437 3825971 3861788 3897595 3933286 3967996 4001112 4032857 4063779 4094002
48893 4094002 4123088 4150395 4175446 4198198 4219164 4239070 4258182 4276033 4291963 4305707 4317184
48882 4317184 4325813 4330419 4329927 4323942 4312711 4296856 4277266 4254808 4229696 4201272 4168808 4132430
48870 4132430 4092886 4050499 4004824 3955499 3902993 3848333 3792500 3736430 3681163 3627428 3575185
48859 3575185 3524022 3473977 3425591 3379232 3334879 3292530 3252277 3213809 3176391 3139659 3104021
48848 3104021 3069974 3037477 3006531 2978025 2953267 2932629 2915239 2900173 2887479 2877766 2871145 2866953
48836 2866953 2864414 2863305 2863981 2866953 2872457 2880417 2890828 2903997 2920115 2938557 2958040 2977751 2998115
48823 2998115 3020152 3044243 3069843 3096288 3123475 3151687 3181053 3211313 3241976 3272639 3303297
48812 3303297 3334316 3365905 3397723 3429290 3460750 3492785 3525662 3558789 3591442 3623563 3655637
48801 3655637 3688128 3721455 3756130 3792387 3829749 3867430 3905077 3942678 3979839 4015692 4049658
48790 4049658 4081902 4112910 4143004 4172302 4200670 4227448 4251540 4272051 4288532 4300505 4307233
48779 4307233 4308362 4304504 4296776 4285930 4272252 4256051 4237697 4217282 4194716 4170245 4144497 4117890
48767 4117890 4090223 4060910 4029396 3995384 3958885 3920173 3879528 3837007 3792597 3746500 3699052
48756 3699052 3650498 3601161 3551781 3503283 3456112 3410194 3365602 3322784 3281823 3241835 3201583
48745 3201583 3160606 3119537 3079446 3041159 3005107 2971515 2940678 2913121 2889384 2869472 2852668
48734 2852668 2838029 2824895 2812613 2800044 2785934 2769884 2752655 2735400 2718963 2704053 2691632
48723 2691632 2682580 2677067 2674537 2674314 2675982 2679118 2683069 2687285 2691903 2697735 2705491 2715017 2725415 2735918
$$ [...]
##END NTUPLES=NMR SPECTRUM
##END=
