
##TITLE=UV1242_M9_1261-1207_5_7241481_N8xrDJecqT
##JCAMPDX= 6.0         $$ Bruker NMR JCAMP-DX V2.0
##DATA TYPE= NMR SPECTRUM
##DATA CLASS= NTUPLES
##ORIGIN= BRUKER
##OWNER= Administrator
$$ 1.72 TOPSPIN		Version 2.1
$$ 2013-01-19 02:24:57.177 -0500  Administrator@X
$$ Compression mode = diff/dup
##.OBSERVE FREQUENCY= 400.02188249412
##.OBSERVE NUCLEUS= ^1H
##.ACQUISITION MODE= SIMULTANEOUS (DQD)
##.ACQUISITION SCHEME= undefined
##.AVERAGES= 8
##.DIGITISER RES= 22
##SPECTROMETER/DATA SYSTEM= spect
##.PULSE SEQUENCE= zg30
##.SOLVENT NAME= COFFEE_meoh
##.SHIFT REFERENCE= INTERNAL, COFFEE_meoh, 1, 14.98509
##AUDIT TRAIL= $$ (NUMBER, WHEN, WHO, WHERE, PROCESS, VERSION, WHAT)
$$ ##TITLE= Audit trail, TOPSPIN		Version 2.1
$$ ##JCAMPDX= 5.01
$$ ##ORIGIN= Bruker BioSpin GmbH
$$ ##OWNER= Administrator
$$ $$ E:\/data/COFFEE/nmr/UV1242_M9_1261-1207_5_7241481_N8xrDJecqT/20/pdata/1/auditp.txt
$$ ##AUDIT TRAIL=  $$ (NUMBER, WHEN, WHO, WHERE, PROCESS, VERSION, WHAT)
(   1,<2013-01-19 02:24:49.068 -0500>,<Administrator>,<X>,<go>,<TOPSPIN 2.1>,
      <created by zg
	started at 2013-01-19 02:23:42.787 -0500,
	POWCHK enabled, PULCHK disabled,
       configuration hash MD5:
       86 BA 57 50 F2 9D 5C 9B 26 00 A9 28 5F 66 2E 89
       data hash MD5: 64K
       38 1B ED 99 C8 A9 90 79 88 6A 52 42 DF 69 B3 32>)
(   2,<2013-01-19 02:24:52.146 -0500>,<Administrator>,<X>,<proc1d>,<TOPSPIN 2.1>,
      <Start of raw data processing
       efp LB = 0 FT_mod = 6 PKNL = 1 PHC0 = 0 PHC1 = 0 SI = 32K 
       data hash MD5: 32K
       58 3E 3C FA 38 94 E3 00 D4 A5 51 53 46 46 EA F3>)
(   3,<2013-01-19 02:24:52.615 -0500>,<Administrator>,<X>,<proc1d>,<TOPSPIN 2.1>,
      <pk PHC0 = 96.64124 PHC1 = 0 
       data hash MD5: 32K
       03 F6 35 6B FD 52 9D 36 DA 63 A8 F1 96 54 58 CA>)
(   4,<2013-01-19 02:24:52.834 -0500>,<Administrator>,<X>,<proc1d>,<TOPSPIN 2.1>,
      <abs ABSG = 1 
       data hash MD5: 32K
       77 B8 11 0E 05 73 2C D7 D5 D6 4C 1D FF A0 48 34>)
(   5,<2013-01-19 02:24:52.990 -0500>,<Administrator>,<X>,<proc1d>,<TOPSPIN 2.1>,
      <abs ABSG = 2 
       data hash MD5: 32K
       D7 89 6B 31 E3 EF 8A 3B D5 BB 9A 58 20 B0 4B 68>)
(   6,<2013-01-19 02:24:53.130 -0500>,<Administrator>,<X>,<proc1d>,<TOPSPIN 2.1>,
      <abs ABSG = 3 
       data hash MD5: 32K
       BD 27 F5 1A 27 F1 A2 BC 20 FD 21 A8 21 1D AA 76>)
(   7,<2013-01-19 02:24:53.271 -0500>,<Administrator>,<X>,<proc1d>,<TOPSPIN 2.1>,
      <abs ABSG = 4 
       data hash MD5: 32K
       D7 AB 0E B9 F6 43 5C 39 8D 66 5A 04 0E 10 24 8E>)
(   8,<2013-01-19 02:24:53.427 -0500>,<Administrator>,<X>,<proc1d>,<TOPSPIN 2.1>,
      <abs ABSG = 5 
       data hash MD5: 32K
       1C A8 93 DB 5C C7 6D D8 53 44 E8 4A 88 5A D9 FF>)
$$ ##END=
$$ 
$$ $$ hash MD5
$$ $$ AE F4 6F 5E 4F C8 13 32 F8 C8 AB BA C7 72 DF 1A
##$RELAX= 
##$RELAX= 
##$RELAX= 
##$RELAX= 
##$RELAX= 
##$RELAX= 
##$RELAX= 
$$ Bruker specific parameters
$$ --------------------------
##$DU= <E:\>
##$EXPNO= 20
$$ [...]
##$TP= (0..7)
150 150 150 150 150 150 150 150
##$TP07= 0
##$TPNAME0= <>
##$TPNAME1= <>
##$TPNAME2= <>
##$TPNAME3= <>
##$TPNAME4= <>
##$TPNAME5= <>
##$TPNAME6= <>
##$TPNAME7= <>
##$TPOAL= (0..7)
0.5 0.5 0.5 0.5 0.5 0.5 0.5 0.5
##$TPOFFS= (0..7)
0 0 0 0 0 0 0 0
##$TUNHIN= 0
##$TUNHOUT= 0
##$TUNXOUT= 0
##$USERA1= <user>
##$USERA2= <user>
##$USERA3= <user>
##$USERA4= <user>
##$USERA5= <user>
##$V9= 5
##$VALIST= <valist>
##$VCLIST= <CCCCCCCCCCCCCCC>
##$VD= 0
##$VDLIST= <DDDDDDDDDDDDDDD>
##$VPLIST= <PPPPPPPPPPPPPPP>
##$VTLIST= <TTTTTTTTTTTTTTT>
##$WBST= 1024
##$WBSW= 4
##$XGAIN= (0..3)
0 0 0 0
##$XL= 0
##$YL= 0
##$YMAX_a= 666705
##$YMIN_a= -567227
##$ZGOPTNS= <>
##$ZL1= 120
##$ZL2= 120
##$ZL3= 120
##$ZL4= 120
##$ABSF1= 14.98509
##$ABSF2= -5.573092
##$ABSG= 5
##$ABSL= 3
##$ALPHA= 0
##$AQORDER= 0
##$ASSFAC= 0
##$ASSFACI= 0
##$ASSFACX= 0
##$ASSWID= 0
##$AUNMP= <proc_prof1d_extract_pilot.lims>
##$AXLEFT= 0
##$AXNAME= <>
##$AXNUC= <1H>
##$AXRIGHT= 0
##$AXTYPE= 0
##$AXUNIT= <>
##$AZFE= 0.1
##$AZFW= 0.1
##$BCFW= 0
##$BC_mod= 0
##$BYTORDP= 0
##$COROFFS= 0
##$CY= 15
##$DATMOD= 1
##$DC= 0
##$DFILT= <>
##$DTYPP= 0
##$F1P= 0
##$F2P= 0
##$FCOR= 0.5
##$FTSIZE= 32768
##$FT_mod= 6
##$GAMMA= 0
##$GB= 0
##$INTBC= 1
##$INTSCL= 1
##$ISEN= 128
##$LB= 0
##$LEV0= 0
##$LPBIN= 0
##$MAXI= 10000
##$MC2= 0
##$MEAN= 0
##$ME_mod= 0
##$MI= 0
##$NCOEF= 0
##$NC_proc= -8
##$NLEV= 6
##$NOISF1= 0
##$NOISF2= 0
##$NSP= 0
##$NTH_PI= 0
##$NZP= 0
##$OFFSET= 14.98509
##$PC= 1
##$PHC0= 96.64124
##$PHC1= 0
##$PH_mod= 1
##$PKNL= yes
##$PPARMOD= 0
##$PPDIAG= 0
##$PPIPTYP= 0
##$PPMPNUM= 2147483647
##$PPRESOL= 1
##$PSCAL= 4
##$PSIGN= 0
##$PYNMP= <proc.py>
##$REVERSE= no
##$SF= 400.02
##$SI= 32768
##$SIGF1= 0
##$SIGF2= 0
##$SINO= 400
##$SIOLD= 32768
##$SPECTYP= <>
##$SREGLST= <1H.CDCl3>
##$SSB= 0
##$STSI= 32768
##$STSR= 0
##$SW_p= 8223.68421052631
##$SYMM= 0
##$S_DEV= 0
##$TDeff= 65536
##$TDoff= 0
##$TI= <>
##$TILT= no
##$TM1= 0
##$TM2= 0
##$TOPLEV= 0
##$USERP1= <user>
##$USERP2= <user>
##$USERP3= <user>
##$USERP4= <user>
##$USERP5= <user>
##$WDW= 1
##$XDIM= 32768
##$YMAX_p= 460330477
##$YMIN_p= -778735
##$CURPLOT= <Network HP LaserJet P1505>
##$CURPRIN= <$Network HP LaserJet P1505>
##$DFORMAT= <normdp>
##$LAYOUT= <+/1D_H.xwp>
##$LFORMAT= <normlp>
##$PFORMAT= <normpl>
##$SURQMSG= 1
$$ End of Bruker specific parameters
$$ ---------------------------------
##NTUPLES= NMR SPECTRUM
##VAR_NAME=  FREQUENCY,     SPECTRUM/REAL,   SPECTRUM/IMAG
##SYMBOL=    X,             R,               I
##VAR_TYPE=  INDEPENDENT,   DEPENDENT,       DEPENDENT
##VAR_FORM=  AFFN,          ASDF,            ASDF
##VAR_DIM=   32768,         32768,           32768
##UNITS=     HZ,            ARBITRARY UNITS, ARBITRARY UNITS
##FACTOR=    0.250966925370066, 1,           1
##FIRST=     8223.43324360094, -46727,       -2327
##LAST=      0,             -15041,          -61168
##MIN=       0,             -778735,         0
##MAX=       8223.43324360094, 460330477,    0
$$ Real data points
##PAGE= N=1
##DATA TABLE= (X++(R..R)), XYDATA
$$ [...]
19545a60888h220A19438a25670o2186l7638C9116A1290a89884F0517K19654b12852
$$ -160888 -8220 119438 -125670 -187856 -225494 39116 11290 -189884 60517 280171 -212852
19533A37101e53639G8710a83919j1929c2805I6436E958J9761b70566d5181H6221
$$ 137101 -553639 78710 -183919 -195848 -32805 96436 5958 25719 -270566 -45181 86221
19521B6567a58853P7875a5649A32184b53121K3105H9917a01631k736j43261C19156
$$ 26567 -158853 -80978 -15649 132184 -253121 -230016 89917 -101631 -104367 -247628 319156
19509b48715A80774p5061b31125M1767j28577b9901l20663b6172C74769a13093
$$ -248715 180774 105713 -231125 -189358 -317935 -29901 -350564 -26172 374769 -113093
19498D1878J54836r504f6181H2054a86929A45124a76937j70562A30998K06574
$$ 41878 196714 187210 -66181 82054 -186929 145124 -176937 -347499 130998 337572
19488C37572e6825p8131C999J78376a32607j78310j74875A9543c050q404l46564
$$ 337572 -56825 -134956 3999 182375 -132607 -310917 -485792 19543 -3050 -11454 -358018
19477c58018b1746G6248b12861E4670b8786F9961C708K9184h9253D757c21301
$$ -358018 -21746 76248 -212861 54670 -28786 69961 3708 32892 -89253 4757 -321301
19465C8113O2495a94852A25657a21068B2239O7571e349A01851D3218J45224a4159
$$ 38113 100608 -194852 125657 -121068 22239 89810 -5349 101851 43218 188442 -14159
19453A4385b06701a2975k41233J0526A5028J4048b35733F7961b87335a33048p4866
$$ 14385 -206701 -12975 -254208 -243682 15028 29076 -235733 67961 -287335 -133048 -207914
19442b07914N5767p8184A38811F09a40686b1181o6041Q166o3445j14299P8893
$$ -207914 -152147 -230331 138811 609 -140686 -21181 -87222 -79056 -142501 -256800 -177907
19431a77907B32113E9961b47451O6752j44103e8719B03955e4076k49104B4590
$$ -177907 232113 59961 -247451 -180699 -324802 -58719 203955 -54076 -303180 24590
19420a10900k3261k83425N5418a56029E8287c441l44345O4525B8302a61835B80767
$$ -110900 -134161 -417586 -362168 -156029 58287 -3441 -347786 -283261 28302 -161835 280767
19408b21775e4732k2398A80530i1155C31690a97702e1094A68765q4174K69401
$$ -221775 -54732 -77130 180530 -91155 331690 -197702 -51094 168765 84591 353992
19398C53992h9482a4404r8984L1503a5605k24806R5709C15774b30546E3003c07088
$$ 353992 -89482 -14404 -113388 -81885 -15605 -240411 -144702 315774 -230546 53003 -307088
19386b6687C30563c92018A14776a01380j13340A78662b29611b8101A96645a67119
$$ -26687 330563 -392018 114776 -101380 -214720 178662 -229611 -28101 196645 -167119
19375A5644g626j34811K1848B42261j13865b85477D035a51704D9843a14554A27491
$$ 15644 -7626 -142437 -120589 242261 128396 -285477 4035 -151704 49843 -114554 127491
19363D5699b15588d928E7114c16972g2089j26421A5470K97647a49769p9572C3557
$$ 45699 -215588 -4928 57114 -316972 -72089 -198510 15470 313117 -149769 -229341 33557
19351A43457C737a35302O2544a5662N278q0361j2489r4329f8463G145J09095b70331
$$ 143457 3737 -135302 -72758 -15662 -10384 -90745 -103234 -197563 -68463 7145 116240 -270331
19338a64139K1897A08873a00932B3805c18746F0548a85497A15496a27018Q154
$$ -164139 -142242 108873 -100932 23805 -318746 60548 -185497 115496 -127018 -118864
19328a18864B44798a18218j29085A47064i4951a7916E7104J50457D7360H833e8081
$$ -118864 244798 -118218 -247303 147064 -94951 -17916 57104 207561 47360 8833 -58081
19316b62320h9406A59599B4946e2913j10795O5480c2095r1424K2078A42113g1561
$$ -262320 -89406 159599 24946 -52913 -163708 -98228 -32095 -123519 -101441 142113 -71561
19304a18080B81857b7836l3526F0154a9322a709A10252b11758A9650M270K62892
$$ -118080 281857 -27836 -61362 60154 -19322 -1709 110252 -211758 19650 23920 286812
19293B86812o3010h322l55367a57833q4492k81813G7661J03799c39761G9359J78803
$$ 286812 223802 -8322 -363689 -157833 -242325 -524138 77661 181460 -339761 79359 258162
19282B58162p2626B4405i3676a9141A08994a32273j70700i3308A11328N2670b39376
$$ 258162 185536 24405 -93676 -19141 108994 -132273 -302973 -93308 111328 163998 -239376
19270c341l61824i3500B11230b25899i8800B84552a86842p023G7225a72742M1944
$$ -3341 -365165 -93500 211230 -225899 -98800 284552 -186842 -193865 77225 -172742 -130798
19259a30798B87113j22343i7028F2678A8523J62740P7958E2565a91674A95929
$$ -130798 287113 164770 -97028 62678 18523 181263 259221 52565 -191674 195929
19248b71137D7033A0684e9435j44862l1868N0147e6567A63193C7200d7419E7406
$$ -271137 47033 10684 -59435 -204297 -236165 -186018 -56567 163193 37200 -47419 57406
19236I9735A9455R8526k2988b80302b728j75093C6306K06633c00872P8294m1198
$$ 99735 19455 117981 94993 -280302 -2728 -177821 36306 242939 -300872 -222578 -263776
19225b63776a06234O990L7760A44665O9885a98633c0073j88649E8026g2811E1830
$$ -263776 -106234 -99244 -61484 144665 214550 -198633 -30073 -218722 58026 -72811 51830
19213G2967a41884a4273l47011F9403b17002A2096b08089l05945A62931a32598
$$ 72967 -141884 -14273 -361284 69403 -217002 12096 -208089 -514034 162931 -132598
19202b38279g9340k7023d3511I9966R1797b85699a34377f2207A43889g872k01418
$$ -238279 -79340 -106363 -43511 99966 191763 -285699 -134377 -62207 143889 -7872 -209290
19191b09290R3322o5065k5889B62595j00952F1041b10479A69338E2914b03347
$$ -209290 -115968 -181033 -206922 262595 161643 61041 -210479 169338 52914 -203347
19180i0428D3570a34750k38865a45726l2399P2956I9838M6994A2193J22475a30466
$$ -90428 43570 -134750 -373615 -145726 -178125 -105169 99838 146832 12193 134668 -130466
19168b4151A08108a15531k01344J35628k36048h2271l22002a39304B7518N6270
$$ -24151 108108 -115531 -316875 -181247 -417295 -82271 -404273 -139304 27518 83788
19158H3788a86305B5547a39472C10303a14467j996C7866a15594H3218a20774N1114
$$ 83788 -186305 25547 -139472 310303 -114467 -116463 37866 -115594 83218 -120774 -69660
19147f9660j27386g4495K4215k51469h0246B34144a51774N3751A65770a42828
$$ -69660 -197046 -74495 -50280 -301749 -80246 234144 -151774 -98023 165770 -142828
19136E6474a56816j7909a668m3025F0001b73963A07335d2969A40623B9544N3553
$$ 56474 -156816 -174725 -1668 -44693 60001 -273963 107335 -42969 140623 29544 83097
19125H3097J0915c83564b5021k03575k204e3584l31753g2038A6253e0823j58747
$$ 83097 94012 -383564 -25021 -228596 -230800 -53584 -385337 -72038 16253 -50823 -209570
19114b09570B45661I6348i0895h658j03292p8233h7689A87397h7724D9712c2874
$$ -209570 245661 96348 -90895 -8658 -111950 -190183 -87689 187397 -87724 49712 -32874
19102F4125b46846C407J82552a9538r6940k8651a8758E6358a57941A2723L87850
$$ 64125 -246846 3407 185959 -19538 -116478 -145129 -18758 56358 -157941 12723 400573
19091D00573i2116I9809M3503c60648a06764r5391A53338c180A82025o6801i5465
$$ 400573 -92116 99809 143312 -360648 -106764 -202155 153338 -3180 182025 115224 -95465
19079B9872J74895A1396J3852h2109m65295I8281a7403A6206h2932C2569a59108
$$ 29872 204767 11396 25248 -82109 -547404 98281 -17403 16206 -82932 32569 -159108
19067c39543G2789d3617m5666k77187A06726g6408Q547A8317O1393R6623g9693
$$ -339543 72789 -43617 -89283 -366470 106726 -76408 -67861 18317 79710 176333 -79693
19055b1282A1816k544h7123j30452a0370A09402C3651c11544A55772L3003a00073
$$ -21282 11816 9272 -87123 -217575 -10370 109402 33651 -311544 155772 188775 -100073
19043A17147a00424J5278L9440a6105j30705A33867b0885F1670M3292E1360j7040
$$ 117147 -100424 -85146 -45706 -16105 -146810 133867 -20885 61670 104962 51360 34320
19032C4320a4599G4224f7443A80144h4897L2876B47812J1420a83063B9524J25218
$$ 34320 -14599 74224 -67443 180144 -84897 -52021 247812 259232 -183063 29524 154742
19021A54742a04304I7335a40098L0877o2379B3186a22867A49624d2120G9996M282
$$ 154742 -104304 97335 -140098 -109221 -171600 23186 -122867 149624 -42120 79996 84278
19010H4278b06311h6984A65350f359E8184a03286G2858a40949L0056A79577J6665
$$ 84278 -206311 -86984 165350 -6359 58184 -103286 72858 -140949 -110893 179577 196242
18999A96242o7632c25721D655a3356j52303d519j04842l3729k0907B02719a50799
$$ 196242 128610 -325721 4655 -13356 -165659 -4519 -109361 -143090 -163997 202719 -150799
18987A654f1301k482A28011e172B51717h8449j21223o3156a0529p0910q4262G557
$$ 1654 -61301 -63783 128011 -5172 251717 -88449 -209672 -272828 -10529 -81439 -165701 7557
18974g4080j94752g9885j34055k5057N0345H0043K71619a33280l030m5737N0769
$$ -74080 -268832 -79885 -213940 -238997 -188652 80043 351662 -133280 -136310 -182047 -131278
18963a31278P675d2990B63433I0980A7526K5074c2627D42543f2779q8543c0686
$$ -131278 -123603 -42990 263433 90980 17526 42600 -32627 442543 -62779 -151322 -30686
18951F0243J41491n2279a67844A6099b45058G9516a00535C4529a6937B100J34313
$$ 60243 201734 149455 -167844 16099 -245058 79516 -100535 34529 -16937 2100 136413
18940A36413a47722A11891D5966J0617g9582j93453J2856m2204d1704B6553K9405
$$ 136413 -147722 111891 45966 56583 -79582 -273035 -260179 -302383 -41704 26553 55958
18929E5958f7004J1552c187A02623O2432F8688a69189A64274c62348I715a94952
$$ 55958 -67004 -55452 -3187 102623 165055 68688 -169189 164274 -362348 9715 -194952
18917a96175A21544K0115b0858a042k84001P5772A2443Q1853j5605c5187B16293
$$ -196175 121544 141659 -20858 -1042 -285043 -209271 12443 94296 78691 -35187 216293
18905A63258D297a33823G8898a11246B31532A6480B579a53969e2306B02431E0424
$$ 163258 4297 -133823 78898 -111246 231532 16480 2579 -153969 -52306 202431 50424
18893b03159I1820b08275D4575c19422H4200a99043o2136q497a19563k1817A14925
$$ -203159 91820 -208275 44575 -319422 84200 -199043 -261179 -269676 -119563 -141380 114925
18881A11725b55654k2738D5146e4856H6944b13551C4875a44195C9309h6582K9301
$$ 111725 -255654 -278392 45146 -54856 86944 -213551 34875 -144195 39309 -86582 -57281
18870e7281B53316c2123A19280C7747b54414e6085I7320c98739a59847D2044a5694
$$ -57281 253316 -32123 119280 37747 -254414 -56085 97320 -398739 -159847 42044 -15694
18858D5106b29308M2787I3289k8228R6123a38869a8696A9212a06899j17985g0723
$$ 45106 -229308 -186521 93289 65061 161184 -138869 -18696 19212 -106899 -224884 -70723
18846I935P2692a95756G9099a9684j15070n6147B5595b71583a20350F3963d1773
$$ 9935 82627 -195756 79099 -19684 -134754 -190901 25595 -271583 -120350 63963 -41773
18834d8551A9912P9176M444A1201a11946c7261l37293f9821m4857A69808o3933
$$ -48551 19912 99088 103532 11201 -111946 -37261 -374554 -69821 -114678 169808 105875
18823A05875a27746E2604d7792G545J39613R8052a43935L3364A57922h6041B94969
$$ 105875 -127746 52604 -47792 7545 147158 245210 -143935 -110571 157922 -86041 294969
18811G8970M26472L4170J3707a80787H2692b26833B52412o569b06004C92524A03469
$$ 78970 505442 539612 553319 -180787 82692 -226833 252412 245843 -206004 392524 103469
18799C15705a50408m182B66694c14436J10248a02055j76114a13237k09911e5599
$$ 315705 -150408 -154590 266694 -314436 -204188 -102055 -278169 -113237 -323148 -55599
18788c19297a2337E4121J05096c23537i3929m3259k02301k5410o2714B56472f7390
$$ -319297 -12337 54121 159217 -323537 -93929 -137188 -339489 -364899 -427613 256472 -67390
18776f5023C01708a15185c4372A5163c9097j85355e3848B25733c8262D2918D448
$$ -65023 301708 -115185 -34372 15163 -39097 -224452 -53848 225733 -38262 42918 4448
18764B5824a95193c9124B53576a13703e5661j83879B34230a25432l60207d3514
$$ 25824 -195193 -39124 253576 -113703 -55661 -239540 234230 -125432 -485639 -43514
18753B96988a66572D69003b45516N0998k32241a3337r8610c1043C76220a83334
$$ 296988 -166572 469003 -245516 -194518 -426759 -13337 -111947 -31043 376220 -183334
18742B0139d003C9463J98235c11683J39481F005J35984p991b60840B11375i7163
$$ 20139 -4003 39463 237698 -311683 -172202 6005 141989 133998 -260840 211375 -97163
18730F7577L2433b33238d5603l9336l3523m8687d1114j43427r5655b8393j83951
$$ 67577 100010 -233238 -45603 -84939 -118462 -167149 -41114 -184541 -280196 -28393 -212344
18719b12344P726j29014h8464B5758b77415P3134A9416j390J12079l0036b51971
$$ -212344 -204618 -333632 -88464 25758 -277415 -204281 19416 18026 130105 100069 -251971
18707I806b02819C221a58351m0136J0163A27500a14585k54185J28158c7941l04986
$$ 9806 -202819 3221 -158351 -198487 -188324 127500 -114585 -368770 -240612 -37941 -342927
18696c42927k60496a38787A54242A7827Q1008a2843l18624J17829N4912K6710
$$ -342927 -603423 -138787 154242 17827 98835 -12843 -331467 -213638 -158726 -132016
18686a32016b8839k13759J7959i7388j61974h9896C23855c57387J25509N0237
$$ -132016 -28839 -242598 -224639 -97388 -259362 -89896 323855 -357387 -231878 -181641
18676a81641B42882g2521n5320O0146L1486q7473B31349d7698j41066J1846b7398
$$ -181641 242882 -72521 -127841 -67695 -36209 -123682 231349 -47698 -188764 -176918 -27398
18664F5636g6187C10809e9299r1460H1857b90045K5795K9244j9681J14711M4284
$$ 65636 -76187 310809 -59299 -150759 81857 -290045 -264250 -235006 -254687 -139976 -95692
18653i5692C4723g7564j68551O3248G97J1762i0198j38642Q5662M3825H089K22588
$$ -95692 34723 -77564 -246115 -182867 797 12559 -90198 -228840 -143178 -99353 8089 230677
18641B30677i4348H3278g211C7323J33270q377i9661C02473A1067i5718G5721
$$ 230677 -94348 83278 -7211 37323 170593 162216 -99661 302473 11067 -95718 75721
18629A5355R9594R0427a54660B40577c4596F2388j3683J62445b56534a23337k61157
$$ 15355 114949 205376 -154660 240577 -34596 62388 48705 211150 -256534 -123337 -384494
18618c84494b5227m2055k06915Q3297A04269a34858k4785A63918K30864b3557
$$ -384494 -25227 -67282 -274197 -190900 104269 -134858 -159643 163918 394782 -23557
18607A67234a49702g4754B65206a6211m55470J85817A05967b90576I55b8164B76834
$$ 167234 -149702 -74754 265206 -16211 -471681 -285864 105967 -290576 955 -28164 276834
18595a09378m4936E1639e6362B04171a65122D1767b64871A88687h5167A56805
$$ -109378 -154314 51639 -56362 204171 -165122 41767 -264871 188687 -85167 156805
18584A38813e0316C35439a3272k85226g5780o5955D5981J92755f6858k56037A26373
$$ 138813 -50316 335439 -13272 -298498 -75780 -141735 45981 238736 -66858 -322895 126373
18572e785l10621A6200d8418j35364m2334B18139G6958b43004N7686c289j89088
$$ -5785 -316406 16200 -48418 -183782 -226116 218139 76958 -243004 -185318 -3289 -192377
18561a92377I1631a03565A83574d7719j8080j11177g5167F3535b14549R9203l5623
$$ -192377 91631 -103565 183574 -47719 -65799 -176976 -75167 63535 -214549 -115346 -150969
18550a50969B14960a02250A94968O7100d09506J53895a6343I6480a56748D5450
$$ -150969 214960 -102250 194968 262068 -409506 -255611 -16343 96480 -156748 45450
18539a18104j22826L9670P2909o8162c1206o5605L7408B37809B0153c9931j57761
$$ -118104 -240930 -201260 -128351 -196513 -31206 -96811 -59403 237809 20153 -39931 -197692
18528a97692P1169D5519b99711B518b81875A2714L3500a07072A64101L5077L3293
$$ -197692 -126523 45519 -299711 2518 -281875 12714 46214 -107072 164101 199178 232471
18517B32471a39803A12660a1674j61824R330A36514n4224J82813C851J20712a59189
$$ 232471 -139803 112660 -11674 -173498 -164168 136514 82290 265103 3851 124563 -159189
18505A24080k0991b1319k31660N2356L0479j18663h8061j51480B68774r4833A8379
$$ 124080 103089 -21319 -252979 -200623 -170144 -288807 -88061 -239541 268774 173941 18379
18493G9895Q4669E1333O3970a31646K6052j06281C70485b30648A77682D8062k2009
$$ 79895 164564 51333 115303 -131646 -105594 -211875 370485 -230648 177682 48062 26053
18482B6053a01930B16391d2392B79623a80048D21546b08371B04402o8188a11699
$$ 26053 -101930 216391 -42392 279623 -180048 421546 -208371 204402 136214 -111699
18471A00024D876b35504Q3216o3169A02048c955C27361a11685G5070a97303P5879
$$ 100024 4876 -235504 -152288 -215457 102048 -3955 327361 -111685 75070 -197303 -121424
18460a21424l870D6698a38964k43184a42719A32853c52515b993q8597A77756k0586
$$ -121424 -125294 46698 -138964 -382148 -142719 132853 -352515 -2993 -91590 177756 157170
18449A57170k7042a134A99308G2950b17621O7249A2588J39326b0762A38444a57120
$$ 157170 130128 -1134 199308 72950 -217621 -150372 12588 151914 -20762 138444 -157120
18437a95389k70143i2010j6315E7231P6789L6013a01560k96774J93135A82647
$$ -195389 -465532 -92010 -108325 57231 134020 170033 -101560 -398334 -205199 182647
18426g4577A41884l4050a5038k92009g3678C9210a75878B9780J1173b73734a32717
$$ -74577 141884 107834 -15038 -307047 -73678 39210 -175878 29780 40953 -273734 -132717
18414B89629b4670B19072e20j88782Q7371k10104g042A36938h895B3938b94294
$$ 289629 -24670 219072 -520 -189302 -101931 -312035 -7042 136938 -8895 23938 -294294
18402a66637B09707i4049l1681A97850D9921o245J519a36985D1866a22425k55011
$$ -166637 209707 -94049 -125730 197850 49921 43676 45195 -136985 41866 -122425 -377436
18391c77436A59909h0815l4034a5864I523d1418a7356B08371C4427f3193J4953
$$ -377436 159909 -80815 -114849 -15864 9523 -41418 -17356 208371 34427 -63193 -48240
18380d8240o6306d4083B7252J46297H198J45882J09128A20465N7428a66190C0073
$$ -48240 -114546 -44083 27252 173549 8198 154080 263208 120465 177893 -166190 30073
18368E4674b64397J11097B33685C7886c60613J35839D00303A61741a40549a2322
$$ 54674 -264397 -153300 233685 37886 -360613 -224774 400303 161741 -140549 -12322
18357a74402N0485A62695a76577l660M2962m7392J2690O5131I9805k9380i1601
$$ -174402 -123917 162695 -176577 -180237 -137275 -184667 -171977 -106846 99805 70425 -91601
18345A63077J42666a46608A41665a00802m0179n2849A25723b14830o7552b6368
$$ 163077 305743 -146608 141665 -100802 -140981 -193830 125723 -214830 -282382 -26368
18334b55135b7506B6320a40328j962c3968C093b69818E1523a56641A70869o7808
$$ -255135 -27506 26320 -140328 -142290 -33968 3093 -269818 51523 -156641 170869 103061
18323A03061a61398D0255K78040F2813a58552C8693N9932d49953B0856g487j13259
$$ 103061 -161398 40255 318295 62813 -158552 38693 98625 -449953 20856 -7487 -120746
18312a20746M6072m20792A85249d7360j06196M465q4369H3376b0550B15794a6240
$$ -120746 -74674 -495466 185249 -47360 -153556 -149091 -233460 83376 -20550 215794 -16240
18300a9844k517j745B24855d4911n0071j81351f5329j37365i4820J7840G4843
$$ -19844 -22361 -24106 224855 -44911 -94982 -276333 -65329 -202694 -94820 -76980 74843
18288B11782b52568a22327C9742J0657a80356A07015L8744k8487J920j0863e7127
$$ 211782 -252568 -122327 39742 50399 -180356 107015 145759 117272 119192 108329 -57127
18276B3884e7564R177k5386l7613B5849a22238j61366C4887J94168d8579A86063
$$ 23884 -57564 -48387 -73773 -111386 25849 -122238 -283604 34887 229055 -48579 186063
18264a31468j32489A97198b87399M392b0701g300D3965M2075e144G3434a03097
$$ -131468 -263957 197198 -287399 -283007 -20701 -7300 43965 86040 -5144 73434 -103097
18252A7102a32679k13041C1296J1304a89451J6642j33135A40121A0201b94476
$$ 17102 -132679 -345720 31296 42600 -189451 -172809 -305944 140121 10201 -294476
18241A39366g7240B8270K35426R2164E3164M6243J05759a2845F5224a10860B5254
$$ 139366 -77240 28270 263696 355860 53164 99407 205166 -12845 65224 -110860 25254
18229b68830l9731h1398j34753N9243C7168J44813a23129I5127H978a08937k5184
$$ -268830 -308561 -81398 -216151 -156908 37168 181981 -123129 95127 8978 -108937 -134121
18218a34121D6310J8873a57565G0285J6298i2300l90069I4828L557J39474a06887
$$ -134121 46310 65183 -157565 70285 86583 -92300 -482369 94828 98385 237859 -106887
18206F7241K2614i983A29577m5500R0006K08080b4778k76960B06902a31460N3302
$$ 67241 89855 -9983 129577 84077 174083 382163 -24778 -301738 206902 -131460 -78158
18195g8158G7619l2178b95498J2626a21549A38870d9244n0014o2221p3795B3140
$$ -78158 77619 45441 -295498 -282872 -121549 138870 -49244 -99258 -161479 -235274 23140
18183g8246K0340j32050d3261D74630b92294J43938k41936h8523L1207A21897
$$ -78246 -57906 -189956 -43261 474630 -292294 -148356 -390292 -88523 -57316 121897
18172b54974a00178e166A21288O2293a26594A57501a24724k31814B87049b97749
$$ -254974 -100178 -5166 121288 183581 -126594 157501 -124724 -356538 287049 -297749
18161c23328b114C2678J2444a91157A40463R5630D8891f6448k5898D279f5577
$$ -323328 -2114 32678 45122 -191157 140463 236093 48891 -66448 -92346 4279 -65577
18149a00438B45443b03122R8671n7761K3703o4094A07098O732A8379c27770A07336
$$ -100438 245443 -203122 -104451 -162212 -138509 -202603 107098 113830 18379 -327770 107336
18137a4640B34793a3896F1556N1722b08110g3469l2643B53125c89920A66325b7598
$$ -14640 234793 -13896 61556 113278 -208110 -73469 -106112 253125 -389920 166325 -27598
18125C8831c45836c612n0416j95637J3082n9247A50833N7317A6021a22272A43708
$$ 38831 -345836 -3612 -54028 -249665 -236583 -295830 150833 208150 16021 -122272 143708
18113d32926C04012n5827D4068h5487A17491l9193k2857j7556K65138i994j12042
$$ -432926 304012 248185 44068 -85487 117491 78298 55441 37885 303023 -9994 -122036
18102a22036k09967B47891C1680J62807b84067A33080a35773m1896B744b93963
$$ -122036 -332003 247891 31680 194487 -284067 133080 -135773 -177669 2744 -293963
18091c9281A90011o2174a55603B94223H604J72047Q3201a32335m211e0635m0690
$$ -39281 190011 127837 -155603 294223 8604 180651 263852 -132335 -136546 -50635 -91325
18080i1325j52565M0946G1903a83338n9947f4461j50823D76895a74285A29709
$$ -91325 -243890 -202944 71903 -183338 -243285 -64461 -215284 476895 -174285 129709
18069c2173j25126A07871D345J67003a8919q4757j06458j13939d5823A35304J57478
$$ -32173 -157299 107871 4345 171348 -18919 -103676 -210134 -324073 -45823 135304 292782
18058B92782b36890A76987E4887J48849b46597M8927D6255K36851a29656I073
$$ 292782 -236890 176987 54887 203736 -246597 -197670 46255 283106 -129656 9073
18047a15942G6850G579M2016b14635N4878A83361d2223A37646D3504a31223A3448
$$ -115942 76850 7579 49595 -214635 -159757 183361 -42223 137646 43504 -131223 13448
18035A30669h6321G4227b05883F1076b00946j11255Q5866C21595E4502J02075
$$ 130669 -86321 74227 -205883 61076 -200946 -312201 -226335 321595 54502 156577
18025A56577k5699d9401F4191J28715C2211a71714j13646a5401G4670a13420B23801
$$ 156577 130878 -49401 64191 192906 32211 -171714 -285360 -15401 74670 -113420 223801
18013D23018j37616b1391j48621n5398R7875f928A61984g0310K6017D7196d216
$$ 423018 285402 -21391 -170012 -225410 -127535 -6928 161984 -70310 -44293 47196 -4216
18001a67096M7364B3873A705N6407J74306d8288A75725i3168B10762L3758e8970
$$ -167096 -119732 23873 1705 58112 232418 -48288 175725 -93168 210762 244520 -58970
17989A5563g6207C23539b35415l14509e9724a6448k90c145A8501e8250A3103J57222
$$ 15563 -76207 323539 -235415 -549924 -59724 -16448 -16738 -3145 18501 -58250 13103 170325
17977A70325k0931D0510a19687q6643l8158b3517G2509J25418c49796b5571m2414
$$ 170325 149394 40510 -119687 -206330 -244488 -23517 72509 197927 -349796 -25571 -67985
17966f7985A41177J0486a85204A5299J17890a50040n536q4830k4775B62420d56879
$$ -67985 141177 151663 -185204 15299 133189 -150040 -155576 -240406 -265181 262420 -456879
17954B61466d1630r3752A11796A3779P9579J24625c3155B2975J90310k735m5241
$$ 261466 -41630 -135382 111796 13779 93358 217983 -33155 22975 213285 210550 165309
17943A65309q2037a8807p3744G2827a52402O5415O364B09320I1546J2631g5748
$$ 165309 83272 -18807 -92551 72827 -152402 -86987 -80623 209320 91546 104177 -75748
17931B7661b99533A00205a9380j74958p2864g8490E4892J14014b1502h366l41554
$$ 27661 -299533 100205 -19380 -194338 -267202 -78490 54892 168906 -21502 -8366 -349920
17920c49920J27104K5590j36340F9301a57399L5925d4356A87666d3037l0298k55939
$$ -349920 -222816 -197226 -333566 69301 -157399 -121474 -44356 187666 -43037 -73335 -329274
17909c29274B67231q4038b61766B2766K4870b5848m4178B13172g8486k08175b7193
$$ -329274 267231 183193 -261766 22766 47636 -25848 -70026 213172 -78486 -286661 -27193
17897f7015N272C28684a34627b2687p6209C35586d4058k6567B264J51509a32838
$$ -67015 -61743 328684 -134627 -22687 -98896 335586 -44058 -70625 2264 153773 -132838
17885h769F2827a33506L2863G3332N7330a29470H9978a4177j06612j01057e8720
$$ -8769 62827 -133506 -100643 73332 130662 -129470 89978 -14177 -120789 -221846 -58720
17873B46988c8499D2847K1523M8171b48204G5282f5198k35465H7762k1402g8483
$$ 246988 -38499 42847 64370 112541 -248204 75282 -65198 -300663 87762 66360 -78483
17861I5694a2129A13848a90411C08964c9227D40859A2584a66946g5087j66032
$$ 95694 -12129 113848 -190411 308964 -39227 440859 12584 -166946 -75087 -241119
17851b41119A5882K0356L3119c4805B00935e3878j96256c8403C08712A03692D6926
$$ -241119 15882 36238 69357 -34805 200935 -53878 -250134 -38403 308712 103692 46926
17839a52704Q12B07977A9007J11763B2688g8032A23983D7162P5141a00503j08532
$$ -152704 -151892 207977 19007 130770 22688 -78032 123983 47162 122303 -100503 -209035
17828b09035C1129d5840J2849C33185c46j17162e845A12733J24995g0684p1436
$$ -209035 31129 -45840 -32991 333185 -346 -117508 -5845 112733 237728 -70684 -142120
17817a42120m2786A80420B1276J13847a38628C02283b52983P8825f1578A38145
$$ -142120 -184906 180420 21276 135123 -138628 302283 -252983 -174158 -61578 138145
17806a13937F2342b68913f6436B03457B7098a54672A63987e7666A09514n4326
$$ -113937 62342 -268913 -66436 203457 27098 -154672 163987 -57666 109514 55188
17796E5188k4139P3320O2617a14510B43043a29705G2871e3638D2297J92557A05105
$$ 55188 31049 104369 166986 -114510 243043 -129705 72871 -53638 42297 234854 105105
17784B15388h2824a6917m1867C14984b45403N3092A73442a62441C8005b21470
$$ 215388 -82824 -16917 -58784 314984 -245403 -192311 173442 -162441 38005 -221470
17773G5752r937C353b4500A28337g1415j01142q895f1190B6388g8863n2785G8245
$$ 75752 65815 3353 -24500 128337 -71415 -172557 -181452 -61190 26388 -78863 -131648 78245
17760a48618E2421o610K70150d6331j00934B60520b07177b9835G6103a52700A92113
$$ -148618 52421 45811 315961 -46331 -147265 260520 -207177 -29835 76103 -152700 192113
17748a8372A07337J24942a5446C546J79927g293m2068B30672K07174j76314k0093
$$ -18372 107337 232279 -15446 3546 183473 -7293 -49361 230672 437846 261532 241439
17737B41439M3954l0325h8909A54342i3210A1743e6816A42999J23038o2796r7658
$$ 241439 285393 255068 -88909 154342 -93210 11743 -56816 142999 266037 203241 105583
17726A05583C3921K2134M0221e2497A01818N5402l6220e8146F3305a26449l6800
$$ 105583 33921 56055 96276 -52497 101818 157220 121000 -58146 63305 -126449 -163249
17715a63249A04685M687n3820L6376c51752i3835C06714B6025c97794e3485G0262
$$ -163249 104685 109372 55552 91928 -351752 -93835 306714 26025 -397794 -53485 70262
17703C98247A84714a16595l5686G271a23579A51967L0523a94626c6997A4498d46862
$$ 398247 184714 -116595 -152281 7271 -123579 151967 182490 -194626 -36997 14498 -446862
17691B0462a73617D8766N0706b74706F9927J22472B5365b9535A61735d1180J6453
$$ 20462 -173617 48766 99472 -274706 69927 192399 25365 -29535 161735 -41180 -24727
17680b4727A0144K81518a28070b7285H4677B5317K12096c81354A95033J15381
$$ -24727 10144 291662 -128070 -27285 84677 25317 237413 -381354 195033 310414
17670C10414k7059I8709P896i2336H9535B4164M4021a89700B0848a04217m1317
$$ 310414 283355 98709 106605 -92336 89535 24164 68185 -189700 20848 -104217 -145534
17659a45534B62298H6539m2539a93457r2635g8525A0675J76100b3434h353n5243
$$ -145534 262298 86539 44000 -193457 -286092 -78525 10675 186775 -23434 -8353 -63596
17648f3596A20295a40835C6895e9175B81057l6025a75646C67142j50414r1089
$$ -63596 120295 -140835 36895 -59175 281057 245032 -175646 367142 216728 125639
17638A25639K02361b91733a5605n2666n9166B78382d9680E3491J79226p1060J22091
$$ 125639 328000 -291733 -15605 -68271 -127437 278382 -49680 53491 232717 161657 283748
17627B83748f1085p5500A16001c8178N188r4079C5991a68783G9890a03310A50580
$$ 283748 -61085 -136585 116001 -38178 -32990 -127069 35991 -168783 79890 -103310 150580
17615H569g585C08628f0174A6327a82690C7001J71983b50374I6321k1254h9833
$$ 8569 -7585 308628 -60174 16327 -182690 37001 208984 -250374 96321 75067 -89833
17603d084D06152a27671I2979J29842K9040B7852K34791j21559b22880h7079D22771
$$ -4084 406152 -127671 92979 222821 251861 27852 262643 141084 -222880 -87079 422771
17591B54128c0229B78711I7317b62620B77645n8684I952D047L08346k9995a10802
$$ 254128 -30229 278711 97317 -262620 277645 218961 9952 4047 312393 282398 -110802
17579a04440A32978l801f8831K3234m8426I1985K53347h2101H8528L1587j5254
$$ -104440 132978 129177 -68831 -45597 -94023 91985 345332 -82101 88528 120115 104861
17568A04861D3890a32312B23233f6721B47456l6359q4526L9351d9424I0642J97899
$$ 104861 43890 -132312 223233 -66721 247456 211097 126571 165922 -49424 90642 288541
17557B88541q9639a07010A27914J76687k7414c03629G993K49265a28574e7545
$$ 288541 198902 -107010 127914 304601 277187 -303629 7993 257258 -128574 -57545
17546B323R6598b43827B03750b8390H1896R7315F5638B4214L31158j49789J11662
$$ 2323 98921 -243827 203750 -28390 81896 179211 65638 24214 355372 205583 317245
17535C17245j44331F5211A7957J24829a04994M2997B06196F4608c4028B39712
$$ 317245 172914 65211 17957 142786 -104994 -61997 206196 64608 -34028 239712
17524A65550L6895i1218E9938J02627c92974H7961l6797J30902P4716H0707K59341
$$ 165550 202445 -91218 59938 162565 -392974 87961 51164 182066 256782 80707 340048
17513C40048c98411A58903Q5679l793J65835f2748F5592b24411h0072m5073k69361
$$ 340048 -398411 158903 244582 240789 406624 -62748 65592 -224411 -80072 -125145 -394506
17502c94506C36902g8676o4125F9391j4149L53211j17419f7998A88633a2123C7317
$$ -394506 336902 -78676 -142801 69391 55242 408453 291034 -67998 188633 -12123 37317
17490C13074A35397J84849h7291l1819A2361L69447A85439m5414A6284J03650
$$ 313074 135397 320246 -87291 -119110 12361 381808 185439 140025 16284 119934
17480A19934i6543C52454A4632R7133K21837M4979D0211K3319c29855C90627c6255
$$ 119934 -96543 352454 14632 111765 333602 378581 40211 63530 -329855 390627 -36255
17468A18257O9781m9354J06598H9149r728J88897C1276a90861B36845Oh208A42176
$$ 118257 188038 138684 245282 89149 79421 268318 31276 -190861 236845 236851 -8208 142176
17455I8736a40559E4869K51400n6163J60362j60327J18925J67811j08464E9774
$$ 98736 -140559 54869 306269 250106 410468 250141 369066 536877 428413 59774
17444E52675j93870p6627A06233I686J22648J14402L8702J0355J34100A44519
$$ 552675 358805 282178 106233 9686 132334 246736 285438 295793 429893 144519
17433B85120A13950R5975n459c7737A30251D5156a60297C23603j21560J8542N2042
$$ 285120 113950 209925 204466 -37737 130251 45156 -160297 323603 202043 220585 272627
17422B72627P8366q6558B1665N75822B8328L76358M0782r6800j45327p572a43758
$$ 272627 350993 264435 21665 597487 28328 404686 445468 348668 203341 195769 -143758
17410D09819j41308B1606J2922M0718K61310k7984i2194A74807h3512D0649O4816
$$ 409819 268511 21606 34528 75246 336556 308572 -92194 174807 -83512 40649 105465
17399A05465c2370I2532K35741q3409J14548g7770A58622A1924O6503l1663R3927
$$ 105465 -32370 92532 328273 244864 359412 -77770 158622 11924 78427 46764 140691
17388A40691F9312a19863A50685O4692C1887J20164a68568Q0425E2920a65149
$$ 140691 69312 -119863 150685 215377 31887 152051 -168568 -88143 52920 -165149
17377A49369f3707B26706i1169E9350K17774r9895N3709F1989P1589l1849L2908
$$ 149369 -63707 226706 -91169 59350 277124 177229 230938 61989 133578 101729 134637
17366A34637K40844n9988b8083j97710D04774r1330o9987b25070c0003C9024J8509
$$ 134637 375481 315493 -28083 -225793 404774 313444 243457 -225070 -30003 39024 57533
17355E7533b10698C33094n1845a87187B94558k6743f732B25014r0822L4667C0575
$$ 57533 -210698 333094 281249 -187187 294558 267815 -6732 225014 134192 168859 30575
17343B50055p1597h6918A78328a8559r9624c4601A95472i6924F7571R1862J34398
$$ 250055 178458 -86918 178328 -18559 -118183 -34601 195472 -96924 67571 159433 293831
17332B93831k2823m9549D1279J82098B9978L49994n2034A03391J44260n8209J48720
$$ 293831 271008 221459 41279 223377 29978 379972 327938 103391 247651 189442 338162
17321C38162e4202E50952d3034H5172K53706K8576e8364A89871J97847k7719n8612
$$ 338162 -54202 550952 -43034 85172 338878 367454 -58364 189871 387718 359999 301387
17310C01387f5529F4957A7139J83845D9330c6286j07119D6688A635b62918A43343
$$ 301387 -65529 64957 17139 200984 49330 -36286 -143405 46688 1635 -262918 143343
17298b6592D04888j44994H2711b48555A23653J8115J43489k8997a0936A03846
$$ -26592 404888 259894 82711 -248555 123653 141768 285257 256260 -10936 103846
17287a768C83348A67437m5079C3184R9409K745N8049O0392d5680C52431A50908
$$ -1768 383348 167437 122358 33184 132593 135338 193387 253779 -45680 352431 150908
17275D66083J23482j84054j72893G6589a05169B1790L55468a95C37844A62570
$$ 466083 589565 405511 232618 76589 -105169 21790 377258 -195 337844 162570
17264I8922l8018K08876k299j10672R4437J64478d0697B89503q6900R708I0355
$$ 98922 60904 269780 267481 156809 251246 415724 -40697 289503 202603 212311 90355
17252C04200c6096B44037G5279J90490A22736L39465B25566K9877i2586B93304
$$ 304200 -36096 244037 75279 265769 122736 462201 225566 255443 -92586 293304
17241A98460a2668C03216h4453A28070J19776J89980L1787k28170r8251J50515
$$ 198460 -12668 303216 -84453 128070 247846 437826 469613 241443 143192 293707
17231B93707J7382n916j24574K42956j75346m2960p4848q968O8812e2078D44456
$$ 293707 311089 305173 180599 423555 248209 205249 130401 121433 190245 -52078 444456
17219B15368E7939K59919J5303O978A38452M93263k05756J6423A74909N4690j5533
$$ 215368 57939 317858 333161 340139 138452 631715 425959 442382 174909 229599 214066
17208B14066q3628J05225Q1279J7297J0605K86520b6495B2715J98996C2986P3142
$$ 214066 130438 235663 316942 334239 344844 631364 -26495 22715 221711 32986 106128
17197A06128K03348n7614j24306J67525l4128M1923A17935K59753O2512A23022
$$ 106128 309476 251862 127556 295081 260953 302876 117935 377688 440200 123022
17186H9189L5818K32606M7515A18024M37898A04368K65999j57399r3181C0714
$$ 89189 125007 357613 405128 118024 555922 104368 370367 212968 119787 30714
17175a84154F17067j85732b9859C81048L4291n0276r4915J51313B07810M47248
$$ -184154 617067 431335 -29859 381048 415339 365063 270148 421461 207810 655058
17165F55058e5271F47632k86858J0806O51J33232j53768E4718J91961L58477A12125
$$ 655058 -55271 647632 360774 371580 372231 505463 351695 54718 246679 605156 112125
17153c7630D25481j81882N06781H1610L67740m9885j94152K16244J5575A5573
$$ -37630 425481 243599 750380 81610 449350 399465 205313 421557 437132 15573
17142B80419J47176A81128K61886j39541J27358Q6063j69949P5004J22559j00462
$$ 280419 427595 181128 443014 303473 430831 516894 346945 421949 544508 444046
17132D44046R4245A94065j0385K2544L26915B35395K70424j65776j54930J46631
$$ 444046 538291 194065 183680 206224 533139 235395 505819 340043 185113 331744
17122C31744N3501m0018j19988N94288I9082M75683A78097k2904J63557j48142
$$ 331744 385245 345227 225239 819527 99082 574765 178097 155193 318750 170608
17112A70608L26176j41180J11141Q102j9445J84384B09304K81750J20155j19010
$$ 170608 496784 355604 466745 474847 455402 639786 209304 491054 611209 492199
17102D92199A54132K7505L31858E3563N19632o8284j25839Q8707K2641A41374
$$ 492199 154132 181637 513495 53563 573195 504911 379072 467779 490420 141374
17091C55728M434R971K08616l1415p1876j66884J56015A29368O44273A69328L26989
$$ 355728 360162 370133 578749 547334 475458 308574 464589 129368 773641 169328 496317
17080D96317J28026k04430C8853N62380l6347j20088J5901p9574J4768j62573
$$ 496317 624343 419913 38853 601233 564886 444798 460699 381125 395893 233320
17070B33320K17149j40608A38727L82426A39784L56210K7627k20289K97078K8332
$$ 233320 450469 309861 138727 521153 139784 495994 523621 303332 600410 628742
17060F28742j54887L09722Q9292l18356j92236A44384L78738J24329k39377J88947
$$ 628742 473855 783577 872869 554513 362277 144384 523122 647451 408074 597021
17050E97021j78070M950J98378L4874k44363L4110J53572k61296N7108K64180
$$ 597021 418951 423901 622279 657153 412790 446900 600472 339176 396284 660464
17040F60464j49578L2155M69487D86813M8114K96330D14712M68329k19667j24423
$$ 660464 510886 543041 1012528 486813 534927 831257 414712 883041 663374 538951
17030E38951J08531K09010l19101B52076K68170L74582m05012O53820l68318p3472
$$ 538951 647482 856492 537391 252076 520246 894828 489816 1143636 775318 701846
17020G01846j97607L97002l71695L83450J2502k63588J33832O6869l82828J81265
$$ 701846 504239 901241 529546 912996 925498 661910 795742 862611 479783 661048
17010F61048j61976L72812j8889k59661M08407k27078O4220l66869M19075j47396
$$ 661048 499072 871884 852995 593334 1001741 774663 838883 472014 891089 743693
17000G43693K19030m13423N13916l05976K03171K2236k57117K67846j73244J03526
$$ 743693 962723 549300 1063216 757240 960411 982647 725530 993376 820132 923658
16990I23658j75268Q9510L01676m78667L07595p6237k96462L25694K6394K01225
$$ 923658 748390 837900 1139576 660909 968504 892267 595805 921499 947893 1149118
16980A149118o9731j50084p2181J3438O6032O8335j34375K05222N6829j33964
$$ 1149118 1079387 929303 857122 870560 936592 1004927 870552 1075774 1132603 998639
16970I98639K10723j22466j73359K00346j21782P8195k39678J39047J74838L5045
$$ 998639 1209362 1086896 913537 1113883 992101 1070296 830618 969665 1144503 1179548
16960A179548P7567k36944j57332L27230k14644J10514k05322J00534j32189K08094
$$ 1179548 1257115 1020171 862839 1190069 975425 1085939 880617 981151 848962 1057056
16950A057056K33277l01657L19965k18541N6837K5120R145L9990k5043n1021M669
$$ 1057056 1290333 988676 1308641 1090100 1146937 1172057 1181202 1221192 1196149 1145128 1149797
16939A149797M7117j68443L37128j39497L7943L82192o62243L16827J13494M83523
$$ 1149797 1196914 1028471 1365599 1226102 1264045 1646237 983994 1300821 1414315 1897838
16929A897838n93121k13577K40010l1495K23514j09885j25417M2453k21156J70804
$$ 1897838 1304717 1091140 1331150 1299655 1523169 1413284 1287867 1330320 1109164 1279968
16919A279968J27936K18461l69796N62114j95288l18793J00529K34568L31259
$$ 1279968 1407904 1626365 1256569 1818683 1623395 1304602 1405131 1639699 1970958
16910A970958k14902j01588N8109N2105J43746J5437o7621j04890K6570J9588
$$ 1970958 1756056 1654468 1712577 1764682 1908428 1923865 1856244 1751354 1777924 1797512
16900A797512J42038M7481j16942J86593j26016j07924M24678l39419k22817j91058
$$ 1797512 1939550 1987031 1870089 2056682 1930666 1822742 2247420 1908001 1685184 1494126
16890A494126M94342j52475L37717J60457k78054L06453j58501J48286N30429
$$ 1494126 1988468 1835993 2173710 2334167 2056113 2362566 2204065 2352351 2882780
16881B882780n02063k12401J41680j11387K55116K49029k22596j30737K75412
$$ 2882780 2380717 2168316 2309996 2198609 2453725 2702754 2480158 2349421 2624833
16872B624833o7464K25429k00983K20077r6550L36671l78191L77109J13729m52589
$$ 2624833 2557369 2782798 2581815 2801892 2705342 3042013 2663822 3040931 3154660 2702071
16862B702071L41753p2400j8443J60866K44287l21142K86483j96601M37886j68376
$$ 2702071 3043824 2971424 2952981 3113847 3358134 3036992 3323475 3126874 3564760 3396384
16852C396384k12504N555K36395p1917n5561Q7783J15058K68774k21716L56913
$$ 3396384 3183880 3189435 3425830 3353913 3298352 3386135 3501193 3769967 3548251 3905164
16842C905164J07595j11583n9075L97554l52255N34544j72242p8512L13124L43648
$$ 3905164 4012759 3901176 3842101 4239655 3887400 4421944 4249702 4171190 4484314 4827962
16832D827962q1167j67592K00855J05453j4829K8447p9267L39477M33655j62809
$$ 4827962 4746795 4579203 4780058 4885511 4870682 4899129 4819862 5159339 5592994 5430185
16822E430185m07464P53826J04752j42882P8766P8903R4864O16087j22882J03092
$$ 5430185 5022721 5776547 5881299 5738417 5817183 5896086 5990950 6607037 6484155 6587247
16812F587247j56663L35159L64318q7964L44394K94138K94335K2064m63408J073663
$$ 6587247 6430584 6765743 7130061 7042097 7386491 7680629 7974964 7997028 7533620 8607283
16802H607283n4764j60873M00801L89492J02914M84025Q4374R6889L33448M05728
$$ 8607283 8552519 8391646 8792447 9181939 9284853 9768878 9853252 9950141 10283589 10689317
16792A0689317L48605j64198J88994P86605q7065N49088j20269L80625L74727
$$ 10689317 11037922 10873724 11062718 11849323 11762258 12311346 12191077 12571702 12946429
16783A2946429N58121L33527O71832Q8349N09444Q21385k3892O28454P64691N82063
$$ 12946429 13504550 13838077 14509909 14598258 15107702 15929087 15905195 16533649 17298340 17880403
16773A7880403K56555P07969J021286L54863R62909M98159R28068P76532J040606
$$ 17880403 18136958 18844927 19866213 20221076 21183985 21682144 22610212 23386744 24427350
16764B4427350J066001J035837J156161Q61203O80397J699732J074175J747092
$$ 24427350 25493351 26529188 27685349 28546552 29226949 30926681 32000856 33747948
16756C3747948J578525J346897J886218J892276J792695J928188K186103K285408
$$ 33747948 35326473 36673370 38559588 40451864 42244559 44172747 46358850 48644258
16748D8644258K818574K545779K796327L112455L210564L486912L940564L786433
$$ 48644258 51462832 54008611 56804938 59917393 63127957 66614869 70555433 74341866
16740G4341866M566044M751965N061802M881952N840747N821647O194289O660145
$$ 74341866 78907910 83659875 88721677 93603629 99444376 105266023 111460312 118120457
16732A18120457O834344O767825P665386P323945P377125P311873P265930O426462
$$ 118120457 124954801 131722626 139388012 146711957 154089082 161400955 168666885 175093347
16724A75093347O409439N098535M075293L587297K484131Q94220o58786j902604
$$ 175093347 181502786 186601321 190676614 194263911 196748042 197642262 196983476 195080872
16716A95080872k723896l936981n148112n614066o824930o726445p571858p376823
$$ 195080872 192356976 188419995 183271883 177657817 170832887 164106442 156534584 149157761
16708A49157761p559054p832185p118875o998729o778796o539003n967789n675785
$$ 149157761 141598707 133766522 126647647 119648918 112870122 106331119 100363330 94687545
16700I4687545n993194m990930m784663m590116l917196m311506l517707k963205
$$ 94687545 88694351 83703421 78918758 74328642 70411446 66099940 62582233 59619028
16692E9619028l491769k752901k839644k729125k114291k456593k170592k021106
$$ 59619028 56127259 53374358 50534714 47805589 45691298 43234705 41064113 39043007
16684C9043007j679145j815685j178841j758678j302210j597770j439124q00331
$$ 39043007 37363862 35548177 34369336 32610658 31308448 29710678 28271554 27471223
16676B7471223j255746j098151j100821r38032n60360j155090n95452r69135p90025
$$ 27471223 26215477 25117326 24016505 23078473 22518113 21363023 20767571 19798436 19008411
16667A9008411l63444r63351k31996q03263o93970l50044l84696p55902k79564
$$ 19008411 18644967 17681616 17449620 16646357 15952387 15602343 15217647 14461745 14182181
16658A4182181n04799l30868q78858n7216l93721n56092k87578j19941k31344
$$ 14182181 13677382 13346514 12467656 12410440 12016719 11460627 11173049 11053108 10821764
16649A0821764m93899k82337L55930p71765m28853k37838r455k20943o03699j53645
$$ 10821764 10327865 10045528 10401458 9629693 9200840 8963002 8953547 8732604 8128905 7975260
16639G975260j56117j89470L09036o19719l45640P9300n24554o5730L23295m29879
$$ 7975260 7819143 7629673 7938709 7318990 6973350 7052650 6528096 6462366 6785661 6355782
16629F355782J14997m58986n2838K0085J22571l74735j98512j90210m0653j37918
$$ 6355782 6470779 6011793 5958955 5979040 6101611 5726876 5528364 5338154 5297501 5159583
16619E159583l2196l15690J19728M0013k92396J98824q64155P2066P9109L13652
$$ 5159583 5127387 4811697 4931425 4971438 4679042 4877866 4013711 4085777 4164886 4478538
16609D478538n43960M61196o03784L10043k02808Q5686j57136j7698n4108l13920
$$ 4478538 3934578 4395774 3791990 4102033 3899225 3984911 3827775 3810077 3755969 3442049
16599C442049k69472M62509l72755P1772k08831J54409j27891l43136L58781K8000
$$ 3442049 3172577 3635086 3262331 3334103 3125272 3279681 3151790 2808654 3167435 3195435
16589C195435k23440j59645j53103J53347o9913J62J78048n06136J32990J03080
$$ 3195435 2971995 2812350 2659247 2812594 2742681 2742843 2920891 2414755 2547745 2650825
16579B650825K697k66870j73569M08342p5574l23726l3020N9265K97783j27458
$$ 2650825 2653522 2386652 2213083 2621425 2545851 2222125 2189105 2248370 2546153 2418695
16569B418695m36774J26772k44409L81757l81512J98420j21323p7266J76625j54796
$$ 2418695 1981921 2108693 1864284 2246041 1864529 2062949 1941626 1864360 2040985 1886189
16559A886189Q7729R2730j77339k47127K07097l4382n3958j981q3006N4777q5565
$$ 1886189 1973918 2066648 1889309 1642182 1849279 1814897 1760939 1758958 1675952 1730729 1645164
16548A645164J34956m23071N894L28029L7843j27844j29177J13999J96858o73972
$$ 1645164 1780120 1357049 1362943 1690972 1728815 1600971 1471794 1585793 1782651 1108679
16538A108679K69244k17245O09200n77580J21359r864K35997j73651n0502j511
$$ 1108679 1377923 1160678 1769878 1192298 1313657 1303793 1539790 1366139 1315637 1314126
16528A314126k29757K85708J39319l45731L1622m79876L91137j13526L31231R1824
$$ 1314126 1084369 1370077 1509396 1163665 1195287 715411 1106548 993022 1324253 1416077
16518A416077l57144M46298m04007p2196j8021J06082j84896K40829E59901M72954
$$ 1416077 1058933 1505231 1101224 1029028 1011007 1117089 932193 1173022 559901 1032855
16508A032855k53502J65018j00783J72561k09016K11877k75744L17786l31097
$$ 1032855 779353 944371 843588 1016149 807133 1019010 743266 1061052 729955
16499G29955J2641J13737k63658M42183p5308J996Q5736l52800Q2475q2813J25314
$$ 729955 742596 856333 592675 1034858 959550 961546 1047282 694482 776957 694144 819458
16488H19458N13315l6991n84469K77318j83123k4896O6484N14767D81382N08006
$$ 819458 1332773 1295782 711313 988631 805508 780612 847096 1361863 481382 989388
16478I89388k83834J77847k39212K33159Q7354j55630l57598K06409J05111j84280
$$ 989388 705554 883401 644189 877348 964702 809072 451474 657883 762994 578714
16468E78714Q9729K215C21495L36032j33452M66088l44288K72044m43618J51285
$$ 578714 668443 670658 321495 657527 524075 990163 645875 917919 474301 625586
16458F25586L21007k66311J6855R5098C46589M11998M3103k15013N0470q6389
$$ 625586 946593 680282 697137 792235 346589 758587 801690 586677 637147 550758
16448E50758L03191k39858B57229M7053N28925D00159J48237A82746J81203J98890
$$ 550758 853949 614091 257229 304282 833207 400159 548396 182746 363949 562839
16438E62839o1439q703m7829A98202K89689A92790N38904m0298B06647N36268
$$ 562839 501400 492697 444868 198202 487891 192790 731694 691396 206647 742915
16428G42915C31566L72874A51373K68869K10525j56780j17509L38947k15678o3189
$$ 742915 331566 704440 151373 420242 630767 473987 356478 695425 479747 416558
16418D16558N4793A74702M03146L89198C59577J56010r8205J01200j27854M23354
$$ 416558 471351 174702 577848 967046 359577 515587 417382 518582 390728 814082
16408H14082j69330k94885K32981j78170R6640p5048j79223O4415K17068j37640
$$ 814082 644752 349867 582848 404678 501318 426270 247047 311462 528530 390890
16398C90890n2277L5178K58004k82214A12645L89158B42560J60777M09L83245
$$ 390890 338613 373791 631795 349581 112645 501803 242560 403337 403746 786991
16388G86991k28127A59963J60603Q8648k01521K44010j23676R8774k1476l030
$$ 786991 558864 159963 320566 409214 207693 451703 328027 426801 405325 402295
16378D02295K4286n4189R3204A51638K69638A40597c3593D21019A93145K43387
$$ 402295 426581 372392 465596 151638 421276 140597 -33593 421019 193145 436532
16368D36532j20303j3516J17500R1458A72783J45516L42919B6999O4051K48648
$$ 436532 316229 302713 420213 511671 172783 318299 661218 26999 91050 339698
16358C39698A32081M07192B55163J24015j52734J51781N0539C4223N69746j24033
$$ 339698 132081 539273 255163 379178 226444 378225 428764 34223 603969 479936
16348D79936p3684j15218K5368j42629L8072n8270b20715D5761J08916a9024C99914
$$ 479936 406252 291034 316402 173773 211845 153575 -220715 45761 154677 -19024 399914
16336C25456A37568A8336N20677b55130A98063R507J90548j67310a57235B16182
$$ 325456 137568 18336 539013 -255130 198063 207570 398118 230808 -157235 216182
16325b0164D68973A87419L4408M3690G4123A2582J7850K54279i327B53459o701
$$ -20164 468973 187419 221827 265517 74123 12582 30432 284711 -9327 253459 246758
16314B46758a28223D8009J26152B9844J35570Q1194G12M75622G4865M66398B37405
$$ 246758 -128223 48009 174161 29844 165414 246608 712 476334 74865 541263 237405
16302A8717N1840a9986D44345c1679G31J78763i6572j84678C84467F616M90487
$$ 18717 70557 -19986 444345 -31679 731 179494 -96572 -281250 384467 6616 497103
16291D97103A18222a5136B94285A06838J81904k107C9898L10615R9830I6864N2066
$$ 497103 118222 -15136 294285 106838 288742 286635 39898 350513 450343 96864 148930
16280A48930h5137E6295J93232I7127l5270L4086M8775k778J68480D9553J36704
$$ 148930 -85137 56295 249527 97127 61857 95943 144718 141940 310420 49553 186257
16269A86257F6338a154I1863J28115c3065D5688J71126E4309a06074K8644C61130
$$ 186257 66338 -1154 91863 219978 -33065 45688 216814 54309 -106074 -77430 361130
16257B65805o4038n9559c59820B00534O5486A05896i6877b0272C67378e0789C97434
$$ 265805 201767 142208 -359820 200534 266020 105896 -96877 -20272 367378 -50789 397434
16245B9423i0663C85295a36576D3889J93855J3594i0706C21577a59343O5206A30042
$$ 29423 -90663 385295 -136576 43889 237744 251338 -90706 321577 -159343 -94137 130042
16233A48926h3611A89618I3319f5279D10549A21712O9468m1588J02993e2239I8260
$$ 148926 -83611 189618 93319 -65279 410549 121712 191180 149592 252585 -52239 98260
16221a9437p8983j4415A74583C0746K9031j7231J89903r5933i6307A39461o3571
$$ -19437 -98420 -112835 174583 30746 59777 42546 232449 136516 -96307 139461 75890
16210G5890J58695N3806E1160a52121B38728A02518D0116J9197J95550b0839A30944
$$ 75890 234585 288391 51160 -152121 238728 102518 40116 59313 254863 -20839 130944
16198b1915A4609O4082A751Q0934j8809K36659j30170P2995M28219i1772D5652
$$ -21915 14609 78691 1751 82685 63876 300535 170365 243360 671579 -91772 45652
16186a27091b8290l14570J46577A76050J4026m7644K54g9627A05496L78642g5937
$$ -127091 -28290 -342860 -196283 176050 190076 142432 142686 -79627 105496 484138 -75937
16174h9068L2019A09468n352c7439L202B3795c18457B30505a09160A35988J31654
$$ -89068 -57049 109468 104116 -37439 -34237 23795 -318457 230505 -109160 135988 267642
16163B67642H4391M1281i5439R250C46111A733K08515h866B53881a35819k196
$$ 267642 84391 125672 -95439 -86189 346111 1733 210248 -8866 253881 -135819 -138015
16152a38015O2774C77670A59690C1606P9205a17986A15122J82072A25617L9724
$$ -138015 -75241 377670 159690 31606 110811 -117986 115122 297194 125617 165341
16142A65341J42577b84680B39533i8730N94C20702a14149K2590B7099J80185a74820
$$ 165341 307918 -284680 239533 -98730 -98136 320702 -114149 -91559 27099 207284 -174820
16130c24907f4850j5922j97323f3071j11062A27015J04423a11982A67433q2762
$$ -324907 -64850 -80772 -278095 -63071 -174133 127015 231438 -111982 167433 84671
16120H4671Q0882F8950b53868d7463j61920e5729r3903d9859j8671B78734b39935
$$ 84671 165553 68950 -253868 -47463 -209383 -55729 -149632 -49859 -68530 278734 -239935
16108a05256r901A32311b75523i4476M6949A08121a00016M5950B95550j07138
$$ -105256 -115157 132311 -275523 -94476 -47527 108121 -100016 -54066 295550 188412
16098A88412f6756D9250g2470F8153L9215l2685J01681R1629a08991B41176a17686
$$ 188412 -66756 49250 -72470 68153 107368 74683 176364 267993 -108991 241176 -117686
16086A43301J51412A08064J24058r3186m7525e4514H8525L9955a07908J5321A67628
$$ 143301 294713 108064 232122 138936 91411 -54514 88525 128480 -107908 -92587 167628
16074C15623a64370c8271A30885A8261h6501k98242J09147B8924a71381e9703
$$ 315623 -164370 -38271 130885 18261 -86501 -384743 -275596 28924 -171381 -59703
16063b17298b0349r6393A08758a11945j3529A19237k9174m4525K78779H187i1499
$$ -217298 -20349 -116742 108758 -111945 -125474 119237 90063 45538 324317 8187 -91499
16051B32951a51225j99466b7657B08028M0434a34171M6729D5656e6242A23990
$$ 232951 -151225 -350691 -27657 208028 248462 -134171 -87442 45656 -56242 123990
16040E6203a55719O7231l7018E2186c28374P9231A19343E7007a08386k08132g8503
$$ 56203 -155719 -88488 -125506 52186 -328374 -249143 119343 57007 -108386 -316518 -78503
16028A86843b9237A39169Q7908a85755M1480A61004A7427J49352f8308P618B5895
$$ 186843 -29237 139169 227077 -185755 -144275 161004 17427 166779 -68308 -60690 25895
16016i4475B12987c75103d4602j28595j24391I1906J11686h519A95564i127j35467
$$ -94475 212987 -375103 -44602 -173197 -297588 91906 203592 -8519 195564 -9127 -144594
16005a44594e9485c720C7522J883M9051K59527c34766f8562j78409k26469a57428
$$ -144594 -59485 -3720 37522 39405 88456 347983 -334766 -68562 -246971 -473440 -157428
15993b12385B156J66941C407J82176h9618O673A14169a44786A67719D9600L17927
$$ -212385 2156 169097 3407 185583 -89618 -82945 114169 -144786 167719 49600 367527
15982C67527l7369j6564M2583A34297K03442d3347j4127k9761c0284C18123I3875
$$ 367527 330158 313594 356177 134297 337739 -43347 -57474 -87235 -30284 318123 93875
15970d122I3697a65867F4593L49780D9786a69888k7938D44642j56247c07910C2235
$$ -4122 93697 -165867 64593 414373 49786 -169888 -197826 444642 288395 -307910 32235
15958F4514a16864E7392b6839C57100E5931k633G688a3703r1049A23672g0412
$$ 64514 -116864 57392 -26839 357100 55931 53298 7688 -13703 -104752 123672 -70412
15946B77295E7417k0664O844f9832n5621l5809j41568O5835A94775b88157j6866
$$ 277295 57417 36753 43597 -69832 -125453 -161262 -302830 -236995 194775 -288157 -305023
15935c05023J29258r2365e1586C39669C5744N246K5215b81781p1403B4017b69722
$$ -305023 -175765 -268130 -51586 339669 35744 40990 66205 -281781 -353184 24017 -269722
15923a47544c6854D3739h5484j57584c4290A91104c3701A73567a75279j4404A16474
$$ -147544 -36854 43739 -85484 -243068 -34290 191104 -33701 173567 -175279 -189683 116474
15911H1977c1375A8752N80a13002j0080A58628k7023a012D02173d05136B09718
$$ 81977 -31375 18752 19332 -113002 -123082 158628 131605 -1012 402173 -405136 209718
15899a36399B12799m3345p6467L5235A113b997m5555j04210P4021I0871P3743
$$ -136399 212799 169454 92987 128222 1113 -2997 -48552 -152762 -78741 90871 164614
15888A64614b44264c6099j91598Q0904E4675a05614G7935L9658g7509B2812c82066
$$ 164614 -244264 -36099 -227697 -146793 54675 -105614 77935 117593 -77509 22812 -382066
15876d06217g2279C1214f6569b9299d939k02342D4174A7164h3998L2866q022a8131
$$ -406217 -72279 31214 -66569 -29299 -4939 -207281 44174 17164 -83998 -51132 -59154 -18131
15863b7740A12073i6941F7863P1397D2243J49504C0308J49250i6424H5486a19984
$$ -27740 112073 -96941 67863 139260 42243 191747 30308 179558 -96424 85486 -119984
15851A43131D5096b20438A8368d08635f1520a2853k00322A25053m8888J05556
$$ 143131 45096 -220438 18368 -408635 -61520 -12853 -213175 125053 76165 181721
15841A81721i457l90511L2947F1678J85059G09b73154c4278j80872O3594k28487
$$ 181721 -9457 -399968 -367021 61678 246737 709 -273154 -34278 -215150 -151556 -380043
15830c80043a35690r6368j34384A9338h3964d326l0167j61825b8951j27822B34024
$$ -380043 -135690 -232058 -366442 19338 -83964 -4326 -34493 -196318 -28951 -156773 234024
15818b71673M1452A86004a86610B49170k8234a47786E8479a41535B06438a52347
$$ -271673 -230221 186004 -186610 249170 220936 -147786 58479 -141535 206438 -152347
15807b40479J19754k34137A77160p539k9260b80452g1999C0193J6315c31642J62426
$$ -240479 -120725 -354862 177160 169621 140361 -280452 -71999 30193 46508 -331642 -169216
15796a69216B48330A1628J55796O1221O367a01559d3187H2632J76118b18788j5140
$$ -169216 248330 11628 167424 228645 235012 -101559 -43187 82632 258750 -218788 -233928
15785b33928G0195J60201b415l04203B0304g3186L1680A7482a37646O6566b2791
$$ -233928 70195 230396 -2415 -306618 20304 -73186 -41506 17482 -137646 -71080 -22791
15773D7851K962a37585M2435o1632d999H8471c11369B6249a40161F9100h2603
$$ 47851 50813 -137585 -95150 -156782 -4999 88471 -311369 26249 -140161 69100 -82603
15761i1227j41536B40659c1925j02727A64213a39199j12884G8697J5084d22937
$$ -91227 -232763 240659 -31925 -134652 164213 -139199 -252083 78697 93781 -422937
15750d00172L9404J19071R7069A71456L04875e4724C2012K65100a41847A09176
$$ -400172 -360768 -241697 -144628 171456 476331 -54724 32012 297112 -141847 109176
15739B34788j8206h6475A9541i1254k3604G0343g4302B31914a20315k05874J01652
$$ 234788 216582 -86475 19541 -91254 -114858 70343 -74302 231914 -120315 -326189 -224537
15728b24537B72640d1557R181A11571Q2269a75345N6832j26656B20740h902k1741
$$ -224537 272640 -41557 -32376 111571 193840 -175345 -118513 -245169 220740 -8902 -30643
15717c0643A24027c26741f0328q7242A65119G7231O2169K9214a15967j72852A751
$$ -30643 124027 -326741 -60328 -147570 165119 77231 139400 168614 -115967 -288819 1751
15705b05969F0434a35404j14998D8541a40853l5678l6198B64594j22384b59437
$$ -205969 60434 -135404 -250402 48541 -140853 -176531 -212729 264594 142210 -259437
15694A15596b0949a642D5413b47214A73376f9457A158N61783a37146B7578J20614
$$ 115596 -20949 -1642 45413 -247214 173376 -69457 1158 562941 -137146 27578 148192
15683A48192F8554f5373A65540R8192m9124d952A13691a64825I9208O0078D3431
$$ 148192 68554 -65373 165540 263732 214608 -4952 113691 -164825 99208 159286 43431
15671e2901B90809D4139l721J62761A00679L1208b50832A01100b91378c7020B292
$$ -52901 290809 44139 40418 203179 100679 131887 -250832 101100 -291378 -37020 2292
15659A09948d95870c3653A77918E4089a25520G925c25267J17142H8515e1041n6986
$$ 109948 -495870 -33653 177918 54089 -125520 7925 -325267 -208125 88515 -51041 -108027
15648a08027B99112b06586G6907e2779j2965p4663A15393C4987O1338H535P096
$$ -108027 299112 -206586 76907 -52779 -65744 -140407 115393 34987 96325 8535 15631
15637A5631a26628A0072b9229C1809a4641k47954B14023c33474a58411d8743j67910
$$ 15631 -126628 10072 -29229 31809 -14641 -262595 214023 -333474 -158411 -48743 -216653
15626b16653G0984c80189g2745o1845K9569p1562A64451k2510J12650f9618K8706
$$ -216653 70984 -380189 -72745 -134590 -105021 -176583 164451 141941 254591 -69618 -40912
15615d0912H5723m0446a52669M0771A1261b5010A44697i1470A87120d7031A88951
$$ -40912 85723 45277 -152669 -111898 11261 -25010 144697 -91470 187120 -47031 188951
15603A29273b64120B9407g2019j7662F7172J35848e0321b2211A84637J5863a78418
$$ 129273 -264120 29407 -72019 -89681 67172 203020 -50321 -22211 184637 200500 -178418
15591H3571a55974g2735l19833B83305j20366a18433B18342B6455c78520a52313
$$ 83571 -155974 -72735 -392568 283305 162939 -118433 218342 26455 -378520 -152313
15580D5483M0890H835f3425A2869O0259j2262J2477L5630J73293b2698j74144
$$ 45483 86373 8835 -63425 12869 73128 60866 73343 108973 282266 -22698 -196842
15569a96842j6500E7437K52445f3018J099A08414a1648A07058J33373Q5943a28965
$$ -196842 -213342 57437 309882 -63018 -61919 108414 -11648 107058 240431 326374 -128965
15557I3478b27760E1714b121n8845m4027A15867b44263J09560A49828n2919r524
$$ 93478 -227760 51714 -2121 -60966 -104993 115867 -244263 -134703 149828 96909 87385
15546H7385f1948q7282I837a31017I0822J16846i7283K1715a9928A81720d9353
$$ 87385 -61948 -149230 9837 -131017 90822 207668 -97283 -75568 -19928 181720 -49353
15534B76526J35930f2339r1182A1082J57538e914l48089I3154J39898b38523o1232
$$ 276526 412456 -62339 -153521 11082 168620 -5914 -354003 93154 233052 -238523 -299755
15523b99755A45094o8856i2829l1699c5293j6465B26955b24909G5876L4646M4260
$$ -299755 145094 76238 -92829 -124528 -35293 -51758 226955 -224909 75876 110522 154782
15512A54782n6064k3458d4921A126c3525A99770g256A345b6350H3244a27815G7384
$$ 154782 98718 75260 -44921 1126 -33525 199770 -7256 1345 -26350 83244 -127815 77384
15499i6701b3440A53890B544L0311K3315a55375o709j75708J50592P0989B25423
$$ -96701 -23440 153890 2544 32855 56170 -155375 -162084 -337792 -187200 -116211 225423
15487a90317e108I6560J39878c1585B38215b89717H0924C8797c38043M2220a29947
$$ -190317 -5108 96560 236438 -31585 238215 -289717 80924 38797 -338043 -295823 -129947
15475G2068M9025D3890J69388d64234a07045l1427C5755h8493j76954d8303j74912
$$ 72068 121093 43890 213278 -464234 -107045 -138472 35755 -88493 -265447 -48303 -223215
15464b23215A20520b53924A76387G867f3906j16333k51936C958J26479e72077
$$ -223215 120520 -253924 176387 7867 -63906 -180239 -432175 3958 130437 -572077
15453B8281L03239A16357n5987g3775j68292D214O7581B6898J60128q9608A3754
$$ 28281 331520 116357 60370 -73775 -242067 4214 71795 26898 187026 97418 13754
15441A08748c9384C1573d5483j96955g1096A47304j7701d46515B43548a71711
$$ 108748 -39384 31573 -45483 -242438 -71096 147304 129603 -446515 243548 -171711
15430I0564j602j6478g2934F2199d9909o2700A09954D6718K0853g535B58753o0834
$$ 90564 88962 72484 -72934 62199 -49909 -112609 109954 46718 67571 -7535 258753 197919
15418A97919a53530e9796m5057B6841J57465i3885A77109c7019m34626A6986B095
$$ 197919 -153530 -59796 -104853 26841 184306 -93885 177109 -37019 -471645 16986 2095
15406d36933C57811g7664J9116a5334l28956J36033A66526h0104f842A8467O6806
$$ -436933 357811 -77664 -58548 -15334 -344290 -208257 166526 -80104 -6842 18467 85273
15395H5273Q9584d3265o580j8238F679L76098A4510e109D24491b77679H402K56044
$$ 85273 174857 -43265 -49845 -68083 6679 382777 14510 -5109 424491 -277679 8402 264446
15383B64446a83117B40014a76246B03021E3610b29162M443C02267b72357A87444
$$ 264446 -183117 240014 -176246 203021 53610 -229162 -224719 302267 -272357 187444
15372b46041A51331E1300a46758O4610f069k27872J5445D1011a70233B1283a70603
$$ -246041 151331 51300 -146758 -82148 -6069 -233941 -218496 41011 -170233 21283 -170603
15360H6899l3495a60539E06009b30305g470j83343D8627a39151J7747A1999B962
$$ 86899 53404 -160539 506009 -230305 -7470 -190813 48627 -139151 -121404 11999 2962
15348B13945a2571B1609L780a37617e1778F9073j9263e7973A15593a75010N5291
$$ 213945 -12571 21609 25389 -137617 -51778 69073 49810 -57973 115593 -175010 -119719
15337a19719p1139d2624m1826J1412p9993L2076L9608B41706j16582b06304F0399
$$ -119719 -190858 -42624 -84450 -73038 -153031 -120955 -81347 241706 125124 -206304 60399
15325B72096a79304H1253O3182b63467A63623J62104g1827A53187l6013d1339
$$ 272096 -179304 81253 144435 -263467 163623 325727 -71827 153187 117174 -41339
15314B43051A09632a1072j49692b0338j56571D5924J08885F7810J15195R3942
$$ 243051 109632 -11072 -160764 -20338 -176909 45924 154809 67810 183005 276947
15304B76947O1238a54455K5124H1764L1589J3533B7404r393a15307A26518b62611
$$ 276947 338185 -154455 -129331 81764 113353 126886 27404 18011 -115307 126518 -262611
15292g278F9416R5496a32612N8462C84969A04799j6630m1154M83273k54326d4305
$$ -7278 69416 164912 -132612 -74150 384969 104799 88169 47015 530288 275962 -44305
15280A90434f3992F1106B8403J53988m0399a05831q7368H0411h2800A39578J29532
$$ 190434 -63992 61106 28403 182391 141992 -105831 -193199 80411 -82800 139578 269110
15269B69110C9821b1219B35420B2236f4018B14342q8245B1913M7927J35356I6441
$$ 269110 39821 -21219 235420 22236 -64018 214342 126097 21913 69840 205196 96441
15257a5487C5700J28810j2461E4183K82817M5601J30815B03944J26971O31726
$$ -15487 35700 164510 152049 54183 337000 382601 513416 203944 330915 962641
15247I62641N60958l92310M13627k47507m23887B84116I1362J40381b3045C30275
$$ 962641 1523599 1131289 1544916 1297409 873522 284116 91362 231743 -23045 330275
15236c17A63905o4194c3775C5907c26040b3083D3528a75994e4116A96232H7566
$$ -317 163905 99711 -33775 35907 -326040 -23083 43528 -175994 -54116 196232 87566
15224H4186l7119R3806k6938K42552A21027a65200G9938P334b9138l0784C54144
$$ 84186 47067 140873 113935 356487 121027 -165200 79938 87272 -29138 -59922 354144
15212A13215A1917J45175b63137a08770F1767A6860J55416g2190G6119M04690
$$ 113215 11917 157092 -263137 -108770 61767 16860 172276 -72190 76119 480809
15202D80809a14913B73298b46834k74359B12903C1276d1235A6226c96587a1593
$$ 480809 -114913 273298 -246834 -521193 212903 31276 -41235 16226 -396587 -11593
15191A04152i7762C42597A49502k962a2417j48886B58740b2374B89210D8415b62735
$$ 104152 -97762 342597 149502 146540 -12417 -161303 258740 -22374 289210 48415 -262735
15179D4689K8025J03154H7805j7485g0507g440I1997B3312J0003J67019k9909
$$ 44689 72714 175868 87805 70320 -70507 -7440 91997 23312 33315 200334 170425
15168A70425G4887K66358A65016o641k2578a33460C87781a64781B0013R874l629
$$ 170425 74887 341245 165016 158375 135797 -133460 387781 -164781 20013 29887 26258
15157B6258Q851O2044a07353D02155a46692B03737k8861K9714d2000H3226K68130
$$ 26258 35109 97153 -107353 402155 -146692 203737 174876 204590 -42000 83226 351356
15146C51356A17405j7911l018J78228a31841L8967B46945p5684q0335c8507D12634
$$ 351356 117405 99494 96476 274704 -131841 -92874 246945 171261 90926 -38507 412634
15134b2005C44127C4180J17153a05651l5390B34748a779C7507K47521R3237j02288
$$ -22005 344127 34180 151333 -105651 -141041 234748 -1779 37507 285028 378265 275977
15123B75977n6702M84468H8280L92173A76241J65963f6287A4315a444B00640k5835
$$ 275977 219275 703743 88280 480453 176241 342204 -66287 14315 -1444 200640 174805
15112A74805k6782b2495A42029P5105p7075a51256C08532I1969J66940r0021G6632
$$ 174805 148023 -22495 142029 217134 140059 -151256 308532 91969 258909 168888 76632
15100g3644m5024I5574J66251B2997M9055K74191e5339H185a72360A77933d2008
$$ -73644 -118668 95574 261825 22997 72052 346243 -55339 8185 -172360 177933 -42008
15088C90230G5946M2809P7373c0431I169L08333O220A21194i2602i321m34560
$$ 390230 75946 118755 196128 -30431 9169 317502 323722 121194 -92602 -9321 -443881
15077d43881A70625G0081M6298O7460J03439F4287J65453P9144M3524A4484J74197
$$ -443881 170625 70081 116379 183839 287278 64287 229740 308884 352408 14484 188681
15066A88681d2862C41016L4597p7686j7482b53920A16403b0516B50344p9710K69774
$$ 188681 -42862 341016 375613 297927 280445 -253920 116403 -20516 250344 170634 440408
15055D40408p40J65654B16655j1746L69492A49517r212n5746J46351B0798K2479
$$ 440408 439668 605322 216655 204909 574401 149517 140305 84559 230910 20798 43277
15044D3277a61594B79261M1029j0929p1032Q4976i8351q6510D04801A08539J53717
$$ 43277 -161594 279261 320290 309361 238329 323305 -98351 -184861 404801 108539 262256
15033B62256c927B41446r1233m3622c041n877A95721H4430L01521b4359j14149
$$ 262256 -3927 241446 150213 106591 -3041 -8918 195721 84430 385951 -24359 -138508
15022a38508A74544J25027h2609A74910j3226n5388K61549j30475D1177M54031
$$ -138508 174544 299571 -82609 174910 161684 106296 367845 237370 41177 495208
15012D95208k25413A19054K72926j63644J34580A77500R451G0623J84419L1642
$$ 495208 269795 119054 391980 228336 362916 177500 186951 70623 255042 286684
15002B86684O4554n6935j08215k738M45854l13936A39552M63531k36621O140j85006
$$ 286684 351238 294303 186088 183350 629204 315268 139552 603083 366462 372602 187596
14991A87596K20206A71698M38261B35237P1554C9305L7931J21697d9665A73778
$$ 187596 407802 171698 609959 235237 306791 39305 77236 198933 -49665 173778
14980B65100l1995J01608e4960A33002J42598o8315N8220D7166J10717h855j1127
$$ 265100 233105 334713 -54960 133002 275600 207285 265505 47166 157883 -8855 -19982
14969a9982B70138M32952j83719A79239H7243f7768D7540J68497K27864j58148
$$ -19982 270138 703090 519371 179239 87243 -67768 47540 216037 443901 285753
14959B85753d9363g826C47599P9413k13143L72203A95181J37293M5066A9249P5407
$$ 285753 -49363 -7826 347599 427012 213869 586072 195181 332474 377540 19249 94656
14948I4656J82711L36828j57566C3775K01352j8039H7956N1282K80393A75383
$$ 94656 277367 614195 456629 33775 235127 217088 87956 139238 419631 175383
14937B61831g5476D58594B06511K03590O9570l634A60403J55914O3553O7595E0519
$$ 261831 -75476 458594 206511 410101 479671 476037 160403 316317 379870 447465 50519
14925A93971J84292N4620j54366A26550h6824D4924O113N05944B74007q2688J58441
$$ 193971 378263 432883 278517 126550 -86824 44924 51037 556981 274007 191319 349760
14914C49760F3474J39920l8671L94125j05635j46271j40559J07023J0693J76084
$$ 349760 63474 203394 164723 558848 453213 306942 166383 273406 284099 460183
14904D60183m629E7018L19576j20437N22437C72754m717o9463L14362C05569J17113
$$ 460183 455554 57018 376594 256157 778594 372754 368037 298574 612936 305569 422682
14893D22682j9786j3755J0447L6505q5072m8803J22200k975K73141J755j54575
$$ 422682 402896 389141 399588 436093 351021 302218 424418 421443 694584 696339 541764
14882E41764A51556J4633K23933j35820R8094J49558O1912k37571L62542a20656
$$ 541764 151556 166189 390122 254302 352396 501954 563866 326295 688837 -120656
14871A90445J60063A10000K00245R2812L02515j0743j56894r5206A56650L96507
$$ 190445 350508 110000 310245 403057 705572 694829 537935 442729 156650 553157
14861E53157n4193k03070M74J79380J82228k81426J06716J1818n2542J25151J43063
$$ 553157 498964 295894 296368 475748 657976 376550 483266 495084 442542 567693 710756
14850G10756k43047l2771L01019j95065J22138B43550J92210L19657k40655j74972
$$ 710756 467709 434938 735957 540892 663030 243550 435760 755417 514762 339790
14840C39790J23931j6573q0026K63255l00593o4422L67414j62995J49112r5685
$$ 339790 463721 447148 367122 630377 329784 265362 632776 469781 618893 523208
14830E23208r6690K84830l33719M87717l05025A53039J21133J63928J90253k64638
$$ 523208 426518 711348 377629 865346 560321 153039 274172 438100 628353 363715
14820C63715p5022Q2027K77927A96115L38490j16845j98038q2169M51939j04125
$$ 363715 288693 370720 648647 196115 534605 417760 219722 137553 589492 485367
14810D85367J8340k0530J78199k72509p8323J75741O1224A80757L75482n4638
$$ 485367 503707 483177 661376 388867 310544 486285 547509 180757 556239 501601
14800E01601O096J29551F3617N25713R2546k9881l14574K64246K27117m03814
$$ 501601 507697 637248 63617 589330 681876 651995 337421 601667 828784 424970
14790D24970O1918K63551j77092L60452m06257K77582O9153j74568m4774J64553
$$ 424970 486888 750439 573347 933799 527542 805124 874277 699709 654935 819488
14780H19488J08251j52159p3941l24966M63539l55599J39462R6962C09657L27574
$$ 819488 927739 775580 701639 376673 840212 484613 624075 721037 309657 637231
14770F37231J40661r3071k40284Q8972r8778K40599J2325J0364P8995l25246J34640
$$ 637231 777892 684821 444537 533509 434731 675330 687655 698019 777014 451768 586408
14759E86408K88123q9638M6674K5376l18653r3792M56965j58791J8686j16428
$$ 586408 874531 784893 831567 856943 538290 444498 901463 742672 761358 644930
14749F44930L53220l21639j7594L06560k13395l6315J41225j21718L70677n44897
$$ 644930 998150 676511 658917 965477 752082 715767 856992 735274 1105951 561054
14739E61054L26484O897J98909k01080J31964j83054o1128J81737l08341J90997
$$ 561054 887538 894435 1093344 892264 1024228 841174 780046 961783 653442 844439
14729H44439Q4707l24762J90314J19280j5797n6458j85516K95218R9472P3417
$$ 844439 929146 604384 794698 913978 898181 841723 656207 951425 1050897 1124314
14719A124314k12180J43690k94709L1353M2390K9667L1473j44501L42125k75568
$$ 1124314 912134 1055824 761115 792468 834858 864525 895998 751497 1093622 818054
14709H18054K58153n801j70732l7864O11r7005L06454j44656K31166m31699K01584
$$ 818054 1076207 1070406 899674 861810 862421 765416 1071870 927214 1158380 726681 928265
14698I28265k08761K53586J21741l92149K60822J55615o272N3509m94385J53219
$$ 928265 719504 973090 1094831 702682 963504 1119119 1112847 1166356 671971 825190
14688H25190K35016j21068m51923K53907J41178m3822K40020j1805m63501K27441
$$ 825190 1060206 939138 487215 741122 882300 838478 1078498 1066693 603192 830633
14678H30633K24500k40701K62975J04163O7321j58447K17922m01514J45250j95306
$$ 830633 1055133 814432 1077407 1181570 1248891 1090444 1308366 906852 1052102 856796
14668H56796k34488M09668r1070J34683L35517k56220N6396k89J99696j00187
$$ 856796 622308 1031976 940906 1075589 1411106 1154886 1211282 1210993 1410689 1310502
14658A310502o1802m63763L44936j51848k2041L69838n25024N26117j01476p1076
$$ 1310502 1248700 784937 1129873 978025 955984 1325822 800798 1326915 1225439 1154363
14648A154363L09551l71385M56647j45850k30452K96645l7902k66834N01427j0160
$$ 1154363 1463914 1092529 1549176 1403326 1172874 1469519 1431617 1164783 1666210 1656050
14638A656050k55236o2645k00137M42587l44915K24177j42159q3541p1249K07945
$$ 1656050 1400814 1338169 1138032 1580619 1235704 1459881 1317722 1234181 1162932 1370877
14628A370877J00751N022R3143n30764M69526k1649j57732K57010k26728L4294
$$ 1370877 1471628 1476650 1569793 1039029 1508555 1486906 1329174 1586184 1359456 1393750
14618A393750K13113k4153q5650J18551o4374J59479l4421L8218K3402j82358
$$ 1393750 1606863 1582710 1497060 1615611 1551237 1710716 1676295 1714513 1737915 1555557
14608A555557Q8366Q5745N5927k89373J4443L70014J19804l79267k7295N65638
$$ 1555557 1643923 1729668 1785595 1496222 1510665 1880679 2000483 1621216 1593921 2159559
14598B159559l76260J71732o14179N67417q9521L51905j96043k06719j34180L43189
$$ 2159559 1783299 1955031 1340852 1908269 1818748 2170653 1974610 1767891 1633711 1976900
14588A976900J53810j02703K02687k75614k44852j05309N03167R3973j53328k03943
$$ 1976900 2130710 2028007 2230694 1955080 1710228 1604919 2108086 2202059 2048731 1844788
14578A844788N83417m37394J82641m9477J70525j47297L94115j69757K1671J82716
$$ 1844788 2428205 1990811 2173452 2123975 2294500 2147203 2541318 2371561 2393232 2575948
14568B575948K3004j87745K9351k09701J30157K79137J40207Q2389k63113J01686
$$ 2575948 2598952 2411207 2440558 2230857 2361014 2640151 2780358 2862747 2599634 2701320
14558B701320M56230k09291K43727L73058L5037J57681L70125M07803J092092
$$ 2701320 3157550 2948259 3191986 3565044 3600081 3757762 4127887 4535690 5627782
14549E627782K047778L688183R167848J8486797R334644k2418146j2855143F168369
$$ 5627782 7675560 11363743 20531591 39018388 48353032 25934886 13079743 6168369
14540C304347r80660P9208m02822J66865k35994L8066N97640m59110l5167J18663
$$ 3304347 2323687 2402895 2000073 2166938 1930944 1969010 2566650 2107540 2072373 2191036
14530B191036L40092k57824J24339m1174J00716J60331K0188M9473l12135M54164
$$ 2191036 2531128 2273304 2397643 2356469 2457185 2617516 2637704 2687177 2375042 2829206
14520B829206l06223J70459l85392M86423J06943p9513j53604K69263K30926k43650
$$ 2829206 2522983 2693442 2308050 2794473 2901416 2821903 2668299 2937562 3168488 2924838
14510B924838l9703J82253N1875J17087l37569K26563r3131M34738m18273J85599
$$ 2924838 2885135 3067388 3119263 3236350 2898781 3125344 3032213 3466951 3048678 3234277
14500C234277J54458r8921P9457o9101K0866M50038m85324K80746r5089L20350
$$ 3234277 3388735 3289814 3369271 3300170 3321036 3771074 3285750 3566496 3471407 3791757
14490C791757j67115J3883J91296L8744R5340j07983J04547j00166K98270J92378
$$ 3791757 3624642 3638525 3829821 3868565 3963905 3855922 3960469 3860303 4158573 4350951
14480D350951k93647M47720l29838J52475J6911O1457m02472O06929k1059j46554
$$ 4350951 4057304 4505024 4175186 4327661 4344572 4406029 4003557 4610486 4589427 4442873
14470D442873K58151l08132J47675L49064J38926k10656J86511l91912L72841
$$ 4442873 4701024 4392892 4540567 4889631 5028557 4817901 5004412 4612500 4985341
14461D985341j83124K27462L13632r8821J06409l4441P4551J54843J01466m8566
$$ 4985341 4802217 5029679 5343311 5244490 5350899 5316458 5391009 5545852 5647318 5598752
14451E598752P9338k9592N1442O8612K65871K77350J5336k33413L02072j47436
$$ 5598752 5678090 5648498 5699940 5768552 6034423 6311773 6327109 6093696 6395768 6248332
14441F248332J96860N8107J16092o3888M63418k22773L00535l39447K23518L26922
$$ 6248332 6445192 6503299 6619391 6555503 7018921 6796148 7096683 6757236 6980754 7307676
14431G307676j64539Q3107L01771J66427k57959J93474l5824N45908m31365K19419
$$ 7307676 7143137 7226244 7528015 7694442 7436483 7629957 7594133 8140041 7708676 7928095
14421G928095K23182J34798J8510L38416M3546N4264M5765N08147K47318j21236
$$ 7928095 8151277 8286075 8304585 8643001 8686547 8740811 8786576 9294723 9542041 9420805
14411I420805K16575K76854j31381M40275k17963K92832L81864q4335M41047R5935
$$ 9420805 9637380 9914234 9782853 10223128 10005165 10297997 10679861 10595526 11036573 11132508
14401A1132508j18495M06499J45068p668r2139N88933k4571K93114J06112N80700
$$ 11132508 11014013 11420512 11565580 11557912 11465773 12054706 12030135 12323249 12429361 13010061
14391A3010061l41478N35709j27760P65198j12190P40056l56082N24869O8058
$$ 13010061 12668583 13204292 13076532 13841730 13729540 14469596 14113514 14638383 14706441
14382A4706441R7373O11428O01847J3799J02542M84524L84655M0381L09706P42248
$$ 14706441 14803814 15415242 16017089 16030888 16133430 16617954 17002609 17042990 17352696 18094944
14372A8094944N74412j41725M91112P61509j76279K99288N59971N24875P1134
$$ 18094944 18669356 18527631 19018743 19780252 19603973 19903261 20463232 20988107 21059241
14363B1059241J147892n3454P42511K44037P76526K64062P54953M99224O93378
$$ 21059241 22207133 22153679 22896190 23140227 23916753 24180815 24935768 25434992 26128370
14354B6128370O43649M01030M39403J016884P18054Q50505O48932O43268P81436
$$ 26128370 26772019 27173049 27612452 28629336 29347390 30197895 30846827 31490095 32271531
14345C2271531P88539J170835M63451J275541Q47846R04269J004983Q83378J377994
$$ 32271531 33060070 34230905 34694356 35969897 36817743 37722012 38726995 39610373 40988367
14336D0988367J015402R36384J789016Q91013K163256J162444J209479J571479
$$ 40988367 42003769 42940153 44729169 45620182 47783438 48945882 50155361 51726840
14328E1726840J634191J311945K074139J690020K139902K135846K011614K146316
$$ 51726840 53361031 54672976 56747115 58437135 60577037 62712883 64724497 66870813
14320F6870813K656095K384368K382291K908752K650290L211852L077061L122488
$$ 66870813 69526908 71911276 74293567 77202319 79852609 83064461 86141522 89264010
14312H9264010L501591L804738L868164M174058M799712M435956M583002N440925
$$ 89264010 92765601 96570339 100438503 104612561 109412273 113848229 118431231 123872156
14304A23872156N339922N711569O058972O346275P187385P310460P638557Q398067
$$ 123872156 129212078 134923647 140982619 147328894 154516279 161826739 169465296 177863363
14296A77863363Q264095R235221R602692J0162936J0565741J1326578J1433580
$$ 177863363 186127458 195362679 204965371 215128307 225694048 237020626 248454206
14289B48454206J2163006J2884450J3440513J3659543J3930665J4502448J4548224
$$ 248454206 260617212 273501662 286942175 300601718 314532383 329034831 343583055
14282C43583055J4619577J4468903J4272824J4100037J2938121J2312441J1096555
$$ 343583055 358202632 372671535 386944359 401044396 413982517 426294958 437391513
14275D37391513R466681P505938M249879J716466m78113p94739k827897m510173
$$ 437391513 446858194 454364132 458614011 460330477 459852364 459057625 456229728 451719555
14267D51719555j855538m487459q328110j0209361j1628589j2950501j3802764
$$ 451719555 449864017 445376558 437048448 426839087 415210498 402259997 388457233
14260C88457233j4593069j4946617j5235145j4910343j4513111j4720001j3119875
$$ 388457233 373864164 358917547 343682402 328772059 314258948 299538947 286419072
14253B86419072j3263029j3061081j2048044j1849070j1665677j0568646j0117718
$$ 286419072 273156043 260094962 248046918 236197848 224532171 213963525 203845807
14246B03845807r768268r178774q075550q185719p783099p376497o902551o283822
$$ 203845807 194077539 184898765 176823215 168637496 160854397 153477900 146575349 140291527
14238A40291527o020887n303236n944049m999603m960745m766485m047673l457274
$$ 140291527 134270640 128967404 123023355 118023752 113063007 108296522 104248849 100791575
14230A00791575m211971l883553l660007l261816l050822l278831k972088k728019
$$ 100791575 96579604 92696051 89036044 85774228 82723406 79444575 76472487 73744468
14222G3744468k309811k546538k417477k378524k065465j828777k006852j661084
$$ 73744468 71434657 68888119 66470642 64092118 62026653 60197876 58191024 56529940
14214E6529940j793382j456623j647306j626098j714052j361743j255299n50252
$$ 56529940 54736558 53279935 51632629 50006531 48292479 46930736 45675437 45125185
14206D5125185j472067j328814j755204o75080j559487n94815m86469j041192
$$ 45125185 43653118 42324304 40569100 39894020 38334533 37739718 37253249 36212057
14198C6212057j024983j191250q94451q14533m94901q78435r13903o59675o34259
$$ 36212057 35187074 33995824 33101373 32286840 31791939 30913504 29999601 29339926 28705667
14189B8705667p02164o49150n28625o93257n25023m50586j067456k01177p70597
$$ 28705667 28003503 27354353 26825728 26132471 25607448 25156862 24089406 23888229 23117632
14180B3117632r0342n50434m43403n38062n06181k85320q30128J21233p28919
$$ 23117632 23027290 22476856 22033453 21495391 20989210 20703890 19873762 19994995 19266076
14171A9266076m4253p59269j4896o20119k29275l79028r1003m11560r7286n30378
$$ 19266076 19221823 18462554 18447658 17827539 17598264 17219236 17128233 16716673 16619387 16089009
14161A6089009l30680j89415j18026j81650l54314k51398j73224o82204j41815
$$ 16089009 15758329 15568914 15450888 15269238 14914924 14663526 14490302 13808098 13666283
14152A3666283J63792k89704k00351k98227l37191o1874o3010l79212l48277K9072
$$ 13666283 13830075 13540371 13340020 13041793 12704602 12642728 12579718 12200506 11852229 11881301
14142A1881301o8407k31335k56903j76698l15806O621k12661j11135j32348n6209
$$ 11881301 11812894 11581559 11324656 11147958 10832152 10838773 10626112 10514977 10382629 10326420
14132A0326420j89527K7276n88234Q1241l67303K65048m01946m9289n5344l32395
$$ 10326420 10136893 10164169 9575935 9657176 9289873 9554921 9152975 9103686 9048342 8715947
14122H715947P3094n8794l57796j776n2830r0520k49909k36890K14077n88702
$$ 8715947 8789041 8730247 8372451 8370675 8317845 8227325 7977416 7740526 7954603 7365901
14112G365901k04515K74540J4610Q5594k07067j61071l60348k28514M72360N3677
$$ 7365901 7161386 7435926 7450536 7536130 7329063 7167992 6807644 6579130 7051490 7105167
14102G105167k59269M6454k37682l28968m9466J62286o38907L40033k20520K07989
$$ 7105167 6845898 6892352 6654670 6325702 6276236 6438522 5799615 6139648 5919128 6127117
14092F127117k66607o3479p1524P0429L452l50643J17314K00537k54213M2020
$$ 6127117 5860510 5797031 5725507 5795936 5799388 5448745 5566059 5766596 5512383 5554403
14082E554403j806j64784l8068k45011p5575j4836j94680K91227l15981J54656
$$ 5554403 5552597 5387813 5349745 5104734 5029159 5014323 4819643 5110870 4794889 4949545
14072D949545k30778K45751j93708j99334M6898L03216n55468p6570K29197k15846
$$ 4949545 4718767 4964518 4770810 4571476 4618374 4921590 4366122 4289552 4518749 4302903
14062D302903J82749K2961J04902R9153n41290M34807m93345K44603r1016k66338
$$ 4302903 4485652 4508613 4613515 4712668 4171378 4606185 4112840 4357443 4266427 4000089
14052D000089K4012J17076l50322O2801L7486j14429k18257j06359K83185k76193
$$ 4000089 4024101 4141177 3790855 3853656 3891142 3776713 3558456 3452097 3735282 3459089
14042C459089r1382j95208L15992j97706K68903l8916l18834P4206r1123R3951
$$ 3459089 3367707 3172499 3488491 3290785 3559688 3520772 3201938 3276144 3185021 3278972
14032C278972p6026L51435k35931q263J0000j53347j02035j90556P6994R9543
$$ 3278972 3202946 3554381 3318450 3310187 3320187 3166840 3064805 2874249 2951243 3050786
14022C050786j32833j06558J18130J47232m49537M64922l69980l7463L26533l70126
$$ 3050786 2917953 2811395 2929525 3076757 2627220 3092142 2722162 2684699 3011232 2641106
14012B641106m01826M1823L89676J75384l59607J22403n1914j79625p9149J80425
$$ 2641106 2239280 2281103 2670779 2846163 2486556 2608959 2557045 2377420 2298271 2478696
14002B478696r4862k98447L0463L29045n42978M15861j64034Q4185J30693k09660
$$ 2478696 2383834 2085387 2115850 2444895 1901917 2317778 2153744 2237929 2368622 2158962
13992B158962O0158j67608M28086R57690K439345O597843J8065350J8167732j7529145
$$ 2158962 2219120 2051512 2479598 3437288 5876633 12474476 30539826 48707558 31178413
13983C1178413j5264608o923885k436248j743280m03131p27497m5067j22850p0629
$$ 31178413 15913805 8989920 6553672 4810392 4407261 3679764 3634697 3511847 3441218
13974C441218l40985L267k00130j38837J24140j20631k96182L99510k29952k0298
$$ 3441218 3100233 3103500 2903370 2764533 2888673 2768042 2471860 2871370 2641418 2621120
13964B621120k25748j9585n42j8852j07188J06304m90675M67517R748R0331m52638
$$ 2621120 2395372 2375787 2375245 2356393 2249205 2355509 1864834 2332351 2342099 2432430 1979792
13953A979792Q2051Q5412l69271Q7840L17474k10236K40536o29462O33387m08847
$$ 1979792 2061843 2147255 1777984 1865824 2183298 1973062 2213598 1584136 2217523 1808676
13943A808676L27449q1949j38874k07184K16340J25879m46187J29968N8648J90065
$$ 1808676 2136125 2054176 1915302 1708118 1924458 2050337 1604150 1734118 1792766 1982831
13933A982831k47934m6143j01955L87643j37563j46202L38039j17576k6478j80185
$$ 1982831 1734897 1688754 1586799 1974442 1836879 1690677 2028716 1911140 1884662 1704477
13923A704477J77081k06587J86813K32740k67401o4939m49898K65531p1733J39704
$$ 1704477 1881558 1674971 1861784 2094524 1827123 1762184 1312286 1577817 1506084 1645788
13913A645788J60602m60269J68459J30731L05627l25019r6108J93819j90068l29590
$$ 1645788 1806390 1346121 1514580 1645311 1950938 1625919 1529811 1723630 1533562 1203972
13903A203972L01154K63275m5252m87530K68926p9320j48083M47641m18872R2934
$$ 1203972 1505126 1768401 1723149 1235619 1504545 1425225 1277142 1724783 1305911 1398845
13893A398845Q3011Q4468j83683j14973l9994J47531r8614J7176P4154J17220
$$ 1398845 1481856 1566324 1382641 1267668 1227674 1375205 1276591 1293767 1367921 1485141
13883A485141k01175P8514o1080j3733J60992p9530r0158k97670J23672K15085
$$ 1485141 1283966 1362480 1301400 1287667 1448659 1369129 1278971 981301 1104973 1320058
13873A320058N8568q0200k81811K21272R6463J22866o33377M24054r8462K06597
$$ 1320058 1378626 1298426 1016615 1237887 1334350 1457216 823839 1247893 1149431 1356028
13863A356028k81945L06430L0217k75566J26864j87533L42956l12886M0143j92586
$$ 1356028 1074083 1380513 1410730 1135164 1262028 1074495 1417451 1104565 1144708 952122
13853I52122P7004O0518l6640Q00222m07694m61569N4702J92203l79637K13908
$$ 952122 1029126 1089644 1053004 1853226 1445532 983963 1038665 1230868 851231 1065139
13843A065139K45849j07530m5136N1476k1486J2734K6991m82433L58930k22255
$$ 1065139 1310988 1203458 1158322 1209798 1188312 1201046 1228037 745604 1104534 882279
13833H82279M3443J29475j72132j37345K01318k61197K37349l8218k82503O36840
$$ 882279 925722 1055197 883065 745720 947038 685841 923190 884972 602469 1239309
13823A239309k22333j83436K71003l26879J01216J78908D22907L86572O6709j40292
$$ 1239309 1016976 833540 1104543 777664 878880 1057788 422907 809479 876188 735896
13813G35896K7551J4111O7641R0644O2244l38182J79154r27J98124j53352l3941
$$ 735896 763447 777558 845199 935843 998087 659905 839059 838132 1036256 882904 848963
13802H48963j50146m1553K25219J79012E17250K56538K72556O9820D16258L69230
$$ 848963 698817 657264 882483 1061495 517250 773788 1046344 1116164 416258 785488
13792G85488J64316j45750k9047R1891r9482J97800J471k84438L7406L64937l39696
$$ 785488 949804 804054 775007 866898 767416 965216 966687 682249 719655 1084592 744896
13781G44896J23243p6441J40939j38034J50425k42140l2658N28897C88990K99608
$$ 744896 868139 791698 932637 794603 945028 702888 670230 1199127 388990 688598
13771F88598J27466k69404K04137J99796C94943M296J54204L02088k12803K27807
$$ 688598 816064 546660 750797 950593 394943 399239 553443 855531 642728 870535
13761H70535j08959j6830J16283l10322J60359Q9607J77371l58613J96006j21958
$$ 870535 761576 744746 861029 550707 711066 800673 978044 619431 815437 693479
13751F93479J41594J02875l30395j70411K50655j9237j10590K10895j68023O6440
$$ 693479 835073 937948 607553 437142 687797 668560 557970 768865 600842 667282
13741F67282J05813O99K26061q9959l94357J78259k95353J89135J98758k44946
$$ 667282 773095 773794 999855 909896 515539 693798 398445 587580 786338 541392
13731E41392J86031r3440j43307k39407J79507K63165j62225L24312D15882L55726
$$ 541392 727423 633983 490676 251269 430776 693941 531716 856028 415882 771608
13721G71608L13929m94754K08163n2606j95152n1532J04973J20484j75188j29691
$$ 771608 1085537 590783 798946 746340 551188 499656 604629 725113 549925 420234
13711D20234J80114n3224l0038J50123j97451K2829J02982O0825k60707K44807
$$ 420234 600348 547124 517086 667209 469758 492587 595569 656394 395687 640494
13701F40494H4574M67680A71995R9706O3975M1712M36055l41900n0665k5986J53318
$$ 640494 84574 552254 171995 271701 335676 377388 813443 471543 420878 394892 548210
13690E48210J01277q1102J06923q2731K35141P1033k22180l27270K48111r0301
$$ 548210 649487 568385 675308 592577 827718 898751 676571 349301 597412 507111
13680E07111r1899J73599Q6183j35838q0093O9039K01404m7850B89790O26037
$$ 507111 415212 588811 674994 539156 459063 528102 729506 681656 289790 915827
13670I15827j89940B11460M53235m142j31528H7165N19770B91341N43739j92437
$$ 915827 725887 211460 664695 660553 529025 87165 606935 291341 835080 642643
13660F42643j61908j77561K03903O9976j18064J51960A55609K56298J09785j17740
$$ 642643 480735 303174 507077 577053 458989 610949 155609 411907 521692 403952
13650D03952J52791j18190Q1304J409j80701j3593l6275A11289N28276l11910
$$ 403952 556743 438553 519857 521266 340565 326972 290697 111289 639565 327655
13640C27655P1586n5107L72895k04969k27289J00563j4532J7606l1253j64327
$$ 327655 399241 344134 717029 512060 284771 385334 370802 388408 357155 192828
13630A92828K57123J34943j37462K12405B85374J01824L5856J17359B20889M93063
$$ 192828 449951 584894 447432 659837 285374 387198 423054 540413 220889 713952
13620G13952l10943R2313k38989N8136j40464M97688m9783B80311M49191C31176
$$ 713952 403009 495322 256333 314469 174005 671693 621910 280311 729502 331176
13609E83776A10890K30764L9990J0913n8129J93576l0664o2810J38183j99615
$$ 583776 110890 341654 381644 392557 334428 528004 497340 434530 572713 373098
13599C73098F7227M38921k02963J29863O7296o5992j62065M651J45400E3480J56470
$$ 373098 67227 506148 303185 433048 500344 434352 272287 276938 422338 53480 209950
13588B09950N33201k96588A11084L32614j5309l2139N5665d4711C39071K44782
$$ 209950 743151 446563 111084 443698 428389 396250 451915 -44711 339071 583853
13578E83853J46863C31770J37202K62308k72587j98000J90365m2075j45175J78395
$$ 583853 730716 331770 468972 731280 458693 260693 451058 408983 263808 442203
13568D42203q4563j3498l6263J46156j37232J2178k2857L4580j14739K26717A15539
$$ 442203 357640 344142 307879 454035 316803 328981 306124 340704 225965 452682 115539
13556A16315M63729k34033L4303j56761J86682j44559q1776H5200L22795L02909
$$ 116315 580044 346011 380314 223553 410235 265676 183900 85200 407995 710904
13546G10904A61844K63327j90496l6994j4378J08221p2852L8771D5416M55954
$$ 710904 161844 425171 234675 197681 183303 291524 218672 257443 45416 501370
13536E01370j72370A4695M11225j1990j6319A59520M47134j19213j56411P022
$$ 501370 329000 14695 425920 413930 397611 159520 606654 487441 331030 338052
13526C38052J57102J82446B24587J93061O3348A58853N4776J66611I2644K79039
$$ 338052 495154 677600 224587 417648 480996 158853 213629 380240 92644 371683
13516C71683R1925K8530j32095a1751A16449k51K45140P9327j79291J30124O4676
$$ 371683 463608 492138 360043 -11751 116449 116198 361338 440665 261374 391498 456174
13505D56174k00715M1929R5276j17064J14101I1852l1829L48936n2531J06471
$$ 456174 255459 297388 392664 275600 389701 91852 60023 408959 356428 462899
13495D62899k01692q5180L75532k12772j29533L3118N3608a36710E82978a3518
$$ 462899 261207 176027 551559 338787 209254 242372 295980 -136710 582978 -13518
13484F80402B47511L06576k57181A14862K93085A49370n1373K94741B8650c2419
$$ 680402 247511 554087 296906 114862 407947 149370 97997 392738 28650 -32419
13473A03511K79532j04592Q3023N0286a55035C27060J02144A39600a2103C80892
$$ 103511 383043 278451 361474 411760 -155035 327060 429204 139600 -12103 380892
13462A01396k3363b04928B14377E1874A110J05113l2647L79532j55850K8503a30432
$$ 101396 78033 -204928 214377 51874 1110 106223 73576 453108 297258 325761 -130432
13450D78440o5495A25003Q7369b3783A56519J47827J15176A93429M92275A2322
$$ 478440 412945 125003 212372 -23783 156519 304346 419522 193429 685704 12322
13439A42026K3037D2798o668J05173i954C06126H8382C4837b49899A64119C5657
$$ 142026 165063 42798 36130 141303 -9954 306126 88382 34837 -249899 164119 35657
13427F6657J21885N677p151O9704G7090L10377J4285J17476B6567K69610B1335
$$ 66657 188542 194219 187068 256772 77090 387467 401752 519228 26567 296177 21335
13415g9060A94753E7630K25792r2361a13580C06517G7408J70729o5222j1166K50490
$$ -79060 194753 57630 283422 191061 -113580 306517 77408 248137 182915 171749 422239
13404D22239f1122C14994J14148g0473A48185L8571E4776L68656A63931l5325
$$ 422239 -61122 314994 429142 -70473 148185 186756 54776 423432 163931 128606
13394A28606a25169B4073K00912J95066q2736K11462j86831j20921l818M8075
$$ 128606 -125169 24073 224985 420051 337315 548777 361946 241025 237207 285282
13384B85282L1186J6167A20371b9861j58922b2285I0703G603L54464p1047r3163
$$ 285282 316468 332635 120371 -29861 -188783 -22285 90703 7603 362067 291020 197857
13373A97857m5977R4912M35220A5657K33839D5211L80998j93003N9376l2535A05345
$$ 197857 151880 246792 682012 15657 249496 45211 426209 233206 292582 260047 105345
13361I4046D4990a767D24672j84125Q1149l284O9248j53115n3359L83232A65427
$$ 94046 44990 -1767 424672 240547 321696 318412 387660 234545 181186 564418 165427
13349F4832a2899I9000P0304R737K4481K53142M2334A73930N9970J98556B03238
$$ 64832 -12899 99000 169304 179041 203522 456664 498998 173930 233900 432456 203238
13337D37422H1237L26200A76488Q919a1254C10909N252j21578F8774j7348J25035
$$ 437422 81237 407437 176488 185407 -11254 310909 316161 194583 68774 51426 176461
13326A76461i715C21922k8324P995h0966B30756p7175M9587L49692H2041K27178
$$ 176461 -9715 321922 293598 301593 -80966 230756 153581 203168 552860 82041 309219
13315C09219K5498J8336N2182E1249L49459I0250K79042A35050L0351j8049n4124
$$ 309219 334717 353053 405235 51249 400708 90250 369292 135050 165401 147352 93228
13304I3228J62796j894E5222M8720P9287m8463n7622M73347j13499G6424K27302
$$ 93228 256024 254130 55222 103942 183229 134766 77144 550491 436992 76424 303726
13293C03726A39184K4662p3136L13404I7227J10345K0929O8810b52323c7418Q47
$$ 303726 139184 163846 90710 404114 97227 207572 228501 297311 -252323 -37418 -36571
13282c6571j03438E57656k10815E254K96608k3053a83530B34939J36670A80486
$$ -36571 -140009 557656 346841 5254 301862 278809 -183530 234939 371609 180486
13271A88284p2211a9685D37021A61206c848A25175L1193n8000N7538J3343f0600
$$ 188284 116073 -19685 437021 161206 -3848 125175 156368 98368 155906 169249 -60600
13259B59938J49992c1652k8570A08088b33453b049E1339K41556O8204E960K21957
$$ 259938 409930 -31652 -60222 108088 -233453 -2049 51339 292895 361099 5960 227917
13248B27917q9642A0413K1577R3864p378i1476H8182J56388A4292N0003k7834
$$ 227917 138275 10413 31990 125854 118476 -91476 88182 244570 14292 64295 36461
13237C6461K40244O2987j45828f2586A50247L5995c0292J4096E76341b36697A05322
$$ 36461 276705 339692 193864 -62586 150247 186242 -30292 -16196 576341 -236697 105322
13225B40567C2479R9627a40061G8712J22819R5091a61421L4102a0466A96227p8683
$$ 240567 32479 132106 -140061 78712 201531 296622 -161421 -127319 -10466 196227 117544
13214A17544q081a34554f1932C04360A16636J43589A15934Q8927L20927a35003
$$ 117544 109463 -134554 -61932 304360 116636 260225 115934 204861 525788 -135003
13203A20998A3141K5794L13755a45309A88745N8800o4226J35197D0081L80154
$$ 120998 13141 38935 352690 -145309 188745 247545 183319 318516 40081 420235
13193D20235a63886d1095k3007q2301O0777J0744A31578o4031J50034j5178B6862
$$ 420235 -163886 -41095 -64102 -146403 -85626 -74882 131578 67547 217581 202403 26862
13181a72040B11631I1126J9014B9030R1647b1668D90656A33885N6158d0301Q511
$$ -172040 211631 91126 110140 29030 120677 -21668 490656 133885 190043 -40301 -31790
13170c1790A65034R3470e1359b0711B08232F7626h244k65596A29658K98607b72952
$$ -31790 165034 258504 -51359 -20711 208232 67626 -8244 -273840 129658 428265 -272952
13158A34856b76345A79859N7749a42965B76190g6416A35413j3269j2234L46103
$$ 134856 -276345 179859 237608 -142965 276190 -76416 135413 122144 109910 456013
13148D56013A71842j0305B4111g0813k16973B62815D8882a70253g4823c6353E8934
$$ 456013 171842 161537 24111 -70813 -287786 262815 48882 -170253 -74823 -36353 58934
13136B37924C6388a60024b4622H3097L78313A7027J30788j1471b56333a7654r9585
$$ 237924 36388 -160024 -24622 83097 461410 17027 147815 136344 -256333 -17654 -117239
13125a17239I8173a06034B11299L9500D4421J51338J26334m1130D7904M7295l198
$$ -117239 98173 -106034 211299 250799 44421 195759 322093 280963 47904 95199 92001
13114I2001i7087A15481J1357B7659Q1156b19509A11123J88329F920J89843i2668
$$ 92001 -97087 115481 126838 27659 108815 -219509 111123 299452 6920 196763 -92668
13102G7651k1512a1306k9761B9307f2827B17129G9602J47764o2229f1767G8376
$$ 77651 56139 -11306 -41067 29307 -62827 217129 79602 227366 165137 -61767 78376
13090C3536J71336a82990C55765a09676A10547a67226a8386p9096H9686J53697
$$ 33536 204872 -182990 355765 -109676 110547 -167226 -18386 -97482 89686 243383
13080B43383j06465j3664P9149C3029K68998j28486J34344O4715j75623F4022
$$ 243383 136918 123254 202403 33029 302027 173541 307885 372600 196977 64022
13069C464K08488i0832B75889j673h546r0080A39398a01251A96866a1202l0509
$$ 3464 211952 -90832 275889 274216 -8546 -98626 139398 -101251 196866 -11202 -41711
13058d1711D01986B4253L70359q9808B5201J39298p470k8289h57F94673b2229
$$ -41711 401986 24253 394612 304804 25201 164499 157029 128740 -857 694673 -22229
13046B15741k6392c3038B59297I0674d6102d353q6035E6278P6292l1553K15941
$$ 215741 189349 -33038 259297 90674 -46102 -4353 -90388 56278 132570 101017 316958
13035C16958D2167D328N32203c105k38876B32717F8388J04613J25714b3913j37648
$$ 316958 42167 4328 536531 -3105 -241981 232717 68388 173001 298715 -23913 -161561
13024a61561M5741C45477m8660M5359j62805b44017B78373j23914j6007J24049
$$ -161561 -115820 345477 296817 342176 179371 -244017 278373 154459 138452 262501
13014B62501P15J1742j02380L0889M8207a76413H9621K0816a8809d815C85163
$$ 262501 263216 274958 172578 203467 251674 -176413 89621 110437 -18809 -4815 385163
13002C30330a89888A37331j6065a70541I2791J28028A6291b12509q389B09184
$$ 330330 -189888 137331 121266 -170541 92791 220819 16291 -212509 -220898 209184
12991a26283j62061I3980i7775r0019k9992D33000I0957M2099f8651a6202E64480
$$ -126283 -288344 93980 -97775 -187794 -217786 433000 90957 133056 -68651 -16202 564480
12979A9311K98756c5226k7565j3726C73956J21499a47909r8657A10260i9336b0009
$$ 19311 318067 -35226 -62791 -76517 373956 495455 -147909 -246566 110260 -99336 -20009
12967C31382E1338R2010J7557R8749D2040a432F283J87833b90908r5293I5526
$$ 331382 51338 143348 160905 259654 42040 -1432 6283 194116 -290908 -386201 95526
12955C21871d4388B60372C3248J11201a07698f313j18963a6791j81749C06408
$$ 321871 -44388 260372 33248 144449 -107698 -6313 -125276 -16791 -198540 306408
12944C06213b15411a2144B05187J14702d1936a0898k0475D6743J45337A0139J19055
$$ 306213 -215411 -12144 205187 319889 -41936 -10898 -31373 46743 192080 10139 129194
12933A29194n8033p394a07102B90794o0866l323D2660b9768A24252C7333P4742
$$ 129194 71161 63767 -107102 290794 229928 226605 42660 -29768 124252 37333 112075
12922A12075B633M3008a45825H5262i3290A24830K5843k738c6819A36388b28941
$$ 112075 2633 45641 -145825 85262 -93290 124830 150673 147935 -36819 136388 -228941
12910a32750b7748B24013B2259L59636D7620a07515A58349E9170J2002d24411
$$ -132750 -27748 224013 22259 381895 47620 -107515 158349 59170 71172 -424411
12899c09176B5654K18910J04835A20065j2010b52469A70337d7273B95900D7221
$$ -309176 25654 244564 349399 120065 108055 -252469 170337 -47273 295900 47221
12888A00510K04100I0588a15596C86675e4631B65067o333D2998b08153h0252j36976
$$ 100510 304610 90588 -115596 386675 -54631 265067 258734 42998 -208153 -80252 -217228
12877b17228a1640A20940g1902A07374a24514E9326a60884E2290K15748n9116
$$ -217228 -11640 120940 -71902 107374 -124514 59326 -160884 52290 268038 208922
12867B08922n6216G1607O9466C8192a92732O8272F3005K14489G3540A4773f5410
$$ 208922 152706 71607 141073 38192 -192732 -124460 63005 277494 73540 14773 -65410
12855C61019e7139B3814J51514i6788k65437h6277I8576h2150E7636b439m4070
$$ 361019 -57139 23814 175328 -96788 -362225 -86277 98576 -82150 57636 -2439 -46509
12844d6509C1331O1455L1188L38620k06828G6256J1848M7403l6300a75662A78638
$$ -46509 31331 92786 123974 462594 255766 76256 88104 135507 99207 -175662 178638
12832A73584b8266j39639B77420m5121B1705J19329a01274c8287C33859b01688
$$ 173584 -28266 -167905 277420 232299 21705 141034 -101274 -38287 333859 -201688
12821B3200d1187j58904j38769B41013a26852e1234p1500B55186J38276A52353
$$ 23200 -41187 -200091 -338860 241013 -126852 -51234 -122734 255186 393462 152353
12810A20408Q8652p931a04028k2085A12557E230d4160l8502A22664m3976c2576
$$ 120408 209060 201129 -104028 -126113 112557 5230 -44160 -82662 122664 78688 -32576
12798E0613b8644O149j20786A40829B877a93360B40805G0888J40500j03457K95920
$$ 50613 -28644 -22495 -143281 140829 2877 -193360 240805 70888 211388 107931 403851
12787D03851B00467F794N7513g4117o0718A01727L77463j63114A51068b50891
$$ 403851 200467 6794 64307 -74117 -134835 101727 479190 316076 151068 -250891
12776A46250J07083A03970g4334C2776L4655b69164b00H4214b57517M9864g9809
$$ 146250 253333 103970 -74334 32776 67431 -269164 -200 84214 -257517 -207653 -79809
12764a76564g4249j54767E9810P6796k1697J6932h5778h095C81183B8522i1689
$$ -176564 -74249 -229016 59810 136606 114909 131841 -85778 -8095 381183 28522 -91689
12752G5935J09677f1777J4333A98134b1291k12127j12775A23877a15999E6243
$$ 75935 185612 -61777 -47444 198134 -21291 -233418 -346193 123877 -115999 56243
12741e7872n7763c5248N714l3645l783B8486K24305k7755j06247E841K30683B7314
$$ -57872 -115635 -35248 -29534 -63179 -66962 28486 252791 225036 118789 5841 236524 27314
12728A82768l47K02955e5717A2115a1106A89589b02590L5692D7767N0076J02284
$$ 182768 182421 385376 -55717 12115 -11106 189589 -202590 -166898 47767 97843 200127
12717B00127b19963f8652A46832C393J74003J2589J8918L9664J26289j17985Q6961
$$ 200127 -219963 -68652 146832 3393 177396 189985 208903 248567 374856 256871 343832
12706C43832q5954K5670J00039l8937H8940J2901Q4003c6335E59865C4503C03
$$ 343832 257878 283548 383587 344650 88940 101841 185844 -36335 559865 34503 303
12694B6409J1820a06724A08292k0242L00398b5652F4389J3719j7595j2931b2293
$$ 26409 38229 -106724 108292 88050 388448 -25652 64389 78108 60513 47582 -22293
12682A73349H786J30321a32039A75673K70948B06388A4843a22779B83585c00229
$$ 173349 8786 139107 -132039 175673 446621 206388 14843 -122779 283585 -300229
12671c32316f0348D5484K12250A04162P5707H2921c49647a09547G2637K08021
$$ -332316 -60348 45484 257734 104162 179869 82921 -349647 -109547 72637 280658
12661B80658E0636i3625j00233C28407j34436P5536m2705a39665m5989C08745
$$ 280658 50636 -93625 -193858 328407 193971 269507 226802 -139665 -185654 308745
12650A8416K90754f2541k64095a37394A82845F759K01660K06068b10693B73455
$$ 18416 309170 -62541 -326636 -137394 182845 6759 208419 414487 -210693 273455
12639a23915c4501F4696a9253A91591D4805K0058h9502A9609d2004I5345R0562
$$ -123915 -34501 64696 -19253 191591 44805 64863 -89502 19609 -42004 95345 185907
12628A85907J08502O2426P4645A54590d4614D2046N3152P5033L45236A16635D8677
$$ 185907 294409 356835 431480 154590 -44614 42046 95198 170231 515467 116635 48677
12616A7011L38838a57958B91900a14758A87074g5727E7972g9401K461i595A11110
$$ 17011 355849 -157958 291900 -114758 187074 -75727 57972 -79401 -76940 -9595 111110
12604D43561a1617A85319K1340K0720J09471a26228B28814I0635M10940D6321
$$ 443561 -11617 185319 206659 227379 336850 -126228 228814 90635 501575 46321
12593a32935m4054B77544j25143a70685A4809P6533R4625f2880F2651b37391N6287
$$ -132935 -176989 277544 152401 -170685 14809 91342 185967 -62880 62651 -237391 -181104
12582a81104e2348D46712G9934b49055B90007f3427J9385h576K278A0816a30903
$$ -181104 -52348 446712 79934 -249055 290007 -63427 -44042 -8576 -6298 10816 -130903
12570B03856a16616A22898J85975j43431G0470a18199A84624m4408P3918l2247
$$ 203856 -116616 122898 308873 165442 70470 -118199 184624 140216 214134 181887
12560A81887O3371q8503J13284f8057A73478A5370M0532c23317j02058a65077
$$ 181887 245258 156755 270039 -68057 173478 15370 55902 -323317 -425375 -165077
12549a89161j5301H5381g5944D1865h3340b6667j23072C16886a55722C42547b34944
$$ -189161 -204462 85381 -75944 41865 -83340 -26667 -149739 316886 -155722 342547 -234944
12537a08047l4799J913e9528B77557F5946K58321r0437q0174a46999H3155C9250
$$ -108047 -142846 -140933 -59528 277557 65946 324267 233830 153656 -146999 83155 39250
12525A49587C7711Q8654h5699A3570C466J97687F5741K73008A67304J31368P4927
$$ 149587 37711 126365 -85699 13570 3466 201153 65741 338749 167304 298672 373599
12514C73599b90867e5699G9936m726a09973A00753c07824h8884B5021O928i6397
$$ 373599 -290867 -55699 79936 75210 -109973 100753 -307824 -88884 25021 31949 -96397
12502G3068J50031a24265A3740a50892b9730k19544c7006R854A36304A4931a57918
$$ 73068 223099 -124265 13740 -150892 -29730 -249274 -37006 -27152 136304 14931 -157918
12490B15847a34397C69131A00686g436B5536g5727b2686A02309b3899G6785a31853
$$ 215847 -134397 369131 100686 -7436 25536 -75727 -22686 102309 -23899 76785 -131853
12478A80637G0534b1829r0714F8644a66974A48510n7838c0842C0302J73803a6446
$$ 180637 70534 -21829 -112543 68644 -166974 148510 90672 -30842 30302 204105 -16446
12466a75055P681f4505N20j12330D9854O9986C7834h4218C23000B3526Q5620a07020
$$ -175055 -167374 -64505 -63985 -176315 49854 119840 37834 -84218 323000 23526 109146 -107020
12453B95418a91860a5887A18092j515k7212f1401p8394J9292H531a74021J3324
$$ 295418 -191860 -15887 118092 116577 89365 -61401 -139795 -120503 8531 -174021 -160697
12442a60697B00608B1522b70622a05794A43886b13269A07000R059c40432C5193
$$ -160697 200608 21522 -270622 -105794 143886 -213269 107000 116059 -340432 35193
12431A68349M5946F8408K11290p140b1568p3799C6936M6475C2684a18231b0801
$$ 168349 214295 68408 279698 272558 -21568 -95367 36936 83411 32684 -118231 -20801
12419b02355e4012B3333b16932h4606B49898r4239p6408g7957k61184E0887a26620
$$ -202355 -54012 23333 -216932 -84606 249898 155659 79251 -77957 -339141 50887 -126620
12407B38405f6026j2939B2855J25240k8245a48440q3703A48852i2132K3248a1934
$$ 238405 -66026 -78965 22855 148095 119850 -148440 -232143 148852 -92132 -68884 -11934
12395b68089A94249A8735b1825B27703b13171A25487a42521B04840a07486A63009
$$ -268089 194249 18735 -21825 227703 -213171 125487 -142521 204840 -107486 163009
12384I7142A9f7084F6611O046J55058b39584C6644K15485I0925b00653A27102
$$ 97142 19 -67084 66611 72657 227715 -239584 36644 252129 90925 -200653 127102
12372b2714k8859A71061J25573j41347h312H6475J29805l0230o6473B7324J61270
$$ -22714 -51573 171061 296634 155287 -8312 86475 216280 186050 119577 27324 188594
12361A88594i0265A46080a36973r4315I532a54207H1920J84333a51244G0935e7446
$$ 188594 -90265 146080 -136973 -231288 9532 -154207 81920 266253 -151244 70935 -57446
12349f5583C7782a59871c4541j10343A60161K20457b40177F6410h5981A43357
$$ -65583 37782 -159871 -34541 -144884 160161 380618 -240177 66410 -85981 143357
12338i9992d3706B14387b2628k45047B57150b60016j1779B20134d2951C66645
$$ -99992 -43706 214387 -22628 -267675 257150 -260016 -271795 220134 -42951 366645
12327b91873E0989j1072L79903a62580A07543m9556M14792A93824O0417a28918
$$ -291873 50989 39917 419820 -162580 107543 57987 472779 193824 254241 -128918
12316c01547K2540a18216j39940A1870b23129H0322P9191e5519j05709O9939A42799
$$ -301547 -279007 -118216 -258156 11870 -223129 80322 159513 -55519 -161228 -91289 142799
12304D7329L3592a7549A31163P0751J40806D825b07027G809K28854a78955g8525
$$ 47329 80921 -17549 131163 201914 342720 4825 -207027 7809 236663 -178955 -78525
12292A62724a17144A22487J86258c2416A49034D1697g4192A60950b66838h284
$$ 162724 -117144 122487 308745 -32416 149034 41697 -74192 160950 -266838 -8284
12281I1555A6605a23756H8207J76141K3077d1578C9218K26618A3753g2537b3023
$$ 91555 16605 -123756 88207 264348 287425 -41578 39218 265836 13753 -72537 -23023
12269i4265c3745M412B23184A5402g2283k6440B25731J04950a34201B99346A6379
$$ -94265 -33745 -29333 223184 15402 -72283 -98723 225731 330681 -134201 299346 16379
12257C07767A7202b55824G527K63002b6757j01001J5357d4042l0726E3744M5047
$$ 307767 17202 -255824 7527 270529 -26757 -127758 -112401 -44042 -74768 53744 98791
12246I8791a53007d3432B8387K73344d2147m3719A2008N2513b72851B14657m336
$$ 98791 -153007 -43432 28387 301731 -42147 -85866 12008 64521 -272851 214657 210321
12235B10321e0513B16430k6198J55984j65821J3187P300R8146G6310M33110A70742
$$ 210321 -50513 216430 190232 346216 180395 193582 200882 299028 76310 509420 170742
12223A65638a81307D23210p2435L1476d096p344A40169K92946p4211k1608I3966
$$ 165638 -181307 423210 350775 382251 -4096 -11440 140169 433115 358904 337296 93966
12211B80341A38465J60477j48194j1023m1344k2032K33584A01737a49796I0702
$$ 280341 138465 298942 150748 139725 98381 76349 309933 101737 -149796 90702
12200a95242C9665K37854J45773A18938J11223m7851J00737L00292g4856A17846
$$ -195242 39665 277519 423292 118938 230161 182310 283047 583339 -74856 117846
12189A6181c4052C18570J33749A73575r939p5028J86150j21489M5607j3992Q8131
$$ 16181 -34052 318570 452319 173575 163636 88608 274758 153269 198876 184884 273015
12178B73015r3731l4869b6678j66944B13805F9922c47257A4321b2234j27075A70036
$$ 273015 179284 144415 -26678 -193622 213805 69922 -347257 14321 -22234 -149309 170036
12166B74618l353d3403i666j95311B52876E099K75499F2824Q7650a94371B2682
$$ 274618 271265 -43403 -9666 -204977 252876 5099 280598 62824 150474 -194371 22682
12154a05795C56022A03201B5698M7338L09507a53409d3862I1710d4059l91407
$$ -105795 356022 103201 25698 73036 382543 -153409 -43862 91710 -44059 -435466
12144d35466a82526B38539I5835D0697J75623A7255J93142c10582A2308K02718
$$ -435466 -182526 238539 95835 40697 216320 17255 210397 -310582 12308 215026
12134B15026L4855H7965J64938a66339C9466J68934K51420A2227J79787f2534
$$ 215026 249881 87965 252903 -166339 39466 208400 459820 12227 192014 -62534
12123C64453A12042O7291k9753b25447C7581a71762d8597B72847f9456c027q894
$$ 364453 112042 179333 149580 -225447 37581 -171762 -48597 272847 -69456 -3027 -11921
12112a1921E0794b87139E885J47406a77085B41362d6034E4630Q4301L1350J26200
$$ -11921 50794 -287139 5885 153291 -177085 241362 -46034 54630 138931 170281 296481
12101B96481D1575J08672J65363c2641A70733a79224A59045g1023B93551I7753
$$ 296481 41575 150247 315610 -32641 170733 -179224 159045 -71023 293551 97753
12090c4546G987a9408j70082A57049p0572q748L01361e8969D41116g9962H7133
$$ -34546 7987 -19408 -189490 157049 86477 77729 379090 -58969 441116 -79962 87133
12078F9388f3925H5654a25854A86573f5232h430A71248L79947R37558J4900G44267
$$ 69388 -63925 85654 -125854 186573 -65232 -8430 171248 551195 1488753 1503653 744267
12066A13620c39804A6611a14978C62418A07054e0609k1690B22765b26323G3750
$$ 113620 -339804 16611 -114978 362418 107054 -50609 -72299 222765 -226323 73750
12055C02130j08716a93469k8725f7021C98754a6456A05170L36765b1374k98774
$$ 302130 193414 -193469 -222194 -67021 398754 -16456 105170 441935 -21374 -320148
12045c20148G3321a83642g6633A84865F1746K83046A323d9053l09396B52097b50576
$$ -320148 73321 -183642 -76633 184865 61746 344792 1323 -49053 -358449 252097 -250576
12033a69967K4155k36320K4790J49953B4174L25819a60778o5486A06027g5417
$$ -169967 -145812 -382132 -357342 -207389 24174 349993 -160778 -226264 106027 -75417
12022a92756A44814K6345l0866O6889m9323a19903A87880N401D7460c18462d3446
$$ -192756 144814 171159 140293 207182 157859 -119903 187880 193281 47460 -318462 -43446
12010b73230j12305A29065n1472h1752n0847a8621n02355a00687G7612c99674
$$ -273230 -385535 129065 77593 -81752 -132599 -18621 -520976 -100687 77612 -399674
11999E9704a82033O3396N8675A59177a40606e4977A6442J21645h461l11267a22707
$$ 59704 -182033 -118637 -59962 159177 -140606 -54977 16442 138087 -8461 -319728 -122707
11987h2243A3158R4615c90120C03594D9931Q4984e4890n8428m2292G1734C0416
$$ -82243 13158 107773 -390120 303594 49931 134915 -54890 -113318 -155610 71734 30416
11975G9789f7817A06864a55628k3189f020A88190b77773C7235a65659D0155c77690
$$ 79789 -67817 106864 -155628 -178817 -6020 188190 -277773 37235 -165659 40155 -377690
11963a10198j24680e0850A88661d20255D2422b92721h4795n27404f6692n8415
$$ -110198 -234878 -50850 188661 -420255 42422 -292721 -84795 -612199 -66692 -125107
11953a25107A08374C9485j6683b81457A67749F6034L7905a91321B977i1355B90383
$$ -125107 108374 39485 22802 -281457 167749 66034 103939 -191321 2977 -91355 290383
11941i2362D5236c54345D5573b97993d6597F9265L374c82166E573J97001a40253
$$ -92362 45236 -354345 45573 -297993 -46597 69265 72639 -382166 5573 202574 -140253
11929A39819a76819I0777J83338b40688A52116K55972a4821A65324C5719h4789
$$ 139819 -176819 90777 274115 -240688 152116 408088 -14821 165324 35719 -84789
11918h127k40865I523i3384A4348K04454j07572O6219b48857E2515O4169h1984
$$ -8127 -248992 9523 -93384 14348 218802 111230 177449 -248857 52515 116684 -81984
11906b56258a6465k41638f4258B09150r7151a57812j48917A1019L33827Q072c0004
$$ -256258 -16465 -258103 -64258 209150 111999 -157812 -306729 11019 344846 352918 -30004
11894f441F5432R111Q782C5308A6366a34544J9919H4855B1502a56675B35660D8467
$$ -6441 65432 74543 83325 35308 16366 -134544 -114625 84855 21502 -156675 235660 48467
11881A10408b05911j29834A67811b65351C641a33497c3067C8520b14171J6676
$$ 110408 -205911 -335745 167811 -265351 3641 -133497 -33067 38520 -214171 -197495
11871a97495a6419o4303O362D0278J52838g823E9263b4525j59054A42220a32709
$$ -197495 -16419 -80722 -74360 40278 193116 -7823 59263 -24525 -183579 142220 -132709
11859A57064E4332g2339a06B3668a00213H1347L96807a36132F758K35921n5406
$$ 157064 54332 -72339 -106 23668 -100213 81347 478154 -136132 6758 242679 187273
11848A87273a58598A30368f7403A96693A1697J93862l3270a21256A21146n3781
$$ 187273 -158598 130368 -67403 196693 11697 205559 172289 -121256 121146 67365
11838F7365I805O032a27946F0226M1403J8946b04865d7566G5799c12411a51254
$$ 67365 9805 15837 -127946 60226 101629 120575 -204865 -47566 75799 -312411 -151254
11826A09699A9783c9199F2695M31459I8920J16331m9074b04538c3430r1730a6715
$$ 109699 19783 -39199 62695 494154 98920 215251 166177 -204538 -33430 -125160 -16715
11814b34590a05910I701b05625Q8403A67801F1987Q7277a92702A37697b37161
$$ -234590 -105910 9701 -205625 -117222 167801 61987 149264 -192702 137697 -237161
11803i0240k51214b7730o2305A73996i7173j84281A91534k6931n4340B0751K44074
$$ -90240 -341454 -27730 -90035 173996 -97173 -281454 191534 164603 110263 20751 264825
11792B64825i4703a69D6574K82315c16591A27898a57723j99687j3064A49145a52073
$$ 264825 -94703 -169 46574 328889 -316591 127898 -157723 -357410 -370474 149145 -152073
11780d040n8475N41A02587l5483a38891A18721a83012j6589B08687a32106O4298
$$ -4040 -62515 -61974 102587 67104 -138891 118721 -183012 -199601 208687 -132106 -67808
11769f7808A1146b100k01148C9270E379a55615a4626A3423M7992Q9833h351D2999
$$ -67808 11146 -2100 -203248 39270 5379 -155615 -14626 13423 61415 151248 -8351 42999
11756B12486m7499b74835B26063b9100k81667g04j76262j49763e9887q5401m7782
$$ 212486 164987 -274835 226063 -29100 -310767 -704 -176966 -326729 -59887 -145288 -193070
11745a93070B1903a00146o6877B15294p0090a35840G5224J63507c13357a5485
$$ -193070 21903 -100146 -167023 215294 145204 -135840 75224 238731 -313357 -15485
11734d5515G1572d8414j03068B01677i9787n7554p8016Q7257a5102l4761J7477
$$ -45515 71572 -48414 -151482 201677 -99787 -157341 -235357 -148100 -15102 -49863 -32386
11723c2386B30832l9453n8836k6199a65555I9455b23607N6806A9162P8627g8880
$$ -32386 230832 191379 132543 106344 -165555 99455 -223607 -166801 19162 97789 -78880
11711C25285B8003J9408P6679K5903J83036g692F4074L00463g5333C69486b22074
$$ 325285 28003 47411 124090 149993 333029 -7692 64074 364537 -75333 369486 -222074
11699d36421c7750j18978j60554A31603m7291c3861A20652E078a29520M5724E88258
$$ -436421 -37750 -156728 -317282 131603 84312 -33861 120652 5078 -129520 -83796 588258
11687A13370a77734A64245e1851A81914b12031C1985J1925K0433L77713G5357
$$ 113370 -177734 164245 -51851 181914 -212031 31985 43910 64343 442056 75357
11676c5194k26055I71e7634A03595a29167G6427d0187j4730j02161A70411J11829
$$ -35194 -261249 971 -57634 103595 -129167 76427 -40187 -54917 -157078 170411 282240
11665B82240j09530a04192G6243C3610N5755N5712K7423a47972D1317J25070E391
$$ 282240 172710 -104192 76243 33610 89365 145077 172500 -147972 41317 166387 5391
11653A41977C8443J24953a16264A92128a46642l2924C56317o9234o1523a46901
$$ 141977 38443 163396 -116264 192128 -146642 -179566 356317 287083 225560 -146901
11642b44828A83752b06381O9739r5326D1532a6789e730n2155k95557a0907j2593
$$ -244828 183752 -206381 -136642 -231968 41532 -16789 -5730 -57885 -353442 -10907 -23500
11631b3500H5065c6679F0165i0315B69686b28318B79585o1253q0766m0194c87127
$$ -23500 85065 -36679 60165 -90315 269686 -228318 279585 218332 137566 97372 -387127
11619F9785a00367B7303R649B584b50933A24522R1687A5001P1812K1109a32116
$$ 69785 -100367 27303 36952 2584 -250933 124522 216209 15001 86813 107922 -132116
11607c34229b3375B49105M1540l2846J50726a62086A03163j9257K48592D3498
$$ -334229 -23375 249105 290645 257799 408525 -162086 103163 83906 332498 43498
11596B38366E6663J06119L9796J72000a47552H6339K8156k1922J86828N5410i1148
$$ 238366 56663 162782 202578 374578 -147552 86339 114495 92573 279401 334811 -91148
11584C74607A12331K87829A24613d8916n5211j9732A29328J97779A07832K0661
$$ 374607 112331 400160 124613 -48916 -104127 -123859 129328 327107 107832 128493
11574A28493I035m428P7247J52637b97048A47470c24580f5756m939B82739j30576
$$ 128493 9035 4607 81854 234491 -297048 147470 -324580 -65756 -70695 282739 152163
11563A52163Q5379A06236b804A22682c4893a959A16143l1782J24030J84458b370
$$ 152163 237542 106236 -2804 122682 -34893 -1959 116143 84361 208391 392849 -2370
11551C2952a27247K5207A33383E1656J17914i9101A0356b37547C93682d9152B43
$$ 32952 -127247 -102040 133383 51656 169570 -99101 10356 -237547 393682 -49152 243
11539D9640j356a52713P146C54331a21544C97910a48622m6861a0370B89949o7977
$$ 49640 48284 -152713 -145567 354331 -121544 397910 -148622 -195483 -10370 289949 221972
11528B21972r1562L2748k8309K51551A61573J19651A23642J62032J41391a59047
$$ 221972 130410 163158 134849 386400 161573 281224 123642 285674 427065 -159047
11517b7661j7879b1188G8177h5415F3524J11492M9714P1080K512J74695g1747
$$ -27661 -45540 -21188 78177 -85415 63524 175016 224730 295810 298322 473017 -71747
11505c3872A22359l2457f3978j65598A81905K3079r6340a11911B5347f2974b2728
$$ -33872 122359 89902 -63978 -229576 181905 204984 108644 -111911 25347 -62974 -22728
11493A41861C2330a85100A67352c8488A02599K91133D5648J51256K01744j09818
$$ 141861 32330 -185100 167352 -38488 102599 393732 45648 196904 398648 288830
11483B88830n2963J06575L7920B7195J21566P397K61596g393A81449m0787o8160
$$ 288830 235867 342442 380362 27195 148761 156158 417754 -7393 181449 140662 72502
11472G2502d3211j5768B20480H5945L19044e8733C01097j17365c5989H0696C3728
$$ 72502 -43211 -58979 220480 85945 404989 -58733 301097 183732 -35989 80696 33728
11460A34183J00041d964l0826A7791P1642Q3578O6J43662A29435b13880D28288
$$ 134183 234224 -4964 -35790 17791 89433 173011 173077 316739 129435 -213880 428288
11448A72300b5827C29550I2054a9568l2105D4276K73118a11051A82891B9001h0633
$$ 172300 -25827 329550 92054 -19568 -51673 44276 317394 -111051 182891 29001 -80633
11436B56808b56663G4278g3426c1711A53417p0371b20794H0582K85992c8676A62730
$$ 256808 -256663 74278 -73426 -31711 153417 83046 -220794 80582 366574 -38676 162730
11424A18383b50180N4990g4197A43987a03247j91891a08250B13030c28459B38724
$$ 118383 -250180 -195190 -74197 143987 -103247 -295138 -108250 213030 -328459 238724
11413B99529F189J16437O3534i2105H5269b6924l62314a45242D6286b9783A2394
$$ 299529 6189 122626 186160 -92105 85269 -26924 -389238 -145242 46286 -29783 12394
11401G9584e7568e680j39816a0715j25056c6310j75380D4550k1917b4416n8738
$$ 79584 -57568 -5680 -145496 -10715 -135771 -36310 -211690 44550 22633 -24416 -83154
11390h3154B98496p3323b33610h5852E5636a43696A9648b32392H0298b3290C28593
$$ -83154 298496 225173 -233610 -85852 55636 -143696 19648 -232392 80298 -23290 328593
11378I1514C8911J75746A05976K62481A10748C1046e3062k73371A97967C2648
$$ 91514 38911 214657 105976 368457 110748 31046 -53062 -326433 197967 32648
11367a73453I6403c68314a26629M5527A0644a15546m7125K384C30500E8697M405
$$ -173453 96403 -368314 -126629 -81102 10644 -115546 -162671 -160287 330500 58697 63102
11356F3102b47520a7861B11650C7418N1420a22108d6120q1447A24032a35904E0301
$$ 63102 -247520 -17861 211650 37418 88838 -122108 -46120 -127567 124032 -135904 50301
11344A67337c9593H5554b66757a4835I7143i6097G0505J02977a06667M1276B88538
$$ 167337 -39593 85554 -266757 -14835 97143 -96097 70505 173482 -106667 -65391 288538
11332e8112q1527C2466a03619B26698b40873l0019B92480b80727E1602J28874
$$ -58112 -139639 32466 -103619 226698 -240873 -270892 292480 -280727 51602 180476
11322A80476a20975L3940j44724A25132J32325a16522a9191j0904C0686h0698
$$ 180476 -120975 -87035 -231759 125132 257457 -116522 -19191 -30095 30686 -80698
11311h0118n6614C469a27437j28517C4115Q662A9095J74661h1070H4200a37536
$$ -80118 -136732 3469 -127437 -255954 34115 42777 19095 193756 -81070 84200 -137536
11299E3627g0092C00323c03193J30211A66438A2555b64367A57687a72464l66771
$$ 53627 -70092 300323 -303193 -172982 166438 12555 -264367 157687 -172464 -539235
11289e39235e0183E5974b06758N9612m7875e9521A45491a32806A60886a5053A71238
$$ -539235 -50183 55974 -206758 -147146 -195021 -59521 145491 -132806 160886 -15053 171238
11277f6503F1260b8166j17015L7322j83518f1505c415C2820b99595J954a27305
$$ -66503 61260 -28166 -145181 -107859 -291377 -61505 -3415 32820 -299595 -297641 -127305
11265D0569J3724A523P4091J4504a71312H0755d3844f604k70478e1528B09718
$$ 40569 54293 1523 75614 90118 -171312 80755 -43844 -6604 -277082 -51528 209718
11253A82396a91267d1783A58886a36689j08809J14510H7117l384K06717g2100
$$ 182396 -191267 -41783 158886 -136689 -245498 -130988 87117 83733 290450 -72100
11242F0199a39909C72463A6349a20861k2207B1430e1797j9428j01668o4695C1181
$$ 60199 -139909 372463 16349 -120861 -143068 21430 -51797 -71225 -172893 -237588 31181
11230D4448a70980A69723i5449D27094F837k463a77078M3087E0483R2032A3851
$$ 44448 -170980 169723 -95449 427094 6837 4374 -177078 -133991 50483 142515 13851
11218a55622O715r5501a3922k9880k3533l32481F2225a7069k13746N4664c6318
$$ -155622 -148907 -244408 -13922 -43802 -67335 -399816 62225 -17069 -230815 -176151 -36318
11206c4561n5841B57635a05640j14560N4238K9918n8290F2845c52770a46801C09639
$$ -34561 -90402 257635 -105640 -220200 -165962 -136044 -194334 62845 -352770 -146801 309639
11194a35058j5177J3952j70541B86615i1917F0646K0764a81406g5181m7901A16932
$$ -135058 -150235 -136283 -306824 286615 -91917 60646 81410 -181406 -75181 -123082 116932
11182d24984D4216a95235c7081D1817e3885b6185q8109j19850d6199m8P843C8172
$$ -424984 44216 -195235 -37081 41817 -53885 -26185 -114294 -234144 -46199 -46247 -38404 38172
11169b07837n1416a09425n8043d9653B6655b30193r2205J38005j76271a0027I5627
$$ -207837 -259253 -109425 -167468 -49653 26655 -230193 -322398 -184393 -360664 -10027 95627
11157g8458B10368a4309B16795f6688a9332q6491j06096A21180J01077G6965i1837
$$ -78458 210368 -14309 216795 -66688 -19332 -105823 -211919 121180 222257 76965 -91837
11145b5718A14894A336J18141g1008E0892M665e14171A37258J16624A25655a53475
$$ -25718 114894 1336 119477 -71008 50892 55557 -514171 137258 253882 125655 -153475
11133d5805E8290J2853i2608B10288a08870B13512I8277H381b66534A55319G2148
$$ -45805 58290 71143 -92608 210288 -108870 213512 98277 8381 -266534 155319 72148
11121d4728J4045l60102G9303J03J52999C0068R1643c4786A07953K03229J30940
$$ -44728 -30683 -390785 79303 79406 232405 30068 121711 -34786 107953 311182 442122
11110D42122a6981l8747A69336a09139C14229K2791j03390a61316C07462f1665
$$ 442122 -16981 -55728 169336 -109139 314229 337020 233630 -161316 307462 -61665
11099A29453M9841J24415L0174h9523c7578C23721q4675E9926K51967H6294M09634
$$ 129453 179294 303709 333883 -89523 -37578 323721 239046 59926 311893 86294 495928
11088D95928j35421A41873L1324L01139r2945A4628e0480A3173a9868B93719O5030
$$ 495928 360507 141873 173197 474336 381391 14628 -50480 13173 -19868 293719 358749
11077C58749B2274J63368M3254A11168Q8239L32788k15101q4184L7470j17850
$$ 358749 22274 185642 228896 111168 199407 532195 317094 232910 270380 152530
11067A52530K42032j28359K23724A44876J37708J19206M08895j57878j20650Q5004
$$ 152530 394562 266203 489927 144876 282584 401790 810685 652807 532157 617161
11057F17161k40039J09572j5567J37396k63615L50094K87334m04600K49405j58346
$$ 617161 377122 486694 471127 608523 344908 695002 982336 577736 827141 668795
11047F68795J1127j29156J42650M69056m28251R9060m6029j22207L09562k71430
$$ 668795 679922 550766 693416 1162472 734221 833281 787252 665045 974607 703177
11037G03177k39830L56571N4186o9094k00140j66410P626L42095C13705L32020
$$ 703177 463347 819918 874104 805010 604870 438460 446086 788181 313705 645725
11027F45725k3464Q4028k19082K71210j44332K52690j89381m4028l02029M51420
$$ 645725 622261 706289 487207 758417 614085 866775 677394 633366 331337 782757
11017G82757n0723k50686J37045M36184l23477j32653J40533j36860m9709J29169
$$ 782757 732034 481348 618393 1054577 731100 598447 738980 602120 552411 681580
11007F81580N2181B14217O24504k01879n6751j17959r0773K70123M0372K67431
$$ 681580 733761 214217 838721 636842 580091 462132 371359 641482 681854 949285
10997I49285l428m52883L11945j64509l0242J92388K06290l37765J10848j36300
$$ 949285 945857 492974 804919 640410 610168 802556 1008846 671081 781929 645629
10987F45629k10936P16305k08466R7009L8115O4343N1930q1273L24321j73800
$$ 645629 434693 1150998 942532 1039541 1077656 1141999 1193929 1112656 1436977 1263177
10977A263177J88944L35387K80058L9148L34452K29538j68448L97897J4943j50688
$$ 1263177 1452121 1787508 2067566 2106714 2441166 2670704 2502256 2900153 2915096 2764408
10967B764408k86000j62158j02026n23321o3163M08031k17440j33994K62050j29264
$$ 2764408 2478408 2316250 2214224 1690903 1627740 2035771 1818331 1684337 1946387 1817123
10957A817123O431j29750L41731n88840j31613n2182L3608F19142p8369k00665
$$ 1817123 1823554 1693804 2035535 1446695 1315082 1262900 1296508 619142 540773 340108
10947C40108K28832j4682D8303O8548K96602J0976B4699K26178B5607N5779a05651
$$ 340108 568940 554258 48303 116851 413453 424429 24699 250877 25607 81386 -105651
10935c4059B52938D6626J2165K71274d5412k8323F8579J74223N5527L1536a21807
$$ -34059 252938 46626 58791 330065 -45412 -73735 68579 242802 298329 329865 -121807
10923A33700L1214N408a86825B38408C8073a09780b0635A03612a59499A0329K8213
$$ 133700 164914 170322 -186825 238408 38073 -109780 -20635 103612 -159499 10329 38542
10912C8542c7302C56288h9677J9970B99059q3939d2082j35221b8292r3804B51768
$$ 38542 -37302 356288 -89677 -69707 299059 215120 -42082 -177303 -28292 -122096 251768
10900b01840c9810J5471p5396H4089L04069F8113k8510a79939P6932A37124J11526
$$ -201840 -39810 -24339 -99735 84089 388158 68113 39603 -179939 -103007 137124 248650
10889B48650b17967O0450A05109K30371a52816F6491b74511k6257d3682A86022
$$ 248650 -217967 -157517 105109 335480 -152816 66491 -274511 -300768 -43682 186022
10878a47014e2650j47271d3708k66471M3255O1727F628Q5442K3112a1982B3329
$$ -147014 -52650 -199921 -43708 -310179 -266924 -205197 6628 92070 115182 -11982 23329
10866i9060j98343P4791B25556d86104A75550E9948K8310a45062P597E5500J73020
$$ -99060 -297403 -222612 225556 -486104 175550 59948 88258 -145062 -137465 55500 228520
10855B28520g7353r3465c0664A34683j9962C4013J67290G089b28226h0013k9876
$$ 228520 -77353 -170818 -30664 134683 114721 34013 201303 7089 -228226 -80013 -109889
10844a09889L0105B39212D3935a61027B18321K7314c0604B81403b74474G175a5307
$$ -109889 -79784 239212 43935 -161027 218321 245635 -30604 281403 -274474 7175 -15307
10832D9252f16k97533f9148A28391N0919a57711d9258l97711H6041J16438b63429
$$ 49252 -616 -298149 -69148 128391 179310 -157711 -49258 -446969 86041 202479 -263429
10820e2008j3004j86040B16711D2047c00526A07388c69842O0607F230b76688F4310
$$ -52008 -65012 -251052 216711 42047 -300526 107388 -369842 -309235 6230 -276688 64310
10808b61196P9335K1751n2185A25990e1063f792F689K9379M7313f0475j66766
$$ -261196 -181861 -160110 -212295 125990 -51063 -6792 6689 36068 83381 -60475 -227241
10797b27241B16442a20495M3609j07339H3388b16245d0351n8281k0748A85336
$$ -227241 216442 -120495 -76886 -184225 83388 -216245 -40351 -98632 -119380 185336
10786F3941J2910c70869A86934f4658B698J53209F677a8374j67086b7610j9172
$$ 63941 76851 -370869 186934 -64658 2698 155907 6677 -18374 -185460 -27610 -46782
10775d6782j13323P2847I7976B0867J12088L4583c92885E6487P7406b18052l0221
$$ -46782 -160105 -87258 97976 20867 132955 167538 -392885 56487 133893 -218052 -248273
10764b48273C7443L38444b37233E1027e804k39396N0940M2990b8389n3891J889
$$ -248273 37443 375887 -237233 51027 -5804 -245200 -194260 -151270 -28389 -82280 -80391
10753h0391A1500e6475A72721p9650i9539j66290A04827a4033j11702e6828A83676
$$ -80391 11500 -56475 172721 93071 -99539 -265829 104827 -14033 -125735 -56828 183676
10741b8902k63091j23510b786j75226J4990b5568k4680q6305p155l6756C9170
$$ -28902 -291993 -415503 -2786 -178012 -163022 -25568 -50248 -136553 -143708 -180464 39170
10729b24918L1970q6152A31396K8681c61734B43591Q7037A53847a26291A75242
$$ -224918 -192948 -279100 131396 160077 -361734 243591 330628 153847 -126291 175242
10718H5981f9094n0598j2576A5922c39914a61187P4831E1895J17214f4359f431
$$ 85981 -69094 -119692 -132268 15922 -339914 -161187 -86356 51895 169109 -64359 -6431
10706c3069p6601k84027A22204f6165A40264R4472h8958B16621o2870K3715g3180
$$ -33069 -109670 -393697 122204 -66165 140264 234736 -88958 216621 153751 177466 -73180
10694F115R9047a25646H464L1546b24314a01709F853c14179Q6980B7850c3979
$$ 6115 105162 -125646 8464 40010 -224314 -101709 6853 -314179 -227199 27850 -33979
10682f9868k00924e9992j49460B48728j18332a5022m22564b02530A90405a63934
$$ -69868 -270792 -59992 -209452 248728 130396 -15022 -437586 -202530 190405 -163934
10671F4924a19389j25177N7402B09385E0387J31449a04221n1512q710I3486K005
$$ 64924 -119389 -244566 -187164 209385 50387 181836 -104221 -155733 -164443 93486 95491
10660I5491c2266B08007g3616C23112d1473n81433a14223J0959A52678b92852
$$ 95491 -32266 208007 -73616 323112 -41473 -622906 -114223 -103264 152678 -292852
10649B38969i3269A38195a71507A30289p23b68092I1298a02219j55460L5957B7358
$$ 238969 -93269 138195 -171507 130289 129566 -268092 91298 -102219 -257679 -221722 27358
10637I3683O9933l1500b3638j63378D369J39864h7321L8940A10354A8737b76410
$$ 93683 163616 132116 -23638 -187016 4369 144233 -87321 -48381 110354 18737 -276410
10625g9F4812c72585B52140h414C1252J76352f8190B673f6126b6327m9497r0859
$$ -79 64812 -372585 252140 -8414 31252 207604 -68190 2673 -66126 -26327 -75824 -166683
10613a66683k47766j5907a48622B62627F3579e1898A6019b24998H9225c3693C48388
$$ -166683 -414449 -430356 -148622 262627 63579 -51898 16019 -224998 89225 -33693 348388
10601A13530c05517E9691J660d1616A26842o120d19584J06769a1826M163m41628
$$ 113530 -305517 59691 61351 -41616 126842 120722 -419584 -312815 -11826 -7663 -449291
10590d49291D2499K45910A36593c23768N7545J01673m0807F8635c4597e028C7062
$$ -449291 42499 288409 136593 -323768 -266223 -164550 -205357 68635 -34597 -5028 37062
10578d4462a5601A63468a03069a6246j87905C1677L45896A4083K563a24536r2271
$$ -44462 -15601 163468 -103069 -16246 -204151 31677 377573 14083 16646 -124536 -216807
10567b16807h2223j13269Q3339B4770b84419H972g3955j7619G7166a63644A25326
$$ -216807 -82223 -195492 -112153 24770 -284419 8972 -73955 -91574 77166 -163644 125326
10555B06808I2418E124c08702O7080f7654A71203B5646e3776k1111p522J17l3612
$$ 206808 92418 5124 -308702 -241622 -67654 171203 25646 -53776 -74887 -82409 -82292 -115904
10543a15904A15956e8775A99402a83920I6834k1554K30053A40980b7024j86871
$$ -115904 115956 -58775 199402 -183920 96834 75280 305333 140980 -27024 -213895
10533b13895i3219A36615j5892a47833H4802a59653I8711j1506c19535j56060
$$ -213895 -93219 136615 120723 -147833 84802 -159653 98711 87205 -319535 -475595
10523d75595b20285c6430j63511C07570q4292E3438K9088N4641o7392a53727k8287
$$ -475595 -220285 -36430 -199941 307570 223278 53438 82526 137167 69775 -153727 -182014
10512a82014L7739a1727j79956C91198A01095q774a01372A86712b67018B4280
$$ -182014 -144275 -11727 -191683 391198 101095 92321 -101372 186712 -267018 24280
10501A95242f0393A54750c39275H950a73384B4008a19483q726A85351a08617b8908
$$ 195242 -60393 154750 -339275 8950 -173384 24008 -119483 -128209 185351 -108617 -28908
10489F6164a12143F1530k9259J11841k3040a13190A13598m7958K33879p5317L08544
$$ 66164 -112143 61530 32271 144112 121072 -113190 113598 65640 299519 224202 532746
10478E32746A98968b4750B21554b79227h0442G461K72250H1219p1J03416g0299
$$ 532746 198968 -24750 221554 -279227 -80442 7461 279711 81219 81148 184564 -70299
10466A94437a30736F212Q6679a02956c6535A7941a32845l5610G2058e6502A02537
$$ 194437 -130736 6212 92891 -102956 -36535 17941 -132845 -168455 72058 -56502 102537
10454i4165q7541a7499k29161h9941I2221L41993a5628r1451k8171o8141N4261
$$ -94165 -181706 -17499 -246660 -89941 92221 434214 -15628 -107079 -135250 -203391 -149130
10443a49130g668l98646c9886A16357J06322J5147p9076c69744j69437A30092
$$ -149130 -7668 -406314 -39886 116357 222679 237826 158750 -369744 -539181 130092
10432a04272n446k4894B45259A9051K31132A5259K35334a84217Q3181n6652d1100
$$ -104272 -109718 -134612 245259 19051 250183 15259 250593 -184217 -101036 -157688 -41100
10420a53937E1255b29248D363b75922c3993j73876r3015a12959C534a77699K8771
$$ -153937 51255 -229248 4363 -275922 -33993 -207869 -300884 -112959 3534 -177699 -148928
10409a48928C0994h5898j02973d0613F4718a90424d5263j7125A3940L0418M22023
$$ -148928 30994 -85898 -188871 -40613 64718 -190424 -45263 -62388 13940 44358 466381
10398D66381b7999j21239l1130C6588N2200e5264j84063B23788B1679m130P3715
$$ 466381 -27999 -149238 -180368 36588 88788 -55264 -239327 223788 21679 17549 91264
10387I1264e8017B06971a31561j43546R5151f0058A62047n3799K33283e5515G7622
$$ 91264 -58017 206971 -131561 -275107 -179956 -60058 162047 108248 341531 -55515 77622
10375D13258j3078J1462O7518j14860r4363N6199a83883E20095j33681J59546
$$ 413258 400180 411642 479160 364300 269937 326136 -183883 520095 386414 545960
10365E45960A93907P4529K59859j24684j50751I3174C5399f9866A99639l3934
$$ 545960 193907 268436 528295 403611 252860 93174 35399 -69866 199639 165705
10355A65705J29922r732F0994J91435M18387J38672k07666B86427o8168l3621
$$ 165705 295627 285895 60994 252429 670816 809488 601822 286427 218259 184638
10345A84638K12977P8679j90100j6269M4231r0956J18585j28529m0884q2578C4787
$$ 184638 397615 476294 286194 269925 314156 223200 341785 213256 172372 89794 34787
10333A33335L76767A25710J47489a8304h151D3721M2907R6548q3425J72206a38166
$$ 133335 510102 125710 273199 -18304 -8151 43721 86628 183176 99751 271957 -138166
10321a7743e435B20783A1872f6473r4985B53634p2746K45547a21553B9036a2873
$$ -17743 -5435 220783 11872 -66473 -161458 253634 180888 426435 -121553 29036 -12873
10309A83411a58607P2097D0995a13692c1818F9219J8463c0996C68484a37428f3462
$$ 183411 -158607 -86510 40995 -113692 -31818 69219 87682 -30996 368484 -137428 -63462
10297A10964B373J95483m9422L13275A68604a23287F4900a18213K570j57015l7791
$$ 110964 2373 197856 148434 461709 168604 -123287 64900 -118213 -115643 -272658 -310449
10286c10449a29421d7363j9187D2726J56805b37535A7412h2506j14071O7739a4229
$$ -310449 -129421 -47363 -66550 42726 199531 -237535 17412 -82506 -196577 -128838 -14229
10274a42090A58751a3761j24930A53519b3745k6620r404m1203a1913k16126D95939
$$ -142090 158751 -13761 -138691 153519 -23745 -50365 -59769 -100972 -11913 -228039 495939
10262C1535d545B37378q802D0701J02290K58588j46564J24563A69453K62977H0459
$$ 31535 -4545 237378 228576 40701 142991 401579 255015 379578 169453 432430 80459
10250D11197A88818a65887A62002b1404k78712O4609K5A67708a64637e4211k693
$$ 411197 188818 -165887 162002 -21404 -300116 -235507 -235482 167708 -164637 -54211 -56904
10239e6904B7175c19628B2268a56437O7592J8702a7873q090l3978j00998o4397
$$ -56904 27175 -319628 22268 -156437 -88845 -70143 -17873 -25963 -59941 -160939 -225336
10228b25336j58589a05872A77691D8422R9445O804a31093G0489f0996A64763n154
$$ -225336 -383925 -105872 177691 48422 147867 154671 -131093 70489 -60996 164763 159609
10217A59609a8941H0475a19085o8534p6698R6441j4421C21478A48074c31176b9405
$$ 159609 -18941 80475 -119085 -187619 -264317 -167876 -182297 321478 148074 -331176 -29405
10205B10145g1370c3273h520j75716J6096q0029A7637Q5287e1224m3957k70930
$$ 210145 -71370 -33273 -8520 -184236 -168140 -248169 17637 102924 -51224 -95181 -366111
10194c66111j18110P4667a20800l9591O9314B0886b15886m1006E3435a98376C26332
$$ -366111 -484221 -409554 -120800 -160391 -91077 20886 -215886 -256892 53435 -198376 326332
10182c58278A57080J7389j8147c3925A69929b70198a30563a1200D8998a14564
$$ -358278 157080 174469 156322 -33925 169929 -270198 -130563 -11200 48998 -114564
10171A67127a1526A96103c18758p5461P7519R5130A0166b82500J36380E917c6756
$$ 167127 -11526 196103 -318758 -394219 -316700 -221570 10166 -282500 -146120 5917 -36756
10159B17193b09702L7090E6889a2082j0715F0912J00233b09137A33583c23383
$$ 217193 -209702 -172612 56889 -12082 -22797 60912 161145 -209137 133583 -323383
10148E3301a22969L6178n58143D3060J45597O9458b02143h8019B9727J03574J69691
$$ 53301 -122969 -86791 -644934 43060 188657 258115 -202143 -88019 29727 133301 302992
10137C02992a86866j00850M5753j69078A05944d51j94282h0004k68507F3647h1581
$$ 302992 -186866 -287716 -241963 -411041 105944 -451 -194733 -80004 -348511 63647 -81581
10125B71174b06345A07538a57647B16996f6769j13212B8964K12156a88997o3367
$$ 271174 -206345 107538 -157647 216996 -66769 -179981 28964 241120 -188997 -252364
10115b52364j26367I5727l4334a03400K1167o9104B46080a62888P8870B4710i35
$$ -252364 -378731 95727 61393 -103400 -82233 -151337 246080 -162888 -84018 24710 -935
10103B2875b10066B2247i8922J3997j49887a16108c3795n2877F6364J76871a05055
$$ 22875 -210066 22247 -98922 -84925 -234812 -116108 -33795 -86672 66364 243235 -105055
10091b2073k40502o9356f3323l0583b9186A0811a04025E7876m280a10192A10905
$$ -22073 -262575 -331931 -63323 -93906 -29186 10811 -104025 57876 53596 -110192 110905
10079a9243n9371q9461n5737J02603N5741k73483H2334a81409P3895j66994Q0466
$$ -19243 -78614 -168075 -223812 -121209 -65468 -338951 82334 -181409 -107514 -274508 -194042
10068a94042B00816a60761D3719h4210c217B10783A118J51569B9743J61064g4334
$$ -194042 200816 -160761 43719 -84210 -3217 210783 1118 152687 29743 190807 -74334
10056I6729J14770C0256a01706K4779l2136B4124J43484d761B75862a3884l41710
$$ 96729 211499 30256 -101706 -76927 -109063 24124 167608 -4761 275862 -13884 -355594
10045c55594a64063a1382j52011J2798B92658A45355e8289l30883I4110H477J65071
$$ -355594 -164063 -11382 -163393 -150595 292658 145355 -58289 -389172 94110 8477 173548
10034A73548B3940i278A0039b95782a5397j15995a3339k74210B73319c1059B92854
$$ 173548 23940 -9278 10039 -295782 -15397 -131392 -13339 -287549 273319 -31059 292854
10022E8713a86501A1167J60158d21549B44925c71694J33695J10870k2695k9220
$$ 58713 -186501 11167 171325 -421549 244925 -371694 -237999 -127129 -149824 -179044
10012a79044k16541g6683c3039r8439a1860k52699a7112E0078a71244k24398h1221
$$ -179044 -395585 -76683 -33039 -131478 -11860 -264559 -17112 50078 -171244 -395642 -81221
10000F9572b56300B6233c9420l04439a63648B60589e7979J6797C7268d6870m76175
$$ 69572 -256300 26233 -39420 -343859 -163648 260589 -57979 -41182 37268 -46870 -523045
9989e23045D09159B1370d5026A41660b03334J1504Q1212B1390J69201c50589J54628
$$ -523045 409159 21370 -45026 141660 -203334 -191830 -110618 21390 190591 -350589 -195961
9978a95961P869N7272B82454H1168d98364a75478P7882k13614a30846E3885J4026
$$ -195961 -188092 -130820 282454 81168 -498364 -175478 -97596 -311210 -130846 53885 67911
9967F7911J03130b4859B1518b38160A06241c8210B29309q4946a39569C8867P0521
$$ 67911 171041 -24859 21518 -238160 106241 -38210 229309 144363 -139569 38867 109388
9956A09388b04391k440J00290a0743j02272a1051k3879j22934r6862d1257n7578
$$ 109388 -204391 -206831 -106541 -10743 -113015 -11051 -34930 -157864 -254726 -41257 -98835
9945i8835l09453J27048P1355j50963b6939F4870D968a49488A60863b41960B30871
$$ -98835 -408288 -281240 -209885 -360848 -26939 64870 4968 -149488 160863 -241960 230871
9933a08702I806L7175b24209a0028E1178h3625B6105g592B93598a61339A18045
$$ -108702 9806 46981 -224209 -10028 51178 -83625 26105 -7592 293598 -161339 118045
9921b33638c9949j9728k8855o9883A02684a16463r0821o29i875j91009c4998F4694
$$ -233638 -39949 -59677 -88532 -158415 102684 -116463 -207284 -207913 -9875 -200884 -34998 64694
9908e16696c2371k15163i5014B30530b05240j3966R2105H50J16947c54682D15853
$$ -516696 -32371 -247534 -95014 230530 -205240 -219206 -127101 850 117797 -354682 415853
9896i1141q3303j53457e957A22522a82432B8975K3083K9416N955O3891d07352
$$ -91141 -174444 -327901 -5957 122522 -182432 28975 52058 81474 87429 151320 -407352
9884c0486I7919J58092b06844A79856k7013c66559P1173B763b54931G8333b33292
$$ -30486 97919 256011 -206844 179856 152843 -366559 -295386 2763 -254931 78333 -233292
9872a26127j59654B80168A17697b02786j06362a35872G8214a80979K8734A4030
$$ -126127 -285781 280168 117697 -202786 -309148 -135872 78214 -180979 -152245 14030
9861g1499A63282D249J39409C7907f8788j49661A5016a44520d3656j10246E5980
$$ -71499 163282 4249 143658 37907 -68788 -218449 15016 -144520 -43656 -153902 55980
9849a96589f3467B53207a51024e1019C5648b07359b0388C14048H9078c7336G9385
$$ -196589 -63467 253207 -151024 -51019 35648 -207359 -20388 314048 89078 -37336 79385
9837b15531G2524b84513A8888J00757i1162k69731J29755A56406f3623l04785
$$ -215531 72524 -284513 18888 119645 -91162 -360893 -231138 156406 -63623 -368408
9827c68408F8075a45356A28200e5696p7048D9087e8198M934a2440l25847A8087
$$ -368408 68075 -145356 128200 -55696 -132744 49087 -58198 -53264 -12440 -338287 18087
9815b65669g8641j75510P7305J5330b668k59885a21334C6365J53101e3029j11492
$$ -265669 -78641 -254151 -176846 -161516 -2668 -262553 -121334 36365 189466 -53029 -164521
9804a64521e7999k17652e9593A23948e02325E2047b62603O94J18318I7644g3373
$$ -164521 -57999 -275651 -59593 123948 -502325 52047 -262603 -261909 -143591 97644 -73373
9792f036j32162r5611m3769q8194J81722Q8454j35644N996R7492L3068A06991
$$ -6036 -138198 -233809 -277578 -365772 -184050 -95596 -231240 -225244 -127752 -94684 106991
9780B28198H2810e5277a7711q4645C95495b65972A16000a34767B09157n8435c55099
$$ 228198 82810 -55277 -17711 -102356 395495 -265972 116000 -134767 209157 150722 -355099
9768A84257a75432j18138I1498a44620f9406r072B01100b38213D4746k99A1719
$$ 184257 -175432 -293570 91498 -144620 -69406 -78478 201100 -238213 44746 44447 11719
9756a6400n3962C41137b77709C01137D8361K35274j6544d6885j6062m779j98333
$$ -16400 -70362 341137 -277709 301137 48361 283635 267091 -46885 -62947 -67726 -266059
9745b66059J13895A27793b91964A18666n2321g7581C40519d9889E8209a25191
$$ -266059 -152164 127793 -291964 118666 66345 -77581 340519 -49889 58209 -125191
9734c13407B0343R0729b98517D51b04025B84694b47476K9891i7362j2839A33147
$$ -313407 20343 111072 -298517 451 -204025 284694 -247476 -217585 -97362 -110201 133147
9722i8155j00673D3662b37081p3419G0085h8716A84140C6108b98044A28844a15921
$$ -98155 -198828 43662 -237081 -310500 70085 -88716 184140 36108 -298044 128844 -115921
9710C4077J5074K0862b85268B4065c00015A16058a06024A79020c2149J2039P17
$$ 34077 49151 70013 -285268 24065 -300015 116058 -106024 179020 -32149 -20110 -19393
9699a9393n8763c5095q9515A37463o3140J81071b67145Q5494e8629q8566a3578
$$ -19393 -78156 -35095 -124610 137463 74323 255394 -267145 -181651 -58629 -147195 -13578
9687a58524G6171d03665F2983B2128J46266b91301I4706a13615k0276f463m3541
$$ -158524 76171 -403665 62983 22128 168394 -291301 94706 -113615 -133891 -6463 -50004
9676e0004B32644A7121b9621A56231b55291b2903k42915F5128g0087B5403b17957
$$ -50004 232644 17121 -29621 156231 -255291 -22903 -265818 65128 -70087 25403 -217957
9664b85923A47087c30249b6837p7104c3290j11656A74899a46397A45501a7720
$$ -285923 147087 -330249 -26837 -103941 -33290 -144946 174899 -146397 145501 -17720
9653C48888g3031A51052b78620P6768B3026a53369j16831e9522H4972a14088c7377
$$ 348888 -73031 151052 -278620 -201852 23026 -153369 -270200 -59522 84972 -114088 -37377
9641c75109D1952c2198C03723b80273B9010g9261j27114k6622d8225r2200r9781
$$ -375109 41952 -32198 303723 -280273 29010 -79261 -206375 -232997 -48225 -140425 -240206
9630b40206c3704B0937g6163p4470A11316b04170h9229l8825N5166j7522o5129
$$ -240206 -33704 20937 -76163 -150633 111316 -204170 -89229 -128054 -72888 -90410 -155539
9619a55539H5637J11951m3734a65334k82498A85526b1692A53519d09748J46716
$$ -155539 85637 197588 153854 -165334 -447832 185526 -21692 153519 -409748 -263032
9609b63032h3396n6454j04230h6286D30637a86794k35922a07042j92870O8299
$$ -263032 -83396 -139850 -244080 -86286 430637 -186794 -422716 -107042 -299912 -231613
9599b31613J00974A05746i8321p7090A1113b4257j62423M5493q4010h4956p8373
$$ -231613 -130639 105746 -98321 -175411 11113 -24257 -186680 -141187 -225197 -84956 -163329
9588a63329B06286c793A4231f4459i428j16559p3862a0326D9157R0818a40936
$$ -163329 206286 -3793 14231 -64459 -9428 -125987 -199849 -10326 49157 139975 -140936
9576D4092J58277D5640K25525b53964H2316g6283C53972c14903H2713b05311B67313
$$ 44092 202369 45640 271165 -253964 82316 -76283 353972 -314903 82713 -205311 267313
9564a16400J7468B38909G7432a92556D5598Q4654b20978B59655B9342K28040e8015
$$ -116400 -98932 238909 77432 -192556 45598 130252 -220978 259655 29342 257382 -58015
9552b4340j20523c2630k7930a336j58391d5877R823A90149a31237o8702k49702
$$ -24340 -144863 -32630 -60560 -1336 -159727 -45877 -36054 190149 -131237 -199939 -449641
9541d49641A02948l0380J48455E0102A8730K9664c8350n128A59460B9562d8857
$$ -449641 102948 72568 221023 50102 18730 48394 -38350 -43478 159460 29562 -48857
9529i9332l22427i1130C8973b66992B8101e4389B68051F2337b58631p6091D6905
$$ -99332 -421759 -91130 38973 -266992 28101 -54389 268051 62337 -258631 -334722 46905
9517e34401a11836j8881A94929g8985k0230j42979R8945j35718a26801G8122c30772
$$ -534401 -111836 -130717 194929 -78985 -99215 -242194 -143249 -278967 -126801 78122 -330772
9505a0331k22437D7161d26449A57188k5527f8964B50922b40650P0068B75141f1148
$$ -10331 -232768 47161 -426449 157188 131661 -68964 250922 -240650 -170582 275141 -61148
9493A43199e5661B1538c4373j36515g724k32983g1244k73518K9378k5628f2429
$$ 143199 -55661 21538 -34373 -170888 -7724 -240707 -71244 -344762 -315384 -341012 -62429
9481h2104k0508a3372j27229j29601C15816a23590e987D128a24553C04500b89944
$$ -82104 -102612 -13372 -140601 -270202 315816 -123590 -5987 4128 -124553 304500 -289944
9469b3104j43704A6722a2186A33273a40151b7924E5286k3992a11825l01982i5046
$$ -23104 -166808 16722 -12186 133273 -140151 -27924 55286 31294 -111825 -413807 -95046
9457b11614A5815a30941d1750j6118J856j43848K3616k72581J92721i9696j60222
$$ -211614 15815 -130941 -41750 -57868 -56012 -199860 -176244 -448825 -256104 -99696 -259918
9446b59918l6799j19202f1034j37585f0980k88991I4473a2618k11665h3098C5195
$$ -259918 -296717 -415919 -61034 -198619 -60980 -349971 94473 -12618 -224283 -83098 35195
9434a05565i371k74116P3052J7514A69748a65627C10910a0769l56669A17855a27989
$$ -105565 -9371 -283487 -210435 -192921 169748 -165627 310910 -10769 -367438 117855 -127989
9422b05539b4703n1408j1682l0976A36028a93925c9053B10262J9880a15095k6492
$$ -205539 -24703 -76111 -87793 -118769 136028 -193925 -39053 210262 230142 -115095 -141587
9411a41587G4237C6929b24611B48324O9764g6228A66556a92292D0531a02108j25553
$$ -141587 74237 36929 -224611 248324 318088 -76228 166556 -192292 40531 -102108 -227661
9400b27661d5345l19617a1854B9972j185J9468c2100B33369c27159i8837m5A48041
$$ -227661 -45345 -364962 -11854 29972 28787 48255 -32100 233369 -327159 -98837 -98882 148041
9387a83482n7246I368e5170A95779a00405A76779c0818l6890B73531a9413M491
$$ -183482 -240728 9368 -55170 195779 -100405 176779 -30818 -67708 273531 -19413 -14922
9376a4922l02911C51626b89721g0147H9113b64552a16023j93429A49582a10743
$$ -14922 -317833 351626 -289721 -70147 89113 -264552 -116023 -309452 149582 -110743
9365a85552J9614g7553J7379a0582I5935A3608K3216J28140a07226D0825b93102
$$ -185552 -165938 -77553 -60174 -10582 95935 13608 36824 164964 -107226 40825 -293102
9353i6261D1578J14109b8355j74980P8822a6579j34489B97290D7516L1847E900
$$ -96261 41578 155687 -28355 -203335 -124513 -16579 -151068 297290 47516 79363 5900
9341a82503M9730b5386k50514J35849B4560c375m07597J65670a17188q3601k9424
$$ -182503 -132773 -25386 -275900 -140051 24560 -3375 -410972 -245302 -117188 -200789 -230213
9330b30213F0197N9868a12323M6211E8456a73282c4306n0032j16486A90652b33069
$$ -230213 60197 120065 -112323 -66112 58456 -173282 -34306 -84338 -200824 190652 -233069
9318A73643C8841e7021A03089a49756f3425j33212G384J75416d9054k0748j16678
$$ 173643 38841 -57021 103089 -149756 -63425 -196637 7384 182800 -49054 -69802 -186480
9307a86480B72624p6992D3769d44337f967j90202O1351d4818A34406a90623i1440
$$ -186480 272624 195632 43769 -444337 -6967 -197169 -135818 -44818 134406 -190623 -91440
9295i3465G9529g3927B47640F3893J564a54651C66441A1326b08590j86257a20697
$$ -93465 79529 -73927 247640 63893 65457 -154651 366441 11326 -208590 -394847 -120697
9283a90067H2032c5985A71408l7352K391E2881d80472h4294I1153h6335j14537
$$ -190067 82032 -35985 171408 134056 136447 52881 -480472 -84294 91153 -86335 -200872
9272b00872A18295K1872a59827C4230e1870h275F3341b34393e2465A782c34917
$$ -200872 118295 140167 -159827 34230 -51870 -8275 63341 -234393 -52465 1782 -334917
9260a77807B17645c8903o2926l47258a42684m03821D5023a10956B19570g1712
$$ -177807 217645 -38903 -101829 -449087 -142684 -546505 45023 -110956 219570 -71712
9249c28697M0900J24761j76845b5032q9902J058l62982b8991I6624C593h083n33768
$$ -328697 -287797 -163036 -339881 -25032 -114934 -113876 -476858 -28991 96624 3593 -8083 -541851
9237e41851a61359H4992e3045a6570j79640A79688j9377e670B4966J21763Q9109
$$ -541851 -161359 84992 -53045 -16570 -196210 179688 160311 -5670 24966 146729 235838
9226B35838b88296a41469A30143h4A2967h749j261j82962J3515l2990A58098e1411
$$ 235838 -288296 -141469 130143 -84 12967 -8749 -10010 -192972 -179457 -212447 158098 -51411
9213d2100G2034a52134A8223d79957a46576I9036f4904j36698a4336G4365h0155
$$ -42100 72034 -152134 18223 -479957 -146576 99036 -64904 -201602 -14336 74365 -80155
9201c14787A36053a613r3500j20678J00004l2378e8959A68345g2212l3162o4770
$$ -314787 136053 -1613 -95113 -215791 -115787 -148165 -58959 168345 -72212 -105374 -170144
9190a70144L9112B09043r4336m6984K09739a44788A37112c9127F717g9844L8780
$$ -170144 -131032 209043 114707 67723 277462 -144788 137112 -39127 6717 -79844 -41064
9179d1064B79052a07326J600c6476G8833a58242C94272A19155a91156C9126f6009
$$ -41064 279052 -107326 -105726 -36476 78833 -158242 394272 119155 -191156 39126 -66009
9167A74637b32910O164R2310B3038b79743a16813j12437A04613J60041b7188I4660
$$ 174637 -232910 -226746 -134436 23038 -279743 -116813 -229250 104613 264654 -27188 94660
9155A0859a03528G1923a43560A48107n0633a02690j22331E9074e74j89207C2622
$$ 10859 -103528 71923 -143560 148107 97474 -102690 -225021 59074 -574 -189781 32622
9143a76207q9788r291C45a31562A13449P0711b09619D20289i9162A78012A3530
$$ -176207 -265995 -275286 345 -131562 113449 184160 -209619 420289 -99162 178012 13530
9131b13706j7386f1387E1544J78021o7590b10717a0891A86035c61938a02288E45680
$$ -213706 -231092 -61387 51544 229565 161975 -210717 -10891 186035 -361938 -102288 545680
9119b87661A45576c20961A55163a13938j33081M0473O9849c9314A01736f0122
$$ -287661 145576 -320961 155163 -113938 -247019 -206546 -136697 -39314 101736 -60122
9108b96711N6775N4274L6622E2714b3674A0824j149h6725c3716q2051n842r5512
$$ -296711 -239936 -185662 -149040 52714 -23674 10824 9675 -86725 -33716 -115767 -121609 -217121
9096b17121g5568j285A18604c32036a04306k57719a31561J2690A61810Q2928c90667
$$ -217121 -75568 -76853 118604 -332036 -104306 -362025 -131561 -118871 161810 244738 -390667
9084A6674b77008i4670C0769a01145l4125A55622a7970j93288M2352m7268L9556
$$ 16674 -277008 -94670 30769 -101145 -135270 155622 -17970 -211258 -168906 -216174 -176618
9073a76618B4058b26213e2661a7271A27697m0335a57563A01718J68938e21294
$$ -176618 24058 -226213 -52661 -17271 127697 87362 -157563 101718 270656 -521294
9062a31015A79087c11317A08466P5564b00075N6574A56539J17395k2726B7739
$$ -131015 179087 -311317 108466 184030 -200075 -143501 156539 273934 251208 27739
9051b84978O3412a09569A52403k2523a76833Q1028A14726b10406K6772M010I5216
$$ -284978 -221566 -109569 152403 129880 -176833 -95805 114726 -210406 -183634 -179624 95216
9039a78329A12766M1172M7106b35322j3714j36229A42051a65940H1297c11527
$$ -178329 112766 153938 201044 -235322 -249036 -385265 142051 -165940 81297 -311527
9028b74506q5494L4935A32879b44231A83028A3632c56289J3002a30887p0304A03919
$$ -274506 -360000 -325065 132879 -244231 183028 13632 -356289 -343287 -130887 -201191 103919
9016b45387h4689k5492a8405A42259m951J8562A0834J86981h4282a0399B3296
$$ -245387 -84689 -110181 -18405 142259 137308 155870 10834 197815 -84282 -10399 23296
9004b26496A72158A9543d0268D6833f0106A03271J7113c45974a33673e1908B62744
$$ -226496 172158 19543 -40268 46833 -60106 103271 120384 -345974 -133673 -51908 262744
8992A89169a47688m082J4544b8282A2812b7094j41992L8352B13738m7315D3495
$$ 189169 -147688 -151770 -137226 -28282 12812 -27094 -169086 -130734 213738 166423 43495
8980B19587r564a05234a2249A66640i0119m76087e5721j75698Q6723A15787K2428
$$ 219587 210023 -105234 -12249 166640 -90119 -566206 -55721 -231419 -144696 115787 138215
8969A38215c22784h8123L0554j3073C4577j1340J43669f5757F004a40958O988
$$ 138215 -322784 -88123 -57569 -70642 34577 23237 166906 -65757 6004 -140958 -133970
8958a33970a0747k47829J09291G5748D986f0528Q829C03777g8183k39952b3669
$$ -133970 -10747 -258576 -149285 75748 4986 -60528 -51699 303777 -78183 -318135 -23669
8946a96038N6520j21543A39823d59204C5668a63186j1922f1652l4637a2546l8099
$$ -196038 -139518 -261061 139823 -459204 35668 -163186 -175108 -61652 -96289 -12546 -50645
8935e0645o4277F00862b58628H0280J48535a9484B0363N2704k6569M04664K70462
$$ -50645 -114922 600862 -258628 80280 228815 -19484 20363 73067 46498 451162 721624
8924G21624N11514J681475Q929644O374996F980193B609539E84943L2247A39015
$$ 721624 1233138 2914613 11844257 18219253 6980193 2609539 584943 617190 139015
8914A41336h404A6252B502b6529C25487A25750J640a2970p3481m8691K4946m7452
$$ 141336 -8404 16252 2502 -26529 325487 125750 127390 -12970 -86451 -135142 -110196 -157648
8902a57648C60265A42851C7308J3035d6906A16565A3498a98283a4363D1971b51330
$$ -157648 360265 142851 37308 50343 -46906 116565 13498 -198283 -14363 41971 -251330
8890A81566m2852b52504A78600f003n07595B68706E0492i3739n3619d2420k01254
$$ 181566 138714 -252504 178600 -6003 -513598 268706 50492 -93739 -147358 -42420 -243674
8879b43674a01213A08482c41535e9682m6652E7620d9986A86760d5799j80159l6137
$$ -243674 -101213 108482 -341535 -59682 -106334 57620 -49986 186760 -45799 -225958 -262095
8868b62095H2640J55725a286I1814N8401b76959J18784n6889h8957K4109E5873
$$ -262095 82640 238365 -1286 91814 150215 -276959 -158175 -215064 -88957 -64848 55873
8856a95445A30945d09664a38793a2737j31429A4818c60634F2142B703b5596j9199
$$ -195445 130945 -409664 -138793 -12737 -144166 14818 -360634 62142 2703 -25596 -44795
$$ [...]
##END NTUPLES=NMR SPECTRUM
##END=
