
##TITLE=UV1243_M9_1261-1207_10_7241085_w7KXbvexhu
##JCAMPDX= 6.0         $$ Bruker NMR JCAMP-DX V2.0
##DATA TYPE= NMR SPECTRUM
##DATA CLASS= NTUPLES
##ORIGIN= BRUKER
##OWNER= Administrator
$$ 1.72 TOPSPIN		Version 2.1
$$ 2013-01-19 03:00:43.601 -0500  Administrator@X
$$ Compression mode = diff/dup
##.OBSERVE FREQUENCY= 400.02188249412
##.OBSERVE NUCLEUS= ^1H
##.ACQUISITION MODE= SIMULTANEOUS (DQD)
##.ACQUISITION SCHEME= undefined
##.AVERAGES= 8
##.DIGITISER RES= 22
##SPECTROMETER/DATA SYSTEM= spect
##.PULSE SEQUENCE= zg30
##.SOLVENT NAME= COFFEE_meoh
##.SHIFT REFERENCE= INTERNAL, COFFEE_meoh, 1, 14.98509
##AUDIT TRAIL= $$ (NUMBER, WHEN, WHO, WHERE, PROCESS, VERSION, WHAT)
$$ ##TITLE= Audit trail, TOPSPIN		Version 2.1
$$ ##JCAMPDX= 5.01
$$ ##ORIGIN= Bruker BioSpin GmbH
$$ ##OWNER= Administrator
$$ $$ E:\/data/COFFEE/nmr/UV1243_M9_1261-1207_10_7241085_w7KXbvexhu/20/pdata/1/auditp.txt
$$ ##AUDIT TRAIL=  $$ (NUMBER, WHEN, WHO, WHERE, PROCESS, VERSION, WHAT)
(   1,<2013-01-19 03:00:35.523 -0500>,<Administrator>,<X>,<go>,<TOPSPIN 2.1>,
      <created by zg
	started at 2013-01-19 02:59:29.023 -0500,
	POWCHK enabled, PULCHK disabled,
       configuration hash MD5:
       86 BA 57 50 F2 9D 5C 9B 26 00 A9 28 5F 66 2E 89
       data hash MD5: 64K
       A7 7E BF 9D 30 23 6D 65 D1 B2 83 58 62 A6 7F F6>)
(   2,<2013-01-19 03:00:38.507 -0500>,<Administrator>,<X>,<proc1d>,<TOPSPIN 2.1>,
      <Start of raw data processing
       efp LB = 0 FT_mod = 6 PKNL = 1 PHC0 = 0 PHC1 = 0 SI = 32K 
       data hash MD5: 32K
       6B A4 63 18 46 0B 5B FD EE AD A3 AB 17 FC 7B 51>)
(   3,<2013-01-19 03:00:38.976 -0500>,<Administrator>,<X>,<proc1d>,<TOPSPIN 2.1>,
      <pk PHC0 = 98.29468 PHC1 = 0 
       data hash MD5: 32K
       2D D5 38 C4 32 84 7A 33 4F 9B 6A 85 06 01 20 D1>)
(   4,<2013-01-19 03:00:39.210 -0500>,<Administrator>,<X>,<proc1d>,<TOPSPIN 2.1>,
      <abs ABSG = 1 
       data hash MD5: 32K
       B8 19 F9 5D 88 6D D1 E0 CD BF DB F4 7E 0B C2 38>)
(   5,<2013-01-19 03:00:39.367 -0500>,<Administrator>,<X>,<proc1d>,<TOPSPIN 2.1>,
      <abs ABSG = 2 
       data hash MD5: 32K
       CE 8A 42 8C 63 C6 A3 76 13 BC F0 6B 01 03 80 A4>)
(   6,<2013-01-19 03:00:39.523 -0500>,<Administrator>,<X>,<proc1d>,<TOPSPIN 2.1>,
      <abs ABSG = 3 
       data hash MD5: 32K
       B6 22 D5 05 26 23 E0 D4 11 C5 56 BD 47 69 B1 A6>)
(   7,<2013-01-19 03:00:39.663 -0500>,<Administrator>,<X>,<proc1d>,<TOPSPIN 2.1>,
      <abs ABSG = 4 
       data hash MD5: 32K
       80 9F 08 DE F2 21 3F DE 19 F0 FF 13 07 A1 EB E8>)
(   8,<2013-01-19 03:00:39.804 -0500>,<Administrator>,<X>,<proc1d>,<TOPSPIN 2.1>,
      <abs ABSG = 5 
       data hash MD5: 32K
       D2 E9 A6 2D 10 55 13 1D A9 4B 4A 6E 26 34 8A AC>)
$$ ##END=
$$ 
$$ $$ hash MD5
$$ $$ 7F 79 AD DC 09 43 62 83 D2 CE 7C E8 2D 1F 89 74
##$RELAX= 
##$RELAX= 
##$RELAX= 
##$RELAX= 
##$RELAX= 
##$RELAX= 
##$RELAX= 
$$ Bruker specific parameters
$$ --------------------------
##$DU= <E:\>
##$EXPNO= 20
$$ [...]
##$TP= (0..7)
150 150 150 150 150 150 150 150
##$TP07= 0
##$TPNAME0= <>
##$TPNAME1= <>
##$TPNAME2= <>
##$TPNAME3= <>
##$TPNAME4= <>
##$TPNAME5= <>
##$TPNAME6= <>
##$TPNAME7= <>
##$TPOAL= (0..7)
0.5 0.5 0.5 0.5 0.5 0.5 0.5 0.5
##$TPOFFS= (0..7)
0 0 0 0 0 0 0 0
##$TUNHIN= 0
##$TUNHOUT= 0
##$TUNXOUT= 0
##$USERA1= <user>
##$USERA2= <user>
##$USERA3= <user>
##$USERA4= <user>
##$USERA5= <user>
##$V9= 5
##$VALIST= <valist>
##$VCLIST= <CCCCCCCCCCCCCCC>
##$VD= 0
##$VDLIST= <DDDDDDDDDDDDDDD>
##$VPLIST= <PPPPPPPPPPPPPPP>
##$VTLIST= <TTTTTTTTTTTTTTT>
##$WBST= 1024
##$WBSW= 4
##$XGAIN= (0..3)
0 0 0 0
##$XL= 0
##$YL= 0
##$YMAX_a= 630908
##$YMIN_a= -537084
##$ZGOPTNS= <>
##$ZL1= 120
##$ZL2= 120
##$ZL3= 120
##$ZL4= 120
##$ABSF1= 14.98509
##$ABSF2= -5.573092
##$ABSG= 5
##$ABSL= 3
##$ALPHA= 0
##$AQORDER= 0
##$ASSFAC= 0
##$ASSFACI= 0
##$ASSFACX= 0
##$ASSWID= 0
##$AUNMP= <proc_prof1d_extract_pilot.lims>
##$AXLEFT= 0
##$AXNAME= <>
##$AXNUC= <1H>
##$AXRIGHT= 0
##$AXTYPE= 0
##$AXUNIT= <>
##$AZFE= 0.1
##$AZFW= 0.1
##$BCFW= 0
##$BC_mod= 0
##$BYTORDP= 0
##$COROFFS= 0
##$CY= 15
##$DATMOD= 1
##$DC= 0
##$DFILT= <>
##$DTYPP= 0
##$F1P= 0
##$F2P= 0
##$FCOR= 0.5
##$FTSIZE= 32768
##$FT_mod= 6
##$GAMMA= 0
##$GB= 0
##$INTBC= 1
##$INTSCL= 1
##$ISEN= 128
##$LB= 0
##$LEV0= 0
##$LPBIN= 0
##$MAXI= 10000
##$MC2= 0
##$MEAN= 0
##$ME_mod= 0
##$MI= 0
##$NCOEF= 0
##$NC_proc= -8
##$NLEV= 6
##$NOISF1= 0
##$NOISF2= 0
##$NSP= 0
##$NTH_PI= 0
##$NZP= 0
##$OFFSET= 14.98509
##$PC= 1
##$PHC0= 98.29468
##$PHC1= 0
##$PH_mod= 1
##$PKNL= yes
##$PPARMOD= 0
##$PPDIAG= 0
##$PPIPTYP= 0
##$PPMPNUM= 2147483647
##$PPRESOL= 1
##$PSCAL= 4
##$PSIGN= 0
##$PYNMP= <proc.py>
##$REVERSE= no
##$SF= 400.02
##$SI= 32768
##$SIGF1= 0
##$SIGF2= 0
##$SINO= 400
##$SIOLD= 32768
##$SPECTYP= <>
##$SREGLST= <1H.CDCl3>
##$SSB= 0
##$STSI= 32768
##$STSR= 0
##$SW_p= 8223.68421052631
##$SYMM= 0
##$S_DEV= 0
##$TDeff= 65536
##$TDoff= 0
##$TI= <>
##$TILT= no
##$TM1= 0
##$TM2= 0
##$TOPLEV= 0
##$USERP1= <user>
##$USERP2= <user>
##$USERP3= <user>
##$USERP4= <user>
##$USERP5= <user>
##$WDW= 1
##$XDIM= 32768
##$YMAX_p= 431938730
##$YMIN_p= -703657
##$CURPLOT= <Network HP LaserJet P1505>
##$CURPRIN= <$Network HP LaserJet P1505>
##$DFORMAT= <normdp>
##$LAYOUT= <+/1D_H.xwp>
##$LFORMAT= <normlp>
##$PFORMAT= <normpl>
##$SURQMSG= 1
$$ End of Bruker specific parameters
$$ ---------------------------------
##NTUPLES= NMR SPECTRUM
##VAR_NAME=  FREQUENCY,     SPECTRUM/REAL,   SPECTRUM/IMAG
##SYMBOL=    X,             R,               I
##VAR_TYPE=  INDEPENDENT,   DEPENDENT,       DEPENDENT
##VAR_FORM=  AFFN,          ASDF,            ASDF
##VAR_DIM=   32768,         32768,           32768
##UNITS=     HZ,            ARBITRARY UNITS, ARBITRARY UNITS
##FACTOR=    0.250966925370066, 1,           1
##FIRST=     8223.43324360094, 17855,        79518
##LAST=      0,             145164,          55015
##MIN=       0,             -703657,         0
##MAX=       8223.43324360094, 431938730,    0
$$ Real data points
##PAGE= N=1
##DATA TABLE= (X++(R..R)), XYDATA
$$ [...]
19567b63625d9054j55485g7472I964J99683a79346D3367J03244K08091b16093
19556d821A34900F1212J7846L7602b13297k1948P7580P0430L0052D8789a64442
19544B593J11777a45042l7123A13605B1685P6685a08281a6817j28840G3969b84259
19532A78683a65703H8468A5174L448f2156k47323Q8165Q9414M9535J620K9540
19521e1205l5756A00272b9598k71202b7194B54781G6111a92353A04311b50170
19510A78155F702a0264H9586b73106J3431m7074B4576K8908b06178Q2183j80585
19499c04580h0865j75724M9784B13589e1658A33530b45940M0719f3344D04904
19488a27784F3287J4565j0692a08352j22679j93515O1746a19065k08961Q2359
$$ plain form
19567 -263625 -49054 -204539 -77472 9964 209647 -179346 43367 146611 354702 -216093
19556 -4821 134900 61212 79058 116660 -213297 -235245 -157665 -87235 -57183 48789 -164442
19544 2593 114370 -145042 -182165 113605 21685 98370 -108281 -16817 -145657 73969 -284259
19532 178683 -165703 88468 15174 18622 -62156 -309479 -221314 -131900 -82365 -80745 -51205
19521 -51205 -86961 100272 -29598 -300800 -27194 254781 76111 -192353 104311 -250170
19510 178155 6702 -10264 89586 -273106 -259675 -306749 24576 53484 -206178 -123995 -304580
19499 -304580 -80865 -256589 -206805 213589 -51658 133530 -245940 -205221 -63344 404904
19488 -127784 63287 77852 67160 -108352 -231031 -424546 -362800 -119065 -328026 -245667
19478b45667I9915K3426J48229G4142J07494a78766P5862j10247D4067J16719
19468A60786b16443K3549A00655a24060e0087m29598a78786a7911I6964i6621
19457a45285P1098l2918a89j34648l79413b0253l6874m25791a38565G4843C5559
19445a77936j21718J3589D1488b8882D44565A70992J62045d5614I5270b0594B2897
19433h6225F6844a84886A99675G6862l0452h3680o8943j07852A21461B0232b20936
19421D8109b86641P3503g5036o2518e4861B72232j17243I161a72726d2331R996
19410c2335J0291k50373G4216a53799A04313J8780J08671a81340j75417a51297
19399D9500f6825k1123E4201c032A2614K44930j16999a86513Q7081k96740B9846
$$ plain form
19478 -245667 99915 123341 271570 74142 181636 -178766 -102904 -213151 44067 160786
19468 160786 -216443 -192894 100655 -124060 -50087 -479685 -178786 -17911 96964 -96621
19457 -145285 -74187 -107105 -189 -134837 -514250 -20253 -57127 -482918 -138565 74843 35559
19445 -177936 -299654 -286065 41488 -28882 444565 170992 333037 -45614 95270 -20594 22897
19433 -86225 66844 -184886 199675 76862 46410 -83680 -152623 -260475 121461 20232 -220936
19421 48109 -286641 -213138 -75036 -137554 -54861 272232 154989 9161 -172726 -42331 -32335
19410 -32335 -22044 -272417 74216 -153799 104313 123093 231764 -181340 -356757 -151297
19399 49500 -66825 -87948 54201 -3032 12614 257544 140545 -186513 -99432 -396172 29846
19387C2911K85365b734E9458b32485h4806J3499a7642A93883L1086a89358D7211
19375a47185a6575j25570l020C63300d4409k27757J04332G542g2375A42998M0453
19364A83451a76743E7040J58300g1343a1472j3012r0133A0922K30427a54074I9244
19352f9606H2331Q2852g6066A60718d4648G2022f493B29988a48999A77620D7602
19340d63178a0897m29966M4241A15178d09414f1908G6596Me3668k69590a38076
19328a77941G4332B0456h0830B6345M701c6253l3376b6974A78778f6132C44654
19316f9094j74919B0713b05615n7435l4828g368I4197b16708A0959J18115c60992
19304a2642k84888B10301h8500L008E8910i4415k30511R4123A40801c29661J59120
$$ plain form
19387 32911 318276 -2734 59458 -232485 -84806 -71307 -17642 193883 224969 -189358 47211
19375 -147185 -16575 -142145 -145165 363300 -44409 -272166 -167834 7542 -72375 142998 183451
19364 183451 -176743 57040 215340 -71343 -11472 -24484 -114617 10922 241349 -154074 99244
19352 -69606 82331 165183 -76066 160718 -44648 72022 -6493 229988 -148999 177620 47602
19340 -463178 -10897 -440863 -396622 115178 -409414 -61908 76596 76600 -53668 -323258 -138076
19328 -177941 74332 20456 -80830 26345 31046 -36253 -69629 -26974 178778 -66132 344654
19316 -69094 -244013 20713 -205615 -263050 -297878 -7368 94197 -216708 10959 129074 -360992
19304 -12642 -297530 210301 -88500 -85492 58910 -94415 -324926 -230803 140801 -329661 -170541
19293a70541n4539B53256d8030j93376L1945m7019A94330A8867d9174F9051c24523
19281A23644G600K4845a38392D6929c5138r0642K700F323a93520g0535j25372
19270a95907J7013c2982A07697f1562E1838i8309k9187A60023d16942a56298P3402
19259h2896a8408H0636h1378A74135g3526B602J02317F19b48909a03651n2154
19248a55805j35402c1927q5961M5746I8971b34953h7695A15257Q430O0760a54492
19236B07323F423c0637D0727J22449b54771D87941a52744O8111K0976j07572C6670
19224A87371a54722K6930d540k35049d8249k3700I2686b02136j17858e5668R494
19213d6174j11108o03E7087j7746M8886j9236a45079H9972i9200G4011a13474
$$ plain form
19293 -170541 -225080 253256 -48030 -241406 -209461 -256480 194330 18867 -49174 69051 -324523
19281 123644 7600 32445 -138392 46929 -35138 -125780 -123080 6323 -193520 -70535 -195907
19270 -195907 -178894 -32982 107697 -61562 51838 -98309 -127496 160023 -416942 -156298 -82896
19259 -82896 -18408 80636 -81378 174135 -73526 2602 104919 619 -248909 -103651 -155805
19248 -155805 -291207 -31927 -117888 -72142 98971 -234953 -87695 115257 123687 184447 -154492
19236 207323 6423 -30637 40727 163176 -254771 487941 -152744 -84633 -63657 -171229 36670
19224 187371 -154722 -127792 -4540 -239589 -48249 -71949 92686 -202136 -319994 -55668 -46174
19213 -46174 -157282 -157885 57087 39341 88227 68991 -145079 89972 -99200 74011 -113474
19201b612l5569A42232e1629k36661a8637k93026R5716a02436b1730C0059b7949
19189a52310d3200A22936m0389l8863g6729k32483E1733b21696D4059K76779E5259
19177b77377j8464B28004b70486n2951A85193a45627C0796b37770G2900b5750
19166a86760B14057B9139b80944B8766J65142d1504a5146k10256n2698H907b83828
19154B08932b09786k84875a6894B39936H4160a74370A45299b369n2683A54739
19143A38368g6832D5340b77144r1343G1260a78816M8037I6046a60619e9527j64763
19132b24290B20185b44191f8468B22509b92125i986r9635j83442j09179C08089
19121B40776o390r7985g9343A23798G449N6798a8429A34038a20506C9643M2061
$$ plain form
19201 -2612 -38181 142232 -51629 -288290 -18637 -311663 -215947 -102436 -21730 30059 -27949
19189 -152310 -43200 122936 82547 43684 -76729 -309212 51733 -221696 44059 320838 55259
19177 -277377 -295841 228004 -270486 -323437 185193 -145627 30796 -237770 72900 -25750
19166 -186760 214057 29139 -280944 28766 193908 -41504 -15146 -225402 -278100 8907 -283828
19154 208932 -209786 -494661 -16894 239936 84160 -174370 145299 -2369 -55052 154739
19143 138368 -76832 45340 -277144 -368487 71260 -178816 -130779 96046 -160619 -59527 -224290
19132 -224290 220185 -244191 -68468 222509 -292125 -9986 -109621 -293063 -402242 308089
19121 240776 234386 136401 -79343 123798 7449 64247 -18429 134038 -120506 39643 81704
19110H1704g8854C64680a11484j8968M8110A20146b31855G4566b02136E7321a18224
19098d1900B09957C1464a20954K8821A93263o4430l1217b61998F5006a61755E7856
19086b55185h3375h435A45707l0703a79315A86490b14957l3676h107j84727r8021
19075b90855d5444k90815J63702k6431k5063D6813O3374J4837d3874l31785d4318
19063c38072F9015A4016J29627a298m7291m631j31980k0939B463a58973l11011
19052d69984H2992c47499J32342L8388k19369B3879A1416r42a20454A37519f1247
19040a66136B10527a16462L3288A24529b9833r601A81022K0673E0813J01314Q1173
19029B33300C4903b35639b3484k49346a04975A94085c6921B03656a06327A53500
$$ plain form
19110 81704 -78854 364680 -111484 -130452 -82342 120146 -231855 74566 -202136 57321 -118224
19098 -41900 209957 31464 -120954 -92133 193263 128833 97616 -261998 65006 -161755 57856
19086 -255185 -83375 -8435 145707 115004 -179315 186490 -214957 -248633 -8107 -192834 -290855
19075 -290855 -45444 -336259 -172557 -198988 -224051 46813 110187 125024 -43874 -375659 -44318
19063 -338072 69015 14016 143643 -1298 -48589 -53220 -185200 -206139 2463 -158973 -469984
19052 -469984 82992 -347499 -215157 -176769 -396138 23879 11416 10474 -120454 137519 -61247
19040 -166136 210527 -116462 -83174 124529 -29833 -39434 181022 201695 50813 152127 233300
19029 233300 34903 -235639 -23484 -272830 -104975 194085 -36921 203656 -106327 153500
19018A15118C4177O4655d2794I3691B3160b2529I8054b32375A1992b90483e1076
19006b49656P9908M3182p4794A36648I012J23553a08875p2489F6223k836a83171
18994e3571k99185A90078c19458a43836A264R4082O8577b25520a11447p2051l42790
18983e26288C28963a94995i4438A54325l2196b6991k3784j67557g4321J9172l35133
18972c90282a72868D47566B17140A2821O4709E554e0888E3301K9837J50634c8810
18960A00184f3578o0023N0982D7437b75804J4567j481H9917a23189Q169j11819
18949b26839j00465e5387H5479R6044a14812E9072h3676C5560J73251b25266c9670
18937g5361A51833a10827j30227B27797b7269k42824H4448J00455l8504b85851
$$ plain form
19018 115118 34177 98832 -42794 93691 23160 -22529 98054 -232375 11992 -290483 -51076
19006 -249656 -169748 -126566 -201360 136648 9012 132565 -108875 -181364 66223 63387 -183171
18994 -53571 -352756 190078 -319458 -143836 1264 95346 163923 -225520 -111447 -183498 -526288
18983 -526288 328963 -194995 -94438 154325 122129 -26991 -50775 -218332 -74321 -55149 -390282
18972 -390282 -172868 447566 217140 12821 77530 5554 -50888 53301 83138 233772 -38810
18960 100184 -63578 -123601 -72619 47437 -275804 -261237 -262718 89917 -123189 -115020 -226839
18949 -226839 -327304 -55387 85479 181523 -114812 59072 -83676 35560 208811 -225266 -39670
18937 -75361 151833 -110827 -241054 227797 -27269 -270093 84448 184903 146399 -285851
18926G1726b98189a43541A48735b11052F1723Q1793g6073r9685N0618d8527C60786
18914A2800P7940C7678O9739b08904B00516a79429j28553J33100B8004K5443a94720
18902C6832a78477C58979a13495F4980k107k4259g002k68302J1558a16555o0937
18891a77492h3002C2836J95699g5494k63253D2528i0734m4243j43843J20563B8484
18879e6239j9786m1709b2314j24391q3569a5799p3549L351r0994G9973C0703Q2681
18867A13384C2880h6087j86010b7891j06103A02363a5443J894p3410A41478a90644
18855a2665l406C27521b93223g5837H7316a10232n7571N5135A65407M7512b17968
18843D0043J1154b26459B2597J41421D9721h8462j06290O42A01163c74265g5552
$$ plain form
18926 71726 -298189 -143541 148735 -211052 61723 143516 -76073 -175758 -125140 -48527 360786
18914 12800 90740 37678 107417 -208904 200516 -179429 -307982 -174882 28004 53447 -194720
18902 36832 -178477 358979 -113495 64980 62873 38614 -7002 -275304 -263746 -116555 -177492
18891 -177492 -83002 32836 228535 -75494 -338747 42528 -90734 -134977 -278820 -158257 28484
18879 -56239 -76025 -117734 -22314 -146705 -230274 -15799 -89348 -85997 -176991 79973 30703 113384
18867 113384 32880 -86087 -272097 -27891 -133994 102363 -15443 -13549 -86959 141478 -190644
18855 -12665 -16071 327521 -293223 -75837 87316 -110232 -167803 -112668 165407 212919 -217968
18843 40043 51197 -226459 22597 164018 49721 -88462 -194752 -194110 101163 -374265 -75552
18831b84970k77225I1474b86838e4085b3016p0598D6088j8109b3354j17212K208
18820a38358B85318A37634M809b50602B56511E1922g7203B9399l673L14564j50163
18809A90127I476J42503j632B1439d6286A97906c7329G0716J20373a53169e0862
18797b31510R9585j67671k9693g9678l21434J51546A0400a20011j01791J595f6910
18785d8363l99475A05723c40925h6522j1750A56415o3527a36026g815H5668a97554
18773A99933i1342E9214g795n2358H6508b0362j02433a6247k29818C03685D2414
18761C67059a7783j2822k35358K4172B82807a19551n5717A02546O5526q2951b14862
18749a5325q1510I6546a5918A08540J31686E5071k4522a50316B84180a77827D7279
$$ plain form
18831 -284970 -562195 91474 -286838 -54085 -23016 -93614 46088 27979 -23354 -140566 -138358
18820 -138358 285318 137634 142443 -250602 256511 51922 -77203 29399 25726 340290 190127
18809 190127 9476 151979 150347 21439 -46286 197906 -37329 70716 191089 -153169 -50862
18797 -231510 -131925 -299596 -329289 -79678 -401112 -249566 10400 -120011 -221802 -220207 -66910
18785 -48363 -447838 105723 -340925 -86522 -98272 156415 92888 -136026 -7815 85668 -197554
18773 199933 -91342 59214 -7795 -60153 86508 -20362 -122795 -16247 -246065 303685 42414
18761 367059 -17783 -30605 -265963 -241791 282807 -119551 -175268 102546 168072 85121 -214862
18749 -15325 -96835 96546 -15918 108540 240226 55071 30549 -150316 284180 -177827 47279
18737b75115A4653f7931j07743B36015G251b50631D8686c20778a39209E6093e0899
18725B97296a97817r8969A89613E4171l798c42316f0291j79059K0863r9615A03801
18713g1921o0668G3995g9858A57923b08212A13072k0853D3868b51424D4788b8321
18701a38398B10604b53299K4167O1281B42541E7081c4252j97646A60431f1322
18690c39699a50346a6770A1847c07315A35342N7718i829j731k33046e2009l9746
18679i1755B17289b5751j02300j08243A22686J07650b35251f4363k52191i0410
18668b28229B0314M23804I6697N1768d20091J08972I3093i2255k32279j60924
18658d85458a94929d6108Q879A92815P3140d9524p5926a8928a74E7269i0233a3379
$$ plain form
18737 -275115 14653 -67931 -175674 236015 7251 -250631 48686 -320778 -139209 56093 -50899
18725 297296 -197817 -296786 189613 54171 50373 -342316 -60291 -239350 -218487 -318102 103801
18713 -71921 -132589 73995 -79858 157923 -208212 113072 92219 43868 -251424 44788 -28321
18701 -138398 210604 -253299 -229132 -167851 242541 57081 -34252 -231898 160431 -61322
18690 -339699 -150346 -16770 11847 -307315 135342 193060 -9829 -11560 -244606 -52009 -91755
18679 -91755 217289 -25751 -128051 -236294 122686 230336 -235251 -64363 -316554 -90410
18668 -228229 20314 444118 96697 148465 -420091 -311119 93093 -92255 -324534 -485458
18658 -485458 -194929 -46108 -37229 192815 265955 -49524 -125450 -18928 -174 57269 -90233 -13379
18645H8263a17986j28328n7828j27198C28601C3279a87074B5021J30971Q5875
18635B41867E7183j1108K50436F5919h5320C27967C2019b54570e0341j05701o1804
18624b17846b8331r1997j4481j90805C43799A04463G014J08341b32021A49000
18613A7894O043i1437O19j26943B36422a37104E911J6394J8281Q2316a24455G1039
18600a39997B21068c34316a02968c0519k2092n3351j327l232N141G5504d5871
18588a66968O3902p4317m0383K0515g3773B7148b05858h3567j29434N9315b9981
18576I0769h2162p5677O5667H3905R44k4475a80884j7546C6073b28217i1523A40035
18563b77331f3787J8033j31346j7409A1586a42270C8215b21879i2594A22389a05543
$$ plain form
18645 88263 -117986 -246314 -304142 -431340 328601 33279 -187074 25021 155992 241867
18635 241867 57183 46075 296511 65919 -85320 327967 32019 -254570 -50341 -156042 -217846
18624 -217846 -28331 -120328 -134809 -325614 343799 104463 7014 115355 -232021 149000
18613 17894 23937 -91437 -90818 -217761 236422 -137104 5911 22305 40586 122902 -124455 71039
18600 -139997 221068 -334316 -102968 -30519 -52611 -105962 -107289 -110521 -105380 75504 -45871
18588 -166968 -103066 -177383 -217766 -197251 -73773 27148 -205858 -83567 -213001 -153686 -29981
18576 90769 -82162 -157839 -92172 83905 84849 60374 -180884 -198430 36073 -228217 -91523 140035
18563 -277331 -63787 -45754 -177100 -194509 11586 -142270 38215 -221879 -92594 122389 -105543
18551I6033i7296k46284a22096b1382A76777a04003r9687h6058A75713a24779
18540a9430p3739d395B34525d41879A82651a78451h8931L7356j59924j6855f8132
18528a24562l24331J87361A40682f0065A82121A5319a19474m269p0873j82815
18518c77431A11119d0530E0791N9508c41201f3021F8248a0469j55982g454j28730
18507a36184j55629K0640N9197M2013J3728C82075f1419j75009J17934e0425j84687
18496b35112A63642b82704b2801C9699b59988O5648k7848a7007C72539a3657I5026
18484A22201a5789j71426c257k7117k05875n9386n3414D31363k07104c89531i547
18472f5268A20816a75214a5395j67103A0024c45228A32644C2880g4182k01111
$$ plain form
18551 96033 -97296 -343580 -122096 -21382 176777 -104003 -203690 -86058 175713 -124779
18540 -19430 -93169 -4395 234525 -441879 182651 -178451 -88931 -51575 -211499 -228354 -68132
18528 -124562 -448893 -261532 140682 -60065 182121 15319 -119474 -123743 -194616 -377431
18518 -377431 111119 -40530 50791 110299 -341201 -63021 68248 -10469 -166451 -7454 -136184
18507 -136184 -291813 -271173 -211976 -169963 -156235 382075 -61419 -236428 -118494 -50425 -235112
18496 -235112 163642 -282704 -22801 39699 -259988 -194340 -222188 -17007 372539 -13657 95026
18484 122201 -15789 -187215 -3257 -30374 -236249 -295635 -349049 431363 224259 -389531 -9547
18472 -65268 120816 -175214 -15395 -182498 10024 -345228 132644 32880 -74182 -275293
18462b75293j8548B49068r4928b89574j5282C7748J72480a39278A11142a76892
18451a34966j90164Q9522j42293D868a51354O5429A17538C2339J84993E7027k1398
18440C5629A0028c77396a14009G6748J00292J28781i4209j96923j39608a5695
18429h8641c566B03625g1612B14168M9590a4664I6317a86119A59099J12089a9418
18417b64204B0736b08283k63751E5065J64005i9536C8277b01273j2612q0243A47947
18405b49018a16724D25658B4239N7098a6127A14515E0331K37080b83354c4328
18394c33008d101j81119Q3849B50311F4127b13726A19943K4238b36113F1784k2927
18383C8857b37403a5787C41334a80241E6496R9377J15053B7622a26035A76690
$$ plain form
18462 -275293 -293841 249068 154140 -289574 -304856 37748 210228 -139278 111142 -176892
18451 -134966 -325130 -235608 -377901 4868 -151354 -85925 117538 32339 217332 57027 35629
18440 35629 10028 -377396 -114009 76748 177040 305821 -94209 -291132 -430740 -15695
18429 -88641 -3566 203625 -71612 214168 263758 -14664 96317 -186119 159099 271188 -19418
18417 -264204 20736 -208283 -472034 55065 219070 -99536 38277 -201273 -213885 -294128 147947
18405 -249018 -116724 425658 24239 81337 -16127 114515 50331 287411 -283354 -34328
18394 -333008 -4101 -185220 -101371 250311 64127 -213726 119943 144181 -236113 61784 38857
18383 38857 -237403 -15787 341334 -180241 56496 155873 270926 27622 -126035 176690
18372A01395c7672A3106J39940F0052R8495g526l9990l1097A17751D3268n220
18361C8048L04891A6663i1866A49223h9277B2505J8902M4505f2420I1227c0648
18349C99884A43184a57995M7855j99116E7496Q3608M9862c0381l16354I4917m6474
18338D8443N8910c49199a08453G0862A3575a02787j31473A60249a2146m5929j74556
18327b32631g4726p3607B82156d899k68263C3476L7629a60696A21208M8865C6678
18315c39088g39m5480j58522f6061H1222J18633I0944b05416a01565B9795K63192
18304B92987i129k85337B00607d07658a18634A56239g5857B3477c9269A41451
18293a56230n749j4348A42931a21977c7859n0372B02308a10156C69049j76316
$$ plain form
18372 101395 -37672 13106 153046 60052 158547 -7526 -47516 -78613 117751 43268 38048
18361 38048 342939 16663 -91866 149223 -89277 22505 41407 85912 -62420 91227 -30648
18349 399884 143184 -157995 -110140 -309256 57496 141104 190966 -30381 -346735 94917 48443
18338 48443 107353 -349199 -108453 70862 13575 -102787 -234260 160249 -12146 -58075 -232631
18327 -232631 -74726 -148333 282156 -4899 -273162 33476 71105 -160696 121208 170073 36678
18315 -339088 -739 -46219 -204741 -66061 81222 199855 90944 -205416 -101565 29795 292987
18304 292987 -9129 -294466 200607 -407658 -118634 156239 -75857 23477 -39269 141451
18293 -156230 -161979 -176327 142931 -121977 -37859 -88231 202308 -110156 369049 192733
18283A92733p0643b90587A65988c8802k66177Q9585k94A44647i0440p2105A24324
18271a80848B37454f252m35641A67618C7503d25052e4540K0699k13278o5466J52743
18260a59842O0276B02563P7577A1027R3977b45312G5848a33046j19622K4875i0972
18248A95370a02412B80587H2583a32355m3489p8043B27614i9291A59864G1034
18237A15702d3039A19566J55387c06723J38266C047a89480q5128R597A03286f741
18225g8720j2698A43622b9401A21478k3716b44633H4120a9310A21595a78563g9922
18213b45156A7145c34205i3862J8253G2604f4934A33477J0267c49084A5886O8989
18202H4875p023a53444H556b96756a09982l37982A11694b12280A6991e32973B66984
$$ plain form
18283 192733 122090 -290587 165988 -38802 -304979 -215394 -215688 144647 -90440 -162545 124324
18271 -180848 237454 -6252 -441893 167618 37503 -425052 -54540 -33841 -247119 -312585 -159842
18260 -159842 -99566 202563 280140 11027 105004 -245312 75848 -133046 -252668 -227793 -90972
18248 195370 -102412 280587 82583 -132355 -175844 -253887 227614 -99291 159864 71034
18237 115702 -43039 119566 274953 -306723 -168457 3047 -189480 -274608 -265011 103286 -6741
18225 -78720 -91418 143622 -29401 121478 97762 -244633 84120 -19310 121595 -178563 -79922
18213 -245156 17145 -334205 -93862 -75609 72604 -64934 133477 143744 -349084 15886 84875
18202 84875 77852 -153444 8556 -296756 -109982 -447964 111694 -212280 16991 -532973 266984
18190A67618c2368A53771J89346j8351a41538B5838b62799a8201C6132L02073
18180C38205D1192a87653q8039e5788C30382a60229A42769a96524j31986h8703
18169a71486l8474P8197e1463G0256c6374j24188j85319d0298r3961j68052K0115
18158b82196j90598A52184F8625e2596a532j22297I6434g0117K6676B7418g0874
18146b99272B91236H9878J69732j05272B4689J97220b0653l2500C8202h3052J0527
18135g2525c5430F6364h3192j65740a11819J9435A28455n4868a26519A27008J33538
18124B60546g0397E4817b8690b18o2334j44813P6612A73523p4264O6523O119E7929
18111B8162A1040L9214a71168a1469C3901R0529e36777d2516k27116Q3240j39406
$$ plain form
18190 167618 -32368 153771 343117 324766 -141538 25838 -262799 -18201 36132 338205
18180 338205 41192 -187653 -275692 -55788 330382 -160229 142769 -196524 -328510 -88703
18169 -171486 -209960 -131763 -51463 70256 -36374 -160562 -345881 -40298 -134259 -302311 -282196
18158 -282196 -472794 152184 68625 -52596 -1532 -123829 96434 -70117 -43441 27418 -70874
18146 -299272 291236 89878 259610 154338 24689 221909 -20653 -53153 38202 -83052 -72525
18135 -72525 -35430 66364 -83192 -248932 -111819 -92384 128455 73587 -126519 127008 260546
18124 260546 -70397 54817 -28690 -218 -62552 -207365 -130753 173523 99259 165782 171901 57929
18111 28162 11040 50254 -171168 -11469 33901 124430 -536777 -42516 -269632 -186392 -325798
18100c25798A42658B9552L69191A56320o0646a20879A88087i7880k65878a56758
18089a92732k3068n3793A0283K8980a2819A3832K8649b03767j49729A07163R271
18078A16434a15845M0381j16350D9573a99760D18092b35678a06871B7086C988
18067c16955a0117A48452b71300H0801b45772A17736I491a28870A04262a73374
18056c8374F0537a35824e7304q8117J9984c4018q4906B593c23633a23724A34781
18044a213A90134b63655I5989c9872C6764K55641j38184J55973F3463J2647a66641
18032A6173h9776l47284c1695B45873b64361a22600A15869a33860D7013F571N6267
18021F2838L33255A22118d36842F9676c56764a36752m104B4487c31089A73970
$$ plain form
18100 -325798 142658 29552 398743 156320 95674 -120879 188087 -97880 -363758 -156758
18089 -192732 -215800 -269593 10283 39263 -12819 13832 42481 -203767 -353496 107163 116434
18078 116434 -115845 -75464 -191814 49573 -199760 418092 -235678 -106871 27086 3988
18067 -316955 -10117 148452 -271300 80801 -245772 117736 9491 -128870 104262 -173374
18056 -38374 60537 -135824 -57304 -145421 -125437 -34018 -118924 2593 -323633 -123724 134781
18044 -1213 190134 -263655 95989 -39872 36764 292405 154221 310194 63463 76110 -166641
18032 16173 -89776 -437060 -31695 245873 -264361 -122600 115869 -133860 47013 6571 62838
18021 62838 396093 122118 -436842 69676 -356764 -136752 -140856 24487 -331089 173970
18010a02589q420A17758f8414j27913A05891h9109r4112h3460a7364E5429e0031
17998a73765A5767a05126A53914Q4979a02535j00322c5359A91285p0956g6856
17987C05328d15313b1932J0314A71564C6626J65106a25682A43711c560A7049M0403
17976E7452K37981h5465A83727f2388A40854o6405K540h1206q0401B87611j16322
17965A71289d9496C32888k0285a60541c9484A0845a6514q9976m49776i4435n7470
17954a51905a5151k23467R1304B31398K4284l5749b13845A66691J79796g1331
17943A96509b16464d9059j02826j49597A75486O7457c75880a59099K1882j8234
17933a55451B47950D4710b8764B59059A21122K88008a82351f3887C12440A35162
$$ plain form
18010 -102589 -111009 117758 -68414 -196327 105891 -89109 -183221 -83460 -17364 55429 -50031
17998 -173765 15767 -105126 153914 238893 -102535 -202857 -35359 191285 120329 -76856
17987 305328 -415313 -21932 -11618 171564 36626 201732 -125682 143711 -3560 17049 57452
17976 57452 295433 -85465 183727 -62388 140854 74449 76989 -81206 -161607 287611 171289
17965 171289 -49496 332888 312603 -160541 -39484 10845 -16514 -106490 -556266 -94435 -151905
17954 -151905 -15151 -238618 -147314 231398 255682 219933 -213845 166691 346487 -71331
17943 196509 -216464 -49059 -151885 -301482 175486 242943 -375880 -159099 -137217 -155451
17933 -155451 247950 44710 -28764 259059 121122 409130 -182351 -63887 312440 135162
17922A99741C1711a50322j3803j58665i7020J2231B26573Q4144H3792b27080A46183
17910c66767J64855A98824a21229A79871c9333C26546a085m50024K02424B42608
17899a82735B9637a39B11863J15303a70491j74453A07839b79343E0254d5086A6993
17887G546R1533L0848b65652J15976B36983A11836d1272k20380O0508A33229e324
17875A62730O4595m9299Q9314G66i4321F1599P9704C2430b02802G984L8640b41665
17862b98189A82012E1830a05220c406A31491o1751J53598g5346L0407a7429p0988
17851h8417H0504a80639C05112b53415m1282D6678J1032J25893j4649c81246A40765
17839A17784K26547A07079J72061b40270g7434q4237E0946O8660a06201I9480
$$ plain form
17922 199741 31711 -150322 -164125 -322790 -97020 -84789 226573 310717 83792 -227080 146183
17910 -366767 -201912 198824 -121229 179871 -39333 326546 -1085 -451109 -248685 242608
17899 -182735 29637 -139 211863 327166 -170491 -344944 107839 -279343 50254 -45086 16993
17887 7546 99079 129927 -265652 -149676 236983 111836 -41272 -261652 -201144 133229 -5324
17875 162730 227325 178026 267340 766 -94321 61599 141303 32430 -202802 7984 46624 -241665
17862 -298189 182012 51830 -105220 -3406 131491 69740 223338 -75346 -44939 -17429 -88417
17851 -88417 80504 -180639 305112 -253415 -294697 46678 57710 183603 168954 -381246 140765
17839 117784 344331 107079 279140 -240270 -77434 -161671 50946 119606 -106201 99480
17828A88359a23534j4951j46415a13584C2744R8853b44927m856A1237a19057M7907
17817g1150a6755f908j63993B41290A9603f8214j58787o2522I7805c8171j43336
17806a81507B7520c10091J46216A43806J8145a29879A89078L38947k30731d0756
17795H4309e1506A37901a51662c5883A10859B1250K50559i1583E9728K68126d2149
17783a7328A76963p1207K55831b52295A02418b42454J07883l4283r3001a00414
17772b16087d6144A45411R1137k3181q3333b61093g5492K3676o095a0789A85779
17760C24588a17525c5804m7311E6903a50852q4856I4152Q0269h9886A02037g9604
17748F437a67886A57995f2320C24401b41735O3472B29163i0566M2507C8017O090
$$ plain form
17828 188359 -123534 -138485 -284900 -113584 32744 131597 -244927 -249783 11237 -119057 -71150
17817 -71150 -16755 -6908 -170901 241290 19603 -68214 -227001 -289523 97805 -38171 -181507
17806 -181507 27520 -310091 -163875 143806 161951 -129879 189078 528025 297294 -40756
17795 84309 -51506 137901 -151662 -35883 110859 21250 271809 -91583 59728 327854 -42149
17783 -17328 176963 105756 361587 -252295 102418 -242454 -134571 -168854 -261855 -100414
17772 -216087 -46144 145411 236548 213367 130034 -261093 -75492 -51816 -57911 -10789 185779
17760 324588 -117525 -35804 -83115 56903 -150852 -235708 94152 174421 -89886 102037 -79604
17748 6437 -167886 157995 -62320 324401 -241735 -178263 229163 -90566 -48059 38017 44107
17737D4107b87884C1711f1644B6399M832P018d5218F4657e8346j26763A53662
17725B1527c58433d041j93483O9697L3395q3039e2044C35427A24194N7568b43577
17713A9770i0458e052A30782b07772Q9321l8784B2497J3482h318o0118q2825E2696
17700h0956J2544J4121p5882m5508l76200a01171A36894b84832C83839j39095
17690B44744b7080j46277M1289B14846E4600c13204G9288d6766l4078p0461r125
17679a60430C30394a23939a8433j473l74898a90003p1035J24228C2471K19995
17669B52466E365b02044A80993c390o3164L1193k0524l781l152A19887b6099E38142
17656C2130a3781B58097a02569E1015b331o6265B36169j14356l5725j1872f546
$$ plain form
17737 44107 -287884 31711 -61644 26399 31231 38249 -45218 64657 -58346 -185109 153662
17725 21527 -358433 -4041 -197524 -127827 -94432 -177471 -52044 335427 124194 181762 -243577
17713 19770 -90458 -5052 130782 -207772 -118451 -157235 22497 35979 -8318 -68436 -151261 52696
17700 -80956 -68412 -54291 -130173 -175681 -551881 -101171 136894 -284832 383839 244744
17690 244744 -27080 -173357 -132068 214846 54600 -313204 79288 -46766 -80844 -151305 -160430
17679 -160430 330394 -123939 -18433 -19906 -394804 -190003 -261038 -136810 32471 252466
17669 252466 5365 -202044 180993 -3390 -66554 -35361 -55885 -59666 -62818 119887 -26099 538142
17656 32130 -13781 258097 -102569 51015 -2331 -68596 236169 121813 86088 74216 -6546
17644b16298A80437a12869A83529b2930H4037b63269a04597A79877o9909j8070
17634I1898L4642a83059A1944O3419J9145a14639n4007C91722j59543O5365j22350
17623A75194a8542C54077b44729A03109a03357r7385h3007E6462k1773a1830m7479
17612e9309A9784a73000a5374m9758A61708J05116G6728J91784f6371B72421n6236
17601B16185m487F1661a08003B75365a50857B86882E3775J53962E179b598r5053
17590i7651M2691j3909F7994k2370r100i4949d3061B46940H1887M6199K6621P9504
17578B34211l4046D3314J70844a33374N8680C236Q2888a92388C85597A4939L77616
17567C92555G6817l3102a30180l7347B4947i3041j46813g1454k2668A86333b0791
$$ plain form
17644 -216298 180437 -112869 183529 -22930 84037 -263269 -104597 179877 109968 91898
17634 91898 126540 -183059 11944 75363 94508 -114639 -168646 391722 232179 297544 175194
17623 175194 -18542 354077 -244729 103109 -103357 -200742 -83007 56462 34689 -11830 -59309
17612 -59309 19784 -173000 -15374 -65132 161708 266824 76728 268512 -66371 272421 216185
17601 216185 211698 61661 -108003 275365 -150857 286882 53775 207737 5179 -2598 -97651
17590 -97651 -54960 -68869 67994 45624 36524 -94949 -43061 246940 81887 128086 154707 234211
17578 234211 200165 43314 214158 -133374 -74694 3236 86124 -192388 385597 14939 392555
17567 392555 76817 43715 -130180 -167527 24947 -93041 -239854 -71454 -94122 186333 -20791
17555a32495j36914D8659J23290B7264a04686A05606C3250i1062A97368G6324
17544A81055D7064I448N0875L48285h2495E5292b24383B7350J55708M0754B9082
17532d3438E7752A1530b37103A28089K52296J48602A3820J08146M23328b08556
17521H6040K65715a17249E8475L7816a45315A04437j1930P1930a23484B3822J62707
17510A86529P6121b3293j05745m2719d243B76386a85841B24860C7929n249a25437
17498F169Q5725a5484F7500Q9751f7599A38721b4105A15683J27169a5551B3985
17486D20755e1784I2566d921j64072B80267H4998b043j18383B08553a31619A25892
17474C95593A9304J65407k6200b2692k84502D9185j0678m27P213f8157I6008J61154
$$ plain form
17555 -132495 -269409 48659 171949 27264 -104686 105606 33250 -91062 197368 76324
17544 181055 47064 9448 60323 408608 -82495 55292 -224383 27350 183058 223812 29082
17532 -43438 57752 11530 -237103 128089 380385 528987 13820 121966 545294 -208556
17521 86040 351755 -117249 58475 96291 -145315 104437 92507 164437 -123484 23822 186529
17510 186529 262650 -23293 -129038 -171757 -4243 276386 -185841 224860 37929 32680 -125437
17498 6169 91894 -15484 67500 157251 -67599 138721 -24105 115683 242852 -15551 23985
17486 420755 -51784 92566 -4921 -168993 280267 84998 -2043 -120426 208553 -131619 125892
17474 395593 19304 184711 158511 -22692 -307194 49185 38507 38080 45293 -68157 96008 257162
17462B57162J27780c03306A10537g6111B46346j09544k5507m9935L04063a69849
17451A23814N5332o6027L92000k9783j52128q9730R6042J28752A91226M0448b51379
17439a10037C33770A16162i3076E53320B15424B7908K63339a03836A29921b91414
17428B96035d336A34296O9381L1583J09649J47825n8154H9114L54014r0172d3509
17416A33694L42092G9309M02882a36935D6162J07860O0977I3433e2075A03995
17405H3713k9963A7254K23678a482B84958b7299j41876A19374D6800L8061j6841
17394F8020L2667f962A20700J78243R2894j59688q1732O8713b6740B87683I5698
17382d360E4114f6912A50410J20041A26968a66777H073a16933p0832R2566C78344
$$ plain form
17462 257162 384942 -303306 110537 -76111 246346 136802 111295 61360 365423 -169849
17451 123814 179146 113119 505119 475336 323208 233478 329520 458272 191226 231674 -251379
17439 -110037 333770 116162 -93076 553320 215424 27908 291247 -103836 129921 -291414
17428 296035 -4336 134296 203677 235260 344909 492734 434580 89114 443128 352956 -43509
17416 133694 475786 79309 482191 -136935 46162 154022 214999 93433 -52075 103995
17405 83713 53750 17254 240932 -1482 284958 -27299 -169175 119374 46800 84861 68020
17394 68020 100687 -6962 120700 298943 391837 232149 150417 219130 -26740 287683 95698
17382 -4360 54114 -66912 150410 270451 126968 -166777 8073 -116933 -187765 -95199 378344
17370C27721j40013f4866D07614q3549C5768K00532J17526A12366K64543F4815
17359B90211B55J40327K43408E2517a49768A15786R3372r0695J95003c21419I0727
17347E936K83590J85570B26137a94502A26062a86971C9717M0089J10783J97193
17337C87782H0935a67528F0820J05674h1835B83162k7900p1543n8155J31628q2599
17326A74593a02718B0603J60056K11569m3792K1013E7590d3616B10445L6548P545
17315B54538m8547d2639B50813j5455k4036e6386A54519n952M48391c8586C11132
17303i1998o5481B1140K34135A0082K55868R95A7277K51780A31590J35189I4027
17291C6819J15164m0385r181L28848j42187L0280F7873l1356L30729M0809j70719
$$ plain form
17370 327721 187708 -64866 407614 324065 35768 236300 353826 112366 376909 64815
17359 290211 255 140582 383990 52517 -149768 115786 209158 118463 313466 -321419 90727
17347 5936 289526 475096 226137 -194502 126062 -186971 39717 79806 190589 387782
17337 387782 80935 -167528 60820 166494 -81835 283162 255262 183719 125564 257192 174593
17326 174593 -102718 20603 180659 392228 348436 369449 57590 -43616 210445 246993 254538
17315 254538 205991 -42639 250813 235358 211322 -56386 154519 148567 596958 -38586 311132
17303 -91998 -157479 21140 255275 10082 265950 266945 17277 269057 131590 266779 94027
17291 36819 151983 111598 102417 431265 289078 319358 67873 36517 367246 408055 237336
17280B37336B2033m149J84027n9182K19100j8825K6100A06774L24018D4806a9289
17268C59816j64682N6633g640A75027J09647J87647g4919B49971I5474L12925
17258D08399f5175B44444J81322A14636N4174m5301R619d9881C50399G3984J84427
17247B58411O1015G8627e6565B38901n8270r40J9129d9875B36131K25338B30466
17235B80656j17489K04489A36190M8739b67263D10390j02166A45406K92586b3390
17224C20212l7102J50849J93440k49863j07708l6982d8075D16335A72951J86718
17214C59669f1878B18994D2760K2784P8508M5568p246a18129D57775B01477G3807
17202e8472B42940I7025l4978k4336L19920E7925J94474c29611C21644A47583
$$ plain form
17280 237336 22033 17884 201911 142729 361829 343004 369104 106774 430792 44806 -19289
17268 359816 195134 251767 -7640 175027 284674 472321 -74919 249971 95474 408399
17258 408399 -65175 244444 425766 114636 168810 123509 133128 -49881 350399 73984 258411
17247 258411 319426 78627 -56565 238901 180631 179691 198820 -49875 236131 461469 230466
17235 280656 163167 367656 136190 184929 -267263 410390 308224 145406 437992 -23390
17224 320212 283110 433959 627399 377536 269828 232846 -48075 416335 172951 359669
17214 359669 -61878 218994 42760 65544 144052 189620 182374 -118129 457775 201477 73807
17202 -58472 242940 97025 62047 37711 357631 57925 252399 -329611 321644 147583
17191G4118K74071m152j42146J52459a18426F3572a3097A15070K36383I5395a51739
17179C38442A54954J56738A17453J42804K34232j61631R6011j60671O4870h6562
17168h3764B44532L46210c2753B71754j03249H3760L06158h119A32623K91484
17158D24107M5883j03718p2071k0858F2507O54731B86125m444m1499K41317k33178
17147B48321A00154a07002E26546A91434P7480p5581J87480j58045L11926j61852
17137C72842A52704j516J07687L2200N1565r810k8988A22219K93240p6230J10891
17126D50120A45348i2970A77649p6928K02262L12306k8560B62848K72146A75214
17115D37695k12114O1400Q0753q5647j06107K47503J5837D9376J39181K19327
$$ plain form
17191 74118 348189 344037 201891 354350 -118426 63572 -13097 115070 351453 95395 -151739
17179 338442 154954 311692 117453 260257 494489 332858 428869 268198 333068 -86562
17168 -83764 244532 590742 -32753 271754 168505 83760 389918 -8119 132623 424107
17158 424107 469990 366272 294201 273343 62507 717238 286125 281681 240182 481499 248321
17147 248321 100154 -107002 526546 191434 268914 193333 380813 222768 534694 372842
17137 372842 152704 151188 258875 291075 342640 332830 303842 122219 415459 339229 450120
17126 450120 145348 -92970 177649 100721 302983 615289 586729 262848 534994 175214
17115 437695 225581 286981 367734 282087 175980 423483 439320 49376 188557 407884
17105D07884o1312L11321k02172M7398j76366J38535J86190C06479L0062L00564
17095F37105j74713r7128k6666R2757k9983j49003N9041j37117l9355L03623j94721
17084B43840N01536l00382N3147J61495C23648J84954j75129O2304L7229R335
17074D42341j02535r245L51802L4341A95388N1720M62847l8161C00557L05471
17064F06028n9188P0657B69893L00373K4827j09877K58987k07252M8583R0600
17054F76134q5181K8361k90483J56407J2874L18438m01443K25044j55334J7769
17044E02586L58954l01937k02367M33981B54731J25446K90059k87648J01540L1126
17034E15254P7126q363B25550J33732L36382j80766L66209j20716m8531Q5745
$$ plain form
17105 407884 346572 657893 455721 503119 326753 465288 651478 306479 336541 637105
17095 637105 462392 365264 338598 431355 401372 252369 311410 174293 134938 438561 243840
17084 243840 745376 444994 498141 659636 323648 508602 333473 395777 433006 442341
17074 442341 339806 330561 682363 716704 195388 247108 709955 671794 300557 606028
17064 606028 546840 617497 269893 570266 595093 485216 744203 536951 585534 676134
17054 676134 590953 619314 328831 485238 498112 816550 415107 640151 484817 502586
17044 502586 861540 559603 357236 791217 254731 380177 670236 382588 484128 515254
17034 515254 592380 584017 225550 359282 695664 514898 881107 760391 711860 797605
17024G97605J04244l62173O81524m83390A78183K48383K56953J11378J62110l15854
17014F41153L40416j66977n8038p4702L28920l05995j44510k72004M04299j95505
17004D97057K37666q2081r1972N9203M4622J53391M8002J29737m86007K29316
16994G38934k52217M36487k95418k15180M21466r4779K57646J01549l84940l00948
16984D12600K55274k80956M27638l8642J18568q5978K7907j31703K58557k04162
16974G59103K63372l85809j88761M52670K01051l53553L90823m17564J54629M8683
16964I24644J09582Q857j40348N4804k05362M49213q8601R9869k08039J29908
16954A134527q9555K64230j79901o7378j31736J78384J25416L41398p76738J21454
$$ plain form
17024 797605 901849 539676 1221200 737810 178183 426566 683519 794897 957007 641153
17014 641153 981569 814592 756554 681852 1010772 704777 560267 288263 692562 497057
17004 497057 734723 652642 560670 619873 664495 817886 865888 995625 509618 738934
16994 738934 486717 923204 627786 412606 834072 739293 996939 1098488 713548 412600
16984 412600 667874 386918 814556 775914 894482 808504 836411 704708 963265 759103
16974 759103 1022475 636666 447905 900575 1101626 748073 1138896 721332 875961 924644
16964 924644 1034226 1043083 902735 957539 752177 1201390 1112789 1212658 1004619 1134527
16954 1134527 1044972 1309202 1129301 1061923 930187 1108571 1233987 1575385 798647 920101
16944I20101j29463L96890j39277l25136L04441N08038l56696m1193j06227m1822
16934I89656n0317K61628N6607L40171r8562j03053N8482l56323J86359j4967
16924A269681L42432j55217j43343J36434J34468J473k92173K95172k57429L07803
16914A639301j25768l12961M8363M24811j57905K68798j08711k14717J98464L00485
16904A960160j82016J52406j43080O200k3343l24887P6151K51682J61725l09518
16894A625480J92707J03717L03028m95853N49847r0118k20252l52726N57151j33809
16884B039172R1561K93468j75311O3327o1913J62561j4534P1911l24687J7919
16874B163474m5898O80881m68939J43616k3641J05609Q6930n4487J35928m31045
$$ plain form
16944 920101 790638 1187528 1048251 723115 1027556 1535594 1178898 1137705 1031478 989656
16934 989656 939339 1200967 1257574 1597745 1499183 1396130 1454612 1098289 1284648 1269681
16924 1269681 1612113 1456896 1313553 1449987 1584455 1585928 1293755 1588927 1331498 1639301
16914 1639301 1513533 1200572 1248935 1673746 1515841 1784639 1675928 1461211 1659675 1960160
16904 1960160 1778144 1930550 1787470 1793670 1770327 1445440 1521591 1773273 1934998 1625480
16894 1625480 1818187 1921904 2224932 1729079 2278926 2188808 1968556 1615830 2172981 2039172
16884 2039172 2130733 2424201 2248890 2312217 2250304 2412865 2398331 2470242 2145555 2163474
16874 2163474 2117576 2798457 2329518 2473134 2449493 2555102 2642032 2587545 2723473 2292428
16864B292428N22360m66702K29622j31610M64318N0973j04289O741o5594p7843
16854B720404K31302K230K21183k73394J65171M91634k06249J03363L04749l0744
16844C729649j79261j66642o2320L12069N51234m22480J61340n7824J76444M79292
16834D521501n38649K44128p2107J14590j22127J00285J78500K49829m19439P70388
16824E026899l68397K67254K86161K64997j61271j54483J91646L48687k64915
16815E436578J60865J28842L52976K13168L30174o3230n10991N76039J61279P5437
16805F861137K21728L41321l49246Q08594L30799j79441K87708o6902M08594q0182
16795H584110L71194K62145L66628J08768M03713J5239M27897K56268K99316K54702
$$ plain form
16864 2292428 2814788 2348086 2577708 2446098 2910416 2961389 2857100 2863841 2798247 2720404
16854 2720404 2951706 2953936 3175119 2901725 3066896 3558530 3352281 3455644 3760393 3729649
16844 3729649 3550388 3383746 3321426 3633495 4184729 3762249 3923589 3865765 4042209 4521501
16834 4521501 3982852 4226980 4154873 4269463 4147336 4247621 4426121 4675950 4256511 5026899
16824 5026899 4658502 4925756 5211917 5476914 5315643 5161160 5352806 5701493 5436578
16815 5436578 5597443 5726285 6079261 6292429 6622603 6559373 6048382 6624421 6785700 6861137
16805 6861137 7082865 7424186 7074940 7883534 8214333 8034892 8322600 8255698 8664292 8584110
16795 8584110 8955304 9217449 9584077 9692845 10096558 10111797 10539694 10795962 11095278 11349980
16785A1349980M92019L04608K33813L04054L60267O43706L85626K96330O84653
16776A5055056L37071L87974M18516M47223Q94923M67206N32609N76704R46436
16767B0063718N05738J066118O83065Q22260O91952J183319R27496Q12852J416605
16758B8173123J312448J182613J241830J614430J534672J414043J741974K412928
16750D0628061J486631K566076J724315K311830K703249K888210L232558K521189
16742F0062119L805068L624660L676040M135023M375781M767797N055189N323225
16734I4824902N429608O401671O024102O737364O474360O672792P285809P131967
16726A46982575O661377O699731O335648N521774M812855L962128K704277K341268
$$ plain form
16785 11349980 11841999 12146607 12380420 12684474 13044741 13688447 14074073 14370403 15055056
16776 15055056 15392127 15780101 16198617 16645840 17540763 18007969 18540578 19117282 20063718
16767 20063718 20569456 21635574 22318639 23140899 23832851 25016170 25943666 26756518 28173123
16758 28173123 29485571 30668184 31910014 33524444 35059116 36473159 38215133 40628061
16750 40628061 42114692 44680768 46405083 48716913 51420162 54308372 57540930 60062119
16742 60062119 63867187 67491847 71167887 75302910 79678691 84446488 89501677 94824902
16734 94824902 100254510 106656181 112680283 119417647 125892007 132564799 139850608 146982575
16726 146982575 153643952 160343683 166679331 172201105 177013960 180976088 183680365 186021633
16718A86021633M96304r03583j920905k778224l976663n065997n784442n991847
16710A60096276p086718o511775p124499p445276p074887o807446o763781o058846
16702A05223048o477580n400312n519482n268459m719297m551329l952056l727586
16694F5606947l518359m007318k917267l173016k333071k653717k201824k588950
16686D2213425k208050j628530j849543j529157j714935j608146j447492j122461
16678B9105111j367964j366591r65339q82872j132998q10203r47152r12458o56627
16669B0062907q39881q07624m03196q19664m55960q44507o45804l61067k87043
16660A4598161m28480l37819o25863l20672l84470n33015m90809j93118m29838
$$ plain form
16718 186021633 186517937 185614354 183693449 180915225 176938562 171872565 166088123 160096276
16710 160096276 153009558 146497783 139373284 131928008 124853121 118045675 111281894 105223048
16702 105223048 98745468 93345156 87825674 82557215 77837918 73286589 69334533 65606947
16694 65606947 62088588 58081270 55164003 51990987 49657916 47004199 44802375 42213425
16686 42213425 40005375 38376845 36527302 34998145 33283210 31675064 30227572 29105111
16678 29105111 27737147 26370556 25405217 24522345 23389347 22579144 21631992 20719534 20062907
16669 20062907 19223026 18415402 18012206 17192542 16736582 15892075 15246271 14885204 14598161
16660 14598161 14169681 13831862 13205999 12885327 12500857 11967842 11477033 11283915 10854077
16651A0854077n2848m70515k29240r606m49762m83799m01502m8618k05222j70129
16641H332836j49783n23413J31908j19586l44291j52725k55309m6973l84912K87408
16631F775160n24930j80599J03155o1368n43792K56998j01670n55140J07673K80984
16621E556471j87701m03525n3576p4336n243r5617j15695j70201K72526o74034
16611D049069J72631r6010k72365J40409l5296l17728L31500m87238m4018K18906
16601C659860k42822q9613N5163j51641j721k11573Q7151N4717l38080o4199K36579
16590B993821k61576M66228l85314j75917J90315k63092p4046K65404n58915L58364
16580B555272n5970j29981j40487o7405O5159j25740M01845l50728j39851K28532
$$ plain form
16651 10854077 10801229 10330714 10101474 10091868 9642106 9158307 8756805 8708187 8502965 8332836
16641 8332836 8183053 7659640 7791548 7671962 7327671 7174946 6919637 6872664 6487752 6775160
16631 6775160 6250230 6069631 6172786 6111418 5567626 5824624 5722954 5167814 5275487 5556471
16621 5556471 5368770 4965245 4911669 4837333 4832090 4736473 4620778 4450577 4723103 4049069
16611 4049069 4221700 4125690 3853325 3993734 3958438 3640710 3972210 3484972 3440954 3659860
16601 3659860 3417038 3327425 3382588 3230947 3229226 3017653 3104804 3159521 2821441 2757242 2993821
16590 2993821 2732245 3198473 2813159 2637242 2827557 2564465 2490419 2755823 2196908 2555272
16580 2555272 2499302 2369321 2228834 2161429 2226588 2100848 2502693 2151965 2012114 2240646
16570B240646q3136K65651j71391l55003L28405l58432k01124P9103k2541J41548
16560A863726k45377J36714K0902k14095j21858K40821J47278N0611p2274m02770
16550A403678N7463n8399l0742J78258k2146o6075J27876q4405q4292P555j18024
16539A310747k41509J34831K08278j91090j4914k5420J17935J27498j63931j54340
16529A108085j88824J77727M14220m64262K52915j12609P5737l2126R126k93468
16519I46521K69613o2833l7000O3560j28404j66676p2924J51750M8522j23047
16509H89082J80621l20576K49837L3219j03162l40744O65066m03482k4026l2731
16499G93104K63140m14270R5624K89157k83028Q669K09549k06966L9258q1797
$$ plain form
16570 2240646 2157510 2423161 2251770 1896767 2225172 1866740 1665616 1744719 1722178 1863726
16560 1863726 1618349 1755063 1775965 1561870 1440012 1680833 1828111 1878722 1806448 1403678
16550 1403678 1461141 1402742 1372000 1550258 1528112 1462037 1589913 1505508 1421216 1428771 1310747
16539 1310747 1069238 1204069 1412347 1221257 1206343 1180923 1298858 1426356 1262425 1108085
16529 1108085 919261 1096988 1511208 1046946 1299861 1187252 1262989 1230863 1239989 946521
16519 946521 1216134 1153301 1116301 1179861 1051457 884781 811857 963607 1012129 889082
16509 889082 1069703 749127 998964 1032183 929021 588277 1253343 849861 825835 793104
16499 793104 1056244 641974 737598 1026755 743727 752396 961945 754979 794237 712440
16489G12440J93289q6610J59613l32271L00802l81564R8421j28237L86148m60608
16479D61423O81800l29861J19758m28880J92415M8026j96716j60916K00453J19355
16469G06857J92533k84208J20688D6824M41237Q6154j5484R7502O7633P0918j82630
16458F12154k82860K20642J356j27609M66583D29976j1423J49060J09310k19793
16448D57130K08557Q0333j45615j53650K03839j09263P152K12240k92199j36441
16438C32083K00478j69337M27977k08893L0J53899j22412J78259C40886K49127
16428E90013k00908j50386O4072q4039N1947J95960P9221k44379j32415K28901
16418C97987p5543J37413j516J27333B55908K2554r5807J50621J71579A92281
$$ plain form
16489 712440 905729 819119 978732 646461 947263 565699 664120 535883 922031 461423
16479 461423 1143223 813362 933120 504240 696655 744681 547965 387049 587502 706857
16469 706857 899390 615182 735870 46824 488061 574215 558731 656233 723866 794784 612154
16458 612154 329294 549936 551292 423683 890266 429976 418553 567613 676923 457130
16448 457130 665687 746020 600405 446755 650594 541331 548483 760723 468524 332083
16438 332083 532561 363224 791201 582308 582338 736237 613825 792084 340886 590013
16428 590013 389105 238719 302791 218752 270699 466659 545880 301501 169086 397987
16418 397987 322444 459857 458341 585674 255908 278462 182655 333276 504855 192281
16407A72939N34017P8436A30887K53041j19430k6435k7802O5547P0627Q9874A20439
16395G21819B13708K47160n513J43945k44941A50658Q942M2264J56183J48763
16385E06810j06399K6001J73734A93535J61257J50887B51370K02034J51500A69417
16374C11314M3246J21558f8184D21579B2996b24479C88916A73743L50427B56585
16363D1267L92884A68729J51678A38955J71711j31773L83426k45497m4867e018
16352D61678A00110Q4515L8009Q5618k1487A07305J24555M5948K71004k45068
16342C03744A26352J1371K65415r1903A11684P4994K49114n0199b30673B22927
16331a64794B63984H183M3793L68350A46355J87202I2632J4963K49264A75912
$$ plain form
16407 172939 706956 785392 130887 383928 264498 238063 210261 275808 346435 436309 120439
16395 721819 213708 460868 455355 599300 354359 150658 159600 201864 358047 506810
16385 506810 400411 426412 600146 193535 354792 505679 251370 453404 604904 169417
16374 311314 354560 476118 -68184 421579 22996 -224479 388916 173743 524170 256585
16363 41267 434151 168729 320407 138955 310666 178893 562319 316822 271955 -5018
16352 461678 100110 184625 222634 308252 286765 107305 231860 277808 548812 303744
16342 303744 126352 137723 403138 311235 111684 186678 435792 385593 -230673 222927
16331 -164794 263984 8183 51976 420326 146355 333557 92632 107595 356859 175912
16320a247A49958K49839j85592P8762f5196B36679j4570H6310J07396b2432C37919
16308G0447J49335F4345M5038J8113L7992O920k0934N4371q780G3306M7027R6269
16296B16602H8751C7366J4539a01184A70591D9012P8829d903D43810j81962M5500
16285C07348a11795G9289J94974B1888J35193L64359A48097l703J74541H5430
16274A62433k8735n1220C5017L34877K0679D2168j9840L5873a4417B01864D7554
16262d0141C64209F6952a30360O4331B13135b79727E8647K94553H269g2857j9902
16251i2759a9710k49283g9332j04505g2920B68734J10664A05093L90733j10480
16241C85346A65553a6718D584b565j23117H2207d4773A44659a99370C4991J24780
$$ plain form
16320 -1247 149958 399797 214205 292967 -65196 236679 222109 86310 193706 -22432 337919
16308 70447 219782 64345 109383 127496 165488 172408 151474 205845 197065 73306 120333 216602
16296 216602 88751 37366 51905 -101184 170591 49012 127841 -4903 443810 261848 307348
16285 307348 -111795 79289 274263 21888 157081 521440 148097 144394 318935 85430
16274 162433 133698 82478 35017 369894 390573 42168 22328 58201 -14417 201864 47554
16262 -40141 364209 66952 -130360 -66029 213135 -279727 58647 353200 8269 -72857 -92759
16251 -92759 -19710 -268993 -79332 -183837 -72920 268734 379398 105093 495826 385346
16241 385346 165553 -16718 4584 -2565 -125682 82207 -44773 144659 -199370 34991 159771
16230A59771K33931C9347L0783J04718i8288d1457B02600O2271a66647A6767M7104
16219F3871j2120J88429c14829h005A74957A8555b3833A095J43334j4364l2915
16208I7150O4016J54795B6008B98Q748Q1515J24483b10304j48397C8741a86126
16196b7641n8517B026K07325K03300c6804A97321b27155E1240K8467L2843q433
16185A04117i7037A94870J04153g1394E1325J57371D5863K17549j29231Q2073
16175B16254q7885P8114c60944a43871a980b06B52634K5421Q1674a4110D48708
16163D24464j39776a65423C67261A9188J31498n1880J63488n0916d0922A63985
16152B5055Q7153h2564j9158c625j16318r1012F1413j4889a73682A54491a08245
$$ plain form
16230 159771 393702 39347 70130 174848 -98288 -41457 202600 264871 -166647 16767 63871
16219 63871 51751 240180 -314829 -8005 174957 18555 -23833 1095 144429 130065 97150
16208 97150 161166 315961 26008 298 9046 90561 215044 -210304 -358701 38741 -186126
16196 -27641 -86158 2026 209351 412651 -36804 197321 -227155 51240 79707 112550 104117
16185 104117 -97037 194870 299023 -71394 51325 208696 45863 263412 134181 216254
16175 216254 128369 206483 -360944 -143871 -1980 -206 252634 278055 359729 -14110 448708
16163 424464 284688 -165423 367261 19188 150686 98806 262294 211378 -40922 163985
16152 25055 112208 -82564 -101722 -3625 -119943 -210955 61413 46524 -173682 154491 -108245
16140A62598i4043N014j58289K5594C3579K45453b55761C45713A67251k2201m193
16129A40857a79482d0215j72783O472C19492q900j10079a72945B6208l050b71547
16117a79901l3675L0586m6522B14524j04200k6451M4234L1386b49945H0998a7744
16105b33162O8495B78375E6180N7231P0096J32743F3216O2096a8047j11838b9296
16093a34028A89181f1407j36411m2959e6820q0371N0809B17150a80662A08422
16082h4073C54582A39846N4697a60079A2784g0568C7448M2547f2059B21454r2955
16071A28499d2708q442m9614J707J9586A51372a67899d6099J5744E254a2357m34979
16059d47336F5513a21429D9294K7105L11432b44603g0796j49080B3755J29319
$$ plain form
16140 162598 -94043 -89029 -247318 -221724 33579 279032 -255761 345713 167251 145050 140857
16129 140857 -179482 -40215 -212998 -206526 319492 310592 200513 -172945 26208 23158 -271547
16117 -179901 -213576 -182990 -229512 214524 110324 83873 128107 159493 -249945 80998 -17744
16105 -233162 -164667 278375 56180 113411 183507 316250 63216 125312 -18047 -129885 -29296
16093 -134028 189181 -61407 -197818 -240777 -56820 -137191 -86382 217150 -180662 108422
16082 -84073 354582 139846 194543 -160079 12784 -70568 37448 79995 -62059 221454 128499
16071 128499 -42708 -51150 -100764 -99057 -79471 151372 -167899 -46099 -30355 5254 -12357 -447336
16059 -447336 65513 -121429 49294 76399 387831 -244603 -70796 -219876 23755 153074
16049A53074A3543N4765J47841c9723j4082A20522a64222l7899C9448h7608k56749
16038c44357K1803I1876e8510b0959B03110a44566g891j2072B67836C6595p623
16027B8972J94889a42978d3170H7764P3259a62382q1488a16023o0082B45412a02130
16015a06876o1499C2547a50661B03340r1817a3015F1975Q0612Q1160b38930G906
16003B38317j18292a97075k04430D44760B017h7664C3735P3428m6595a25784L9436
15992h6348j1979A88008b52504e1393F3410b91995A26927J49523m0763A8720a5333
15980B43618J3865J8438j23676a80376D5607J37214I0611g7342q1545A25921b946
15968A95031J14282d1223l38344j61783H5899B4237a63056A71821K04138q1445
$$ plain form
16049 153074 13543 68308 216149 -39723 -53805 120522 -164222 -202121 39448 -87608 -344357
16038 -344357 -322554 91876 -58510 -20959 203110 -144566 -7891 -19963 267836 36595 28972
16027 28972 223861 -142978 -43170 87764 161023 -162382 -243870 -116023 -176105 245412 -102130
16015 -106876 -168375 32547 -150661 203340 111523 -13015 61975 142587 223747 -238930 7906
16003 238317 120025 -197075 -401505 444760 2017 -87664 33735 107163 60568 -125784 -86348
15992 -86348 -98327 188008 -252504 -51393 63410 -291995 126927 276450 235687 18720 -15333
15980 243618 257483 275921 152245 -180376 45607 182821 90611 -77342 -158887 125921 -2946
15968 195031 309313 -41223 -379567 -541350 85899 24237 -163056 171821 375959 294514
15958B94514A27751K10644G6489b81387A6121f7929k42673H4456k7380J39428
15948A96504a18531B4778a20326I6713a17589o0105A4148e0786j71649N0110c1581
15936c3308f152l36941A45289a02173k69461B9358m542P6009m9380b47358K5968
15925b21390g3109j39119F6401a35885A19503j7313a8131r9808A10454k788d2675
15913c8303a921k94868Q2744G2991J10928d5892j59168l2046d0025o8319j9336
15902a27680k34007P6316f9397O551p1695b5067l82458A41984d3046H1499R025
15891I0524Q5697a97827n9454B78618a5132k1544j15971k006A53502b47501B88221
15879a29446r1078C1236J89084c6888D5600b10219G2432R509f4098b5827A40955
$$ plain form
15958 294514 127751 338395 76489 -281387 16121 -67929 -310602 84456 57076 196504
15948 196504 -118531 24778 -120326 96713 -117589 -177694 14148 -50786 -222435 -172325 -31581
15936 -33308 -6152 -343093 145289 -102173 -371634 29358 24816 100825 51445 -247358 -221390
15925 -221390 -73109 -212228 66401 -135885 119503 102190 -18131 -117939 110454 107666 -42675
15913 -38303 -1921 -296789 -214045 72991 183919 -45892 -205060 -237106 -40025 -108344 -127680
15902 -127680 -361687 -285371 -69397 -62846 -134541 -25067 -407525 141984 -43046 81499 90524
15891 90524 176221 -197827 -257281 278618 -15132 -36676 -152647 -154653 153502 -247501 288221
15879 -129446 -220524 31236 220320 -36888 45600 -210219 72432 81941 -64098 -25827 140955
15867a54459B57833b74850P9029k8783f6204a7749e543j39052m2933K8144j03818
15856b63202a27880A40729g3178n4879r1097j72011A61669a01816B8532a95360
15845E7863J06358a4989l44432A6328b23679H9914b719I7575L63969A44595Q9893
15834B34488b03941d2760E9285J90843D3455i9508D3128J0997P0891k8089e43
15822b66530R1343r2341H2071P983I460h7778B6318a38428m13876d9948b183l56674
15810c58857a25866I7867B4115J85597m4316q1292a5396r1772m8502F6522L0363
15799I6885M2618J784b0092j27976Q42g1883E5837g0561B516O0492K25490d2830
15786a00422l49060g9789B30235P4592c773j48788B42139e8659D3696e794k36422
$$ plain form
15867 -154459 257833 -274850 -195821 -224604 -66204 -17749 -5543 -144595 -187528 -159384 -263202
15856 -263202 -127880 140729 -73178 -128057 -219154 -391165 161669 -101816 28532 -195360
15845 57863 164221 -14989 -359421 16328 -223679 89914 -2719 97575 461544 144595 234488
15834 234488 -203941 -42760 59285 250128 43455 -99508 43128 54125 125016 96927 -543
15822 -266530 -175187 -267528 82071 90054 9460 -87778 26318 -138428 -552304 -49948 -2183 -358857
15810 -358857 -125866 97867 24115 209712 165396 84104 -15396 -107168 -155670 66522 96885
15799 96885 139503 141287 -20092 -148068 -147226 -71883 55837 -70561 2516 63008 288498 -42830
15786 -100422 -449482 -79789 230235 304827 -3773 -152561 242139 -58659 43696 -5794 -242216
15775b42216f9081I0603a14478N3006k572a834C91451j36108a3831G7490O9984
15764A47474a31212A69549e6906C1489J10215M0726k1536a41820e1455C40328
15753g2559D9531P9099A7521i0000A49417N1176a98565A9928K64323j04132b08506
15741C21334h1727k1196A9877a78971G561l362J24853b10319q1355C6176M1490
15730G7666L082R1439k1731a34316b6725C8930P9197L2735b2373J0995k403l03455
15718c17236A04159B383K1535i9002B07705a65096b946A39044c68188h8000H1411
15706f5952C5128M624J1837F124g5057b8591l0971F5219J74483C915L48900a69113
15693a44727A784a07243D4045a17861I6801A5315J05417a48531B84690h815D2313
$$ plain form
15775 -242216 -69081 90603 -114478 -61472 -64044 -1834 391451 255343 -13831 77490 147474
15764 147474 -131212 169549 -56906 31489 141704 182430 160894 -141820 -51455 340328
15753 -72559 49531 128630 17521 -90000 149417 200593 -198565 19928 284251 180119 -208506
15741 321334 -81727 -102923 19877 -178971 7561 4199 129052 -210319 -291674 36176 77666
15730 77666 80748 172187 150456 -134316 -26725 38930 118127 150862 -22373 -11378 -13781 -317236
15718 -317236 104159 2383 23918 -99002 207705 -165096 -2946 139044 -368188 -88000 81411
15706 -65952 35128 39752 51589 6124 -75057 -28591 -59562 65219 239702 3915 352815 -169113
15693 -144727 1784 -107243 44045 -117861 96801 15315 120732 -148531 284690 -8815 42313
15681b55500a7492j16953a8924A0398J89684o8758J43175b86098H156a62688I0989
15669A04294C982i9004j4519n9525B49826C4129a05928k74264a1074C06945h6897
15657a37157b4051l74423F8355a8187D2340i3690C2604g1350p177k72021J1355
15646c39193a05506A8900J03336J96448g2930j31592L8967G482L64362E2043B527
15634B33003a7958k98619b6666q1134A30921c18769a11229A11256g989A20307
15623A3107d0900n0784j78934D62586a03506G9895C1060J76659f9480E7179A5430
15611A44505o38i9149p2300H0158a58923B08313b61691i4075p575A45354f5176
15599c62351C4135i8597Q862r573Q118k1527E94K521J38712a81908A91196a70409
$$ plain form
15681 -255500 -17492 -134445 -18924 10398 200082 131324 274499 -286098 8156 -162688 90989
15669 104294 3982 -99004 -113523 -173048 249826 34129 -105928 -380192 -11074 306945 -86897
15657 -137157 -24051 -398474 68355 -18187 42340 -93690 32604 -71350 -78527 -350548 -339193
15646 -339193 -105506 18900 122236 318684 -72930 -204522 -165555 7482 371844 52043 2527
15634 233003 -17958 -316577 -26666 -107800 130921 -318769 -111229 111256 -7989 120307
15623 13107 -40900 -91684 -270618 462586 -103506 79895 31060 207719 -69480 57179 15430
15611 144505 143867 -99149 -171449 80158 -158923 208313 -261691 -94075 -101650 145354 -65176
15599 -362351 34135 -98597 -89735 -99308 -91190 -112717 594 3115 141827 -181908 191196 -170409
15586a01510k21608a5142A82957b7902j81935a4711I1526a1006A97211c9318e349
15574H2988b11056d1605G9072a39875j3299D5252r377a87216C8440a9590r4013
15563a13603k01567c7259B10493o1136b8665E5941i5609F237L32360b16672C35792
15551A8128c0584A55429F3360c3808A17059e1906j06589C18246A08458J09518
15541B17976C9978c44063A38228f3726A96383a24869m8929O5636A74634g9760
15530A53671a65926K1786j08185D0344c1047j75791A3841P1111J31517B9818N5195
15519H5013a95382B69476a62004C27789N6923A61667c57174f5350A72573o4018
15509A08555A78b8536l9425l48037a9416I667J71268D0803L17373H2893Q7626
$$ plain form
15586 -101510 -323118 -15142 182957 -27902 -209837 -14711 91526 -11006 197211 -39318 -5349
15574 82988 -211056 -41605 79072 -139875 -153174 45252 35875 -187216 38440 -19590 -113603
15563 -113603 -315170 -37259 210493 149357 -28665 55941 -95609 6237 338597 -216672 335792
15551 18128 -30584 155429 63360 -33808 117059 -51906 -158495 318246 108458 217976
15541 217976 39978 -344063 138228 -63726 196383 -124869 -173798 -108162 174634 -79760
15530 153671 -165926 -144140 -252325 40344 -31047 -206838 13841 84952 216469 29818 85013
15519 85013 -195382 269476 -162004 327789 384712 161667 -357174 -65350 172573 108555
15509 108555 178 -28536 -67961 -415998 -19416 9667 180935 40803 358176 82893 170519
15498A70519b04791B45468C6804i4579D7542i9435A61909R7026c4782B83198a76130
15486a42265p8485d2972j30792o8058A8023K91895b01905K0992A0138d556C19812
15474C07774I4919a06512j76006f2846F4382f8185j08991N4492j44728A04659
15463a44897A77259e7266B26895a0475n7776A12577K8099a5456B4564O7540e155
15451f1144B22722O9877c9447A6025J66512B605K6433R1682m7383J35878F4504
15439a57662j53759a16411D02065i7310j37047A378O6063d3777A43445b61082
15428b02797h001B62576a20850j03312A40979n0596J2293h3802G9350e04884a62099
15416D6952K00815j21924O4328g350D9295g8151B26968i9303M4591J3964G2253
$$ plain form
15498 170519 -204791 245468 36804 -94579 47542 -99435 161909 258935 -34782 283198 -176130
15486 -142265 -220750 -42972 -173764 -241822 18023 309918 -201905 -180913 10138 -4556 319812
15474 307774 94919 -106512 -282518 -62846 64382 -68185 -177176 -122684 -267412 104659
15463 -144897 177259 -57266 226895 -10475 -68251 112577 140676 -15456 24564 92104 -5155
15451 -61144 222722 292599 -39447 16025 182537 2605 29038 120720 73337 209215 64504
15439 -157662 -311421 -116411 402065 -97310 -234357 1378 67441 -43777 143445 -261082
15428 -202797 -8001 262576 -120850 -224162 140979 90383 102676 -83802 79350 -504884 -162099
15416 46952 247767 125843 190171 -7350 49295 -78151 226968 -99303 -54712 -40748 72253
15404a49026C5985a51626a7040B11186e2882m7998A92984a25848q3647C1793N1759
15393H3552J65617d3357B8826g8944H610e9975B9208a36910q1883A08321a62323
15381C220a02796b9561A492R9666c81247c4813j44628K0155p9618A64142n6025
15370A08117a56833c2648D4893I817K31597n88E3839J13914h8695L9604F4050
15358A05122P6007g0533H7998P4571d51D4367a54991N4928j41229b9694E7292
15346B78717C6704K19847b46720b5181A11587J757f089k33916A05281A7230M3765
15335F0995b11840d7C8009K07332c6052A30859a37844n5531A12266P5899h5115
15323A15730h8795k29650a14379M4941B3519J5525J49191r517J88117I6415J00578
$$ plain form
15404 -149026 35985 -151626 -17040 211186 -52882 -100880 192984 -125848 -209495 31793 83552
15393 83552 249169 -43357 28826 -78944 8610 -59975 29208 -136910 -218793 108321 -162323
15381 3220 -102796 -29561 1492 101158 -381247 -34813 -179441 -159286 -238904 164142 108117
15370 108117 -156833 -32648 44893 9817 241414 240826 53839 167753 -88695 -49091 64050
15358 105122 181129 -70533 87998 162569 -451 44367 -154991 -100063 -241292 -29694 57292
15346 278717 36704 256551 -246720 -25181 111587 113344 -6089 -240005 105281 17230 60995
15335 60995 -211840 -47 38009 245341 -36052 130859 -137844 -193375 112266 188165 -85115
15323 115730 -88795 -318445 -114379 -69438 23519 39044 188235 178718 366835 96415 196993
15312A96993a27454l4597e6774A33825F1904A5149K06999a08261E911a21608d8868
15300A74329a52662g4745B13297h1756q307a4904F1857B6427b50086F5548b9854
15288C37668F5988L4226i1652k8949A7913a69052A65896O9686E0700K98125h3568
15276D3487g3348A69746O1292a06381A13754g9542G4157d0072a7183F3637b58722
15264A77644F33J4476a30042A33920L1595o7402K3178K836J20345L8483i7457
15252i5780B30864F7205J61877c1110F18799J235674m04619J21728J21692p50551
15242I42723m49041A38122J82426e415B41823K70837B7998b5582I5930J19421
15232B15351J20453A11759c17492C35334A3813R6936K0473J55486E5933b3685
$$ plain form
15312 196993 -127454 -162051 -56774 133825 61904 15149 222148 -108261 5911 -121608 -48868
15300 174329 -152662 -74745 213297 -81756 -90063 -14904 61857 26427 -250086 65548 -29854
15288 337668 65988 100214 -91652 -120601 17913 -169052 165896 235582 50700 348825 -83568
15276 43487 -73348 169746 231038 -106381 113754 -79542 74157 -40072 -17183 63637 -258722
15264 177644 633 15109 -130042 133920 165515 98113 121291 124127 244472 282955 -97457
15252 -95780 230864 67205 229082 -31110 618799 1854473 1449854 1571582 1693274 942723
15242 942723 493682 138122 320548 -5415 241823 512660 27998 -25582 95930 215351
15232 215351 335804 111759 -317492 335334 13813 110749 131222 286708 55933 -23685
15221B83539i281j45991C81906j05751J8271p5943r7665b16687i5080l4182A12152
15209F1641K0029h6440c2413j65649A7313F156J39466a85453B174L08807O0099
15198C71080G9525h9381k29600F6750Q2949J29869d84128A11786L04510a50539
15187A54415o1784k0539Q6195R9400N4506D4607k0794r858f7748B13763n4192
15176A59571g8623D1637J32796H6516j9402L5448K93011G7662k9319K69350a29340
15164c67579a03024H4666a27233B8823N9110M8625L1866J67668A12187d9265C50100
15152A51102a07428b2954A45015m2815p196M1445E4934a7806l3939B00810H9689
15140a02093n1676F6355P8392D8852J76504e4821A5322K23898L5188b92913c9518
$$ plain form
15221 283539 -9281 -155272 381906 276155 294426 218483 120818 -216687 -95080 -129262 112152
15209 61641 81670 -86440 -32413 -198062 17313 6156 145622 -185453 2174 310981 371080
15198 371080 79525 -89381 -318981 66750 149699 279568 -484128 111786 416296 -150539
15187 154415 92631 72092 158287 257687 312193 44607 23813 13955 -67748 213763 159571
15176 159571 -78623 41637 174433 86516 67114 102562 395573 77662 48343 317693 -129340
15164 -367579 -103024 84666 -127233 28823 87933 136558 168424 336092 112187 -49265 350100
15152 151102 -107428 -22954 145015 102200 95004 136449 54934 -17806 -51745 200810 89689
15140 -102093 -153769 66355 144747 48852 225356 -54821 15322 239220 274408 -292913 -39518
15128A65619e6615j088C33474E6159J63435F7079K18776n2576Q632J54276C5152
15116D9315J18898F0815J50501H0199a59295A76271E8761j9613A5132M248K78045
15105B97425F2903A9270g7521B69707m1667j4098M6964o4784Q869G9709P4885
15094A54594G4538k4941J27967a97931A33080A975L85708M2848H8483f6327B3321
15082F4018r988J75626q3591K48120D5552k2320L05483B4661J8959M0880J69765
15071B54265J1337J45459A55818J40160c4597A24974P3950G6710Q2557A3171L7439
15060E0610Q7428K70001j57583J38020b38084A20649M89725A52783J58942Q088
15050C19813L62003A98463M1139C0498J65197K08766a71217E0430Q0186a40809
$$ plain form
15128 165619 -56615 -57703 333474 56159 219594 67079 285855 233279 241911 396187 35152
15116 49315 168213 60815 211316 80199 -159295 176271 58761 39148 15132 19380 297425
15105 297425 62903 19270 -77521 269707 228040 213942 260906 196122 204991 79709 154594
15094 154594 74538 49597 177564 -197931 133080 1975 387683 430531 88483 -66327 23321
15082 64018 54030 229656 146065 394185 45552 23232 328715 24661 43620 84500 254265
15071 254265 265602 411061 155818 295978 -34597 124974 198924 76710 159267 13171 50610
15060 50610 138038 408039 250456 388476 -238084 120649 610374 152783 311725 319813
15050 319813 681816 198463 239602 30498 195695 404461 -171217 50430 130616 -140809
15039B81421O6142A38199k8312m9119K21247J02311A62074a6030C28780q8565
15029B40215F0086J77597b2995A88072L81817I3757a67381B67243K4541A45361
15018A80362K66578A49518K5603j2075A7611K43286M3829j6340p1845J3270j03608
15007A26203J93322J2253J20789m4138a17779B35230j15351Q4027a65985A54866
14996B1795J81280K1018f5580D44901l8064A56780J04895K21076J8683b87924
14985A81225K34855j92064G9669J34539O3111K15414n1007j39872J68504a47673
14974D12765Q4015C6189C313J01974p588R4222J19467p533J23894A88653J91709
14963C80362A52100M4332n9228N6246K04275A71809l6020J02663L7685K52899
$$ plain form
15039 281421 347563 138199 109887 60768 282015 384326 162074 -16030 328780 240215
15029 240215 60086 237683 -22995 188072 569889 93757 -167381 267243 291784 145361
15018 180362 446940 149518 175121 163046 17611 260897 304726 288386 216541 229811 126203
15007 126203 319525 331778 452567 408429 -117779 235230 119879 203906 -165985 154866
14996 21795 203075 224093 -65580 444901 406837 156780 261675 482751 501434 -287924
14985 181225 416080 224016 79669 214208 277319 492733 441726 301854 470358 -147673
14974 412765 496780 36189 3313 105287 97699 191921 311388 303855 427749 188653 380362
14963 380362 152100 196432 137204 193450 397725 171809 135789 238452 276137 529036
14953E29036A54618l305J40870k9482b6663B11307j1190K36838F6486K50854A45239
14941B75791j6962J08396r1267J51820H2686J62135J40101e071C05657A29351
14930d1531A80347O253K49869q609j78066J78808a37726D45849J64222j46838
14920D63233J59880j25635m1268A26798Q767L90436A73100K402M3490Q1626Q2291
14909C82909p8872j47114K7451J21312J14307p4109K16420j39689A51625L55187
14899E06812D8612M15477k24989J67499j43582G9517J39604K65803j62947K41822
14889E63799B42642N2827L63805j19985j41962j20678Q5305o024l1285L5410N6554
14878D16609j12332N4325R9888q1870K6087A33812R6490n5860L57730m8023A68916
$$ plain form
14953 529036 154618 151313 292183 262701 -26663 211307 200117 436955 66486 317340 145239
14941 275791 258829 367225 275958 427778 82686 244821 384922 -5071 305657 129351
14930 -41531 180347 186600 436469 427860 249794 428602 -137726 445849 610071 463233
14920 463233 623113 497478 456210 126798 135565 526001 173100 175502 218992 300618 382909
14909 382909 304037 156923 184374 305686 419993 345884 562304 422615 151625 506812
14899 506812 48612 464089 239100 406599 263017 79517 219121 484924 321977 563799
14889 563799 242642 295469 659274 539289 397327 276649 361954 355930 324645 360055 416609
14878 416609 304277 358602 458490 376620 402707 133812 230302 174442 532172 484149 168916
14866B05225J45268j60215K86326K2834O6118j92498j423r1368l311j7524H1549
14854C65884R3996k5883J48564B35520n6904N33442q2904J4895j32026J67723
14844F79746B44752K38639k33603N52832C96205l8510P9354J6792k4239R0192
14834E19794j67423L608L43591j70979R669q4830j51075j47406R6682L97391A25481
14822D63149j46269L75471l24658K63596k30506N7347K5418K73586l65531j72616
14812B18987k1462n9557L27044A56738K96406J31602J31985p2915j96894K79171
14802G26093k63895J24639o0980J82908B54624K44824J07060j00886B30100L43360
14792E73460J32927C47452L24821k28016L3698N7934K61688k39221j67626K42700
$$ plain form
14866 205225 350493 190278 476604 499438 565556 373058 371635 280267 276956 259432 81549
14854 365884 459880 433997 582561 235520 178616 712058 629154 644049 512023 679746
14844 679746 244752 483391 249788 802620 396205 357695 437049 453841 429602 519794
14834 519794 352371 355979 699570 528591 538260 453430 302355 154949 251631 649022 125481
14822 463149 316880 692351 367693 631289 400783 458130 483548 757134 391603 218987
14812 218987 197525 137968 465012 156738 453144 584746 716731 643816 446922 726093
14802 726093 462198 586837 525857 708765 254624 499448 606508 505622 230100 573460
14792 573460 706387 347452 672273 444257 477955 535889 797577 558356 390730 633430
14782F33430j29102K19265k96337K62673j92982J97607k72624J88635j90963K64600
14772F84202A40348N29254r7600L22634l35200J44908k11211o967r2477L73425
14762G67114l62007K95229k69696j21897O36163m16239K46194j0042n2539l4480
14752F77800O4883N7205j7432k11281J44531O4115j27681m1482r565L7093j9434
14741F18752k9097l064j63175M90684n3519C45027M49427l01164L41391o8689
14731G65992p2878J94901k3111l31899L71833r8066J18674J24794Q7936m52388
14721F85788K42781j1012j4858k16192J19755K42052l11997j7405M30676n64604
14711E84984K77175k18669K00397q183k13177J02058J83668l8522J65507j5239
$$ plain form
14782 633430 504328 723593 427256 689929 496947 694554 421930 610565 419602 684202
14772 684202 140348 669602 572002 894636 559436 704344 493133 486166 393689 767114
14762 767114 405107 700336 430640 308743 944906 528667 774861 764819 712280 677800
14752 677800 742683 799888 782456 571175 715706 779821 652140 610658 601093 638186 618752
14741 618752 589655 586591 423416 914100 860581 345027 794454 493290 834681 765992
14731 765992 693114 888015 864904 533005 904838 806772 925446 1050240 1138176 685788
14721 685788 928569 917557 902699 686507 806262 1048314 736317 718912 1149588 584984
14711 584984 862159 643490 843887 835704 622527 724585 908253 869731 1035238 1019999
14701A019999l69319J52064j4804K2101J36790j04140Q2783k80264K55845J17790
14691A018845j80056P6198m5401q4978L73043m61782K45727j15941j2561L02467
14681A115561m33459M13193j82548P0485M94236m39255j6321Q9666M979j55772
14671I60765J64823l01471L85522j27692k18601R6540P1935L46264k30647R4726
14661A242164k06992k3437P4164J52403j26267J48557j81212O2753P5383j61843
14651A055673K75079J89303l58259J38567j3956p0981J11572l96213K75611J2752
14641A219148j9150P6550Q5786J62993k7653m88296L14505O3054n09335K16371
14631A093973J90734K62830l13869L68759k64407l30169M77047L4653J93626l07253
$$ plain form
14701 1019999 650680 802744 787940 810041 946831 842691 925474 645210 901055 1018845
14691 1018845 838789 914987 869586 784608 1157651 695869 941596 825655 813094 1115561
14681 1115561 682102 1095295 912747 983232 1477468 1038213 1021892 1111558 1116537 960765
14671 960765 1125588 824117 1209639 1081947 863346 959886 1031821 1378085 1147438 1242164
14661 1242164 1035172 1011735 1085899 1238302 1112035 1260592 1079380 1142133 1217516 1055673
14651 1055673 1330752 1520055 1161796 1300363 1286407 1215426 1326998 930785 1206396 1219148
14641 1219148 1199998 1276548 1362334 1525327 1497674 1009378 1323883 1386937 877602 1093973
14631 1093973 1284707 1547537 1233668 1602427 1338020 1007851 1484898 1519551 1713177 1405924
14621A405924K3709j74172J71598j66508J70024L36840k67265j51807K39153j70548
14611A416948P8985q4300j45180M23942n421K51403k59221k07466N26277k61558
14601A734409J07030m675P6302m2049l2767m6237J73562k94900j63291M52864
14591A960248k7521l39869J87344p7467K58958j53653K69999j46937J42873k34234
14581A839741L98831o9917m1670j41513l94549O77009j05098J12595j82604O4368
14571B157193J64862j93530k4639J75457K27699j59412K45235j43855K73556m20578
14561B301988K37839J719Q0398N20314j23763M1182L55572k9309K89323M7938
14551C723201Q24564O35767J931207L717107R185282K1862228J581170B0157316
$$ plain form
14621 1405924 1429633 1255461 1427059 1260551 1430575 1767415 1500150 1348343 1587496 1416948
14611 1416948 1495933 1411633 1266453 1690395 1684974 1936377 1677156 1469690 1995967 1734409
14601 1734409 1841439 1836764 1913066 1871017 1838250 1792013 1965575 1670675 1507384 1960248
14591 1960248 1932727 1592858 1780202 1702735 1961693 1808040 2078039 1931102 2073975 1839741
14581 1839741 2238572 2168655 2126985 1985472 1590923 2267932 2162834 2275429 2092825 2157193
14571 2157193 2322055 2128525 2103886 2279343 2507042 2347630 2592865 2449010 2722566 2301988
14561 2301988 2539827 2541546 2621944 3142258 3018495 3059677 3415249 3385940 3675263 3723201
14551 3723201 4547765 5183532 7114739 10831846 20017128 41879356 43460526 20157316
14542A1736274E426891k312717p62245k00770o3123p8502R6232k50935K66681
14533B121512L21980m92749K55167J76825q3701j76767K63983l57785J54799J53271
14523B336535r0584L89226j53560J74136m79183M85222k09436J0385N1949L36921
14513B851611L2470k01194J53708P2178m4545R6451M41381m91969L76221m64222
14503B822090L62143j38890L7277R553J2797L57904j79693j98172J48263K37468
14493C470740k21002M68523O3151m76371L81913m23451L05301k41292N07772q2845
14483C752439k11054K19761L61081j85628K00952M2931m0138j91826N499K36985
14473D191002j44895J83178K18427j72718J94502o4269L44951r7526l35604N05387
$$ plain form
14542 11736274 5426891 3114174 2351929 2151159 2088036 2009534 2105766 1854831 2121512
14533 2121512 2443492 1950743 2205910 2382735 2299034 2122267 2386250 2028465 2183264 2336535
14523 2336535 2245951 2635177 2481617 2655753 2176570 2661792 2452356 2462741 2514690 2851611
14513 2851611 2884081 2682887 2836595 2908773 2864228 2960679 3402060 2910091 3286312 2822090
14503 2822090 3184233 3045343 3082620 3092173 3104970 3462874 3283181 3085009 3233272 3470740
14493 3470740 3249738 3718261 3781412 3305041 3686954 3263503 3568804 3327512 3835284 3752439
14483 3752439 3541385 3761146 4122227 3936599 4137551 4180482 4140344 3948518 3954017 4191002
14473 4191002 4046107 4229285 4447712 4274994 4469496 4405227 4750178 4652652 4317048 4822435
14463D822435j1603J18305l17117M19856N54440j067480N75996j28504J00189
14454E066517K30240k578L81310k45407j09022p0401O43149m90442J56951R7260
14444E657577L55955j56740j194M18954j00119k82780N53587J63094J48038K32792
14434F989164k36328p4713M21721K73475o69214M88168j60510K47562N9751L80554
14424G719630j62928K63319L5134K03162k0537K20347J97714J23713M8689m9365
14414H578878M48129k0899J10953p3973K21573k30230L56348K43618k19991N19684
14404I934090j92814L88900M21616R7940k00163l6654O58410j85199L08605J12094
14394A1306825M04282J80301J24805n9514J20420P15038J03805N10885K63346
$$ plain form
14463 4822435 4810832 4929137 4612020 5031876 5586316 4518836 5094832 4966328 5066517
14454 5066517 5296757 5294179 5675489 5430082 5321060 5250659 5893808 5403366 5560317 5657577
14444 5657577 6013532 5856792 5855598 6274552 6174433 5891653 6445240 6608334 6756372 6989164
14434 6989164 6752836 6678123 7099844 7373319 6704105 7192273 7031763 7279325 7339076 7719630
14424 7719630 7556702 7820021 7855155 8058317 8037780 8258127 8455841 8579554 8628243 8578878
14414 8578878 9027007 9006108 9117061 9043088 9264661 9034431 9390779 9634397 9414406 9934090
14404 9934090 9741276 10130176 10551792 10649732 10449569 10412915 11071325 10886126 11194731 11306825
14394 11306825 11711107 11891408 12016213 11956699 12077119 12792157 12895962 13406847 13670193
14385A3670193j4335K23191K48246M49567p8047O02050j23841L67116M03697j691
14375A5746146K83183O47901N30349j54931O33456M1655M78878K71061N31362
14366A9009060K89218K87975N55063M95984O80551J91704O30829M77502J05649
14357B2723535R14125N56267M4631J030948N56394N38264O62486L25389J059077
14348B8411116P31877M56111J149581L55736J036166M45508J100417J101503Q52775
14339C5640790Q49767J151157Q65393J393008J230990P11448J456888J161413
14331D4460854J528191J465974J298001J623111J911350J449572J749220K043729
14323E7530002J570930K014975K049760K328949K384237K570911K466070L000113
$$ plain form
14385 13670193 13655858 13879049 14127295 14576862 14498815 15100865 14977024 15344140 15747837 15746146
14375 15746146 16029329 16677230 17207579 17052648 17686104 17727759 18206637 18477698 19009060
14366 19009060 19298278 19586253 20141316 20637300 21317851 21509555 22140384 22617886 22723535
14357 22723535 23637660 24193927 24238558 25269506 25825900 26364164 27026650 27352039 28411116
14348 28411116 29142993 29599104 30748685 31104421 32140587 32586095 33686512 34788015 35640790
14339 35640790 36490557 37641714 38507107 39900115 41131105 41842553 43299441 44460854
14331 44460854 45989045 47455019 48753020 50376131 52287481 53737053 55486273 57530002
14323 57530002 59100932 61115907 63165667 65494616 67878853 70449764 72915834 75915947
14315G5915947K618383K815369L420033L129886L718005L718900M109810L914983
14307A03361316M256664M996344M756888N207038N160114N944264O343640O374311
14299A46400579O760182P445313P536173Q015695Q697775Q659042R580702J0332057
14291B13427518J0320811J1203272J1153942J2023085J2199642J2977560J3132927
14284B96438757J3078645J3406664J3968428J3342482J3181707J2794758J1983034
14277C88194475J1159839J0205307Q949275O961951M667275J472513L28095m62461
14269D31476269k049585n237735l343441m246343o988646r248655j0805034j2258339
14261C77298491j3061419j3455427j4078643j3956586j4083428j3791354j3681137
$$ plain form
14315 75915947 78534330 81349699 84769732 87899618 91617623 95336523 99446333 103361316
14307 103361316 107617980 112614324 117371212 122578250 127738364 133682628 140026268 146400579
14299 146400579 153160761 160606074 168142247 176157942 184855717 193514759 203095461 213427518
14291 213427518 223748329 234951601 246105543 258128628 270328270 283305830 296438757
14284 296438757 309517402 322924066 336892494 350234976 363416683 376211441 388194475
14277 388194475 399354314 409559621 418508896 425470847 430138122 431610635 431938730 431476269
14269 431476269 429426684 424188949 420845508 416599165 409610519 400361864 389556830 377298491
14261 377298491 364237072 350781645 336703002 322746416 308662988 294871634 281190497
14254B81190497j2171240j2161684j2119160j1650632j0992586j0478861j0262941
14247B01353393r630525q792963q533382p875074p589091p086883p119402o628047
14239A38098026n901544n529634n102736n204690m966065m487863m263254l940910
14231I8701330l644294l884081l713978l331923l266907k671127l070697k731788
14223G2386535k394316k515891k186333k146691k242241j698520k269945j728274
14215E5204324k034049j217207j142559k082650j529617j172214j518672j060674
14207D3446682l10415j758947j068449j290499j128835j260319r49883q2550j284837
14198C4311948j170768o08672j003111r28998o71211l37442r93781n61897p97431
$$ plain form
14254 281190497 269019257 256857573 244738413 233087781 222095195 211616334 201353393
14247 201353393 191722868 182929905 174396523 166521449 158932358 151845475 144726073 138098026
14239 138098026 132196482 126666848 121564112 116359422 111393357 106905494 102642240 98701330
14231 98701330 95057036 91172955 87458977 84127054 80860147 78189020 75118323 72386535
14223 72386535 69992219 67476328 65289995 63143304 60901063 59202543 56932598 55204324
14215 55204324 53170275 51953068 50810509 48727859 47198242 46026028 44507356 43446682
14207 43446682 43136267 41377320 40308871 39018372 37889537 36629218 35679335 35596785 34311948
14198 34311948 33141180 32532508 31529397 30600399 29929188 29591746 28597965 28036068 27238637
14189B7238637m62245o14373q29298m53213n57239n44741n46117q02433k73619
14180B2155359k97698k14138p48303l98373k31965m09337l75528m84661p59952
14171A8235404R0085k62912o40071j67268k24508n71806j05925n03833j89177
14162A5659989k41524m45306k8565j93369m06804j30024m67166k69977R421m39698
14152A3046977k33653j60039k99000j24592p0659m79304J40971l38594j5023k74443
14142A1192641j53809o8280j64706j26123l84848k27014j48401L9667j40243k00327
14132I618557j05060j28398l71677k77148J346O3j97800k29656n4547O2048m59496
14121G858232J64833o878k64263p9163r6820j49491k78702L37739l67795M22014
$$ plain form
14189 27238637 26776392 26162019 25332721 24879508 24322269 23777528 23231411 22428978 22155359
14180 22155359 21857661 21643523 20895220 20496847 20264882 19855545 19480017 18995356 18235404
14171 18235404 18325489 18062577 17422506 17255238 17030730 16458924 16352999 15849166 15659989
14162 15659989 15418465 14973159 14944594 14751225 14344421 14214397 13747231 13477254 13486675 13046977
14152 13046977 12813324 12653285 12354285 12229693 12159034 11679730 11820701 11482107 11467084 11192641
14142 11192641 11038832 10970552 10805846 10679723 10294875 10067861 9919460 9959127 9818884 9618557
14132 9618557 9513497 9385099 9013422 8736274 8737620 8737683 8539883 8310227 8255680 8317728 7858232
14121 7858232 8023065 8016187 7751924 7672761 7575941 7426450 7147748 7485487 7117692 7539706
14111G539706l26160j53220N4283j11036n36981K64478k0351k65160l3545K69259
14101F681273k98588q9954j64947Q6783k47539P4242j70698p7932n7088J17648
14091E853200j85968j20930k02359j17217J59430k24686l1623j1112R5775m1032
14081E173478j00614l58128L75814l09122J57056k31173K00204j07212k53192
14072D547111k07545J29121q9332R3532j83064K43230n8054l30054m5370K15797
14062D315372l40673J52049J49110j72781j54988J49383Q6769K91998m10911q7329
14052C977999l26256j81220K63037P7492k88033N4435P0550l31993q5618l3907
14042C196486p0147J95161k27838o7042L05891k46768K27084k79616J17220J82693
$$ plain form
14111 7539706 7213546 7060326 7114609 7003573 6466592 6731070 6710719 6445559 6412014 6681273
14101 6681273 6382685 6292731 6127784 6214567 5967028 6041270 5870572 5792640 5735552 5853200
14091 5853200 5667232 5546302 5343943 5226726 5386156 5161470 5129847 5118735 5214510 5173478
14081 5173478 5072864 4714736 5090550 4781428 4938484 4707311 4907515 4800303 4547111
14072 4547111 4339566 4468687 4379355 4472887 4289823 4533053 4474999 4144945 4099575 4315372
14062 4315372 3974699 4126748 4275858 4103077 3948089 4097472 4184241 4476239 4065328 3977999
14052 3977999 3651743 3470523 3733560 3811052 3523019 3577454 3648004 3316011 3230393 3196486
14042 3196486 3126339 3321500 3093662 3026620 3332511 3085743 3312827 3033211 3150431 3333124
14032C333124j25262l19219K33289P426m0738P0681l61899j89269J16713J20582
14022B845428K9531j22436l0207j13694N0036l9432k7397M27114j94243k80811
14012B543889r6014j30438K36964k5765l6878k16074J74771j65260j37365J53450
14002B301280K5689j46709j35318N8977J98165j25210j06026M8464k71213N9194
13992A907293J78311K71856J50230N26051K408311O719385K0944675J3981290
13984D7087402k1840816j1629055n208896k465143j165868m27317l01566l59300
13976C689441p16477K01512k5480n42987K17969P0208k79094J39976n41794L56847
13966B570121j01743j12817n2026m5545j58862j32800J82317j47074K29576l10748
$$ plain form
14032 3333124 3207862 2888643 3121932 3129358 3088620 3159301 2797402 2608133 2724846 2845428
14022 2845428 2874959 2752523 2722316 2608622 2658658 2619226 2591829 3018943 2824700 2543889
14012 2543889 2447875 2317437 2554401 2528636 2491758 2275684 2450455 2285195 2147830 2301280
14002 2301280 2326969 2180260 2044942 2103919 2302084 2176874 2070848 2119312 1848099 1907293
13992 1907293 2085604 2357460 2507690 3033741 5442052 12161437 33106112 47087402
13984 47087402 25246586 13617531 8408635 5943492 4777624 4350307 4048741 3689441
13976 3689441 2972964 3174476 3148996 2606009 2823978 2894186 2615092 2755068 2213274 2570121
13966 2570121 2468378 2355561 2303535 2257990 2099128 1966328 2148645 2001571 2231147 1920399
13956A920399J83568K18141j06924M6039K57921p5315n01412k18493n9039M71809
13946B136694j83604k35661J84365O8947m83083K2452N63512j08561l39954J73207
13936A798314k01437L92198k45457M812K21705m83526J75503K4176o7314R815
13926A628789J95350k04708k7505l192l04000K11639j02894j7679K18513j01075
13916A493238m2954J09026m7227p5781j1012n1031L5944R2051k07590J54196j6775
13905A432085j14695N40255m43937n8739j05693K27551J76328l92995L70850j16815
13895A514195j91291K02679j45659p9066q8899K38672N2045Q3109k65759k60042
13885A059984J29353L3026L8939l2682R6222m64627M31332l01572R6390K12831
$$ plain form
13956 1920399 2103967 2322108 2215184 2261223 2519144 2443829 1942417 1723924 1664885 2136694
13946 2136694 1953090 1717429 1901794 1970741 1487658 1510110 2073622 1965061 1625107 1798314
13936 1798314 1596877 1989075 1743618 1748430 1970135 1486609 1662112 1686288 1618974 1628789
13926 1628789 1824139 1619431 1591926 1588734 1284734 1496373 1393479 1375800 1594313 1493238
13916 1493238 1450284 1559310 1512083 1436302 1425290 1374259 1410203 1502254 1294664 1448860 1432085
13905 1432085 1317390 1857645 1413708 1354969 1249276 1476827 1653155 1260160 1631010 1514195
13895 1514195 1322904 1525583 1379924 1300858 1211959 1450631 1502676 1585785 1320026 1059984
13885 1059984 1189337 1222363 1261302 1228620 1324842 860215 1291547 989975 1086365 1299196
13875A299196k86322K45141N479L09734j77803l54847K27713j86447M1412j7988
13865A105268J26396j3901k02404r8583J02998J98338O881J40665j66907J17015
13855A315766P9397m35703J37359n7j02095l21683J24242J83604L4022J14974
13845A129826j78393L0288k05673K09441j65660L82168n8492j77616K10986m90422
13835F86453Q91040o49118L41832k12377k10507Q7853K71397o9054n37486L53944
13825I53977p3906l36038L36634M6277r3696O5664n7430K74236k85681L26705
13815A156742k11298j03821j4107L6633l75626N15833m27760P6289K49954P1968
13805I74807k00734r983k3920Q1393n0015q6402p3209O61966m56806j82405j09708
$$ plain form
13875 1299196 1012874 1258015 1263494 1573228 1395425 1040578 1268291 1081844 1123256 1105268
13865 1105268 1231664 1217763 1015359 916776 1019774 1218112 1224993 1365658 1198751 1315766
13855 1315766 1395163 959460 1096819 1096762 994667 672984 797226 980830 1014852 1129826
13845 1129826 951433 981721 776048 985489 819829 1201997 1143505 965889 1176875 686453
13835 686453 1577493 928375 1270207 1057830 847323 935176 1206573 1137519 600033 953977
13825 953977 880071 544033 880667 926944 833248 898912 841482 1115718 830037 1156742
13815 1156742 945444 841623 827516 864149 488523 1004356 576596 652885 902839 974807
13805 974807 774073 764090 740170 821563 771548 685146 611937 1273903 817097 634692 524984
13794E24984J41392j8381J30794K22701m70015M28577k69859n1654J59567O0550
13784H58656j27372q2473L7300L5723J98898k57562L12524C88579N76939J54560
13774A120078k22150q6673J17205q9400n1873J33798J48482j43085l23946j09355
13764D93081j95429M16761J20242j36700k053q8602k85098L88595l1443o4255
13754F15099J14593J45863k67439J61008N3992k96141Q7100J49155j51582J51652
13744G63300l4623J13051q210k03221o5275J9824L4138k23792L97082k47460l1269
13733E13545q4813M61835j14069k33259k10266R0865K06521K29539J48828k78528
13723G30198M2940r7610k58150n5814M98324j39753K7005r7055k55750K23313
$$ plain form
13794 524984 666376 647995 778789 1001490 531475 960052 690193 638539 798106 858656
13784 858656 731284 648811 686111 721834 920732 663170 975694 388579 965518 1120078
13774 1120078 897928 811255 928460 839060 787187 920985 1069467 926382 602436 493081
13764 493081 297652 714413 834655 697955 695902 607300 322202 710797 679354 615099
13754 615099 729692 875555 608116 769124 823116 526975 614075 763230 611648 763300
13744 763300 728677 841728 833518 630297 565022 584846 618984 395192 792274 544814 513545
13733 513545 428732 890567 776498 543239 332973 423838 630359 859898 1008726 730198
13723 730198 773138 675528 417378 361564 859888 720135 747140 650085 394335 617648
13713F17648L28847m00044j46834K83584k89857K87385C02166K36042B12270K64913
13703D77183M659k191N0458j20560K7498J44956j62983n7440J17070A60625L39519
13692E00144M13053C33965J26644J62964q6256M9678P5474J54590j3686k63291
13682E40082k23117K92221A75660K80311M0652j89506M11654k61980j34352J56788
13672D79227M0960p0043k4506L9416M307N47815m82970M390K0931j59118J42004
13661E42413j5218A29364K77952J41396A09786N88908C25906L8552L3400K44431
13651F42289j54988A20168O38352k47010H3807L60072J9825A60316M82192N8887
13641G01395A90651L10869j24219J02046A42582L64052q5232J53436B52614J39813
$$ plain form
13713 617648 946495 546451 399617 683201 393344 680729 302166 538208 212270 477183
13703 477183 481842 479651 530109 409549 437047 582003 419020 361580 478650 160625 500144
13692 500144 913197 333965 460609 623573 537317 586995 662469 817059 803373 540082
13682 540082 316965 609186 175660 455971 496623 307117 718771 456791 322439 479227
13672 479227 520187 450144 425638 465054 469361 1017176 534206 538596 559527 400409 542413
13661 542413 527195 129364 407316 548712 109786 698694 325906 364458 397858 642289
13651 642289 487301 120168 758520 511510 83807 443879 463704 160316 642508 701395
13641 701395 190651 501520 377301 479347 142582 506634 421402 574838 252614 392427
13631C92427J72068K5209q9968j86083K2274K92138m7267B81815M54695j33617
13621F02893A80344L91935j85212o3935j46533N0271K69880j41034A27421N02168
13611F29589P7822d8613C05563c6939B92053L13296j77951N2509j27504n9778
13601B92625N41595B69302M7084J25355J01804B68858n0769J96301p8112P3552
13591D09830p2856k0642J52599j73071j17615n8203R6611K22127j64199J08855
13581C83436K19466j56865I1073K5823N3556Q7973n3692J13652A15992M52447
13571E68439B49033R5395M9528j96557p4530A3443L24832J4841p0712K0865L10860
13560F14129R7360l10767A24595J93043J90645n9461k22299L2718J13826j61732
$$ plain form
13631 392427 564495 589704 499736 313653 335927 628065 580798 281815 736510 602893
13621 602893 180344 572279 387067 323132 176599 226870 496750 355716 127421 629589
13611 629589 707411 -48613 305563 -36939 292053 605349 427398 479907 352403 292625
13601 292625 834220 269302 316386 441741 543545 268858 218089 414390 336278 409830
13591 409830 336974 316332 468931 295860 178245 120042 216653 438780 274581 383436
13581 383436 602902 446037 91073 116896 170452 258425 204733 318385 115992 568439
13571 568439 249033 344428 393956 197399 122869 13443 338275 353116 282404 303269 614129
13560 614129 711489 400722 124595 317638 508283 448822 226523 259241 373067 211335
13550B11335J76028A00725N32845A81801L9470J50380j32360L73179B31557k0429
13540B11128r4702M02771F5972L62129J13358k16791n3233J5825F8966J77953
13530B46919N4143K06997l5981A46097o8580J11740A8273L74101j34060L06760
13520E65074k63008n8363j16599J50736A33183M40450d3281F18746B57803J21579
13510C79382j78478J97907A15098K18040F3863P9590L36303B01678J17833c5922
13499B52092l1521D8214M33282A72083K77189Q8025B31540K82860J82256B87984
13488B83461I2597J26278I5864L19700A49771k4686E33K38118j1081J63415j52844
13477B38141K17954A93562J11392A36361K39394A40519k7444L13912r4533C4140
$$ plain form
13550 211335 387363 100725 633570 181801 221271 371651 239291 612470 231557 211128
13540 211128 116426 519197 65972 428101 541459 324668 271435 287260 68966 246919
13530 246919 301062 508059 472078 146097 77517 189257 18273 392374 258314 565074
13520 565074 302066 243703 127104 277840 133183 573633 -43281 618746 257803 379382
13510 379382 200904 398811 115098 333138 63863 143453 479756 201678 319511 -35922
13499 252092 220571 48214 481496 172083 449272 537297 231540 514400 696656 287984
13488 283461 92597 218875 95864 415564 149771 125085 533 238651 227570 390985 238141
13477 238141 456095 193562 304954 136361 375755 140519 113075 426987 332454 34140
13466C24295J7741K14523B14495M2578Q7786I5296K53483L6829o3097A39835P5089
13455B14924L73808C4075J03500B4089J37530K57336j72242o8617J0279J31395
13445C19770L0540b53359C7031K91895j54831g2284A23655K12120j22866J98J01674
13434C14781J03742A89572L19828k2346k05236m1713F9550L26030A69411K39107
13424D08518k02028j2165d1816q0196A51241L29395a058A14612b5937B46203a43406
13412A52224b0776o6853D63758A43191K60187G6845K06484d1222A65615Q5112
13402B50727o2560E5256M3564j8822P2698a26508H5486J19704d2183B5279J33027
13391A58306D4800L33591h6761A90641L63530A52584J64116j27895K01295j51491
$$ plain form
13466 324295 342036 556559 214495 257073 344859 95296 348779 385608 322511 139835 214924
13455 214924 588732 34075 137575 24089 161619 418955 246713 178096 188375 319770
13445 319770 350310 -253359 37031 328926 174095 -72284 123655 335775 212909 213107 314781
13434 314781 418523 189572 509400 487054 281818 240105 69550 395580 169411 408518
13424 408518 206490 194325 -41816 -122012 151241 480636 -1058 114612 -25937 246203 -143406
13412 152224 -20776 -87629 463758 143191 403378 76845 283329 -41222 165615 250727
13402 250727 188167 55256 98820 79998 152696 -126508 85486 205190 -42183 25279 158306
13391 158306 44800 378391 -86761 190641 554171 152584 316700 188805 390100 238609
13381B38609o9492M1406O8791j3930a13843F1350A3803L44131m5784q5789J04188
13370C30549j12403p8303J39073O020J85962A62337M00669j73475n8720k1116
13360C09695K28022I3716P4304m0553h8792F7732L89317j84805J93829i623A44163
13348A25992J52866R684J0144a4439D85321L1859B51055L6368F2059K72383A02210
13336E06623j36771G5744M41913B38966M7855I5402G447J74304J0548f4790B32832
13324F0536J20930N4173p5224G4086O3171L26484K6415F0699J44886n1938K199
13313A55846K55829C4169J61233a3910C96822c404l5416A44593R0359J27944A76963
13301G7782K69424G9423e129B75157J0366J530j32385L671L30584E4816g5929
$$ plain form
13381 238609 169117 210523 279314 265384 -113843 61350 13803 357934 312150 226361 330549
13370 330549 218146 139843 278916 284936 470898 162337 563006 389531 330811 309695
13360 309695 537717 93716 168020 127467 -88792 67732 457049 272244 466073 -9623 144163
13348 125992 278858 288542 298686 -14439 485321 517180 251055 287423 62059 334442 102210
13336 506623 369852 75744 517657 238966 286821 95402 7447 181751 192299 -64790 232832
13324 60536 181466 235639 160415 74086 137257 463741 490156 60699 205585 153647 155846
13313 155846 411675 34169 195402 -13910 396822 -3404 -38820 144593 234952 362896 176963
13301 77782 347206 79423 -5129 275157 285523 287053 154668 158339 488923 54816 -75929
13289b64397A71280K3353b84q7820B3949a38387L9311B06174l2020J09692A38085
13277B88219F3690a28466F6387c4580A83403L6704J06323a16795C45162D4577
13266B41720r2854k5089B7044K28374j25519M683E9871J63452J64164j67636i0994
13254B54485B4937M10572A36533J39636n0752o3554a48572d9735A22213j1558
13244A10655m8762K76033c3133B33863o4982F8467e8791b8451r3643B29625b8329
13232C16131j11522J38161c83849A55663a192j88960B28090j01421N8673E2476
13221B48944j21648J05309E1200b6727j26505c1955G5897b91401A1163Q5356Q2099
13210A78618h679j51727D8284c70011B31173E0235d7821A06152a07716B04917
$$ plain form
13289 -264397 171280 194633 -284 -88104 23949 -138387 -99076 206174 174154 283846 138085
13277 288219 63690 -128466 66387 -34580 183403 220107 326430 -116795 345162 44577
13266 241720 148866 123777 27044 255418 129899 134582 59871 223323 387487 219851 -90994
13254 254485 24937 435509 136533 276169 225417 161863 -148572 -49735 122213 110655
13244 110655 61893 337926 -33133 233863 168881 68467 -58791 -28451 -122094 229625 -28329
13232 316131 204609 342770 -383849 155663 -1192 -190152 228090 126669 185342 52476
13221 248944 127296 232605 51200 -26727 -153232 -31955 75897 -291401 11163 96519 178618
13210 178618 -8679 -160406 48284 -370011 231173 50235 -47821 106152 -107716 204917
13199i3448D0350a50522A31971f5602k7083L4300G5688B161L145N5305a50849
13187C42437a25695D52904A31832a2567B13830J83859J03904g4450A60387J42333
13177C02720A42927B5542b0265C21473Q5075C3263d448E9969a14952j22878R7531
13166a40299M3970B62178J76142E9227a70166E1960c0897H4955a33075B00609
13155C64201A66837b63701B60323a71928B13201g7466E4042J72306p3140N6867
13145B10075H7079J6901a0862A62371a4403n9428I9084P0635J30116b8739I1734
13133D3483J38123e3200A05838a72665A38922O4997F469K08062h4148P53B61716
13121C48154A64888j0761a98288h4062A14637c3758C67957a08314g690k38704
$$ plain form
13199 -93448 40350 -150522 131971 -65602 -92685 -58385 75688 2161 5306 60611 -150849
13187 342437 -125695 452904 131832 -12567 213830 397689 501593 -74450 160387 302720
13177 302720 142927 25542 -20265 321473 406548 33263 -4448 59969 -114952 -237830 -140299
13166 -140299 -96329 262178 438320 59227 -170166 51960 -30897 84955 -133075 200609
13155 364201 166837 -263701 260323 -171928 213201 -77466 54042 226348 153208 210075
13145 210075 87079 103980 -10862 162371 -14403 -73831 99084 169719 299835 -28739 91734
13133 43483 181606 -53200 105838 -172665 138922 203919 6469 214531 -84148 -83395 261716
13121 348154 164888 154127 -198288 -84062 114637 -33758 367957 -108314 -7690 -246394
13111b46394g3672B11195b14064Q4239B91400H7485c11707B03402P4647m9990
13101B28059J25967G5396P287A8589b06121H6348l1929Q4078b203C12184A48905
13089A36592O4064H9979N5525J93288j64945B4980o46M0420R8179j6103a206A16012
13076A02052J88811j10293a98579A09361E4426D724b13791C42391D0890a60743
13065A41480L03026f191B55690b7996A57183b3155j06106A11010M07984A84257
13054A55886l2651j4551r431J7744J20762c9164A73805A4102M84743a24882A56062
13042a51129B32910I5623a96573E42887C5826J11947J4R5422D0892a44033A30821
13030I0212j8531a18102E5590J16589a41915A25251Q5763A02067L16054j94599
$$ plain form
13111 -246394 -73672 211195 -214064 -129825 291400 87485 -311707 203402 278049 228059
13101 228059 354026 75396 82683 18589 -206121 86348 54419 138497 -2203 312184 148905
13089 136592 200656 89979 145504 338792 173847 24980 24334 64754 162933 146830 -1206 116012
13076 102052 290863 180570 -198579 109361 54426 4724 -213791 342391 40890 -160743
13065 141480 444506 -6191 255690 -27996 157183 -23155 -129261 111010 518994 184257
13054 155886 123235 108684 99253 116997 237759 -39164 173805 14102 498845 -124882 156062
13042 -151129 232910 95623 -196573 542887 35826 147773 147787 243209 40892 -144033 130821
13030 90212 71681 -118102 55590 172179 -141915 125251 211014 102067 418121 223522
13020B23522g5275o4193b5962A4183L2290K79394j06931M5326H5611b04460c7594
13008D85012a84018g6227j5679E5633N2559N6258c84670E7898J24549a21838B49027
12996C22351G9763J00763F0470J51864j02314h8606J3558n8298B43227a83540
12985B23973C9415J54871c9075A70255g7101K1056E8317L63629I7832a89782E06666
12973a85219B09632b14401F4595a25901A62234a3206B71960a91237G6410a00236
12962b96171C89918e2272k4250j6488A8424c09j4549B59561a23668B7425l582
12951B3843R8118f1865C17880A49212a4664B38454j04296b51162J20380H234K46428
12940B54662A10439L2348J27122B1481J08474K18361e1920k2761B01984q8730
$$ plain form
13020 223522 -75275 -139468 -25962 14183 46473 325867 218936 264262 85611 -204460 -37594
13008 485012 -184018 -76227 -91906 55633 108192 164450 -384670 57898 182447 -121838 249027
12996 322351 79763 180526 60470 212334 110020 -88606 -75048 -133346 243227 -183540
12985 223973 39415 194286 -39075 170255 -77101 -56045 58317 421946 97832 -189782 506666
12973 -185219 209632 -214401 64595 -125901 162234 -13206 271960 -191237 76410 -100236
12962 -296171 389918 -52272 -76522 -93010 18424 -309 -14858 259561 -123668 27425 23843
12951 23843 121961 -61865 317880 149212 -14664 238454 134158 -251162 -130782 8234 254662
12940 254662 110439 142787 269909 21481 129955 348316 -51920 -74681 201984 113254
12930A13254J4690f7200C52058b03325A2393O124J93369G9794C1318J28769g6614
12918I7756l0083C2511j1764a8373E91156I4037A337J19524K57673i6720c9983
12906G4332e8073B21051E1108K28878a79038A77343p3745A8534Q8094b25251e050
12894F5224c81063h5813k09427j11615A49818c88652c7740C12634L4824a21361
12883C42180D2911Q8854J74596a71176b1604C05475I2746O6743K08635a61116
12872a9044B03623b7500a1003A87637b36778A60589P5622i6093A50257L8353E5165
12860H1362h7392d0474k8585A47268B7173L40596A53601b9955H7582C7614Q9410
12849A27024a50545a1053A16913e1272k61717b6543k06602B06116C2428N4704
$$ plain form
12930 113254 127944 -67200 352058 -203325 12393 18517 211886 79794 31318 160087 -76614
12918 97756 67673 32511 20747 -18373 591156 94037 1337 120861 378534 -96720 -39983
12906 74332 -58073 221051 51108 279986 -179038 177343 103598 18534 106628 -225251 -5050
12894 65224 -381063 -85813 -295240 -406855 149818 -388652 -37740 312634 347458 -121361
12883 342180 42911 131765 306361 -171176 -21604 305475 92746 159489 368124 -161116
12872 -19044 203623 -27500 -11003 187637 -236778 160589 236211 -96093 150257 188610 55165
12860 81362 -87392 -40474 -69059 147268 27173 367769 153601 -29955 87582 37614 127024
12849 127024 -150545 -11053 116913 -51272 -312989 -26543 -233145 206116 32428 87132
12839H7132i4005d1898H42b3684j97823E3915O8620n140A3415c454k36298h8709
12826d7912A18950G879a79636L0990A75868l4809p17O1331J412C9301N5061Q4472
12814A78834B1897K12349g8886l4196H8192R3101K02978c03478A69492O2820b03076
12802C6685L74565b33506C27341A5244Q2855K4044k3187h152A26518a904j1383
12791a3287D7555K36359a11733b7031C793Q6042a56376A29730k0295b10401c4764
12779B11327b25926G146f2996o5745J2971B248a73521A81392h8813I0103b9117
12767A79776k5107C0368b86829i1350E8324h0520I7734A5974i0473d2390j52958
12756a95348h5758P202B04604D2637A0067K41215a37792C1205J1864K91624q2220
$$ plain form
12839 87132 -94005 -41898 842 -23684 -221507 53915 122535 117395 13415 -3454 -239752 -88709
12826 -47912 118950 7879 -179636 -148646 175868 141059 140342 201673 203085 39301 94362 178834
12814 178834 21897 234246 -78886 -113082 88192 181293 384271 -303478 169492 232312 -203076
12802 36685 411250 -233506 327341 15244 98099 122143 98956 -8152 126518 -1904 -13287
12791 -13287 47555 283914 -111733 -27031 3793 89835 -156376 129730 109435 -210401 -34764
12779 211327 -225926 7146 -62996 -128741 -115770 2248 -173521 181392 -88813 90103 -29117
12767 179776 154669 30368 -286829 -91350 58324 -80520 97734 15974 -90473 -42390 -195348
12756 -195348 -85758 -78556 204604 42637 10067 251282 -137792 31205 43069 334693 252473
12745B52473d20A98167I252a99815A25365l1039e5059D48986H3115b13634a03222
12733A03746a93790A57360a62573A75626a72156A72748A9787L2708K47524n3719
12723B46300I9249a21022N6464A044J89949N633m549E7633A9265P3568m2992A5744
12710C8265J86496M6668n7804K52714A20455c4592B11990P66J94937A91163g530
12698B13649F7853f8497C15655G9451i8333j88966J40979k8318C74851h5789Q980
12687g6809A67735M4185d6868G3137c33161A3969a4546C0005J43805P2426a7923
12675D1581J33802O0454E5665k1942P1567J06680p178G9191a1421B66690h4531
12663C78152b23336C68019F8762f4311K1470A8764d4825D7111J41184L80232a6418
$$ plain form
12745 252473 -420 198167 9252 -199815 125365 94326 -55059 448986 83115 -213634 -103222
12733 103746 -193790 157360 -162573 175626 -172156 172748 19787 52495 300019 246300
12723 246300 99249 -121022 -64558 1044 190993 196626 192077 57633 19265 92833 49841 15744
12710 38265 224761 271429 213625 466339 120455 -34592 211990 212756 407693 191163 -7530
12698 213649 67853 -68497 315655 79451 -98333 -287299 -146320 -174638 374851 -85789 -76809
12687 -76809 167735 211920 -46868 73137 -333161 13969 -14546 30005 173810 246236 -17923
12675 41581 175383 235837 55665 33723 105290 211970 204792 79191 -11421 266690 -84531
12663 378152 -223336 368019 68762 -64311 -42841 18764 -44825 47111 188295 568527 -16418
12651f8486D09386E7551b71391B22953a23963J0789m5224k2780L5372B56064E6868
12639A75301L9696a46569A27040b10362l1517E2169J97222j20556g4755b8382
12628D71587A48061J42095O8617r7172i3993B29817K49671j18090G5818K81253
12618C57071h0074B40340I5399b71866H8364R9549b32747C6721J4040K56183A11190
12606A69159a21133B2273R4660H332L5889J97126b9944A52453L8454g1309B18019
12594C1270c65864a43090E5480c660p6943C33460C1097m386a8110j54143B45268
12582a43258I6397a31404d4649B93029a44331A57519b23282j8707A74007J34686
12572C08693a5489B23306B7509a50526K6954G7495L5162e1709f643C46488k2687
$$ plain form
12651 -68486 409386 57551 -271391 222953 -123963 -113174 -158398 -181178 -145806 256064 56868
12639 175301 214997 -146569 127040 -210362 -241879 52169 249391 128835 -74755 -28382
12628 471587 148061 290156 358773 261601 -93993 229817 479488 361398 75818 357071
12618 357071 -80074 240340 95399 -271866 88364 187913 -232747 36721 50761 306944 111190
12606 169159 -121133 22273 116933 8332 44221 241347 -29944 152453 190907 -71309 218019
12594 31270 -365864 -143090 55480 -3660 -80603 333460 31097 26711 -18110 -172253 245268
12582 -143258 96397 -131404 -44649 293029 -144331 157519 -223282 -241989 174007 308693
12572 308693 -15489 223306 27509 -150526 -123572 77495 112657 -51709 -6643 346488 323801
12561C23801h6007D6257P1003J32235b34385B06352l5922i3753B63936E7728a01349
12549H4158Q7011l8998e5577j61916A21449L6307r774m6580G990b2697j88002
12538b10699j39324a47291k1990A31446f8347j5667H8746J1097e34560G3474a69958
12526A09375K5480J11621H7376B4242l940J08189K62261d13020d2545r5840B09325
12514B31843b06170H1949a96205E56716B8869j975a10685e4457B59547a69594
12503b60392O5360k11843A93177a57678b3740l8461B81613r3633b7308A17407
12492A24291k7937f0993l45590B86616F7922J05926G9095b7415A51269a10059
12481B22368a29688q2915B14428D1107d6688B60363a83943f6105H8227B6501J62726
$$ plain form
12561 323801 -86007 46257 117260 249495 -234385 206352 170430 -93753 263936 57728 -101349
12549 84158 171169 132171 -55577 -217493 121449 157756 147982 101402 7990 -22697 -210699
12538 -210699 -350023 -147291 -169281 131446 -68347 -84014 88746 99843 -534560 73474 -169958
12526 109375 134855 246476 87376 24242 20302 128491 390752 -413020 -42545 -138385 209325
12514 231843 -206170 81949 -196205 556716 28869 26894 -110685 -54457 259547 -169594
12503 -260392 -195032 -406875 193177 -157678 -23740 -62201 281613 187980 -27308 117407
12492 124291 96354 -60993 -406583 286616 67922 173848 79095 -27415 151269 -110059
12481 222368 -129688 -212603 214428 41107 -46688 260363 -183943 -66105 88227 26501 189227
12470A89227b3816C4782Q4651b98539D3111L7575K72068a4402j69185D238R267
12459A3505e2980q609C99031B8998f0905e348H501J47289m9953f9672a7830p1923
12447h9753j21680b615j298C535c6655j57237h2042j79101R4286O5931J4066j15343
12435b02203L114N9974B71151b50476c8540p2468k12779N2384A11686l2096h1600
12423I9368N1474d00046J29873A62502a96267B99990l0548a46052d8856A63981
12412A07177J8559c07662E8737Q4475g9672K7557A84082c3560l66984a42796b5591
12400B01804C8385a48508M2017j88052a12307k49533A46292c7058b309o2940b5078
12388A01204J27632a16754J9590C8536J21456l7792a14643d2118l467B17817I0138
$$ plain form
12470 189227 -23816 34782 119433 -298539 43111 80686 352754 -14402 -183587 4238 13505
12459 13505 -52980 -61589 399031 28998 -60905 -5348 8501 155790 105837 -69672 -17830 -89753
12447 -89753 -211433 -2615 -3913 3535 -36655 -193892 -82042 -261143 -166857 -100926 -86860 -202203
12435 -202203 -199089 -139115 271151 -250476 -38540 -111008 -323787 -271403 111686 79590 -81600
12423 99368 150842 -400046 -270173 162502 -196267 299990 269442 -146052 -48856 163981
12412 107177 125736 -307662 58737 143212 -79672 -52115 184082 -33560 -400544 -142796 -25591
12400 201804 38385 -148508 -106491 -294543 -112307 -361840 146292 -37058 -2309 -65249 -25078
12388 101204 228836 -116754 -97164 38536 159992 122200 -114643 -42118 -45585 217817 90138
12376B66245a46351Q218H6461k6209c30293L4791I8159K69232H8354J82172e1744
12364A40611P1602a71131p9479E6011f9737j0478n7419k5456F1966h3521A75407
12352A33142f5160I8696D5332J9892K1065a18819B15209c03943E7395L1947c15636
12340A15764i4232J1624B76596a46395B70919A4229g0846k41801H2546K877a0031
12328B0901a9388o6270H5179a45084n2187C9596J67846B1159M2541f0431A83320
12316b07115e9528A19922c89983J62073e3046A24389n000C4572d1049A0707h9548
12304B16774b48019A06156c4115A09899b311j51567d4816j77911J02966d6608
12293c36596a19371D12082D9979h9063j1757B26422r1353E8977M23251E3574J14008
$$ plain form
12376 266245 -146351 -138133 86461 60252 -330293 -295502 98159 367391 88354 270526 -51744
12364 140611 212213 -171131 -250610 56011 -69737 -80215 -137634 -163090 61966 -83521 175407
12352 133142 -65160 98696 45332 65224 86289 -118819 215209 -303943 57395 89342 -315636
12340 115764 -94232 -82608 276596 -146395 270919 14229 -70846 -312647 82546 85423 -10031
12328 20901 -19388 -85658 85179 -145084 -197271 39596 207442 21159 63700 -60431 183320
12316 -207115 -59528 119922 -389983 -227910 -53046 124389 119389 34572 -41049 10707 -89548
12304 216774 -248019 106156 -34115 109899 -2311 -153878 -44816 -222727 -119761 -46608
12293 -336596 -119371 412082 49979 -89063 -100820 226422 135069 58977 482228 53574 167582
12282A67582D1043J55010b46492h7232B89549H3347J54957K42266h6828A81463
12271A40277J19196C3246J94026N4095a88683C01811O2635m2889b8654G4576J29208
12260B03784d1350A62799h8598j70494A11694g7208A29867J63720n2867A17796
12249B46518p3249Q1255a64981C8794a10632b8962r581j63987c322A29223a17042
12237C41719e570D01322a52369J5582D8384j0171J53054J23527A54235b22508
12226d7917B54469c8318B55628k5970C8444J04064c4847H7894J53942I7600K94240
12215C91840A71570l5497K12654D9825K83689A64870K06479F6833c6873B4775
12204D75542D496a19861B71124j1634C8392L60007e3606D0778J95880L23249b62413
$$ plain form
12282 167582 41043 196053 -246492 -87232 289549 83347 238304 480570 -86828 181463
12271 140277 259473 33246 227272 281367 -188683 301811 364446 321557 -28654 74576 203784
12260 203784 -41350 162799 -88598 -259092 111694 -77208 129867 293587 240720 117796
12249 246518 173269 254524 -164981 38794 -110632 -28962 -38543 -202530 -3322 129223 -117042
12237 341719 -5570 401322 -152369 -136787 48384 38213 191267 314794 154235 -222508
12226 -47917 254469 -38318 255628 229658 38444 142508 -34847 87894 241836 97600 391840
12215 391840 171570 136073 348727 49825 333514 164870 371349 66833 -36873 24775
12204 475542 4496 -119861 271124 259490 38392 398399 -53606 40778 236658 559907 -262413
12192C83767A91204R6137r6615A5531b02570O4022c6515C0800a95840C00001m9776
12181B50225A2341M4163R7754J37455b43598j6083B02184I0126M967h0267a1712
12169B82252r0826G6637K13944a807D8988L75188f6678B5564b9883p7065C4342
12157c1200B6899c47535A31201J11022a80546B60641G1382N8709a45718B70783
12146a550G2817K05162Q7640A75486F2948J40185L5588I4343N5940a5528j07849
12135a23377e26A14269b25586R4537L5977B79440f5745D8600a22132m8477P8118
12124i2491j95201E0594m977c811A7552J15541k7411C0a15827A26374L810m1120
12112H9064J7388K1436e8897A26700K29356a02461B35036b29042f3533B6863b2787
$$ plain form
12192 383767 191204 287341 190726 15531 -202570 -138548 -36515 30800 -195840 300001 250225
12181 250225 12341 56504 154258 291713 -243598 -259681 202184 90126 95093 -80267 -11712
12169 282252 191426 76637 290581 -1807 48988 424176 -66678 25564 -29883 -106948 34342
12157 -31200 26899 -347535 131201 242223 -180546 260641 71382 130091 -145718 270783
12146 -1550 72817 277979 365619 175486 62948 203133 238721 94343 150283 -15528 -123377
12135 -123377 -526 114269 -225586 -131049 -95072 279440 -65745 48600 -122132 -170609 -92491
12124 -92491 -287692 50594 45617 -3811 17552 133093 105682 30 -115827 126374 130184 89064
12112 89064 106452 127888 -58897 126700 356056 -102461 235036 -229042 -63533 26863 -22787
12100B96051h6533C57591D7847a59345B53966c7238C92752D7815a8149B7296d5396
12088g2435G7516b01722G5005a05666B74036A07998a44256A05397a24412A99411
12077A57132h3671E392K87874b17637R9170B45457r845M89941J060586n58327
12067A227812D97886d23174A75930i8246F7364K33670J6753n6172a06377j67131
12057b73508g2006I3474J19962H3826e9240H1973a45475b6698A56892D4726j7956
12046B6770J88765F1194i265H6913d1509A8689N595M34974A0818O4096c35475
12034A60745C4149d3623B21706a19852a9844A54678b44205A52000a02771B67038
12023a77605g2492j07453r7632a1986C8181e4909H4270D0058L1298a722j41038
$$ plain form
12100 296051 -86533 357591 47847 -159345 253966 -37238 392752 47815 -18149 27296 -45396
12088 -72435 77516 -201722 75005 -105666 274036 107998 -144256 105397 -124412 199411
12077 157132 -83671 5392 293266 -217637 -118467 245457 235612 725553 1786139 1227812
12067 1227812 497886 -423174 175930 -98246 67364 301034 317787 261615 -106377 -273508
12057 -273508 -72006 93474 213436 83826 -59240 81973 -145475 -26698 156892 44726 26770
12046 26770 215535 61194 -9265 86913 -41509 18689 24284 459258 10818 74914 -335475
12034 160745 34149 -43623 221706 -119852 -19844 154678 -244205 152000 -102771 267038
12023 -177605 -72492 -179945 -277577 -11986 38181 -54909 84270 40058 71356 -1722 -142760
12012a42760m9011E4052j926a79458n8210D579b89677J11724L4621B93143a95587
12000c13578J46788K9708A45364d865r6271A77896c8520j5846M105n9681N1340
11989e8602j20240D4872L8322a0128A99715G7156J00728a22418j67808A75157
11978a26581A24724a26864B52042p5225a18776N3134d96k16407E9450i5825C2546
11966a54569A2684i2973n977A83966K54929a62361j18193j62345H8489b45123
11955a25388B20930b19612A86365a28414J7635M2301B78051a9024k43218J25563
11945a36679C8117b59254C0731f0558j78055o0505L3804L2020J771P8903C7756
11933B39492F8642a28734k1140A24571J59756e2534b6000D6937J91476m0271l9334
$$ plain form
12012 -142760 -191771 54052 52126 -179458 -237668 4579 -289677 -177953 -143332 293143 -195587
12000 -313578 -166790 -137082 145364 -4865 -101136 177896 -38520 -54366 -50261 -109942 -58602
11989 -58602 -178842 44872 83194 -10128 199715 77156 177884 -122418 -290226 175157
11978 -126581 124724 -126864 252042 176817 -118776 -65642 -496 -216903 59450 -95825 32546
11966 -154569 12684 -92973 -98950 183966 438895 -162361 -280554 -442899 88489 -245123
11955 -125388 220930 -219612 186365 -128414 -110779 -68478 278051 -19024 -262242 -136679
11945 -136679 38117 -259254 30731 -60558 -238613 -299118 -265314 -233294 -231523 -152620 37756
11933 239492 68642 -128734 -149874 124571 284327 -52534 -26000 46937 238413 198142 158808
11922A58808a07887A647J73836C7189a40535q5810Q8823l933B6859M4808A099
11910a50206F9448a74105A60210e9877C691J57801k7156K89J18091a31752j26436
11899b58188R9172A49921P9691C4111J67221L1284H5812c03086e4457k87397C53623
11887d719A55909f8267k8967C12883C0178a10235H5698d16333a55336j85649A40153
11875B11799a00398m0610A5571i8607a3143p3184A6572L7325F717R2456j9414
11864G9759J16217o312b23869a09070H3962e1098q3418A6135c5771F5284a16805
11852a05355d0511j41584A75038b65193H0565N5753a90726A14187o597l0134b04874
11840f020m66374B57153G1423b09436g5611A82249A8400J75807c2956B1723q62
$$ plain form
11922 158808 -107887 1647 175483 37189 -140535 -226345 -137522 -141455 26859 71667 1099
11910 -150206 69448 -174105 160210 -59877 3691 161492 134336 134625 252716 -131752 -258188
11899 -258188 -159016 149921 229612 34111 201332 232616 85812 -303086 -54457 -341854 353623
11887 -4719 155909 -68267 -97234 312883 30178 -110235 85698 -416333 -155336 -340985 140153
11875 211799 -100398 -141008 15571 -98607 -13143 -86327 16572 53897 6717 99173 79759
11864 79759 195976 189664 -223869 -109070 83962 -51098 -134516 16135 -35771 65284 -116805
11852 -105355 -40511 -182095 175038 -265193 80565 136318 -190726 114187 107590 77456 -204874
11840 -6020 -472394 257153 71423 -209436 -75611 182249 18400 194207 -32956 21723 20861
11829B0861M8509A1659J05878L823i0164q7972p4890A87529f2524J7950a4070
11817A34841c78735a86707B09533a79363D3348a31867a5839F3235J10244f2131
11806e3334n9865E0837a36579A2894J2344a09755d5723J4480e834E3340a0825
11794A4811f0620k27315A88315e2878A17224e8300B27574a5911A7125L43250K5167
11783C85542D9398b12920f4151l3368n5179F5378c82215D1288b3140q734k34181
11772b66055Q8846D0050Q2053K04699i7907j70904A65027i0808A89784R5668a75836
11760A06872a54282K2488F9387a37494e1914B8533o790f699k5778k15516b1636
11748c13755C4373a73509A10375B2144M1389j4686K21034a16035D67223A78125
$$ plain form
11829 20861 69370 11659 117537 121360 -90164 -178136 -253026 187529 -62524 -44574 -14070
11817 134841 -378735 -186707 209533 -179363 43348 -131867 -15839 63235 173479 -62131
11806 -53334 -113199 50837 -136579 12894 25238 -109755 -45723 -31243 -5834 53340 -10825
11794 14811 -60620 -287935 188315 -52878 117224 -58300 227574 -15911 17125 360375 385542
11783 385542 49398 -212920 -64151 -97519 -152698 65378 -382215 41288 -23140 -31874 -266055
11772 -266055 -177209 40050 122103 326802 -97907 -268811 165027 -90808 189784 285452 -175836
11760 106872 -154282 -131794 69387 -137494 -51914 28533 21743 -6699 -32477 -247993 -21636
11748 -313755 34373 -173509 110375 22144 63533 48847 269881 -116035 467223 178125
11737e1277F0311J41533f8276l04861i8638A09910b17263C40019c82706a08393
11726A39020h9390J2992E8023a6507k02546D1303l732n61h4172B05228C5854L57031
11714C92885I5661b0842j36400d7904O761C8384d37371b5830A90151E1319M3510
11703I4829a68231A692a44845n9090I8002J82942f5505A97724e0790j18122l137
11692a72049c652F4647e1604n2934b578j89554A36824b25192f2189B44730p9388
11681A65342P8097H2534g1362D76303F8936b56699B90767F3632B082L47402j43111
11670B06373H5769l0897R0597b02066B25969J29153B2854Q8719L3004h953p5207
11659h4160d113k32129F511c42976I078N1785P1055e9733A29263a36332B33633
$$ plain form
11737 -51277 60311 201844 -68276 -373137 -98638 109910 -217263 340019 -382706 -108393
11726 139020 -89390 -76398 58023 -16507 -219053 41303 37571 37010 -84172 205228 35854 392885
11714 392885 95661 -20842 -157242 -47904 -41143 38384 -437371 -25830 190151 51319 94829
11703 94829 -168231 1692 -144845 -203935 98002 280944 -65505 197724 -50790 -168912 -172049
11692 -172049 -3652 64647 -51604 -104538 -2578 -192132 136824 -225192 -62189 244730 165342
11681 165342 243439 82534 -71362 476303 68936 -256699 290767 63632 2082 349484 206373
11670 206373 85769 54872 145469 -202066 225969 355122 22854 111573 144577 -8953 -84160
11659 -84160 -4113 -236242 6511 -342976 9078 60863 131918 -59733 129263 -136332 233633
11647a37697k6627j4139E5385A0503K1265f6424B45306f2692l1915k054H9070
11635g1533B46981g9783D78773b82156a32930A84025l8674N7814m4101J31945
11625B91009a16249j62642C69021r8782L911f3415m3871K2750A23741a55115j43548
11614b98663I8842a71404N2077D7272f5222A24568e4634A97673b98374H6409J02818
11603A89227J13739A3330M2735b1647C8199J40262a5380B814c7729B08759h6642
11591A83558b00981o2995a00869A94433c11436c9107A33896J32346m3561A10211
11580A4400N0337b1042j04070l6262B43018b74369C2992R0953f4386B41531J06935
11569C48466j36585p943h1990C29838A02574K831j9446J1054J13710l0689M8470
$$ plain form
11647 -137697 -164324 -178463 55385 10503 31768 -66424 245306 -62692 -94607 -96661 89070
11635 -71533 246981 -79783 478773 -282156 -132930 184025 145351 203165 159064 291009
11625 291009 -116249 -278891 369021 270239 274150 -63415 -107286 -84536 123741 -155115 -298663
11614 -298663 98842 -171404 -119327 47272 -65222 124568 -54634 197673 -298374 86409 189227
11603 189227 302966 13330 56065 -21647 38199 178461 -15380 2814 -37729 208759 -86642
11591 183558 -200981 -263976 -100869 194433 -311436 -39107 133896 266242 222681 110211
11580 14400 64737 -21042 -125112 -161374 243018 -274369 32992 123945 -64386 241531 348466
11569 348466 211881 203938 -81990 329838 102574 105405 85959 97013 210723 180034 228504
11558B28504A09959b42197A815a36766G0658K8596c9526A20121g0145A76791b65057
11546B13a97034E6302J09917J14893J81285g8855B92329M3391E2277J230O8447
11535A21954l2668K7814K17461m1235K9743Q7228C7556N4824P8296p4493B8043
11523b44749J07377A35011L261J3046P0452K5570e5893I7055a56863B36510e8030
11511A42439l5760c7723j83659C73532n5933D6021c01329A78247e6794I6821K4618
11500A21439J54416a60527A29688B3262L36O1935J8194K85027d2640A13503M6863
11489A60366Q7092A5955e9111J7129D0912J05819P8267k8178e5560B98687B5089
11477I9645J06083E8071K22592b4981B37188b5141A30428F1015J98766L66547
$$ plain form
11558 228504 109959 -242197 1815 -136766 70658 99254 -39526 120121 -70145 176791 -265057
11546 213 -197034 56302 166219 281112 462397 -78855 292329 335720 52277 53507 121954
11535 121954 89286 117100 334561 293326 323069 410297 37556 92380 170676 96183 28043
11523 -244749 -137372 135011 138272 151318 221770 247340 -55893 97055 -156863 236510 -58030
11511 142439 106679 -37723 -221382 373532 317599 46021 -301329 178247 -56794 96821 121439
11500 121439 275855 -160527 129688 23262 23598 85533 103727 388754 -42640 113503 160366
11489 160366 247458 15955 -59111 -41982 40912 146731 224998 196820 -55560 298687 25089
11477 99645 205728 58071 280663 -24981 237188 -25141 130428 61015 259781 626328
11467F26328A1486C953L0782K23051J4643H9143C669K5833J90231o4172p2175
11456H3386J72553A19960Q8379J05312l9380j3350A12269a68602A60302C5287
11445A48360J37306a80073M1063B3286M4462K68042A60082j1515P97f711j86415
11434a93126A58937F9303k0228J55563n6686i9827K7001K0770D8262i4028C13818
11422B04748a61781J4120c3975k73828M8488b0846O345k15426P5533l1124E6462
11410a23356A01116b3952B23932c9732k66021F4264J19203a04636B20308j09431
11400A10877a24941e0215A12051K08033F7507a33022j13717a22406B09962m0496
11390A69466b21369o1193Q4341b5168h491j45416E3851d8459j56358D95970H7764
$$ plain form
11467 626328 11486 3953 34735 257786 272429 89143 3669 29502 219733 155561 83386
11456 83386 255939 119960 208339 313651 274271 260921 112269 -168602 160302 35287
11445 148360 285666 -180073 -139010 23286 67748 335790 160082 148567 149364 -6711 -193126
11434 -193126 158937 69303 49075 204638 147952 -99827 -72826 -52056 48262 -94028 313818
11422 204748 -161781 -147661 -33975 -307803 -259315 -20846 -14501 -229927 -154394 -185518 56462
11410 -123356 101116 -23952 223932 -39732 -305753 64264 183467 -104636 220308 110877
11400 110877 -124941 -50215 112051 320084 67507 -133022 -246739 -122406 209962 169466
11390 169466 -221369 -282562 -198221 -25168 -8491 -153907 53851 -48459 -204817 495970 87764
11378A05654a48891C49812a3642D11529g2032H2818b05643B11105D4179N6958
11368A01137d4791d039l3931C7919f6088m429B17578b51261B977d5992H6219c4683
11355A29425n7111l2100J59146P6424j08311H2206K7447K24809A31008h0416B28587
11343A54839E2424L6931H063b9996p1963A05791A3162b04233A81302a94994D0304
11331B33957j07319f1381B7688K51551m4561i2823n2460p708G7697N79879A13148
11319A8289b1810B71523a65075A28715R6391n4835C1070N6196J77028g6730l11894
11308c88624A2694g9112A75368C6634L8370g085B05166q4170a55666G0993b27747
11296a16306K2851I0202J70841I3895d11599A3840J22224a07540l09086i038m8860
$$ plain form
11378 105654 -148891 349812 -13642 411529 -72032 82818 -205643 211105 44179 101137
11368 101137 -44791 -4039 -37970 37919 -66088 -70517 217578 -251261 2977 -45992 86219 -34683
11355 129425 72314 40214 199360 275784 167473 82206 109653 334462 131008 -80416 228587
11343 154839 52424 89355 8063 -29996 -101959 105791 13162 -204233 181302 -194994 40304
11331 233957 126638 -61381 27688 279239 234678 -92823 -145283 -152991 77697 657576 113148
11319 18289 -21810 271523 -165075 128715 225106 170271 31070 87266 264294 -76730 -388624
11308 -388624 12694 -79112 175368 36634 75004 -7085 205166 120996 -155666 70993 -227747
11296 -116306 -93455 90202 261043 93895 -411599 13840 136064 -107540 -416626 -9038 -57898
11285e7898A08955J56880a67263j98509C3948c2174G0944e6048p4645G0558a52348
11273A27923b14869f0097j29110f6409l9437k883p6515F3873c057n4580k88118
11262c45755C1583O1766e1585A30713n4185d3846C1116O5989L34584i0536k44703
11251c35239I4354a94095P1385k89952B32012g4365k04849g3065A02397c01647
11240d9492M119j76468E1163a28657b5246p7234A53088a77017P1013l96775J06569
11229c96210a50010B18012I1481l5081R9375c8680F1727d11891a29936G742c01868
11217E131e7398A28589a05391j93757a09314B11273a6029k17263L3383A67712
11206I5857e6217o3453E7201a72943D0532A1534J10533a46296R537j18197A786
$$ plain form
11285 -57898 108955 265835 -167263 -365772 33948 -32174 70944 -56048 -130693 70558 -152348
11273 127923 -214869 -60097 -189207 -66409 -105846 -108729 -185244 63873 -3057 -57637 -345755
11262 -345755 31583 93349 -51585 130713 76528 -43846 31116 97105 431689 -90536 -335239
11251 -335239 94354 -194095 -122710 -412662 232012 -74365 -279214 -73065 102397 -301647
11240 -49492 -45373 -221841 51163 -128657 -25246 -102480 153088 -177017 -106004 -502779 -396210
11229 -396210 -150010 218012 91481 56400 155775 -38680 61727 -411891 -129936 7742 -301868
11217 5131 -57398 128589 -105391 -299148 -109314 211273 -16029 -233292 -199909 167712
11206 95857 -56217 -119670 57201 -172943 40532 11534 122067 -146296 -136759 -254956 1786
11194G4173J80025a8221d927G2080a70938D1628R8401f7380E0820b71964h1830
11182e1075k41558D0237a41263j7717r6878B7513K02320e6804A42356J63505A14411
11170c3238A33712n5016d5143C36543c87297a24467M5515C716a98888g0226B11004
11158a09297j32591B46299a19380C367c35031C22385a19883B20196A04272a32826
11147a81962N5167A43768I518J85551G0506B2406J13837c1528p5391C87513A6334
11135a27317E8122h0593j09567C76612c42282J30330J03630C50648r013a90213
11124I0911g6136j06388I1049O6476L9829f1512L0381C51312A10425f5380j11777
11113a77157h0909A01275I081K90277q6919K26225A77344C1194P6625b2293m9105
$$ plain form
11194 74173 254198 -18221 -4927 72080 -170938 41628 140029 -67380 50820 -271964 -81830
11182 -51075 -292633 40237 -141263 -158980 -255858 27513 229833 -56804 142356 305861 114411
11170 -33238 133712 78696 -45143 336543 -387297 -124467 -78952 3716 -198888 -70226 211004
11158 -109297 -241888 246299 -119380 3367 -335031 322385 -119883 220196 104272 -132826
11147 -181962 -126795 143768 9518 195069 70506 22406 136243 -31528 -106919 387513 16334
11135 -127317 58122 -80593 -190160 376612 -342282 -211952 -108322 350648 341635 -190213
11124 90911 -76136 -182524 91049 157525 197354 -61512 -31131 351312 110425 -65380 -177157
11113 -177157 -80909 101275 9081 299358 212439 438664 177344 31194 107819 -22293 -71398
11102g1398B45076F7954M46319A22948A3103K74618J00108A45762M2791J6240
11092B04793R4619J57414H7551c5328A72304o0950J16214J71230A2639K14794
11082B27433i6830E0021O0546K73820E5696b49357F34337B41517P5457J00614
11072D17588J29642B47334l3864l8719K13871n3203J17380F2411M25245m8133
11062D39523M6999m0578J68663j37744B33355J29729R7934J00930j99337O7126
11052D29737J33642K33789j38811J12984l10444J40569n8699K15878j53074J90085
11042G95656k42132J75686o7217K50358k04791p2191J68120j38273l24567L54070
11032F94719k94569m4728M77044K86095E37506K25100j88439O5113r8072J12663
$$ plain form
11102 -71398 245076 67954 514273 122948 13103 287721 387829 145762 188553 204793
11092 204793 299412 456826 87551 -35328 172304 111354 227568 398798 12639 227433
11082 227433 -96830 50021 110567 384387 55696 -249357 634337 241517 316974 417588
11072 417588 547230 247334 213470 174751 388622 335419 452799 62411 487656 439523
11062 439523 486522 445944 614607 476863 233355 363084 461018 561948 362611 429737
11052 429737 563379 797168 658357 771341 460897 601466 542767 758645 605571 795656
11042 795656 553524 729210 661993 912351 707560 635369 803489 665216 340649 694719
11032 694719 400150 355422 832466 1118561 537506 762606 574167 639280 541208 653871
11022F53871k00533Q0279j45245n3886K65407J34674m2011l45209o5929L45237
11012F26655j5992J62122A22123P81175l13375k0611J1979J87302k17824K50309
11002H01078C97559A85129M87187r5092l8735k5288J31885k37730M68659k23834
10992F52181l4834j11443Q0272J01891J50643j01984j39102L16942o2394J26810
10982I78982J77970j36324K83720k4950K49402n6344Q5193M0956N11797J14477
10972B224879L45136L6538J52939k61595k58602J6972J82923j48097o06938j14784
10962A569371j98365K36441k66116K02866L19461L2504m09221J45823m14156k36509
10952I82099L07660l29645q320j56896k39669D4049K17477A23583e9922E03911
$$ plain form
11022 653871 453338 533617 388372 334486 599893 734567 692556 347347 281418 626655
11012 626655 610663 772785 122123 903298 589923 569312 581291 768593 550769 801078
11002 801078 397559 185129 672316 577224 538489 513201 645086 407356 876015 652181
10992 652181 617347 505904 586176 688067 838710 736726 597624 914566 852172 978982
10982 978982 1156952 1020628 1304348 1279398 1528800 1472456 1557649 1598605 2110402 2224879
10972 2224879 2570015 2606553 2759492 2497897 2239295 2256267 2439190 2291093 1684155 1569371
10962 1569371 1371006 1607447 1341331 1544197 1863658 1896162 1486941 1632764 1218608 982099
10952 982099 1289759 960114 951794 794898 555229 44049 261526 123583 -59922 503911
10941I090O830K38085j10267J72151j30699j7202e3416J5155F4359M5144L3784
10930A43287b08400D26003j82003a72885A16181J3337a38491G6741K6064J6012
10920A18817A0619K7113J02201b98928e7566D12530A01706P8324p0215c2299k883
10909c5182j36007D7636J03452h119k43783G9149b76066A18383N246c66539a00290
10897a71957g094A04925L990r958K12118h7184j35948C48536b95327h3760j22152
10886b05912a95F9882h7112j18748k19772a84407B50840d2017o1748K7330Q209
10875f8226B016b21700A5674g918j14262c8231o0161m8788I9027j4275i5126K4580
10863g0546H322K62264b92836B13490e0797C18607D3648K7272a22561H5695g164
$$ plain form
10941 9090 15920 254005 143738 315889 185190 167988 -53416 -38261 64359 109503 143287
10930 143287 -208400 426003 244000 -172885 116181 129518 -138491 76741 102805 118817
10920 118817 10619 37732 139933 -298928 -57566 412530 101706 180030 109815 -32299 -35182
10909 -35182 -171189 47636 151088 -8119 -251902 79149 -276066 118383 123629 -366539 -100290
10897 -171957 -7094 104925 108915 98957 311075 -87184 -223132 348536 -295327 -83760 -205912
10886 -205912 -195 69882 -87112 -205860 -425632 -184407 250840 -42017 -103765 -76435 -68226
10875 -68226 2016 -221700 15674 -7918 -122180 -38231 -98392 -147180 99027 84752 -95126 -70546
10863 -70546 8322 270586 -292836 213490 -50797 318607 43648 70920 -122561 85695 -7164
10851D59088B5998b89413d1610B51694b07068j07189a09140E0853k4700a50677
10840f9109l989m1400A76187J87799e2223B0525Q6202m1138a05175a6113l4353
10829e0466B13196b6547B20471b7399j18155e0180A57982F0253L9234b11281A97012
10817C23912C8224a20258j45323b019j38171D6660a64295B1429c20179d7442l644
10806e1086B489e42593D46235E9859e8607l2654C00303a3497A84572H536a60472
10794a58584n8413P1496q8614e2878j63054B66561c7579a0233A56547i4478c0787
10782H9209N462e9309k33755F922N9507B5018a91305d8159p3986H5759b11702
10770C42107f878n3464j09993A40472a89474j0015Q1072A15299C5944i1077A07414
$$ plain form
10851 459088 25998 -289413 -41610 251694 -207068 -314257 -109140 50853 26153 -150677
10840 -69109 -73098 -114498 176187 363986 -52223 20525 106727 65589 -105175 -16113 -50466
10829 -50466 213196 -26547 220471 -27399 -145554 -50180 157982 60253 99487 -211281 197012
10817 323912 38224 -120258 -265581 -2019 -140190 46660 -164295 21429 -320179 -47442 -51086
10806 -51086 2489 -542593 446235 59859 -58607 -91261 300303 -13497 184572 8536 -160472
10794 -158584 -216997 -145501 -234115 -52878 -215932 266561 -37579 -10233 156547 -94478 -30787
10782 89209 94671 -59309 -293064 6922 66429 25018 -191305 -48159 -122145 85759 -211702
10770 342107 -6878 -60342 -170335 140472 -189474 -199489 -118417 115299 35944 -91077 107414
10758B19049G7752J51241a14090c0108j31923J5556C80976e9096b922j85142P7109
10747a10955k14976a05536A70800k8891a79986P1518m6334o0387F0729b0141j13259
10736a33400a6284k53756E1348d02651B84975A6023c36883a14201a5539I6646
10725f3373B50955m9324C2989a81845k30109f757p9849k18337A56687n9490a2150
10713B56901g5167D3310c48378m0590B4803L5218b84581q8146J45092B67562g3687
10701g2247L2909m8805K7407J3659A72813m6181g4575B20927a05544A6512a16751
10689C2858a63615M3510N7202F8989J33573b03892C6325d4317a7590A39750i5736
10677F6688c51420a56457N1344K07D3436b0300G2222a0983j77591h5755k3565
$$ plain form
10758 219049 77752 228993 -114090 -30108 -162031 -146475 380976 -59096 -2922 -188064 -110955
10747 -110955 -325931 -105536 170800 141909 -179986 -108468 -154802 -215189 60729 -20141 -133400
10736 -133400 -16284 -270040 51348 -402651 284975 16023 -336883 -114201 -15539 96646
10725 -63373 250955 201631 32989 -181845 -411954 -6757 -86606 -304943 156687 97197 -12150
10713 256901 -75167 43310 -348378 -388968 24803 60021 -284581 -372727 -227635 267562 -73687
10701 -72247 -39338 -88143 -60736 -47077 172813 126632 -74575 220927 -105544 16512 -116751
10689 32858 -163615 -120105 -62903 68989 202562 -203892 36325 -44317 -17590 139750 -95736
10677 66688 -351420 -156457 -105113 -104906 43436 -20300 72222 -10983 -188574 -85755 -109320
10666a09320c2541j49806B49813b41985I31a29990L9397j63413H8848A0569f7071
10654a84864A18640J50650E3700a50770A39515E1472a58064E521e2912A10475
10643b41034O4159M1141B89098d7433D1378a34950L159B01073a5672j71403C54404
10631B56608c8661q6629l0883k5117B37204b8519c061j50298K2858f0052r3320
10620a53372e6115A97371a55563q1379B9696J59011f8309p9272D17256G244h2330
10608D3254d1563k65123E8797c15519D0507a50426f0471G2676a24298R401n577
10597a20474B50515f430j4245l26834a563j19361n9461q8072B62774b74755B0966
10585a27870q5315l4528B42170a92460b956q6028A78081c4531j92063A9917g7557
$$ plain form
10666 -109320 -32541 -182347 249813 -241985 931 -129990 -90593 -254006 88848 10569 -67071
10654 -184864 118640 269290 53700 -150770 139515 51472 -158064 5521 -52912 110475
10643 -241034 -176875 -135734 289098 -47433 41378 -134950 -131791 201073 -15672 -187075 354404
10631 256608 -38661 -125290 -156173 -181290 237204 -28519 -3061 -153359 -130501 -60052 -153372
10620 -153372 -56115 197371 -155563 -236942 29696 188707 -68309 -147581 417256 7244 -82330
10608 43254 -41563 -306686 58797 -315519 40507 -150426 -60471 72676 -124298 -114897 -120474
10597 -120474 250515 -6430 -20675 -347509 -1563 -120924 -180385 -268457 262774 -274755 20966
10585 -127870 -213185 -247713 242170 -192460 -2956 -88984 178081 -34531 -226594 19917 -77557
10573a65943G5384c32776G0994K34785A09007e6293m0805n5820B00521o8956M7028
10562A78593n274a43220A37207c6700a1417D7676J00753N638C9990J37771n4179
10551A23582e8273G9892a03776j26415N8648P8552l04387A40092D1751b51337
10540b0089n9568B20367i950A76599b33792a11891F7823r729c13920J15062m5587
10529b44445f5055C90230b03217a2587A32565g4265A39356C3010d54483G3565
10518a60808j43889D1463a44836K0185E9283P0144N6502b9738j9119j5358j85398
10507b49613B07880h7344J9088G3604c2433C7344a2329A05560c39036b780j77895
10496a80675k2708G2686a88332J3425j65601J25136l9282f0914A1818O2481d4659
$$ plain form
10573 -165943 75384 -332776 70994 305779 109007 -56293 -97098 -152918 200521 131565 178593
10562 178593 173319 -143220 137207 -36700 -11417 47676 148429 154067 39990 177761 123582
10551 123582 -58273 79892 -103776 -230191 -171543 -92991 -397378 140092 41751 -251337
10540 -20089 -79657 220367 -9950 176599 -233792 -111891 67823 58094 -313920 -198858 -244445
10529 -244445 -65055 390230 -203217 -12587 132565 -74265 139356 33010 -454483 73565
10518 -160808 -304697 41463 -144836 -124651 59283 129427 185929 -29738 -48857 -64215 -249613
10507 -249613 207880 -87344 -68256 73604 -32433 37344 -12329 105560 -339036 -2780 -180675
10496 -180675 -203383 72686 -188332 -174907 -340508 -215372 -254654 -60914 11818 74299 -44659
10484e8661r3141M4034C43433L34481C11787A39941J75517j33956J40124A8526
10473B41856B2740N1453i3742B32517a29967N9748E041e9200b4646k21783j29473
10462c75902f1835m1662f378n609B15968b75860e3709j98089E5255a94336A7047
10450d13682b7965D7491a1123C43479K737e2126B25469p8598j534b1406j12770
10439a34176J0835C3363d0950C739O5431b10931A13090a64674D6673J5014J20682
10428A82369b06483N6859j54305G963K03551a19796j90374c6833r4745A07669
10417A39458J2085D4243M5849a10488D8607K9321O7066N4271a34417N338n4094
10406a83173B834L64888d1204j80958P2211C32411A52350E5604b15583O1514A88028
$$ plain form
10484 -58661 -151802 -107768 343433 677914 311787 139941 315458 181502 321626 18526
10473 241856 22740 74193 -93742 232517 -129967 -70219 5041 -59200 -24646 -246429 -375902
10462 -375902 -61835 -103497 -6378 -11987 215968 -275860 -53709 -251798 55255 -194336 17047
10450 -413682 -27965 47491 -11123 343479 346216 -52126 225469 146871 145337 -21406 -134176
10439 -134176 -123341 33363 -40950 3739 69170 -210931 113090 -164674 46673 61687 182369
10428 182369 -206483 -149624 -303929 7963 211514 -119796 -310170 -36833 -131578 107669
10417 139458 151543 44243 90092 -110488 48607 77928 144994 199265 -134417 -129079 -183173
10406 -183173 2834 367722 -41204 -222162 -149951 332411 152350 55604 -215583 -154069 188028
10394a65650D5077b46598A25413J06529A4521h8477A54356P676l1075a19414A42164
10382A00864J5703J47853K8358r0121K12606c45095B85916A02182A6191K46576
10372B62767H2153J06924e3560C29438o4535L31733j67984K079K11808L0147C20944
10360e3499D79408H2255J88572j23895C3821R6541a104A89955K53653L17972p3500
10349F88080j57794F6093L06403A28347K43045p4481J78358A64413c0508B52477
10338h9870c0904F3882M14571A14646R4831b11029I1119J78315a87A28161b4792
10326E19790A11977L4903D3850J19759J20005J3333C7256J08981J64902j39003
10316A72136P3217j4418L44489a84543A38649j4452b29451A75257C932P3744k1091
$$ plain form
10394 -165650 45077 -246598 125413 231942 14521 -88477 154356 162032 130957 -119414 142164
10382 100864 116567 264420 292778 202657 415263 -345095 285916 102182 16191 262767
10372 262767 82153 189077 -53560 329438 264903 596636 428652 430731 642539 672686 320944
10360 -53499 479408 82255 270827 146932 33821 130362 -1104 189955 443608 761580 688080
10349 688080 530286 66093 372496 128347 371392 296911 475269 164413 -30508 252477
10338 -89870 -30904 63882 478453 114646 209477 -211029 91119 269434 -187 128161 -24792
10326 519790 111977 146880 43850 163609 283614 296947 37256 146237 311139 172136
10316 172136 245353 230935 575424 -184543 138649 124197 -229451 175257 3932 77676 56585
10305E6585j0451d5787A51235E8833b1137B75528a81746A62150c01456A4495P1565
10294H6060h7771B0009J40260n3533o691K01324b67312j48776A03669K07397F1912
10282a21641e8212A91598p5290A6165c1236j43740D7841c39741a01099F914c35078
10270b75461C41389B19a09851A63103p6220f8820b2692B71565A4212L80913A45453
10258E27590J04035j29185J14292k84192m4366I6135A3593L9902j4260J81179
10248B20414j09288a70261c5608j06579k66733d5827A4709g7732c3348m5574H2571
10236A88853d6097A78304b1551L286l40856g7414H6476J01800c90386J04722a02581
10224A86036G5776a38822B48332B6314a50137p9560O2106j04659c6729j37334
$$ plain form
10305 56585 46134 -45787 151235 58833 -21137 275528 -181746 162150 -301456 14495 86060
10294 86060 -87771 20009 160269 106736 100045 301369 -267312 -416088 103669 311066 61912
10282 -121641 -58212 191598 116308 16165 -31236 -174976 47841 -339741 -101099 6914 -335078
10270 -275461 341389 219 -109851 163103 86883 -68820 -22692 271565 14212 395125 145453
10258 527590 631625 502440 616732 332540 288174 96135 13593 53495 39235 220414
10248 220414 111126 -170261 -35608 -142187 -408920 -45827 14709 -77732 -33348 -78922 82571
10236 188853 -46097 178304 -21551 -18265 -359121 -77414 86476 188276 -390386 -285664 -102581
10224 186036 75776 -138822 248332 26314 -150137 -229697 -167591 -272250 -36729 -174063
10214a74063b3807A70650d5996r8874E9905b5706K232j83937i5803b6987k46974
10203b73961i5981p7666A66629E9661a06213j39492D31105a24686D7090J79868
10193B26958a15572r874N0424J053C6633Q8556a40205O8796B03817b76628P3710
10182b02918l18260b6401F360J6288d5338E1731i6022a7242k9922j59490g5790
10170A6126J39017c63471a556j75796F2786b36495c4363q135j88963A24389J83955
10159C08344e5226k5152n4054A7190M3640c1494j63281P1253I766a4311B73928
10147b36385J14504k39824d5228E3494h9616A38905a39137L1090n1272a8607j0923
10136b9530a0990j03256j94353B55859a22616L2577I4939Q5264a84497A28754
$$ plain form
10214 -174063 -23807 170650 -45996 -144870 59905 -25706 -23474 -207411 -95803 -26987 -273961
10203 -273961 -95981 -173647 166629 59661 -106213 -245705 431105 -124686 47090 226958
10193 226958 -115572 -125446 -75022 -73969 36633 125189 -140205 -71409 203817 -276628 -202918
10182 -202918 -521178 -26401 6360 22648 -45338 51731 -96022 -17242 -47164 -206654 -75790
10170 16126 155143 -363471 -1556 -177352 62786 -236495 -34363 -42498 -231461 124389 308344
10159 308344 -55226 -80378 -134432 17190 60830 -31494 -194775 -123522 9766 -14311 273928
10147 -236385 -121881 -361705 -45228 53494 -89616 138905 -139137 -108047 -159319 -18607 -29530
10136 -29530 -10990 -114246 -308599 255859 -122616 -90039 94939 180203 -184497 128754
10125A63129F825c45957f0037k17147c4389J0165B8926K60931A9576b86078Q4794
10114b01284c5490E4213a6093k03156i8045J730B35319j4110N2482j35760c34741
10102h2712p2676F0752c19811J19396C1150a656k48015a07496k00014c1660R34
10091c0726j98673r2620H7975Q1208l9022m236b06708A15848R2975B3699e1609
10079d76224a47385L9599I3625a00371J2843C75385A57355c14361A4330L07005
10069C21335b17213n1285A19781d05355B3633L0409O2281K16916j62678M6303
10059B16864A1279b91474G1292a62495B7086a89315A93798a91409d4527l4885
10049g9412i243j71522g2476l19721Q7846a51796A66821b6921A0634K49787c41434
$$ plain form
10125 163129 6825 -345957 -60037 -277184 -34389 -24224 28926 289857 19576 -286078 -201284
10114 -201284 -35490 54213 -16093 -219249 -98045 -96315 235319 221209 273691 137931 -334741
10102 -82712 -155388 60752 -319811 -200415 31150 -1656 -249671 -107496 -307510 -31660 -30726
10091 -30726 -229399 -322019 87975 169183 130161 125925 -206708 115848 208823 23699 -51609
10079 -476224 -147385 -107786 93625 -100371 -87528 375385 157355 -314361 14330 321335
10069 321335 -217213 -268498 119781 -405355 23633 54042 116323 333239 170561 216864
10059 216864 11279 -291474 71292 -162495 27086 -189315 193798 -191409 -44527 -79412
10049 -79412 -9243 -180765 -72476 -392197 -304351 -151796 166821 -26921 10634 260421 -341434
10037A03047i9541k7545e4218A85108g7087A92823a90586j30445g4543b9430l4182
10026f3612o6973m2753f7344A79356d1106j23408A55476a76857B68999a68181
10015A573g9487p4942M5430G2404a4848j73892j53074A17583a3365q7783o2938
10004a64086K7669O4749A6165b54629C0778M07443B10425a55693N22A31564J45594
9993B77158d132A5423P3489a83563k0569A58242d30036J46062k85416a56050A1180
9981I4943b24182a9375m70734b08410N3452N863j5983k48K9747A63074j5538D7385
9968D15644k07052o4810E2492b1502A12270a11236l91551a15363I637a37430c2015
9956c94806J00059B91080e168B3170a37747K9897o7318h5033j01800E59390j56202
$$ plain form
10037 103047 -99541 -127086 -54218 185108 -77087 192823 -190586 -321031 -74543 -29430 -63612
10026 -63612 -130585 -173338 -67344 179356 -41106 -164514 155476 -176857 268999 -168181
10015 1573 -79487 -154429 -108999 72404 -14848 -188740 -341814 117583 -13365 -101148 -164086
10004 -164086 -136417 -71668 16165 -254629 30778 438221 210425 -155693 -155171 131564 277158
9993 277158 -4132 15423 88912 -183563 -204132 158242 -430036 -283974 -569390 -156050 11180
9981 94943 -224182 -19375 -490109 -208410 -154958 -149095 -165078 -165326 -135579 163074 147536 47385
9968 415644 208592 143782 52492 -21502 112270 -111236 -502787 -115363 9637 -137430 -32015
9956 -394806 -294747 291080 -5168 23170 -137747 -107850 -175168 -85033 -186833 559390 403188
9945D03188b38586J03679L2389C17903a75411a5651q2095p484A37612c11729c4506
9933D5409d9907j61365m704j88026a43463j38205a1497q439j98018e9084C8479
9921b0987j54972o3100h3401k16670b8581G149a72472A13856d0723A67831i0865
9909b32760k924A34477D0521h4953B0893h6716j28675n9754D8666e4953j2454
9898f7407A60975e3101A17456b06807J740B72067F4872j613c01126e5009a4307
9886a98051B18340g8035E4300K136b9930k31315h3905l08076a06996K3828Q330
9875g4838A6483e3524j6461m2569l7105A03442m3360c3437B59181b93246B6971
9863B99115a34358J457j36013A36022E3034d8643q6619B75293a71860L045M7326
$$ plain form
9945 403188 -238586 -134907 -102518 317903 -175411 -15651 -97746 -105230 137612 -311729 -34506
9933 45409 -49907 -211272 -215976 -404002 -143463 -281668 -11497 -19936 -217954 -59084 38479
9921 -20987 -175959 -239059 -83401 -300071 -28581 7149 -172472 113856 -40723 167831 -90865
9909 -232760 -235684 134477 40521 -84953 20893 -86716 -215391 -275145 48666 -54953 -67407
9898 -67407 160975 -53101 117456 -206807 -205067 272067 64872 63259 -301126 -55009 -14307
9886 -198051 218340 -78035 54300 56436 -29930 -261245 -83905 -391981 -106996 -83168 -74838
9875 -74838 16483 -53524 -69985 -112554 -149659 103442 60082 -33437 259181 -293246 26971
9863 299115 -134358 -132901 -268914 136022 53034 -48643 -135262 275293 -171860 -168815 -121489
9852a21489A55669c07918A4354e33755d6390k11640R4630j06390A11092a00230
9841b93869C34792a77757A58781a00310l5545j4522J094j90654A6207c80606A6639
9829b2081D106c36288g4095l4899A14288A5776N3264j2756h4976k45828h5825
9817c34403A23095P2722c48805Q9583B81084C6460a87219g6988j04669A16946
9806b00029P3290N6294A78910C8330B690b84536H3752a45994b1158q0782C50298
9794H862J18771b29663B8019K08112b407j61806I3021a52670J9885c8268j64833
9783b03101j48670B9016b6471C44745a32080O529A76956b16350a01528m31284
9773e32812a36767C7546a07290L5736D0714K01642a21285C9929a49371A36702
$$ plain form
9852 -121489 155669 -307918 14354 -533755 -46390 -258030 -163400 -269790 111092 -100230
9841 -293869 334792 -177757 158781 -100310 -135855 -150377 -149283 -339937 16207 -380606 16639
9829 -22081 4106 -336288 -74095 -108994 114288 15776 69040 56284 -84976 -330804 -85825
9817 -334403 123095 195817 -348805 -259222 281084 36460 -187219 -76988 -181657 116946
9806 -200029 -126739 -70445 178910 38330 2690 -284536 83752 -145994 -21158 -101940 350298
9794 8862 127633 -229663 28019 236131 -2407 -164213 93021 -152670 -132785 -38268 -203101
9783 -203101 -351771 29016 -26471 344745 -132080 -125551 176956 -216350 -101528 -532812
9773 -532812 -136767 37546 -107290 -71554 40714 242356 -121285 39929 -149371 136702
9762c02584a09996I580a95463A21537O1642b40232a09731p9385A03222a85876
9751a26603p9115c5806o2387A20449e1388G6649c77767J66350F385b32041j05600
9740c37641g6263D0329j1393a54740A74166i6990B14222C3844L9111M3583e2119
9728E9288K05019c10634p047N2052A25421a2259o2819J1167A59970C3270L54855
9717C88125b17847J01354A02882k2223R15K15784e3517C2916A242b74443C4074
9705a99866B24473a10491c5801A70156I056f8012B39234j9600b76207A28899a99054
9693c19278L9349G4481b11468K5049C9277b38119J01056d1026B5234K10691a28669
9681a45892D0645O1327b69792F792a97194P2147j87852e6199j14483A44921a54595
$$ plain form
9762 -302584 -109996 9580 -195463 121537 183179 -240232 -109731 -189116 103222 -185876
9751 -126603 -205718 -35806 -98193 120449 -51388 76649 -377767 -211417 6385 -232041 -337641
9740 -337641 -76263 40329 28936 -154740 174166 -96990 214222 33844 72955 116538 -52119
9728 59288 264307 -310634 -317681 -265629 125421 -12259 -75078 -63911 159970 33270 388125
9717 388125 -217847 -116493 102882 80659 81574 297358 -53517 32916 1242 -274443 34074
9705 -199866 224473 -110491 -35801 170156 9056 -68012 239234 219634 -276207 128899 -199054
9693 -319278 -279929 74481 -211468 -186419 39277 -238119 -137063 -41026 25234 235925 -128669
9681 -145892 40645 101972 -269792 6792 -197194 -125047 -312899 -56199 -170682 144921 -154595
9669a4486j30092C0292R554J28703n8524D2268f159l10945J55327I8023d294j04269
9657a08563A79297P2809A20315d9250m9964L2857B9298b27324A63949o1779k8053
9646G4117K16268B0996a14936M2443o0345R381j09244f785j91595L7463M1613
9635a19304k53378g3947m09054e7699B25649A11002a95750R5484j15729j62966
9625c78961P3129G8168b5757l0182j78258a4355l66705a47710D4647a17556l1536
9614a49092c8732o7490o538C5725i8364A37516h9312k74709H0838a55767k62993
9603d18760G9144b07983h8939p8417O3942A41673e5065A06346b15843p6730M3169
9592b49404a17130i44k29366A26415K1521c01822e4324j02549l1226l8403N8185
$$ plain form
9669 -14486 -144578 30292 39846 168549 110025 42268 -6159 -317104 -161777 98023 -4294 -108563
9657 -108563 179297 252106 120315 -49250 -99214 -66357 29298 -227324 163949 102170 74117
9646 74117 290385 20996 -114936 -72493 -132838 -123457 -232701 -6785 -198380 -160917 -119304
9635 -119304 -372682 -73947 -483001 -57699 225649 111002 -195750 -100266 -215995 -378961
9625 -378961 -305832 78168 -25757 -55939 -234197 -14355 -381060 -147710 44647 -117556 -149092
9614 -149092 -38732 -106222 -112760 35725 -98364 137516 -89312 -364021 80838 -155767 -418760
9603 -418760 79144 -207983 -88939 -167356 -103414 141673 -55065 106346 -215843 -292573 -249404
9592 -249404 -117130 -944 -230310 126415 147936 -301822 -54324 -156873 -188099 -226502 -168317
9581a68317k05569a78706A87989i8324n877B1692J43552g5428C05492a5536j23026
9570a38562d2343j38076M7845f3024D4003e3030j73319K5034O355h7625F0696
9558c19667A25307G282J12378O0571H8352C3458a0175k1132k62359A82893c69791
9546b71983j021h3003B04528a17929c7853k57278G9392J63677a48381L357i049
9534b60461c6674j01876N0377o4335M8694B32625b87842h7466j3393j4640A77983
9522a8321B40883a77878j57699a56596C48859c05821A22562a68503f3544i946
9511a68428F3313C133c05972J44878k1163d6113C9531b19476A61767b8934j25074
9500a54008a8805k94784a03734j51403J27377j24555B16269f7471o2219j59548
$$ plain form
9581 -168317 -373886 -178706 187989 -98324 -104201 21692 165244 -75428 305492 -15536 -138562
9570 -138562 -42343 -180419 -132574 -63024 44003 -53030 -226349 -201315 -194960 -87625 60696
9558 -319667 125307 7282 119660 180231 88352 33458 -10175 -31307 -293666 182893 -369791
9546 -271983 -273004 -83003 204528 -117929 -37853 -295131 79392 243069 -148381 -145024 -9049
9534 -260461 -36674 -138550 -88173 -152508 -103814 232625 -287842 -87466 -100859 -115499 177983
9522 -18321 240883 -177878 -335577 -156596 348859 -305821 122562 -168503 -63544 -9946
9511 -168428 63313 3133 -305972 -161094 -182257 -46113 39531 -219476 161767 -28934 -154008
9500 -154008 -18805 -313589 -103734 -255137 -127760 -252315 216269 -67471 -129690 -289238
9490b89238B5888O7043a11914a4656j5020F9722j0549b78271J24031B65095c67377
9478D9792b08347d7492k52671g8056p5983A46384G923a52017f1607I417f6689
9466c01640A07337a99825K1806M2901K3457A8185c2350H7022a96112H9131J88188
9455B77319a94689G7498o368a46031k5259A60108a21700a4371D0205c63109C81708
9443A47321j3451M7323a74618Q4133G6282g757A26100b50971C06636a76238A50190
9431d1785j08824b8586i069j11598A49106O4978i1282l3130A2331J7874b96243
9419b70009A28196d4791m1027k80972J08609A04397a25818D9247h2192j70093
9409b52285D6469a44013A3331M8507e3549j69461h2009k21941A65473h7312B35811
$$ plain form
9490 -289238 25888 92931 -111914 -14656 -29676 69722 59173 -278271 -154240 265095 -367377
9478 49792 -208347 -47492 -300163 -78056 -154039 146384 7923 -152017 -61607 9417 -66689
9466 -301640 107337 -199825 -178019 -135118 -111661 18185 -32350 87022 -196112 89131 277319
9455 277319 -194689 77498 71130 -146031 -171290 160108 -121700 -14371 40205 -363109 381708
9443 147321 133870 181193 -174618 -90485 76282 -7757 126100 -250971 306636 -176238 150190
9431 -41785 -150609 -28586 -9069 -120667 149106 214084 -91282 -124412 12331 30205 -296243
9419 -270009 128196 -44791 -85818 -366790 -258181 104397 -125818 49247 -82192 -252285
9409 -252285 46469 -144013 13331 61838 -53549 -223010 -82009 -303950 165473 -87312 235811
9397h4493m0693G8521a06812O927E3615L3993b2658j8644j38043b4170G1217O5695
9385A36912a58236j21783E9689a29853j4075G7461b89727j71963a33291a1631
9374A80261d3239m2472k90140g9830J2206F19992b27609b4660j60086j70464a0259
9362a02418I3720e1450k25906a25780H52c43176m019d8770B10018h5747k06651
9351b92398j8081A52334J13053b1956C79800A72J01245h3223p8301e5841q5703
9340a41544J6822G3070a9343l08030i6136n1614p9214A08397J03372a464B42776
9328c58019Q6722c2185j53544q1797a29920l2524f0159p7383l1788C9494a23906
9316b49066j692l9566k9092i4759r0303f5514j07262q8209B43917m387E6078M5998
$$ plain form
9397 -84493 -125186 78521 -106812 -99885 53615 87608 -22658 -41302 -179345 -24170 71217 136912
9385 136912 -158236 -280019 59689 -129853 -143928 77461 -289727 -461690 -133291 -11631
9374 180261 -43239 -85711 -375851 -79830 -67624 619992 -227609 -24660 -184746 -355210 -10259
9362 -102418 93720 -51450 -277356 -125780 852 -343176 -347195 -48770 210018 -85747 -292398
9351 -292398 -310479 152334 265387 -21956 379800 172 101417 -83223 -161524 -55841 -141544
9340 -141544 -124722 73070 -19343 -327373 -96136 -147750 -226964 108397 211769 -1464 242776
9328 -358019 -271297 -32185 -185729 -267526 -129920 -162444 -60159 -137542 -169330 39494 -123906
9316 -249066 -250758 -290324 -319416 -94759 -185062 -65514 -172776 -260985 243917 239530 56078 102076
9304A02076c54019a11884M1724A14272a63213j6635A54742a72336j65794C68152
9293a93787D9941R6888a75100N5678B31802j581a61667H9949K8503a45919B27066
9281g4578q5259A80951H5571J45574B4698J30356D1445h6452c3719l9393G010
9269b26308b9002j36507n6147a02712B17733i9071L0611d492l42203I605b34874
9257e7220A0169L408O3491M6192f7015r9875g4891k26666P5421j19029A00003
9245B20519H2516b40657N519J08061A08640E1453a583j52844A24086a11602j4191
9234a25793j9811K8331m9670a7568l33750a24454A25865a80973a8538C0378c10071
9222a85583p2549l1288a16921e7213j17027A18234B0447b86791i8828j48933d0157
$$ plain form
9304 102076 -354019 -111884 -70160 114272 -163213 -179848 154742 -172336 -338130 368152
9293 -193787 49941 146829 -175100 -119422 231802 230221 -161667 89949 118452 -145919 227066
9281 -74578 -159837 180951 85571 231145 24698 155054 41445 -86452 -33719 -73112 7010
9269 -226308 -29002 -165509 -221656 -102712 217733 -99071 -68460 -4492 -346695 9605 -234874
9257 -57220 10169 13577 77068 123260 -67015 -166890 -74891 -301557 -226136 -345165 100003
9245 220519 82516 -240657 -235138 -127077 108640 51453 -1583 -154427 124086 -111602 -125793
9234 -125793 -145604 -117273 -166943 -17568 -351318 -124454 125865 -180973 -18538 30378 -310071
9222 -185583 -258132 -289420 -116921 -57213 -174240 118234 20447 -286791 -98828 -247761 -40157
9210a97939E6543b08835F216c97821a8414C83625A01248a24851E0446d6213E6855
9198c12670g3508A83621a03048A33232D4203a72823r0150I883a74173A40681d9060
9186F4476M8204B8936b92559Q4325A24203b13109d0433H158l400g4557k33222
9175c07779h8245k36258C6768a39046o451B37677b20331L7842l7900G2953J72077
9164B45030D7871c21302J51452j63488a56985M742C6316K66362b06926D0013c3488
9152h0319j25920P7603N3597H9640l3767M3423a15249O286B8390c70998J13912
9141b57086L4631q2699J00681j08827A16035D833a54894n2917j30224A84691e5079
9129A52348b63927A92765a08065G4514L4238d24582b000n2366A7277b45726A00809
$$ plain form
9210 -197939 56543 -208835 6216 -397821 -18414 383625 101248 -124851 50446 -46213 56855
9198 -312670 -73508 183621 -103048 133232 44203 -172823 -262973 9883 -174173 140681 -49060
9186 64476 112680 28936 -292559 -208234 124203 -213109 -40433 8158 4758 -74557 -307779
9175 -307779 -88245 -324503 36768 -139046 -145497 237677 -220331 -182489 -220389 72953 245030
9164 245030 47871 -321302 -169850 -333338 -156985 -152243 36316 302678 -206926 40013 -33488
9152 -80319 -206239 -128636 -75039 89640 55873 99296 -115249 -108963 28390 -370998 -257086
9141 -257086 -222455 -305154 -204473 -313300 116035 4833 -154894 -207811 -338035 184691 -55079
9129 152348 -263927 192765 -108065 74514 108752 -424582 -2000 -54366 17277 -245726 100809
9117A37613R8285F8783K27592a56473e5727A5992R5984a44746C50854A6521b00162
9105C8333J4976E72M034K05468o7117a60324D6608f7650Q737m6195k2780G5080
9092a56263j02332A03542g8789B8972a62130J7909P0587A72596b71052Q4140j7563
9081b04475B39187m9084h5067j29194A94234K35790i3879C46732A50008c27027
9070a48887C44194a26771A26666e3533m2368B29070A1341f9679o707I8975b47310
9058a066j96431E6355c09660e5346C8402h2533j35668B48911b85752i9016b8367
9046h1652A710b39055A96596k0958a62370e4696H0578J79c44750a09841n665a0487
9033b84404g2882k03166b5866F8836a24742e5569A08951a96103B46604a02166
$$ plain form
9117 137613 235898 68783 296375 -156473 -55727 15992 111976 -144746 350854 16521 -200162
9105 38333 53309 572 4606 210074 142957 -160324 46608 -67650 -58913 -105108 -127888 75080
9092 -156263 -258595 103542 -78789 28972 -162130 -144221 -73634 172596 -271052 -186912 -204475
9081 -204475 239187 190103 -85067 -214261 194234 430024 -93879 346732 150008 -327027
9070 -148887 344194 -126771 126666 -53533 -95901 229070 11341 -69679 -76386 98975 -247310
9058 -1066 -197497 56355 -309660 -55346 38402 -82533 -218201 248911 -285752 -99016 -28367
9046 -81652 1710 -239055 196596 175638 -162370 -54696 80578 80757 -344750 -109841 -115506 -10487
9033 -284404 -72882 -276048 -25866 68836 -124742 -55569 108951 -196103 246604 -102166
9022B92953m3016a80100l7800b8228o411A06295a4528C6028c88320J54838B03291
9010b9597l80741B78641A14278O9011a9661A72268h1997m3681I9929d55996H6987
8998A66087d7269n0057k59002c1528p5960j50585B3706L4337e3332j88745b5625
8986f4713o0839B17689J357b37332A69480i7363A03290L0481f763j38674K9163
8975a16274L3400r279G336K13233a93003q4387q9958C76012a87761o7926G9879
8963A76680f8714G4849C0070J53604q1899a4866F7446J18390b74986D3944b32661
8951d4085A36786f8218F9384M8476N6068P0336A7734a63589A36779a7341B09930
8939A37697j1584c11131b8599b135B37075J85569f9821B7680a59309c3292H4761
$$ plain form
9022 292953 249937 -180100 -217900 -28228 -34639 106295 -14528 36028 -388320 -233482 203291
9010 -29597 -410338 278641 114278 183289 -19661 172268 -81997 -125678 99929 -455996 86987
8998 166087 -47269 -97326 -356328 -31528 -107488 -258073 23706 58043 -53332 -242077 -25625
8986 -64713 -125552 217689 219046 -237332 169480 -97363 103290 133771 -6763 -145437 -116274
8975 -116274 -82874 -92153 7336 220569 -193003 -277390 -367348 376012 -187761 -255687 79879
8963 176680 -68714 74849 30070 183674 101775 -14866 67446 185836 -274986 43944 -232661
8951 -44085 136786 -68218 69384 117860 173928 244264 17734 -163589 136779 -17341 209930
8939 137697 126113 -311131 -28599 -2135 237075 422644 -69821 27680 -159309 -33292 84761
8927a02368B34213K58400M2705M33390J575343R732877M904236E370051B086612
8917H11681j20001A15436g895B13705b1844m7674C14724b09432d3142C82847q9484
8906B93363F7327k8697J05251C4082g0518H0307B6436N2932a20145B19716c0298
8894a24869A28754a10443I6477b1399k19631f2472o3272q9168E1437a54987c2438
8882C10469a30568A43197a39079A10421A7870L3937H945O056a9748f23l56575
$$ plain form
8927 -102368 234213 492613 535318 968708 2544051 12276928 17181164 5370051 2086612
8917 811681 691680 115436 -7895 213705 -21844 -69518 314724 -209432 -43142 382847 293363
8906 293363 67327 38630 143881 34082 -70518 80307 26436 79368 -120145 219716 -30298
8894 -124869 128754 -110443 96477 -21399 -241030 -62472 -125744 -214912 51437 -154987 -32438
8882 310469 -130568 143197 -139079 110421 17870 51807 8945 15001 -19748 -623 -357198
$$ [...]
##END NTUPLES=NMR SPECTRUM
##END=
