
##TITLE=UV1243_M9_1261-1207_10_7241085_w7KXbvexhu
##JCAMPDX= 6.0         $$ Bruker NMR JCAMP-DX V2.0
##DATA TYPE= NMR SPECTRUM
##DATA CLASS= NTUPLES
##ORIGIN= BRUKER
##OWNER= Administrator
$$ 1.72 TOPSPIN		Version 2.1
$$ 2013-01-19 03:13:45.476 -0500  Administrator@X
$$ Compression mode = diff/dup
##.OBSERVE FREQUENCY= 400.02188249412
##.OBSERVE NUCLEUS= ^1H
##.ACQUISITION MODE= SIMULTANEOUS (DQD)
##.ACQUISITION SCHEME= undefined
##.AVERAGES= 64
##.DIGITISER RES= 22
##SPECTROMETER/DATA SYSTEM= spect
##.PULSE SEQUENCE= noesygpps1d.comp
##.SOLVENT NAME= COFFEE_meoh
##.SHIFT REFERENCE= INTERNAL, COFFEE_meoh, 1, 14.96097
##AUDIT TRAIL= $$ (NUMBER, WHEN, WHO, WHERE, PROCESS, VERSION, WHAT)
$$ ##TITLE= Audit trail, TOPSPIN		Version 2.1
$$ ##JCAMPDX= 5.01
$$ ##ORIGIN= Bruker BioSpin GmbH
$$ ##OWNER= Administrator
$$ $$ E:\/data/COFFEE/nmr/UV1243_M9_1261-1207_10_7241085_w7KXbvexhu/22/pdata/1/auditp.txt
$$ ##AUDIT TRAIL=  $$ (NUMBER, WHEN, WHO, WHERE, PROCESS, VERSION, WHAT)
(   1,<2013-01-19 03:13:39.679 -0500>,<Administrator>,<X>,<go>,<TOPSPIN 2.1>,
      <created by zg
	started at 2013-01-19 03:02:10.148 -0500,
	POWCHK enabled, PULCHK disabled,
       configuration hash MD5:
       86 BA 57 50 F2 9D 5C 9B 26 00 A9 28 5F 66 2E 89
       data hash MD5: 64K
       7F 4B 97 4A 74 95 81 1D 77 F2 B2 12 36 4D 34 D2>)
(   2,<2013-01-19 03:13:42.710 -0500>,<Administrator>,<X>,<proc1d>,<TOPSPIN 2.1>,
      <Start of raw data processing
       efp LB = 0.3 FT_mod = 6 PKNL = 1 PHC0 = 0 PHC1 = 0 SI = 128K 
       data hash MD5: 128K
       A9 1D 85 7C 0D E8 4B EB CC BB 90 AA 4B 8A 9A 26>)
(   3,<2013-01-19 03:13:43.757 -0500>,<Administrator>,<X>,<proc1d>,<TOPSPIN 2.1>,
      <pk PHC0 = -80.89783 PHC1 = 0 
       data hash MD5: 128K
       8A 6C 41 53 79 ED 4E 77 B2 C1 21 43 02 84 B9 71>)
(   4,<2013-01-19 03:13:44.429 -0500>,<Administrator>,<X>,<proc1d>,<TOPSPIN 2.1>,
      <abs ABSG = 1 
       data hash MD5: 128K
       B0 54 7A 35 38 0A D8 59 09 8D CB C1 E0 D7 A0 E3>)
(   5,<2013-01-19 03:13:44.617 -0500>,<Administrator>,<X>,<proc1d>,<TOPSPIN 2.1>,
      <abs ABSG = 2 
       data hash MD5: 128K
       05 8A 5D 49 04 DB 2B 8F D8 5B C5 FE 4D EA 1C 1C>)
(   6,<2013-01-19 03:13:44.773 -0500>,<Administrator>,<X>,<proc1d>,<TOPSPIN 2.1>,
      <abs ABSG = 3 
       data hash MD5: 128K
       DC 0E CC 8D DF 5B 5E 34 C5 5D 83 CA 69 3A 46 4E>)
(   7,<2013-01-19 03:13:44.945 -0500>,<Administrator>,<X>,<proc1d>,<TOPSPIN 2.1>,
      <abs ABSG = 4 
       data hash MD5: 128K
       4B 93 78 25 F1 F2 4C F1 C1 E5 E9 B2 81 B8 28 5B>)
(   8,<2013-01-19 03:13:45.117 -0500>,<Administrator>,<X>,<proc1d>,<TOPSPIN 2.1>,
      <abs ABSG = 5 
       data hash MD5: 128K
       9E 55 B1 BD DE AF D8 FE F5 7A E2 ED 3F 4E 3A EA>)
$$ ##END=
$$ 
$$ $$ hash MD5
$$ $$ FE E4 84 D0 2B E0 CF C2 C2 77 00 41 94 88 65 16
##$RELAX= 
##$RELAX= 
##$RELAX= 
##$RELAX= 
##$RELAX= 
##$RELAX= 
##$RELAX= 
##$RELAX= 
$$ Bruker specific parameters
$$ --------------------------
##$DU= <E:\>
##$EXPNO= 22
$$ [...]
##$TP07= 0
##$TPNAME0= <>
##$TPNAME1= <>
##$TPNAME2= <>
##$TPNAME3= <>
##$TPNAME4= <>
##$TPNAME5= <>
##$TPNAME6= <>
##$TPNAME7= <>
##$TPOAL= (0..7)
0.5 0.5 0.5 0.5 0.5 0.5 0.5 0.5
##$TPOFFS= (0..7)
0 0 0 0 0 0 0 0
##$TUNHIN= 0
##$TUNHOUT= 0
##$TUNXOUT= 0
##$USERA1= <user>
##$USERA2= <user>
##$USERA3= <user>
##$USERA4= <user>
##$USERA5= <user>
##$V9= 5
##$VALIST= <valist>
##$VCLIST= <CCCCCCCCCCCCCCC>
##$VD= 0
##$VDLIST= <DDDDDDDDDDDDDDD>
##$VPLIST= <PPPPPPPPPPPPPPP>
##$VTLIST= <TTTTTTTTTTTTTTT>
##$WBST= 1024
##$WBSW= 4
##$XGAIN= (0..3)
0 0 0 0
##$XL= 0
##$YL= 0
##$YMAX_a= 6236908
##$YMIN_a= -13618756
##$ZGOPTNS= <>
##$ZL1= 120
##$ZL2= 120
##$ZL3= 120
##$ZL4= 120
##$ABSF1= 14.96097
##$ABSF2= -5.597212
##$ABSG= 5
##$ABSL= 3
##$ALPHA= 0
##$AQORDER= 0
##$ASSFAC= 0
##$ASSFACI= 0
##$ASSFACX= 0
##$ASSWID= 0
##$AUNMP= <proc_prof1d_extract.lims>
##$AXLEFT= 0
##$AXNAME= <>
##$AXNUC= <1H>
##$AXRIGHT= 0
##$AXTYPE= 0
##$AXUNIT= <>
##$AZFE= 0.1
##$AZFW= 0.1
##$BCFW= 0
##$BC_mod= 0
##$BYTORDP= 0
##$COROFFS= 0
##$CY= 15
##$DATMOD= 1
##$DC= 0
##$DFILT= <>
##$DTYPP= 0
##$F1P= 0
##$F2P= 0
##$FCOR= 0.5
##$FTSIZE= 131072
##$FT_mod= 6
##$GAMMA= 0
##$GB= 0
##$INTBC= 1
##$INTSCL= 1
##$ISEN= 128
##$LB= 0.3
##$LEV0= 0
##$LPBIN= 0
##$MAXI= 10000
##$MC2= 0
##$MEAN= 0
##$ME_mod= 0
##$MI= 0
##$NCOEF= 0
##$NC_proc= -2
##$NLEV= 6
##$NOISF1= 0
##$NOISF2= 0
##$NSP= 0
##$NTH_PI= 0
##$NZP= 0
##$OFFSET= 14.96097
##$PC= 1
##$PHC0= -80.89783
##$PHC1= 0
##$PH_mod= 1
##$PKNL= yes
##$PPARMOD= 0
##$PPDIAG= 0
##$PPIPTYP= 0
##$PPMPNUM= 2147483647
##$PPRESOL= 1
##$PSCAL= 4
##$PSIGN= 0
##$PYNMP= <proc.py>
##$REVERSE= no
##$SF= 400.020009649969
##$SI= 131072
##$SIGF1= 0
##$SIGF2= 0
##$SINO= 400
##$SIOLD= 131072
##$SPECTYP= <>
##$SREGLST= <1H.CDCl3>
##$SSB= 0
##$STSI= 131072
##$STSR= 0
##$SW_p= 8223.68421052631
##$SYMM= 0
##$S_DEV= 0
##$TDeff= 65536
##$TDoff= 0
##$TI= <>
##$TILT= no
##$TM1= 0
##$TM2= 0
##$TOPLEV= 0
##$USERP1= <user>
##$USERP2= <user>
##$USERP3= <user>
##$USERP4= <user>
##$USERP5= <user>
##$WDW= 1
##$XDIM= 131072
##$YMAX_p= 455139440
##$YMIN_p= -11740
##$CURPLOT= <Network HP LaserJet P1505>
##$CURPRIN= <$Network HP LaserJet P1505>
##$DFORMAT= <normdp>
##$LAYOUT= <+/1D_H.xwp>
##$LFORMAT= <normlp>
##$PFORMAT= <normpl>
##$SURQMSG= 1
$$ End of Bruker specific parameters
$$ ---------------------------------
##NTUPLES= NMR SPECTRUM
##VAR_NAME=  FREQUENCY,     SPECTRUM/REAL,   SPECTRUM/IMAG
##SYMBOL=    X,             R,               I
##VAR_TYPE=  INDEPENDENT,   DEPENDENT,       DEPENDENT
##VAR_FORM=  AFFN,          ASDF,            ASDF
##VAR_DIM=   131072,        131072,          131072
##UNITS=     HZ,            ARBITRARY UNITS, ARBITRARY UNITS
##FACTOR=    0.0627417313425164, 1,          1
##FIRST=     8223.62146879497, -1052,        -68833
##LAST=      0,             1999,            -69415
##MIN=       0,             -11740,          0
##MAX=       8223.62146879497, 455139440,    0
$$ Real data points
##PAGE= N=1
##DATA TABLE= (X++(R..R)), XYDATA
$$ [...]
$$ plain form
61621 438325 436310 433470 430460 428237 426893 425830 424682 423526 422474 421673 421425 421670 421567 420207 417546
61606 417546 414116 410046 405041 399119 392725 386246 380067 374861 371092 368340 365773 363186 360887 358792
61592 358792 356439 353871 351666 350031 348611 347193 345797 344072 341537 338607 336485 335682 335332 334319 332356
61577 332356 329655 326321 322676 319635 318071 317964 318539 319059 319276 319373 319738 320607 321706 322365 322057 320750 318883
61560 318883 317234 316556 316886 317425 317583 317911 319318 321509 323122 323538 323710 324871 327108 329588 331600 332924
61544 332924 333635 333971 334125 333993 333452 332966 333386 334953 337054 339182 341578 344640 348282 352227 356356 360220
61528 360220 362749 363127 361810 360100 358834 357872 356703 355104 353198 351286 349688 348508 347497 346213 344418
61513 344418 342304 340342 338925 338094 337682 337728 338497 339879 341019 340966 339591 337546 335447 333542 332088 331467
$$ packed form
61621D38325k015k840l010k223j344j063j148j156j052q01k48K45j03j360k661
61606D17546l430m070n005n922o394o479o179n206l769k752k567k587k299k095
61592C58792k353k568k205j635j420j418j396j725k535k930k122q03l50j013j963
61577C32356k701l334l645l041j564j07N75N20K17R7L65Q69J099O59l08j307j867
61560C18883j649o78L30N39J58L28J407K191J613M16J72J161K237K480K012J324
61544C32924P11L36J54j32n41m86M20J567K101K128K396L062L642L945M129L864
61528C60220K529L78j317j710j266r62j169j599j906j912j598j180j011j284j795
61513C44418k114j962j417q31m12M6P69J382J140n3j375k045k099j905j454o21
$$ plain form
61497 331467 331785 332668 333583 334122 334091 333727 333680 334245 334671 333860 331839 329933 329281 329766 330591 331341 332101 332990 334036
61478 334036 335305 336830 338560 340492 342676 345001 347200 349066 350492 351352 351651 351674 351641 351443 351158 351526
61462 351526 353155 355359 356701 356748 356419 356362 355920 354255 351711 349480 348464 349012 351235 354829 358868 362394
61446 362394 365125 367278 368983 370274 371370 372469 373396 373874 374182 375199 377680 381503 385593 388681 390355
61431 390355 391348 392631 394400 396337 398583 401637 405214 408010 409057 408811 408504 408856 409817 411209 413096
61416 413096 415626 418777 422175 425132 427141 428447 429797 431527 433221 434281 434407 433469 431438 428673 425838
61401 425838 423295 420919 418584 416399 414366 412363 410591 409497 409101 408982 409066 409727 410821 411384 410751 409432
61385 409432 408391 407975 407938 407986 407797 407043 405963 405521 406422 408261 410113 411626 413065 414584 415979 417077
$$ packed form
61497C31467L18Q83R15N39l1l64m7N65M26q11k021j906o52M85Q25P50P60Q89J046
61478C34036J269J525J730J932K184K325K199J866J426Q60K99K3l3j98k85L68
61462C51526J629K204J342M7l29n7m42j665k544k231j016N48K223L594M039L526
61446C62394K731K153J705J291J096J099R27M78L08J017K481L823M090L088J674
61431C90355R93J283J769J937K246L054L577K796J047k46l07L52R61J392J887
61416D13096K530L151L398K957K009J306J350J730J694J060J26r38k031k765k835
61401D25838k543k376k335k185k033k003j772j094l96j19Q4O61J094N63o33j319
61385D09432j041m16l7M8j89p54j080m42R01J839J852J513J439J519J395J098
$$ plain form
61369 417077 418008 419147 420883 423155 425160 425978 425676 425342 425839 427119 428919 431389 434553 437757 440356
61354 440356 442564 445193 448884 453900 460212 467384 474905 482959 492255 502682 512815 521361 528422 534674
61340 534674 540042 544163 547649 551719 556640 561435 565217 568074 570559 572888 574802 575835 575647 574293
61326 574293 572152 569486 566335 562941 559814 557149 554708 552589 551472 551652 552428 553069 553804 555198 557134
61311 557134 559227 561822 565661 570859 577083 584552 594002 605728 619376 634592 651127 668341 685221
61298 685221 700829 714166 723884 729005 729953 728192 724784 719818 713138 704956 695720 685982 676377 667133
61284 667133 657640 647105 635689 624470 614336 605551 598334 593058 589631 587300 585378 583874 583216
61271 583216 583721 585401 587936 590723 593251 595497 597778 600255 602807 605265 607580 609985 613271 618553
$$ packed form
61369D17077R31J139J736K272K005Q18l02l34M97J280J800K470L164L204K599
61354D40356K208K629L691N016O312P172P521Q054R296J0427J0133Q546P061O252
61340E34674N368M121L486M070M921M795L782K857K485K329J914J033j88j354
61326E74293k141k666l151l394l127k665k441k119j117J80P76O41P35J394J936
61311E57134K093K595L839N198O224P469R450J1726J3648J5216J6535J7214J6880
61298F85221J5608J3337R718N121R48j761l408m966o680q182r236r738r605r244
61284F67133r493j0535j1416j1219j0134q785p217n276l427k331j922j504o58
61271E83216N05J680K535K787K528K246K281K477K552K458K315K405L286N282
$$ plain form
61257 618553 626353 636092 646838 658092 669372 679577 687604 693416 697679 700558 701719 701446 700769 700226
61243 700226 699305 697401 694680 691592 688163 684243 680126 676447 673569 671339 669429 667733 666445 665762 665631
61228 665631 665984 667162 669705 673608 678305 683682 690486 699215 709084 718752 727729 736316 744518 751887
61214 751887 758329 764234 769741 774604 778888 783055 787149 790445 792179 792331 791585 790850 790843 791792 793485 795839
61198 795839 799279 804327 811128 819850 831281 846335 864989 886202 908750 931569 953335 972504
61186 972504 988083 1000126 1009359 1016562 1022183 1026270 1028753 1029965 1030611 1031013 1030723 1029200 1026422 1022455
61172 1022455 1017015 1010048 1002205 993993 984845 973834 960873 946404 930326 912319 892942 873339
61160 873339 853920 834374 814869 796171 778492 761398 745042 730450 718224 707892 698955 691760
$$ packed form
61257F18553P800R739J0746J1254J1280J0205Q027N812M263K879J161k73o77n43
61243G00226r21j904k721l088l429l920m117l679k878k230j910j696j288o83j31
61228F65631L53J178K543L903M697N377O804Q729R869R668Q977Q587Q202P369
61214G51887O442N905N507M863M284M167M094L296J734J52p46p35pR49J693K354
61198G95839L440N048O801Q722J1431J5054J8654K1213K2548K2819K1766J9169
61186I72504J5579J2043R233P203N621M087K483J212O46M02k90j523k778l967
61172A022455n440o967p843q212r148j1011j2961j4469j6078j8007j9377j9603
61160H73339j9419j9546j9505j8698j7679j7094j6356j4592j2226j0332q937p195
$$ plain form
61148 691760 686891 684322 683577 684135 685273 686022 685647 683901 680711 676079 670378 664300 658398 653051 648763
61133 648763 645915 644301 643506 643690 645411 648730 653245 658993 666559 676230 687765 701157 716932 735515
61119 735515 756827 780608 806517 833972 862496 892265 923674 956467 989905 1023654 1057645
61108 1057645 1091211 1123304 1153595 1182445 1209730 1234657 1256784 1276176 1292357 1304210 1311268
61097 1311268 1314148 1313296 1308190 1298234 1283586 1264664 1241583 1214611 1184580 1152395 1118680 1084242
61085 1084242 1050249 1017472 985744 954503 923534 893118 863895 836641 811749 788918 767765
61074 767765 748540 731738 717332 705084 695196 687732 681784 676313 671563 668510 667116 666389 665957 666219
61060 666219 667073 668009 669531 672927 678414 684939 691965 699921 708703 717530 726738 738025 752203 768191
$$ packed form
61148F91760m869k569p45N58J138P49l75j746l190m632n701o078n902n347m288
61133F48763k848j614p95J84J721L319M515N748P566R671J1535J3392J5775J8583
61119G35515K1312K3781K5909K7455K8524K9769L1409L2793L3438L3749L3991
61108A057645L3566L2093L0291K8850K7285K4927K2127J9392J6181J1853P058
61097A311268K880q52n106r956j4648j8922k3081k6972l0031l2185l3715l4438
61085A084242l3993l2777l1728l1241l0969l0416k9223k7254k4892k2831k1153
61074G67765j9225j6802j4406j2248r888p464n948n471m750l053j394p27m32K62
61060F66219Q54R36J522L396N487O525P026P956Q782Q827R208J1287J4178J5988
$$ plain form
61046 768191 784858 802366 821117 840981 862336 886314 913167 941722 971157 1001870 1033903
61035 1033903 1066176 1098222 1131089 1165557 1200963 1236744 1273573 1311973 1351344 1391460 1433306
61024 1433306 1477363 1522636 1568385 1615028 1662266 1708447 1753357 1799837 1851095 1908363 1972686
61013 1972686 2046680 2132318 2228766 2334393 2449173 2573782 2709572 2862414 3044034 3266689
61003 3266689 3539386 3872384 4281726 4785398 5400663 6153219 7086140 8252725 9707172
60994 9707172 11513979 13747592 16423414 19375232 22206884 24429312 25717304 26077440
60986 26077440 25795773 25251182 24778206 24637899 24993946 25816037 26798721 27444760 27310628
60977 27310628 26230354 24348222 21976606 19429072 16937076 14642219 12611392 10854895
$$ packed form
61046G68191J6667J7508J8751J9864K1355K3978K6853K8555K9435L0713L2033
61035A033903L2273L2046L2867L4468L5406L5781L6829L8400L9371M0116M1846
61024A433306M4057M5273M5749M6643M7238M6181M4910M6480N1258N7268O4323
61013A972686P3994Q5638R6448J05627J14780J24609J35790J52842J81620K22655
61003C266689K72697L32998M09342N03672O15265P52556R32921J166585J454447
60994I707172J806807K233613K675822K951818K831652K222428J287992L60136
60986B6077440k81667n44591m72976j40307L56047Q22091R82684O46039j34132
60977B7310628j080274j882132k371616k547534k491996k294857k030827j756497
$$ plain form
60969 10854895 9351697 8073673 6994870 6089560 5332620 4703217 4184049 3757120 3403616
60960 3403616 3107692 2857635 2643830 2458266 2295742 2153040 2026775 1913751 1812871
60951 1812871 1724657 1648940 1584539 1530595 1486282 1449276 1416179 1384428 1352631 1319567 1284575
60940 1284575 1248747 1214086 1181444 1150489 1121331 1094587 1069841 1045664 1021482 998215 976855
60929 976855 957487 939848 923713 908555 893902 880219 868509 858881 850486 842960 836844 832341
60917 832341 828772 825761 824001 824281 826459 829990 834892 841616 850406 861281 874362 889740 907194
60904 907194 926364 947106 969473 993415 1018576 1044303 1069931 1095253 1120592 1146175 1171493
60893 1171493 1195535 1217511 1237041 1253791 1267434 1277970 1285646 1290414 1291823 1289489 1283344 1273351
$$ packed form
60969A0854895j503198j278024j078803r05310p56940o29403n19168m26929l53504
60960C403616k95924k50057k13805j85564j62524j42702j26265j13024j00880
60951A812871q8214p5717o4401n3944m4313l7006l3097l1751l1797l3064l4992
60940A284575l5828l4661l2642l0955k9158k6744k4746k4177k4182k3267k1360
60929I76855j9368j7639j6135j5158j4653j3683j1710r628q395p526o116m503
60917H32341l569l011j760K80K178L531M902O724Q790J0875J3081J5378J7454
60904I07194J9170K0742K2367K3942K5161K5727K5628K5322K5339K5583K5318
60893A171493K4042K1976J9530J6750J3643J0536P676M768J409k334o145r993
$$ plain form
60881 1273351 1259358 1241523 1220586 1197508 1172926 1147144 1120535 1093650 1066886 1040330 1014168
60870 1014168 989085 965865 944513 924183 904296 885342 868100 852357 837097 821905 807407
60859 807407 794235 782252 771097 760741 751044 741338 731050 720339 709600 698819 687965 677617
60847 677617 668445 660252 652245 644188 636538 629379 621953 613599 604634 595836 587246 577983 567281 555407
60833 555407 543421 532284 522494 514445 508559 504728 502038 499527 497082 495120 493620 492188 491046 491040
60819 491040 492364 494044 495271 496561 498823 501674 503659 504203 504500 506068 508910 511633 513198 514045 515317
60804 515317 517396 519659 521489 522887 523916 524202 523562 522678 522389 522510 522059 520620 518749 517040 515520 514076
60788 514076 512737 511244 509019 505897 502365 498814 495102 491046 486748 482120 476716 470403 463703 457117
$$ packed form
60881A273351j3993j7835k0937k3078k4582k5782k6609k6885k6764k6556k6162
60870A014168k5083k3220k1352k0330j9887j8954j7242j5743j5260j5192j4498
60859H07407j3172j1983j1155j0356r697r706j0288j0711j0739j0781j0854j0348
60847F77617r172q193q007q057p650p159p426q354q965q798q590r263j0702j1874
60833E55407j1986j1137r790q049n886l831k690k511k445j962j500j432j142o
60819D91040J324J680J227J290K262K851J985N44K97J568K842K723J565Q47J272
60804E15317K079K263J830J398J029K86o40q84k89J21m51j439j871j709j520j444
60788E14076j339j493k225l122l532l551l712m056m298m628n404o313o700o586
$$ plain form
60774 457117 450681 444501 439071 434567 430389 425989 421749 418503 416558 415637 415439 415800 416627 418036 420219
60759 420219 422890 425308 427159 428892 430817 432587 434036 435815 438406 441095 442835 443792 445239 448139
60745 448139 452580 458345 465163 472390 479115 484675 488670 490614 490093 487289 482857 477416 471454 465478
60731 465478 459770 454167 448460 442745 437013 430844 424075 417364 411433 406075 400687 395490 391375 388589
60717 388589 386432 384263 382055 379843 377383 374634 371967 369664 367596 365594 363759 362296 361361 361084 361425
60702 361425 362024 362487 362770 363020 363205 363265 363419 363884 364464 364871 365191 365595 365893 366013 366606 368406 371144 373926
60684 373926 376639 380062 384511 389262 393581 397550 401535 405588 409869 414965 421181 427867 434067 439719
60670 439719 445730 452866 460825 468491 474963 480178 484394 487255 487932 486439 484214 482755 482009 480804 478592
$$ packed form
60774D57117o436o180n430m504m178m400m240l246j945r21j98L61Q27J409K183
60759D20219K671K418J851J733J925J770J449J779K591K689J740R57J447K900
60745D48139M441N765O818P227O725N560L995J944n21k804m432n441n962n976
60731D65478n708n603n707n715n732o169o769o711n931n358n388n197m115k786
60717C88589k157k169k208k212k460k749k667k303k068k002j835j463r35k77L41
60702C61425N99M63K83K50J85O0J54M65N80M07L20M04K98J20N93J800K738K782
60684C73926K713L423M449M751M319L969L985M053M281N096O216O686O200N652
60670D39719O011P136P959P666O472N215M216K861O77j493k225j459p46j205k212
$$ plain form
60655 478592 475944 473423 470902 468163 465355 462644 460069 458011 457056 457121 457309 456954 456205 455243 453568 450505
60639 450505 445937 440214 433834 427567 422327 418407 415255 412410 410128 408735 407896 407119 406488 406222 405979
60624 405979 405327 404623 404626 405371 406094 406183 405552 404235 402410 400907 400807 402181 403821 404578 404497 404309 404362 404569 405027
60605 405027 405978 407290 408564 409824 411525 413656 415335 415716 415085 414601 415003 415916 416509 416506 416407 416875 418135
60588 418135 419886 421636 423081 424236 425198 425895 426180 426157 426189 426537 427161 427917 428716 429452 430085 430980 432872 436210
60570 436210 440718 445834 451435 457863 465455 474360 484693 496558 509961 524816 540781 556793 571129
60557 571129 582443 590610 596089 598611 597210 591700 583504 574680 566457 558996 552196 546349 542066 539783
60543 539783 539356 540094 541368 543285 546634 552169 560075 570178 582362 596664 613050 631302 651044
$$ packed form
60655D78592k648k521k521k739k808k711k575k058r55O5J88l55p49r62j675l063
60639D50505m568n723o380o267n240l920l152k845k282j393q39p77o31k66k43
60624D05979o52p04LP45P23Q9o31j317j825j503j00J374J640P57q1j88N3K07M58
60605D05027R51J312J274J260J701K131J679L81o31m84M02R13N93lr9M68J260
60588D18135J751J750J445J155R62O97K85k3L2L48O24P56P99P36O33Q95J892L338
60570D36210M508N116N601O428P592Q905J0333J1865J3403J4855J5965J6012J4336
60557E71129J1314Q167N479K522j401n510q196q824q223p461o800n847m283k283
60543E39783m27P38J274J917L349N535P906J0103J2184J4302J6386J8252J9742
$$ plain form
60530 651044 671712 692352 711369 726644 736374 740168 739249 735341 729463 721901 712991 703434 693928
60517 693928 684999 677192 670971 666264 662439 658972 655927 653682 652406 651914 651882 652095 652601 653675 655589
60502 655589 658543 662961 669630 679282 692199 708561 729066 754811 786618 824768 869190 919265
60490 919265 973418 1029464 1085487 1139954 1190961 1236015 1272932 1300563 1318386 1325770 1321965 1306587
60478 1306587 1279929 1243094 1198039 1147193 1092761 1036565 980546 926854 877055 831530 789990
60467 789990 752289 718451 688262 661351 637597 617087 599691 584949 572249 560898 550236
60456 550236 540058 530848 523148 516709 510658 504602 499126 494927 491720 488376 484092 479114 474292 470274
60442 470274 467339 465663 465218 465415 465337 464598 463625 462903 462273 461355 460289 459521 459076 458594 458071 457914 458232 458568
$$ packed form
60530F51044K0668K0640J9017J5275R730L794r19l908n878p562q910r557r506
60517F93928q929p807o221m707l825l467l045k245j276m92l2K13N06J074J914
60502F55589K954M418O669R652J2917J6362K0505K5745L1807L8150M4422N0075
60490I19265N4153N6046N6023N4467N1007M5054L6917K7631J7823P384l805j5378
60478A306587k6658l6835m5055n0846n4432n6196n6019n3692m9799m5525m1540
60467G89990l7701l3838l0189k6911k3754k0510j7396j4742j2700j1351j0662
60456E50236j0178r210p700o439o051o056n476m199l207l344m284m978m822m018
60442D70274k935j676m45J97p8p39r73p22o30r18j066p68m45m82n23j57L18L36
$$ plain form
60424 458568 458518 458097 457324 455982 454151 452567 452038 452698 454107 455852 457756 459643 461213 462124 462168 461559 461095
60407 461095 461629 463129 464570 465024 464650 464343 464702 465713 467176 468901 470520 471616 472174 472665 473505 474734
60391 474734 476295 478401 481293 484760 488154 491048 493745 496938 500888 505110 508894 511927 514315 516241
60377 516241 517932 519777 522095 524719 527085 528848 530239 531720 533516 535510 537479 539327 541185 543229
60363 543229 545321 546921 547550 547288 546626 546015 545786 546349 547964 550413 553312 556755 561197 566760 573200 580697
60347 580697 589977 601296 613656 625458 635711 644355 651716 657907 662539 664774 663927 660252 654830
60334 654830 648422 640808 631583 621323 611386 602717 595271 588578 582423 576852 571859 567302 563029 558992
60320 558992 555272 552040 549495 547760 546715 545862 544609 542894 541407 540905 541454 542730 544950 548868 554827
$$ packed form
60424D58568n0m21p73j342j831j584n29O60J409J745J904J887J570R11M4o09m64
60407D61095N34J500J441M54l74l07L59J011J463J725J619J096N58M91Q40J229
60391D74734J561K106K892L467L394K894K697L193L950M222L784L033K388J926
60377E16241J691J845K318K624K366J763J391J481J796J994J969J848J858K044
60363E43229K092J600O29k62o62o11k29N63J615K449K899L443M442N563O440P497
60347E80697R280J1319J2360J1802J0253Q644P361O191M632K235q47l675n422
60334F54830o408p614r225j0260r937q669p446o693o155n571m993m557m273m037
60320E58992l720l232k545j735j045q53j253j715j487n02N49J276K220L918N959
$$ plain form
60305 554827 562477 571736 583486 598937 618736 643027 671690 703709 736527 766803 791971 810689
60293 810689 821945 824427 817166 800603 776883 749201 720793 694136 670648 650796 634316 620490
60281 620490 608709 598959 591529 586088 581457 576566 571371 566491 562215 558220 554036 549343 544026 538418
60267 538418 533338 529407 526355 523478 520633 518266 516470 514718 512801 511408 511345 512492 513923 514862 515139
60252 515139 514901 514314 513569 512886 512388 512083 512007 512236 512750 513394 513984 514337 514274 513763 513111 512748 512724 512612 512129 511675
60232 511675 511954 513103 514584 515991 517579 519826 522776 526125 529735 533656 537706 541382 544252 546291
60218 546291 547892 549664 552139 555420 559195 563260 567809 573041 578709 584446 590326 596683 603530 610610
60204 610610 617938 625707 633688 641263 648133 654476 660356 665546 670109 674522 678939 682817 685544 687045
$$ packed form
60305E54827P650R259J1750J5451J9799K4291K8663L2019L2818L0276K5168J8718
60293H10689J1256K482p261j6563k3720k7682k8408k6657k3488j9852j6480j3826
60281F20490j1781r750p430n441m631m891n195m880m276l995m184m693n317n608
60267E38418n080l931l052k877k845k367j796j752j917j393o3J147J431R39K77
60252E15139k38n87p45o83m98l05p6K29N14O44N90L53o3n11o52l63k4j12m83m54
60232E11675K79J149J481J407J588K247K950L349L610L921M050L676K870K039
60218E46291J601J772K475L281L775M065M549N232N668N737N880O357O847P080
60204F10610P328P769P981P575O870O343N880N190M563M413M417L878K727J501
$$ plain form
60190 687045 687514 686970 685373 682816 679359 675054 670318 665841 661862 658010 654077 650350 646832 642831 637916
60175 637916 632753 628321 624711 621390 618302 615869 614064 612284 610204 608163 606626 605763 605566 605887 606330
60160 606330 606568 606746 607130 607391 606848 605536 604420 604298 604976 605874 607005 608847 611431 614091 616212 617901
60144 617901 619698 621792 623825 625479 626991 628896 631460 634681 638696 643767 649794 656251 662761 669411
60130 669411 676324 683245 689677 695120 699011 700840 700694 699406 697930 696722 695859 695311 694865 694235 693600 693697
60114 693697 695034 697295 699870 702481 704938 706739 707522 707615 707579 707502 707166 706529 705427 703156 699109 693663
60098 693663 687816 682147 676753 671908 668001 664986 662759 661969 663524 667212 671673 675858 679766 683653
60084 683653 687456 691308 695668 700424 704570 707297 708806 709544 709242 707300 703632 698491 691882 683817 674927
$$ packed form
60190F87045M69n44j597k557l457m305m736m477l979l852l933l727l518m001m915
60175F37916n163m432l610l321l088k433j805j780k080k041j537q63j97L21M43
60160F06330K38J78L84K61n43j312j116j22O78Q98J131J842K584K660K121J689
60144F17901J797K094K033J654J512J905K564L221M015N071O027O457O510O650
60130F69411O913O921O432N443L891J829j46j288j476j208q63n48m46o30o35R7
60114F93697J337K261K575K611K457J801P83R3l6p7l36o37j102k271m047n446
60098F93663n847n669n394m845l907l015k227p90J555L688M461M185L908L887
60084F83653L803L852M360M756M146K727J509P38l02j942l668n141o609q065q890
$$ plain form
60069 674927 666125 657713 649309 640628 631941 623808 616689 610675 605310 599773 593620 587270 581461 576373
60055 576373 571616 566971 562678 558961 555753 553012 550966 549846 549632 550298 552011 554846 558414 562143 565919
60040 565919 570187 575383 581506 588326 595683 603279 610320 615766 619037 620321 620238 619368 618060 616344 613960
60025 613960 610646 606435 601371 595022 586764 576746 566139 556132 547055 538745 531311 524988 519580
60012 519580 514675 510339 507102 505217 504250 503372 501814 499185 495688 491954 488469 485370 483005 482181 483276
59997 483276 485454 487479 489033 490543 491916 492457 492150 492065 493120 495170 497699 500721 504460 508708 513075
59982 513075 517503 521994 526108 529217 531038 531523 530444 527620 523437 518735 514256 510459 507697 506009
59968 506009 504775 503114 500872 498911 498155 498539 499158 499435 499808 501130 503511 506080 507873 508728 509168 509723
$$ packed form
60069F74927q802q412q404q681q687q133p119o014n365n537o153o350n809n088
60055E76373m757m645m293l717l208k741k046j120k14O66J713K835L568L729L776
60040E65919M268N196O123O820P357P596P041N446L271J284q3q70j308j716k384
60025F13960l314m211n064o349q258j0018j0607j0007r077q310p434o323n408
60012E19580m905m336l237j885r67q78j558k629l497l734l485l099k365q24J095
59997D83276K178K025J554J510J373N41l07q5J055K050K529L022L739M248M367
59982E13075M428M491M114L109J821M85j079k824m183m702m479l797k762j688
59968E06009j234j661k242j961p56L84O19K77L73J322K381K569J793Q55M40N55
$$ plain form
59952 509723 510676 512257 514580 517323 519832 521736 523243 524772 526532 528567 530954 533704 536565 539033
59938 539033 540573 540832 539870 538218 536529 535027 533406 531362 529125 527325 526360 525989 525631 525052 524698 525193
59922 525193 526578 528284 529897 531581 533537 535458 536929 538191 540065 543201 547700 553315 559559 565665
59908 565665 570925 575159 578521 580885 581790 581033 578912 575919 572640 569958 568739 569035 570006 570929 571993
59893 571993 573844 576691 580164 583880 587826 592230 597233 602673 608144 613312 618156 622817 627298 631562
59879 631562 635861 640623 645969 651597 657145 662325 666608 669179 669451 667495 663837 658964 653051 645959
59865 645959 637479 627818 617891 608856 601282 594973 589617 585261 582075 580056 579207 579699 581520 584151 586938
59850 586938 589813 593395 598315 604600 611897 620298 630666 643833 659405 675527 689870 700690 707115
$$ packed form
59952E09723R53J581K323K743K509J904J507J529J760K035K387K750K861K468
59938E39033J540K59r62j652j689j502j621k044k237j800r65l71l58n79l54M95
59922E25193J385J706J613J684J956J921J471J262J874L136M499N615O244O106
59908E65665N260M234L362K364R05p57k121k993l279k682j219K96R71R23J064
59893E71993J851K847L473L716L946M404N003N440N471N168M844M661M481M264
59879F31562M299M762N346N628N548N180M283K571K72j956l658m873n913p092
59865F45959q480r661r927r035p574o309n356m356l186k019q49M92J821K631K787
59850E86938K875L582M920O285P297Q401J0368J3167J5572J6122J4343J0820O425
$$ plain form
59837 707115 709133 707794 705150 703493 704536 709190 717317 727085 735066 738096 735422 728706 719984 710096
59823 710096 699072 687298 675769 665343 656029 647097 637969 628976 620999 614304 608280 602557 597825
59810 597825 594978 593873 593534 593243 592735 591735 590149 588463 587127 585693 583449 580735 578621 577265 575568
59795 575568 572650 568764 564634 560762 557655 555818 555158 555037 555134 555593 556154 555986 554621 552331 549468 546283
59779 546283 543495 541991 541596 541106 539945 538775 538085 537247 535598 533428 531213 528870 526532 525091 525035 525600
59763 525600 526011 526768 528630 531126 533237 535049 537472 540692 544028 547120 550153 553065 555591 558067 561271
59748 561271 565384 569867 574293 578630 582802 586748 590823 595350 599824 603343 605838 608141 610823 613669
59734 613669 616324 618706 620673 622056 623218 624919 627342 629764 631436 632338 632916 633531 634387 635551 636798
$$ packed form
59837G07115K018j339k644j657J043M654Q127R768P981L030k674o716q722r888
59823G10096j1024j1774j1529j0426r314q932r128q993p977o695o024n723m732
59810E97825k847j105l39k91n08j000j586j686j336j434k244k714k114j356j697
59795E75568k918l886m130l872l107j837o60j21R7M59N61j68j365k290k863l185
59779E46283k788j504l95m90j161j170o90q38j649k170k215k343k338j441n6N65
59763E25600M11P57J862K496K111J812K423L220L336L092L033K912K526K476L204
59748E61271M113M483M426M337M172L946M075M527M474L519K495K303K682K846
59734F13669K655K382J967J383J162J701K423K422J672R02N78O15Q56J164J247
$$ plain form
59719 636798 637747 638392 639232 640703 642643 644457 645656 646200 646449 646821 647375 647775 647696 647122 646199 645082 644117
59702 644117 643811 644253 644772 644575 643663 642839 642939 644281 646719 649972 653945 658816 664581 670362 674577 676129
59686 676129 675246 673046 670606 668601 667273 666256 664785 662482 659682 656728 653391 649374 644949 640575
59672 640575 636237 631629 626644 621201 614979 607916 600675 594080 588329 583231 578864 575430 572772 570619
59658 570619 569087 568388 568316 568511 569023 570098 571767 574164 577839 582994 588693 593540 597038 599629 601622
59643 601622 602727 602545 600902 597801 593556 588858 584221 579613 575076 571322 569035 567858 566847 565730
59629 565730 565045 565156 565762 566268 566095 564884 562946 561224 560210 559269 557718 556113 555595 556265 557141 557456 557059
59612 557059 555804 553640 551332 550060 550185 551167 552651 554784 557555 560687 564167 567919 571012 572204 571438
$$ packed form
59719F36798R49O45Q40J471J940J814J199N44K49L72N54M00p9n74r23j117r65
59702F44117l06M42N19j97r12q24J00J342K438L253L973M871N765N781M215J552
59686F76129q83k200k440k005j328j017j471k303k800k954l337m017m425m374
59672F40575m338m608m985n443o222p063p241o595n751n098m367l434k658k153
59658E70619j532o99p2J95N12J075J669K397L675N155N699M847L498K591J993
59643F01622J105j82j643l101m245m698m637m608m537l754k287j177j011j117
59629E65730o85J11O06N06j73j211j938j722j014r41j551j605n18O70Q76L15l97
59612E57059j255k164k308j272J25R82J484K133K771L132L480L752L093J192p66
$$ plain form
59597 571438 569860 568213 566142 563289 560171 557624 556059 555474 555648 556158 556761 557656 558812 559384 558624 557054
59581 557054 555661 554242 551840 548677 546099 544438 542470 539445 536178 533483 530944 528055 525437 523918
59567 523918 523345 523207 523578 524502 525214 524984 524272 524113 524723 525444 525804 525983 526420 527460 529108 530858 532105
59550 532105 533040 534653 537545 541167 544507 547101 549174 551393 554692 559701 566061 572891 580134 588832
59536 588832 600144 615063 634924 660326 688487 712949 727530 730626 725313 716184 706858 699500
59524 699500 695030 693485 694699 698508 704009 709338 712995 715026 716209 716517 715065 711152 704660 695773
59510 695773 685021 673368 661636 650089 638912 628525 618906 609300 599437 590477 583768 579032 574809
59497 574809 570458 566678 564080 562302 560814 559794 559762 560724 561970 562560 562013 560700 559533 559153 559612 560922
$$ packed form
59597E71438j578j647k071k853l118k547j565n85J74N10O03Q95J156N72p60j570
59581E57054j393j419k402l163k578j661j968l025l267k695k539k889k618j519
59567E23918n73j38L71R24P12k30p12j59O10P21L60J79M37J040J648J750J247
59550E32105R35J613K892L622L340K594K073K219L299N009O360O830P243Q698
59536E88832J1312J4919J9861K5402K8161K4462J4581L096n313r129r326p358
59524F99500m470j545J214L809N501N329L657K031J183L08j452l913o492q887
59510F95773j0752j1653j1732j1547j1177j0387r619r606r863q960o709m736m223
59497E74809m351l780k598j778j488j020l2R62J246N90n47j313j167l80M59J310
$$ plain form
59481 560922 563475 567649 573352 580251 588090 596541 605284 614607 625381 637875 651019 663312 673986
59468 673986 682750 688980 692043 692217 690570 688076 685340 683007 681769 682019 683906 687612 693305 701086 711266
59453 711266 724214 739478 755527 770985 785813 800759 816008 830962 844970 857517 867848
59442 867848 874959 877902 875777 867872 854491 837434 819125 801290 784757 770026 757380 746511
59430 746511 736561 726607 716184 705762 696764 690472 686718 684425 683615 685784 691878 701130 712651 726829
59416 726829 743972 762801 781795 801184 822161 845151 870611 900349 934980 969637 994716
59405 994716 1002308 991261 966236 933986 901069 872644 851262 837403 832170 838124 855596 878509
59393 878509 895804 898108 883255 856019 823591 791409 762033 736372 714864 697417 683120 670932
$$ packed form
59481E60922K553M174N703O899P839Q451Q743R323J0774J2494J3144J2293J0674
59468F73986Q764O230L063J74j647k494k736k333j238K50J887L706N693P781J0180
59453G11266J2948J5264J6049J5458J4828J4946J5249J4954J4008J2547J0331
59442H67848P111K943k125p905j3381j7057j8309j7835j6533j4731j2646j0869
59430G46511r950r954j0423j0422q998o292l754k293q10K169O094R252J1521J4178
59416G26829J7143J8829J8994J9389K0977K2990K5460K9738L4631L4657K5079
59405I94716P592j1047k5025l2250l2917k8425k1382j3859n233N954J7472K2913
59393H78509J7295K304j4853k7236l2428l2182k9376k5661k1508j7447j4297j2188
$$ plain form
59381 670932 660695 652940 647749 644399 642098 640543 639782 640116 642153 646210 651537 656729 661103 665102
59367 665102 669329 673900 678909 684724 691401 698326 704847 710815 716369 721690 727252 733725 741353 749847
59353 749847 759109 769503 781215 793963 807656 822709 839269 856700 874389 892610 911984 932352
59341 932352 952648 971687 988684 1003195 1014919 1023404 1027733 1026799 1020269 1009127 995005 979050
59329 979050 961539 942261 921074 898388 875486 854117 835379 819021 804045 789822 776456
59318 776456 764293 753524 744272 736691 730751 725999 721723 717412 713038 708873 705099 701734 698847 696597
59304 696597 695013 694049 693908 694987 697339 700663 705090 711542 720954 733587 749397 768231 788606 806659
59290 806659 817577 818565 810137 794844 775593 755060 735428 717908 702813 690310 680677 673801
$$ packed form
59381F70932j0237p755n191l350k301j555p61L34K037M057N327N192M374L999
59367F65102M227M571N009N815O677O925O521N968N554N321N562O473P628Q494
59353G49847R262J0394J1712J2748J3693J5053J6560J7431J7689J8221J9374K0368
59341I32352K0296J9039J6997J4511J1724Q485M329r34o530j1142j4122j5955
59329I79050j7511j9278k1187k2686k2902k1369j8738j6358j4976j4223j3366
59318G76456j2163j0769r252p581n940m752m276m311m374m165l774l365k887k250
59304F96597j584r64j41J079K352L324M427O452R412J2633J5810J8834K0375J8053
59290H06659J0918R88q428j5293j9251k0533j9632j7520j5095j2503r633o876
$$ plain form
59278 673801 669142 666450 666073 668383 673421 681253 692033 705468 720738 737217 754738 772850 790399
59265 790399 806244 819957 831515 840671 846954 849932 849222 844658 836702 826330 814217 800448 785220
59252 785220 769361 753844 739210 725839 714327 705147 698181 692977 689282 687078 686433 687627 691119
59239 691119 696998 704612 713021 721650 730329 738969 747475 755798 763762 770973 777011 781586 784421 785278
59225 785278 784226 781614 777646 772253 765459 757520 748591 738712 728409 718928 711452 706174 702390 699382
59211 699382 697103 696172 697178 699752 702295 703043 701518 698615 695272 691612 687536 683418 679704 676240 672561
59196 672561 668636 664898 661732 659234 657317 655719 654016 651950 649668 647521 645827 645015 645617 647713 650515
59181 650515 652958 654747 656561 659189 662611 666056 668874 671311 674324 678651 684234 690723 698257 707369
$$ packed form
59278F73801m659k692l77K310N038P832J0780J3435J5270J6479J7521J8112J7549
59265G90399J5845J3713J1558R156O283K978p10m564p956j0372j2113j3769j5228
59252G85220j5859j5517j4634j3371j1512r180o966n204l695k204o45J194L492
59239F91119N879P614Q409Q629Q679Q640Q506Q323P964P211O038M575K835Q57
59225G85278j052k612l968n393o794p939q929r879j0303r481p476n278l784l008
59211F99382k279r31J006K574K543P48j525k903l343l660m076m118l714l464l679
59196F72561l925l738l166k498j917j598j703k066k282k147j694q12O02K096K802
59181F50515K443J789J814K628L422L445K818K437L013M327N583O489P534R112
$$ plain form
59167 707369 718220 730414 743563 757559 772193 786911 801086 814171 825525 834546 841158 845674
59155 845674 848004 847425 843452 836446 827034 815366 801492 786256 771232 757689 745792 734701 723302
59142 723302 711053 698514 687003 677446 669479 661780 653253 643861 634473 626091 619189 613584 608804
59129 608804 604530 600742 597603 595288 593805 592913 592375 592426 593770 597013 602272 609430 618375 628703 639563
59114 639563 650228 660640 671101 681848 693206 705561 718405 729948 738577 744563 749515 754374
59102 754374 758845 762593 765839 768588 770306 770689 770002 768422 765853 762602 759405 756492 753484 750536 748660
59087 748660 748402 748982 749345 749302 748957 747661 744423 739110 732556 725559 718224 710236 701576 692945 685362 679089
59071 679089 673175 666626 659798 653919 649362 645375 641456 637819 634336 630288 625737 621998 619992 619057
$$ packed form
59167G07369J0851J2194J3149J3996J4634J4718J4175J3085J1354R021O612M516
59155H45674K330n79l973p006r412j1668j3874j5236j5024j3543j1897j1091j1399
59142G23302j2249j2539j1511r557p967p699q527r392r388q382o902n605m780
59129F08804m274l788l139k315j483q92n38N1J344L243N259P158Q945J0328J0860
59114F39563J0665J0412J0461J0747J1358J2355J2844J1543Q629N986M952M859
59102G54374M471L748L246K749J718L83o87j580k569l251l197k913l008k948j876
59087G48660k58N80L63m3l45j296l238n313o554o997p335p988q660q631p583o273
59071F79089n914o549o828n879m557l987l919l637l483m048m551l739k006r35
$$ plain form
59057 619057 618086 616875 615591 613869 611463 608983 606991 605015 602535 600254 599297 599546 599928 599929 599689 598938
59041 598938 597163 594802 593074 592390 591897 590842 589537 588635 588235 588058 588024 588250 588839 590021 592271 596061
59025 596061 601483 608153 615465 623103 631370 640811 651428 662526 673413 683891 693916 703159 711075
59012 711075 716964 719952 719642 717080 714318 712526 711234 709898 709294 710486 713157 716137 719210 723400 729615
58997 729615 737902 747813 758560 768870 777649 785003 791950 799062 805936 811918 816614 819603 820289 818306
58983 818306 813720 806899 798716 790757 784613 780646 777879 775333 773197 772566 774319 778521 784849 793399
58969 793399 804770 819118 835346 851789 867761 883805 900386 917150 933818 950816 968187
58958 968187 984505 997700 1006600 1010937 1010426 1004836 994751 981264 964950 945897 924671 902486
$$ packed form
59057F19057r71j211j284j722k406k480j992j976k480k281r57K49L82Jk40p51
59041E98938j775k361j728o84m93j055j305r02m00j77l4K26N89J182K250L790
59025E96061N422O670P312P638Q267R441J0617J1098J0887J0478J0025R243P916
59012G11075N889K988l10k562k762j792j292j336o04J192K671K980L073M190O215
58997G29615Q287R911J0747J0310Q779P354O947P112O874N982M696K989O86j983
58983H18306m586o821q183p959o144l967k767k546k136o31J753M202O328Q550
58969G93399J1371J4348J6228J6443J5972J6044J6581J6764J6668J6998J7371
58958I68187J6318J3195Q900M337n11n590j0085j3487j6314j9053k1226k2185
$$ plain form
58946 902486 880378 858871 838392 819318 801561 784790 769203 755570 744434 735684 728903 723664
58934 723664 719481 715947 713040 710936 709505 708259 706756 704820 702489 699998 697662 695570 693599 691854
58920 691854 690698 690118 689556 688681 687860 687504 687493 687660 688242 689363 690708 692341 695181 699888 705822 711973
58904 711973 718442 726132 735464 746387 759274 774637 792048 810321 828778 847518 866469 885043
58892 885043 902815 919960 937030 954846 974512 996931 1022355 1050613 1081225 1112702 1142403
58881 1142403 1168086 1189300 1206529 1219546 1227595 1230634 1229025 1222204 1209016 1189494 1165297 1138384
58869 1138384 1110240 1082271 1055664 1030596 1006583 983905 963787 946914 932561 919429 906687
58858 906687 894046 881549 869383 857356 844652 830763 816480 803198 791358 780380 769905
$$ packed form
58946I02486k2108k1507k0479j9074j7757j6771j5587j3633j1136q750o781n239
58934G23664m183l534k907k104j431j246j503j936k331k491k336k092j971j745
58920F91854j156n80n62q75q21l56j1J67N82J121J345J633K840M707N934O151
58904G11973O469P690R332J0923J2887J5363J7411J8273J8457J8740J8951J8574
58892H85043J7772J7145J7070J7816J9666K2419K5424K8258L0612L1477K9701
58881A142403K5683K1214J7229J3017Q049L039j609o821j3188j9522k4197k6913
58869A138384k8144k7969k6607k5068k4013k2678k0118j6873j4353j3132j2742
58858I06687j2641j2497j2166j2027j2704j3889j4283j3282j1840j0978j0475
$$ plain form
58847 769905 760134 751131 742768 735283 728834 722603 715461 707534 700020 693470 687335 681213 675269 669324
58833 669324 662868 656241 650582 646199 642166 637909 634045 631191 629091 627471 626766 627366 629050 631669 635553
58818 635553 640722 646459 652157 657837 663513 668910 674159 679793 685594 690453 693860 696599 699363 701600
58804 701600 702435 701915 700603 698701 696288 693802 691425 688449 683942 677773 670564 663028 655750 649180 643352
58789 643352 637968 633026 629038 626421 625128 625004 625956 627726 630087 633352 638003 643703 649453 654840 660300
58774 660300 665977 671147 674901 676586 675478 671131 664375 656923 649631 642073 634087 626510 619859 613483
58760 613483 606813 600493 595503 592012 589813 589069 589869 591718 594202 597519 601750 606254 610403 614304 618299
58745 618299 622449 626954 632285 638334 644301 650017 656459 664222 672325 679388 685263 690664 695894 700915
$$ packed form
58847G69905r771r003q363p485o449o231p142p927p514o550o135o122n944n945
58833F69324o456o627n659m383m033m257l864k854k100j620p05O00J684K619L884
58818F35553N169N737N698N680N676N397N249N634N801M859L407K739K764K237
58804G01600Q35n20j312j902k413k486k377k976m507o169p209p536p278o570n828
58789F43352n384m942l988k617j293j24R52J770K361L265M651N700N750N387N460
58774F60300N677N170L754J685j108m347o756p452p292p558p986p577o651o376
58760F13483o670o320m990l491k199p44Q00J849K484L317M231M504M149L901L995
58745F18299M150M505N331O049N967N716O442P763Q103P063N875N401N230N021
$$ plain form
58731 700915 706107 711968 718376 724899 731517 738366 745138 751394 757145 762572 767593 772262 777153 782844
58717 782844 789341 796452 804219 812532 820857 828932 837275 846424 856006 864954 872307 877458 880037 879846
58703 879846 876622 869839 859294 845760 830170 812274 791273 767895 744480 722536 701669 681561
58691 681561 663496 648736 636580 625384 614762 605554 598218 592371 587422 582736 577513 571422 565029
58678 565029 559071 553801 549494 546762 545652 545260 545020 545550 547436 550065 552761 556261 561894 569820 579240
58663 579240 589824 601794 614846 627983 640143 650211 656833 659163 657667 653534 647662 640822 634150
58650 634150 628505 623643 618813 613835 608918 603945 598794 593986 590171 587261 584763 582691 581494 581374
58636 581374 582286 584323 587602 592126 598084 605733 614550 623116 630258 635648 639034 639917 638578 636324 633915
$$ packed form
58731G00915N192N861O408O523O618O849O772O256N751N427N021M669M891N691
58717G82844O497P111P767Q313Q325Q075Q343R149R582Q948P353N151K579j91
58703H79846l224o783j0545j3534j5590j7896k1001k3378k3415k1944k0867k0108
58691F81561j8065j4760j2156j1196j0622r208p336n847m949m686n223o091o393
58678E65029n958n270m307k732j110l92k40N30J886K629K696L500N633P926R420
58663E79240J0584J1970J3052J3137J2160J0068O622K330j496m133n872o840o672
58650F34150n645m862m830m978m917m973n151m808l815k910k498k072j197j20
58636E81374R12K037L279M524N958P649Q817Q566P142N390L386Q83j339k254k409
$$ plain form
58621 633915 630624 625666 619682 613978 609282 606257 606274 610424 618301 628628 640503 653192 665528 676438
58607 676438 685481 692149 695610 695943 694671 693102 691100 688328 685386 682514 678470 672227 664792 657834
58593 657834 651527 645377 640207 637392 636725 636883 637676 640157 644893 651738 660967 672953 686875 701179
58579 701179 715161 728812 741495 752263 761203 769010 775511 780083 783362 787078 792323 799271 808310
58566 808310 820033 834313 850814 870276 893894 921466 951365 982125 1012709 1041511 1066580
58555 1066580 1086916 1102323 1112179 1115742 1113692 1108075 1100605 1092026 1082891 1073806 1064997 1056643 1049329
58542 1049329 1043121 1036661 1028310 1017704 1004969 989152 969153 945845 921647 898202 875930 855459
58530 855459 837694 822585 809508 798893 791970 788855 788374 789709 792778 797011 801279 805166 809035
$$ packed form
58621F33915l291m958n984n704m696l025J7M150P877J0327J1875J2689J2336J0910
58607F76438R043O668L461L33j272j569k002k772k942k872m044o243p435o958
58593F57834o307o150n170k815o67J58P93K481M736O845R229J1986J3922J4304
58579G01179J3982J3651J2683J0768Q940P807O501M572L279L716N245O948R039
58566H08310J1723J4280J6501J9462K3618K7572K9899L0760L0584K8802K5069
58555A066580K0336J5407R856L563k050n617p470q579r135r085q809q354p314
58542A049329o208o460q351j0606j2735j5817j9999k3308k4198k3445k2272k0471
58530H55459j7765j5109j3077j0615o923l115m81J335L069M233M268L887L869
$$ plain form
58517 809035 812825 815969 818320 819914 820104 818306 815266 812172 808860 804430 799206 794369 789991 785270
58503 785270 780522 777002 774836 772975 771111 769739 768302 765343 760762 756065 752065 748149 744153 741131
58489 741131 739710 739276 739307 740115 741909 744461 748003 753156 759884 767842 777698 790559 806046 822523
58475 822523 839207 856366 873295 887850 898286 904137 905237 901602 894423 885587 875965 865563 855174
58462 855174 846100 838299 830720 823624 818745 817081 818299 822392 829911 840348 852264 865191 879474
58449 879474 893963 905914 913555 916933 916046 910336 900547 889046 877618 866567 856310 847949 841759
58436 841759 836899 833104 831057 830852 831799 833872 837517 841992 845941 849765 855406 863686 873929 886152
58422 886152 901117 917959 934184 948407 960720 970207 974765 973971 969579 962687 953017 941499 930677
$$ packed form
58517H09035L790L144K351J594J90j798l040l094l312m430n224m837m378m721
58503G85270m748l520k166j861j864j372j437k959m581m697m000l916l996l022
58489G41131j421m34L1Q08J794K552L542N153O728P958R856J2861J5487J6477
58475H22523J6684J7159J6929J4555J0436N851J100l635p179q836r622j0402j0389
58462H55174r074p801p579p096m879j664J218M093P519J0437J1916J2927J4283
58449H79474J4489J1951P641L378q87n710r789j1501j1428j1051j0257q361o190
58436H41759m860l795k047k05R47K073L645M475L949L824N641Q280J0243J2223
58422H86152J4965J6842J6225J4223J2313R487M558p94m392o892r670j1518j0822
$$ plain form
58409 930677 921536 912463 902187 891317 880267 868451 856490 846555 839393 833506 828258 825142 824903
58396 824903 826069 827532 830008 833735 837420 840786 845452 851758 857270 860075 861177 862144 862787 862801 863331
58381 863331 865181 867521 869815 872989 877356 881562 884869 888242 891971 894668 896016 898061 902272 907696
58367 907696 913351 919929 927666 935230 942423 951455 963692 977494 991006 1004718 1019533 1034561 1048636
58354 1048636 1061784 1073555 1082122 1086727 1088966 1090312 1090565 1089938 1090091 1091746 1093788 1095951 1099676 1105205
58340 1105205 1110904 1116752 1125201 1137023 1149675 1161516 1174223 1189195 1205083 1220943 1238277 1257660
58328 1257660 1276688 1293557 1309289 1324235 1336022 1343440 1348721 1353430 1355875 1355269 1354605 1356308 1358803
58315 1358803 1360557 1363702 1370128 1377630 1383658 1389541 1397329 1405824 1413517 1422222 1433868 1446730 1458678
$$ packed form
58409I30677r141r073j0276j0870j1050j1816j1961r935p162n887n248l116k39
58396H24903J166J463K476L727L685L366M666O306N512K805J102R67O43J4N30
58381H63331J850K340K294L174M367M206L307L373L729K697J348K045M211N424
58367I07696N655O578P737P564P193R032J2237J3802J3512J3712J4815J5028J4075
58354A048636J3148J1771Q567M605K239J346K53o27J53J655K042K163L725N529
58340A105205N699N848Q449J1822J2652J1841J2707J4972J5888J5860J7334J9383
58328A257660J9028J6869J5732J4946J1787P418N281M709K445o06o64J703K495
58315A358803J754L145O426P502O028N883P788Q495P693Q705J1646J2862J1948
$$ plain form
58302 1458678 1471183 1486386 1503151 1519753 1537305 1556736 1575540 1591548 1606910 1624323 1642355
58291 1642355 1658544 1674122 1691540 1710174 1728502 1747679 1769029 1790976 1812291 1835194 1861403
58280 1861403 1888577 1914606 1941775 1972507 2004781 2036238 2068932 2105327 2143455 2180871 2219543
58269 2219543 2261884 2305940 2349691 2395968 2447633 2501919 2555211 2609465 2668128 2729739 2791535
58258 2791535 2855256 2923138 2992116 3058352 3123652 3191178 3259024 3324560 3390808 3461710 3535400
58247 3535400 3609098 3686188 3771202 3862238 3955761 4054254 4161508 4275153 4391937 4515577
58237 4515577 4651128 4796477 4947908 5108878 5284394 5472055 5667982 5876206 6102590
58228 6102590 6345047 6599819 6871530 7166608 7482879 7816666 8173891 8562717 8982006
$$ packed form
58302A458678J2505J5203J6765J6602J7552J9431J8804J6008J5362J7413J8032
58291A642355J6189J5578J7418J8634J8328J9177K1350K1947K1315K2903K6209
58280A861403K7174K6029K7169L0732L2274L1457L2694L6395L8128L7416L8672
58269B219543M2341M4056M3751M6277N1665N4286N3292N4254N8663O1611O1796
58258B791535O3721O7882O8978O6236O5300O7526O7846O5536O6248P0902P3690
58247C535400P3698P7090Q5014R1036R3523R8493J07254J13645J16784J23640
58237D515577J35551J45349J51431J60970J75516J87661J95927K08224K26384
58228F102590K42457K54772K71711K95078L16271L33787L57225L88826M19289
$$ plain form
58219 8982006 9429149 9912167 10441238 11015773 11633657 12305551 13045805 13857783 14744053
58210 14744053 15722599 16816637 18037918 19398410 20929518 22671811 24657596 26925931
58202 26925931 29546017 32606796 36199152 40435409 45476135 51517064 58773626 67518985
58194 67518985 78135345 91114471 107042482 126621012 150670026 180047799 215491061
58187 215491061 257237871 304143179 352493889 395692579 425982195 437708160 429870915
58180 429870915 406113534 372525638 335165433 298601701 265416345 236247815 210354396
58173 210354396 186614517 164379521 143643658 124688612 107748219 92921382 80178536
58166 80178536 69355793 60199804 52461997 45937494 40435192 35770502 31799000 28419340
$$ packed form
58219H982006M47143M83018N29071N74535O17884O71894P40254Q11978Q86270
58210A4744053R78546J094038J221281J360492J531108J742293J985785K268335
58202B6925931K620086L060779L592356M236257N040726O040929P256562Q745359
58194F7518985J0616360J2979126J5928011J9578530K4049014K9377773L5443262
58187B15491061M1746810M6905308M8350710M3198690L0289616J1725965p837245
58180D29870915k3757381l3587896l7360205l6563732l3185356k9168530k5893419
58173B10354396k3739879k2234996k0735863j8955046j6940393j4826837j2742846
58166H0178536j0822743r155989p737807o524503n502302m664690l971502l379660
$$ plain form
58158 28419340 25536908 23055690 20906441 19049587 17444426 16040538 14800799 13706789
58150 13706789 12737702 11865406 11072210 10352928 9697533 9090358 8527218 8014932 7552414
58141 7552414 7128520 6738628 6386643 6070061 5779132 5511652 5272974 5059888 4858924
58132 4858924 4662297 4472386 4289572 4109116 3931689 3764299 3608608 3459393 3315727
58123 3315727 3182626 3060506 2943848 2831512 2728074 2633757 2543113 2454813 2373129 2298682
58113 2298682 2227059 2157528 2093949 2036197 1979752 1924604 1875483 1832277 1789171 1744531 1702790
58102 1702790 1665151 1627085 1586841 1548201 1512732 1476990 1439519 1403482 1370487 1338550 1307709
58091 1307709 1280993 1258320 1235881 1212897 1192591 1175452 1158067 1139681 1123241 1108652 1091634
$$ packed form
58158B8419340k882432k481218k149249j856854j605161j403888j239739j094010
58150A3706789r69087q72296p93196p19282o55395o07175n63140n12286m62518
58141G552414m23894l89892l51985l16582k90929k67480k38678k13086k00964
58132D858924j96627j89911j82814j80456j77427j67390j55691j49215j43666
58123C315727j33101j22120j16658j12336j03438r4317r0644q8300q1684p4447
58113B298682p1623o9531o3579n7752n6445n5148m9121m3206m3106m4640m1741
58102A702790l7639l8066m0244l8640l5469l5742l7471l6037l2995l1937l0841
58091A307709k6716k2673k2439k2984k0306j7139j7385j8386j6440j4589j7018
$$ plain form
58080 1091634 1070834 1049685 1029735 1008506 985624 964709 947093 929594 910611 892875 878106
58069 878106 864258 850046 837153 826138 814935 803056 792531 783335 772747 760575 750065 742284
58057 742284 734535 725687 717924 711602 703503 692149 680164 669510 658990 648269 639792 634590 630336
58044 630336 625438 621119 617885 614041 609295 605714 603545 600177 594869 590329 587893 585219 580507 575053
58030 575053 569765 563062 554168 544852 536096 526589 516161 507081 500250 493675 486370 480149 475873 471570
58016 471570 466140 461415 458645 456300 453233 450760 449710 448577 446415 444578 443901 443127 441660 440843 441014
58001 441014 440433 438616 437590 438310 439029 438718 438815 439900 439922 437547 434202 431125 427496 423230 420394 419886
57985 419886 419688 418286 416960 416851 416693 415246 413225 411098 407932 404073 401898 402091 402178 400544 398720 397812
$$ packed form
58080A091634k0800k1149j9950k1229k2882k0915j7616j7499j8983j7736j4769
58069H78106j3848j4212j2893j1015j1203j1879j0525r196j0588j2172j0510p781
58057G42284p749q848p763o322q099j1354j1985j0654j0520j0721q477n202m254
58044F30336m898m319l234l844m746l581k169l368n308m540k436k674m712n454
58030E75053n288o703q894r316q756r507j0428r080o831o575p305o221m276m303
58016D71570n430m725k770k345l067k473j050j133k162j837o77p74j467q17J71
58001D41014n81j817j026P20P19l11R7J085K2k375l345l077l629m266k836n08
57985D19886j98j402j326j09j58j447k021k127l166l859k175J93Q7j634j824r08
$$ plain form
57969 397812 396118 392617 389534 388757 388643 387100 385093 384351 384174 383461 383584 386156 389800 391945 392309 392111
57953 392111 391452 389873 388120 387058 386038 384179 382004 380274 378729 377478 377843 380334 383580 386752 391060
57938 391060 397338 404272 410723 417761 426703 437180 448718 461998 476697 490326 501196 510518 519705
57925 519705 527712 533024 536051 537428 536083 531281 524620 517713 509722 499476 488199 477819 468216
57912 468216 458426 448995 440918 433726 426766 420916 416971 413813 410115 406259 402702 398251 392123 385944
57898 385944 381438 377723 373163 368322 364779 362551 361032 360899 362622 364449 364446 363489 363948 366484 370251 375027
57882 375027 380851 386695 391680 396569 402055 406809 409247 409914 410023 409132 406531 403410 401195 399033 395446
57867 395446 391170 387746 384527 379906 374498 370259 367284 364260 361400 360118 360257 360303 360015 360408 361544
$$ packed form
57969C97812j694l501l083p77j14j543k007p42j77p13J23K572L644K145L64j98
57953C92111o59j579j753j062j020j859k175j730j545j251L65K491L246L172M308
57938C91060O278O934O451P038Q942J0477J1538J3280J4699J3629J0870R322R187
57925E19705Q007N312L027J377j345m802o661o907p991j0246j1277j0380r603
57912D68216r790r431q077p192o960n850l945l158l698l856l557m451o128o179
57898C85944m506l715m560m841l543k228j519j33J723J827lr57M59K536L767M776
57882C75027N824N844M985M889N486M754K438O67J09q91k601l121k215k162l587
57867C95446m276l424l219m621n408m239k975l024k860j282J39M6k88L93J136
$$ plain form
57852 361544 362783 364737 368461 372974 376060 377389 378575 380304 381658 382097 381875 380574 377404 372963 368771
57837 368771 365178 361536 358127 355874 354400 352421 349969 348251 347461 346680 345796 345622 346212 346934 348028 350229
57821 350229 353060 355388 357415 360147 363161 365089 366208 368297 371818 375457 378790 383192 389314 395461
57807 395461 399308 399980 397962 394213 389865 385755 381922 378233 375241 373409 371921 369598 366653 364221
57793 364221 362478 360723 358948 357755 356866 355354 353242 351381 349787 347563 344492 341373 338853 337139
57779 337139 336663 337678 339471 341243 343391 346571 350043 352625 354856 358396 363441 368451 372322 375123
57765 375123 376783 376857 375708 374323 372833 370683 368239 366699 366474 367121 368779 371943 375770 378334 378779
57750 378779 377797 375924 372929 369062 365339 362281 359578 357081 354871 352456 349399 346593 345366 345280 344436
$$ packed form
57852C61544J239J954L724M513L086J329J186J729J354M39k22j301l170m441m192
57837C68771l593l642l409k253j474j979k452j718p90p81q84j74N90P22J094K201
57821C50229K831K328K027K732L014J928J119K089L521L639L333M402O122O147
57807C95461L847O72k018l749m348m110l833l689k992j832j488k323k945k432
57793C64221j743j755j775j193q89j512k112j861j594k224l071l119k520j714
57779C37139m76J015J793J772K148L180L472K582K231L540N045N010L871K801
57765C75123J660P4j149j385j490k150k444j540k25O47J658L164L827K564M45
57750C78779r82j873k995l867l723l058k703k497k210k415l057k806j227q6q44
$$ plain form
57735 344436 342052 339172 336719 334477 332249 330371 328677 326380 323464 320958 319462 318509 317587 316678 315638
57720 315638 314160 312465 310979 309343 306832 303628 300510 297534 294226 290913 288526 287313 286969 287535 288699
57705 288699 288811 286523 283099 281099 280953 280858 280036 279763 280836 282187 282735 282798 282989 283279 283740 284659 285386 284524
57687 284524 281811 278476 275468 272747 270515 269499 269612 270010 270858 273410 277964 283558 290174 299430 312370
57672 312370 328478 347857 372774 405886 448291 500433 563482 637904 720351 802012 869756
57661 869756 910084 915016 886282 833714 769074 701303 636051 576653 524282 478580 439249 406408
57649 406408 379435 356999 338633 324782 314848 306769 299130 292251 286573 281508 276701 272968 271003
57636 271003 270252 269806 269355 268688 267416 265797 264661 264123 263533 262981 263367 264553 265033 264074 262645 261555 260300
$$ packed form
57735C44436k384k880k453k242k228j878j694k297k916k506j496r53r22r09j040
57720C15638j478j695j486j636k511l204l118k976l308l313k387j213l44N66J164
57705B88699J12k288l424k000j46r5q22k73J073J351N48O3J91K90M61R19P27q62
57687B84524k713l335l008k721k232j016J13L98Q48K552M554N594O616R256J2940
57672C12370J6108J9379K4917L3112M2405N2142O3049P4422Q2447Q1661O7744
57661H69756M0328M932k8734n2568o4640o7771o5252n9398n2371m5702l9331l2841
57649D06408k6973k2436j8366j3851r934q079p639o879n678n065m807l733j965
57636B71003p51m46m51o67j272j619j136n38n90n52L86J186M80r59j429j090j255
$$ plain form
57619 260300 258502 256865 255744 254284 251996 249800 248528 247700 246767 246233 246479 246763 246433 245953 245769 245416
57603 245416 244697 244461 245101 245571 245029 244237 244166 244360 243973 243298 242982 242668 241716 240410 239250 237925 236073 234200
57585 234200 232662 230670 227546 224135 221720 220260 218922 217659 216944 216474 215442 213821 212346 211438 210930
57570 210930 210548 210008 209055 207880 206916 205853 203776 200812 198567 198095 198448 198129 197037 195962 195082 194117
57554 194117 193327 193244 193928 195261 197432 200349 203339 206091 209118 212520 215242 216474 216923 217694 218742 219418
57538 219418 219773 220337 221325 222978 225813 229594 232884 234662 235537 236365 236651 235672 234316 234331 236194 239019
57522 239019 242081 245192 247997 250180 252128 254319 256377 257697 258595 259775 261042 261643 261590 261582 261831 261893 261497
57505 261497 260719 259523 257889 256154 254593 253028 251418 250255 249671 248770 246705 243839 240989 238152 234924
$$ packed form
57619B60300j798j637j121j460k288k196j272q28r33n34K46K84l30m80j84l53
57603B45416p19k36O40M70n42p92p1J94l87o75l16l14r52j306j160j325j852j873
57585B34200j538j992l124l411k415j460j338j263p15m70j032j621j475r08n08
57570B10930l82n40r53j175r64j063k077k964k245m72L53l19j092j075q80r65
57554A94117p90q3O84J333K171K917K990K752L027L402K722J232M49P71J048O76
57538B19418L55N64R88J653K835L781L290J778Q75Q28K86r79j356J5J863K825
57522B39019L062L111K805K183J948K191K058J320Q98J180J267O01n3qK49O2l96
57505B61497p78j196j634j735j561j565j610j163n84r01k065k866k850k837l228
$$ plain form
57490 234924 231665 229146 227393 225800 224056 222157 219910 217341 215206 214244 214220 214440 214743 215194 215401 215066
57474 215066 214768 215179 215882 215968 215480 215266 215604 215946 215952 215876 215912 215826 215393 214761 214393 214795 216042 217435 218127 218204
57454 218204 218509 219305 219975 220204 220343 220278 219285 217664 217124 218537 220514 221328 221124 221005 220963 220193 218748 217458
57436 217458 216691 216361 216643 217563 218376 218446 218196 218231 218198 217624 217159 217777 219281 220804 222297 224339 226942 229606
57418 229606 232090 234166 235259 235332 235434 236236 236799 236073 234826 234635 235603 236569 237091 237682 238481 239171 239925 241072
57400 241072 242077 242201 241903 242296 243510 244813 245983 247203 248006 247781 247122 247250 248240 249100 249420 249659 250049
57383 250049 250580 251872 254675 258528 262126 264873 267003 268493 269205 269782 270975 272283 272585 271923 271290 270921
57367 270921 270248 269356 268906 268673 267721 266089 264859 264492 264449 264523 265066 265895 266406 266921 268458 271007 273480 275563
$$ packed form
57490B34924l259k519j753j593j744j899k247k569k135r62k4K20L03M51K07l35
57474B15066k98M11P03Q6m88k14L38L42Op6L6q6m33o32l68M02J247J393O92P7
57454B18204L05P96O70K29J39o5r93j621n40J413J977Q14k04j19m2p70j445j290
57436B17458p67l30K82R20Q13P0k50L5l3n74m65O18J504J523J493K042K603K664
57418B29606K484K076J093P3J02Q02N63p26j247j91R68R66N22N91P99O90P54J147
57400B41072J005J24k98L93J214J303J170J220Q03k25o59J28R90Q60L20K39L90
57383B50049N31J292K803L853L598K747K130J490P12N77J193J308L02o62o33l69
57367B70921o73q92m50k33r52j632j230l67m3P4N43Q29N11N15J537K549K473K083
$$ plain form
57349 275563 278158 281656 285137 287687 289305 290207 290415 290394 290919 291942 292605 292622 292692 293393 294630 296253 298154
57332 298154 299756 300469 300733 301524 302861 303939 304630 305545 306664 307307 307560 308293 309595 310543 310773 310969 311613
57315 311613 312547 313996 316586 320004 322971 324934 326544 328081 328803 328357 327644 327678 328585 330108 332071 334011
57299 334011 335397 336588 338561 341476 344505 347231 350036 352983 355617 358125 361365 365357 369063 372090
57285 372090 375382 379738 384861 390274 395987 401779 407034 411827 417069 423090 429176 434894 440687 446655
57271 446655 452026 456495 461035 466646 473194 479995 486652 492851 498249 503059 507940 512939 517405 521176
57257 521176 524833 528562 531867 534717 537897 541838 546169 550708 555741 561050 565849 570072 574556 579576
57243 579576 584421 588761 593171 597941 602628 607238 612580 618923 625625 632488 640175 648771 657341 665510
$$ packed form
57349B75563K595L498L481K550J618R02K08k1N25J023O63J7P0P01J237J623J901
57332B98154J602P13K64P91J337J078O91R15J119O43K53P33J302R48K30J96O44
57315C11613R34J449K590L418K967J963J610J537P22m46p13L4R07J523J963J940
57299C34011J386J191J973K915L029K726K805K947K634K508L240L992L706L027
57285C72090L292M356N123N413N713N792N255M793N242O021O086N718N793N968
57271D46655N371M469M540N611O548O801O657O199N398M810M881M999M466L771
57257E21176L657L729L305K850L180L941M331M539N033N309M799M223M484N020
57243E79576M845M340M410M770M687M610N342O343O702O863P687Q596Q570Q169
$$ plain form
57229 665510 674155 683873 694102 704413 715322 727097 739079 750908 763161 776084 789004 801738
57217 801738 815248 830069 845432 860788 876775 893703 910427 925908 940762 956146 972192
57206 972192 988588 1005632 1023561 1041733 1059625 1077836 1097152 1117428 1138259 1159909 1182666
57195 1182666 1206090 1229742 1253834 1278416 1302780 1326382 1349423 1371897 1393166 1413195 1433092
57184 1433092 1453606 1474243 1494677 1515725 1537960 1560638 1583179 1606573 1632066 1659429 1687751
57173 1687751 1716987 1747512 1778996 1810961 1843713 1877640 1912281 1947050 1982102 2017528 2052527
57162 2052527 2086404 2119621 2152938 2186338 2219644 2253287 2287571 2322152 2357182 2393908 2433136
57151 2433136 2474152 2516157 2559708 2605589 2653404 2702456 2752984 2805264 2858560 2912236 2966886
$$ packed form
57229F65510Q645R718J0229J0311J0909J1775J1982J1829J2253J2923J2920J2734
57217H01738J3510J4821J5363J5356J5987J6928J6724J5481J4854J5384J6046
57206I72192J6396J7044J7929J8172J7892J8211J9316K0276K0831K1650K2757
57195A182666K3424K3652K4092K4582K4364K3602K3041K2474K1269K0029J9897
57184A433092K0514K0637K0434K1048K2235K2678K2541K3394K5493K7363K8322
57173A687751K9236L0525L1484L1965L2752L3927L4641L4769L5052L5426L4999
57162B052527L3877L3217L3317L3400L3306L3643L4284L4581L5030L6726L9228
57151B433136M1016M2005M3551M5881M7815M9052N0528N2280N3296N3676N4650
$$ plain form
57140 2966886 3023073 3079995 3136838 3194445 3254164 3315890 3378679 3442384 3507173 3572298 3636975
57129 3636975 3701924 3768668 3838005 3910604 3988274 4073013 4165324 4264840 4371967 4487506 4611376
57118 4611376 4743272 4884103 5035328 5197492 5370907 5557316 5759487 5979671 6219913
57109 6219913 6483634 6775826 7102329 7470115 7887704 8364318 8909691 9536473 10262833
57100 10262833 11112747 12116008 13310184 14741858 16464504 18535840 21017296 23972040
57092 23972040 27458339 31522402 36195164 41489370 47392779 53862368 60825093 68179567
57084 68179567 75791117 83486355 91057853 98273134 104873674 110570157 115060735 118082405
57076 118082405 119468180 119173925 117267354 113898558 109270180 103611625 97158026 90137472
$$ packed form
57140B966886N6187N6922N6843N7607N9719O1726O2789O3705O4789O5125O4677
57129C636975O4949O6744O9337P2599P7670Q4739R2311R9516J07127J15539J23870
57118D611376J31896J40831J51225J62164J73415J86409K02171K20184K40242
57109F219913K63721K92192L26503L67786M17589M76614N45373O26782P26360
57100A0262833Q49914J003261J194176J431674J722646K071336K481456K954744
57092B3972040L486299M064063M672762N294206N903409O469589O962725P354474
57084F8179567P611550P695238P571498P215281O600540N696483M490578L021670
57076A18082405J385775k94255j906571l368796m628378n658555o453599p020554
$$ plain form
57068 90137472 82767339 75254452 67792861 60557040 53692368 47307046 41469641 36212988
57060 36212988 31540992 27434951 23859330 20768011 18110070 15833631 13888156 12226294
57052 12226294 10805344 9587868 8541706 7639657 6858849 6180183 5588157 5070368 4616308
57043 4616308 4216596 3863588 3551763 3276358 3031942 2813198 2616604 2440206 2282137
57034 2282137 2140497 2014211 1902669 1804755 1719402 1646681 1587171 1541018 1509154 1494620 1501081
57023 1501081 1531440 1590206 1684143 1813073 1956792 2075798 2131285 2106942 2012874 1872704
57013 1872704 1709798 1542011 1381688 1235947 1107320 995632 899736 818058 748732 689790
57003 689790 639178 594983 556190 522897 495120 471684 450826 431597 413989 397914 382789
$$ packed form
57068I0137472p370133p512887p461591p235821o864672o385322n837405n256653
57060C6212988m671996m106041l575621l091319k657941k276439j945475j661862
57052A2226294j420950j217476j046162r02049p80808o78666n92026n17789m54060
57043D616308l99712l53008l11825k75405k44416k18744j96594j76398j58069
57034B282137j41640j26286j11542r7914q5353p2721n9510m6153l1864j4534O461
57023A501081L0359N8766R3937J28930J43719J19006N5487k4343r4068j40170
57013A872704j62906j67787j60323j45741j28627j11688r5896q1678o9326n8942
57003F89790n0612m4195l8793l3293k7777k3436k0858j9229j7608j6075j5125
$$ plain form
56992 382789 368124 354094 341468 331194 324011 320274 320261 324600 334004 348356 366029 383914 397881
56979 397881 403809 399349 385188 364351 340191 315217 291185 269147 249211 231077 215085 202170
56967 202170 192818 186807 184029 184689 188622 195293 204823 218296 236800 260737 289912 323133 357136
56954 357136 386566 405810 411077 401432 378991 348315 314629 281861 252185 226731 205813 188783
56942 188783 174903 164483 158321 156191 157084 160959 169002 182016 199931 223281 253790 292552 338056
56929 338056 385927 429534 460970 473570 465282 439627 403113 362023 321073 283152 249136 218592
56917 218592 191320 167773 147981 131164 116847 105320 96529 89505 83442 78398 74449 71118 68173
56904 68173 66032 64812 63921 63215 63573 65652 68921 72553 76479 80943 85863 91323 97948 106216 116243
$$ packed form
56992C82789j4665j4030j2626j0274p183l737j3M339R404J4352J7673J7885J3967
56979C97881N928m460j4161k0837k4160k4974k4032k2038j9936j8134j5992j2915
56967B02170r352o011k778O60L933O671R530J3473J8504K3937K9175L3221L4003
56954C57136K9430J9244N267r645k2441l0676l3686l2768k9676k5454k0918j7030
56942A88783j3880j0420o162k130Q93L875Q043J3014J7915K3350L0509L8762M5504
56929C38056M7871M3607L1436J2600q288k5655l6514m1090m0950l7921l4016l0544
56917B18592k7272k3547j9792j6817j4317j1527q791p024o063n044l949l331k945
56904F8173k141j220q91p06L58K079L269L632L926M464M920N460O625Q268J0027
$$ plain form
56889 116243 128808 145643 167880 194809 224557 254918 282806 304065 315225 315340 305750 288852
56877 288852 267832 246516 228021 213424 202205 193686 187681 184406 184437 188457 196716 209297 227107
56864 227107 251764 284155 324088 371899 429169 496439 570159 642062 701268 737587 745229 725443
56852 725443 685628 635082 581300 529468 483255 444592 413507 389515 372882 364001 362518 368128
56840 368128 381701 404719 438291 483667 543146 619313 713315 823730 945178 1066059 1168484
56829 1168484 1233620 1249972 1218185 1149174 1058099 958614 860148 768378 686938 617819 560666
56818 560666 513465 475058 446406 428791 421874 424533 436796 459727 494069 540352 599905 673744
56806 673744 759255 847884 926097 979214 996620 976132 924557 853515 773887 693223 616455
$$ packed form
56889A16243J2565J6835K2237K6929K9748L0361K7888K1259J1160J15r590j6898
56877B88852k1020k1316j8495j4597j1219q519o005l275L1M020Q259J2581J7810
56864B27107K4657L2391L9933M7811N7270O7270P3720P1903N9206L6319P642j9786
56852G25443l9815n0546n3782n1832m6213l8663l1085k3992j6633q881j483N610
56840C68128J3573K3018L3572M5376N9479P6167R4002J10415J21448J20881J02425
56829A168484O5136J6352l1787o9011r1075r9485r8466r1770q1440o9119n7153
56818E60666m7201l8407k8652j7615o917K659J2263K2931L4342M6283N9553P3839
56806F73744Q5511Q8629P8213N3117J7406k0488n1575p1042p9628q0664p6768
$$ plain form
56795 616455 547031 486957 436672 395506 362255 335699 315269 301244 294044 293514 299279 311581
56783 311581 331318 359366 395893 439562 486368 529327 560216 572615 564205 537180 496914 449653
56771 449653 400482 352831 309105 270867 238321 210463 186298 165532 147997 133135 120393
56760 120393 109554 100334 92276 85291 79666 75234 71223 67196 63493 60456 57941 55749 53732 51310
56746 51310 47930 44294 41959 41300 41019 40208 39596 39941 40549 40445 39954 39910 40159 40042 39685 39694 40091 40538 41061
56727 41061 41689 41990 41876 42226 43764 45901 47652 49065 50828 53036 55340 57783 60485 63034 65147
56712 65147 67430 70508 73827 76320 77868 79229 80906 82976 85613 88842 92016 94290 95417 95590 94995
56697 94995 94033 93292 92681 91335 89105 87335 87328 88738 90265 91116 90977 89554 87206 85228 84402 83989 83113
$$ packed form
56795F16455o9424o0074n0285m1166l3251k6556k0430j4025p200n30N765J2302
56783C11581J9737K8048L6527M3669M6806M2959L0889J2399q410k7025m0266m7261
56771D49653m9171m7651m3726l8238l2546k7858k4165k0766j7535j4862j2742
56760A20393j0839r220q058o985n625m432m011m027l703l037k515k192k017k422
56746E1310l380l636k335o59k81q11o12L45O08j04m91m4K49j17l57RL97M47N23
56727D1061O28L01j14L50J538K137J751J413J763K208K304K443K702K549K113
56712F5147K283L078L319K493J548J361J677K070K637L229L174K274J127J73n95
56697I4995r62p41o11j346k230j770pJ410J527Q51j39j423k348j978q26m13q76
$$ plain form
56680 83113 82183 81823 81437 80255 78914 78484 78635 78344 77806 78040 79057 80008 80805 82096 83860 85425 86728
56663 86728 88302 90292 92631 95711 99696 103705 107051 110633 115546 120921 124970 127708 130700 134314
56649 134314 137286 139113 140872 143171 145031 145324 143995 141474 138222 135241 133674 133424 133310 132851 132721
56634 132721 133173 133370 132752 131883 131406 131114 130522 129488 127935 125797 123489 121618 120051 118105 115701 113438
56618 113438 111481 109454 107497 106259 105619 104515 102479 100393 99304 99219 99446 99456 99111 98602 98312 98360 98405
56601 98405 98348 98821 100220 101659 101851 100697 99113 97678 96594 96551 98274 101276 104244 106571 108438 109661
56585 109661 109838 109459 109497 109963 110182 110341 111270 112756 113680 113999 114934 116912 118899 120230 121616 123753 126267
56568 126267 128653 131064 133610 135943 138128 140960 145057 150546 157849 167649 179799 193358 207894
$$ packed form
56680H3113r30l60l86j182j341m30J51k91n38K34J017R51P97J291J764J565J303
56663H6728J574J990K339L080L985M009L346L582M913N375M049K738K992L614
56649A34314K972J827J759K299J860K93j329k521l252k981j567k50j14m59j30
56634A32721M52J97o18q69m77k92n92j034j553k138k308j871j567j946k404k263
56618A13438j957k027j957j238o40j104k036k086j089q5K27J0l45n09k90M8M5
56601I8405n7M73J399J439J92j154j584j435j084m3J723L002K968K327J867J223
56585A09661J77l79L8M66K19J59R29J486R24L19R35J978J987J331J386K137K514
56568A26267K386K411K546K333K185K832M097N489P303R800J2150J3559J4536
$$ plain form
56555 207894 223392 238524 250484 257410 260050 260561 260689 261515 263660 266747 269430 270648 270410 269223
56541 269223 267552 265962 264737 263108 259902 255208 250299 245666 240432 234110 227596 221852 216764 212002
56527 212002 207794 204086 200023 195165 190349 186520 183406 180114 176392 172639 169196 166257 163989 162259
56513 162259 160642 158976 157410 155764 153538 150772 148221 146461 145480 145235 145793 146822 147748 148527 149407 149885
56497 149885 148930 146511 143987 142652 142669 143510 144555 145119 144843 144235 144036 144083 143696 143035 142891 143182 142980 142147
56479 142147 141668 142196 143441 145101 147098 148784 149322 149097 149375 150358 151016 151033 151320 152206 152835 152938 153563 155252
56461 155252 156967 157691 157793 157975 158046 157608 156912 156314 155826 155731 156570 158049 159086 159336 159498 159786 159580 159066
56443 159066 159616 161740 164105 165409 165965 166621 167422 168178 169143 170307 171144 171744 172995 175009 176667 177398
$$ packed form
56555B07894J5498J5132J1960O926K640N11J28Q26K145L087K683J218k38j187
56541B69223j671j590j225j629l206m694m909m633n234o322o514n744n088m762
56527B12002m208l708m063m858m816l829l114l292l722l753l443k939k268j730
56513A62259j617j666j566j646k226k766k551j760r81k45N58J029R26P79Q80M78
56497A49885r55k419k524j335J7Q41J045N64k76o08j99M7l87o61j44K91k02q33
56479A42147m79N28J245J660J997J686N38k25K78R83O58J7K87Q86O29J03O25J689
56461A55252J715P24J02J82P1m38o96n98m88r5Q39J479J037K50J62K88k06n14
56443A59066N50K124K365J304N56O56Q01P56R65J164Q37O00J251K014J658P31
$$ plain form
56427 177398 177996 178948 179388 178657 177533 176962 176784 176593 176594 176794 176630 176247 176726 178198 179122 178430 177011 176161
56409 176161 175991 176322 177589 179606 180890 180517 179435 178831 178527 178061 177854 177992 177386 175668 174600 175951
56393 175951 179178 182687 186245 190483 195041 198950 202116 204939 207134 208205 208304 207412 204594 199354 192866
56378 192866 186641 180972 175891 172500 171850 173418 176069 179588 183968 188317 192021 195900 200598 204817
56364 204817 206922 207458 208305 210031 211813 213344 215008 216636 217754 218782 220470 222461 223724 224040 223860
56349 223860 223206 222031 221092 221121 221583 221525 221164 221376 222160 222906 223714 225101 226824 228166 229002 229594 229874 229945
56331 229945 230642 232520 234962 237255 239713 242715 245645 248069 250911 255047 259610 263172 265813 268534
56317 268534 271402 273802 275843 277970 279815 280858 281681 283151 284948 286237 287145 288290 289590 290845 292680
$$ packed form
56427A77398N98R52M40p31j124n71j78j91JK00j64l83M79J472R24o92j419q50
56409A76161j70L31J267K017J284l73j082o04l04m66k07J38o06j718j068J351
56393A75951L227L509L558M238M558L909L166K823K195J071R9q92k818n240o488
56378A92866o225n669n081l391o50J568K651L519M380M349L704L879M698M219
56364B04817K105N36Q47J726J782J531J664J628J118J028J688J991J263L16j80
56349B23860o54j175r39K9M62n8l61K12P84P46Q08J387J723J342Q36N92K80P1
56331B29945O97J878K442K293K458L002K930K424K842M136M563L562K641K721
56317B68534K868K400K041K127J845J043Q23J470J797J289R08J145J300J255J835
$$ plain form
56302 292680 295559 298767 301823 305920 312323 320109 327169 332749 337377 341089 343517 345250 347396 350166
56288 350166 353170 356463 360019 363057 365375 368405 373383 379456 385261 391287 398754 407183 415183 422902
56274 422902 431620 441578 452188 463676 476429 489391 501331 513153 526826 542474 558667 575112
56262 575112 592878 612373 633400 656982 684902 717478 753821 794138 839759 891074 947585
56251 947585 1010015 1080365 1159789 1248212 1346010 1454226 1573107 1701988 1840359 1987303
56241 1987303 2140127 2295299 2450373 2603247 2750013 2885609 3006291 3109558 3192047 3249752
56231 3249752 3280382 3283760 3260300 3211182 3139690 3050162 2945612 2828148 2701262 2569385 2435365
56220 2435365 2300528 2167041 2037914 1914654 1797078 1685468 1580872 1483344 1392141 1307673
$$ packed form
56302B92680K879L208L056M097O403P786P060N580M628L712K428J733K146K770
56288C50166L004L293L556L038K318L030M978O073N805O026P467Q429Q000P719
56274D22902Q718R958J0610J1488J2753J2962J1940J1822J3673J5648J6193J6445
56262E75112J7766J9495K1027K3582K7920L2576L6343M0317M5621N1315N6511
56251I47585O2430P0350P9424Q8423R7798J08216J18881J28881J38371J46944
56241A987303J52824J55172J55074J52874J46766J35596J20682J03267Q2489N7705
56231C249752L0630L378k3460m9118p1492q9528j04550j17464j26886j31877j34020
56220B435365j34837j33487j29127j23260j17576j11610j04596r7528r1203q4468
$$ plain form
56210 1307673 1231189 1162452 1099748 1042222 990188 943219 899989 860059 823878 791075 760682
56199 760682 732871 708558 687531 668879 652776 639771 628844 618435 608818 601037 594149 586290
56187 586290 578005 571568 567271 563316 559183 555994 553528 550113 545806 542620 541127 539776 538018 537166
56173 537166 537559 537819 537615 538311 540119 541323 541229 541311 542632 544531 546628 549762 554270 559540 565719 573594
56157 573594 582480 590712 598449 607428 617806 628033 638083 649748 663421 677742 692965 711442
56145 711442 734035 759214 786654 818637 857043 902024 954612 1017395 1091357 1174962 1267423
56134 1267423 1369623 1480168 1593085 1700868 1797719 1879632 1944998 1996909 2042174 2086251
56124 2086251 2130631 2174846 2217344 2253451 2276391 2282784 2275265 2259007 2238312 2216786 2196429 2174304
$$ packed form
56210A307673p6484o8737o2704n7526n2034m6969m3230l9930l6181l2803l0393
56199G60682k7811k4313k1027j8652j6103j3005j0927j0409r617p781o888p859
56187E86290q285o437m297l955m133l189k466l415m307l186j493j351j758q52
56173E37166L93K60k04O96J808J204r4Q2J321J899K097L134M508N270O179P875
56157E73594Q886Q232P737Q979J0378J0227J0050J1665J3673J4321J5223J8477
56145G11442K2593K5179K7440L1983L8406M4981N2588O2783P3962Q3605R2461
56134A267423J02200J10545J12917J07783R6851Q1913O5366N1911M5265M4077
56124B086251M4380M4215M2498L6107K2940O393p519j6258k0695k1526k0357k2125
$$ plain form
56112 2174304 2143047 2096694 2034102 1956351 1864617 1762315 1655960 1551744 1453360 1363862 1286200
56101 1286200 1220496 1164099 1115902 1077556 1049135 1027173 1008677 993709 982329 972597 963596 957124
56089 957124 954310 953630 954028 956714 962018 967787 972802 978473 985312 991267 995561 1000587 1007878 1015665 1022625
56074 1022625 1030425 1040255 1050342 1059297 1068490 1078857 1088964 1098612 1110640 1126548 1143877 1160444
56062 1160444 1177556 1196488 1215612 1233836 1253115 1274539 1295513 1313745 1330533 1347287 1362497
56051 1362497 1375164 1387547 1401427 1415226 1427857 1441678 1458548 1476635 1494279 1513263 1535075
56040 1535075 1557767 1579787 1603120 1629388 1656725 1683792 1712903 1745831 1780471 1814953 1850942
56029 1850942 1889681 1929187 1968761 2011627 2059538 2109447 2159065 2210663 2265634 2320689 2373755
$$ packed form
56112B174304l1257m6353o2592p7751r1734j02302j06355j04216r8384q9498p7662
56101A286200o5704n6397m8197l8346k8421k1962j8496j4968j1380r732r001o472
56089I57124k814o80L98K686N304N769N015N671O839N955M294N026P291P787O960
56074A022625P800R830J0087Q955R193J0367J0107R648J2028J5908J7329J6567
56062A160444J7112J8932J9124J8224J9279K1424K0974J8232J6788J6754J5210
56051A362497J2667J2383J3880J3799J2631J3821J6870J8087J7644J8984K1812
56040A535075K2692K2020K3333K6268K7337K7067K9111L2928L4640L4482L5989
56029A850942L8739L9506L9574M2866M7911M9909M9618N1598N4971N5055N3066
$$ plain form
56018 2373755 2428264 2487058 2547432 2606994 2668950 2736406 2806802 2877271 2950268 3028552 3109972
56007 3109972 3192665 3279898 3374172 3472119 3571003 3674458 3785931 3902606 4022142 4149076
55997 4149076 4287829 4435637 4589403 4753080 4930947 5120063 5316989 5525473 5749794
55988 5749794 5987376 6236059 6501634 6789865 7098405 7425210 7777072 8160749 8573919
55979 8573919 9014629 9491071 10011845 10575830 11182774 11844404 12573440 13372003 14243743
55970 14243743 15207064 16283168 17482802 18819858 20326700 22041205 23992870 26220541
55962 26220541 28792446 31793522 35312072 39463245 44413369 50364451 57540826 66225412
55954 66225412 76801483 89749284 105641793 125177757 149183681 178541584 214086026
$$ packed form
56018B373755N4509N8794O0374N9562O1956O7456P0396P0469P2997P8284Q1420
56007C109972Q2693Q7233R4274R7947R8884J03455J11473J16675J19536J26934
55997D149076J38753J47808J53766J63677J77867J89116J96926K08484K24321
55988E749794K37582K48683K65575K88231L08540L26805L51862L83677M13170
55979H573919M40710M76442N20774N63985O06944O61630P29036P98563Q71740
55970A4243743R63321J076104J199634J337056J506842J714505J951665K227671
55962B6220541K571905L001076L518550M151173M950124N951082P176375Q684586
55954F6225412J0576071J2947801J5892509J9535964K4005924K9357903L5544442
$$ plain form
55947 214086026 256325234 304591354 355680385 403136097 438604552 455139440 450316824
55940 450316824 426899419 390870951 348657121 305325989 264133702 226794875 193930603
55933 193930603 165515800 141234831 120663604 103329374 88762575 76549336 66331046
55926 66331046 57775534 50583978 44517898 39390646 35037508 31314752 28116191 25363379
55918 25363379 22981348 20900545 19074053 17471924 16061638 14809487 13694968 12706531
55910 12706531 11826221 11032557 10314330 9667669 9082839 8546555 8053786 7605058 7194915
55901 7194915 6814098 6460129 6135120 5835865 5555956 5294788 5054917 4833156 4623265
55892 4623265 4424785 4240635 4068744 3904416 3748259 3603547 3468368 3338394 3214989
$$ packed form
55947B14086026M2239208M8266120N1089031M7455712L5468455J6534888m822616
55940D50316824k3417405l6028468m2213830m3331132m1192287l7338827l2864272
55933A93930603k8414803k4280969k0571227j7334230j4566799j2213239j0218290
55926F6331046q555512p191556o066080n127252m353138l722756l198561k752812
55918B5363379k382031k080803j826492j602129j410286j252151j114519r88437
55910A2706531q80310p93664p18227o46661n84830n36284m92769m48728m10143
55901G194915l80817l53969l25009k99255k79909k61168k39871k21761k09891
55892D623265j98480j84150j71891j64328j56157j44712j35179j29974j23405
$$ plain form
55883 3214989 3102748 3001317 2907182 2821282 2747254 2683933 2626446 2572633 2521619 2468455 2407519
55872 2407519 2339783 2270286 2200226 2127804 2054619 1984309 1916497 1848766 1783155 1724107 1671273
55861 1671273 1620845 1572837 1530552 1493562 1457656 1421456 1387252 1355605 1324766 1295222 1269342
55850 1269342 1246415 1222941 1197734 1172182 1146013 1117561 1087866 1059822 1033600 1007285 981424
55839 981424 958366 937659 916770 895971 877816 862067 845862 828854 813613 800785 788265
55828 788265 775434 764065 754680 745911 737649 730993 724834 716298 704868 692570 680017 665974 650960
55815 650960 637507 626395 616170 606660 599485 594586 589745 584195 579634 577119 575896 575786 577840 582156
55801 582156 587740 594753 604233 615385 625821 634556 642133 647881 649959 648156 643860 637259 627505 615624
$$ packed form
55883C214989j12241j01431r4135q5900p4028o3321n7487n3813n1014n3164o0936
55872B407519o7736o9497p0060p2422p3185p0310o7812o7731o5611n9048n2834
55861A671273n0428m8008m2285l6990l5906l6200l4204l1647l0839k9544k5880
55850A269342k2927k3474k5207k5552k6169k8452k9695k8044k6222k6315k5861
55839I81424k3058k0707k0889k0799j8155j5749j6205j7008j5241j2828j2520
55828G88265j2831j1369r385q769q262o656o159q536j1430j2298j2553j4043j5014
55815F50960j3453j1112j0225r510p175m899m841n550m561k515j223j10K054M316
55801E82156N584P013R480J1152J0436Q735P577N748K078j803m296o601r754j1881
$$ plain form
55787 615624 604145 593613 582508 570998 561696 556093 552852 550043 546391 540067 529292 515013 500624
55774 500624 488479 478892 472570 471168 474998 482975 495310 513223 534865 554049 564432 563502 552357
55761 552357 534026 512684 492035 473114 454912 437305 421562 407951 395181 382639 371083
55750 371083 360816 351281 342712 335964 330421 324350 317653 311986 307824 303811 299452 295987 294053 292935
55736 292935 292646 294189 296990 298609 297950 296328 294475 291086 285607 279941 275755 272111 267398 261839 256548
55721 256548 251656 246837 242426 238788 235793 233810 233814 235603 237411 238313 239612 242918 248343 255503 264569
55706 264569 274963 284387 290578 293163 292819 289730 283930 276160 267335 257939 248638 240503 233854 227863
55692 227863 221962 216700 212660 209587 207192 205728 205192 205067 205383 206903 209810 213400 217507 222860 229422
$$ packed form
55787F15624j1479j0532j1105j1510r302n603l241k809l652o324j0775j4279j4389
55774E00624j2145r587o322j402L830P977J2335J7913K1642J9184J0383r30j1145
55761E52357j8331k1342k0649j8921j8202j7607j5743j3611j2770j2542j1556
55750C71083j0267r535q569o748n543o071o697n667m162m013m359l465j934j118
55736B92935k89J543K801J619o59j622j853l389n479n666m186l644m713n559n291
55721B56548m892m819m411l638k995j983MJ789J808R02J299L306N425P160R066
55706B64569J0394R424O191K585l44l089n800p770q825r396r301q135o649n991
55692B27863n901n262m040l073k395j464n36j25L16J520K907L590M107N353O562
$$ plain form
55677 229422 235834 241161 245779 249764 251932 251525 249604 247714 246196 244727 243430 242505 241710 241096 241307
55662 241307 242428 243492 243862 244088 244730 245518 246485 248664 252625 257286 261228 264303 267017 269215 270441
55647 270441 270834 270662 269557 267080 263491 259164 253844 247257 239935 232792 226241 220193 214369 208248 201376
55632 201376 194103 187345 181401 175795 170519 166441 164077 162921 162345 162203 162127 161316 159496 157258 155089
55617 155089 153020 151367 150569 150075 148774 146862 145783 145842 145535 143933 142079 141138 140774 140420 140518 141258 141545
55600 141545 140609 139381 138879 138422 136893 134641 132658 130914 129049 127764 127839 128542 128621 128193 128116 128162 127517 126593
55582 126593 126593 127563 128460 128997 129866 131182 132191 132652 133298 134783 137200 140566 144739 148929 152454 155978
55566 155978 160930 167594 174665 180691 185028 187545 188458 188566 188592 188069 185714 181132 175411 169913 165157
$$ packed form
55677B29422O412N327M618L985K168m07j921j890j518j469j297r25p95o14K11
55662B41307J121J064L70K26O42P88R67K179L961M661L942L075K714K198J226
55647B70441L93j72j105k477l589m327n320o587p322p143o551o048n824o121o872
55632B01376p273o758n944n606n276m078k364j156n76j42p6q11j820k238k169
55617A55089k069j653p98m94j301j912j079N9l07j602j854r41l64l54R8P40K87
55600A41545r36j228n02m57j529k252j983j744j865j285P5P03P9m28p7M6o45r24
55582A26593%R70Q97N37Q69J316J009M61O46J485K417L366M173M190L525L524
55566A55978M952O664P071O026M337K517R13J08K6n23k355m582n721n498m756
$$ plain form
55551 165157 161051 157449 154204 151191 148471 146145 144120 142384 141304 141128 141462 141853 142641 144470 147094
55536 147094 149446 150910 151825 152641 153297 153565 153451 153004 152155 150905 149447 148016 146765 145663 144334 142294
55520 142294 139653 137289 135967 135608 135769 136382 137461 138468 138732 138223 137208 135252 131353 125249 118020
55505 118020 111208 105635 101123 97051 93109 89685 87489 86758 87037 87786 88823 90013 91044 91841 92825
55490 92825 94371 96331 98323 100032 100957 100485 98702 96639 95201 94317 93561 93006 92850 92769 92417 92168 92677
55473 92677 93997 95692 97392 98685 98969 98211 97410 97513 98224 98627 98582 98621 98806 98653 98050 97393 96904 96579
55455 96579 96630 97153 97484 96796 95311 94150 93927 94229 94447 94450 94440 94782 95850 97375 98150 97223 95258 93785
55437 93785 93213 92581 91338 90260 90240 91096 91988 92337 91934 90887 89915 90097 91775 94078 95914 97065 98023
$$ packed form
55551A65157m106l602l245l013k720k326k025j736j080j76L34L91P88J829K624
55536A47094K352J464R15Q16O56K68j14m47q49j250j458j431j251j102j329k040
55520A42294k641k364j322l59J61O13J079J007K64n09j015j956l899o104p229
55505A18020o812n573m512m072l942l424k196p31K79P49J037J190J031P97R84
55490I2825J546J960J992J709R25m72j783k063j438q84p56n55j56q1l52k49N09
55473I2677J320J695J700J293K84p58q01J03P11M03m5L9J85j53o03o57m89l25
55455I6579N1N23L31o88j485j161k23L02K18Lj0L42J068J525P75r27j965j473
55437I3785n72o32j243j078k0Q56Q92L49m03j047r72J82J678K303J836J151R58
$$ plain form
55420 98023 99167 100471 101750 102854 103822 105005 106821 109300 112107 115035 118105 121103 123487 124915 125562
55405 125562 125678 125140 123634 121143 118060 114948 112206 109843 107583 105276 103039 100921 98698 96370 94586
55390 94586 94083 94810 96003 97043 97861 98613 99378 100144 100682 100606 99934 99423 99826 100902 101742 101966 102010 102263 102578
55371 102578 102769 102933 103051 102783 101957 100882 99939 99169 98431 97700 97039 96473 95956 95304 94266 92927 91928 91890
55353 91890 92669 93514 93802 93277 91863 89956 88758 89417 91566 93400 93598 92605 91715 91413 91227 90858 90733
55336 90733 91249 91941 91783 90409 88771 88277 89239 90587 91243 91307 91439 91601 91173 90133 89282 89155 89364 89306
55318 89306 88995 88897 89315 90243 91539 93039 94538 95736 96153 95390 93758 92443 92525 93908 95608 96945 97855
55301 97855 98217 97688 96408 95122 94226 93230 91578 89583 88131 87684 87969 88481 88981 89546 90332 91296 92140
$$ packed form
55420I8023J144J304J279J104R68J183J816K479K807K928L070K998K384J428O47
55405A25562J16n38j506k491l083l112k742k363k260k307k237k118k223k328j784
55390I4586n03P27J193J040Q18P52P65P66N38p6o72n11M03J076Q40K24M4K53L15
55371A02578J91J64J18k68q26j075r43p70p38p31o61n66n17o52j038j339r99l8
55353I1890P79Q45K88n25j414j907j198O59K149J834J98r93q90l02j86l69j25
55336I0733N16O92j58j374j638m94R62J348O56O4J32J62m28j040q51j27K09n8
55318H9306l11r8M18R28J296J500J499J198M17p63j632j315Q2J383J700J337R10
55301I7855L62n29j280j286q96r96j652j995j452m47K85N12N00N65P86R64Q44
$$ plain form
55284 92140 92561 92510 92113 91502 90891 90605 90759 91086 91399 91954 92974 94099 94832 95362 96272 97529 98404 98451 98011
55265 98011 97665 97694 98105 98698 99050 98952 98831 99206 99808 99946 99661 99676 100113 100184 99478 98678 98532 98874 99243 99773
55245 99773 100741 101715 101943 101411 100919 101135 101989 102895 103292 103051 102512 102039 101479 100360 98656 96981 95914 95536
55227 95536 95673 96142 96567 96534 96148 95972 96160 96159 95567 94736 94242 94235 94616 95296 95904 95905 95473 95635 96919 98414 98865
55206 98865 98250 97571 97419 97581 97840 98338 99133 100001 100734 101153 100909 99826 98406 97492 97386 97734 98208 98857
55188 98857 99751 100758 101694 102380 102535 101986 100977 99921 98866 97613 96310 95459 95275 95413 95445 95258 94876
55171 94876 94295 93718 93686 94637 96379 98115 99045 99007 98647 98907 100199 102096 103869 105190 106136 106711 106746 106309
55153 106309 105891 106046 106920 108188 109326 109939 109903 109318 108342 107160 106139 105814 106533 108058 109608 110346 109894
$$ packed form
55284I2140M21n1l97o11o11k86J54L27L13N55J020J125P33N30R10J257Q75M7m40
55265I8011l46K9M11N93L52r8j21L75O02J38k85J5M37P1p06q00j46L42L69N30
55245I9773R68R74K28n32m92K16Q54R06L97k41n39m73n60j119j704j675j067l78
55227I5536J37M69M25l3l86j76J88jn92q31m94pL81O80O08Jm32J62J284J495M51
55206I8865o15o79j52J62K59M98P95Q68P33M19k44j083j420r14j06L48M74O49
55188I8857Q94J007R36O86J55n49j009j056j055j253j303q51j84J38L2j87l82
55171I4876n81n77l2R51J742J736R30l8l60K60J292J897J773J321R46N75L5m37
55153A06309m18J55Q74J268J138O13l6n85r76j182j021l25P19J525J550P38m52
$$ plain form
55136 109894 108516 106823 105254 103865 102648 101839 101703 102166 102932 103829 104728 105258 105156 104836 105014 105684 106111
55119 106111 106015 106079 106899 108114 109074 109796 110557 110993 110461 109088 107715 106804 106069 105287 104859 105316 106621 108188
55101 108188 109401 110054 110482 111242 112495 113769 114504 114728 114908 115306 115758 116015 115974 115611 114984 114309 113790 113424
55083 113424 113149 113108 113507 114293 115166 115875 116342 116650 117060 117830 118800 119411 119451 119500 120277 121674 122873 123305 123085
55064 123085 122562 121846 120906 119856 118988 118496 118117 117224 115607 114052 113517 113685 113180 111604 110392 110853 112252
55047 112252 112971 112940 113486 114978 116162 116101 115402 114937 114496 113462 112001 110769 110017 109657 109787 110502 111505
55030 111505 112468 113460 114559 115318 115270 114790 114883 116025 117581 118425 118006 116773 115615 114818 113770 111943 109951
55013 109951 109000 109283 109661 109247 108582 108707 109634 110494 110834 111076 111771 112986 114401 115559 116050 115821 115318 115014
$$ packed form
55136A09894j378j693j569j389j217q09j36M63P66Q97Q99N30j02l20J78O70M27
55119A06111r6O4Q20J215R60P22P61M36n32j373j373r11p35p82m28M57J305J567
55101A08188J213O53M28P60J253J274P35K24J80L98M52K57m1l63o27o75n19l66
55083A13424k75m1L99P86Q73P09M67L08M10P70R70O11M0M9P77J397J199M32k20
55064A23085n23p16r40j050q68m92l79q93j617j555n35J68n05j576j212M61J399
55047A12252P19l1N46J492J184o1o99m65m41j034j461j232p52l60J30P15J003
55030A11505R63R92J099P59m8m80R3J142J556Q44m19j233j158p97j048j827j992
55013A09951r51K83L78m14o65J25R27Q60L40K42O95J215J415J158M91k29n03l04
$$ plain form
54995 115014 114924 114845 114930 115604 116984 118735 120424 121680 122125 121645 120753 120320 120762 121712 122475 122611 122127 121427
54977 121427 121094 121491 122425 123351 123903 124133 124303 124597 124919 124887 124221 123331 123206 124312 125831 126476 125966 125128
54959 125128 124604 124154 123512 123280 124393 126921 129874 132134 133297 133672 133758 133766 133478 132545 130997 129391 128334
54942 128334 127963 128005 128206 128439 128456 127903 126730 125407 124541 124378 124844 125881 127449 129154 130323 130689 130864
54925 130864 131819 133970 137042 140748 145234 150731 157090 163959 171219 178961 186993 194584 200736 204696
54911 204696 206238 205593 203131 199144 193918 187893 181589 175346 169329 163806 159217 155814 153364 151295
54897 151295 149044 146249 142907 139498 136771 135186 134622 134722 135264 136062 136768 137081 137036 136918 137062 137921 140025
54880 140025 143462 147616 151822 156171 161276 167371 174128 181260 188633 195660 201239 204688 206358 206933
$$ packed form
54995A15014r0p9Q5O74J380J751J689J256M45m80q92m33M42R50P63J36m84p00
54977A21427l33L97R34R26N52K30J70K94L22l2o66q90j25J106J519O45n10q38
54959A25128n24m50o42k32J113K528K953K260J163L75Q6Qk88r33j548j606j057
54942A28334l71M2K01K33J7n53j173j323q66j63M66J037J568J705J169L66J75
54925A30864R55K151L072L706M486N497O359O869P260P742Q032P591O152L960
54911B04696J542o45k462l987n226o025o304o243o017n523m589l403k450k069
54897A51295k251k795l342l409k727j585n64J00N42P98P06L13m5j18J44Q59K104
54880A40025L437M154M206M349N105O095O757P132P373P027N579L449J670N75
$$ plain form
54866 206933 206426 204276 200281 194971 189071 182916 176425 169523 162531 156196 151191 147532 144604 141916
54852 141916 139571 137818 136381 134637 132370 129972 127875 126127 124671 123650 123143 122807 122156 121194 120477
54837 120477 120463 120961 121370 121355 121122 121101 121487 122163 122893 123450 123639 123349 122699 122023 121582 121294 120857 120197 119680 119743
54817 119743 120298 120695 120412 119673 119245 119629 120596 121500 121900 121841 121714 121927 122654 123781 125090 126444 127728 128733
54799 128733 129300 129517 129582 129433 128876 128130 127851 128408 129355 129910 129752 129130 128456 128112 128425 129397 130493 131007 130646
54780 130646 129629 128409 127578 127796 129294 131558 133911 136322 139162 142299 145118 147482 150114 153803 158792
54765 158792 165066 172627 181138 189832 198182 206235 213951 220651 225531 228292 228886 227145 223192 217840
54751 217840 211907 205442 198221 190681 183654 177331 171298 165550 160677 156980 154115 151800 150196 149334
$$ packed form
54866B06933n07k150l995n310n900o155o491o902o992o335n005l659k928k688
54852A41916k345j753j437j744k267k398k097j748j456j021n07l36o51r62p17
54837A20477j4M98M09j5k33k1L86O76P30N57J89k90o50o76m41k88m37o60n17O3
54817A19743N55L97k83p39m28L84R67R04M00n9j27K13P27J127J309J354J284J005
54799A28733N67K17O5j49n57p46k79N57R47N55j58o22o74l44L13R72J096N14l61
54780A30646j017j220q31K18J498K264K353K411K840L137K819K364K632L689M989
54765A58792O274P561Q511Q694Q350Q053P716O700M880K761N94j741l953n352
54751B17840n933o465p221p540p027o323o033n748m873l697k865k315j604q62
$$ plain form
54737 149334 148774 148151 147556 147092 146599 146134 146206 147100 148399 149597 150848 152645 155102 158029 161384 165165
54721 165165 169117 173135 177750 183560 190196 196479 201632 205730 208817 210260 209364 206175 201239 194880
54707 194880 187288 179181 171800 166021 161723 158218 155083 152411 150342 148693 147161 145767 144830 144504 144496
54692 144496 144323 143701 142632 141267 139860 138683 137802 136990 136090 135329 134975 134747 133978 132488 130931 130071 129986
54675 129986 130190 130281 130099 129526 128533 127446 126703 126300 125832 125179 124788 125029 125549 125616 124975 124104 123720 124255 125716
54656 125716 127630 129108 129331 128303 126950 126247 126295 126488 126500 126776 127865 129491 130656 130670 129842 128966 128363
54639 128363 127755 127025 126707 127462 129281 131452 133244 134408 135087 135483 135684 135688 135499 135210 134873 134273 133049 131266
54621 131266 129690 129118 129473 129934 129946 129705 129536 129306 128743 128054 127788 128212 129106 130131 131169 132329 133714
$$ packed form
54737A49334n60o23n95m64m93m65P2Q94J299J198J251J797K457K927L355L781
54721A65165L952M018M615N810O636O283N153M098L087J443q96l189m936o359
54707A94880p592q107p381n779m298l505l135k672k069j649j532j394r37l26q
54692A44496j73o22j069j365j407j177q81q12r00p61l54k28p69j490j557q60q5
54675A29986K04R1j82n73r93j087p43m03m68o53l91K41N20O7o41q71l84N35J461
54656A25716J914J478K23j028j353p03M8J93J2K76J089J626J165J4q28q76o03
54639A28363o08p30l18P55J819K171J792J164O79L96K01Mj89k89l37o00j224j783
54621A31266j576n72L55M61J2k41j69k30n63o89k66M24Q94J025J038J160J385
$$ plain form
54604 133714 135158 136191 136433 136007 135332 134505 133347 132144 131784 132734 134314 135483 136050 136609 137510 138440 138848
54587 138848 138302 136609 134168 132093 131351 131762 132338 132504 132368 131953 131046 129951 129474 129838 130348 130547 130975
54570 130975 132232 133933 135188 135720 135863 135869 135816 135890 136143 136216 135838 135373 135282 135304 134823 133865 133042 132584 132137 131556
54550 131556 131240 131496 132098 132721 133390 134317 135550 136898 137987 138469 138521 139019 140709 143202 145327 146529 147358
54533 147358 148427 149581 150413 151011 151683 152297 152393 151763 150533 148890 147115 145674 144866 144391 143628 142314 140715
54516 140715 139255 138291 138185 139157 140867 142411 142958 142413 141376 140573 140357 140636 141044 141125 140482 139045 137299
54499 137299 136060 135830 136352 136973 137352 137685 138274 139159 140096 140694 140602 139908 139358 139786 141168 142542 143066 142835
54481 142835 142476 142324 142346 142620 143353 144515 145730 146608 147011 147092 147233 147733 148365 148504 148025 147767 148621 150370
$$ packed form
54604A33714J444J033K42m26o75q27j158j203l60R50J580J169N67N59R01R30M08
54587A38848n46j693k441k075p42M11N76J66j36m15r07j095m77L64N10J99M28
54570A30975J257J701J255N32J43On3P4K53P3l78m65r1K2m81r58q23m58m47n81
54550A31556l16K56O02O23O69R27J233J348J089M82N2M98J690K493K125J202Q29
54533A47358J069J154Q32N98O72O14R6o30j230j643j775j441q08m75p63j314j599
54516A40715j460r64j06R72J710J544N47n45j037q03k16K79M08Q1o43j437j746
54499A37299j239k30N22O21L79L33N89Q85R37N98r2o94n50M28J382J374N24k31
54481A42835l59j52K2K74P33J162J215Q78M03Q1J41N00O32J39m79k58Q54J749
$$ plain form
54463 150370 152058 153357 154810 156601 157994 158379 158172 158028 157716 156604 154912 153550 152811 152115 151206 150714
54447 150714 151106 151809 151939 151436 150826 150254 149416 148286 147227 146413 145703 145165 145133 145597 145933 145486 144178 142463
54429 142463 140994 140366 140766 141751 142728 143710 145173 147093 148744 149688 150353 151257 152187 152720 153026 153508 153934
54412 153934 153735 153039 152673 153081 153841 154378 154665 155030 155686 156610 157573 158193 158221 157830 157408 157097 156837 156748 157100
54393 157100 157902 158939 160142 161563 163040 164357 165646 167097 168345 168767 168412 167913 167349 165993 163551
54378 163551 160902 159116 158304 157955 157895 158266 158941 159608 160256 161050 161937 162802 163842 165305 167033 168688 170233
54361 170233 171752 172979 173554 173646 173911 174868 176624 179016 181540 183417 184312 184958 186452 188986 191819 194560
54345 194560 197743 201851 206384 210296 213004 214524 214838 213631 210649 206127 200748 195252 190030 185082
$$ packed form
54463A50370J688J299J453J791J393L85k07j44l12j112j692j362p39o96r09m92
54447A50714L92P03J30n03o10n72q38j130j059q14p10n38l2M64L36m47j308j715
54429A42463j469o28M00R85R77R82J463J920J651R44O65R04R30N33L06M82M26
54412A53934j99o96l66M08P60N37K87L65O56R24R63O20K8l91m22l11k60q9L52
54393A57100Q02J037J203J421J477J317J289J451J248M22l55m99n64j356k442
54378A63551k649j786q12l49o0L71O75O67O48P94Q87Q65J040J463J728J655J545
54361A70233J519J227N75R2K65R57J756K392K524J877Q95O46J494K534K833K741
54345A94560L183M108M533L912K708J520L14j207k982m522n379n496n222m948
$$ plain form
54331 185082 180407 176356 173385 171454 169946 168299 166594 165388 165052 165342 165616 165408 164800 164221 163935 163891
54315 163891 164034 164475 165136 165528 165246 164546 164058 164006 164063 163942 163746 163666 163715 163878 164215 164665 164956 164908 164607 164178
54295 164178 163540 162584 161471 160599 160251 160324 160397 160145 159783 159975 161114 162761 164008 164337 163960 163378 162939 162817
54277 162817 163080 163634 164318 165084 165862 166313 166037 165148 164275 163858 163729 163571 163407 163377 163335 163073 162807 163035 163916
54258 163916 165120 166340 167630 169057 170247 170589 169958 169044 168803 169644 171271 173188 175035 176399 176743 175929
54242 175929 174625 173769 173626 173669 173345 172555 171398 169885 168121 166432 165101 164171 163629 163549 163902 164419 164851
54225 164851 165123 165167 164844 164223 163670 163423 163304 163058 162767 162718 163027 163650 164578 165729 166870 167908 169052 170321
54207 170321 171077 170525 168718 166670 165409 165189 165626 166236 166663 166715 166421 165974 165562 165328 165512 166329 167645 168986
$$ packed form
54331A85082m675m051k971j931j508j647j705j206l36K90K74k08o08n79k86m4
54315A63891J43M41O61L92k82p00m88n2N7j21j96q0M9J63L37M50K91m8l01m29
54295A64178o38r56j113q72l48P3P3k52l62J92J139J647J247L29l77n82m39j22
54277A62817K63N54O84P66P78M51k76q89q73m17j29j58j64l0m2k62k66K28Q81
54258A63916J204J220J290J427J190L42o31r14k41Q41J627J917J847J364L44q14
54242A75929j304q56j43M3l24p90j157j513j764j689j331r30n42q0L53N17M32
54225A64851K72M4l23o21n53k47j19k46k91m9L09O23R28J151J141J038J144J269
54207A70321P56n52j807k048j261k20M37O10M27N2k94m47m12k34J84Q17J316J341
$$ plain form
54189 168986 169975 170548 170678 170190 169044 167570 166181 165039 164265 164227 165167 166586 167458 167214 166240 165279 164655
54172 164655 164249 163951 163797 163790 163863 164026 164299 164547 164585 164442 164303 164161 163799 163178 162611 162452 162733 163234 163735 164105
54152 164105 164323 164575 165147 166083 167004 167463 167429 167313 167573 168374 169498 170404 170499 169568 168001 166485 165487 165104
54134 165104 165292 165993 166972 167770 167998 167687 167313 167363 167859 168323 168289 167743 166961 166054 165044 164298 164397 165378 166622
54115 166622 167750 169153 171155 173125 174136 174290 174599 175535 176464 176782 176880 177536 178787 179930 180477 180663 181071
54098 181071 182037 183410 184685 185323 185042 183918 182330 180936 180453 181115 182279 182930 182688 182110 181907 182166 182465
54081 182465 182504 182377 182409 182878 183857 185245 186965 189011 191164 192849 193650 193898 194355 195311 196386 197280 198242
54064 198242 199702 201906 205106 209614 215429 222211 229943 239211 250438 262997 275222 285007 290392
$$ packed form
54189A68986R89N73J30m88j146j474j389j142p74l8R40J419Q72k44r74r61o24
54172A64655m06k98j54pP3J63K73K48L8j43j39j42l62o21n67j59K81N01N01L70
54152A64105K18K52N72R36R21M59l4j16K60Q01J124R06R5r31j567j516r98l83
54134A65104J88P01R79P98K28l11l74N0M96M64l4n46p82r07j010p46R9R81J244
54115A66622J128J403K002J970J011J54L09R36R29L18R8O56J251J143N47J86M08
54098A81071R66J373J275O38k81j124j588j394m83O62J164O51k42n78k03K59K99
54081A82465L9j27L2M69R79J388J720K046K153J685Q01K48M57R56J075Q94R62
54064A98242J460K204L200M508N815O782P732R268J1227J2559J2225R785N385
$$ plain form
54051 290392 290249 284989 276409 266569 256977 248785 242876 239142 236257 232978 229479 226912 226048 226924 229400
54036 229400 233206 237587 241753 245691 249932 254576 259270 264051 269336 274914 279771 283230 285631 287611
54022 287611 289322 290770 292291 294189 296246 298036 299443 300500 300970 300524 299183 297280 295017 292256 288695
54007 288695 284178 279006 273960 269745 266341 263141 259710 256057 252192 248047 243985 240817 238865 237500
53993 237500 236053 234751 234159 234006 233280 231490 229215 227259 225757 224357 222969 221934 221513 221470 221358 221135
53977 221135 221251 221968 222829 223174 223072 223282 224270 225780 227593 230120 233833 238540 243659 248864 253884 257946
53961 257946 260127 260307 259236 257601 255461 252684 249451 246088 242698 239249 235943 233311 231897 231762 232296
53946 232296 232699 232786 233157 234445 236673 239576 243153 247437 251994 256290 260489 265281 270854 276554 281648
$$ packed form
54051B90392j43n260q580r840r592q192n909l734k885l279l499k567q64Q76K476
54036B29400L806M381M166L938M241M644M694M781N285N578M857L459K401J980
54022B87611J711J448J521J898K057J790J407J057M70m46j341j903k263k761l561
54007B88695m517n172n046m215l404l200l431l653l865m145m062l168j952j365
53993B37500j447j302n92j53p26j790k275j956j502j400j388j035m21m3j12k23
53977B21135J16P17Q61L45j02K10R88J510J813K527L713M707N119N205N020M062
53961B57946K181J80j071j635k140k777l233l363l390l449l306k632j414j35N34
53946B32296M03Q7L71J288K228K903L577M284M557M296M199M792N573N700N094
$$ plain form
53931 281648 285905 289332 291884 293704 295152 296338 297082 297654 299053 302087 306454 311172 315739 320486 325926
53916 325926 332164 338922 345925 353337 361946 372762 386235 401980 419393 438332 459195 482666
53904 482666 509317 538483 566822 588608 598777 596183 583717 565536 544734 523296 502811 484302
53892 484302 467780 452656 438534 425332 412898 400993 389607 378969 369174 360028 351331 343197
53880 343197 336003 329944 324630 319208 313094 306552 300414 295281 291166 287807 284908 281989 278422 273976
53866 273976 269176 264877 261505 258831 256332 253590 250449 247012 243602 240646 238466 237024 235785 234035
53852 234035 231546 228812 226408 224369 222537 221296 221272 222258 223149 223213 222851 222747 222860 222801 222674 222845 223153 223057
53834 223057 222473 221810 221223 220465 219505 218693 218155 217605 216955 216657 217105 218031 218781 218938 218503 217735 217066 216986 217726
$$ packed form
53931B81648M257L427K552J820J448J186P44N72J399L034M367M718M567M747N440
53916C25926O238O758P003P412Q609J0816J3473J5745J7413J8939K0863K3471
53904D82666K6651K9166K8339K1786J0169k594j2466j8181k0802k1438k0485j8509
53892D84302j6522j5124j4122j3202j2434j1905j1386j0638r795r146q697q134
53880C43197p194o059n314n422o114o542o138n133m115l359k899k919l567m446
53866B73976m800m299l372k674k499k742l141l437l410k956k180j442j239j750
53852B34035k489k734k404k039j832j241k4R86Q91O4l62j04J13n9j27J71L08r6
53834B23057n84o63n87p58r60q12n38n50o50k98M48R26P50J57m35p68o69q0P40
$$ plain form
53815 217726 219087 220644 221999 222894 223403 224081 225601 228037 230746 233109 235081 236873 238475 239924 241788
53800 241788 244894 249548 255316 261598 268076 274571 280804 286542 291846 296921 301734 305901 309075 311395
53786 311395 313440 315621 317659 318812 318674 317642 316481 315496 314303 312370 309606 306249 302366 297746 292418
53771 292418 286971 282092 277875 273908 270045 266708 264288 262578 261011 259193 256946 254186 251151 248496
53757 248496 246653 245160 243143 240426 237706 235548 233703 231617 229203 226855 225002 223832 223255 222901 222354
53742 222354 221564 220878 220628 220871 221599 222902 224739 226768 228554 229777 230245 230039 229804 230489 232485 235169
53726 235169 237541 239182 240445 241903 243814 245984 247974 249523 250822 252256 253909 255587 257284 259248
53712 259248 261495 263671 265566 267312 268895 270005 270681 271622 273333 275377 276987 278142 279452 281209 283166
$$ packed form
53815B17726J361J557J355Q95N09O78J520K436K709K363J972J792J602J449J864
53800B41788L106M654N768O282O478O495O233N738N304N075M813M167L174K320
53786C11395K045K181K038J153j38j032j161r85j193j933k764l357l883m620n328
53771B92418n447m879m217l967l863l337k420j710j567j818k247k760l035k655
53757B48496j843j493k017k717k720k158j845k086k414k348j853j170n77l54n47
53742B22354p90o86k50K43P28J303J837K029J786J223M68k06k35O85J996K684
53726B35169K372J641J263J458J911K170J990J549J299J434J653J678J697J964
53712B59248K247K176J895J746J583J110O76R41J711K044J610J155J310J757J957
$$ plain form
53697 283166 285137 287212 289415 291696 294350 297896 302329 306841 310508 313010 314600 315619 316230 316503 316554
53682 316554 316520 316282 315355 313392 310935 309265 309167 310118 310978 311117 310517 309232 307452 305792 304750 303988 302890
53665 302890 301756 301554 302389 303101 302734 301606 300484 299419 298026 296357 294785 293422 292327 292017 292966 294680
53649 294680 296038 296630 297099 297921 298495 297899 296169 294312 293220 293070 293699 295034 296920 298942 300798 302644
53633 302644 304695 306610 307741 308049 308295 309118 310321 311390 312404 313947 316304 319174 322191 325347 328850
53618 328850 332765 336882 340805 344265 347532 351328 356045 361142 365619 368985 371491 373655 376040 379384
53604 379384 384309 390723 397832 404745 410737 415114 417624 419171 421306 424572 427902 430144 431671 433841
53590 433841 437297 441459 445501 449087 452125 454435 455871 456330 455496 452927 448668 443489 438323 433597 429256
$$ packed form
53697B83166J971K075K203K281K654L546M433M512L667K502J590J019O11K73N1
53682C16554l4k38r27j963k457j670r8R51Q60J39o00j285j780j660j042p62j098
53665C02890j134k02Q35P12l67j128j122j065j393j669j572j363j095l10R49J714
53649B94680J358N92M69Q22N74n96j730j857j092j50O29J335J886K022J856J846
53633C02644K051J915J131L08K46Q23J203J069J014J543K357K870L017L156L503
53618C28850L915M117L923L460L267L796M717N097M477L366K506K164K385L344
53604C79384M925O414P109O913N992M377K510J547K135L266L330K242J527K170
53590D33841L456M162M042L586L038K310J436M59q34k569m259n179n166m726m341
$$ plain form
53575 429256 425150 421101 416776 411935 406962 402785 399931 397828 395444 392688 390661 390223 390719 390645 389417
53560 389417 387841 386818 386279 385668 384933 384515 384684 385437 386848 388997 391484 393569 394969 396179 397815 399848
53544 399848 401806 403538 405431 407827 410593 413505 416831 421140 426546 432549 438760 445418 452923 461149
53530 461149 469607 478114 486884 496092 505773 516083 527167 538781 550540 562669 575964 590743
53518 590743 606289 621612 636474 651401 667066 683957 702369 722328 743689 766512 791119
53507 791119 817534 845103 873001 900895 928824 956612 983798 1009991 1034997 1058723 1081338
53496 1081338 1103438 1125648 1147993 1169882 1190778 1210727 1230246 1249849 1269678 1289483 1309052
53485 1309052 1328617 1348629 1369029 1389127 1408450 1427460 1447026 1467337 1487652 1506993 1524683
$$ packed form
53575D29256m106m049m325m841m973m177k854k103k384k756k027m38M96p4j228
53560C89417j576j023n39o11p35m18J69P53J411K149K487K085J400J210J636K033
53544C99848J958J732J893K396K766K912L326M309N406O003O211O658P505Q226
53530D61149Q458Q507Q770R208R681J0310J1084J1614J1759J2129J3295J4779
53518E90743J5546J5323J4862J4927J5665J6891J8412J9959K1361K2823K4607
53507G91119K6415K7569K7898K7894K7929K7788K7186K6193K5006K3726K2615
53496A081338K2100K2210K2345K1889K0896J9949J9519J9603J9829J9805J9569
53485A309052J9565K0012K0400K0098J9323J9010J9566K0311K0315J9341J7690
$$ plain form
53474 1524683 1540327 1553698 1564792 1573747 1580614 1585273 1587475 1586867 1583116 1576208 1566474 1554181 1539404
53461 1539404 1522554 1504694 1486951 1469829 1453418 1437780 1422457 1405919 1386475 1363884 1339433
53450 1339433 1314422 1289282 1264224 1239790 1216272 1193280 1170439 1147959 1126116 1104884 1084730
53439 1084730 1067142 1053397 1043041 1034481 1026920 1020814 1016384 1012772 1009071 1005480 1002883 1001763 1002051
53426 1002051 1003666 1006658 1011017 1016785 1024262 1033674 1044754 1057047 1070566 1085724 1102655 1121061
53414 1121061 1140811 1162292 1185957 1211830 1239626 1269078 1299934 1331940 1365173 1400186 1437442
53403 1437442 1476633 1516949 1558105 1600870 1646421 1695294 1747024 1800653 1855469 1911354 1968576
53392 1968576 2027336 2087482 2148611 2210362 2272552 2335087 2397712 2459842 2520698 2579706 2636762
$$ packed form
53474A524683J5644J3371J1094Q955O867M659K202o08l751o908r734j2293j4777
53461A539404j6850j7860j7743j7122j6411j5638j5323j6538j9444k2591k4451
53450A339433k5011k5140k5058k4434k3518k2992k2841k2480k1843k1232k0154
53439A084730j7588j3745j0356q560p561o106m430l612l701l591k597j120K88
53426A002051J615K992M359N768P477R412J1080J2293J3519J5158J6931J8406
53414A121061J9750K1481K3665K5873K7796K9452L0856L2006L3233L5013L7256
53403A437442L9191M0316M1156M2765M5551M8873N1730N3629N4816N5885N7222
53392A968576N8760O0146O1129O1751O2190O2535O2625O2130O0856N9008N7056
$$ plain form
53381 2636762 2691926 2744870 2794852 2841280 2883994 2922864 2957403 2987051 3011590 3031014 3045261
53370 3045261 3054367 3058631 3058124 3052173 3039738 3020194 2993350 2958918 2916735 2867606 2813367 2755860
53358 2755860 2696257 2635409 2574188 2513081 2451960 2390783 2330305 2271677 2215536 2161842 2110472
53347 2110472 2061561 2015109 1970398 1926003 1880590 1833884 1786749 1740128 1694207 1649000 1605303
53336 1605303 1564229 1525864 1489391 1454764 1423251 1395780 1371658 1349660 1329697 1312461 1297878
53325 1297878 1284758 1271749 1257898 1242635 1226099 1209383 1193717 1179455 1166407 1154807 1145097
53314 1145097 1136996 1129759 1123354 1118466 1115324 1113492 1112902 1114064 1117017 1121110 1126321 1133723 1143987 1156244
53300 1156244 1169218 1182841 1197949 1214930 1233649 1254366 1277696 1303619 1331301 1360074 1390014
$$ packed form
53381B636762N5164N2944M9982M6428M2714L8870L4539K9648K4539J9424J4247
53370C045261R106M264n07n951j2435j9544k6844l4432m2183m9129n4239n7507
53358B755860n9603o0848o1221o1107o1121o1177o0478n8628n6141n3694n1370
53347B110472m8911m6452m4711m4395m5413m6706m7135m6621m5921m5207m3697
53336A605303m1074l8365l6473l4627l1513k7471k4122k1998j9963j7236j4583
53325A297878j3120j3009j3851j5263j6536j6716j5666j4262j3048j1600r710
53314A145097q101p237o405m888l142j832n90J162K953M093N211P402J0264J2257
53300A156244J2974J3623J5108J6981J8719K0717K3330K5923K7682K8773K9940
$$ plain form
53289 1390014 1421435 1454217 1487780 1521339 1554090 1585415 1615018 1642734 1668306 1691577 1712778
53278 1712778 1732216 1749622 1764031 1774368 1780038 1781095 1778113 1771877 1762956 1751561 1737856 1722166
53266 1722166 1704608 1684757 1662166 1637166 1610722 1583458 1555228 1525777 1495356 1464425 1433078
53255 1433078 1401098 1368442 1335417 1302415 1269679 1237329 1205495 1174483 1144739 1116425 1088976
53244 1088976 1061392 1033159 1004721 976844 949826 923586 898234 873990 850539 827081 803287
53233 803287 779873 757972 738177 720425 704545 690552 678489 668278 659622 651802 643660 634228
53221 634228 623491 612253 601126 589817 577576 564207 550435 537237 524904 512840 500316
53210 500316 487345 474670 463023 452725 444027 437182 431757 426324 419652 412126 405318 400109 395832
$$ packed form
53289A390014L1421L2782L3563L3559L2751L1325K9603K7716K5572K3271K1201
53278A712778J9438J7406J4409J0337N670J057k982o236q921j1395j3705j5690
53266A722166j7558j9851k2591k5000k6444k7264k8230k9451l0421l0931l1347
53255A433078l1980l2656l3025l3002l2736l2350l1834l1012k9744k8314k7449
53244A088976k7584k8233k8438k7877k7018k6240k5352k4244k3451k3458k3794
53233H03287k3414k1901j9795j7752j5880j3993j2063j0211q656p820q142r432
53221F34228j0737j1238j1127j1309j2241j3369j3772j3198j2333j2064j2524
53210E00316j2971j2675j1647j0298q698o845n425n433o672p526o808n209m277
$$ plain form
53197 395832 391292 385907 379585 372308 364406 356794 350268 344809 339953 335535 331630 328083 324649 321442
53183 321442 318773 316669 314914 313430 312214 311104 309939 308813 307788 306616 305150 303732 302678 301657
53169 301657 300214 298665 297722 297268 296330 294350 291797 289365 287219 285305 283786 282724 281823 280877 280172 280061
53153 280061 280341 280339 279489 277722 275468 273426 272078 271353 270866 270455 270173 269890 269370 268750 268419 268314 267879 266974
53135 266974 266260 266370 267094 267794 268236 268619 269038 269344 269442 269393 269267 269077 268798 268404 268015 267953 268420 269174 269954 271210
53115 271210 273796 277701 281669 284490 286258 287914 289946 291980 293461 294241 294532 294560 294223 293012 290551
53100 290551 287303 284311 282051 280040 277828 275774 274284 272881 270764 268009 265464 263625 262256 261011
53086 261011 259754 258342 256825 255907 256481 258506 260866 262523 263280 263353 262902 262297 262217 262922 263758 263871 263215
$$ packed form
53197C95832m540n385o322p277p902p612o526n459m856m418l905l547l434l207
53183C21442k669k104j755j484j216j110j165j126j025j172j466j418j054j021
53169C01657j443j549r43m54r38j980k553k432k146j914j519j062r01r46p05j11
53153B80061K80kq50j767k254k042j348p25m87m11k82k83n20o20l31j05m35r05
53135B66974p14J10P24P00M42L83M19L06R8m9j26j90k79l94l89o2M67P54P80J256
53115B71210K586L905L968K821J768J656K032K034J481P80K91K8l37j211k461
53100B90551l248k992k260k011k212k054j490j403k117k755k545j839j369j245
53086B61011j257j412j517r18N74K025K360J657P57P3m51o05q0P05Q36J13o56
$$ plain form
53069 263215 262471 262176 262301 262539 262614 262367 261860 261385 261118 260796 259964 258576 257105 256075 255670 255792 256242 256747
53051 256747 257125 257577 258597 260306 261997 262676 262080 260901 259951 259441 259203 259268 259847 260848 261796 262236 262001
53034 262001 261196 260197 259657 260011 260826 261014 259956 258217 256884 256427 256491 256636 256810 257048 257090 256630 255874 255547
53016 255547 256170 257435 258484 258801 258658 258659 259107 259935 260949 261852 262257 262062 261689 261623 261861 262154 262620 263578 264836
52997 264836 265738 265986 265944 266023 266299 266846 267832 268988 269537 269108 268322 268150 268911 270168 271253 271746 271769 272029 273117
52978 273117 274618 275525 275760 276568 278907 282133 284942 286981 288687 290048 290577 290366 290209 290542 291062 291494
52962 291494 292090 293161 294638 296247 297754 298947 299735 300264 300598 300374 299205 297293 295135 292739 289725
52947 289725 286179 282790 280064 277988 276506 275716 275422 275059 274328 273455 272619 271624 270351 269120 268308 267943
$$ packed form
53069B63215p44k95J25K38P5k47n07m75k67l22q32j388j471j030m05J22M50N05
53051B56747L78M52J020J709J691O79n96j179r50n10k38O5N79J001R48M40k35
53034B62001q05r99n40L54Q15J88j058j739j333m57O4J45J74K38M2m60p56l27
53016B55547O23J265J049L17j43JM48Q28J014R03M05j95l73o6K38K93M66R58J258
52997B64836R02K48m2P9K76N47R86J156N49m29p86j72P61J257J085M93K3K60J088
52978B73117J501R07K35Q08K339L226K809K039J706J361N29k11j57L33N20M32
52962B91494N96J071J477J609J507J193P88N29L34k24j169j912k158k396l014
52947B89725l546l389k726k076j482p90k94l63p31q73q36r95j273j231q12l65
$$ plain form
52931 267943 267865 267915 267779 267075 265869 264794 264359 264385 264336 263976 263504 263233 263332 263697 263983 263894 263511 263127 262797 262309
52911 262309 261626 261031 260791 260964 261542 262477 263498 264204 264401 264153 263626 263146 263162 263645 263701 262488 260473 259088
52893 259088 259051 259762 260477 261237 262292 263389 264158 264668 265148 265642 266324 267509 268898 269398 268337 266356 264512
52876 264512 263055 261773 260960 261083 261743 261941 261392 260799 260826 261540 262898 265063 267942 271031 273935 276674
52860 276674 279302 281598 283251 284022 283729 282469 280862 279591 278565 277024 274587 271675 268757 265674 262160
52845 262160 258538 255452 253037 250865 248604 246399 244611 243411 242706 242235 241663 240776 239689 238851 238720 239344
52829 239344 240264 240925 241240 241676 242747 244485 246446 248110 249138 249411 249054 248388 247674 246906 245991 245060 244399
52812 244399 244121 244186 244745 246208 248774 252067 255395 258290 260665 262502 263605 263771 263140 262170 261132 259797
$$ packed form
52931B67943p8N0j36p04j206j075m35K6m9l60m72k71R9L65K86q9l83l84l30m88
52911B62309o83n95k40J73N78R35J021P06J97k48n27m80J6M83N6j213k015j385
52893B59088l7P11P15P60J055J097P69N10M80M94O82J185J389N00j061j981j844
52876B64512j457j282q13J23O60J98n49n93K7P14J358K165K879L089K904K739
52860B76674K628K296J653P71k93j260j607j271j026j541k437k912k918l083l514
52845B62160l622l086k415k172k261k205j788j200p05m71n72q87j087q38j31O24
52829B39344R20O61L15M36J071J738J961J664J028K73l57o66p14p68r15r31o61
52812B44399k78O5N59J463K566L293L328K895K375J837J103J66o31r70j038j335
$$ plain form
52796 259797 257858 255617 253823 252717 251543 249336 246037 242555 239852 238209 237250 236403 235391 234516 234432
52781 234432 235460 237245 239263 241455 244014 246725 248996 250559 251675 252584 253153 253196 252827 252273 251618 250885
52765 250885 250186 249635 249281 249185 249375 249664 249747 249505 248983 248102 246799 245533 245118 245725 246406 246014 244395 242381
52747 242381 240809 239961 239810 240370 241683 243641 245903 247992 249694 251422 253867 257007 259793 261256 261712
52732 261712 262316 263524 264599 264847 264764 265584 267944 271340 274710 277261 278838 279761 280315 280330 279347 277336 275109
52715 275109 273679 273244 273014 272140 270581 268892 267357 265660 263498 261222 259611 259102 259448 260143 260872 261524
52699 261524 262022 262407 262899 263625 264409 265027 265587 266371 267409 268462 269393 270197 270743 270854 270736 270919 271655 272701
52681 272701 273810 275032 276333 277352 277871 278182 278575 278777 278348 277375 276261 275012 273414 271842 271190 271749
$$ packed form
52796B59797j939k241j794j106j174k207l299l482k703j643r59q47j012q75q4
52781B34432J028J785K018K192K559K711K271J563J116R09N69M3l69n54o55p33
52765B50885o99n51l54r6J90K89Q3k42n22q81j303j266m15O07O81l92j619k014
52747B42381j572q48j51N60J313J958K262K089J702J728K445L140K786J463M56
52732B61712O04J208J075K48q3Q20K360L396L370K551J577R23N54J5r83k011k227
52715B75109j430m35k30q74j559j689j535j697k162k276j611n09L46O95P29O52
52699B61524M98L85M92P26P84O18N60P84J038J053R31Q04N46J11j18J83P36J046
52681B72701J109J222J301J019N19L11L93K02m29r73j114j249j598j572o52N59
$$ plain form
52665 271749 272711 273028 272340 270877 268970 267103 265939 265701 265754 265350 264679 264663 265806 267783 270219 273294 277248
52648 277248 281624 285338 287399 287474 286013 284066 282662 282023 281398 279914 277539 275040 273153 272131 272019
52633 272019 272809 274147 275319 275874 276032 276152 276126 275777 275685 276897 279612 282674 284652 285035 284156 282458 280380
52616 280380 278581 277566 277095 276485 275543 274734 274370 274128 273549 272635 271733 271187 271233 271938 273007 273935 274537 275102
52598 275102 275871 276689 277349 277959 278678 279377 279913 280459 281215 281956 282311 282405 282799 283807 285176 286524 287814 289269
52580 289269 290970 292621 293688 293828 293242 292554 292257 292390 292758 293213 293553 293420 292564 291076 289200 287101 284989
52563 284989 283212 281897 280734 279446 278322 277907 278303 279132 280053 280911 281511 281720 281776 282016 282261 281934 280906
52546 280906 279826 279406 279695 280232 280630 280787 280724 280487 280137 279718 279237 278677 278003 277234 276604 276487 276978 277681 278195
$$ packed form
52665B71749R62L17o88j463j907j867j164k38N3m04o71j6J143J977K436L075L954
52648B77248M376L714K061P5j461j947j404o39o25j484k375k499j887j022j12
52633B72019P90J338J172N55J58J20k6l49r2J212K715L062J978L83q79j698k078
52616B80380j799j015m71o10r42q09l64k42n79r14r02n46M6P05J069R28O02N65
52598B75102P69Q18O60O10P19O99N36N46P56P41L55R4L94J008J369J348J290J455
52580B89269J701J651J067J40n86o88k97J33L68M55L40j33q56j488j876k099k112
52563B84989j777j315j163j288j124m15L96Q29R21Q58O00K09N6K40K45l27j028
52546B80906j080m20K89N37L98J57o3k37l50m19m81n60o74p69o30j17M91P03N14
$$ plain form
52527 278195 278645 279429 280594 281813 282861 283702 284189 284161 283835 283613 283522 283357 283391 284328 286323 288664 290764 292962
52509 292962 295897 299522 303242 306763 310253 313738 316739 318541 318579 316628 312974 308469 304265 301221 299401
52494 299401 298042 296214 293758 291531 290430 290229 289814 288512 286685 284972 283609 282796 283064 284607 286610
52479 286610 287889 288155 288151 288652 289758 291155 292575 293891 295050 296068 296947 297627 298163 298893 300200 302150
52463 302150 304503 307064 309842 312938 316392 319962 322928 324345 323859 322137 320131 317976 315048 311121
52449 311121 306993 303700 301461 299738 298134 296762 295716 294612 292989 291030 289507 288922 288936 288755 287921
52434 287921 286572 285079 283709 282566 281591 280666 279922 279861 280865 282659 284592 286450 288493 290613 292001
52419 292001 292013 291055 290200 290188 291115 292815 294961 296893 297996 298531 299680 302376 306292 310426 314593 319891
$$ packed form
52527B78195M50P84J165J219J048Q41M87k8l26k22r1j65L4R37J995K341K100K198
52509B92962K935L625L720L521L490L485L001J802L8j951l654m505m204l044j820
52494B99401j359j828k456k227j101k01m15j302j827j713j363q13K68J543K003
52479B86610J279K66mN01J106J397J420J316J159J018Q79O80N36P30J307J950
52463C02150K353K561K778L096L454L570K966J417m86j722k006k155k928l927
52449C11121m128l293k239j723j604j372j046j104j623j959j523n85J4j81q34
52434B87921j349j493j370j143r75r25p44o1J004J794J933J858K043K120J388
52419B92001J2r58q55j2R27J700K146J932J103N35J149K696L916M134M167N298
$$ plain form
52403 319891 327503 337480 349054 361699 375017 387487 396281 399109 396017 388925 379752 369582 359291
52390 359291 349983 342489 336887 332718 329325 326079 322821 320190 319008 319196 319760 319907 319710 319632 320003 321166
52374 321166 323517 327045 331235 335600 339927 343955 347476 350918 355122 360172 365019 368561 370502 370919
52360 370919 369809 367593 365310 363703 362604 361715 361274 361385 361495 361320 361589 362960 364812 366156 367213 368951
52344 368951 371401 373667 375480 377577 380375 383287 385622 387409 389148 391407 394710 399198 404369 409762
52330 409762 415784 423195 431989 441682 452451 464937 478876 493186 507585 522912 539444 556104
52318 556104 572001 587655 603864 620167 635454 649522 663151 676980 691146 705826 721406
52307 721406 738167 756162 775165 794340 812448 829038 845143 862104 879893 897230 913236
$$ packed form
52403C19891P612R977J1574J2645J3318J2470Q794K828l092p092r173j0170j0291
52390C59291r308p494n602m169l393l246l258k631j182J88N64J47j97p8L71J163
52374C21166K351L528M190M365M327M028L521L442M204N050M847L542J941M17
52360C70919j110k216k283j607j099q89m41J11J10j75K69J371J852J344J057J738
52344C68951K450K266J813K097K798K912K335J787J739K259L303M488N171N393
52330D09762O022P411Q794R693J0769J2486J3939J4310J4399J5327J6532J6660
52318E56104J5897J5654J6209J6303J5287J4068J3629J3829J4166J4680J5580
52307G21406J6761J7995J9003J9175J8108J6590J6105J6961J7789J7337J6006
$$ plain form
52296 913236 928192 942555 955911 967171 975432 980400 982274 981597 979072 975283 970532 964940 958685
52283 958685 952087 945524 939262 933347 927629 921932 916322 911351 907986 906998 908246 910757 913708 917097
52269 917097 921343 926639 933134 941329 951537 963035 974488 985293 995899 1006718 1017476 1027948
52257 1027948 1038674 1050447 1063516 1077634 1092521 1107887 1123311 1138436 1153005 1166519 1178264
52246 1178264 1187996 1196123 1202876 1207734 1210162 1210507 1209626 1207952 1205527 1202669 1199864 1197028 1193490 1188824
52232 1188824 1183272 1177278 1171059 1164724 1158450 1152354 1146489 1141054 1136433 1132897 1130336 1128297 1126186 1123630
52218 1123630 1120891 1118809 1118036 1118377 1119162 1120227 1122211 1125856 1131299 1138096 1145620 1153320 1160865 1168302 1175897
52203 1175897 1183650 1191032 1197393 1202570 1207001 1211319 1216019 1221424 1227654 1234457 1241285 1247835 1254465 1261715
$$ packed form
52296I13236J4956J4363J3356J1260Q261M968J874o77k525l789m751n592o255
52283I58685o598o563o262n915n718n697n610m971l365r88J248K511K951L389
52269I17097M246N296O495Q195J0208J1498J1453J0805J0606J0819J0758J0472
52257A027948J0726J1773J3069J4118J4887J5366J5424J5125J4569J3514J1745
52246A178264R732Q127O753M858K428L45q81j674k425k858k805k836l538m666
52232A188824n552n994o219o335o274o096n865n435m621l536k561k039k111k556
52218A123630k739k082p73L41P85J065J984L645N443O797P524P700P545P437P595
52203A175897P753P382O361N177M431M318M700N405O230O803O828O550O630P250
$$ plain form
52189 1261715 1269405 1276578 1282578 1287820 1293094 1298317 1302491 1304796 1305156 1303602 1299717 1293176 1284515 1274879
52175 1274879 1265034 1254945 1244337 1233366 1222627 1212663 1203655 1195581 1188539 1182707 1178042 1174250 1171224
52162 1171224 1169341 1169100 1170612 1173617 1177825 1182858 1187954 1192171 1194952 1196238 1196051 1194392 1191584 1188279
52148 1188279 1185010 1182040 1179706 1178455 1178336 1178884 1179747 1181074 1183068 1185440 1187539 1188759 1188623 1186858 1183719
52133 1183719 1180003 1176499 1173654 1171927 1171999 1174226 1178266 1183794 1191400 1202215 1216638 1233838 1252647
52120 1252647 1272643 1294280 1318118 1343977 1370716 1396879 1421644 1445132 1467795 1489679 1510359
52109 1510359 1529294 1546112 1560837 1574100 1586856 1599562 1611841 1623275 1634317 1645988 1658732
52098 1658732 1671988 1684874 1696831 1707449 1716173 1722558 1726632 1728584 1728001 1723728 1714781 1701422 1685195
$$ packed form
52189A261715P690P173O000N242N274N223M174K305L60j554l885o541q661r636
52175A274879r845j0089j0608j0971j0739r964r008q074p042n832m665l792l026
52162A171224j883k41J512L005M208N033N096M217K781J286j87j659k808l305
52148A188279l269k970k334j251j19N48Q63J327J994K372K099J220j36j765l139
52133A183719l716l504k845j727P2K227M040N528P606J0815J4423J7200J8809
52120A252647J9996K1637K3838K5859K6739K6163K4765K3488K2663K1884K0680
52109A510359J8935J6818J4725J3263J2756J2706J2279J1434J1042J1671J2744
52098A658732J3256J2886J1957J0618Q724O385M074J952n83m273q947j3359j6227
$$ plain form
52085 1685195 1667838 1650243 1632497 1614711 1597553 1582047 1569029 1558754 1550836 1544556 1539427 1535396
52073 1535396 1532456 1530332 1528940 1528987 1531560 1537029 1544732 1553800 1563902 1575031 1586997 1599382 1611790
52060 1611790 1623968 1635939 1648097 1660856 1674027 1686818 1698514 1708937 1718136 1726078 1732781 1738431
52048 1738431 1742999 1745881 1746091 1742740 1735454 1724636 1711335 1696501 1680367 1662883 1644625 1626678
52036 1626678 1609594 1593086 1576878 1561281 1546669 1533016 1520204 1508238 1496882 1485656 1474506
52025 1474506 1463870 1453782 1443509 1432532 1421267 1410338 1399686 1388906 1377976 1367112 1356383
52014 1356383 1345968 1336332 1327687 1319679 1312000 1304712 1297548 1289627 1280446 1270432 1259768 1247398 1232097
52001 1232097 1213872 1193393 1170683 1145605 1119145 1092881 1067393 1042398 1018345 996592 977833
$$ packed form
52085A685195j7357j7595j7746j7786j7158j5506j3018j0275p918o280n129m031
52073A535396k940k124j392M7K573N469P703R068J0102J1129J1966J2385J2408
52060A611790J2178J1971J2158J2759J3171J2791J1696J0423R199P942O703N650
52048A738431M568K882K10l351p286j0818j3301j4834j6134j7484j8258j7947
52036A626678j7084j6508j6208j5597j4612j3653j2812j1966j1356j1226j1150
52025A474506j0636j0088j0273j0977j1265j0929j0652j0780j0930j0864j0729
52014A356383j0415r636q645q008p679p288p164p921r181j0014j0664j2370j5301
52001A232097j8225k0479k2710k5078k6460k6264k5488k4995k4053k1753j8759
$$ plain form
51990 977833 961437 946475 932399 918566 904216 889319 874628 860562 846727 832670 818321
51979 818321 803525 787976 771905 755985 740293 724208 707716 691996 678249 666625 656716 648495
51967 648495 642314 638491 637263 638701 642342 647448 653783 661599 670714 680336 689904 699150 707006 711522
51953 711522 711607 708018 701995 693784 683398 672088 661884 654030 648806 646470 647303 650819 656069 662828
51939 662828 671674 682753 695330 708784 723243 738775 754531 769178 781817 792028 799294 802875
51927 802875 802226 797237 788107 775246 759371 741420 722146 701857 680782 659744 640196 623311
51915 623311 609129 596857 585988 576831 569950 565484 563174 562777 564207 567589 573481 582862 596596
51902 596596 614910 637596 664565 695791 730377 765602 796960 819490 829646 826481 811348 786672
$$ packed form
51990I77833j6396j4962j4076j3833j4350j4897j4691j4066j3835j4057j4349
51979H18321j4796j5549j6071j5920j5692j6085j6492j5720j3747j1624r909q221
51967F48495o181l823j228J438L641N106O335P816R115R622R568R246P856M516
51953G11522Q5l589o023q211j0386j1310j0204p854n224k336Q33L516N250O759
51939F62828Q846J1079J2577J3454J4459J5532J5756J4647J2639J0211P266L581
51927H02875o49m989r130j2861j5875j7951j9274k0289k1075k1038j9548j6885
51915F23311j4182j2272j0869r157o881m466k310l97J430L382N892R381J3734
51902E96596J8314K2686K6969L1226L4586L5225L1358K2530J0156l165j5133k4676
$$ plain form
51890 786672 755048 719192 682112 646777 615354 588641 566208 547207 531316 519048 511131 507680
51878 507680 508029 511203 516417 523355 532256 543584 557213 572009 586509 599892 611822 621468 627352
51865 627352 628396 624731 617298 607120 595190 582608 570299 558727 548154 539104 532357 528499 527519
51852 527519 528758 531220 534076 536951 539659 541790 542782 542304 540304 536758 531662 525325 518384 511506 505189
51837 505189 499637 494609 489650 484896 481337 479761 479740 480356 481644 484361 488383 492377 495338 497420 498870
51822 498870 499127 497628 494747 491191 487153 482791 478945 476464 475153 474236 473668 474188 476198 479295 482900
51807 482900 486659 490089 492365 492709 490827 487049 482301 477743 473986 470696 467283 463871 461268 460097
51793 460097 460279 461212 462035 461807 459950 456696 452928 449572 447233 446141 446081 446441 446716 446946 447451 448151 448471
$$ packed form
51890G86672l1624l5856l7080l5335l1423k6713k2433j9001j5891j2268p917l451
51878E07680L49L174N214O938Q901J1328J3629J4796J4500J3383J1930R646N884
51865F27352J044l665p433j0178j1930j2582j2309j1572j0573r050o747l858r80
51852E27519J239K462K856K875K708K131R92m78k000l546n096o337o941o878o317
51837E05189n552n028m959m754l559j576k1O16J288K717M022L994K961K082J450
51822D98870K57j499k881l556m038m362l846k481j311r17n68N20K010L097L605
51807D82900L759L430K276L44j882l778m748m558l757l290l413l412k603j171
51793D60097J82R33Q23k28j857l254l768l356k339j092o0L60K75K30N05P00L20
$$ plain form
51776 448471 447856 446180 443762 441227 439330 438687 439650 442466 447290 453876 461591 470142 479998 491675 504676
51761 504676 517560 528994 538342 545203 548913 548745 544474 536640 526373 515025 503800 493497 484439
51748 484439 476564 469689 463928 459809 457694 457114 457086 457194 457897 459630 462150 465137 468961 474321 481423
51733 481423 490007 499845 510550 521006 529579 535097 537408 537117 535210 532879 531302 531349 533362 536851
51719 536851 540155 540903 537536 530529 521882 513609 506935 502514 500500 500211 500209 499057 496055 491456 486295
51704 486295 481885 479090 478066 478871 481942 487398 494027 499624 502557 502753 501210 499049 497138 496172 496722
51689 496722 499119 503220 508167 512588 515267 515529 512943 507244 499016 489993 481930 475353 469999 466121
51675 466121 464421 464789 466152 467817 469999 472648 474647 474944 473953 473235 474161 477406 483305 491839 502186
$$ packed form
51776D48471o15j676k418k535j897o43R63K816M824O586P715Q551R856J1677J3001
51761E04676J2884J1434R348O861L710j68m271p834j0267j1348j1225j0303r058
51748D84439p875o875n761m119k115n80k8J08P03J733K520K987L824N360P102
51733D81423Q584R838J0705J0456Q573N518K311k91j907k331j577M7K013L489
51719E36851L304P48l367p007q647q273o674m421k014k89kj152l002m599n161
51704D86295m410k795j024Q05L071N456O629N597K933J96j543k161j911r66N50
51689D96722K397M101M947M421K679K62k586n699q228r023q063o577n354l878
51675D66121j700L68J363J665K182K649J999K97r91p18R26L245N899Q534J0347
$$ plain form
51660 502186 512785 521963 528342 530872 529047 523321 515162 506590 499580 495639 495528 499254 506370 516374
51646 516374 528763 542578 555816 565421 568490 564071 553903 541081 527910 515187 503175 492440
51634 492440 483444 475903 469159 463048 458005 454355 451734 449282 446349 443128 440603 439633 439991 440492 440094
51619 440094 438639 436453 433721 430618 427687 425492 423936 422314 420192 417879 415956 414600 413578 412695
51605 412695 412000 411618 411670 412456 414481 418064 422908 428259 433536 438685 444011 449953 457143 466301 477703
51590 477703 490754 504194 516495 525916 530702 529966 524542 516538 507955 499948 493193 488260 485360 484348
51576 484348 485412 489467 497455 509448 524699 542270 561242 580701 600259 620685 643428 669140
51564 669140 696840 724682 751397 777116 803279 832125 865946 906238 953275 1006437 1064629
$$ packed form
51660E02186J0599R178O379K530j825n726q159q572p010l941j11L726P116J0004
51646E16374J2389J3815J3238R605L069m419j0168j2822j3171j2723j2012j0735
51634D92440q996p541o744o111n043l650k621k452k933l221k525r70L58N01l98
51619D40094j455k186k732l103k931k195j556j622k122k313j923j356j022q83
51605D12695o95l82N2P86K025L583M844N351N277N149N326N942P190R158J1402
51590D77703J3051J3440J2301R421M786p36n424q004q583q007o755m933k900j012
51576D84348J064M055P988J1993J5251J7571J8972J9459J9558K0426K2743K5712
51564F69140K7700K7842K6715K5719K6163K8846L3821M0292M7037N3162N8192
$$ plain form
51553 1064629 1125892 1186525 1241134 1284219 1312131 1323830 1320178 1302779 1273297 1233402 1185040
51542 1185040 1130600 1072643 1013336 954240 896749 842489 793011 749197 711225 679010 652310
51531 652310 630484 612580 597667 584762 572575 560029 547252 535521 525900 518308 512049 506630
51519 506630 501656 496584 491284 486446 482804 480193 477980 476113 474989 474435 473631 472110 470173 468222 466349
51504 466349 464759 463957 464155 464975 466106 467922 470982 475123 479306 482284 483286 482269 479828 476854 474160
51489 474160 472231 471164 470670 470264 469640 468767 467502 465334 461810 457045 451521 445582 439524 433908 429180
51474 429180 425053 420866 416537 412574 409134 405803 402506 399848 398062 396286 393541 390075 387097 385317
51460 385317 384256 382949 380870 378200 375609 373893 373491 374207 375510 377203 379638 383201 387627 392021 395758
$$ packed form
51553A064629O1263O0633N4609M3085K7912J1699l652j7399k9482l9895m8362
51542A185040n4440n7957n9307n9096n7491n4260m9478m3814l7972l2215k6700
51531F52310k1826j7904j4913j2905j2187j2546j2777j1731r621p592o259n419
51519E06630m974n072n300m838l642k611k213j867j124n54q04j521j937j951j873
51504D66349j590q02J98Q20J131J816L060M141M183K978J002j017k441k974k694
51489D74160j929j067m94m06o24q73j265k168l524m765n524n939o058n616m728
51474D29180m127m187m329l963l440l331l297k658j786j776k745l466k978j780
51460C85317j061j307k079k670k591j716m02P16J303J693K435L563M426M394L737
$$ plain form
51445 395758 399367 404320 411757 421601 433302 447213 464533 485482 507867 527904 542543 551015
51433 551015 554520 554910 553752 552164 550854 549782 547752 542774 533420 520031 504514 489028 474987
51420 474987 463070 453541 446237 440500 435509 430799 426548 423432 422059 422315 423383 424639 426448 429626
51406 429626 434109 438683 442245 444996 448076 452308 457627 463532 469643 475716 481462 486624 491257 495758
51392 495758 500495 505470 510574 516168 523109 532065 543108 556177 571634 590006 611613 637139 668375
51379 668375 707626 756005 812655 875801 944304 1018162 1097765 1182402 1268769 1350660 1420678
51368 1420678 1472965 1504771 1516119 1508719 1485033 1447311 1396930 1335002 1263836 1187274 1109288
51357 1109288 1032632 959078 890277 827687 771938 722838 680016 643266 612392 586974 566189
$$ packed form
51445C95758L609M953P437R844J1701J3911J7320K0949K2385K0037J4639Q472
51433E51015L505L90j158j588j310j072k030m978r354j3389j5517j5486j4041
51420D74987j1917r529p304n737m991m710m251l116j373K56J068J256J809L178
51406D29626M483M574L562K751L080M232N319N905O111O073N746N162M633M501
51392D95758M737M975N104N594O941Q956J1043J3069J5457J8372K1607K5526L1236
51379F68375L9251M8379N6650O3146O8503P3858P9603Q4637Q6367Q1891P0018
51368A420678N2287L1806J1348p400k3686l7722n0381o1928p1166p6562p7986
51357A109288p6656p3554o8801o2590n5749m9100m2822l6750l0874k5418k0785
$$ plain form
51346 566189 548760 533384 519399 506803 495552 485285 475938 468021 461810 456657 451711 447019 443333
51333 443333 440915 439107 437081 434559 431733 428886 426153 423340 419875 415289 409876 404682 400680 398071
51319 398071 396414 395249 394407 393786 393055 391804 390061 388486 387881 388566 390330 392886 396048 399502 402742
51304 402742 405417 407578 409493 411426 413625 416312 419568 423290 427199 430712 432983 433472 432497 430889 429098
51289 429098 426934 424080 420402 415790 410310 404664 399932 396673 394758 394257 395847 399908 405705 411897
51275 411897 417521 422124 425358 427009 427254 426496 425068 423370 422034 421562 421950 422973 424687 427397 431178
51260 431178 435489 439168 440900 440177 437890 435551 433696 431546 428393 424773 421866 420213 419378 418472 416655
51245 416655 413586 409884 406819 405168 404609 404460 404489 404642 404595 404170 403778 403935 404663 405811 407405 409109 409958
$$ packed form
51346E66189j7429j5376j3985j2596j1251j0267r347p917o211n153m946m692l686
51333D43333k418j808k026k522k826k847k733k813l465m586n413n194m002k609
51319C98071j657j165q42o21p31j251j743j575o05O85J764K556L162L454L240
51304D02742K675K161J915J933K199K687L256L722L909L513K271M89r75j608j791
51289D29098k164k854l678m612n480n646m732l259j915n01J590M061N797O192
51275D11897N624M603L234J651K45p58j428j698j336m72L88J023J714K710L781
51260D31178M311L679J732p23k287k339j855k150l153l620k907j653q35r06j817
51245D16655l069l702l065j651n59j49K9J53m7m25l92J57P28J148J594J704Q49
$$ plain form
51228 409958 409343 407867 406442 405040 403192 401256 400062 399506 398628 397143 395838 395313 395303 395532 396348 398049
51212 398049 400251 402370 404229 405776 406765 407119 407302 407960 409524 412297 416547 422099 428147 433843 438968
51197 438968 443833 448660 453218 456989 459520 460688 460655 459585 457484 454419 450732 446927 443458 440750 439081
51182 439081 438239 437561 436670 435835 435279 434518 432955 430769 428612 426668 424735 423054 422145 421819 421235 420171
51166 420171 419467 419820 420808 421618 422357 424109 427802 433321 439558 445147 449253 451783 452939 452793 451534 449721
51150 449721 447744 445232 441625 437350 433770 431816 431160 430833 430149 428881 427211 425816 425577 426819 429051
51135 429051 431579 434006 436011 437113 436925 435415 432819 429585 426433 424045 422553 421649 421162 421096 421125 420756
51119 420756 420163 420225 421457 423486 425888 428876 432684 436820 440538 443680 446517 449089 451226 453047 454894
$$ packed form
51228D09958o15j476j425j402j848j936j194n56q78j485j305n25j0K29Q16J701
51212C98049K202K119J859J547R89L54J83O58J564K773M250N552O048N696N125
51197D38968M865M827M558L771K531J168l3j070k101l065l687l805l469k708j669
51182D39081q42o78q91q35n56p61j563k186k157j944j933j681r09l26n84j064
51166D20171p04L53R88Q10P39J752L693N519O237N589M106K530J156j46j259j813
51150D49721j977k512l607m275l580j954o56l27o84j268j670j395k39J242K232
51135D29051K528K427K005J102j88j510k596l234l152k388j492r04m87o6K9l69
51119D20756n93O2J232K029K402K988L808M136L718L142K837K572K137J821J847
$$ plain form
51104 454894 456891 458979 461310 464207 467749 471650 475541 479147 482269 484774 486516 487232 486733 485276 483389
51089 483389 481191 478280 474571 470831 467992 466203 464943 463776 462530 460988 459055 457190 456138 456087 456474
51074 456474 456703 456758 456985 457588 458579 460050 462249 465328 469090 473031 476790 480607 485285 491577 499636 509248
51058 509248 520580 534442 551484 570943 590279 606437 617791 625057 630564 636985 646709 661416
51046 661416 681146 703681 725705 745148 762105 777283 789979 798031 799524 794237 783725 770538
51034 770538 757359 746196 737654 730537 722209 709879 692339 670831 648121 626598 607288 590429
51022 590429 576373 565554 557969 553180 550749 550384 551724 554347 558028 562838 568899 576175 584505 593695
51008 593695 603457 613389 623239 633329 644516 657393 671436 685250 697848 709414 720661 731847
$$ packed form
51104D54894J997K088K331K897L542L901L891L606L122K505J742P16m99j457j887
51089D83389k198k911l709l740k839j789j260j167j246j542j933j865j052n1L87
51074D56474K29N5K27O03R91J471K199L079L762L941L759L817M678O292Q059R612
51058E09248J1332J3862J7042J9459J9336J6158J1354P266N507O421R724J4707
51046F61416J9730K2535K2024J9443J6957J5178J2696Q052J493n287j0512j3187
51034G70538j3179j1163q542p117q328j2330j7540k1508k2710k1523j9310j6859
51022E90429j4056j0819p585m789k431l65J340K623L681M810O061P276Q330R190
51008E93695R762R932R850J0090J1187J2877J4043J3814J2598J1566J1247J1186
$$ plain form
50996 731847 742873 753946 765468 777255 788470 798479 807308 815211 822207 828140 832756 835654 836612
50983 836612 836180 835501 835430 836240 838246 842071 848008 855624 864352 873921 883887 893373 902025 910919 921879
50968 921879 936038 953604 974797 1000299 1030693 1065996 1105952 1150343 1198800 1250662 1305285
50957 1305285 1362323 1421392 1481618 1541780 1600918 1658470 1713662 1765132 1811607 1852973 1890235
50946 1890235 1924281 1955093 1982448 2006880 2029535 2051624 2074653 2100656 2130793 2163388 2194260
50935 2194260 2219574 2238003 2250142 2256830 2258710 2256670 2251522 2243126 2230304 2211729 2186743 2155420
50923 2155420 2118031 2074411 2023894 1966204 1902403 1834505 1764127 1692162 1619936 1549828 1484085
50912 1484085 1423502 1367766 1316571 1269740 1226754 1187102 1150993 1118981 1090880 1065665 1042440
$$ packed form
50996G31847J1026J1073J1522J1787J1215J0009Q829P903O996N933M616K898R58
50983H36612m32o79p1Q10K006L825N937P616Q728R569R966R486Q652Q894J0960
50968I21879J4159J7566K1193K5502L0394L5303L9956M4391M8457N1862N4623
50957A305285N7038N9069O0226O0162N9138N7552N5192N1470M6475M1366L7262
50946A890235L4046L0812K7355K4432K2655K2089K3029K6003L0137L2595L0872
50935B194260K5314J8429J2139O688J880k040n148q396j2822j8575k4986l1323
50923B155420l7389m3620n0517n7690o3801o7898p0378p1965p2226p0108o5743
50912A484085o0583n5736n1195m6831m2986l9652l6109l2012k8101k5215k3225
$$ plain form
50901 1042440 1020967 1001162 982706 965395 949538 935657 923883 913691 904262 895201 886968 880382
50889 880382 875633 872032 868860 866015 863658 861711 860150 859383 859746 860926 862370 864057 866376 869499 873416
50874 873416 878348 884486 891468 898748 906383 914863 924268 934348 945428 958441 973804 990884 1008938
50861 1008938 1028081 1049003 1072135 1097483 1125095 1155411 1189236 1227502 1270865 1319497 1373445
50850 1373445 1433164 1499393 1572569 1652787 1740394 1836078 1940090 2051717 2169844 2293783
50840 2293783 2423214 2557479 2695174 2834183 2971737 3104479 3228850 3341735 3440852 3524798
50830 3524798 3593093 3646344 3686185 3714747 3734058 3745973 3752645 3756884 3761941 3771095 3787412 3813398
50818 3813398 3850117 3896503 3949748 4006221 4061458 4109517 4143601 4158339 4151315 4122110 4070424
$$ packed form
50901A042440k1473j9805j8456j7311j5857j3881j1774j0192r429r061q233o586
50889H80382m749l601l172k845k357j947j561p67L63J180J444J687K319L123L917
50874H73416M932O138O982P280P635Q480R405J0080J1080J3013J5363J7080J8054
50861A008938J9143K0922K3132K5348K7612L0316L3825L8266M3363M8632N3948
50850A373445N9719O6229P3176Q0218Q7607R5684J04012J11627J18127J23939
50840B293783J29431J34265J37695J39009J37554J32742J24371J12885R9117Q3946
50830C524798O8295N3251L9841K8562J9311J1915O672M239N057R154J6317K5986
50818C813398L6719M6386N3245N6473N5237M8059L4084J4738p024k9205n1686
$$ plain form
50807 4070424 3995806 3898744 3781021 3645040 3493579 3330359 3160147 2987905 2818052 2654423
50797 2654423 2500196 2357444 2227072 2109448 2004834 1913069 1833258 1764211 1705143 1655790
50787 1655790 1615907 1584779 1561132 1543449 1530474 1521393 1515473 1511570 1508241 1504326 1499294 1493033 1485503
50774 1485503 1476568 1466115 1454349 1442027 1430071 1418641 1406720 1392987 1376960 1358963 1339185
50763 1339185 1317365 1293481 1268303 1243033 1218655 1195626 1173878 1153078 1133254 1115255 1100208
50752 1100208 1088431 1079230 1071933 1066673 1063911 1063582 1065101 1068124 1072978 1080439 1091208 1105484 1122910
50739 1122910 1143059 1166193 1193380 1225701 1263397 1305968 1353009 1404751 1461701 1523821 1590083
50728 1590083 1658850 1728768 1799261 1870135 1940813 2010201 2077336 2141934 2204183 2264040 2320772
$$ packed form
50807D070424p4618r7062j17723j35981j51461j63220j70212j72242j69853j63629
50797B654423j54227j42752j30372j17624j04614r1765p9811o9047n9068m9353
50787A655790l9883l1128k3647j7683j2975r081n920l903l329l915n032o261p530
50774A485503q935j0453j1766j2322j1956j1430j1921j3733j6027j7997j9778
50763A339185k1820k3884k5178k5270k4378k3029k1748k0800j9824j7999j5047
50752A100208j1777r201p297n260k762l29J519L023M854P461J0769J4276J7426
50739A122910K0149K3134K7187L2321L7696M2571M7041N1742N6950O2120O6262
50728A590083O8767O9918P0493P0874P0678O9388O7135O4598O2249N9857N6732
$$ plain form
50717 2320772 2372993 2418949 2456787 2484766 2501557 2506688 2500910 2486180 2465248 2441262 2417566 2397427
50705 2397427 2383529 2377558 2380135 2390946 2408948 2432820 2461450 2493756 2527807 2560383 2587638 2606006
50693 2606006 2612272 2603401 2577101 2532767 2471614 2396086 2309537 2216143 2120167 2024921 1932717 1845713
50681 1845713 1766061 1695078 1632950 1579699 1535869 1501791 1476742 1459592 1450046 1448543 1455002 1468374
50669 1468374 1487553 1512075 1541538 1574704 1609549 1643985 1676302 1705212 1730025 1750884 1768550
50658 1768550 1783885 1797614 1810418 1822871 1835213 1847509 1860067 1873319 1887162 1900858 1913913
50647 1913913 1926787 1940521 1956123 1974720 1997780 2026320 2060082 2098228 2140768 2188474 2241332
50636 2241332 2298013 2357163 2418277 2480699 2542442 2600882 2654431 2703121 2747827 2789557 2829535
$$ packed form
50717B320772N2221M5956L7838K7979J6791N131n778j4730k0932k3986k3696k0139
50705B397427j3898n971K577J0811J8002K3872K8630L2306L4051L2576K7255J8368
50693B606006O266q871k6300m4334o1153p5528q6549r3394r5976r5246r2204q7004
50681A845713p9652p0983o2128n3251m3830l4078k5049j7150r546j503O459J3372
50669A468374J9179K4522K9463L3166L4845L4436L2317K8910K4813K0859J7666
50658A768550J5335J3729J2804J2453J2342J2296J2558J3252J3843J3696J3055
50647A913913J2874J3734J5602J8597K3060K8540L3762L8146M2540M7706N2858
50636B241332N6681N9150O1114O2422O1743N8440N3549M8690M4706M1730L9978
$$ plain form
50625 2829535 2869770 2913113 2961469 3012024 3054637 3074780 3061534 3014036 2940850 2854248 2765332
50614 2765332 2682382 2610565 2551919 2506316 2473132 2451741 2440758 2437852 2440663 2447330 2455984 2464285
50602 2464285 2469571 2468890 2458911 2436679 2400894 2352190 2292203 2222886 2146667 2066378 1984627 1903567
50590 1903567 1825211 1751306 1682676 1619288 1561192 1508890 1462628 1421924 1386068 1354554 1326820
50579 1326820 1302088 1279782 1259657 1241323 1224108 1207674 1192358 1178762 1167377 1158722 1153200 1150657
50567 1150657 1150599 1153031 1158400 1166435 1175800 1185497 1196066 1208851 1224454 1242525 1262808 1285771 1312192
50554 1312192 1342478 1376390 1413208 1452202 1492882 1534610 1576039 1615412 1651553 1684272 1713761
50543 1713761 1740183 1764005 1786208 1807913 1830244 1854772 1883487 1917863 1958272 2004623 2057190
$$ packed form
50625B829535M0235M3343M8356N0555M2613K0143j3246m7498p3186q6602q8916
50614B765332q2950p1817n8646m5603l3184k1391j0983k906K811O667Q654Q301
50602B464285N286o81r979k2232l5785m8704n9987o9317p6219q0289q1751q1060
50590A903567p8356p3905o8630o3388n8096n2302m6262m0704l5856l1514k7734
50579A326820k4732k2306k0125j8334j7215j6434j5316j3596j1385q655n522k543
50567A150657n8K432N369Q035R365R697J0569J2785J5603J8071K0283K2963K6421
50554A312192L0286L3912L6818L8994M0680M1728M1429L9373L6141L2719K9489
50543A713761K6422K3822K2203K1705K2331K4528K8715L4376M0409M6351N2567
$$ plain form
50532 2057190 2116536 2183066 2257057 2338828 2428661 2526970 2634714 2753051 2882148 3020746
50522 3020746 3167144 3319953 3477347 3636251 3793027 3944665 4088640 4221957 4341043
50513 4341043 4442464 4523201 4580522 4612405 4618149 4598084 4552784 4483180 4391437 4281135 4156358
50502 4156358 4021063 3879467 3736636 3598289 3469927 3356032 3259854 3183754 3129625 3098783
50492 3098783 3091444 3106582 3142279 3195774 3262858 3337427 3411846 3477684 3526466 3550861 3546167 3510871
50480 3510871 3445793 3353332 3237774 3105374 2962807 2815262 2666337 2519262 2377239 2242493
50470 2242493 2115867 1997731 1888882 1790282 1702342 1624742 1556732 1497303 1445214 1399123 1357878
50459 1357878 1320854 1288152 1260368 1237938 1220636 1207736 1198567 1192899 1190896 1192783 1198405 1207049
$$ packed form
50532B057190N9346O6530P3991Q1771Q9833R8309J07744J18337J29097J38598
50522C020746J46398J52809J57394J58904J56776J51638J43975J33317J19086
50513D341043J01421Q0737N7321L1883N744k0065m5300o9604r1743j10302j24777
50502D156358j35295j41596j42831j38347j28362j13895r6178p6100n4129l0842
50492C098783p339J5138L5697N3495O7084P4569P4419O5838M8782K4395m694l5296
50480C510871o5078r2461j15558j32400j42567j47545j48925j47075j42023j34746
50470B242493j26626j18136j08849r8600q7940p7600o8010n9429n2089m6091m1245
50459A357878l7024l2702k7784k2430j7302j2900r169n668k003J887N622Q644
$$ plain form
50447 1207049 1217774 1229805 1242351 1254277 1264619 1273539 1282145 1291153 1300329 1309505 1319228 1329714
50435 1329714 1339836 1348090 1354230 1359123 1363366 1367008 1370483 1374684 1379892 1385551 1391456 1398385 1407186 1417853
50421 1417853 1430029 1443994 1460622 1480608 1504158 1531296 1562089 1596656 1635160 1677832 1724974
50410 1724974 1777070 1834762 1898417 1967560 2040966 2117367 2195733 2274738 2352378 2426610 2496294
50399 2496294 2561153 2620758 2673780 2718300 2752526 2774952 2783969 2777793 2755125 2715905 2661352 2593474
50387 2593474 2514794 2428359 2337501 2245435 2155301 2070531 1994514 1929448 1875783 1833225 1802119
50376 1802119 1783500 1777948 1784811 1802468 1828842 1861350 1896630 1930607 1959059 1978287 1985505 1978948
50364 1978948 1958073 1923887 1878800 1825576 1766220 1702104 1635027 1567502 1501705 1438607 1378478
$$ packed form
50447A207049J0725J2031J2546J1926J0342Q920Q606R008R176R176R723J0486
50435A329714J0122Q254O140M893M243L642L475M201N208N659N905O929Q801J0667
50421A417853J2176J3965J6628J9986K3550K7138L0793L4567L8504M2672M7142
50410A724974N2096N7692O3655O9143P3406P6401P8366P9005P7640P4232O9684
50399B496294O4859N9605N3022M4520L4226K2426R017o176k2668l9220n4553o7878
50387B593474p8680q6435r0858r2066r0134q4770p6017o5066n3665m2558l1106
50376A802119j8619n552O863J7657K6374L2508L5280L3977K8452J9228P218o557
50364A978948k0875l4186m5087n3224n9356o4116o7077o7525o5797o3098o0129
$$ plain form
50353 1378478 1321772 1269012 1220053 1174096 1130522 1089436 1051435 1017081 986586 959859 936873
50342 936873 917947 903394 892825 885148 879429 875492 873631 874139 877306 883359 892078 902888 915632
50329 915632 930873 949112 970199 993723 1019135 1044695 1066874 1081832 1087681 1085133 1076513 1064866
50317 1064866 1053371 1044266 1037924 1033403 1029806 1026734 1023876 1021116 1018974 1018044 1018017 1018093 1018299 1019491 1021875
50302 1021875 1024588 1027019 1029597 1032649 1035362 1036670 1036766 1037023 1038726 1042383 1047958 1055057 1062947 1070917 1078805
50287 1078805 1086915 1095548 1105013 1116146 1130153 1147118 1164455 1177365 1181681 1176741 1165425 1151505
50275 1151505 1137380 1124225 1113192 1105466 1101432 1100644 1102590 1106901 1112953 1120000 1127623 1135400 1142183
50262 1142183 1146555 1148196 1148074 1147098 1145346 1142812 1140089 1137705 1135380 1132479 1128791 1124447 1119573 1114603
$$ packed form
50353A378478n6706n2760m8959m5957m3574m1086l8001l4354l0495k6727k2986
50342I36873j8926j4553j0569p677n719l937j861N08L167O053Q719J0810J2744
50329I15632J5241J8239K1087K3524K5412K5560K2179J4958N849k548q620j1647
50317A064866j1495r105o342m521l597l072k858k760k142r30k7P6K06J192K384
50302A021875K713K431K578L052K713J308R6K57J703L657N575P099P890P970P888
50287A078805Q110Q633R465J1133J4007J6965J7337J2910M316m940j1316j3920
50275A151505j4125j3155j1033p726m034p88J946M311O052P047P623P777O783
50262A142183M372J641j22r76j752k534k723k384k325k901l688m344m874m970
$$ plain form
50248 1114603 1110531 1108159 1107310 1107300 1108079 1110414 1115107 1122601 1133324 1147822 1166406 1189048 1215720 1246372
50234 1246372 1280241 1315495 1349964 1382283 1412135 1439529 1464285 1486411 1506631 1526054 1545286
50223 1545286 1564005 1581234 1595504 1604724 1606534 1599272 1582453 1556308 1521519 1479873 1434590 1389075
50211 1389075 1345363 1304246 1266648 1234124 1208034 1188857 1176211 1168556 1162608 1153955 1139118 1117163
50199 1117163 1089406 1058149 1025888 994958 967028 942705 921718 903434 887200 872624 859730
50188 859730 848623 838875 829532 819878 809961 800289 791322 783366 776555 770644 765057 759380 753667 748192
50174 748192 743184 738837 735241 732163 729252 726627 724871 724233 724154 723867 723149 722248 721420 720912 721134 722407
50158 722407 724608 727388 730652 734593 739317 744825 751358 759457 769420 780742 792247 802868 812195
$$ packed form
50248A114603m072k372q49j0P79K335M693P494J0723J4498J8584K2642K6672L0652
50234A246372L3869L5254L4469L2319K9852K7394K4756K2126K0220J9423J9232
50223A545286J8719J7229J4270R220J810p262j6819k6145l4789m1646m5283m5515
50211A389075m3712m1117l7598l2524k6090j9177j2646p655n948q653j4837k1955
50199A117163k7757l1257l2261l0930k7930k4323k0987j8284j6234j4576j2894
50188H59730j1107r748r343r654r917r672q967p956o811n911n587n677n713n475
50174G48192n008m347l596l078k911k625j756o38p9k87p18r01q28n08K22J273
50158G22407K201K780L264L941M724N508O533Q099R963J1322J1505J0621R327
$$ plain form
50145 812195 820174 826379 829990 830695 829197 826469 822750 817827 812132 806898 803107 800882 800214 801791 806717
50130 806717 815548 827888 842782 859348 877186 896461 917699 941636 969308 1001978 1040506 1084781
50118 1084781 1133985 1187274 1243694 1301540 1358488 1412772 1464090 1513339 1561869 1611036 1661888
50107 1661888 1714757 1768975 1822773 1873113 1915814 1946542 1962216 1961615 1945084 1914278 1872006 1821332
50095 1821332 1764346 1702137 1636094 1568632 1502366 1439163 1380327 1327215 1281093 1242605 1211672
50084 1211672 1187615 1169116 1154374 1141700 1129953 1118467 1107013 1096030 1086443 1078993 1073987 1071628
50072 1071628 1071966 1074280 1077193 1079862 1082527 1085519 1088308 1090082 1090776 1090818 1090061 1087613 1082667 1075132 1065664
50057 1065664 1055379 1045272 1035460 1025221 1014103 1002755 992319 983395 976022 970262 966154 963340
$$ packed form
50145H12195P979O205L611P05j498k728l719m923n695n234l791k225o68J577M926
50130H06717Q831J2340J4894J6566J7838J9275K1238K3937K7672L2670L8528M4275
50118A084781M9204N3289N6420N7846N6948N4284N1318M9249M8530M9167N0852
50107A661888N2869N4218N3798N0340M2701L0728J5674o01j6531l0806m2272n0674
50095A821332n6986o2209o6043o7462o6266o3203n8836n3112m6122l8488l0933
50084A211672k4057j8499j4742j2674j1747j1486j1454j0983r587p450n006k359
50072A071628L38K314K913K669K665K992K789J774O94M2p57k448m946p535r468
50057A065664j0285j0107r812j0239j1118j1348j0436q924p373n760m108k814
$$ plain form
50045 963340 961391 960430 960890 962789 965855 970252 976607 985228 995847 1008135 1021906 1036713 1051829
50032 1051829 1066916 1082258 1098053 1113778 1128620 1142283 1155001 1166785 1176979 1184696 1189558 1191924
50020 1191924 1192427 1191457 1189186 1185924 1182081 1177681 1172137 1164713 1155139 1143720 1131037 1117781 1104807
50007 1104807 1093146 1083801 1077432 1074203 1074070 1077360 1084976 1097849 1116382 1140688 1171108 1207802 1249713
49994 1249713 1294378 1338996 1381433 1420343 1455058 1485824 1513811 1540467 1566721 1592489 1616153
49983 1616153 1634304 1642664 1637907 1618669 1585156 1538742 1482319 1420091 1356003 1292469 1230990 1173417
49971 1173417 1121717 1076737 1037954 1004430 975431 950154 927629 907172 888654 872187 857845
49960 857845 845727 835992 828640 823374 819758 817549 816998 818816 823581 831123 840790 852369 866271 882535
$$ packed form
50045I63340j949r61M60J899L066M397O355Q621J0619J2288J3771J4807J5116
50032A051829J5087J5342J5795J5725J4842J3663J2718J1784J0194P717M862K366
50020A191924N03r70k271l262l843m400n544p424r574j1419j2683j3256j2974
50007A104807j1661r345o369l229j33L290P616J2873J8533K4306L0420L6694M1911
49994A249713M4665M4618M2437L8910L4715L0766K7987K6656K6254K5768K3664
49983A616153J8151Q360m757j9238l3513m6414n6423o2228o4088o3534o1479n7573
49971A173417n1700m4980l8783l3524k8999k5277k2525k0457j8518j6467j4342
49960H57845j2118r735p352n266l616k209n51J818M765P542R667J1579J3902J6264
$$ plain form
49946 882535 900005 916842 931506 943027 950855 955117 956787 957020 956277 954336 950827 945280 936848 924610
49932 924610 908275 888348 865775 841733 817600 794569 773099 752975 733985 716485 701315
49921 701315 689219 680195 673441 668203 664643 663406 664324 666176 668007 670030 672777 675990 679023 681913
49907 681913 685336 689821 695631 703103 712372 722913 734112 746351 760980 779143 800866 824975
$$ packed form
49946H82535J7470J6837J4664J1521P828M262J670K33p43j941l509n547q432j2238
49932I24610j6335j9927k2573k4042k4133k3031k1470k0124j8990j7500j5170
49921G01315j2096r024o754n238l560j237R18J852J831K023K747L213L033K890
49907F81913L423M485N810P472R269J0541J1199J2239J4629J8163K1723K4109
$$ [...]
##END NTUPLES=NMR SPECTRUM
##END=
