
##TITLE=UV1244_M9_1261-1207_20_7241261_aUttAETxPP
##JCAMPDX= 6.0         $$ Bruker NMR JCAMP-DX V2.0
##DATA TYPE= NMR SPECTRUM
##DATA CLASS= NTUPLES
##ORIGIN= BRUKER
##OWNER= Administrator
$$ 1.72 TOPSPIN		Version 2.1
$$ 2013-01-19 03:37:15.587 -0500  Administrator@X
$$ Compression mode = diff/dup
##.OBSERVE FREQUENCY= 400.02188249412
##.OBSERVE NUCLEUS= ^1H
##.ACQUISITION MODE= SIMULTANEOUS (DQD)
##.ACQUISITION SCHEME= undefined
##.AVERAGES= 8
##.DIGITISER RES= 22
##SPECTROMETER/DATA SYSTEM= spect
##.PULSE SEQUENCE= zg30
##.SOLVENT NAME= COFFEE_meoh
##.SHIFT REFERENCE= INTERNAL, COFFEE_meoh, 1, 14.98509
##AUDIT TRAIL= $$ (NUMBER, WHEN, WHO, WHERE, PROCESS, VERSION, WHAT)
$$ ##TITLE= Audit trail, TOPSPIN		Version 2.1
$$ ##JCAMPDX= 5.01
$$ ##ORIGIN= Bruker BioSpin GmbH
$$ ##OWNER= Administrator
$$ $$ E:\/data/COFFEE/nmr/UV1244_M9_1261-1207_20_7241261_aUttAETxPP/20/pdata/1/auditp.txt
$$ ##AUDIT TRAIL=  $$ (NUMBER, WHEN, WHO, WHERE, PROCESS, VERSION, WHAT)
(   1,<2013-01-19 03:37:07.587 -0500>,<Administrator>,<X>,<go>,<TOPSPIN 2.1>,
      <created by zg
	started at 2013-01-19 03:36:00.259 -0500,
	POWCHK enabled, PULCHK disabled,
       configuration hash MD5:
       86 BA 57 50 F2 9D 5C 9B 26 00 A9 28 5F 66 2E 89
       data hash MD5: 64K
       05 43 3B 7B 78 0E B9 D4 87 F4 86 C6 74 A3 EE 11>)
(   2,<2013-01-19 03:37:10.618 -0500>,<Administrator>,<X>,<proc1d>,<TOPSPIN 2.1>,
      <Start of raw data processing
       efp LB = 0 FT_mod = 6 PKNL = 1 PHC0 = 0 PHC1 = 0 SI = 32K 
       data hash MD5: 32K
       DC BE C2 AF 60 0B EB EC D3 90 03 07 64 30 1F 7C>)
(   3,<2013-01-19 03:37:11.087 -0500>,<Administrator>,<X>,<proc1d>,<TOPSPIN 2.1>,
      <pk PHC0 = 96.50391 PHC1 = 0 
       data hash MD5: 32K
       EB FC 03 E4 C2 43 10 85 86 5C 5D F1 6D 09 0F 1B>)
(   4,<2013-01-19 03:37:11.321 -0500>,<Administrator>,<X>,<proc1d>,<TOPSPIN 2.1>,
      <abs ABSG = 1 
       data hash MD5: 32K
       AF 03 55 20 70 F3 DD F5 02 78 86 BA 4C C1 E7 60>)
(   5,<2013-01-19 03:37:11.462 -0500>,<Administrator>,<X>,<proc1d>,<TOPSPIN 2.1>,
      <abs ABSG = 2 
       data hash MD5: 32K
       F4 4C EF 93 3E 9A C6 4F 3D F2 83 3E F3 CD 58 B6>)
(   6,<2013-01-19 03:37:11.618 -0500>,<Administrator>,<X>,<proc1d>,<TOPSPIN 2.1>,
      <abs ABSG = 3 
       data hash MD5: 32K
       3C C4 AA 58 A1 24 8A 51 D2 00 E0 59 E1 A5 23 20>)
(   7,<2013-01-19 03:37:11.759 -0500>,<Administrator>,<X>,<proc1d>,<TOPSPIN 2.1>,
      <abs ABSG = 4 
       data hash MD5: 32K
       6A 69 D7 60 F7 61 7F ED 7D 0C 49 C4 08 C2 6C DA>)
(   8,<2013-01-19 03:37:11.915 -0500>,<Administrator>,<X>,<proc1d>,<TOPSPIN 2.1>,
      <abs ABSG = 5 
       data hash MD5: 32K
       8F 5D BF AF AE 5A D6 9B 5E 72 29 80 86 AB A4 88>)
$$ ##END=
$$ 
$$ $$ hash MD5
$$ $$ BD 2A EC 93 C6 D6 70 2C 5C 22 E4 B4 5F 43 D8 C7
##$RELAX= 
##$RELAX= 
##$RELAX= 
##$RELAX= 
##$RELAX= 
##$RELAX= 
##$RELAX= 
$$ Bruker specific parameters
$$ --------------------------
##$DU= <E:\>
##$EXPNO= 20
$$ [...]
##$TP= (0..7)
150 150 150 150 150 150 150 150
##$TP07= 0
##$TPNAME0= <>
##$TPNAME1= <>
##$TPNAME2= <>
##$TPNAME3= <>
##$TPNAME4= <>
##$TPNAME5= <>
##$TPNAME6= <>
##$TPNAME7= <>
##$TPOAL= (0..7)
0.5 0.5 0.5 0.5 0.5 0.5 0.5 0.5
##$TPOFFS= (0..7)
0 0 0 0 0 0 0 0
##$TUNHIN= 0
##$TUNHOUT= 0
##$TUNXOUT= 0
##$USERA1= <user>
##$USERA2= <user>
##$USERA3= <user>
##$USERA4= <user>
##$USERA5= <user>
##$V9= 5
##$VALIST= <valist>
##$VCLIST= <CCCCCCCCCCCCCCC>
##$VD= 0
##$VDLIST= <DDDDDDDDDDDDDDD>
##$VPLIST= <PPPPPPPPPPPPPPP>
##$VTLIST= <TTTTTTTTTTTTTTT>
##$WBST= 1024
##$WBSW= 4
##$XGAIN= (0..3)
0 0 0 0
##$XL= 0
##$YL= 0
##$YMAX_a= 652776
##$YMIN_a= -554122
##$ZGOPTNS= <>
##$ZL1= 120
##$ZL2= 120
##$ZL3= 120
##$ZL4= 120
##$ABSF1= 14.98509
##$ABSF2= -5.573092
##$ABSG= 5
##$ABSL= 3
##$ALPHA= 0
##$AQORDER= 0
##$ASSFAC= 0
##$ASSFACI= 0
##$ASSFACX= 0
##$ASSWID= 0
##$AUNMP= <proc_prof1d_extract_pilot.lims>
##$AXLEFT= 0
##$AXNAME= <>
##$AXNUC= <1H>
##$AXRIGHT= 0
##$AXTYPE= 0
##$AXUNIT= <>
##$AZFE= 0.1
##$AZFW= 0.1
##$BCFW= 0
##$BC_mod= 0
##$BYTORDP= 0
##$COROFFS= 0
##$CY= 15
##$DATMOD= 1
##$DC= 0
##$DFILT= <>
##$DTYPP= 0
##$F1P= 0
##$F2P= 0
##$FCOR= 0.5
##$FTSIZE= 32768
##$FT_mod= 6
##$GAMMA= 0
##$GB= 0
##$INTBC= 1
##$INTSCL= 1
##$ISEN= 128
##$LB= 0
##$LEV0= 0
##$LPBIN= 0
##$MAXI= 10000
##$MC2= 0
##$MEAN= 0
##$ME_mod= 0
##$MI= 0
##$NCOEF= 0
##$NC_proc= -8
##$NLEV= 6
##$NOISF1= 0
##$NOISF2= 0
##$NSP= 0
##$NTH_PI= 0
##$NZP= 0
##$OFFSET= 14.98509
##$PC= 1
##$PHC0= 96.50391
##$PHC1= 0
##$PH_mod= 1
##$PKNL= yes
##$PPARMOD= 0
##$PPDIAG= 0
##$PPIPTYP= 0
##$PPMPNUM= 2147483647
##$PPRESOL= 1
##$PSCAL= 4
##$PSIGN= 0
##$PYNMP= <proc.py>
##$REVERSE= no
##$SF= 400.02
##$SI= 32768
##$SIGF1= 0
##$SIGF2= 0
##$SINO= 400
##$SIOLD= 32768
##$SPECTYP= <>
##$SREGLST= <1H.CDCl3>
##$SSB= 0
##$STSI= 32768
##$STSR= 0
##$SW_p= 8223.68421052631
##$SYMM= 0
##$S_DEV= 0
##$TDeff= 65536
##$TDoff= 0
##$TI= <>
##$TILT= no
##$TM1= 0
##$TM2= 0
##$TOPLEV= 0
##$USERP1= <user>
##$USERP2= <user>
##$USERP3= <user>
##$USERP4= <user>
##$USERP5= <user>
##$WDW= 1
##$XDIM= 32768
##$YMAX_p= 455407249
##$YMIN_p= -724566
##$CURPLOT= <Network HP LaserJet P1505>
##$CURPRIN= <$Network HP LaserJet P1505>
##$DFORMAT= <normdp>
##$LAYOUT= <+/1D_H.xwp>
##$LFORMAT= <normlp>
##$PFORMAT= <normpl>
##$SURQMSG= 1
$$ End of Bruker specific parameters
$$ ---------------------------------
##NTUPLES= NMR SPECTRUM
##VAR_NAME=  FREQUENCY,     SPECTRUM/REAL,   SPECTRUM/IMAG
##SYMBOL=    X,             R,               I
##VAR_TYPE=  INDEPENDENT,   DEPENDENT,       DEPENDENT
##VAR_FORM=  AFFN,          ASDF,            ASDF
##VAR_DIM=   32768,         32768,           32768
##UNITS=     HZ,            ARBITRARY UNITS, ARBITRARY UNITS
##FACTOR=    0.250966925370066, 1,           1
##FIRST=     8223.43324360094, -130581,      56587
##LAST=      0,             -86241,          49473
##MIN=       0,             -724566,         0
##MAX=       8223.43324360094, 455407249,    0
$$ Real data points
##PAGE= N=1
##DATA TABLE= (X++(R..R)), XYDATA
$$ [...]
19535a49949G972h365j85319O4230r1102R8040K3134K1321B7088J21835e7160
19523c54550A62597a21240A11407a85247O0322J2183r2544J00413k95934A85291
19512a65830B79651A28875b62844e156j26459A38142c5477B65885b58260F7537
19501A93663a21002N7018j49039M5615j4067e4828C06049E8326K40790c2649A44892
19489D2834c92052A65494d0373j32049F5714K40795A02237a40091k29411B50339
19478a23365D1692h2433H30J17408d2314l0646j02543g0346k31286P2602A04873
19466c35199Q4942F5523a64287B42352a78805J0624P9648j70189p0608J10955
19456b18375c6174C88453G8742d4383C93406A66772d43709B42480a87675i0113
$$ y = [-149949, 7972, -8365, -193684, -129454, -220556, -122516, -99382, -78061, 27088, 148923, -57160, -354550, 162597, -121240, 111407, -185247, -124925, -112742, -205286, -104873, -400807, 185291, -165830, 279651, 128875, -262844, -5156, -131615, 138142, -35477, 265885, -258260, 67537, 193663, -121002, -63984, -213023, -167408, -181475, -54828, 306049, 58326, 299116, -32649, 144892, 42834, -392052, 165494, -40373, -172422, 65714, 306509, 102237, -140091, -369502, 250339, -123365, 41692, -82433, 830, 118238, -42314, -72960, -175503, -70346, -301632, -229030, 104873, -335199, -250257, 65523, -164287, 242352, -178805, -168181, -88533, -258722, -329330, -218375, -36174, 388453, 78742, -44383, 393406, 166772, -443709, 242480, -187675, -90113]
19445b32766f4641A07880P8708d17514D26962A66699b4843p1615A49166b55471
19434e6815a7584D33944A12963c05254c4970j51148H0378b5302i797o2600o6609
19423a39006f6350J7478G2382r689M6883b68420a17611b4511m1196B21536b00043
19411b63735G9831M4478b9581g007B0378a27799N6721A3413a0204k9524r0589
19400a30317a998p3759r1670l429L3625j37549M8299L0477C00462A14796b253
19388a77350A5471M2058O5967a3355l20879C6190J43857a66222o5182c0415j08032
19377a38447c6395j07579k0622e4381J3722o022l6406o8150L8075m756D11479
19365e60j53150f1600A10937a09186q6157h633j6447C58570b1949j4577a3917
$$ y = [-232766, -64641, 107880, 186588, -417514, 426962, 166699, -24843, -96458, 149166, -255471, -56815, -17584, 433944, 112963, -305254, -34970, -186118, 80378, -25302, -9797, -72397, -139006, -66350, -48872, 72382, 62693, 109576, -268420, -117611, -24511, -65707, 221536, -200043, -263735, 79831, 124309, -29581, -7007, 20378, -127799, -71078, 13413, -10204, -39728, -130317, -1998, -75757, -167427, -170856, -137231, -274780, -226481, -196004, 300462, 114796, -2253, -177350, 15471, 57529, 123496, -13355, -334234, 36190, 180047, -166222, -231404, -30415, -138447, -36395, -143974, -164596, -54381, -40659, -46681, -83087, -151237, -113162, -117918, 411479, -560, -153710, -61600, 110937, -109186, -195343, -8633, -25080, 358570, -21949, -36526, -13917]
19353a77602Q3461p1192j80727A99256C5361a10291b4460f463l03061E6262f6109
19341b34201m595h5231A94573g9212I6324J14688A798a6687q197j01660B40774
19329a16837G7143c82122J43068a02175C0497g8705d381j19329K1430a1605L483
19318h122j51848A93074b04093k3940O5797I18b71453e789o7815r7377L127P2548
19306i5306B86288b43276j9571L2172A34462A2173a03094A53509g6340j04240
19296a80580k33833A96383i6913k76993e8903K4663A44594a72210p5051B08933
19285E6631J87908a54735Q90B03277I6442h4061l97771f2650k7991A17014c0625
19273F8815J44801E0262b02741A31367b2726j30724K0029j55754J35865D8891
$$ y = [-177602, -94141, -165333, -346060, 199256, 35361, -110291, -24460, -6463, -309524, 56262, -66109, -234201, -238796, -85231, 194573, -79212, 96324, 211012, 1798, -16687, -24884, -126544, 240774, -116837, 77143, -382122, -239054, -102175, 30497, -78705, -4381, -123710, -102280, -11605, -8122, -159970, 193074, -204093, -228033, -162236, 918, -271453, -5789, -73604, -170981, -167854, -95306, 286288, -243276, -262847, -230675, 134462, 12173, -103094, 153509, -76340, -180580, -414413, 196383, -96913, -373906, -58903, -34240, 144594, -172210, -247261, 208933, 56631, 244539, -154735, -153845, 203277, 96442, -84061, -481832, -62650, -90641, 117014, -30625, 68815, 213616, 50262, -202741, 131367, -22726, -153450, -133421, -289175, -153310, 48891]
19262a84759j56379A28524i0037A96527L67156b18717j06368O1005J11988n6502
19252b08594A8612K22107a18186j57439C5355a17609B3589a31633n5805A28847
19241A9430a77524e0087n08088B7314a2873k74230C92859G7092j1136b46417i3764
19229a51385M139e7379A2714c42195I467J10398a67141C02982B7881J0645a36244
19217a73857A79342c58972J31904C4162K4094h3307E1732j4756q293O9219b2539
19205h224E4310c58553a31741F6157K98066c6753k25321K4373f0667R453k71775
19194c22989A48532a6214C6934J41092a15407c3099A3373a44230j98708A81255
19183E72K35789j7720b48838N2320M0785g2514k89896C2334b52475C499J09867
$$ y = [-184759, -341138, 128524, -90037, 196527, 563683, -218717, -325085, -264080, -152092, -208594, 18612, 240719, -118186, -275625, 35355, -117609, 23589, -131633, -187438, 128847, 19430, -177524, -50087, -558175, 27314, -12873, -287103, 392859, 77092, 65956, -246417, -93764, -151385, -147246, -57379, 12714, -342195, 9467, 119865, -167141, 302982, 27881, 38526, -136244, -173857, 179342, -358972, -227068, 34162, 58256, -83307, 51732, 36976, 28683, 97902, -22539, -8224, 54310, -358553, -131741, 66157, 364223, -36753, -262074, -237701, -60667, -51214, -322989, 148532, -16214, 36934, 178026, -115407, -33099, 13373, -144230, -342938, 181255, 572, 236361, 218641, -248838, -196518, -155733, -72514, -362410, 32334, -252475, 3499, 113366]
19172A13366e29233C2749d23465a14117L8523k52394B2911i0760m7427H4442g0416
19160i6854f889E4508Q4616b55352n5874d7508A704b1140b666I4922g2697B02718
19147B03970F8560h3046B7975E920j348c5960A898J44961d8625k45571E4434c0475
19134D1529a99726P7429E0958a54514q9942B54748E7454g4458L0993k76542J21030
19123a98977K2641a4533j5007C28127a65551B33653a18619k6275B52836c05229
19112i3841n1191A8357c22273A78559a29997o6748L0963A83450b32433j3012A11443
19100a693B5646K78778L0807A36245b26094j31603a36407f5919B10482k6517a77889
19088g594k15737k14823d4948n9468p765R730j8782b3692G5187K7872D0069H165
$$ y = [113366, -529233, 32749, -423465, -114117, -75594, -327988, 22911, -90760, -138187, 84442, -70416, -96854, -6889, 54508, 139124, -255352, -311226, -47508, 1704, -21140, -2666, 94922, -72697, 202718, 203970, 68560, -83046, 27975, 5920, 4572, -35960, 1898, 146859, -48625, -294196, 54434, -30475, 41529, -199726, -122297, 50958, -154514, -244456, 254748, 57454, -74458, -43465, -320007, -198977, -176336, -14533, -29540, 328127, -165551, 233653, -118619, -144894, 252836, -305229, -93841, -145032, 18357, -322273, 178559, -129997, -196745, -165782, 183450, -232433, -245445, 111443, -1693, 25646, 304424, 335231, 136245, -226094, -357697, -136407, -65919, 210482, 183965, -177889, -7594, -223331, -438154, -44948, -104416, -112181, -102451, -121233, -23692, 75187, 103059, 40069, 8165]
19075a01412a5726o8560F1870a08777a2689j38263k01929D8873a14905K3647k38156
19064c29414h6869B38901a35724B11744b15025j43588Q6933H2482a08009g669
19053d5196A03754j1945m0263K13067a70944G1979a95325D3301J1511Q9757g3052
19041b41614G6358a61312g178r5237j08875A9078a82813g3965B57230E9952A5440
19029a52902B34196P812p4221J10817K4685m6907a39517A3566f8960k0824j29196
19018b18980l43201A73223H2499c14105A09899D0584J44885B6056L265c09956
19007a16155j17540C2565c40383B1905b60808A32h3019k45165H4492h6491j16254
18996b02745g5055p7442D7246k3112a12766H3743b65924a73G3970J99533J66387
$$ y = [-101412, -15726, -84286, 61870, -108777, -12689, -150952, -352881, 48873, -114905, -91258, -329414, -86869, 238901, -135724, 211744, -215025, -358613, -271680, 82482, -108009, -7669, -45196, 103754, 91809, 51546, 264613, -170944, 71979, -195325, 43301, 54812, 144569, -73052, -241614, 76358, -161312, -7178, -102415, -211290, 19078, -182813, -73965, 257230, 59952, 15440, -152902, 234196, 242008, 167787, 278604, 303289, 256382, -139517, 13566, -68960, -89784, -218980, -562181, 173223, 82499, -314105, 109899, 40584, 185469, 26056, 29321, -309956, -116155, -233695, 32565, -340383, 21905, -260808, 132, -83019, -328184, 84492, -86491, -202745, -75055, -152497, 47246, 24134, -112766, 83743, -265924, -173, 73970, 273503, 439890]
18985D39890a60396G4482e0180A27541b32984o3574n6207E8497A8926f0473j70978
18974b31451o479B5788d432m3884l5234j11580O5131b762m1060j28998I8290g1543
18961b66662e947n6208J7850C55243b45206D8013N6876a14889N0599A82832c1421
18949A38380a33166G5996l1327J30533h3176A57093C6043d1181A28676A0670c03073
18937g7884A46117a36721d2738m00348B2290J46538A99K09031m2411D643K65699
18926B70342b66506i5151A62382b92057C00689n7930q3583b1620B4794b62444
18915C6526d01400e5143k0886k11839J13853o8355C9626a2253A22725i3511k46339
18904c39850J64631b0383d153H6230b15275g0981l2787A34146a7175A05618K0762
$$ y = [439890, -160396, 74482, -50180, 127541, -232984, -296558, -352765, 58497, 18926, -60473, -231451, -237930, 25788, -4432, -48316, -83550, -195130, -129999, -2762, -43822, -172820, 98290, -71543, -266662, -5947, -62155, -44305, 355243, -245206, 48013, 104889, -114889, -64290, 182832, -31421, 138380, -133166, 75996, 44669, 175202, -83176, 157093, 36043, -41181, 128676, 10670, -303073, -77884, 146117, -136721, -42738, -443086, 22290, 168828, 199, 209230, 166819, 4643, 270342, -266506, -95151, 162382, -292057, 300689, 242759, 159176, -21620, 24794, -262444, 36526, -401400, -55143, -76029, -287868, -174015, -242370, 39626, -12253, 122725, -93511, -339850, -175219, -20383, -4153, 86230, -215275, -70981, -103768, 134146, -17175, 105618, 126380]
18893A26380a1317m2634A17023j9680N9904b29851J0023h412A15108j7754b6264
18881A03858i59B4923a92543P3164M7057k7071b6550j06234B10558k2688N1243
18870B39113h3368j63208o3646F7404Q6725c73434e0740A65895o594J37829g2145
18858c3031A08806O0718c04799a6225j45641b2673p7978A22694K4770J18240a78756
18846B19660C2618K1153c19669c5960k44524J31429r4425f3009A55892a08149
18835H1683a74764O3776F0659A5304L34735a01609A82975m3275N0650f8525A78650
18823A66106m400g598l12043A483Q8629c7226j84679R4827C07269f6469c2678
18811C0519I809i691A6650d3188A31138b3989H8304c5810A18956a19272N587D7491
$$ y = [126380, -11317, -53951, 117023, 97343, 157247, -229851, -219828, -8412, 115108, 97354, -26264, 103858, -959, 24923, -192543, -119379, -72322, -99393, -26550, -132784, 210558, 187870, 239113, -83368, -246576, -310222, 67404, 154129, -373434, -50740, 165895, 159301, 297130, -72145, -33031, 108806, 169524, -304799, -16225, -161866, -22673, -100651, 122694, 147464, 265704, -178756, 219660, 32618, 53771, -319669, -35960, -280484, -149055, -243480, -63009, 155892, -108149, 81683, -174764, -110988, 60659, 15304, 350039, -101609, 182975, 139700, 190350, -68525, 178650, 166106, 161706, -7598, -319641, 1483, 90112, -37226, -221905, -127078, 307269, -66469, -32678, 30519, 9809, -9691, 16650, -43188, 131138, -23989, 88304, -35810, 118956, -119272, -113685, 47491]
18798A49162b92411A74648B1757a92978A35688b6751j05084l4453q4797f6575
18787c6616j30147b628j46740B2013p969a44985m5213K0725A74876f5566F2979
18775a02723J3592L9674J4520J3562G3580K9207J21286b60853b8705m1103o3154
18764a32962j48270C2392b4600D4809A3492i7496B7829g7112A01943c0695j50973
18753a81668B26594a37372A01935h7476A51223i8445F6933a02432j05782K3170
18743a85044l00138b9809B07570b04567A97560b30142j89114a53132l0174d5397
18732c25209C5648a44314A32578b30399J3056A21460c23366a01643q2767C34422
18721a87156B37789a6508j75576F015a95280B6663a54410o9948k1078j97637a99380
$$ y = [149162, -292411, 174648, 21757, -192978, 135688, -26751, -131835, -166288, -251085, -66575, -36616, -166763, -2628, -149368, 22013, 14044, -144985, -190198, -169473, 174876, -65566, 62979, -102723, -89131, -49457, -34937, -21375, 73580, 102787, 224073, -260853, -28705, -69808, -132962, -281232, 32392, -24600, 44809, 13492, -97496, 27829, -77112, 101943, -30695, -181668, 226594, -137372, 101935, -87476, 151223, -98445, 66933, -102432, -208214, -185044, -485182, -29809, 207570, -204567, 197560, -230142, -419256, -153132, -183306, -45397, -325209, 35648, -144314, 132578, -230399, -217343, 121460, -323366, -101643, -184410, 334422, -187156, 237789, -16508, -192084, 6015, -195280, 26663, -154410, -224358, -245436, -443073, -199380]
18709A24863m6915g3506B09266e38942A18691D2297a13136A52849K21127a59305
18698c05798a08999j2836l5426E6274A7978L4892a40245A04688d12053k1900B14671
18686c23127H9923c5232G8059a73864B4372b0620B9133b00301M4102f0403E5867
18674C8429N0009c28186A24773b483B6911N1434b61678A34329b80810G3670J8961
18663I2631K15584a79763P8592k6471A33425a15997j06652d7390r0092j6121C0679
18651G7785b77402G2379C3635b01293d6126A35079Q8225A11036a53221L7746d43
18639b35536L318O1819j8528j23681C8242J06005a21986j2720e6768k66427F3649
18627b72508A69938C5733B954i9201j56742O1206J4223D4494K63573j15339F6672
$$ y = [124863, 77948, -73506, 209266, -538942, 118691, 42297, -113136, 152849, 373976, -159305, -305798, -108999, -121835, -157261, 56274, 17978, 52870, -140245, 104688, -412053, -433953, 214671, -323127, 89923, -35232, 78059, -173864, 24372, -20620, 29133, -200301, -156199, -60403, 55867, 38429, 88438, -328186, 124773, -2483, 26911, 78345, -261678, 134329, -280810, 73670, 92631, 308215, -179763, -101171, -127642, 133425, -115997, -222649, -47390, -137482, -153603, 30679, 77785, -277402, 72379, 33635, -201293, -46126, 135079, 223304, 111036, -153221, -115475, -443, -235536, -232218, -170399, -188927, -312608, 38242, 144247, -121986, -134706, -56768, -323195, 63649, -272508, 169938, 35733, 2954, -99201, -255943, -194737, -180514, 44494, 308067, 192728, 66672]
18615b4166k97027a20043J6634m09189A33150b90838a10898F2010b20126A56557
18604b05189H0799J31441G4930J0843O8889c9227o7236A42099c861n4225m15958
18593d74044a7923H7766a14127p9624j01634K8701B45541j22296b30877e2682
18582A94618A7129b11059A97845b19167l516R0222k16749h8951j39094q1158j5455
18571c24658g637j82173H2136a75791c9838k0050n15207f0453J040j62784A00727
18559b5501k92139A51990a3947k58542e7637j84370d3396H1819M7393C0715R7609
18548A28324a90196r2088a32219n6803M6085d8212j21624g4490F6811k9302c1408
18536G2776J1725k0356J31591F2602a86166j9453E9198e8929o451k9932n460j30823
$$ y = [-24166, -321193, -120043, -103409, -512598, 133150, -290838, -110898, 62010, -220126, 156557, -205189, 80799, 212240, 74930, 85773, 154662, -39227, -106463, 142099, -3861, -58086, -474044, -17923, 87766, -114127, -193751, -295385, -266684, 245541, 123245, -230877, -52682, 194618, 17129, -211059, 197845, -219167, -222683, -132461, -349210, -88951, -228045, -309203, -324658, -7637, -189810, 82136, -175791, -39838, -59888, -575095, -60453, -59413, -222197, 100727, -25501, -317640, 151990, -13947, -272489, -57637, -242007, -43396, 81819, 129212, 30715, 128324, -190196, -282284, -132219, -189022, -142937, -48212, -169836, -74490, 66811, 37509, -31408, 72776, 84501, 64145, 195736, 62602, -186166, -205619, 59198, -58929, -65380, -95312, -100772, -231595]
18524b31595N442o1915m3776D5670A3309e2446k02166A63197a69950q893B76612
18512g6541A62910c3621j11967A59409a93027A0127f8549B5486L00783a54970
18501h5031F1210b59921J11406A61660c06184h9269A5745M8966c56540l7916O6632
18490c27824B22392d0112A05737A2688h9291j97661R5947R3486j05316N0591j11078
18479b63322F0408j6684b51778K5693A4599c9415j92798l8378K5234F4588C2035
18467c31251a9998B8581L14435c62796J5406A71096a87194Q0298B84193g4674
18456c3442N834E4204i2645F2873b63358J07595C8202J86767b8513l5183j53026
18445b16722q2118B0084g6421B02341a22196A7944b54895F8966L0387b44605g7254
$$ y = [-231595, -226153, -288068, -331844, 45670, 13309, -52446, -254612, 163197, -169950, -178843, 276612, -76541, 162910, -33621, -145588, 159409, -193027, 10127, -68549, 25486, 326269, -154970, -85031, 61210, -259921, -148515, 161660, -306184, -89269, 15745, 64711, -356540, -394456, -327824, 222392, -40112, 105737, 12688, -89291, -286952, -191005, -97519, -202835, -152244, -263322, 60408, 43724, -251778, -226085, 14599, -39415, -232213, -270591, -245357, 64588, 32035, -331251, -19998, 28581, 343016, -362796, -347390, 171096, -187194, -106896, 284193, -74674, -33442, -27608, 54204, -92645, 62873, -263358, -155763, 38202, 224969, -28513, -63696, -216722, -298840, 20084, -76421, 202341, -122196, 17944, -254895, 68966, 99353, -244605, -77254]
18433h2831A96316B1605J24337b83704A14762O4023p3843a16395d069A10422f4926
18421a46118c5847k89862a54994d4227j27501f7360n56B9899J0858c0404G8575
18409C74955A76357J68790b82268p918E344M3322j9969a91929c7682j83823L6507
18398a84998H6815C3186Q5394k3927O4805a52872o242f3570F9182a039j82003
18387a83042f9933k1314A613J04279f4766r3113H5389b1765E1580e69070B84346
18375G6998F56J28903h9746B72929a34769A97066b7799a2724A81268K69596C9418
18363B598P9899N5367g0735D569h7814j44457i9439C0608i3323o3717K7779C99951
18350h4321k22619Q7706O7077B3740a4796r669P512A17965k9821m2361b3811j39576
$$ y = [-82831, 196316, 21605, 145942, -283704, 114762, 178785, 104942, -116395, -4069, 110422, -64926, -146118, -35847, -325709, -154994, -44227, -171728, -67360, -67916, 29899, 40757, -30404, 78575, 374955, 176357, 345147, -282268, -290186, 5344, 48666, 28697, -191929, -37682, -221505, -184998, 86815, 33186, 118580, 94653, 159458, -152872, -159114, -63570, 69182, -1039, -183042, -69933, -91247, 1613, 105892, -64766, -157879, 85389, -21765, 51580, -569070, 284346, 76998, 656, 129559, -89746, 272929, -134769, 197066, -27799, -12724, 181268, 450864, 39418, 2598, 82497, 137864, -70735, 4569, -87814, -232271, -99439, 30608, -93323, -157040, -129261, 399951, -84321, -306940, -219234, -152157, 23740, -14796, -24465, -16953, 117965, 88144, 45783, -23811, -163387]
18338a63387j3314A7080a19150B9389B398N6778J81298b4204q333A56673a14944
18326H1343i4651j57652B32652e5127A07485a69609N1465j43545B23910n1951
18316A71959b50411C4716a51924B72441a60682A87516a30840N6745B15902E9190
18305B5031d4724l8567j2667E1311a30085f2583k68540c3743B47033b80069A70628
18293A25991a55117n1669c2493m5042L037A69601h4912c2907A45119n801c6566
18281B01139c11001a50110C324e7985j40009Q3604A02899a3319k75732g182m3342
18270e0524B61743a25103D9442K29111H413j073e1072C23129a03490l58105A20224
18258C15765I9553e4020j58808A03449g9364k07034A7045a47478A36494a57741
$$ y = [-163387, -176701, 17080, -119150, 29389, 2398, 59176, 240474, -24204, -32537, 156673, -114944, 81343, -94651, -252303, 232652, -55127, 107485, -169609, -118144, -261689, 223910, 171959, -250411, 34716, -151924, 272441, -160682, 187516, -130840, -74095, 215902, 59190, 25031, -44724, -83291, -95958, 51311, -130085, -62583, -331123, -33743, 247033, -280069, 170628, 125991, -155117, -206786, -32493, -77535, -74498, 169601, -84912, -32907, 145119, 139318, -36566, 201139, -311001, -150110, 3324, -57985, -197994, -114390, 102899, -13319, -289051, -7182, -50524, 261743, -125103, 49442, 278553, 8413, 7340, -51072, 323129, -103490, -461595, 120224, 315765, 99553, -54020, -212828, 103449, -79364, -286398, 17045, -147478, 136494, -157741]
18247A4542b59440A96843a95751A82910F2280J3821a25485j69770j9575O0813
18237b54017j15102k27146d575l31359J33956i603C53745a38460j500r2451D4617
18225C61263a3370m35005B9862a70392e7104n7665G2238a22422B90734j29370
18215A61364c1768A28972m6217o769B7559a48035f2002b0392C1597a54552P4184
18204h0368k17587A07876a25246j12947A56672J02308j12647D8218a34755d5293
18193a46305J7712C18237a83630d616m7566B19013g8269H6673l8227a94506H0666
18181a45075e808l9348j57232p3872l0744k3937h1132l00861B77355h5548k74229
18170c59777c2949k4346A21922K69047A77606c06472A8129K21843J0099o0461
$$ y = [14542, -259440, 196843, -195751, 182910, 62280, 76101, -125485, -295255, -314830, -254017, -369119, -596265, -4575, -335934, -201978, -9603, 353745, -138460, -139960, -232411, 44617, 361263, -13370, -448375, 29862, -170392, -57104, -114769, 72238, -122422, 290734, 161364, -31768, 128972, 82755, 75986, 27559, -148035, -62002, -20392, 31597, -154552, -80368, -297955, 107876, -125246, -238193, 156672, 258980, 146333, 48218, -134755, -45293, -146305, -128593, 318237, -183630, -4616, -52182, 219013, -78269, 86673, 48446, -194506, 80666, -145075, -5808, -45156, -202388, -276260, -307004, -330941, -81132, -381993, 277355, -85548, -359777, -32949, -57295, 121922, 390969, 177606, -306472, 18129, 239972, 250071, 189610]
18160A89610b20882j07280a3824k27625i2809C59655A54338k9382E8180a32521
18149h7004j17728e8691B0746a38755E807K37640A08141n3078a42109M8322F8346
18137C497J26759k1579K01063a29189C9387a34868k66814a057j43259F2792f0848
18125H9365P9021g8194I7298h6333R516c0232n3366j7933H5007b51220M038A5459
18112a56258A81170K43454a43345E4006F106a13969n2507K9191B51909j02036
18102A49873a3393A59867B0246d23640g3395B01103b73500J12242C15100b00116
18091A04672L9151j1214b19669c6407A04499J2987c7201B6500a04145n8223H7439
18079A48666b45121A61867f7352A30485b90063k3497J30205B13408p7646a54198
$$ y = [189610, -220882, -328162, -13824, -241449, -92809, 359655, 154338, 124956, 58180, -132521, -87004, -204732, -58691, 20746, -138755, 5807, 243447, 108141, 55063, -142109, -93787, 68346, 3497, 130256, 108677, 309740, -129189, 39387, -134868, -401682, -1057, -144316, 62792, -60848, 89365, 168386, -78194, 97298, -86333, -76817, -30232, -83598, -101531, 85007, -251220, -247182, 15459, -156258, 181170, 424624, -143345, 54006, 6106, -113969, -166476, -137285, 251909, 149873, -13393, 159867, 20246, -423640, -73395, 201103, -273500, -161258, 315100, -200116, 104672, 143823, 132609, -219669, -36407, 104499, 117486, -37201, 26500, -104145, -162368, 87439, 148666, -245121, 161867, -67352, 130485, -290063, -313560, -183355, 213408, 135762, -154198]
18068a8094A8214a24712A77730J82726a15258A37138b66914A37099b60417d5445
18057B27451A1044R7089h65B680a02407B28181b44891A49394a89904f6988A18164
18045E494M19182F518a02528F2692f3947j37739c9234k42122E5502b26523l573
18034b30096A6876J38266a86951D8593b08373f545j74751g881k2295A75344d5923
18022A98260I5940b29254j50853i38A18273b56954B27016d09317a39220g106A76180
18010e6315B7910a13790j2053j61664G6062K90665A65136p5407N8779a18587A41476
17998H2340c0607k87116F9934a4927j08823j3902c5822p5655B56209b0071A45988
17986H902K83653A25067A7459K06121d3109G8306e44121b52868b8440F4494D831
$$ y = [-18094, 18214, -124712, 177730, 360456, -115258, 137138, -266914, 137099, -260417, -45445, 227451, 11044, 108133, -865, 2680, -102407, 228181, -244891, 149394, -189904, -66988, 118164, 5494, 424676, 6518, -102528, 62692, -63947, -201686, -39234, -281356, 55502, -226523, -230096, 16876, 155142, -186951, 48593, -208373, -6545, -181296, -7881, -30176, 175344, -45923, 198260, 95940, -229254, -380107, -938, 118273, -256954, 227016, -409317, -139220, -7106, 176180, -56315, 27910, -113790, -125843, -287507, 76062, 366727, 165136, 89729, 148508, -118587, 141476, 82340, -30607, -317723, 69934, -14927, -123750, -137652, -35822, -111477, 256209, -20071, 145988, 8902, 292555, 125067, 17459, 223580, -43109, 78306, -544121, -252868, -28440, 64494, 4831]
17974h733j30544G9595a19030b8247k8994p031j18973j9609G7400c31607a12000
17962a15031j20114G8501B2716J72793g7819F1242b61631B94606h0615C24831
17951e4105D1518J78872N6909D3649b11393a415j88751F9913R6525b65549A01795
17939i6669L7303j60935A04458a24926E7475a03615q5104c4063A77365b19861
17928a43392A62812a21532c1368A27656L38612b6952p8565C4167d6739j3853C7835
17916a63466a1955n3133j66518A58720J02477j09942F4063J86442a42408C164
17905A94863a99141I7643B9330a02062l0731e6913O82j24113J1209a9590D0983
17893a60249b5582n0472j69546a19020b851j94029A09576a25070A84857E3219
$$ y = [-8733, -139277, 79595, -119030, -28247, -57241, -64272, -183245, -202854, 77400, -331607, -112000, -115031, -235145, 78501, 22716, 195509, -77819, 61242, -261631, 294606, -80615, 324831, -54105, 41518, 220390, 277299, 43649, -211393, -1415, -190166, 69913, 166438, -265549, 101795, -96669, -59366, -220301, 104458, -124926, 57475, -103615, -188719, -34063, 177365, -219861, -143392, 162812, -121532, -31368, 127656, 466268, -26952, -105517, 34167, -46739, -60592, 37835, -163466, -11955, -65088, -231606, 158720, 261197, 151255, 64063, 250505, -142408, 3164, 194863, -199141, 97643, 29330, -102062, -132793, -56913, -56231, -180344, -169135, -19590, 40983, -160249, -25582, -76054, -245600, -119020, -2851, -196880, 109576, -125070, 184857, 53219]
17882d2408A58276g4230C04640F2458a48783K5109A23035g8929q258A77182P1220
17871B48402a72451A03345P5640F2889J87005c15800a5811H5666f8426A48020
17860C13807F1115i6876L8437F2740a30577A54498a40120I7080C453K41657C8950
17848A16047b41367J10484F758J80876a43437A93004a0185C22200E3171L7175
17838I0346b60753J8878A25340b17756C55822j44817a80925e7585K5071k38584
17828b71098D4269b91255A89535a92286A66748J86828a93555j338F3414a45067
17817D2468K8124D092c9361B34440b84148C59116d8646I7399J0908c2410C14449
17805C3618m953h562A28978h3112j42456a6270k43882J24601A8604b28973D57831
$$ y = [-42408, 158276, -74230, 304640, 62458, -148783, -123674, 123035, -78929, -87187, 177182, 248402, -172451, 103345, 178985, 62889, 249894, -315800, -15811, 85666, -68426, 148020, 313807, 61115, -96876, -58439, 62740, -130577, 154498, -140120, 97080, 3453, 245110, 38950, 116047, -241367, -130883, 6758, 187634, -143437, 193004, -10185, 322200, 53171, 90346, -260753, -241875, 125340, -217756, 355822, 211005, -180925, -57585, -32514, -271098, 44269, -291255, 189535, -192286, 166748, 353576, -193555, -194893, 63414, -145067, 42468, 70592, 4092, -39361, 234440, -284148, 359116, -48646, 97399, 108307, -32410, 314449, 33618, 28665, -8562, 128978, -83112, -225568, -16270, -260152, -135551, 18604, -228973, 457831]
17793A01225a61164k2650A83423C60a41472j11190c2336D9169K21662F5663a25343
17781b90347E5429J74729D0655K26761f6308A59768g3867j30849j51081J44796
17771b11001a345C86692b43543D55586c9515j60602h3834A50727a67715A1069
17760B76106a66375g4544K0983j17240k32113J29089f142j26375B7527h4893L4574
17749e0319H9308b4295F7954K9966i5175A77712a34815C55593a84594A05344P2169
17738A77513B6223J7884N2830Q516b92895F3867b9998A119L21340c4724H5013
17726A56580A7900E091Q2308l7296i7465r1489N8079A52786F4244L57686A52226
17714C07973A20636D6610a38282k8898A94834a43228D2594a89807d2842A79521
$$ y = [101225, -161164, -183814, 183423, 360, -141472, -252662, -32336, 49169, 270831, 65663, -125343, -290347, 55429, 230158, 40655, 267416, -66308, 159768, -73867, -204716, -355797, -211001, -1345, 386692, -243543, 455586, -39515, -200117, -83834, 150727, -167715, 11069, 276106, -166375, -74544, -53561, -170801, -402914, -273825, -6142, -132517, 27527, -84893, -50319, 89308, -24295, 67954, 97920, -95175, 177712, -134815, 355593, -184594, 105344, 177513, 26223, 44107, 96937, 105453, -292895, 63867, -29998, 1119, 322459, -34724, 85013, 156580, 17900, 5091, 87399, 50103, -97465, -188954, -130875, 152786, 64244, 421930, 152226, 307973, 120636, 46610, -138282, -167180, 194834, -143228, 42594, -189807, -42842, 179521]
17703C2552J19205J37490A0881b03366D4484J63324A2520K41156D8241K88234
17693C36475j38192k5179b11502A140N8378J51088a19783C0506b12519j11293
17683c23812b458n5280j9850j01325B31992a13845B24702i1849J4886k08582n208
17672b90753B7318K2088M8810J05098m2642c67860a07674B81814j04872n2968
17662A23974K1019a54033b9112I273K19446K1942h590j04541n7223D08340j81071
17651B27269a80085D07389k00176b08608B83681l1715a28646b6655F1681a02856
17640b58231A4814N0060Q4195a1350q004j00649B11957a7111l08548A36221O4128
17629B00349P0932a89580C74852A13520C2252j013Q1194B6199e2986B63695b08822
$$ y = [32552, 151757, 289247, 10881, -203366, 44484, 207808, 12520, 253676, 48241, 336475, 198283, 173104, -211502, 1140, 59518, 210606, -119783, 30506, -212519, -323812, -2458, -57738, -77588, -178913, 231992, -113845, 224702, -91849, -76963, -285545, -290753, 27318, 49406, 98216, 203314, 160672, -367860, -107674, 281814, 176942, 123974, 144993, -154033, -29112, 9273, 228719, 250661, -8590, -113131, -170354, 408340, 227269, -180085, 407389, 207213, -208608, 283681, 251966, -128646, -26655, 61681, -102856, -258231, 14814, 64874, 149069, -11350, -19354, -120003, 211957, -17111, -325659, 136221, 200349, 271281, -189580, 374852, 113520, 32252, 31239, 112433, 26199, -52986, 263695, -208822]
17617c2083d370A1763N6979l1303R7948o3514k474K52787j40622g6959B77558
17605e7774D9688J26178N5019J1541a83469A47059B3932K76140F3627a02921B22144
17593c55201A23752J97627l6187r1375j6386C0641J79248J35675a70372l4491
17583b04863C67945f8456A16288l9636L2402f9043b7886p7471B44672M429k4919
17572B24182a55855C20911a46305g0409A63621C4004J08977r441b5155B43820
17561a06486A48841E9779d0032J3149o2482a0659F9189k2318Q6958l7454f4055
17549a15574k55761B33009G0693b06530d241D38195c5011A72602k4060b1169A44468
17537B06263L15170A84422a84330A99095D4729a92494B28631K6612a83280A88682
$$ y = [-32083, -4370, 11763, 68742, 37439, 135387, 71873, 69399, 322186, 181564, -76959, 277558, -57774, 49688, 175866, 230885, 242426, -183469, 147059, 23932, 300072, 63627, -102921, 222144, -355201, 123752, 321379, 285192, 193817, 177431, 30641, 209889, 345564, -170372, -204863, 367945, -68456, 116288, 76652, 109054, -69043, -27886, -105357, 244672, 249101, 224182, -155855, 320911, -146305, -70409, 163621, 34004, 142981, 133540, -25155, 243820, -106486, 148841, 59779, -40032, -26883, -89365, -10659, 69189, 46871, 133829, 96375, -64055, -115574, -371335, 233009, 70693, -206530, -4241, 438195, -35011, 172602, 148542, -21169, 144468, 206263, 521433, 184422, -184330, 199095, 44729, -192494, 228631, 255243, -183280, 188682]
17526b2929A86993h944D59032A56019J20356B7220J09596R8264I7910F635L15958
17515C22593K2447E0859J92973A05414g3663B1155q945c847F4646R0397b55607
17503h2422B61373r2745J38430a49611A67572a6628A77457J45163b46138A56123
17492A00994K83687f2940r6360a9081A13372a96022A983c7398J5051f805C34302
17480e2342B05104P1244d7432l0032E0748K10076l8899a820B58597b04172h602
17468F1321L633J94098J46619f95A61554a36984f3823j43203M789a4890p5364
17457i0254B28069F9584K82128q7522K5722K28214A70233m5515J46947l3022m5909
17446A92734L39803k41785a7082A69956o7055J74301k2817R7451j02401j08501
$$ y = [-22929, 186993, -8944, 459032, 156019, 276375, 27220, 136816, 235080, 97910, 6635, 322593, 345040, 50859, 243832, 105414, -73663, 21155, 12210, -3847, 64646, 155043, -255607, -82422, 261373, 168628, 307058, -149611, 167572, -16628, 177457, 322620, -246138, 156123, 100994, 384681, -62940, -159300, -19081, 113372, -196022, 1983, -37398, -22347, -6805, 334302, -52342, 205104, 276348, -47432, -77464, 50748, 260824, 221925, -1820, 258597, -204172, -8602, 61321, 64954, 259052, 405671, -695, 161554, -136984, -63823, -207026, -202237, -14890, -90254, 228069, 69584, 351712, 264190, 289912, 518126, 170233, 124718, 271665, 238643, 192734, 532537, 290752, -17082, 169956, 102901, 277202, 254385, 351836, 249435, 140934]
17436A40934j1033M1893G6140L98411G5869L72577r1838F5711L21169A51823J97569
17425C49392J20180r4299q2842G7926J04883J77141R9402i1013C85490p5366A35899
17413A07030a9224j77707C26120A53711J82245j45819d5881B31667J36191b17155
17402B12065b1341A87334K21271A29270g9574B05686o9114N7888a94995C0028
17391C50350o1249a26524D57381f3764B97311A15412k2999e503B76576a80822
17380H0475N6018O0335c7705j74726A89625J37390F7197J3351b8074C38407a18036
17368C8240O0308L57660A7493K77782C2945a41291k3631F320J25967d8238A38195
17356g5485n3559G3298Q2449L1455m3040a36637E8948a49191C27409A28551c2180
$$ y = [140934, 129901, 171794, 76140, 474551, 75869, 448446, 356608, 65711, 386880, 151823, 349392, 469572, 375273, 292431, 77926, 182809, 359950, 459352, -91013, 385490, 310124, 135899, 107030, -19224, -196931, 326120, 153711, 335956, 190137, -45881, 231667, 367858, -217155, 212065, -21341, 187334, 408605, 129270, -79574, 205686, 136572, 194460, -194995, 30028, 350350, 289101, -126524, 457381, -63764, 297311, 115412, 92413, -5503, 276576, -180822, 80475, 136493, 196828, -37705, -212431, 189625, 327015, 67197, 80548, -28074, 338407, -118036, 38240, 98548, 456208, 17493, 295275, 32945, -141291, -164922, 6320, 132287, -48238, 138195, -75485, -129044, 73298, 155747, 187202, 144162, -136637, 58948, -149191, 327409, 128551, -32180]
17344h2017B70273l9812M3400o9233N5621d3089B10294j9694N8581c2067A27440
17332C36259R5601d7969B19816c9470B55357J31515j11445K3931D7453K05390
17322B52843A13690j7003A7073J85598A3485L30114A51007p4428b33666B06997
17311B06106J328j03657j6861P8177O4240J12470J16783o8253L5642F7374A3169
17299B00072K75320B3514R6682O106a5681B11316J36576j66908N6946D0547J63746
17288B04293K56629B26315P5512j16855m5934L51652A76113J13331j42596c4693
17277A34689c715B04348M7949c2845E53901a82896A45218L28093a66691A55714
17266c58350A81346a95389A90316J5808L711e3471i054C04825J99810d7861A56666
$$ y = [-82017, 270273, 230461, 273861, 204628, 260249, -43089, 210294, 190600, 249181, -32067, 127440, 336259, 431860, -47969, 219816, -39470, 255357, 386872, 275427, 299358, 47453, 252843, 113690, 96687, 17073, 202671, 13485, 343599, 151007, 76579, -233666, 206997, 206106, 207434, 103777, 86916, 165093, 229333, 341803, 458586, 390333, 425975, 67374, 13169, 200072, 475392, 23514, 120196, 126302, -15681, 211316, 347892, 180984, 237930, 40547, 204293, 460922, 226315, 301827, 184972, 139038, 490690, 176113, 289444, 146848, -34693, 134689, -3715, 204348, 252297, -32845, 553901, -182896, 145218, 473311, -166691, 155714, -358350, 181346, -195389, 190316, 206124, 209835, -53471, -9054, 304825, 504635, -47861, 156666]
17254C03355n8134J16869L02747A22804J65926j2284A06606d5668A28301J62829
17244B91130E0819K15467I3629R4285k9342L94998G4217K62198J69568q5035G3201
17232B12064A4589L43294J6481m3205F3753K05960J60854C5883N61165B33471
17221B06149j1142J17096J55059K5710A26732k769M3302J33530J45526p436k931
17210D35954C7613a26564C90249a1336A83180h3363A99227J34819j05709e3369
17199D99099D2513P9194L71445A57473n4651l042K61106J142j00788a45021D19705
17187C20327A36775J07852A01384M48564E5447M41234f9286A33343l106L32727
17177D62964H2806J56897K82477F8573K25393J67265j99682Q201J43654j40337
$$ y = [303355, 245221, 362090, 664837, 122804, 288730, 276446, 106606, -45668, 128301, 291130, 50819, 266286, 93629, 187914, 158572, 553570, 74217, 336415, 505983, 420948, 73201, 212064, 14589, 357883, 374364, 331159, 63753, 269713, 430567, 35883, 597048, 233471, 206149, 195007, 312103, 467162, 492872, 126732, 123963, 167265, 300795, 446321, 438885, 435954, 37613, -126564, 390249, -11336, 183180, -83363, 199227, 334046, 228337, -53369, 499099, 42513, 121707, 493152, 157473, 102822, 99780, 360886, 362028, 261240, -145021, 419705, 320327, 136775, 244627, 101384, 549948, 55447, 496681, -69286, 133343, 130237, 462964, 82806, 239703, 522180, 68573, 293966, 461231, 261549, 269750, 413404, 273067]
17167B73067n7481J90461j03833A36561L51957B03103N8154K34906Q2118A71470
17156D83717L3103k29062J32483j77173J23258N4710l458K21337j64195j27841
17146C46879N3328j44323J88384K60253C38850R9413A44835J69231j11148K97021
17136D99939k7424j71527N8139K27669F833L36963K52132l8019k28980L9439m1099
17125C27269p1328J26700j65335J26484J06834L33086k47703p4155K13909B16153
17114C55225l1897K74559A13002L53176M5202L894j80974j25897J69202J52131
17104E29736n6143O7731j4399j78736r0691L75329B73587K28822A66202L97037
17094E63239O7628r6768k01508K32045j26427j94075K05612j11501K53280k00248
$$ y = [273067, 215586, 406047, 302214, 136561, 488518, 203103, 261257, 496163, 578281, 171470, 483717, 516820, 287758, 420241, 243068, 366326, 421036, 417578, 638915, 474720, 346879, 400207, 255884, 444268, 704521, 338850, 438263, 144835, 314066, 202918, 499939, 472515, 300988, 359127, 586796, 6833, 343796, 595928, 557909, 328929, 368368, 327269, 255941, 382641, 217306, 343790, 450624, 783710, 536007, 461852, 675761, 216153, 355225, 323328, 597887, 113002, 466178, 511380, 515274, 334300, 208403, 377605, 529736, 473593, 541324, 526925, 348189, 257498, 632827, 273587, 502409, 166202, 563239, 630867, 534099, 332591, 564636, 438209, 244134, 449746, 338245, 591525, 391277]
17084C91277k3196Q1581j33749P3686K99165k06200l927J28880L1739j11782j11363
17073D16111K71934j47495M5835J48792k63342A66065N68636j30439j63442J570
17063D42390J87A93855L36492l7352J35376m4977l994k36864J67529j01455n0473
17052C58137L11944j81799j58029J84887A75293L70870P160j97973K80474Q7358
17042G23182k15266k8541J28846k9139k4664K71163l12362j3017J07626R2442
17032G00270K09582j53927k31838J40244j39229M23821j58523K13906l42779K16171
17022H77698l6420l6045k18077Q9738m3203K1230K04330j97709L65215l6901j47866
17011H41990o5580K47909l78201K01143K40895n03235p970J65116O0322Q6884
$$ y = [391277, 368081, 449662, 315913, 389599, 688764, 482564, 478637, 607517, 639256, 527474, 416111, 688045, 540550, 586385, 735177, 471835, 166065, 734701, 604262, 440820, 442390, 442577, 193855, 530347, 492995, 628371, 583394, 579400, 342536, 510065, 408610, 358137, 670081, 488282, 330253, 515140, 175293, 546163, 553323, 355350, 635824, 723182, 507916, 479375, 608221, 579082, 554418, 825581, 513219, 500202, 607828, 700270, 909852, 755925, 524087, 664331, 525102, 948923, 790400, 1004306, 661527, 877698, 841278, 805233, 587156, 676894, 633691, 654921, 859251, 661542, 1026757, 989856, 841990, 776410, 1024319, 646118, 847261, 1088156, 584921, 576951, 742067, 802389, 889273]
17001H89273m4916k20230K65905P0152j95397J68438j74138m3755K0945m7133
16991F89144Q9181l08517O23747C05400Q72029l63586K30546m9050J37452j36268
16981I96523j06271L54950j52501k04418j61439L47403j1074j92893J84096l17388
16971G36988M26128j82564P463J33096m3135j08816o4243L23046k00870J93241
16961A220334l38912P8556j13364K17577J85706P4232n0582k25442L1488K64442
16951A344035q4747p338K14144m26899L41491J31915l53126j12745L17166m826
16941A359070k72699K58692M5687p5006p279L9739R6269m6784j57011J22033n5707
16930A307004J18920j13162K56201J47496l7084O1079k75580J03742k14250K21305
$$ y = [889273, 844357, 624127, 890032, 960184, 764787, 933225, 759087, 715332, 736277, 689144, 778325, 469808, 1093555, 305400, 1177429, 813843, 1044389, 995339, 1132791, 996523, 890252, 1245202, 1092701, 888283, 726844, 1074247, 1063173, 870280, 1054376, 736988, 1163116, 980552, 988015, 1121111, 1077976, 969160, 904917, 1227963, 1027093, 1220334, 881422, 959978, 846614, 1064191, 1249897, 1324129, 1273547, 1048105, 1079593, 1344035, 1259288, 1251950, 1466094, 1039195, 1380686, 1512601, 1159475, 1046730, 1363896, 1359070, 1086371, 1345063, 1390750, 1315744, 1308465, 1348204, 1444473, 1397689, 1240678, 1362711, 1307004, 1425924, 1312762, 1568963, 1716459, 1679375, 1740454, 1464874, 1568616, 1354366, 1575671]
16920A575671L76222n71921r97j41307M43795L50775m19976J78457l74723K97195
16910A713191p9262n417J61813j94017J30110K92931l67388J15283J3738K5974
16900A806956n0199J74317J15759k11788l43320M90320J21113J05784J7003j45789
16890B080156k48686N94332n01503K61417j47646L72502l12363M87324K0213Q2650
16880B688396l63801J72975P7368q0092J05290j24691M93374o43110L88773j92607
16870B521875J84085J55354k34178M61499j78842k29662L44401l76563M12667
16861C060636r2163j12600K80864K22776k50874L71786k1482j9149j65523R170
16851C283441L93730p3200K9111m1624l12849L89753K50918j15545r869n8667
$$ y = [1575671, 1951893, 1379972, 1378975, 1237668, 1681463, 2032238, 1612262, 1790719, 1415996, 1713191, 1633929, 1628512, 1790325, 1596308, 1726418, 2019349, 1651961, 1767244, 1780982, 1806956, 1756757, 1931074, 2046833, 1835045, 1491725, 1982045, 2103158, 2208942, 2225945, 2080156, 1831470, 2425802, 1924299, 2185716, 2038070, 2410572, 2098209, 2585533, 2605746, 2688396, 2324595, 2497570, 2574938, 2494846, 2600136, 2475445, 2968819, 2325709, 2714482, 2521875, 2705960, 2861314, 2627136, 3088635, 2909793, 2680131, 3024532, 2647969, 3060636, 2968473, 2855873, 3136737, 3359513, 3108639, 3480425, 3458943, 3439794, 3274271, 3283441, 3677171, 3603971, 3633082, 3591458, 3278609, 3668362, 3919280, 3803735, 3793866, 3735199]
16841C735199k17632M48230r7311L56103n747L9376J28481k43330L96388K02091
16831D741848k3811n6436M37395r9978J32855r6472L51107j69585J96916l8932
16821E374907L51108M0567j99190K22171L82332l25042k5855N51105j32307L16343
16811F556139K27207n7037J46269P3089O02087k90395J62112p5313N69043J58572
16801H071773j83341J51719P94166k17082M85569P4208L08979l2552M51555J47696
16791A0052690K48095m9110O10949K81566J777M85056J59462M62334k30603O84485
16781A2706701K25150O71626M74979K73872P46031o2968P13199K85558L54770
16772A6388918Q43241M46091K75587M57504R15737M10653J030839N20112N14791
$$ y = [3735199, 3517567, 3965797, 3868486, 4224589, 4218842, 4258218, 4386699, 4143369, 4539757, 4741848, 4718037, 4661601, 5098996, 4999018, 5131873, 5035401, 5386508, 5216923, 5413839, 5374907, 5726015, 5766582, 5567392, 5789563, 6171895, 5846853, 5820998, 6372103, 6239796, 6556139, 6783346, 6726309, 6872578, 6945667, 7547754, 7257359, 7419471, 7344158, 7913201, 8071773, 7888432, 8040151, 8834317, 8617235, 9102804, 9177012, 9485991, 9453439, 9904994, 10052690, 10300785, 10251675, 10862624, 11144190, 11145967, 11631023, 11790485, 12252819, 12022216, 12706701, 12931851, 13603477, 14078456, 14352328, 15098359, 15035391, 15748590, 16034148, 16388918, 17232159, 17678250, 17953837, 18411341, 19327078, 19737731, 20768570, 21288682, 21803473]
16763B1803473R07755R91038L46189J034921J164011R82999J110516R78238J310806
16754C0629946J541272J008817J224806J771816J278402J923255J446690K504810
16746D3329814J778317J884906K315831K691088K241889K890182K921002L406896
16738F3459925L525027L345154L858488M019157M299604N215340M795840N058883
16730I7577418N740659O005097N963351O487230O996067O989387O703211P102728
16722A49565148P391391O526342O427325N855275M763400M533633L086685J966158
16714A90115357N14569o08331j761618l290531l980230m985520n996786o531710
16706A63475200o499161p006852p656469p209765p226704p275979o714510o188330
$$ y = [21803473, 22711228, 23702266, 24048455, 25083376, 26247387, 27230386, 28340902, 29319140, 30629946, 32171218, 33180035, 34404841, 36176657, 37455059, 39378314, 40825004, 43329814, 45108131, 46993037, 49308868, 51999956, 54241845, 57132027, 60053029, 63459925, 66984952, 70330106, 74188594, 78207751, 82507355, 87722695, 92518535, 97577418, 103318077, 109323174, 115286525, 121773755, 128769822, 135759209, 142462420, 149565148, 156956539, 163482881, 169910206, 175765481, 180528881, 185062514, 188149199, 190115357, 190629926, 190021595, 188259977, 184969446, 180989216, 176003696, 170006910, 163475200, 156976039, 149969187, 142312718, 135102953, 127876249, 120600270, 113885760, 107697430]
16698A07697430o530485n560836n875574n311213n115916m586840m147418m000375
16690F6568773l566464l717862l264275l263272k446386k509911l087621j719435
16682D2993547k390431j982731j459134j946207j776865j667806j058472j617940
16674B9093961j205900j192438j111802r31038q31205j439502p02884j062765
16666B0616427o23687l47710r15124m58647j061641m95500m97241q61268k73488
16657A5082121r66735m5890k68532n56227m65808l03306n68268l04344l12469
16648A1290542m76492q8262n88400J2525m34038j97724n92726Q948k97492q4306
16638H552575k27861k87367k30724k07825j38090m52048J11979k23754K2607m97014
$$ y = [107697430, 101166945, 95606109, 89730535, 84419322, 79303406, 74716566, 70569148, 66568773, 63002309, 59284447, 56020172, 52756900, 50310514, 47800603, 44712982, 42993547, 40603116, 38620385, 37161251, 35215044, 33438179, 31770373, 30711901, 29093961, 27888061, 26695623, 25583821, 24652783, 23821578, 22382076, 21679192, 20616427, 19992740, 19645030, 18729906, 18271259, 17209618, 16714118, 16216877, 15355609, 15082121, 14115386, 14069496, 13800964, 13244737, 12778929, 12475623, 11907355, 11603011, 11290542, 10814050, 10725788, 10137388, 10149913, 9715875, 9518151, 8925425, 8934373, 8636881, 8552575, 8324714, 8037347, 7806623, 7598798, 7460708, 7008660, 7120639, 6896885, 6919492, 6422478]
16628F422478R8657l76391K12534m65839j10009j58951K81060m90169j80288O0617
16618E293699l15099K1687J06490m11581K27315l91270Q298M3429o2722K14568
16608D734814n54865k95932K24506r0049N8035m88189N04167j84452k21437m60827
16598C225771J90347r4149K02917R4115l76902o7024p0930j15869q6265k39656
16588B662355J77331k68710K52902R7339k73378J12102m12796n1266J61912J50343
16578B608134M8161k23628k85063L21709j77763k68588M77342l80762k46341M55572
16568B328773n75224k4891K79108J69162L16678m01345l0581J76488l06962K0043
16558A951249k16710j39163P7513L09109j61761Q2358l18125K38343n8782M7650
$$ y = [6422478, 6521135, 6144744, 6357278, 5891439, 5781430, 5622479, 5903539, 5413370, 5233082, 5293699, 4978600, 5000287, 5106777, 4695196, 4922511, 4531241, 4539539, 4582968, 4520246, 4734814, 4179949, 3884017, 4108523, 4018474, 4076509, 3588320, 4092487, 3908035, 3686598, 3225771, 3416118, 3321969, 3524886, 3619001, 3242099, 3175075, 3104145, 2988276, 2902011, 2662355, 2839686, 2570976, 2823878, 2921217, 2647839, 2759941, 2347145, 2295879, 2457791, 2608134, 2656295, 2432667, 2147604, 2469313, 2291550, 2022962, 2500304, 2119542, 1873201, 2328773, 1753549, 1728658, 2007766, 2176928, 2493606, 2092261, 2061680, 2238168, 1931206, 1951249, 1734539, 1595376, 1672889, 1981998, 1820237, 1902595, 1584470, 1822813, 1764031, 1811681]
16548A811681N025l16694L9502L4499J75936o617k24991J91197j76939l86081
16538A146518L46984J88504m37843n4165K51251l32414J95223O460J09866L33998
16528A754382m60419l3411m5717l2460J04326K38445j22269k31221k74539M63533
16518A360650m48567J8220L06541q56j3184m50802J26364K99821n6125k52301
16508H89761O4148k6106l884J5777k61859M46783k2518j80708N0024J03287k94307
16497G80398M64569m29886j0465Q3521j49461J23355P9367J12905j24107m4031
16487H86165J5861j16598J28916j61515q302j44639K42902M2336J62002j80389
16477H66739o4698n7188r6355L1572O2648j5575j1420k11779J67296K96814D76023
$$ y = [1811681, 1816706, 1500012, 1539514, 1574013, 1749949, 1743332, 1518341, 1709538, 1532599, 1146518, 1493502, 1682006, 1244163, 1189998, 1441249, 1108835, 1304058, 1310518, 1420384, 1754382, 1293963, 1260552, 1214835, 1182375, 1286701, 1525146, 1402877, 1171656, 897117, 1360650, 912083, 930303, 1236844, 1235988, 1222804, 772002, 898366, 1198187, 1142062, 889761, 953909, 927803, 923919, 939696, 677837, 1124620, 1102102, 921394, 971418, 1074705, 780398, 1244967, 815081, 804616, 888137, 738676, 862031, 941398, 1054303, 930196, 886165, 902026, 785428, 914344, 752829, 744527, 599888, 842790, 885126, 1047128, 866739, 802041, 744853, 648498, 680070, 742718, 727143, 715723, 503944, 671240, 968054, 476023]
16465H50228j81330m716Q5834k97432J70853k66432M09381M5889j74702P1660
16455G09233M60428l77963B83316N51226k1384j60586k62960K45975k26196J11964
16445E21355j31022K95037k72636J95368B90193O69626m09530k63812N7454K26892
16435E70823l6927P3776B47951L86570p6452k07956O0025J65045j71055j89634
16425B14494J90959J82000B83957J28780m6419J97989K4841j28683o1152L61158
16415G60471l01823M7304j33007m6477o9333K9399K22024j91498R0029E9851o451
16404E3400K61522K1171J34794j08435K70352B78463J62092K3851j86347J34408
16394D12467J23817j65497J10053k18367M031G9461L64699A31631K98322n1981
$$ y = [850228, 668898, 664182, 750016, 452584, 623437, 357005, 766386, 812275, 637573, 709233, 1169661, 791698, 283316, 834542, 813158, 652572, 389612, 635587, 409391, 521355, 390333, 685370, 412734, 608102, 290193, 959819, 550289, 286477, 343931, 570823, 533896, 607672, 247951, 634521, 558069, 350113, 410138, 575183, 404128, 214494, 405453, 587453, 283957, 412737, 366318, 564307, 589148, 460465, 399313, 760471, 458648, 505952, 372945, 326468, 257135, 286534, 508558, 317060, 407089, 59851, 53400, 314922, 336093, 470887, 362452, 632804, 278463, 440555, 464406, 278059, 412467, 536284, 370787, 480840, 262473, 266504, 79461, 444160, 131631, 429953, 377972]
16384C77972J20565Q3992L271k65199Q1860n2051J46087k38309J05965l4475o998
16373C22680K99569j80944j50059J57850J4823a5818B28828M0537r6819R7364
16363B69910H9522K70884l7423A02853J4657m8554J16045M88803j61767A04974
16352C06018j38709K80688k02636f0196B0682J91901C6409K88671o3805A24978
16341C35455J64892B35827K91827a9364D09199A88725j893n8800L43729B02876
16330D16685n4991A60652K66255r5235j52261f37C02281J17952B03269K46571
16320D49840j90012j15028m786a07385C23590C8224r196J25297E1142L60588H1497
16308C26134J60728c4116A45295L52407k48100d926H4331B0303N1494k5840B1256
$$ y = [377972, 498537, 582529, 585800, 320601, 402461, 350410, 496497, 258188, 364153, 329678, 322680, 622249, 441305, 291246, 449096, 463919, -15818, 228828, 269365, 172546, 269910, 89522, 360406, 322983, 102853, 117510, 68956, 185001, 673804, 512037, 104974, 306018, 167309, 447997, 245361, -60196, 20682, 212583, 36409, 325080, 261275, 124978, 335455, 500347, 235827, 527654, -19364, 409199, 188725, 186832, 128032, 471761, 202876, 416685, 361694, 160652, 426907, 331672, 179411, -637, 302281, 420233, 203269, 449840, 259828, 144800, 140014, -107385, 323590, 38224, 29028, 154325, 51142, 411730, 81497, 326134, 486862, -34116, 145295, 497702, 249602, -4926, 84331, 20303, 71797, 45957, 21256]
16296B8046K04139N8608l2523o1846K53552p4398A38254L1045m2469K52011j15712
16285B63129b59161A89878b9269C92580g1809C43880A38341n8712l002J89845
16275B66472K9485a54411E8248K42175n3236A07135I261P9910F709M44627r9947
16264C51389A16724d3520J8694E0078F204M59599A93464c1948B70358A05057B335
16252F7493J74894l9208G8624L60124A69118n3521m6959a13760p7425A25590a7402
16240E9071K03734j16105O7760k3200B6773J11678e411P36B27002c2567B28387
16228C4517K68691e9272D23608j35093G7129J61377b68053A06341a34410I0662
16217C6504K33680c10252f6424D09014e0713B62657P1181I8968e8686D02834j81404
$$ y = [28046, 232185, 290793, 258270, 196424, 449976, 375578, 138254, 169299, 126830, 378841, 263129, -259161, 189878, -29269, 392580, -71809, 343880, 138341, 79629, 76627, 266472, 295957, -154411, 58248, 300423, 247187, 107135, 9261, 89171, 6709, 451336, 351389, 116724, -43520, -24826, 50078, 6204, 465803, 193464, -31948, 270358, 105057, 2335, 67493, 242387, 203179, 78624, 438748, 169118, 115597, 68638, -113760, -191185, 125590, -17402, 59071, 262805, 146700, 214460, 191260, 26773, 138451, -5411, -4675, 227002, -32567, 228387, 34517, 303208, -59272, 423608, 288515, 77129, 238506, -268053, 106341, -134410, 90662, 36504, 270184, -310252, -66424, 409014, -50713, 262657, 333838, 98968, -58686, 402834, 221430]
16206B21430H3042A454J22601N7275M4676c6248F8311a25491j95204B68660o7896
16195B00764A2802d4791K838A56830K84723A74063j9032a17409A36294J44015
16185B80309d2310B43847g7576F6353E774Q5980m5561N5723B8183P6936c2536
16173d7107k0360B39515p4359b3236A39879g8089A52390a66228G2649j44e9880
16161B8926j4454e2772C5331K55086C3519a59557L4445K0658A37767b12157C28549
16149A51441h3966A50376a32635B8934J2860a34320B26900e96062B82229p2469
16139B09760a31330r894m1823f0307I1986K91573G5389J12055d9365C0708J43065
16128A73773J05709b40274B25660o5220p7737d3228B24946b98420M4774A04340
$$ y = [221430, 83042, 1454, 124055, 181330, 226006, -36248, 68311, -125491, -320695, 268660, 200764, 12802, -44791, -41953, 156830, 441553, 174063, 155031, -117409, 136294, 280309, -42310, 243847, -77576, 66353, 5774, 91754, 46193, 101916, 28183, 105119, -32536, -47107, -67467, 239515, 165156, -23236, 139879, -78089, 152390, -166228, 72649, 72505, -59880, 28926, 14472, -52772, 35331, 290417, 33519, -159557, -125112, -104454, 137767, -212157, 328549, 151441, -83966, 150376, -132635, 28934, 41794, -134320, 226900, -596062, 282229, 209760, -131330, -141224, -183047, -60307, 91986, 383559, 75389, 187444, -49365, 30708, 173773, 279482, -240274, 225660, 160440, 82703, -43228, 224946, -298420, -253646, 104340]
16117B20086a29267j57283D2565L9578h1039c7424B54300c03194F8881f637A02313
16105C9315m856A5442M62750A85740J19289a15534m7380B99131J21145o0568P481
16094C67189A1065O6613b68526h0571m6524B65644e3960b4905C6530d67232C59882
16082g6560l5255o3837A293a5572o7319c2328o6453B13665c9141J7614A96830
16070b14775J5455B00319m5463K08630A22724b01958E6523Q4022e9676I0307b8529
16058B4450K7680J01809c3697J6675l68014P9057a38867B78889e0849D118e3019
16046a90303B82819b7446I235b008D3864R1982g6744F30L2869J63329e2084B46944
16033b58422L5941e3030D3632J83578e55r2708j48549A01767J38104J94198f8827
$$ y = [220086, -129267, -286550, 42565, 82143, -81039, -37424, 254300, -303194, 68881, -6637, 102313, 39315, 34459, 15442, 478192, 185740, 305029, -115534, -162914, 299131, 420276, 359708, 367189, 11065, 77678, -268526, -80571, -127095, 265644, -53960, -24905, 36530, -467232, 359882, -76560, -111815, -175652, 1293, -15572, -82891, -32328, -98781, 213665, -39141, -21527, 196830, -214775, -199320, 200319, 154856, 363486, 122724, -201958, 56523, 140545, -59676, 90307, -28529, 24450, 52130, 153939, -33697, -17022, -385036, -305979, -138867, 278889, -50849, 4118, -53019, -190303, 282819, -27446, 9235, -2008, 43864, 135846, -76744, 630, 33499, 196828, -52084, 246944, -258422, -222481, -53030, 43632, 227210, -555, -93263, -241812, 101767, 239871, 434069, -68827]
16021b24957B3601J32721k95g5309j44465l19714A21645F0097a8255A35810F3699
16009g8801C28046c89091a07288j91036J3611h8743j00485M5341A57783b28987
15998A01544f3431A83079b37043D93876a74726B72174f8229A13687c35887a50751
15987A04003a6680e218B14306m3107l0296K53861a7858B43331K25088a26971j4314
15976a41285O497r0947f5335I98a13179F4440K09220C1312K52620A01907J8050
15965A19957J84249j27516p7420a00386A87059c8433E1573O4072g9678j6077l89004
15954d84759h9097I1857a93089p4671L5138N5991n5438b8553A15311e270m12424
15943d17694h5514A2520a43731D62762a43843C51328d7051k28002a14096m8023
$$ y = [-224957, 23601, 156322, 156027, -75309, -219774, -539488, 121645, 60097, -18255, 135810, 63699, -78801, 328046, -389091, -107288, -298324, -284713, -88743, -189228, -143887, 157783, -228987, 101544, -63431, 183079, -237043, 493876, -174726, 272174, -68229, 113687, -335887, -150751, 104003, -16680, -5218, 214306, 171199, 140903, 394764, -17858, 243331, 468419, -126971, -141285, -134788, -225735, -65335, 998, -113179, 64440, 273660, 31312, 283932, 101907, 119957, 304206, 176690, 99270, -100386, 187059, -38433, 51573, 115645, -79678, -95755, -484759, -89097, 91857, -193089, -267760, -232622, -176631, -232069, -28553, 115311, -5270, -417694, -85514, 12520, -143731, 462762, -143843, 351328, -47051, -275053, -114096, -162119]
15933a62119E9308a41064d1447q8736A31896c5677B6939b21081A99025d45698
15922a68663g2316A60110m7285b66781b9916k5089j01844o1749g7248a9564j76924
15911a96488q582j35631h0273l194n8753j0925F0821R5428N1851e8639B821f4968
15898b98246a11377o6924i162j2711k40926R0933B6668g6855L6416K0169l04561
15887c24831A61759f2210F6522c72447h788H2403j595d5110C88393j75472a15730
15875A93801a31231A10518k2289J0571a66708p306A60536D2395b81477m223K2570
15864b63130Q4517A81860b12197A57676B8362Q3262e5053A99343d6420b1544k9378
15853e0922H7750b20473A28637a07264B90071A15117a79752E3682J87564A11158
$$ y = [-162119, 59308, -141064, -41447, -130183, 131896, -35677, 26939, -221081, 199025, -445698, -168663, -72316, 160110, 112825, -266781, -29916, -55005, -156849, -218598, -77248, -19564, -196488, -205070, -340701, -80273, -83467, -142220, -153145, 60821, 156249, 208100, -58639, 2821, -64968, -298246, -111377, -178301, -9162, -21873, -262799, -171866, 26668, -76855, -40439, -20270, -324831, 161759, -62210, 66522, -372447, -8788, 82403, 80808, -45110, 388393, 212921, -115730, 193801, -131231, 110518, 88229, 98800, -166708, -174014, 160536, 42395, -281477, -285700, -263130, -178613, 181860, -212197, 157676, 28362, 111624, -55053, 199343, -46420, -21544, -50922, 87750, -220473, 128637, -107264, 290071, 115117, -179752, 53682, 241246, 111158]
15842a06155k1812H4392L7215d1639j93038G0751O7952i2672C100b66739J08418
15831a58321f6128A18431a36604K2051B0035a02673A6709J475h0758a8433o7649
15820h6082J2718j10842l24925A24243e0353j81461A22186m9840a73762A8114
15809A72214a98575n2499H4007a53575M5988I4925M0349b99825i4635A09053k6702
15798H2351o839c027A62628m7657g6210B30971q044G5806K952g4323B73730c07832
15785B2286K0974g0544l0725k24688G4619b94466g7468b8297j08792e3789D09064
15773A44936b20251D4764J41587a37780A0500N3419h9449k5307p7286B39967B7047
15761F1033J58791b2956B73140c16635D433d9551B3121L9222B633O4930d1180
$$ y = [-106155, -127967, 84392, 121607, -41639, -234677, 70751, 138703, -92672, 3100, -266739, -158321, -66128, 118431, -136604, -114553, 20035, -102673, 16709, 18184, -80758, -18433, -86082, -73364, -184206, -509131, 124243, -50353, -231814, 122186, 72346, -173762, 18114, 172214, -198575, -251074, 84007, -153575, -107587, 94925, 135274, -299825, -94635, 109053, 82351, 75512, -3027, 162628, 114971, -76210, 230971, 222927, 75806, 78758, -74323, 273730, -307832, 22286, 43260, -70544, -101269, -325957, 74619, -294466, -77468, -28297, -137089, -53789, 409064, 144936, -220251, 44764, 186351, -137780, 10500, 63919, -89449, -114756, -192042, 239967, 27047, 61033, 219824, -22956, 273140, -316635, 4433, -49551, 23121, 62343, 2633, 67563, -41180]
15749A70504j3739k5456c18483H3738O1756J68054i2828j30135a974k57764J01423
15738a58315r9149a5212k62697f7067H1929j7044m477K921K31111f4376j05155
15727a69531p1548N6559e4530A47319d22152a71842F4993b13203d9762j3612j11098
15716a74472c1995j08657M0175B2220d4539j3973A92009o0474a41738A23096e8423
15704A1398c23481a38274m1101A96008c01064D58175d92980B25804e36576b57609
15693G4789g2562P259I6361k4977N6107B7127c2132j66862D0338m983f4857J6272
15681d8585j04533B80251b1136C52759a2977n3378H173a76720B33214D2177J40745
15670A82922J22141I8225b36173c7850E1008a79546B638a23006p9367B22161m373
$$ y = [170504, 156765, 131309, -318483, 83738, 145494, 313548, -92828, -222963, -1974, -259738, -158315, -257464, -15212, -277909, -67067, 81929, 64885, 60408, 63329, 294440, -64376, -169531, -241079, -184520, -54530, 147319, -422152, -171842, 64993, -213203, -49762, -63374, -174472, -31995, -140652, -100477, 22220, -44539, -58512, 192009, 131535, -141738, 123096, -58423, 11398, -323481, -138274, -179375, 196008, -301064, 458175, -492980, 225804, -536576, -257609, 74789, -72562, -65303, 96361, 71384, 127491, 27127, -32132, -198994, 40338, 35355, -64857, -48585, -153118, 280251, -21136, 352759, -12977, -66355, 8173, -176720, 233214, 42177, 182922, 305063, 98225, -236173, -37850, 51008, -179546, 2638, -123006, -202373, 222161, 217788]
15659B17788a73438C6846c47490A33555n3038J70083o9034H746K39295h0566I5447
15647b2706C5568N326f7039B91113h9731J5469j58422O5473A87275b56068B98660
15635a30125I8250J43034P7530C282b257C17274D4084g4965n5965B05543O9856
15624B75399G5327K6502M4805J86452c39656J07984C29626a97785D9061j4805
15614C4256L0303Q0282J11370c2901N169E4008f3322C9221a90286a1771k4410
15603c6181C63J1322J02339n6296O2425Q3124a85061A71247a98698P246B49765
15591a69613F193J46470h5675j71186A938c95899a25114A20416b53825a26648
15580A23113C3232i1860K890k21713c6466N26A36656E4511K87962a8725D6149
$$ y = [217788, -173438, 36846, -347490, 133555, 80517, 250600, 181566, 8746, 248041, -80566, 95447, -22706, 35568, 40894, -67039, 291113, -89731, -74262, -232684, -167211, 187275, -256068, 298660, -130125, 98250, 241284, 318814, 3282, -2257, 317274, 44084, -74965, -130930, 205543, 275399, 75327, 101829, 146634, 333086, -339656, -231672, 329626, -197785, 49061, 34256, 64559, 144841, 256211, -32901, -27732, 54008, -63322, 39221, -190286, -11771, -36181, 363, 11685, 114024, 57728, 120153, 203277, -185061, 171247, -198698, -191452, 249765, -169613, 6193, 152663, -85675, -256861, 1938, -395899, -125114, 120416, -253825, -126648, 123113, 33232, -91860, -88970, -310683, -36466, -35940, 136656, 54511, 342473, -18725, 46149]
15568A01543j8858a54369B66500b11111F1507L43185F0422J4472a15632A40945
15557d23929J94739A21889b75818B89891h0599C18766d0715A01970J53025m3032
15547B11963d29277h6762j28900q5679D5667J67185f5154B9422O8760h5346L9139
15536d6207o2795D085b76669P0818j32851A41099a50669M0641j94811h0022K3924
15525e6098F9599P7668a62305C91073A15979i4307j71472J07295A20084B6214
15514a61145r783I7688b93806a40028A47299F9806O5352J3324a40988A6479J07017
15503A23496J03903j00473b79177A96404g707j11558j50560A66938d2908j85503
15493b28411a8036j02989B13780D0402c16080e668A03479J25648a43804I9822
$$ y = [101543, 82685, -154369, 266500, -211111, 61507, 404692, 60422, 74894, -115632, 140945, -423929, -229190, 121889, -275818, 289891, -80599, 318766, -40715, 101970, 254995, 211963, -429277, -86762, -215662, -301341, 45667, 212852, -65154, 29422, 98182, -85346, -46207, -109002, 4085, -276669, -205851, -338702, 141099, -150669, -110028, -304839, -80022, -56098, 69599, 147267, -162305, 391073, 115979, -94307, -265779, -158484, 120084, 26214, -161145, -170928, 97688, -293806, -140028, 147299, 69806, 135158, 148482, -140988, 16479, 123496, 227399, 126926, -279177, 196404, -7707, -119265, -269825, 166938, -42908, -228411, -18036, -121025, 213780, 40402, -316080, -5668, 103479, 229127, -143804, 99822]
15482B67548h003B38621a81082F515c41124J45728g5166B6789J9699B3170L18729
15471C41899A31679N5129F4016O2991j066d18255A22209C1977c445G8605b5835
15459d5088G2070a69436A82169c17553A63655b6698j87825E8967J46658a01727
15448B33902a81431b573k34043B77041o4645J5442i0306m5433o8191E5175J25016
15437A80191b91304J23673K5149B94348A33731h1687a4801A34569a30108l7415
15427a67523F0091b18348i2428c2456A52015I031a66074C0630J23510K0468L2622
15416B07230H8056a63249A0217R4218J82968g0536j8238A37773g4237q517I714
15404b4583j34525O6146a1972G8430a08006n8097g7917r6109N4386K0303A11970
$$ y = [267548, -8003, 238621, -181082, 6515, -341124, -195396, -75166, 26789, 46488, 23170, 341899, 131679, 186808, 64016, 127007, 125941, -418255, 122209, 31977, -3445, 78605, -25835, -45088, 72070, -169436, 182169, -317553, 163655, -26698, -214523, 58967, 205625, -101727, 233902, -181431, -2573, -236616, 277041, 212396, 227838, -90306, -135739, -203930, 55175, 180191, -291304, -167631, -142482, 294348, 133731, -81687, -14801, 134569, -130108, -167523, 60091, -218348, -92428, -32456, 152015, 9031, -166074, 30630, 154140, 174608, 207230, 88056, -163249, 10217, 104435, 287403, -70536, -88774, 137773, -74237, -82754, 9714, -24583, -159108, -92962, -11972, 78430, -108006, -166103, -77917, -174026, -119640, -99337, 111970]
15392A3021J29293B4631O7929j5207a69866e8243j49498B02289L4491G3526b28499
15380d15226b03114E6699i2108B00728d0088B3884K28795r7750J24797a56747
15369B737J69755A7823b44886J01991f4838j33548F6730b05104H6593g579k3165
15358c0744l01920a8923B31483d6923f529j91742C25841Q534r6318J18431a26682
15346E7990J32758q6895e3849B55377a1870j21682J1388a5148k47114D0280J0130
15335E0410K10884M7973a56938C77328a43244d4970A94766C7868J08404B6075
15324i6850H2564b60283E3564L4881P6686I843O9681P9912F7497k8274O4591Q9794
15312A93608o1037N8515R0323j25207i4625k00829j7612B02134m5452M5667f09
$$ y = [13021, 142314, 24631, 92560, 77353, -169866, -58243, -207741, 202289, 236780, 73526, -228499, -415226, -203114, 56699, -92108, 200728, -40088, 23884, 252679, 154929, 279726, -156747, 2737, 172492, 17823, -244886, -142895, -64838, -198386, 66730, -205104, 86593, -7579, -30744, -332664, -18923, 231483, -46923, -6529, -198271, 325841, 334375, 238057, 356488, -126682, 57990, 190748, 103853, -53849, 255377, -11870, -133552, -122164, -15148, -262262, 40280, 50410, 261294, 309267, -156938, 377328, -143244, -44970, 194766, 37868, 146272, 26075, -96850, 82564, -260283, 53564, 88445, 165131, 9843, 79524, 159436, 67497, 39223, 103814, 193608, 132571, 191086, 281409, 156202, -94625, -295454, -313066, 202134, 156682, 202349, -609]
15300A42005M7274G553J32240J87473m4452g2540B60961M8091A2906J81554a33013
15288A81913a42329C84698a631A58853J07864a23192A15461F223L8037c01803
15277e3395I9029a62320H9107e569j83937k0424A73413c1393A31455g3736a8425
15265G1716C5488a01370B59538A09066g5397B39305a09468A13876a55538A48485
15254C45934m3855K6448q6648A15248K67989L84301M03943L43104j19283J62869
15244A558171k38874o40401k87499A89582J38667A7620K51343F3768J2010B5380
15233A60777h8991B63282q7675F6636K92808m4428b41680A69019N4143a69265
15222C28255c8278B23260J01592e7370A37119B2287d5070o9370A17065f3476k2468
$$ y = [142005, 189279, 7553, 139793, 327266, 282814, -72540, 260961, 309052, 12906, 194460, -133013, 181913, -142329, 384698, -1631, 158853, 266717, -123192, 115461, 6223, 44260, -301803, -53395, 99029, -162320, 89107, -5569, -189506, -209930, 173413, -31393, 131455, -73736, -18425, 71716, 35488, -101370, 259538, 109066, -75397, 239305, -109468, 113876, -155538, 148485, 345934, 302079, 328527, 241879, 115248, 383237, 767538, 1171481, 1514585, 1395302, 1558171, 1319297, 678896, 391397, 189582, 328249, 17620, 268963, 63768, 75778, 25380, 160777, -88991, 263282, 175607, 66636, 359444, 315016, -241680, 169019, 223162, -169265, 328255, -38278, 223260, 324852, -57370, 137119, 22287, -45070, -114440, 117065, -63476, -85944]
15211h5944f758B10976O2695J13202a56402a8760B10883b1179C40985j09641j06035
15200A25309b06984H9311O0967b0436B10437P5251j12605p2081J6129c07159A79960
15188A11094a19230D80765A18475j3004J51373b6562B49209g3932k45194h7035
15177C86519a50289B88759a44081M8104L6557D22592a29788A57346K05376a79764
15166A34223i359H2965J81520A14663L04427A62867M6821J03162a43872B15928
15155a72196A39733o3870a95729A84432L83953I968h5850A64338K27725M6009
15145D38072A3948F228L76921J01834H4381j7963K25660j7835E7787a1827j66931
15134a78758G9788B3878a67592B69452j27186a51817a4222B48518M5388p4926
$$ y = [-85944, -6758, 210976, 273671, 386873, -156402, -18760, 210883, -21179, 340985, 231344, 125309, -206984, 89311, 150278, -20436, 210437, 285688, 173083, 101002, 117131, -307159, 179960, 111094, -119230, 480765, 118475, 105471, 256844, -26562, 249209, -73932, -319126, -87035, 386519, -150289, 288759, -144081, -95977, -59420, 422592, -129788, 157346, 362722, -179764, 134223, -9359, 82965, 264485, 114663, 419090, 162867, 209688, 312850, -143872, 215928, -172196, 139733, 75863, -195729, 184432, 568385, 9968, -85850, 164338, 392063, 438072, 13948, 6228, 383149, 484983, 84381, 66418, 292078, 274243, 57787, -11827, -178758, 79788, 23878, -167592, 269452, 142266, -151817, -14222, 248518, 293906, 218980]
15124B18980R158J63596B4397h3716B31014e4966C85538a881A32215J96522j22185
15113B06552K63129e2679C05653A24373h8501H8287K44985Q1041H1417Q9469P1937
15102B42823C5830L41597c9529B84929j35608k9461K09080J71204B46286d5725
15091H5008d80691A95528k3550j2553a6390j81212A66810K9869a0148C2388K18302
15080B50690F3546K89237B2995L29358D8331K76996j46394K4143d1604A53691
15069B54401J30785i4231A89448a98928A45590L02171j65967A26760P4708C290
15058B64744k5893G6734M30505d3323l5988I2635M84899I3121J18887M8586J16654
15047C77248A53479P8233p934q2680D7713J40461J56658j18804j8833N2085J7052
$$ y = [218980, 228138, 391734, 24397, -83716, 231014, -54966, 385538, -1881, 132215, 328737, 206552, 469681, -52679, 305653, 124373, -88501, 88287, 333272, 414313, 81417, 170886, 242823, 35830, 377427, -39529, 284929, 149321, 119860, 328940, 500144, 246286, -45725, 85008, -480691, 195528, 171978, 159425, -16390, -197602, 166810, 196679, -10148, 32388, 250690, 63546, 352783, 22995, 352353, 48331, 325327, 178933, 203076, -41604, 153691, 254401, 385186, -94231, 189448, -198928, 145590, 447761, 281794, 126760, 201468, 3290, 264744, 238851, 76734, 507239, -43323, -79311, 92635, 577534, 93121, 212008, 260594, 377248, 153479, 231712, 223778, 141098, 47713, 188174, 344832, 226028, 207195, 259280, 276332]
15036B76332m107a39240C98165j09193J01128r7755c3378D07620F508K94907q8703
15025B12712J16378P4898L13193B83732J06788A51446L6177K47406A73996j1029
15015A62967K84443j07524J79206k33435l2044K1373l9994O1473C8201M22327
15005D60528j6192a32104G4768O5840K20379I6119J95357q4371E7484g3778B75623
14993B01619J11753i9719B84131q6837J91692A03328m8231K01888L2641a9056
14982B52876q1972L01855q4792j87639a07813A62523P0358K5730J83457A70804
14971C34751i1224C38456a9333D51815A15788L0021J23987K04596j64639j22378
14961A87375K8043I9927K11292J53821A97938K19160j32592m9607J5853o4389
$$ y = [276332, 272225, -139240, 398165, 288972, 390100, 292345, -33378, 407620, 6508, 301415, 212712, 329090, 403988, 717181, 283732, 390520, 151446, 187623, 435029, 173996, 162967, 447410, 339886, 519092, 285657, 253613, 274986, 234992, 296465, 38201, 460528, 444336, -132104, 74768, 140608, 360987, 96119, 291476, 207105, 57484, -73778, 275623, 201619, 313372, -99719, 284131, 197294, 388986, 103328, 55097, 256985, 289626, -19056, 252876, 170904, 472759, 387967, 200328, -107813, 162523, 232881, 258611, 442068, 170804, 334751, -91224, 338456, -19333, 451815, 115788, 145809, 269796, 474392, 309753, 187375, 215418, 99927, 311219, 465040, 197938, 417098, 284506, 234899, 250752, 186363]
14951A86363K11871A53813L49769m5426j58304J38026o5340n7283o239j7312k0765
14940B70939o8328L10954l146j65961J25439A55806M7005L64350A37705M49646
14930E87351B18953J30526B8110J97786J59179j76315k4774Q0949A06263K60662
14920C66925Q2228A66872L0478L09016q6509q3258K6339J01397J6371n9746j40910
14909B80050K23607m1711l9719J42645M7664k05492j93747M14893k53581A40902
14898B35402J42890A40924L83409j67533A73388N3293J74758P8479k05592J54042
14888D28368r9854N8334P248K34164j93010k08420R6780L77244C31600j29271
14878B02329K75758A83338K39634j21396J43164j23957P2855P9627Q7757j74068
$$ y = [186363, 398234, 153813, 503582, 458156, 299852, 437878, 372538, 315255, 309016, 291704, 270939, 202611, 513565, 510419, 344458, 469897, 155806, 202811, 567161, 137705, 587351, 218953, 349479, 28110, 225896, 385075, 208760, 183986, 264935, 106263, 366925, 449153, 166872, 197350, 506366, 419857, 336599, 362938, 464335, 480706, 420960, 280050, 503657, 461946, 422227, 564872, 612536, 407044, 213297, 628190, 374609, 140902, 235402, 378292, 140924, 524333, 356800, 173388, 226681, 401439, 479918, 274326, 428368, 328514, 386848, 394096, 628260, 435250, 226830, 323610, 700854, 331600, 202329, 478087, 183338, 422972, 301576, 444740, 320783, 393638, 473265, 561022, 386954]
14868C86954L88294l26242j42956I0269P16390k86417M3705k056K3116j65333
14858D19674q8130J13986K0829l4746l1748j07550J74157l7193O0797L4706B03948
14846G70766C37099J84891O6986r8170j65591J18553o9379J37270B42150L43110
14836E85260k87660L48000L9326J7082k64429n397J73928j5967j83492K44226
14826F50877N8668k50075J50773J11874p6623M8047k68161K15067k47698K93621
14816F86370l23557j0856J02891O6114L0455J97380j089k42565J7665K5510K10444
14805G58762k28082L098j09077K06623O5230Q3449L3672l43940J20780j48533
14795D41982K13257N1540j18566K17306m6047l53965K48791J28866j50023k2069
$$ y = [386954, 775248, 449006, 306050, 90269, 806659, 520242, 563947, 561891, 585007, 419674, 331544, 445530, 466359, 431613, 399865, 292315, 466472, 429279, 490076, 524782, 203948, 770766, 337099, 521990, 588976, 490806, 325215, 443768, 374389, 511659, 242150, 585260, 297600, 645600, 684926, 702008, 437579, 432182, 606110, 590143, 406651, 650877, 709545, 459470, 610243, 722117, 645494, 693541, 425380, 640447, 392749, 686370, 362813, 351957, 454848, 520962, 551417, 748797, 747708, 505143, 522808, 548318, 758762, 530680, 533778, 424701, 631324, 696554, 780003, 813675, 469735, 590515, 441982, 655239, 706779, 588213, 805519, 759472, 405507, 654298, 783164, 633141, 611072]
14785F11072P6101J13017n2020P9131k87238J90678j15385l721j70978M79894
14775I20551n085p2825l87605K15373J2586K21371j04341L1998j14777r490L4544
14764G42300J63710l73505K68940J28297l44551K78872J20533j34275p9488K65930
14754A036763k32918j25410K46495l67835L73475l04800J74265K28869l46697
14745F82207O5941K07150K24570m68555J39449N521J7375j89146P0501M07502
14735A162515k11915l90095l7109N44137j45781L2715J46724k33970j36283j18736
14725F12202K02889K41922k31747J51243Q7093l9155l22800L00817j53473J34094
14715I83085j79487R5192M4910L3969k87966L09688J96515L3776j15788r9994
$$ y = [611072, 687173, 800190, 748170, 827301, 540063, 730741, 615356, 611635, 440657, 920551, 915466, 842641, 455036, 670409, 682995, 904366, 800025, 832023, 717246, 707756, 742300, 906010, 532505, 801445, 929742, 585191, 864063, 984596, 850321, 770833, 1036763, 803845, 678435, 924930, 557095, 930570, 625770, 800035, 1028904, 682207, 748148, 955298, 1179868, 711313, 850762, 856283, 873658, 684512, 755013, 1162515, 950600, 560505, 523396, 1067533, 921752, 954467, 1101191, 867221, 730938, 612202, 815091, 1057013, 825266, 976509, 1063602, 1024447, 701647, 1002464, 848991, 983085, 803598, 898790, 943700, 977669, 689703, 999391, 1195906, 1229682, 1113894, 1013900]
14705A013900K14469m73769R8672J42828l24967M99496J4073J75455j62297r0360
14695A107500l14097K60307O0866j71208J84641j27985J33756n096J40807j39461
14685A130030J3081k68398L77825j49646j98809N87354l29531J3044r8775j2729
14675A063446K62527o817k68399J49817j27192J53379l25621M97905J702j06557
14665A294190J49895n2007r2465R9892N2617O2572R307l69928n7775J34702l94200
14654H36800K88382L95244l31901Q3502k17642L22648L2264K54717o42397M22551
14644A444168q7967K74295r7546j13926l528K84688j1213n39787L46313k61846
14634A233651L5456M64386k48272K60744m24686O28279n34559N70474n82569R3375
$$ y = [1013900, 1228369, 754600, 853272, 996100, 671133, 1170629, 1184702, 1360157, 1197860, 1107500, 793403, 1053710, 1114576, 943368, 1128009, 1000024, 1133780, 1128684, 1269491, 1130030, 1143111, 874713, 1252538, 1102892, 904083, 1491437, 1161906, 1174950, 1076175, 1063446, 1325973, 1319156, 1050757, 1200574, 1073382, 1226761, 901140, 1399045, 1400747, 1294190, 1444085, 1392078, 1299613, 1399505, 1452122, 1514694, 1524001, 1154073, 1096298, 1231000, 836800, 1125182, 1520426, 1188525, 1272027, 1054385, 1377033, 1409297, 1664014, 1021617, 1444168, 1356201, 1630496, 1532950, 1419024, 1415496, 1700184, 1688971, 1149184, 1495497, 1233651, 1269107, 1733493, 1485221, 1745965, 1321279, 1949558, 1414999, 1985473, 1402904, 1496279]
14624A496279M12341j04242j09106M3623R8134k03554O5640l25254K18128J02987
14614A694976K83982l37833L31049j20550k1943K3304m33102M57780J73497k86632
14604A764528L42655n56369L71556J03073K00606j72165j02362J42923q7268l5986
14594A971191J74280j09029r9456L19440o62N676l07051N66885j41576K3732q6573
14583B316857j13820L19560n8585k10092L16953l28711L84191l7163O1356P5146
14573B725692j09894n9606K06102q7404p177L1178J81934K26953l5058k41904
14563B830816J91620n5281K25629j1725k55105L86740N0061N90350j83282K31515
14553D001338N13958J99808P77775R41082J605021L779919Q272131J2089584L299101
$$ y = [1496279, 1908620, 1804378, 1695272, 1738895, 1837029, 1633475, 1699115, 1373861, 1591989, 1694976, 1978958, 1641125, 1972174, 1851624, 1829681, 1852985, 1419883, 1877663, 2051160, 1764528, 2107183, 1550814, 1922370, 2025443, 2226049, 2053884, 1951522, 2094445, 2007177, 1971191, 2145471, 2036442, 1936986, 2256426, 2255764, 2261440, 1954389, 2521274, 2379698, 2403430, 2316857, 2203037, 2522597, 2464012, 2253920, 2570873, 2242162, 2626353, 2589190, 2650546, 2725692, 2615798, 2556192, 2762294, 2674890, 2667713, 2698891, 2880825, 3107778, 3072720, 2830816, 3022436, 2967155, 3192784, 3181059, 2925954, 3312694, 3362755, 3953105, 3769823, 4001338, 4515296, 4715104, 5492879, 6433961, 8038982, 11818901, 20091032, 32180616, 35479717]
14544C5479717r171913j2705218o273130k715411q35365m86933k75131P8346k63206
14535B831756J31111k91079j05518j47459J44070K80769J98790l75475J18661
14526B785626j16153L45367k55073L43P7968N9656J93961J88469l7901k12956
14516C029307l3985n7494K04875R5722Q7605r4712L13625R3756j34686o0818R814
14505C453009p1474p6224K90505k54578M25190j61344o184j6836K62538L72889
14495D217491l68752K93503k776n346l44213K92435R0100j94418K62907J06945
14485D347876K38729j16005Q6469j02326J54919k08868O0069R416J52372R7997
14475D720648q952M8331n6717J65514J55012q1353P9639J79126m693q2962P4528
$$ y = [35479717, 26307804, 13602586, 7329456, 4614045, 3778680, 3291747, 3016616, 3094962, 2831756, 2962867, 2671788, 2566270, 2418811, 2562881, 2843650, 3042440, 2666965, 2785626, 2669473, 3014840, 2759767, 2760110, 2838078, 2897734, 3091695, 3280164, 3242263, 3029307, 2995322, 2937828, 3142703, 3238425, 3326030, 3231318, 3544943, 3638699, 3504013, 3443195, 3453009, 3381535, 3305311, 3595816, 3341238, 3766428, 3605084, 3598900, 3582064, 3844602, 4217491, 3848739, 4142242, 4139466, 4134120, 3789907, 4082342, 4172442, 3978024, 4240931, 4347876, 4586605, 4470600, 4557069, 4454743, 4609662, 4400794, 4460863, 4470279, 4622651, 4720648, 4711696, 4760027, 4703310, 4868824, 5023836, 4942483, 5022122, 5201248, 5196555, 5113593, 5188121]
14464E188121O3448K59055q0216l255J22438M68735l12474J84713K61137n8571
14454F093131R8903j31010j34360M56163l8137r9552J66612K55363k5374r1812
14444F549927M68764l69189L58575r5673L66975o5381J39781K76148j45719K55612
14434G739820j03439P7673M64118n32864O07102p9753K91605Q7549k56731J54206
14424H449286L28196m3625K11634K57992J10095l16458P33114k12605J74147K11578
14414I903354K36490O0579r7989M10198P2880L90797j55472K30905k8095L78847
14404A1402494m9545J99467L99304J35336K17942P805K47126P1941M00063J80648
14394A3212581k5930N66471K45362L15611o9429L7828M60848J75716J54311N72395
$$ y = [5188121, 5251569, 5510624, 5430408, 5427153, 5549591, 6018326, 5705852, 5890565, 6151702, 6093131, 6192034, 6061024, 5926664, 6382827, 6344690, 6245138, 6411750, 6667113, 6641739, 6549927, 7018691, 6649502, 7008077, 6912404, 7279379, 7213998, 7353779, 7629927, 7484208, 7739820, 7636381, 7714054, 8178172, 7645308, 8252410, 8172657, 8464262, 8551811, 8295080, 8449286, 8777482, 8733857, 8945491, 9203483, 9313578, 8997120, 9730234, 9517629, 9691776, 9903354, 10139844, 10200423, 10102434, 10512632, 10585512, 10976309, 10820837, 11051742, 11023647, 11402494, 11352949, 11552416, 11951720, 12087056, 12304998, 12312803, 12559929, 12631870, 13031933, 13212581, 13186651, 13753122, 13998484, 14314095, 14244666, 14282494, 14743342, 14919058, 15073369, 15645764]
14384A5645764J9611M47773m3202N84212m2789L84170N07179K92656L35361j14438
14374A8016297O27163N06274M80560K49779R7128N25035O42662M1635R20936M77863
14364B2585332L71599N25542J31195N09532L95273R92368J45879N75437P51273
14355B6983430Q40599N82242L10272Q50523P35399N40680Q35604O34310R88765
14346C3301824N95723R55165J075649P99972R52166R09742Q82567J104516Q15628
14337D1392952J515786J420595J294080Q16346J297722J333120J546628J232015
14329E1849244J531910J723711J750922J849468J961971J711121J773890K680569
14321F6832806J943175K456287J965273K765601K821703K841945K697511L047503
$$ y = [15645764, 15665375, 16113148, 16069946, 16654158, 16611369, 16995539, 17502718, 17795374, 18130735, 18016297, 18643460, 19149734, 19630294, 19880073, 19977201, 20502236, 21144898, 21186533, 22107469, 22585332, 22956931, 23482473, 23613668, 24123200, 24518473, 25510841, 25656720, 26232157, 26983430, 27824029, 28406271, 28716543, 29567066, 30302465, 30843145, 31678749, 32313059, 33301824, 33897547, 34852712, 35928361, 36728333, 37680499, 38590241, 39472808, 40577324, 41392952, 42908738, 44329333, 45623413, 46439759, 47737481, 49070601, 50617229, 51849244, 53381154, 55104865, 56855787, 58705255, 60667226, 62378347, 64152237, 66832806, 68775981, 71232268, 73197541, 75963142, 78784845, 81626790, 84324301, 87371804]
14313H7371804L417837L418829L579911L499440M245745L925580M738609M441813
14305A18639568M743763N206628N548414N526498O254959O382710O352424P198403
14297A65853367P459728Q159891Q233051Q818438R571257R718618R892815J0928766
14289B38635931J1475629J1723118J2220007J2924354J3459232J3398788J3828645
14282C27665704J4292694J4359122J4156297J4495659J3829575J3026757J2408147
14275D24233955J1305721R739370O879287L248916j229997k042474n218108j51223
14267D46765447l357912o543127q587446j1397762j2985800j2965802j3547444
14260C77380154j3424737j3675873j4277524j4168394j3379836j3148810j3491099
$$ y = [87371804, 90789641, 94208470, 97788381, 101287821, 105533566, 109459146, 114197755, 118639568, 123383331, 128589959, 134138373, 139664871, 145919830, 152302540, 158654964, 165853367, 173313095, 181472986, 189706037, 198524475, 208095732, 217814350, 227707165, 238635931, 250111560, 261834678, 274054685, 286979039, 300438271, 313837059, 327665704, 341958398, 356317520, 370473817, 384969476, 398799051, 411825808, 424233955, 435539676, 445279046, 452158333, 455407249, 454177252, 452134778, 446916670, 446765447, 443407535, 436864408, 428276962, 416879200, 403893400, 390927598, 377380154, 363955417, 350279544, 336002020, 321833626, 308453790, 295304980, 281813881]
14253B81813881j2892081j3198773j2811581j2008006j1920900j1037236j0648606
14246A97296698r630970r368637q690477p747424p943774p007204o922525o485196
14238A33500491n652057n798031n191129m798417n119180m127208l974891m099674
14230I4739904l602537l971634l078765l320838k826808l078411k970593k535520
14222F9354798k215296k483440k390732j553862k012622k046569k323482j533934
14214E2794861j011670j804919j421173j933112j037343j642866r23971q30303
14206D2189504j300833j204059j363399j138797p11251j049667r41924m07662
14198C4071912j196581q40830r48916p29399m63340p88072q85145q03098n77210
$$ y = [281813881, 268921800, 255723027, 242911446, 230903440, 218982540, 207945304, 197296698, 187665728, 178297091, 169606614, 161859190, 153915416, 146908212, 139985687, 133500491, 127848434, 122050403, 116859274, 112060857, 106941677, 102814469, 98839578, 94739904, 91137367, 87165733, 84086968, 80766130, 77939322, 74860911, 71890318, 69354798, 67139502, 64656062, 62265330, 60711468, 58698846, 56652277, 54328795, 52794861, 51783191, 49978272, 48557099, 46623987, 45586644, 43943778, 43019807, 42189504, 40888671, 39684612, 38321213, 37182416, 36471165, 35421498, 34479574, 34071912, 32875331, 32034501, 31085585, 30356186, 29892846, 29104774, 28219629, 27416531, 26839321]
14189B6839321p02706k87237j325056r7308l50589q44498o60966j33905p50446
14180B1686610m37091o9931n65129o37542k99597m65123l52973k75638o50589
14171A7932997N0917q13894m0527l05193j65712k96842l33995o69669j40678k90359
14161A4927045p3299l62556j10263k88870l98989l43316l09535l30211K15809
14152A2925815k16236j95737l77679k4216n17934K21851o45193J98228k32189
14143A1136710m10173j57640r8242k73941k4280l7085j79121p874j30994k54753
14133I562607m3875p06276K85761j68k41633q8411p9634k69267r0704j39594R4310
14122H283116j14761k07167k25338N899k41134Q1918k78522K77216k08889j59104
$$ y = [26839321, 26136615, 25849378, 24524322, 24427014, 24076425, 23231927, 22570961, 22437056, 21686610, 21249519, 21179588, 20614459, 19976917, 19677320, 19212197, 18859224, 18583586, 17932997, 17983914, 17170020, 17129493, 16824300, 16658588, 16361746, 16027751, 15358082, 15217404, 14927045, 14853746, 14491190, 14380927, 14092057, 13693068, 13349752, 13040217, 12710006, 12925815, 12709579, 12513842, 12136163, 12111947, 11594013, 11815864, 11170671, 11368899, 11136710, 10726537, 10568897, 10470655, 10196714, 10172434, 10135349, 9956228, 9948354, 9817360, 9562607, 9518732, 8812456, 9098217, 9098049, 8856416, 8768005, 8688371, 8419104, 8328400, 8188806, 8283116, 8168355, 7961188, 7735850, 7741749, 7500615, 7582533, 7304011, 7581227, 7372338, 7213234]
14112G213234j11401K4973J3925k18913m50921J62247r9373j14032J30399l60717
14102F189421K91255m27764k00101L68778K8403l38092m78284M93140k91680K94303
14092E929379k50445o1254k4386k14461J84073l67628O764m3154j4019J45900
14082E290769m78258J67300n4384k26493M69415l87876K49010l96891k01237M678
14072D436033j9935K16128l59170L1066J07643j16726j0732p7447l9455m1960
14062D125445l90283L88789j00736n1786k63194L55912j72009J15914n02037N53422
14052D059437j25349K3309l59297o8907Q3331j33623N396j16173J2076q949K9602
14041C400853l05348L73733j77638K3880k1745J00002j12163j15278m3690J43015
$$ y = [7213234, 7101833, 7126806, 7140731, 6921818, 6470897, 6633144, 6533771, 6419739, 6550138, 6189421, 6480676, 6052912, 5852811, 6221589, 6249992, 5911900, 5433616, 5926756, 5635076, 5929379, 5678934, 5617680, 5593294, 5378833, 5562906, 5195278, 5202042, 5158888, 5144869, 5290769, 4812511, 4979811, 4925427, 4698934, 5168349, 4780473, 5029483, 4632592, 4431355, 4436033, 4416098, 4632226, 4273056, 4304122, 4411765, 4295039, 4284307, 4206860, 4167405, 4125445, 3735162, 4123951, 4023215, 3971429, 3708235, 4064147, 3892138, 4008052, 3506015, 4059437, 3934088, 3957397, 3598100, 3529193, 3612524, 3478901, 3484297, 3368124, 3380200, 3371251, 3400853, 3095505, 3469238, 3291600, 3315480, 3293735, 3393737, 3281574, 3166296, 3122606, 3265621]
14031C265621j77184j45758K50914q2257j05987q7983j3966J85920J05872q0280
14021C114912n75616q6068K63240J0798j13333R7976k82310L81607R9845l92269
14011B518782J4800l11209P2805K50007p7725n3722K10140m78349K12035j71920
14001B185644M7606J73953j2962n2497P2119K61041k41569q3440K4930K71246
13991B646071J13618L69062J019064K995152O630434J2902094P412306o032143
13983B8055658j1615887n992130l205721j687474q22068q09618j68398j90672
13975C563690l25797j81759L5775j31450j52849k5710l82775L3275O0671l68589
13965B124482K3710M92533n21655l0566J91366k06339l759k00410L24352l14874
$$ y = [3265621, 3088437, 2942679, 3193593, 3111336, 3005349, 2917366, 2903400, 3089320, 3195192, 3114912, 2539296, 2453228, 2716468, 2727266, 2613933, 2711909, 2429599, 2811206, 2911051, 2518782, 2533582, 2222373, 2295178, 2545185, 2467460, 2413738, 2623878, 2145529, 2357564, 2185644, 2233250, 2407203, 2394241, 2341744, 2413863, 2674904, 2433335, 2349895, 2374825, 2646071, 2759689, 3128751, 4147815, 7142967, 13773401, 26675495, 34087801, 28055658, 16439771, 10447641, 7241920, 5554446, 4732378, 3922760, 3754362, 3563690, 3237893, 3056134, 3091909, 2960459, 2807610, 2781900, 2399125, 2432400, 2493071, 2124482, 2148192, 2640725, 2119070, 2088504, 2279870, 2073531, 2069772, 1869362, 2193714, 1878840]
13955A878840N10248n50351p2670L03589k75661J45635J10585j94959J24636j89574
13945A790318J1397K05551j17697k3253J30497j73118L01150k23330q0799j39049
13935A681667q1353J6059L10725m35491J27537j48389L74706K33683k18538j91203
13925A669403k4974m94663M10701j87483J45442r1913O0984J23772k02786K03389
13915A611872K4278j87244K27919m13064J81345j86075J94756O6821k24149k75962
13905A020497J30094L5388J39956l610R9459j31145J83002M3579k55385j13445
13895A148390K43943j3056L4101j56466j63030J657K50816m2956j85341J33164
13885A251222j57560J82931J50326q5643J48475l72701L88767m43163P52558n37881
$$ y = [1878840, 2389088, 1838737, 1766067, 2069656, 1793995, 1939630, 2050215, 1855256, 1979892, 1790318, 1801715, 2007266, 1889569, 1866316, 1996813, 1823695, 2124845, 1901515, 1820716, 1681667, 1600314, 1616373, 1927098, 1491607, 1619144, 1470755, 1845461, 2079144, 1860606, 1669403, 1644429, 1149766, 1560467, 1372984, 1518426, 1426513, 1487497, 1611269, 1408483, 1611872, 1636150, 1448906, 1676825, 1263761, 1445106, 1259031, 1453787, 1520608, 1296459, 1020497, 1150591, 1185979, 1325935, 1322325, 1421784, 1290639, 1473641, 1517220, 1261835, 1148390, 1392333, 1379277, 1413378, 1256912, 1093882, 1095539, 1346355, 1303399, 1118058, 1251222, 1093662, 1276593, 1426919, 1341276, 1489751, 1117050, 1505817, 1062654, 1815212, 1277331]
13875A277331k20257M54757j59931J81348l20068j88211L06907j34344K24964
13866A422496j87456k71562L02330o2116j26316j16508J46123K95997m58856j29916
13856H14216q4351J91854J62588j34358J3578J01131K6164J06761j15603k76706
13846H05274K71901j34674m3008Q234L4331l71532N91929k12772K3068k72819
13836F99932M93753m09447K64431k84132m7655K66336k2004N7407R9288k45452
13826H72457L06999j44918k37044Q1507J80495l72809l03471N58104J19068Q8897
13816A149285N5751q8805D99454K95446N2310j90962K39508q1090j04551J96435
13806I06550Q25l1109j15560N2968q6396l03165K32352o9512j690K54951K96781
$$ y = [1277331, 1057074, 1511831, 1351900, 1533248, 1213180, 1024969, 1331876, 1197532, 1422496, 1235040, 963478, 1265808, 1203692, 1077376, 960868, 1106991, 1402988, 944132, 814216, 729865, 921719, 1084307, 949949, 963527, 1064658, 1090822, 1197583, 1081980, 805274, 1077175, 942501, 899493, 907727, 942058, 570526, 1162455, 949683, 972751, 699932, 1193685, 784238, 1048669, 764537, 716882, 983218, 961214, 1018621, 1117909, 872457, 1179456, 1034538, 797494, 879001, 1059496, 686687, 383216, 941320, 1060388, 1149285, 1205036, 1116231, 499454, 794900, 847210, 656248, 895756, 814666, 710115, 906550, 907375, 876266, 760706, 813674, 727278, 424113, 656465, 586953, 585263, 840214, 1136995]
13795A136995E06609K42206L1348n4915o1090k54340R5463M29019m2877k07245
13785F84178K31239l30070L851L58682j75397P8856j32373r1228n1533K51871
13775H28076q5564j77408J65045J6611j31391J94490j31762L0625k1227J15773
13765H03268o3518L38875k16863j26122K18599m42470J75151o3791K78186D44880
13754E78164J96618N4067k52787j80042J75505m7721j48927J95932Q3936J79835
13744H34580C01062M59880B30742M65344r8287j83036K17418B93954N64034k43313
13734F14675p0269N1021R6688j81238J14288j15818P562A19920L77670J94374
13724F91964M2129l37840K37584k60471L38275J48627C36314M13868j06938j68684
$$ y = [1136995, 506609, 748815, 780163, 725248, 664158, 409818, 505281, 934300, 891423, 684178, 915417, 585347, 589198, 947880, 772483, 851339, 718966, 627738, 576205, 828076, 742512, 565104, 730149, 746760, 615369, 809859, 678097, 708722, 687495, 803268, 739750, 1078625, 861762, 735640, 954239, 511769, 686920, 623129, 901315, 444880, 578164, 774782, 828849, 576062, 396020, 571525, 523804, 374877, 570809, 654745, 834580, 301062, 760942, 230742, 696086, 597799, 414763, 632181, 293954, 857988, 614675, 544406, 595427, 692115, 510877, 625165, 509347, 516909, 119920, 497590, 691964, 734093, 396253, 633837, 373366, 711641, 860268, 336314, 750182, 643244, 474560]
13714D74560L7210L78271n4094C32879N80834l67224n5365k27301M10901q4911
13704E89813p1283m9358A97245J61501J3186n2022J31915M2187B09625M81740
13694F91365J80074m16259K12922n6122k33435J72008m318j25457J49174A63396
13683G2138M15822j66303L64874B29849J94455N3434M93833k58740j48068A62670
13672C28023K23203j7217j8202j24322L1133r4396J03610q8649F0122N06111j13505
13661D52728J22871B66282K08795l9937K17990k73629J64941r3057L4442k33687
13651B52140j19949L82767j73541m8689J7725k7876R8306R4624K68790C51843
13640F42912k33010k138o0742A63231H0309J49971L48904j96779N6490j76530
$$ y = [474560, 511770, 890041, 835947, 332879, 913713, 546489, 491124, 263823, 674724, 589813, 518530, 469172, 197245, 358746, 371932, 319910, 451825, 494012, 209625, 691365, 871439, 455180, 668102, 611980, 378545, 550553, 546235, 420778, 569952, 163396, 72138, 487960, 321657, 686531, 229849, 424304, 477738, 971571, 712831, 564763, 162670, 328023, 551226, 534009, 515807, 391485, 422618, 328222, 431832, 343183, 60122, 566233, 452728, 575599, 266282, 475077, 435140, 653130, 379501, 544442, 451385, 485827, 252140, 132191, 514958, 341417, 292728, 310453, 282577, 380883, 475507, 744297, 351843, 642912, 409902, 407764, 347022, 163231, 80309, 230280, 579184, 382405, 438895, 262365]
13630B62365o5397K09419l5713J05084G0680N93878l06442J17762m5800j90383
13620B39695J19441N1974J37748r8899j56861P7461P6821k5399A98325Q5436L21157
13609F04918B37722J37635j75866L32451j89666q8291J89631N3478A65888M29342
13599E95230j93758A50587Q0747A02088j1503f3979F22965k72278j1181r6901
13589B42605J55548k8983j49194P586O4312l4834J20415K8124H1006L95377j30099
13578C46284j34575D9130L03423p6652J1187A40032b306C51981Q4839j78084J05682
13567C64418M1913K1406j7520M32182C12009A36975L83640j61589H7179J09089
13557A96268J25580m8103M24261A86120O9497K44486k6348q7968d7919F25736
$$ y = [262365, 196968, 406387, 370674, 475758, 70680, 664558, 358116, 475878, 430078, 239695, 359136, 411110, 548858, 449959, 293098, 370559, 447380, 421981, 198325, 283761, 604918, 237722, 375357, 199491, 531942, 342276, 253985, 443616, 497094, 165888, 595230, 401472, 150587, 231334, 102088, 90585, -63979, 622965, 350687, 339506, 242605, 398153, 369170, 219976, 227562, 291874, 257040, 377455, 405579, 81006, 476383, 346284, 211709, 49130, 352553, 275901, 287088, 140032, -2306, 351981, 436820, 258736, 364418, 406331, 427737, 410217, 842399, 312009, 136975, 520615, 359026, 87179, 196268, 321848, 273745, 698006, 186120, 255617, 500103, 473755, 385787, -47919, 625736]
13546B08802K58095j48316D1841J95980r7980L3912o2307L63418K47A02063N1665
13535A53728m2463M04395i3275C14087j36016K39790A30816L43814H5046e668
13524B27381k6097J39187n2762A21201L43789A74590R6746K96554A1057K58423
13514B69480i0880H1743N1643J24630I1894D0794L74868j62333r7570Q0758d5547
13502C3442K59934b8699E77069A40346J92853O3504p9491O2162n8843n2836N9306
13491C27001a2550C98977A89282L96877j18073d1811F16304A12582L35660A17950
13480A53403L66271B29010P3532K56036j85546j697R2539j76489o6487P3494j499
13469B92893j30165n4391K841J11088b774o2117D15290A49962M6775R7958m653
$$ y = [208802, 466897, 318581, 41841, 237821, 139841, 173753, 111446, 474864, 475111, 102063, 153728, 111265, 515660, -93275, 314087, 178071, 417861, 130816, 474630, 85046, -5668, 227381, 201284, 340471, 287709, 121201, 464990, 174590, 271336, 567890, 11057, 269480, -90880, 81743, 133386, 258016, 91894, 40794, 415662, 253329, 155759, 236517, -45547, 33442, 293376, -28699, 577069, 140346, 333199, 396703, 317212, 379374, 320531, 267695, 327001, -12550, 398977, 189282, 586159, 468086, -41811, 616304, 112582, 448242, 117950, 153403, 519674, 229010, 302542, 558578, 373032, 371335, 463874, 287385, 220898, 294392, 292893, 162728, 108337, 111178, 222266, -2774, -64891, 415290, 149962, 196737, 294695, 290042]
13458B90042L8874j8346b67332g7255c916A02211d6108E3554Q3704K96016h3350
13446C7K67178h5629C22844P8899P8007E0098L37746A02736M11907j99087h2216
13434A94989M71659A8897R3291K5963J4233a4403B22420A02748e9952A39770K7355
13423A67125o4470K69526A03567J13376C4076a75301I1480K21993n1113o5990
13413A96370H9834J50213B7397j2756K5622J76620J87790A43881C6733J53097
13403A89830O400p6674i9690q9734A11092B4805i5707B03379G2015C316K50443
13392B53759K9044A08993j4864e8235B04651J72065A88336J37296G6436P2122
13382A48558m6765m5067J64120N1343K2530a14127B53948c26251C39154I5743
$$ y = [290042, 328916, 310570, -267332, -77255, -3916, 102211, -46108, 53554, 137258, 433274, -83350, 37, 267215, -85629, 322844, 401743, 479750, 50098, 387844, 102736, 514643, 315556, -82216, 194989, 666648, 18897, 112188, 138151, 152384, -14403, 222420, 102748, -59952, 139770, 167125, 102655, 372181, 103567, 216943, 34076, -175301, 91480, 313473, 262360, 196370, 89834, 240047, 27397, 14641, 40263, 216883, 404673, 143881, 36733, 189830, 196230, 119556, -99690, -189424, 111092, 24805, -95707, 203379, 72015, 3316, 253759, 282803, 108993, 94129, -58235, 204651, 376716, 188336, 325632, 76436, 148558, 101793, 56726, 220846, 272189, 294719, -114127, 253948, -326251, 339154, 95743]
13371B92189j44699J80256K14758B38256a10902E08818B00167R2940m8253J29077
13361C73931l4763j01686L4852j12162J70190I4484R3195h5525G7032a90035D34788
13349E6823L25021L4623H8078K35333e2299C93020J60382B44317j4115J30067
13339C60269A21037a29675C2416a6021B46104E4114d1196D19760n7981A7542K17314
13328B34856p4908a55679C35464k7001N9126a21763D0908J94021b97028C88313
13317a11726E47909M2206b75724B98970k188b1886B58079J30163A6277K53593
13307B69870j22087K91806O5906j31110A35802a33872B58337a52062F6404j4401
13297E2003d1646A91892k0910L2219L6969q3283p1536l7662b401F8180L19284
$$ y = [292189, 147490, 327746, 542504, 238256, -110902, 508818, 200167, 293107, 244854, 373931, 339168, 237482, 272334, 160172, 330362, 94484, 187679, -85525, 77032, -190035, 434788, 56823, 381844, 416467, 88078, 323411, -52299, 393020, 553402, 244317, 230202, 360269, 121037, -129675, 32416, -16021, 246104, 54114, -41196, 419760, 361779, 17542, 234856, 159948, -155679, 335464, 308463, 367589, -121763, 40908, 234929, -297028, 388313, -111726, 547909, 590115, -275724, 298970, 296782, -21886, 258079, 388242, 16277, 269870, 147783, 439589, 505495, 374385, 135802, -133872, 258337, -152062, 66404, 52003, -41646, 191892, 170982, 203201, 240170, 156887, 85351, 47689, -2401, 68180, 387464]
13286C87464r325A69675L1647f536E89673A0576J98575n30l4928N9502J64899
13275C98094G8877j91L55769A16468D1729K28426H1067J40843A08749a46331C16275
13263C4751g0607l7832G4234K59245q1751l9137a8955A62244R6234J96482H6172
13251C3930R7536c5372B00316b27958A63656M8192d828j79164A95881a5451C53984
13239B53004A06145l2603Q6763J39214j7617J03585H0316J58180j11972O2482
13229A89006b29993B70665a8000k0659C75287a4150G2065a4886A60301b69973
13218C30311f7365A62661e7928A7676K68294a10564C04795A39112n699l2407h0335
13206C0244j2707g5091j46544B0419e264C36145E2091J73220p7065J28862a95730
$$ y = [387464, 378139, 169675, 201322, -6536, 589673, 10576, 209151, 208621, 173693, 233195, 398094, 78877, 78686, 434455, 116468, 41729, 270155, 81067, 221910, 108749, -146331, 316275, 34751, -70607, -108439, 74234, 333479, 251728, 212591, -18955, 162244, 258478, 454960, 86172, 33930, 131466, -35372, 200316, -227958, 163656, 211848, -4828, -183992, 195881, -15451, 353984, 253004, 106145, 73542, 160305, 299519, 281902, 385487, 80316, 238496, 126524, 189006, -229993, 270665, -18000, -38659, 375287, -14150, 72065, -14886, 160301, -269973, 330311, -67365, 162661, -57928, 17676, 285970, -110564, 304795, 139112, 133413, 101006, -80335, 30244, 17537, -75091, -221635, 20419, -5264, 336145, 52091, 225311, 148246, 277108, -195730]
13194A43549K20371E8498J63313f4392A68355a41375A21936R4790a45213L4377
13184a10836d2890B76880p9495b59221H0926N9254K71415B3945R8617b5700E7163
13172C63460A33345j4671d861A74843L75260a04807A07638J89236p7548d126D1173
13160C9112f6119A62451J13364A14344Q5391M5070a48016A46854L4901J24931
13150C06686N520j35524K1404c3703A64710i865j01131j03074A74691d2623I9898
13138A17687n7671b12505A46340r249a81574A39321J45981I8361k4418J20342
13128A94285n4031M1166M7757c3947B61375a54361A75123a79012g3524B6522M43237
13117D69759b11689i1139A58181n0066C373L18510A17763A1943J30883j2951M6946
$$ y = [143549, 363920, 58498, 221811, -64392, 168355, -141375, 121936, 216726, -145213, -110836, -42890, 276880, 197385, -259221, 80926, 140180, 411595, 23945, 122562, -25700, 57163, 363460, 133345, 118674, -4861, 174843, 550103, -104807, 107638, 296874, 219326, -4126, 41173, 39112, -66119, 162451, 275815, 114344, 199735, 244805, -148016, 146854, 181755, 306686, 312206, 176682, 198086, -33703, 164710, -9865, -110996, -214070, 174691, -42623, 99898, 117687, 60016, -212505, 146340, 137091, -181574, 139321, 285302, 98361, 73943, 194285, 140254, 181420, 229177, -33947, 261375, -154361, 175123, -179012, -73524, 26522, 469759, -211689, -91139, 158181, 108115, 3373, 321883, 117763, 11943, 142826, 129875, 176821]
13106A76821K36361A60280R2649a87340D78569d1097j03454D3951J13815C780
13095a0789n6032F9808b59094H8518a44048A00245R2596p2315J38029A28116R9078
13084B27194A3890a21580B45461L7307H1394f3447A67424A0837K69897H3740b80517
13072A59446E7712Q8728K03364k881c1942A34436o2476a08035D0998d4038H1508
13060a8512k0293B31566L70670a67661j08324C14389j05831J346G9162b07067
13049B40295a24381d4485D07436g256B63756a64922B02154c7511j8800D17692
13038D8120J06048j7125C5248j2597e500B52487K0728a10312K4864C09131H2765
13026B88475n5198A4626F423a48677C03868M6916A66740G9146b023j34904A56517
$$ y = [176821, 413182, 160280, 252929, -187340, 478569, -41097, -144551, 43951, 157766, 3780, -10789, -66821, 69808, -259094, 88518, -144048, 100245, 192841, 120526, 258555, 128116, 227194, 13890, -121580, 245461, 282768, 81394, -63447, 167424, 10837, 280734, 83740, -280517, 159446, 57712, 146440, 349804, 346923, -31942, 134436, 71960, -108035, 40998, -44038, 81508, -18512, -38805, 231566, 602236, -167661, -275985, 314389, 208558, 209904, 79162, -207067, 240295, -124381, -44485, 407436, -7256, 263756, -164922, 202154, -37511, -56311, 417692, 48120, 154168, 137043, 35248, 22651, -5500, 252487, 273215, -110312, -85448, 309131, 82765, 288475, 233277, 14626, 6423, -148677, 303868, 350784, 166740, 79146, -2023, -136927, 156517]
13014E4567K10527n738j01429a02333b612A32489a78608H7160A3751Q5887J24488
13003B24126h9769A0293J63584a29177A29491B9671J16577A0139L69880b9014
12992A31843k4221C500Q7960b0786o0556G8218R5858b44385f0451A86216o0531
12981A25685a55862B07096n3426a60416B2209M98841a15890D49560A09000a02857
12970C04345j22193J84925a13215c4890H8177B4605h6080j27056E9353J66202
12960B25555L91931G4065B5553g348I3061L9613B9310N7059A0818m531b09765
12948F7450a8836A2512K01149B1355a19686A46733M0168c27956D03280b68189
12937f1053F6640a3768C8949K45207B5296L0716b63997F9773J27417F5157a06617
$$ y = [54567, 265094, 259356, 157927, -102333, -2612, 132489, -178608, 87160, 13751, 99638, 224126, -89769, 10293, 173877, -129177, 129491, 29671, 146248, 10139, 380019, -29014, 131843, 107622, 3500, 91460, -20786, -81342, 78218, 174076, -244385, -60451, 186216, 125685, -155862, 207096, 153670, -160416, 22209, 521050, -115890, 449560, 109000, -102857, 304345, 182152, 367077, -113215, -34890, 88177, 24605, -86080, -213136, 59353, 225555, 617486, 74065, 25553, -7348, 93061, 132674, 29310, 86369, 10818, 6287, -209765, 67450, -18836, 12512, 213661, 21355, -119686, 146733, 186901, -327956, 403280, -268189, -61053, 66640, -13768, 38949, 284156, 25296, 56012, -263997, 69773, 197190, 65157, -106617]
12925C84431A00359q310J95447a76245f5143A9939M38943a1912l07523A82857
12914C4017b834p9201l4019e423A55581r677J3886A0576R679J94785k6599J73626
12902C62067G7116H104N1516J60807a9282j19427f7867H1491J69101r0187a21137
12890e1503B69533a06869k0784j4859A97512b2885k14375D2979Q9231C2046a93210
12878A98937a08629k48736J56546C9190j2195f7204i848n48980I3226b63590d6413
12866G4670P0471a4999p713B137L02339r6300a55271A07736a87291A18858l3001
12855H5857L6274a06842b4982p0302A12862h0628B19799a21843j01686D39348
12844C82902a5415j00135j31695L2388e3820A25445a36764C01229E7536d1528
$$ y = [384431, 100359, 92049, 287496, -176245, -65143, 19939, 458882, -11912, -319435, 182857, 34017, -2834, -82035, -116054, -5423, 155581, 145904, 159790, 10576, 20255, 215040, 188441, 362067, 77116, 8104, 59620, 220427, -19282, -138709, -67867, 81491, 250592, 160405, -121137, -51503, 269533, -106869, -127653, -142512, 197512, -22885, -237260, 42979, 132210, 32046, -193210, 198937, -108629, -357365, -200819, 39190, 26995, -67204, -9848, -558828, 93226, -263590, -46413, 74670, 145141, -14999, -22712, 2137, 304476, 208176, -155271, 107736, -187291, 118858, 85857, 122131, -106842, -24982, -95284, 112862, -80628, 219799, -121843, -223529, 439348, 382902, -15415, -115550, -247245, -214857, -53820, 125445, -136764, 301229, 57536, -41528]
12833D042M3663R3135K44971A23817l3027L22898I8873a33013j8624j08006C7837
12821E1414K07792b07571P1804E49224k65193K1298j24296i9612F7987K30244
12811B98231j26620q0871a83743f7668A2242a84574c1279j01572L2484p7651P8634
12800i9384B15853b3121b104j4250A09956h4885A17704j4754l5928b0073j22185
12789a42258B23252J71395G7628a82314Q5505B78430c65351A9742c8486B31707
12778B23963b5248B07674E8854a70463A02959i7354K2976o0896A23687J25486
12768B49173H1729Q3566p3380c60757C2397b04802E9172J08203b08930h6693a1858
12756B50365e389I4109c42904h4984M0811a4383j18363O3802A71332G0794a83655
$$ y = [4042, 47705, 140840, 385811, 123817, 90790, 413688, 98873, -133013, -151637, -259643, 37837, 51414, 259206, -207571, -135767, 549224, 284031, 305329, 181033, -99612, 67987, 298231, 171611, 90740, -183743, -67668, 12242, -184574, -31279, -132851, -100367, -178018, -99384, 215853, -23121, -2104, -16354, 109956, -84885, 117704, 102950, 67022, -20073, -142258, 223252, 394647, 77628, -182314, -96809, 278430, -365351, 19742, -38486, 231707, 223963, -25248, 207674, 58854, -170463, 102959, -97354, -74378, -135274, 123687, 249173, 81729, 165295, 91915, -360757, 32397, -204802, 59172, 167375, -208930, -86693, -11858, 250365, -5389, 94109, -342904, -84984, -44173, -14383, -132746, -68944, 171332, 70794, -183655]
12744A18024O7475b39654B4284L26265j40502b07038A89092l1388O5728l7957
12734A85475k3041a21316B06032b1407l6228A65666d7474m454H7583R0324a11030
12722h0877l10364b8307j07454j66277D8737A2962K21082J31067A06714h6817
12711a87699B42508k0885p1717F2903K35456j14118a1371C85625a41065B77012
12700F2825L78309a89512F30331A0842A235P3178c987B30676f7702A6896L34319
12689C51215f6006O688H331Q8073l7755a82821B21759M9006Q0043f3443r7666
12678a61109F3721i0671k552H8670a46475N6417F0147C178J02416l1464J43461
12667B17591e7695B9237J09003n7836a5496m6874B86957a23319a8494A54137J85429
$$ y = [118024, 185499, -239654, 24284, 350549, 210047, -207038, 189092, 157704, 223432, 185475, 162434, -121316, 206032, -21407, -57635, 165666, -47474, -51928, 87583, 177907, -111030, -80877, -391241, -28307, -135761, -302038, 48737, 12962, 234044, 365111, 106714, -86817, -187699, 242508, 221623, 149906, 62903, 298359, 184241, -11371, 385625, -141065, 277012, 62825, 441134, -189512, 630331, 10842, 1235, 74413, -3987, 230676, -67702, 16896, 351215, -66006, -59318, 8331, 96404, 58649, -182821, 221759, 270765, 350808, -63443, -161109, 63721, -90671, -93223, 88670, -146475, -90058, 60147, 3178, 105594, 74130, 217591, -57695, 29237, 138240, 80404, -15496, -62370, 286957, -123319, -18494, 154137, 339566]
12656C39566F6187c7735A23122l8498l4668L6981L22646G3729a31366p3499I9333
12644B3170a75345h1151H8653M044P4423F1329J55748e2199H7004Q4891l8246
12633A33649F5234h3795B00758o1873N5279o2108J37163H5664K64541M0807g450
12621I4980j1347B1073L51742b12232B82366M421l276a8657l32338B81054b91880
12609D6247c247j61843F3858a01605E6870c5984C06975a10883d7152I0004N437
12598I5441i2079B82659F4456O5445n5417Q0620E8409b12055A88533f4061A72380
12586B939R0508L1399h1381o9320G6643k4071a18997d0377A08721a06123j92745
12575b98868j48390d036l9796B49060O8509n7528j4988i2569H4679b28124C7859
$$ y = [339566, 66187, -37735, 123122, 84624, 49956, 86937, 409583, 73729, -131366, -204865, 99333, 23170, -175345, -81151, 88653, 92697, 167120, 61329, 217077, -52199, 87004, 171895, 133649, 65234, -83795, 200758, 138885, 194164, 132056, 269219, 85664, 350205, 391012, -7450, 94980, 83633, 21073, 372815, -212232, 282366, 286787, 283511, -18657, -350995, 281054, -291880, 46247, -3247, -165090, 63858, -101605, 56870, -35984, 306975, -110883, -47152, 90004, 95441, -92079, 282659, 64456, 129901, 74484, 155104, 58409, -212055, 188533, -64061, 172380, 2939, 93447, 124846, -81381, -150701, 76643, 52572, -118997, -40377, 108721, -106123, -298868, -447258, -4036, -43832, 249060, 317569, 260041, 245053, -92569, 84679, -228124, 37859]
12563B27716A5338P6638I799K30098b16178G2481J01992a04203j24155Q0203D2332
12551D62945F4862K87598b74385A74564J78410j42086o159k3286A2552e767B28685
12539b15265f9933r6731p7537e6494C6741L43914b52335F8885a54309A34242a94171
12527b08244o5728B61177A08615K6032j2091A7901a48135b2740A55643j8234a02792
12515a02646A17647L77778B07189c8182D062O796L48017F3095M3940e8575Q349
12504e0226B16611D5645b4773k53917A43166f4578B075J42305b64531A54410K76625
12493D31035B07111H656a53990O4471j39167A42865a83535I1480m0050a48341
12482A38660e1558A81257A7221Q1837A3175P7416K30103d8946n8860A00277l2766
$$ y = [227716, 15338, 91976, 9799, 239897, -216178, 72481, 174473, -104203, -228358, -148155, 42332, 462945, 64862, 352460, -274385, 174564, 352974, 210888, 204729, 181443, 12552, -5767, 228685, -215265, -69933, -166664, -244201, -56494, 36741, 380655, -252335, 68885, -154309, 134242, -194171, -208244, -273972, 261177, 108615, 134647, 122556, 17901, -148135, -22740, 155643, 137409, -102792, -102646, 117647, 495425, 207189, -38182, 4062, 10858, 358875, 63095, 107035, -58575, -50226, 216611, 45645, -24773, -278690, 143166, -64578, 2075, 144380, -264531, 154410, 431035, 207111, 8656, -153990, -89519, -228686, 142865, -183535, 91480, 51430, -148341, 138660, -51558, 181257, 17221, 99058, 13175, 90591, 320694, -48946, -107806, 100277, 67511]
12471F7511J92938h0424B1409i7663p3586J7134A44683a46906B9884a5260j453
12460a6713B16251c66896d1321B1509J92264a5084o2772r1081O8329B22459A4601
12448A64680a39967A56194f2532B99417G6237b18926M4288a2472j32309H0807
12437A17392a00507j90678A9627K64318a39773j58518m547a00155l9A56078b053
12425A82862a23530D6144O8248a73276H6499N8934a95213E1982a7138j80253E7427
12413G7826J47965b35560A47789a22446k6804b8547B85830A17610L96161A04567
12402b15886N8994d193k0896R632j02176a2057n5704j18522h9253n6067J7418
12391a27902o631b4285A01912C0845J34964G8080R9884a50193I2271M3229O3619
$$ y = [67511, 260449, -80424, 21409, -97663, -171249, -154115, 144683, -146906, 29884, -15260, -16713, 216251, -366896, -41321, 21509, 213773, -15084, -77856, -168937, -100608, 222459, 14601, 164680, -139967, 156194, -62532, 299417, 76237, -218926, -174638, -12472, -144781, 80807, 117392, -100507, -291185, 19627, 283945, -139773, -298291, -302838, -100155, -100194, 156078, -2053, 182862, -123530, 46144, 114392, -173276, 86499, 145433, -195213, 51982, -17138, -197391, 57427, 77826, 225791, -235560, 147789, -122446, -149250, -28547, 285830, 117610, 513771, 104567, -215886, -156892, -4193, -25089, -15457, -117633, -12057, -67761, -186283, -89253, -145320, -127902, -134533, -24285, 101912, 30845, 165809, 78080, 177964, -150193, 92271, 135500, 199119]
12380A99119a54039C3398M2321a23932j49342B43161b00592D147f1407G0685e6026
12368F1131e5441E0633e0658Q64C61191a85246A19851f5803K4769A13301B5395
12356a0288n15557B12185C3446J63449a76016g0466A44183b44505B192b30917
12345b65343e5790J3382J5507j23836A38974c9315B34331a62055A11343a72728
12334a54710N9471A47629A6968a43622K6935F3255J90439d2456m2868L5899A49807
12322B6905J9952N5648a38358A15132a59869A6806J30230b03597H7650b43295
12311a5685k2599B23533q4562e7535J0381A0100a44780j05441D5793d15244B70167
12299B0574a43406F5165i3485j14039M1045A10964N4412Q7074c97250A83161D7093
$$ y = [199119, -154039, 33398, 75719, -123932, -273274, 243161, -200592, 4147, -61407, 70685, -56026, 61131, -55441, 50633, -50658, -49794, 361191, -185246, 119851, -65803, -41034, 113301, 25395, -10288, -525845, 212185, 33446, 196895, -176016, -70466, 144183, -244505, 2192, -230917, -265343, -55790, -42408, -26901, -150737, 138974, -39315, 234331, -162055, 111343, -172728, -154710, -95239, 147629, 16968, -143622, -116687, 63255, 253694, -42456, -85324, -49425, 149807, 26905, 46857, 102505, -138358, 115132, -159869, 16806, 147036, -203597, 87650, -243295, -15685, -38284, 223533, 138971, -57535, -47154, 10100, -144780, -250221, 45793, -415244, 270167, 20574, -143406, 65165, -93485, -207524, -166479, 110964, 165376, 252450, -397250, 183161, 47093]
12287F5909i369r2218B71084c2196k02940B22335A06825J03380p4116D9708l195
12276D6513Q2861J36617i1513C2563O4354j3543N4462a04747b9205A04136J53258
12265B57394J12407C8454J72592D846L24916j64534f6509B23086D8306K35965
12255B84271a28697A23704K06027j14658R8147A39895k8802R1503r2849d5651
12244B7682a61526C56680A65963J2653J1986O1205D3641j8129g6013B08147g8625
12232C48943d2034A2932J84642p8028b143A61441B9379J32660l0706J47129r1799
12221A86663k997K32270F6108K27542n5063M7839p4691L4370b3551q4600A59303
12209A00779J20316n7289K81304d7726j51665B23715M7645J5532a4063B1201J00075
$$ y = [65909, -9369, -101587, 271084, -32196, -235136, 222335, 106825, 210205, 136089, 49708, 46513, 129374, 265991, -91513, 32563, 96917, 83374, 137836, -104747, -29205, 104136, 257394, 369801, 38454, 211046, 4846, 329762, 165228, -66509, 223086, 48306, 284271, -128697, 123704, 329731, 215073, 313220, 139895, 111093, 202596, 109747, -45651, 27682, -161526, 356680, 165963, 178616, 190602, 251807, 43641, 25512, -76013, 208147, -78625, 348943, -42034, 12932, 197574, 119546, -2143, 161441, 29379, 162039, 131333, 278462, 186663, 183666, 415936, 66108, 293650, 238587, 286426, 211735, 246105, -23551, -108151, 159303, 100779, 221095, 163806, 445110, -47726, -199391, 223715, 271360, 286892, -14063, 21201, 121276]
12198A21276L23719A43745C9675o107R0791J05176m3910p058p5440C5250K25149
12187B60399G1250M7051m7310a53686A50346p1731J28991F1879Q8341J07812d105
12175C95593C955L73392g5655C1234J32161O7103b6460j20516A50200J59221d3890
12163G5070a37649D77842i9328M6381j3991A7976a90511A68978l7324m6161j5171
12152G0322q739a41990c3546C3218J03178a26829B10481J1083b18176D7961r461
12141C8500a19255H1809Q4257c23157B74595i082j15786A74386c08912I4574c022
12129A14875J10143B1642a28834A18298d7292A69848G2191j2189b16586j16811
12119c33397G1725K31904A11480J56261b60743d0881a9233j97743A86297i1479
$$ y = [121276, 444995, 143745, 39675, 33568, 124359, 229535, 185625, 178567, 103127, 35250, 260399, 71250, 118301, 70991, -153686, 150346, 78615, 207606, 61879, 150220, 258032, -4105, 395593, 3955, 377347, -75655, 31234, 163395, 230498, -26460, -146976, 150200, 309421, -43890, 75070, -137649, 477842, -99328, -52947, -66938, 17976, -190511, 168978, 131654, 85493, 70322, 61583, -141990, -33546, 33218, 136396, -126829, 210481, 221564, -218176, 47961, 38500, -119255, 81809, 166066, -323157, 274595, -9082, -124868, 174386, -308912, 94574, -3022, 114875, 225018, 21642, -128834, 118298, -47292, 169848, 72191, 60002, -216586, -333397, 71725, 303629, 111480, 267741, -260743, -40881, -19233, -216976, 186297, -91479]
12108A64045J38975a85355I3144b23075G684f0698k07722b1426C59979A32011
12097E7655b13020g7477j12698A42064a14596j21085C06539d0697B55652a02823
12086G5378J76172D7615c6027A1034a87112m4711J04187b4584A41868g6401A90509
12074i7590r1441B81181c33672c6747A92395L29547L68137L46491l75325D28300
12063B22620g6423J2506D4153e4445A6259b19044n7036A66071a90452L0411q0514
12052b40555I0106D2275P6401a14733H6569b32380a03797J3338f570C19616D0534
12040b48611B85459f7852E2348J92549i14q0082p8788D5910n281c6657k72369
12029c09026m1229C5963Q2950k2507j2118b00651I4437K9234b05816A12000a04346
$$ y = [164045, 303020, -185355, 93144, -223075, 7684, -60698, -268420, -21426, 359979, 132011, 57655, -213020, -77477, -190175, 142064, -114596, -235681, 306539, -40697, 255652, -102823, 75378, 251550, 47615, -36027, 11034, -187112, -231823, -127636, -24584, 141868, -76401, 190509, -97590, -189031, 281181, -333672, -36747, 192395, 521942, 890079, 1236570, 861245, 428300, 222620, -76423, -63917, 44153, -54445, 16259, -219044, -276080, 166071, -190452, -160041, -240555, 90106, 42275, 118676, -114733, 86569, -232380, -103797, -90459, -6570, 319616, 40534, -248611, 285459, -67852, 52348, 244897, -914, -80996, -159784, 45910, 40629, -36657, -309026, -350255, 35963, 118913, 96406, 84288, -200651, 94437, 123671, -205816, 112000, -104346]
12017d8465q655I2612I197b9367G7886a41077B9951a39556b7186A41533b17247
12005E4882a41045o7020C0361J28264D597d9669A47895c35352G4124a55062b9797
11993b31255K2003G3593e8832C52044B5743b02559d0662B19345a37522K0429A97887
11981C8441p481a87687R0978B2314e2306A29264e6621A4613f4248A91234A4736
11969d35458E609d10375I8866b39481h5561m2590C54823a2173l71149B37519h8319
11957B03641a30738r9333A37447g4138A719a33543D8352i2389j51349B20463h0373
11945A07212b9161A202a72128P3793A46332O7011a9286G3279J9059d20328h2247
11933b74643B7183d6289B7642J59817b20533f929B4083a85664A31007J60774b50391
$$ y = [-48465, -57120, 92612, 9197, -29367, 77886, -141077, 29951, -139556, -27186, 141533, -217247, 54882, -141045, -208065, 30361, 158625, 4597, -49669, 147895, -335352, 74124, -155062, -29797, -231255, -209252, 73593, -58832, 352044, 25743, -202559, -40662, 219345, -137522, -117093, 197887, 38441, 30960, -187687, -96709, 22314, -52306, 129264, -56621, 14613, -64248, 191234, 14736, -435458, 5609, -410375, 98866, -239481, -85561, -128151, 354823, -12173, -383322, 237519, -88319, 203641, -130738, -230071, 137447, -74138, 1719, -133543, 48352, -92389, -243738, 220463, -80373, 107212, -29161, 1202, -172128, -98335, 146332, 213343, -19286, 73279, 92338, -420328, -82247, -274643, 27183, -46289, 27642, 187459, -220533, -6929, 24083, -185664, 131007, 291781, -250391]
11921b80568A49245o2414k1986i7642C64761b10087A5907N446J40544a9528C44996
11909a88232n9697J21041K2766G5033C0058b2663B1733K5018e8882B7463a8261
11897H6781a87803g0991B31959a57020G7393d2766B16158a7186H0435f4779A0527
11885a05363r8874b1863j22998J9801N5309i641D7753L2603K51675j33670C3644
11873A68763e0769A95350b66257J04565n5735R9155n7861A7759b75582O2466j8350
11862b31466D0514m119J33389a65862B34096i3298G635c40668a68294C61271g4479
11850d5874n2523G3038B6532J51123C6842d1122A0986c75985j25120f7412E9666
11838A95005o4575a5298A47804h7744L082q4386j34230g9215j68795H889P2768
$$ y = [-280568, 149245, 86831, 64845, -97642, 364761, -210087, 15907, 21353, 161897, -19528, 344996, -188232, -247929, -126888, -104122, 75033, 30058, -22663, 21733, 46751, -58882, 27463, -18261, 86781, -187803, -70991, 231959, -157020, 77393, -42766, 216158, -17186, 80435, -64779, 10527, -105363, -204237, -21863, -144861, -125060, -69751, -9641, 47753, 80356, 332031, 198361, 33644, 168763, -50769, 195350, -266257, -161692, -217427, -118272, -176133, 17759, -275582, -213116, -231466, 40514, 36395, 169784, -165862, 234096, -93298, 7635, -340668, -168294, 361271, -74479, -45874, -98397, 73038, 26532, 177655, 36842, -41122, 10986, -375985, -501105, -67412, 59666, 195005, 130430, -15298, 147804, -87744, -84662, -169048, -303278, -79215, -248010, 8889, 81657]
11827H1657f75227A7258N575a88776B1438b37171F3876Q4177b02863A99621a78541
11815e1799l38191c0338l27216a63737j00879i0264B1461K4859b62983B26634
11804b32889a8086A01613a47606g2017j58744R9935l0777r5602B16153a203B0019
11792c1625D9018b87680a41648G4955b9174P798A72658E8287j9685b76673B45568
11780b6204p7727M5427j32056A60081F6284J84152a51826j08888n0968f8143k32674
11769c00817B7211J22396a94107h1077B18414r8920K41840a39232c139k82721
11759b85860B98448b30678a5268A09382a90659f401C18200b33608C8363f2221
11748A13261K7468J8163b7465n6129b4186A41218F889K39147c01225D2036J55327
$$ y = [81657, -675227, 17258, 22833, -188776, 21438, -237171, 63876, 148053, -202863, 199621, -178541, -51799, -389990, -30338, -357554, -163737, -264616, -90264, 21461, 46320, -262983, 226634, -232889, -18086, 101613, -147606, -72017, -230761, -130826, -161603, -257205, 216153, -1203, 20019, -31625, 49018, -287680, -141648, 74955, -29174, -21376, 172658, 58287, 38602, -276673, 245568, -26204, -103931, -58504, -190560, 160081, 66284, 250436, -151826, -260714, -311682, -68143, -300817, 27211, 149607, -194107, -81077, 218414, 119494, 361334, -139232, -3139, -285860, 298448, -230678, -15268, 109382, -190659, -6401, 318200, -233608, 38363, -62221, 113261, 140729, 158892, -27465, -83594, -24186, 141218, 6889, 246036, -301225, 42036, 197363]
11737A97363g2266A78140a43970H7006f3819j3084L809j69085d1515A01275J98591
11726B99866E6134b56593O7305Q5211B15768o1162J01984A11772R042b2937A76783
11714a31023A11180J22406a05148j20692A32725J6746h8847G3896K42096A35799
11703C36496A51421l5453b2896A26203L0726b9515j13919L2903c6346G187K69170
11692B76357j2840I1983K137C0863j4257b70096c7109I8902K20655E4715c25555
11680c91564G8402d158A06121k8030J82860g8179o5802I1699b5598j23201I6402
11668d2621k17693D848a23337B5051H924J49040J31440I284J84901B7372h307
11656b03030A4249h9111N757C3276J49806a12060k56410E8768b12159B3568K647
$$ y = [197363, -72266, 178140, -143970, 87006, -63819, -76903, -73094, -242179, -41515, 101275, 299866, 56134, -256593, -189288, -104077, 215768, 154606, 256590, 111772, 120814, -22937, 176783, -131023, 111180, 233586, -105148, -225840, 132725, 149471, -88847, 73896, 315992, 135799, 336496, 151421, 115968, -22896, 126203, 156929, -29515, -143434, -110531, -36346, 7187, 276357, 263517, 91983, 94120, 30863, 16606, -270096, -37109, 98902, 319557, 54715, -325555, -391564, 78402, -4158, 106121, 78091, 260951, -78179, -143981, 91699, -25598, -148799, 96402, -42621, -260314, 4848, -123337, 25051, 8924, 157964, 289404, 9284, 194185, 27372, -8307, -203030, 14249, -89111, -83354, 33276, 183082, -112060, -368470, 58768, -212159, 23568, 26215]
11645B6215L417K10886C363c1718B07869a6194l8424A19965a25307J3011C90725
11633b48140A9785b87809J43273A77033D562J26583F1905L1830C2634i6987A50140
11621a6858k7897A40601d0914p6600A02138i4701a2597o8882E022a41747A66900
11609I645J14877j0016a24636A84798f2624A55696a55913A19654A6728b02081
11598I1549B4719a54933A00575K32555e0089j83370a05282A436h6435C10254A37755
11586B8034L26604A05135D5627N014K19506C5537A6120N7541B7448J30532R3211
11575B51191k3259m9779o7590C0666a18967C25695A32855m0401C6520a63979B24152
11563A962a46220n7143C08695a53558P5179q5307A58887n9543R7162C9507K45671
$$ y = [26215, 29632, 240518, 3363, -31718, 207869, -16194, -54618, 119965, -125307, -112296, 390725, -248140, 19785, -287809, -144536, 177033, 4562, 131145, 61905, 93735, 32634, -96987, 150140, -16858, -44755, 140601, -40914, -117514, 102138, -94701, -12597, -81479, 5022, -141747, 166900, 9645, 124522, 114506, -124636, 184798, -62624, 155696, -155913, 119654, 16728, -202081, 91549, 24719, -154933, 100575, 333130, -50089, -233459, -105282, 1436, -86435, 310254, 137755, 28034, 354638, 105135, 45627, 50641, 270147, 35537, 16120, 73661, 27448, 157980, 251191, 227932, 178153, 110563, 30666, -118967, 325695, 132855, 92454, 36520, -163979, 224152, 1962, -146220, -203363, 308695, -153558, -78379, -163686, 158887, 99344, 196506, 39507, 285178]
11552B85178J367A00708h5380B61036a89840A42196d3715H3941J57193f987A30266
11540A91920q5128D121a83317q9492B98503i6971B04867K6766J60457A9010O0279
11529G9289R6637h3183B06007a6360A6300a29767B13179b7371B96605a2999p4160
11518h7159A29861E2395M9751J9076J23450J73116A36747A3489K21736j15666
11508A19559f8452m8661B21772R7165A19086g1115B31333c7173B47187A05284
11497a81760B20103N7395a47304A41965c9013G1131J36592q7788k4553i9248C06654
11485g6705a6219C16560E3778M0309J10275a84061D544R4315J73987j11950L95793
11474E56689A25300m6957B113K42073E4819b2309B08251A0157c6577p543I4193
$$ y = [285178, 286545, 100708, -85380, 261036, -189840, 142196, -43715, 83941, 241134, -6987, 130266, 191920, 106792, 4121, -183317, -272809, 298503, -96971, 204867, 231633, 392090, 19010, 79289, 175926, -83183, 206007, -16360, 16300, -129767, 213179, -27371, 296605, -12999, -87159, 129861, 52395, 102146, 121222, 244672, 417788, 136747, 13489, 235225, 119559, -68452, -117113, 221772, 318937, 119086, -71115, 231333, -37173, 247187, 105284, -181760, 220103, 277498, -147304, 141965, -39013, 71131, 207723, 119935, 95382, -99248, 306654, -76705, -16219, 316560, 53778, 94087, 204362, -184061, 4544, 98859, 272846, 160896, 556689, 125300, 78343, 2113, 244186, 54819, -22309, 208251, 10157, -36577, -44120, 94193]
11462b42513g2057A96679a13154H0157B3674a02810b6883l2718B22017a6464C61644
11450B65481j17041l4306m741N2677K07632G248d3913F2478N0209e0102A13595
11438a32452B56068b36854l554H4139Q7182d1374k8565m4546A29212f4699H9488
11426F9367a16483q388j27656a9099j65542D6644L9463a04068d1375k3287D874
11414C3494J47344R8701d686B51368K42283G3947j2372a78756A83662b36177F5899
11402B69817a36464D605J68233a12960j08488I6454j2828k0213a03010a9045l7886
11391e6931F1574K002e9185m4493j39505g8114k0379c0812a3804m3765F9966i2201
11378A21184j7113L18993A77997C6101f4976A39207c17912H9412b29059L1910
$$ y = [-242513, -72057, 196679, -113154, 80157, 23674, -102810, -26883, -59601, 222017, -16464, 361644, 265481, 148440, 114134, 109393, 162070, 369702, 7248, -43913, 62478, 112687, -50102, 113595, -132452, 256068, -236854, -240408, 84139, 171321, -41374, -69939, -114485, 129212, -64699, 89488, 69367, -116483, -124871, -252527, -19099, -184641, 46644, 86107, -104068, -41375, -64662, 4874, 33494, 180838, 279539, -4686, 251368, 493651, 73947, 61575, -178756, 183662, -236177, 65899, 269817, -136464, 4605, 172838, -112960, -221448, 96454, 83626, 63413, -103010, -19045, -56931, 61574, 63576, -59185, -103678, -243183, -78114, -98493, -30812, -13804, -57569, 69966, -92201, 121184, 104071, 423064, 177997, 36101, -64976, 139207, -317912, 89412, -229059, -197149]
11368a97149K3913A18883c345G3660b00526Q4328k92520a44566E0317a05016n5850
11357a60866b2554j51966P1900j17887A0205i5855E8536R1825p1720d0950m1834
11346h2784r3867b6761I2984h4492D6629B707a68027p7412r8857O6662A87590
11334a2781A29407a30959B37499r0895B7242a03143I1776b9836A93595a37526
11323c7917B18859P6118h0607A66797a48749g0717a4947C15782G3822M8144a23327
11311E0247b46406a9058C90469A9002a44391M6523p925c0428B28289D310N9621
11300F3931J60630c52107C02682j47268C1319a32047C6768r827b22462J433A6486
11288a79561f6413A06063j3820a5635p6597l40915A57274h2684D8411K791J05822
$$ y = [-197149, -173236, 118883, -3345, 73660, -200526, -116198, -408718, -144566, 50317, -105016, -160866, -22554, -174520, -102620, -220507, 10205, -95855, 58536, 150361, 78641, -40950, -82784, -176651, -26761, 92984, -84492, 46629, 2707, -168027, -245439, -344296, -277634, 187590, -12781, 129407, -130959, 237499, 146604, 27242, -103143, 91776, -29836, 193595, -137526, -37917, 218859, 294977, -80607, 166797, -148749, -70717, -14947, 315782, 73822, 121966, -123327, 50247, -246406, -19058, 390469, 19002, -144391, -97868, -105793, -30428, 228289, 4310, 63931, 224561, -352107, 302682, 155414, 31319, -132047, 36768, 26941, -222462, -221029, 16486, -179561, -66413, 106063, 92243, -15635, -92232, -433147, 157274, -82684, 48411, 51202, 157024]
11277A57024f0044J0360H3219a266H9403H349e1533j26563F4334c24772a10946
11265c53145e6534P784A95836G5412a21892H8067j5808a83643D7183b88085C42904
11253a38831N1635l9886D5775K13407i685k24651d8889F22K66754a51945O2699
11242h9246p5394e7729A17469E6434b179k29299g789A14253b11480I6322J15065
11231B11387a38720C1368e5054J6272m2520J9562K4614k9359G8215d9266F1898
11219a79287k25756G7810a06130k27303J8262j11967J53958c2677A33111F4823
11208D8123J82162m8153A6249c76374A218a65438A98134J4846h6969j30521f7995
11196G7086E857L5521N1610K15726C6432N9589a88744N2753j40833A49198a55449
$$ y = [157024, -60044, -49684, 83219, -1266, 89403, 8349, -51533, -178096, 64334, -324772, -110946, -353145, -56534, -48750, 195836, 75412, -121892, 88067, 72259, -183643, 47183, -288085, 342904, -138831, -87196, -127082, 45775, 259182, -9685, -234336, -48889, 622, 267376, -151945, -89246, -164640, -57729, 117469, 56434, -2179, -231478, -7789, 114253, -211480, 96322, 211387, -138720, 31368, -55054, -38782, -81302, -61740, -37126, -66485, 78215, -49266, 61898, -179287, -405043, 77810, -106130, -333433, -315171, -427138, -273180, -32677, 133111, 64823, 48123, 230285, 182132, 16249, -376374, 1218, -165438, 198134, 212980, -86969, -217490, -67995, 77086, 5857, 41378, 92988, 308714, 36432, 96021, -188744, -135991, -276824, 149198, -155449]
11184a15593L3200b8499C5512B211a36781E8475J65550a15465j9697F291N6611
11173F2902b90603h9208C5031a89942j23595G1479c33053d9385j71308B0259a47689
11161B60519a11678A00343b82069D458b48490I4746L9325B9064a84052b5646I3785
11149a81933o4605f2949j10628A7916b9726D7420l777b91690C39913g4404J3744
11138f0660m2832j9480c8284j7818D5464Q7048b49055A10838a47332A00790J26747
11127B27537p4283m1841a84018C0501R4881c81909A05838e4916n2965E8605g6221
11115a4403e414A17157J65006A39933J25957I3808J72191R3773A51835J19514
11105B71349C4462K02921M4648F791J82744a76912B67084d4761B48643J51747
$$ y = [-115593, -82393, -28499, 35512, 2211, -136781, 58475, 224025, -115465, -135162, 6291, 62902, -290603, -89208, 35031, -189942, -313537, 71479, -333053, -49385, -220693, 20259, -147689, 260519, -111678, 100343, -282069, 4458, -248490, 94746, 134071, 29064, -184052, -25646, 93785, -181933, -246538, -62949, -173577, 17916, -29726, 47420, 43643, -291690, 339913, -74404, -60660, -103492, -122972, -38284, -56102, 45464, 132512, -249055, 110838, -147332, 100790, 227537, 153254, 111413, -184018, 30501, 125382, -381909, 105838, -54916, -107881, 58605, -76221, -14403, -5414, 117157, 282163, 139933, 265890, 93808, 265999, 359772, 151835, 271349, 34462, 237383, 282031, 6791, 189535, -176912, 267084, -44761, 248643, 400390]
11095D00390K45865j60205A4311L5996J36507B3636J2199L98317k8511E9237e7552
11083G6798J65021j14627J61167A02373K94349I5064j7950a00387B01140l2509
11073A68631b0988D61264j87571H5523O8262k9997l1842L5670K97928J61509j13068
11062D73985J26741n1166J46465l28939M2245K42608Q919J13135k73637B17489
11051H57315j33397L33031m82048J53934J27812L16803l13959k56967L42144k74870
11041F69798J22581j73381k34602M86309m890k56024J60796B30382N99500l18823
11031E11059L6581L65938L1616k60427Q4713k44921J74307K89009D65739J17974
11021E83713J35250J8853C42229K595O717Q8688J92217k67209J63656J14835P7325
$$ y = [400390, 646255, 486050, 14311, 50307, 186814, 23636, 35835, 434152, 405641, 59237, -57552, 76798, 241819, 127192, 288359, 102373, 396722, 95064, 77114, -100387, 201140, 168631, -20988, 461264, 273693, 85523, 153785, 123788, 91946, 127616, 425544, 587053, 473985, 600726, 549560, 696025, 367086, 409331, 651939, 660858, 773993, 500356, 217489, 857315, 723918, 1056949, 574901, 728835, 856647, 1173450, 859491, 602524, 944668, 669798, 792379, 618998, 384396, 870705, 865815, 609791, 770587, 230382, 829882, 511059, 547640, 913578, 945194, 684767, 769480, 524559, 698866, 987875, 465739, 583713, 718963, 737816, 342229, 344824, 351541, 440229, 632446, 365237, 528893, 643728, 721053]
11010G21053J13492j42392O0215n0424k00197J29085L42488m34698J57059K11718
11000I07399k3317l27116M00040m63744L94825J932C64749K29122J76374l08915
10990D61330K33943L39409k02400P0774j46722J40224n6744j00862J60066L40583
10980A239601k91094P00812j07153L08846J685K17742J84620K54101J6321K90927
10970B816408j39394m7495n9627l46578l15474J07534j00814k08549p8650k689
10960A624672O2221m02073N38988k97452J84777q1138o6023k15738m84733k98644
10950E64857L02958p785p0726C73953L861p2505J9032j7301K7067A66900D2359
10938D79229A61804K0145p8987L53306j55929b74451c2078a032C39564D2388b07021
$$ y = [721053, 834545, 692153, 752368, 701944, 501747, 630832, 973320, 538622, 695681, 907399, 884082, 556966, 957006, 493262, 888087, 890019, 364749, 593871, 770245, 461330, 695273, 1034682, 832282, 903056, 756334, 896558, 839814, 738952, 899018, 1239601, 948507, 1649319, 1542166, 1851012, 1852697, 2070439, 2255059, 2509160, 2525481, 2816408, 2677014, 2629519, 2569892, 2223314, 1907840, 2015374, 1914560, 1706011, 1627361, 1624672, 1686893, 1284820, 1823808, 1526356, 1711133, 1629995, 1563972, 1348234, 863501, 564857, 867815, 860030, 789304, 373953, 377814, 305309, 324341, 307040, 334107, 166900, 42359, 479229, 161804, 181949, 102962, 456268, 300339, -274451, -32078, -1032, 339564, 42388, -207021]
10926D35116A52888F8822J07313g7690j46315E3543a18086a9281k63108N3651
10916b28738f417B44222b70848o8680C01041b58634A2405d8938q3654m337m5139
10905a82068A43636b17808C22785b17131i7963A8334f8013A62575E3567O2893
10895A16460L5763o2996R8083i6525B46620A09564a68285I8491d04168R6214D20411
10883E2278a91557J8311A20176b47989d6120k1525k1132p0393c3919j20742b6341
10871d57923A11125a44773J1082j6914p1224A25657c01738i2317A43793J59313
10861C03106A37575a85284F4919a34525d3803D2622b78968i0938A04025l7969
10851F6056L7524c50027O3841j37012C52799c5332k00621C19241b7309j24321
$$ y = [435116, 152888, 68822, 176135, -77690, -224005, 53543, -118086, -19281, -282389, -228738, -6417, 244222, -270848, -339528, 301041, -258634, 12405, -48938, -132592, -136929, -182068, 143636, -217808, 322785, -217131, -97963, 18334, -68013, 162575, 53567, 116460, 152223, 89227, 187310, -96525, 246620, 109564, -168285, 98491, -404168, -307954, 420411, 52278, -191557, -173246, 120176, -247989, -46120, -67645, -88777, -159170, -33919, -154661, -26341, -457923, 111125, -144773, -133691, -150605, -221829, 125657, -301738, -92317, 143793, 303106, 137575, -185284, 64919, -134525, -43803, 42622, -278968, -90938, 104025, 66056, 103580, -350027, -286186, -423198, 352799, -35332, -235953, 319241, -27309, -151630]
10841a51630A21222a96226f7840j18645P3803d0433H4288A2583a5508r818j48339
10830a73665o8113i0733A1525D070K52972a16317I0538a50440c5376k36962M2389
10819b29949k4281D44392F5403c3155n5627O833j41674i1022p6603A59728d9810
10807i2651k8082k5434q1142A52948J99591E9762b32614D8356b36460d4021n905
10796d9926j04808b214j27074C5313J6621c22258Q1355A91940K3147a44586e0261
10784b2614A2368P3705l5513b48796B47064J57592j53461H5874b140H1663N3900
10773A35563L3241e676A83520m9358F5058k51B3070b29734P5126F1001R540b50838
10760g0956A61471k1927a48919A43730n1970K24937G9458a53113B15932b21838
$$ y = [-151630, 121222, -196226, -67840, -186485, -112682, -40433, 84288, 12583, -15508, -25326, -173665, -241778, -90733, 11525, 4070, 257042, -116317, 90538, -150440, -35376, -272338, -229949, -254230, 444392, 65403, -33155, -88782, -81949, -223623, -91022, -167625, 159728, -49810, -92651, -120733, -146167, -227309, 152948, 352539, 59762, -232614, 48356, -236460, -44021, -49926, -154734, -2214, -129288, 35313, 51934, -322258, -240903, 191940, 215087, -144586, -50261, -22614, 12368, 86073, 50560, -248796, 247064, 404656, 251195, 85874, -2140, 81663, 135563, 168804, -5676, 183520, 134162, 65058, 64807, 23070, -229734, -154608, 61001, 70541, -250838, -70956, 161471, 139544, -148919, 143730, 91760, 316697, 79458, -153113, 215932, -221838]
10749I5667a92768B88406c10916b2099k5465A0605R3770b3788B0224a2402A15452
10737F0841b43862b1072A10240P4196l0350c27536A22812a17915n4984j11835
10727b84734a41062N5039J0867k8529P036k05605H8339a25711A18991C909e9318
10715A56257D9641K6946e6755D8561L02847a68247A46995n8127j3782c61837J12692
10704b49145P3707J6961p0414g1091q3338b9597F0721a04737J0205j80956j08948
10693c84436i0469c7328j65501H4812F523b95000b9278B00856I0370g9895n996
10682h5891A00225b23962b6404B03526a28168B92837I091D81b85632L0753Q9450
10671a65429F9290a96319J3275B42962c6522I4323k1249k845l0086b1531p8756
$$ y = [95667, -192768, 288406, -310916, -22099, -47564, 10605, 104375, -23788, 20224, -12402, 115452, 60841, -243862, -21072, 110240, 184436, 154086, -327536, 122812, -117915, -172899, -284734, -141062, -86023, -75156, -103685, -96649, -302254, 88339, -125711, 118991, 3909, -59318, 156257, 49641, 76587, -56755, 48561, 351408, -168247, 146995, 88868, 75086, -361837, -249145, -175438, -158477, -228891, -71091, -154429, -29597, 60721, -104737, -94532, -275488, -384436, -90469, -37328, -202829, 84812, 6523, -295000, -29278, 200856, 90370, -79895, -85891, 100225, -223962, -26404, 203526, -128168, 292837, 9091, 481, -285632, -254879, -165429, 69290, -196319, -183044, 242962, -36522, 94323, 73074, 70229, 40143, -21531, -100287]
10660a00287j06589B979g2583J0591j39386g1317a2406p3148A25899a0929j51807
10649a62736B08027g2821j04362g8825A25301n0895l7047d30387I7167a42091
10638G7861b41724K8761R129f743m80755f9534j33595C8131c38930h3599C32390
10626A77061h2144l226j13135a3674k48877a03284p8678D7643a39884c8430m4118
10615h2548o0443I5047N0859c9965J7557D7708c8256j86193K8263G9971J20971
10604B00942b8370A98608a16752l9427B08673a53629B2385J12456b10608I6779
10593E8442a66290g576L584j77835l5504B74077i5233j61393o7713q5513a32810
10581b96199D6176B0827i7222k29995b6659B19375B8481L07331H6547j1322A6946
$$ y = [-100287, -206876, 2979, -72583, -61992, -201378, -71317, -12406, -85554, 125899, -10929, -162736, 208027, -72821, -177183, -78825, 125301, 74406, 37359, -430387, 97167, -142091, 77861, -241724, -212963, -203834, -6743, -487498, -69534, -203129, 38131, -338930, -83599, 332390, 177061, -82144, -85370, -198505, -13674, -262551, -103284, -181962, 47643, -139884, -38430, -82548, -142991, 95047, 145906, -39965, -22408, 47708, -38256, -224449, -196186, 79971, 200942, -28370, 198608, -116752, -156179, 208673, -153629, 22385, 134841, -210608, 96779, 58442, -166290, -7576, -3992, -181827, -217331, 274077, -95233, -256626, -324339, -409852, -132810, -296199, 46176, 20827, -97222, -327217, -26659, 219375, 28481, 335812, 86547, 75225, 16946]
10569c38327K036B98815a46778E00519G7200c7373k44212B44364b23646f9814
10558g2811n7360B48082m8485f5959B54690c17453a55185d3955A2450a88002P6488
10547a11514j62639H3695e014l4355I1500a0889o9707k40392a43330A46159m1875
10536A04284A8796J90064c09387c1863j74154h294F2797c99504J93594C28408
10525B09846D1543J86332b4841I2785J72047a14073J8077b0258A31140n1901g111
10513g0699F0650a90796f8050p0920f7821n7956o6040B60998b55286i5539d543
10501A7211a71753N0705D7622B664J4768J4172F763Q074i5666B44823A16645c6248
10488f0875B3183J56939E8902E734c2674C3307P3744Q3192N324C0947K0908A4210
$$ y = [-338327, -336291, 298815, -146778, 500519, 77200, -37373, -281585, 244364, -223646, -69814, -72811, -130171, 248082, 199597, -65959, 254690, -317453, -155185, -43955, 12450, -188002, -111514, -274153, 83695, -5014, -39369, 91500, -10889, -80596, -320988, -143330, 146159, 104284, 18796, 208860, -309387, -31863, -206017, -8294, 62797, -399504, -205910, 328408, 209846, 41543, 227875, -24841, 92785, 264832, -114073, -95996, -20258, 131140, 79239, -7111, -70699, 60650, -190796, -68050, -138970, -67821, -125777, -191817, 260998, -255286, -95539, -4543, 17211, -171753, -121048, 47622, 2664, 17432, 31604, 6763, 14837, -95666, 244823, 116645, -36248, -60875, 23183, 180122, 58902, 5734, -32674, 33307, 107051, 190243, 195567, 30947, 51855, 14210]
10475a80522P1204K487M4304A66139M3753J00789i8992j59752B4910J38509E9812
10463A05871h4662A91240C3219d03795J34836E0227M3934d8148A29315a22559
10452b35367g1828k8164I8718d06099d2180j20104f4291C47861F91b02054K0183
10441a81871H0038J07920d2920C62790e6156D6361K0205C2004a53662A67379M4093
10430B11472c39136i4756R511D8354J54837D8477A173c51828A59236b04713b016
10418A13471a592j4566A89326F3756d03672A53268b4316B9744J8513b0653E8513
10406a3584j14149L5124G8233b07595B1402P2521b1159A37075a04454R079A68954
10394f3382D1232J25395J6048a43222c4708j66050a031B93860A25238j6865a55776
$$ y = [-180522, -109318, -106831, -62527, 166139, 209892, 310681, -98992, -258744, 24910, 163419, 59812, 105871, -84662, 191240, 33219, -403795, -268959, 50227, 94161, -48148, 129315, -122559, -235367, -71828, -99992, 98718, -406099, -42180, -162284, -64291, 347861, 691, -202054, -181871, 80038, 187958, -42920, 362790, -56156, 46361, 66566, 32004, -153662, 167379, 211472, -339136, -94756, -85245, 48354, 203191, 48477, 1173, -351828, 159236, -204713, -2016, 113471, -1592, -16158, 189326, 63756, -403672, 153268, -24316, 29744, 48257, -20653, 58513, -13584, -127733, -92609, 78233, -207595, 21402, 93923, -21159, 137075, -104454, -95375, 168954, -63382, 41232, 166627, 182675, -143222, -34708, -200758, -1031, 293860, 125238, 108373, -155776]
10382A88833J5697a2942H9725M2281J91195G0019K16545j07728P1410J48482b08985
10370B09932j193a1413E42912j88794K10034A84045L72506H1612J72054l1737
10360B21929a29468B00215O0844o2976I0951c9136B69420m656K88374R4179C18245
10348E51306p5446A68427J36851j03566M97273l43075p3261q6689o9580M8787
10338A75167P0212J04856n0815F2294M0668Q6302a79396C05093a51356A36383
10327b36738C537K29493C1158M67468B25789j0810e0727I8996J7930J31536C8808
10315B45110a17426B21588K3302m5435F625J22403f265r0386A54722d06283E3167
10303b38653L5208B10224h4843A82481e0748E2117N7607P1175a88327K0661m4879
$$ y = [188833, 204530, -12942, 89725, 132006, 323201, 70019, 286564, 178836, 250246, 398728, -208985, 209932, 208739, -11413, 542912, 354118, 564152, 184045, 556551, 81612, 253666, 221929, -129468, 200215, 261059, 198083, 90951, -39136, 269420, 264764, 553138, 647317, 318245, 551306, 475860, 168427, 305278, 201712, 698985, 355910, 282649, 195960, 126380, 175167, 245379, 350235, 299420, 62294, 102962, 189264, -179396, 305093, -151356, 136383, -236738, 3537, 233030, 31158, 498626, 225789, 214979, -50727, 98996, 116926, 248462, 38808, 245110, -117426, 221588, 244890, 199455, 6625, 129028, -6265, -96651, 154722, -406283, 53167, -238653, -203445, 210224, -84843, 182481, -50748, 52117, 109724, 180899, -188327, -167666, -212545]
10292b12545D1101d38694A14170n4040a69606a3679q0902c6460j10589E8392c66606
10280a3077C0866O3452C8910J68774j2117k372a9977I6900Q3876D4258M6528I076
10267G4503C1923J44221k9354e6442j51527M5007B54920K3512N6529O6424F5467
10255A73954G4986M10597b2552o7460m7573D6100K55118C8512R070L3907b64318
10243G8824k0543a37200f1751A92433O2274b90297C7935J20060l1006H90a25134
10231E9734M5548f026j06460j77111N6653M069h398B36063j10360B9251a63763
10219i3333a4329B14757F4519g6134B01147i2308A55732Q0977G7536a85972b3680
10207B49623C9761J48875B9322i069A75872O1216c77808A41533P5499m9147a16744
$$ y = [-212545, 41101, -438694, 114170, 60130, -169606, -13679, -94581, -36460, -147049, 58392, -366606, -13077, 30866, 94318, 38910, 207684, 195567, 193195, -19977, 96900, 180776, 44258, 90786, 9076, 74503, 31923, 176144, 146790, -56442, -207969, -162962, 254920, 278432, 334961, 401385, 65467, 173954, 74986, 485583, -22552, -90012, -137585, 46100, 301218, 38512, 47582, 81489, -264318, 78824, 58281, -137200, -61751, 192433, 254707, -290297, 37935, 157995, 126989, 890, -125134, 59734, 105282, -6026, -112486, -289597, -232944, -228875, -8398, 236063, 125703, 29251, -163763, -93333, -14329, 214757, 64519, -76134, 201147, -92308, 155732, 236709, 77536, -185972, -23680, 249623, 39761, 188636, 29322, -9069, 175872, 237088, -377808, 141533, 217032, 167885, -116744]
10195A09949h0945A65297b94999D7236a63843b0831j09313K1089d2982l75965
10185d18947h2984l6846B5052R7025F0491B1400h9124H016a76043j3890R572g0488
10172a67327j28000E3869R5812h4297m1738a393A2244i8577k8877C24174G087
10160a38568A12982a36521F0791a78350f2090k70530m752J61831p3084r3342g7607
10148a19470I548I47a50786H0584h7505p9912H2723c2954A10540a32775m3529
10137a76304j21586L7179M3845j6906A58628a71116C8091L1079b545j85849C4601
10125a74557B77323g7504L3592A02430c07447A43446b572j15113l95760J76805
10115c36640a24081N4514K3216J1950j81031A96062r7146j2135g5360C7684a53650
$$ y = [109949, -80945, 165297, -294999, 47236, -163843, -20831, -130144, -109055, -42982, -418947, -82984, -119830, 25052, 122077, 60491, 21400, -89124, 8016, -176043, -189933, -180361, -70488, -167327, -295327, 53869, 149681, -84297, -126035, -1393, 12244, -98577, -127454, 324174, 7087, -138568, 112982, -136521, 60791, -178350, -62090, -332620, -337372, -175541, -248625, -341967, -77607, -119470, 9548, 947, -150786, 80584, -87505, -167417, 82723, -32954, 110540, -132775, -176304, -297890, -260711, -216866, -233772, 158628, -171116, 38091, 69170, -2545, -188394, 34601, -174557, 277323, -77504, -43912, 102430, -307447, 143446, -2572, -117685, -513445, -336640, -124081, -69567, -46351, -34401, -215432, 196062, 98916, 86781, -75360, 37684, -153650]
10103b91564M2255a00250A0298b06851j30621A4147e7555l12029a65723o3502
10093b29225B50386C5999N1785J19155a57586M580B04838K5271b31007A76427
10082c90988f6591H4135K6266D9636A468a96480c1649B9531J61436g0887m15230
10071d86117a03617M6870B04325c11620a29417A11337P3732g7481j53898O1189
10061a70190N5953K2260G456N2595b4889K262l39060A74004F4772a39040q3781
10050b22821a07396C22105b71701a29384K6024j52212J9709i6248A55348c68199
10039B86580b26381j04823C53188B6003A0886a10038h664j79427l15671M3817
10029d59945K00408B12746a54616A72366F7159b0029l14319J57564j06205i6188
$$ y = [-291564, -249309, -100250, 10298, -206851, -337472, 14147, -57555, -369584, -165723, -229225, 250386, 35999, 87784, 206939, -157586, -153006, 204838, 230109, -231007, 176427, -390988, -66591, 84135, 110401, 49636, 1468, -196480, -31649, 29531, 190967, -70887, -486117, -103617, -56747, 204325, -311620, -129417, 111337, 185069, -77481, -231379, -170190, -114237, -91977, 7456, 60051, -24889, -22627, -361687, 174004, 64772, -139040, -222821, -107396, 322105, -271701, -129384, -103360, -255572, -235863, -96248, 155348, -368199, 286580, -226381, -331204, 353188, 26003, 10886, -110038, -8664, -188091, -503762, -459945, -259537, 212746, -154616, 172366, 67159, -20029, -334348, -176784, -282989, -96188]
10018b30668h6755j00349N1818k29964A92637G6540a33228A40434b3331k70580
10008b93911J21255A28945M8010b77969I8746a87428k0523A19357n2454J243J10070
9997A78216f7694j06696e6406H0305M3247b2948k05652j07017h2300j76689A3385
9985c25231a29793n3623f1770l07479f6837k9994A06304a32351m54197C8690A4637
9973B7189K08026h8457j40533f9054n6659q975l2580f4916q9759D7307a49737
9961a45147A17120a53422n6805h3162j2043A92275I4377k5677e1569j86482K9717
9950b08334b9173k8798k5447R445A87203l6989g7313b4642j71135A20495b5069
9938e8492A22012n8117a52881N6043j484A02188J1643h2334B03338e489A6525
$$ y = [-230668, -86755, -187104, -135286, -365250, 192637, 76540, -133228, 140434, -23331, -293911, -172656, 128945, 176955, -277969, 98746, -187428, -207951, 119357, 66903, 68146, 178216, -67694, -174390, -56406, 80305, 123552, -22948, -228600, -335617, -82300, -258989, 13385, -325231, -129793, -183416, -61770, -369249, -66837, -96831, 106304, -132351, -586548, 38690, 14637, 27189, 235215, -88457, -228990, -69054, -125713, -134688, -167268, -64916, -154675, 47307, -149737, -145147, 117120, -153422, -210227, -83162, -95205, 192275, 94377, 68700, -51569, -238051, -208334, -29173, -57971, -83418, -73973, 187203, 150214, -77313, -24642, -195777, 120495, -25069, -58492, 122012, 63895, -152881, -96838, -98322, 102188, 113831, -82334, 203338, -5489, 16525]
9926A88345M0885J70268A06570g1156B5110b5572b667j36161B878J38654l007
9915A38525P0697e9878A72690f746B11779c00097A12325a490n9641B08424J056
9904B09480i8380j90568c0836B55906c33365h4485B72481a86122f3404K138A02627
9892B03924c83677R5899a0234m44377J46261B66419H4539a5446A40833a5535B84189
9880b24813R1480k75686a87484l816M0964b0732j24203a240B5125a26192o5340
9869a91532A01927G124J56355a17671j01526A30218b05360R6041E086a2787A26396
9857a2553j00101n1610i126B47488G89Q7747R9755p6339a08406E2777b89945d5448
9844a09353q8644f5806E1791b68421A0479a90107c2647C4884R6850K49905a98934
$$ y = [188345, 229230, 399498, 106570, -71156, 25110, -25572, -2667, -138828, 2878, 141532, 138525, 209222, -59878, 172690, -6746, 211779, -300097, 112325, -1490, -61131, 208424, 209480, -98380, -288948, -30836, 255906, -333365, -84485, 272481, -186122, -63404, -61266, 102627, 203924, -383677, -287778, -10234, -454611, -308350, 266419, 84539, -15446, 140833, -15535, 284189, -224813, -133333, -409019, -187484, -191300, -150336, -20732, -144935, -1240, 25125, -126192, -191532, 101927, 7124, 163479, -117671, -219197, 130218, -205360, -109319, 5086, -12787, 126396, -12553, -112654, -164264, -9126, 247488, 789, 88536, 188291, 111952, -108406, 52777, -289945, -45448, -109353, -197997, -65806, 51791, -268421, 10479, -190107, -32647, 34884, 131734, 381639, -198934]
9832A20424E0352L8716j3917a51142j22554P8271m2746A2590b18350p740n0154
9821b76244a11266j59597j99689e5557C2735a55259q3663A85409a57591D6748
9810a20102n00057A49831a7023j72501e7706F9615b27843f8776A49354K0848n6507
9799A13695b63096J16765g2774J418A39206D5611a75655j82156I3955b24375F8639
9787g0823A58910g6114c5141A90577a97341F7232b90114N6458G6523h1761n3666
9776a35427B2145c36912I2684K041b08496D5049b74141j99135B4740f5582l25579
9765c91161c0354k71249f4358j24522M5732A7304b64560J06929f5605q3607j5704
9754a64916L8293D4241a19103B37347j2183M6568A28542c2479q0639A2424b48495
$$ y = [120424, 50352, 89068, 75151, -151142, -273696, -195425, -238171, 12590, -218350, -226090, -276244, -111266, -270863, -470552, -55557, 32735, -155259, -238922, 185409, -157591, 46748, -120102, -620159, 149831, -17023, -189524, -57706, 69615, -227843, -68776, 149354, 170202, 113695, -263096, -146331, -72774, -71356, 139206, 45611, -175655, -357811, 93955, -224375, 68639, -70823, 158910, -76114, -35141, 190577, -197341, 67232, -290114, -233656, 76523, -81761, -135427, 22145, -336912, 92684, 94725, -208496, 45049, -274141, -473276, 24740, -65582, -391161, -30354, -301603, -64358, -188880, -143148, 17304, -264560, -157631, -65605, -149212, -164916, -126623, 44241, -119103, 237347, 225164, 271732, 128542, -32479, -113118, 12424, -248495]
9742E6095R035a10911d9923J0711i085p994j1298e008j05438A27863i2325D3853
9729b3152k1383p0789p5622I1039I367b40134A76065c28901A3538K19986a43681
9717c88384b21j47560c1036q7552Q664g852A14811a6278q0551L5355k1709k63996
9705c47179F6336i9140j34663A1646P0780b7690R888A27246b36583f6890l4923
9694a01813d0696A37820b49618J6479A30484c84252a11730F7174a23907N6330
9684f7577j86516B0482b31798c2966J92o4576M8211j95222d4578F6435b28756
9672C4516a15149g497k55036c3771A05122J0871b06005c9592r5014C18456g0531
9660A20247l3424d3843j9512j11430F4585b50709D9480K3625J77851F9737b69006
$$ y = [56095, 65130, -110911, -49923, -39212, -9085, -17079, -28377, -5008, -110446, 127863, -92325, 43853, -23152, -44535, -115324, -190946, 91039, 9367, -240134, 176065, -328901, 13538, 233524, -143681, -388384, -221, -147781, -31036, -118588, -109924, -7852, 114811, -16278, -96829, -61474, -83183, -347179, 66336, -99140, -233803, 11646, 82426, -27690, -17802, 127246, -236583, -66890, -101813, -40696, 137820, -249618, -233139, 130484, -384252, -111730, 67174, -123907, -67577, -254093, 20482, -231798, -32966, -32774, -97350, -49139, -244361, -44578, 66435, -228756, 34516, -115149, -7497, -262533, -33771, 105122, 115993, -206005, -39592, -134606, 318456, -70531, 120247, 86823, -43843, -63355, -174785, 64585, -250709, 49480, 73105, 250956, 69737, -269006]
9648b62263j63376J41964j82980a47730j48419b5624G052B794K90021a89630H2586
9636G4776J65425c5677m87430E7692k520b23505C37155a27566k7169f9484j58504
9625b27988G4881l354f8933j1878a7088r5059B73185d974E7975B5238b23397e6651
9612B42117f8458n8126c0563R28p5197j05664J2156A03679K7840O736b11332I5169
9599a69806h1982C65322a64409P7075A00607b67840I206O5173g3890A07051g2666
9587d3292D6929d46915a99900i6557I4335P6680a50081D6345g2721c0866A65048
9575B83211h6050k30933d5912m6921H9597m1538b1970l10497J54395A12994B8815
9563D29844h2745k24616a03767n6595D4049K54347d159k87431A3355l996a12342
$$ y = [-262263, -425639, -283675, -466655, -147730, -296149, -25624, 7052, 2794, 292815, -189630, 82586, 74776, 240201, -35677, -523107, 57692, 55172, -223505, 337155, -127566, -154735, -69484, -227988, 74881, 71527, -68933, -80811, -17088, -112147, 273185, -4974, 57975, 25238, -223397, -56651, 242117, -68458, -126584, -30563, -29635, -104832, -210496, -198340, 103679, 131519, 138255, -211332, 95169, -169806, -81982, 365322, -164409, -87334, 100607, -267840, 9206, 74379, -73890, 107051, -72666, -43292, 46929, -446915, -199900, -96557, 94335, 171015, -150081, 46345, -72721, -30866, 165048, 283211, -86050, -316983, -45912, -92833, 89597, 48059, -21970, -332467, -178072, 112994, 28815, 429844, -82745, -307361, -103767, -160362, 44049, 298396, -4159, -291590, 13355, 9359, -112342]
9551C8921Q3252B6853R0483e4206l952a1610B33841b1567r1304d1651j29743k47549
9539d18943B73859e8608k37941L7203O4684Q1685I1965a33434B4593a18196G1067
9527D7536J72566f26655K27771m4177b09040N7695P4739k51654a02340j09238
9517b11578B72727A7176e68236F2939a20336l6847L4050A72496a17258F6257b99340
9505A57391c06258A19521g24p0060b9188m1316I9346F141b47093A39483f7869
9493d1333j25762q9330O577H1943O3047A8551a02679L4205n59428C2108b0634
9481i7339P1k31664G2062d58800a03443G237N7291b26509F8470c69809J84464
9470a85345l8910r9610A0827a63869A07611q652a08491A74307b26544B00014D6374
$$ y = [38921, 122173, 26853, 117336, -54206, -58158, -11610, 233841, -21567, -112871, -41651, -171394, -418943, 273859, -58608, -296549, -259346, -194662, -112977, 91965, -133434, 24593, -118196, 71067, 47536, 220102, -626655, -398884, -443061, -209040, -151345, -76606, -328260, -102340, -211578, 272727, 17176, -568236, 62939, -120336, -157183, -123133, 172496, -117258, 66257, -299340, 157391, -306258, 119521, -724, -70784, -29188, -70504, 99346, 6141, -247093, 139483, -67869, -41333, -167095, -256425, -249848, 81943, 144990, 18551, -102679, -68474, -627902, 32108, -20634, -97339, -97268, -328932, 72062, -458800, -103443, 7237, 64528, -226509, 68470, -369809, -185345, -224255, -323865, 10827, -163869, 107611, 98959, -108491, 174307, -226544, 200014, 46374]
9458F374L2736e1796E3949r817b7961l41172E0920b01030A6775c38383E0466a73079
9445a83765j62524l1021B03962a47481C3352j2132a3990j5065I0837b27427B07863
9433a15031m7433D3649a94908n5074g5943D0069a85843a0194k21774l6433H6619
9421I3044a22389j44388C2489O7872a89842Q8109H9884f7368B15470G9210g7332
9409g0251A28548A822O4157c8826A1616P8421M7639d3994k53811I3376e2935j9692
9397g2627k66935A83267b69410R7771f8757K4231k23634d511k31567a00964Q504
9386i2460j19393f0774F0926b08272A00754b65537B78422G2300c6511m8152H4119
9374A28444B6415J04074F0289a26950B3846f1650j73220P3307j73700o1781a61140
$$ y = [6374, 39110, -51796, 53949, 44132, -27961, -369133, 50920, -201030, 16775, -338383, 50466, -173079, -183765, -346289, -377310, 203962, -147481, 33352, 21220, -13990, -29055, 90837, -227427, 207863, -115031, -162464, 43649, -194908, -249982, -75943, 40069, -185843, -10194, -231968, -268401, 86619, 93044, -122389, -266777, 32489, 100361, -189842, -101733, 89884, -67368, 215470, 79210, -77332, -70251, 128548, 1822, 65979, -38826, 11616, 90037, 137676, -43994, -297805, 93376, -52935, -72627, -339562, 183267, -269410, -171639, -68757, -44526, -268160, -4511, -236078, -100964, -92460, -211853, -60774, 60926, -208272, 100754, -265537, 278422, 72300, -36511, -84663, 84119, 128444, 26415, 130489, 60289, -126950, 23846, -61650, -234870, -161563, -335263, -397044, -161140]
9362a15470m5781N9626D6243f3372n9769F8216a47917f7286j52740A1927a51967
9350A91579h7911q2638j40880b2190A42084a65798q3262J15958a771C4843a22425
9338a47350A07790g8996H6695C9030c41689J69703A72172B9643a65702A3557c11827
9326b29261j7796J22522D9098K2890K3038a04079j14465k13788b04124A52900
9315i877o6205j2788j79530a04784k2054n1287j73968P8959k8423B37294H602
9303A11650e8590k09366J5005C1557L80712a40817L5280I0049f2107A9075c0672
9291a81349f3214j8234q037H222h1239o4214G7958b04273b9844E6855f4818A9261
9278c9135l06766G587c15655A42367J06677n0937e9A65537m1940Q6222p0189e4899
$$ y = [-115470, -161251, -101625, 46243, -63372, -123141, 68216, -147917, -67286, -220026, 11927, -151967, 191579, -87911, -170549, -311429, -22190, 142084, -165798, -249060, -133102, -1771, 34843, -122425, -147350, 107790, -78996, 86695, 39030, -341689, -171986, 172172, 29643, -165702, 13557, -311827, -229261, -247057, -124535, 49098, 71988, 95026, -104079, -218544, -432332, -204124, 152900, -9877, -76082, -88870, -268400, -104784, -126838, -178125, -352093, -273134, -301557, 237294, 8602, 111650, -58590, -267956, -252951, 31557, 412269, -140817, -105537, 90049, -62107, 19075, -30672, -181349, -63214, -81448, -89485, 8222, -81239, -145453, 77958, -204273, -29844, 56855, -64818, 19261, -39135, -345901, 7587, -315655, 142367, 249044, 198107, -59, 165537, 123597, 209819, 139630, -54899]
9265e26068K52311k8108a8677j77571E0491K5807a09630A35188m8680B1078a45463
9253h2971j59702b8996A16758b01728k6782A29099b02772p5316i0201j655j03295
9242a95151M727B83453c32164J44436Q1461j01465j32410d4834a6256j91851k7512
9231b35619i2034E450b04658R6931A2971J91212c64436B79756H243g0190C1003
9219A36235c0126E426d69326a42001b9757n0578a568l22671a10950M411D9990
9207c29761Q9371J20064A37890d7103J2455A81414b62076a7582J223j39758M9436
9196a06681C9348b87780f1395o5972E0262a70805I6512a08677D0961d2829k17007
9185b59836k84484K61272B14879d00719a01284D1367N0799a14089a132j42382
$$ y = [-526068, -273757, -301865, -18677, -196248, 50491, 76298, -109630, 135188, 86508, 21078, -145463, -82971, -242673, -28996, 116758, -201728, -228510, 129099, -202772, -278088, -90201, -91856, -195151, -190424, 283453, -332164, -187728, -106267, -207732, -340142, -44834, -16256, -208107, -235619, -92034, 5450, -204658, -107727, 12971, 204183, -364436, 279756, 8243, -70190, 31003, 136235, -30126, 5426, -469326, -142001, -29757, -80335, -1568, -324239, -110950, -106539, 49990, -329761, -240390, -120326, 137890, -47103, -34648, 181414, -262076, -17582, -16359, -156117, -106681, 39348, -287780, -61395, -127367, 50262, -170805, 96512, -108677, 40961, -42829, -259836, -544320, -283048, 214879, -400719, -101284, 41367, 92166, -114089, -1132, -143514]
9175a43514k05001J31462A25415g8668k5476m7826b0483N911q5006D5288L3140
9164G8428J82986p5222K28546a56736m0601A29866a01030n2027B19446c15517
9153B1665K12387a59977i617j01301E2963c38235a3369j76042l31403b22220n2580
9142b74800D0764c04756A62320b39499a2218k59933a26584b276A08085R8774e8611
9130b04066D31J0791K64742a06532k82373h2187j750r22J2349m1978A16132C7219
9117A28778c8753b906q3519A00150a62190E5324R8015c41125h9381A14524r030
9106A05494e7696G4215d25706B1259M8262f1513A96977p2975b68639C3372b48092
9094b28684J05639j0707a2857H3683l4103a9355C24192p5155a70352q565g7248
$$ y = [-143514, -348515, -217053, 125415, -78668, -104144, -151970, -20483, -14572, -99578, 45288, 78428, 261414, 186192, 414738, -156736, -197337, 129866, -101030, -153057, 219446, -315517, 21665, 234052, -159977, -9617, -110918, 52963, -338235, -13369, -189411, -520814, -222220, -274800, 40764, -304756, 162320, -239499, -12218, -272151, -126584, -2276, 108085, 206859, -58611, -204066, 431, 11222, 275964, -106532, -388905, -82187, -83937, -84859, -72510, -114488, 116132, 37219, 128778, -38753, -2906, -86425, 100150, -162190, 55324, 153339, -341125, -89381, 114524, 105494, -57696, 74215, -425706, 21259, 69521, -61513, 196977, 124002, -268639, 33372, -248092, -228684, -123045, -133752, -12857, 83683, 49580, -19355, 324192, 249037, -170352, -178917, -77248]
9082A17572g306F4560O4261c46766A7330i8974G8800q075a57898j61747A82397
9070a19713j70141A515K37646n3685B9157H099i6111H2099K1974J8378h4770B84515
9057A61498c8272k54889J23285H1820b2363l2257l38091D4590d3711P314B5574
9045a4588D8765K6958b80843A1833K55791g0292k77801C58999j16196A18990J11993
9034B30983d35996F3035c1717C082h9712A33238a94801j1991b8109p2458p5648
9023a76215k27603A7143a65246B18814c16622Q9174M8593p8920f3887j78008J0320
9012b31575c1307k69425Q6736a4317A80309b27307B04203d9280q762D92280b24252
9000b77064B27040b96194C39595f6424c2427A41135a31182A72816e8119o39178
$$ y = [117572, -7306, 64560, 128821, -346766, 17330, -98974, 78800, 70725, -157898, -319645, 182397, -119713, -289854, 1515, 239161, 185476, 29157, 8099, -96111, 82099, 104073, 122451, -84770, 284515, 161498, -38272, -293161, -169876, 81820, -22363, -54620, -392711, 44590, -43711, -36397, 25574, -14588, 48765, 75723, -280843, 11833, 267624, -70292, -348093, 358999, 242803, 118990, 230983, -435996, 63035, -31717, 3082, -89712, 133238, -194801, -206792, -28109, -100567, -176215, -403818, 17143, -165246, 218814, -316622, -227448, -178855, -257775, -63887, -241895, -231575, -31307, -300732, -213996, -14317, 180309, -227307, 204203, -49280, -58042, 492280, -224252, -277064, 227040, -296194, 339595, -66424, -32427, 141135, -131182, 172816, -58119, -697297]
8990f97297B81687a73190G0390b06620B58764i5247D730M5268g4620r3426G0185
8978a09481A06737a49776A06367c2931l4095j10084B72724C5365j5551J6674c47859
8966i1053B96712H9311J58737E4272b17627A95122E8387a76762B59924b30673
8955a09311j00820f5704k8557H1680a0393I6575m8073b53727e7168A18523O169
8944A24692b23390B31176i5920d6210k6856A6992f4767k6998B28065C0911K19401
8933B50312q2993C687J86617B8991P3749J0152J83455L93185L16003J689467M374889
8922G069891O914397k91447E714598B325664A069766l84550j79771A17208K74273
8913C91481j34897M0496I9808D8034L10281K30084k45425A50510K13994B1142
$$ y = [-697297, 281687, -173190, 70390, -206620, 258764, -95247, 4730, 49998, -74620, -168046, 70185, -109481, 106737, -149776, 106367, -32931, -67026, -177110, 272724, 35365, 19814, 36488, -347859, -91053, 296712, 89311, 248048, 54272, -217627, 195122, 58387, -176762, 259924, -230673, -109311, -210131, -65704, -94261, 81680, -10393, 96575, 48502, -253727, -57168, 118523, 124692, -223390, 231176, -95920, -46210, -73066, 16992, -64767, -91765, 228065, 30911, 250312, 167319, 3687, 190304, 28991, 102740, 112892, 296347, 689532, 1005535, 2695002, 7069891, 13984288, 13692841, 5714598, 2325664, 1069766, 685216, 505445, 117208, 391481, 256584, 297080, 99808, 48034, 358315, 588399, 342974, 150510, 364504, 21142]
8902B25604d2781D6125a22326C01964a70141b0460A84174a90667F0141K8276d83796
8890b52198N4600l5498k6452A88489b44416A9135d4762j77770A52952E846L74698
8879C80544j57712c9528C1676J59673b41332F1844d88416G2605O8280a25630k42450
8868c68080A96859b25330C56660A42648a45665J1160H3669b3237j23196L4035
8858a12398A80960c48873I1037c58060e4147j41313D7161b72449h0816D54446
8847a96113b2417E3085a7754n2883j42206N8165d2655f616r37j67027O3859B02202
$$ y = [225604, -42781, 46125, -122326, 301964, -170141, -20460, 184174, -190667, 60141, 88417, -483796, -252198, -197598, -233096, -259548, 188489, -244416, 19135, -44762, -222532, 152952, 5846, 380544, 222832, -39528, 31676, 191349, -241332, 61844, -488416, 72605, 140885, -125630, -368080, 196859, -225330, 356660, 142648, -145665, -134505, 83669, -23237, -146433, -112398, 180960, -348873, 91037, -358060, -54147, -195460, 47161, -272449, -80816, 454446, -196113, -22417, 53085, -17754, -70637, -212843, -154678, -42655, -6616, -7553, -174580, -110721, 202202]
$$ [...]
##END NTUPLES=NMR SPECTRUM
##END=
