
##TITLE=UV1244_M9_1261-1207_20_7241261_aUttAETxPP
##JCAMPDX= 6.0         $$ Bruker NMR JCAMP-DX V2.0
##DATA TYPE= NMR SPECTRUM
##DATA CLASS= NTUPLES
##ORIGIN= BRUKER
##OWNER= Administrator
$$ 1.72 TOPSPIN		Version 2.1
$$ 2013-01-25 03:08:11.326 -0500  Administrator@X
$$ Compression mode = diff/dup
##.OBSERVE FREQUENCY= 400.02188249412
##.OBSERVE NUCLEUS= ^1H
##.ACQUISITION MODE= SIMULTANEOUS (DQD)
##.ACQUISITION SCHEME= undefined
##.AVERAGES= 8
##.DIGITISER RES= 22
##SPECTROMETER/DATA SYSTEM= spect
##.PULSE SEQUENCE= zg30
##.SOLVENT NAME= COFFEE_meoh
##.SHIFT REFERENCE= INTERNAL, COFFEE_meoh, 1, 14.98509
##AUDIT TRAIL= $$ (NUMBER, WHEN, WHO, WHERE, PROCESS, VERSION, WHAT)
$$ ##TITLE= Audit trail, TOPSPIN		Version 2.1
$$ ##JCAMPDX= 5.01
$$ ##ORIGIN= Bruker BioSpin GmbH
$$ ##OWNER= Administrator
$$ $$ E:\/data/COFFEE/nmr/UV1244_M9_1261-1207_20_7241261_aUttAETxPP/30/pdata/1/auditp.txt
$$ ##AUDIT TRAIL=  $$ (NUMBER, WHEN, WHO, WHERE, PROCESS, VERSION, WHAT)
(   1,<2013-01-25 03:08:03.139 -0500>,<Administrator>,<X>,<go>,<TOPSPIN 2.1>,
      <created by zg
	started at 2013-01-25 03:06:57.092 -0500,
	POWCHK enabled, PULCHK disabled,
       configuration hash MD5:
       86 BA 57 50 F2 9D 5C 9B 26 00 A9 28 5F 66 2E 89
       data hash MD5: 64K
       60 C0 8B 0A E1 B7 ED 91 09 F1 FB E7 D8 93 81 CB>)
(   2,<2013-01-25 03:08:06.217 -0500>,<Administrator>,<X>,<proc1d>,<TOPSPIN 2.1>,
      <Start of raw data processing
       efp LB = 0 FT_mod = 6 PKNL = 1 PHC0 = 0 PHC1 = 0 SI = 32K 
       data hash MD5: 32K
       49 F2 18 29 D9 6D 61 DD B8 34 0F 5A 5B A1 74 91>)
(   3,<2013-01-25 03:08:06.670 -0500>,<Administrator>,<X>,<proc1d>,<TOPSPIN 2.1>,
      <pk PHC0 = 98.87146 PHC1 = 0 
       data hash MD5: 32K
       88 E2 00 25 4C DB 5D DF B3 29 2D D1 DA 18 33 A3>)
(   4,<2013-01-25 03:08:06.905 -0500>,<Administrator>,<X>,<proc1d>,<TOPSPIN 2.1>,
      <abs ABSG = 1 
       data hash MD5: 32K
       44 06 10 BE A3 31 FF 48 E7 4D B3 D0 41 DF E8 25>)
(   5,<2013-01-25 03:08:07.045 -0500>,<Administrator>,<X>,<proc1d>,<TOPSPIN 2.1>,
      <abs ABSG = 2 
       data hash MD5: 32K
       D7 C1 1F A6 86 E5 6E A8 21 B2 5A 8C 5F 16 AE 7E>)
(   6,<2013-01-25 03:08:07.201 -0500>,<Administrator>,<X>,<proc1d>,<TOPSPIN 2.1>,
      <abs ABSG = 3 
       data hash MD5: 32K
       55 44 BC D9 C7 2E 0D 03 26 2F 75 0E 9D AD 1D 40>)
(   7,<2013-01-25 03:08:07.342 -0500>,<Administrator>,<X>,<proc1d>,<TOPSPIN 2.1>,
      <abs ABSG = 4 
       data hash MD5: 32K
       58 35 8D E8 D2 F4 E9 B0 4F 74 E1 47 91 26 A6 7D>)
(   8,<2013-01-25 03:08:07.483 -0500>,<Administrator>,<X>,<proc1d>,<TOPSPIN 2.1>,
      <abs ABSG = 5 
       data hash MD5: 32K
       DB 80 28 C1 F4 A7 60 5D 81 2A 31 D4 3A 35 75 11>)
$$ ##END=
$$ 
$$ $$ hash MD5
$$ $$ 84 DE 83 14 CE 02 1F 8E C9 7B CB DD 90 20 30 EA
##$RELAX= 
##$RELAX= 
##$RELAX= 
##$RELAX= 
##$RELAX= 
##$RELAX= 
##$RELAX= 
$$ Bruker specific parameters
$$ --------------------------
##$DU= <E:\>
##$EXPNO= 30
$$ [...]
##$TP= (0..7)
150 150 150 150 150 150 150 150
##$TP07= 0
##$TPNAME0= <>
##$TPNAME1= <>
##$TPNAME2= <>
##$TPNAME3= <>
##$TPNAME4= <>
##$TPNAME5= <>
##$TPNAME6= <>
##$TPNAME7= <>
##$TPOAL= (0..7)
0.5 0.5 0.5 0.5 0.5 0.5 0.5 0.5
##$TPOFFS= (0..7)
0 0 0 0 0 0 0 0
##$TUNHIN= 0
##$TUNHOUT= 0
##$TUNXOUT= 0
##$USERA1= <user>
##$USERA2= <user>
##$USERA3= <user>
##$USERA4= <user>
##$USERA5= <user>
##$V9= 5
##$VALIST= <valist>
##$VCLIST= <CCCCCCCCCCCCCCC>
##$VD= 0
##$VDLIST= <DDDDDDDDDDDDDDD>
##$VPLIST= <PPPPPPPPPPPPPPP>
##$VTLIST= <TTTTTTTTTTTTTTT>
##$WBST= 1024
##$WBSW= 4
##$XGAIN= (0..3)
0 0 0 0
##$XL= 0
##$YL= 0
##$YMAX_a= 681656
##$YMIN_a= -580432
##$ZGOPTNS= <>
##$ZL1= 120
##$ZL2= 120
##$ZL3= 120
##$ZL4= 120
##$ABSF1= 14.98509
##$ABSF2= -5.573092
##$ABSG= 5
##$ABSL= 3
##$ALPHA= 0
##$AQORDER= 0
##$ASSFAC= 0
##$ASSFACI= 0
##$ASSFACX= 0
##$ASSWID= 0
##$AUNMP= <proc_prof1d_extract_pilot.lims>
##$AXLEFT= 0
##$AXNAME= <>
##$AXNUC= <1H>
##$AXRIGHT= 0
##$AXTYPE= 0
##$AXUNIT= <>
##$AZFE= 0.1
##$AZFW= 0.1
##$BCFW= 0
##$BC_mod= 0
##$BYTORDP= 0
##$COROFFS= 0
##$CY= 15
##$DATMOD= 1
##$DC= 0
##$DFILT= <>
##$DTYPP= 0
##$F1P= 0
##$F2P= 0
##$FCOR= 0.5
##$FTSIZE= 32768
##$FT_mod= 6
##$GAMMA= 0
##$GB= 0
##$INTBC= 1
##$INTSCL= 1
##$ISEN= 128
##$LB= 0
##$LEV0= 0
##$LPBIN= 0
##$MAXI= 10000
##$MC2= 0
##$MEAN= 0
##$ME_mod= 0
##$MI= 0
##$NCOEF= 0
##$NC_proc= -8
##$NLEV= 6
##$NOISF1= 0
##$NOISF2= 0
##$NSP= 0
##$NTH_PI= 0
##$NZP= 0
##$OFFSET= 14.98509
##$PC= 1
##$PHC0= 98.87146
##$PHC1= 0
##$PH_mod= 1
##$PKNL= yes
##$PPARMOD= 0
##$PPDIAG= 0
##$PPIPTYP= 0
##$PPMPNUM= 2147483647
##$PPRESOL= 1
##$PSCAL= 4
##$PSIGN= 0
##$PYNMP= <proc.py>
##$REVERSE= no
##$SF= 400.02
##$SI= 32768
##$SIGF1= 0
##$SIGF2= 0
##$SINO= 400
##$SIOLD= 32768
##$SPECTYP= <>
##$SREGLST= <1H.CDCl3>
##$SSB= 0
##$STSI= 32768
##$STSR= 0
##$SW_p= 8223.68421052631
##$SYMM= 0
##$S_DEV= 0
##$TDeff= 65536
##$TDoff= 0
##$TI= <>
##$TILT= no
##$TM1= 0
##$TM2= 0
##$TOPLEV= 0
##$USERP1= <user>
##$USERP2= <user>
##$USERP3= <user>
##$USERP4= <user>
##$USERP5= <user>
##$WDW= 1
##$XDIM= 32768
##$YMAX_p= 474691540
##$YMIN_p= -687304
##$CURPLOT= <Network HP LaserJet P1505>
##$CURPRIN= <$Network HP LaserJet P1505>
##$DFORMAT= <normdp>
##$LAYOUT= <+/1D_H.xwp>
##$LFORMAT= <normlp>
##$PFORMAT= <normpl>
##$SURQMSG= 1
$$ End of Bruker specific parameters
$$ ---------------------------------
##NTUPLES= NMR SPECTRUM
##VAR_NAME=  FREQUENCY,     SPECTRUM/REAL,   SPECTRUM/IMAG
##SYMBOL=    X,             R,               I
##VAR_TYPE=  INDEPENDENT,   DEPENDENT,       DEPENDENT
##VAR_FORM=  AFFN,          ASDF,            ASDF
##VAR_DIM=   32768,         32768,           32768
##UNITS=     HZ,            ARBITRARY UNITS, ARBITRARY UNITS
##FACTOR=    0.250966925370066, 1,           1
##FIRST=     8223.43324360094, 95485,        -159154
##LAST=      0,             23956,           -3914
##MIN=       0,             -687304,         0
##MAX=       8223.43324360094, 474691540,    0
$$ Real data points
##PAGE= N=1
##DATA TABLE= (X++(R..R)), XYDATA
$$ [...]
$$ plain form
19555 -199542 -88847 -131050 361407 -31296 -193701 -47906 -179364 -237491 390933 37658 167959
19544 167959 114146 -165245 57473 -44502 -313572 70570 197598 -37118 -30904 131928 -159376
19532 -15391 186240 -134513 -67333 -271682 72179 12387 80025 -82073 -335301 -293452 51203
19520 -217387 -98653 -265300 -71645 -188418 -171581 -139466 17566 51613 -146168 -127426 29311
19508 -92320 9995 -213267 -252772 -136417 -254160 -275810 -171381 366195 -314539 -55358 -46801
19497 -46801 -181688 -355573 -227625 -415739 95290 -274347 -166589 84501 -324012 -28018
19486 -91323 17204 -134371 -199308 -462277 130822 -161911 -5641 -3817 -222634 131115 -17448
19474 -165675 -293141 238886 -214608 17903 -254160 52425 -234268 -20763 43149 249573
$$ packed form
19555a99542h8847m2203C61407c1296j62405d7906j31458n8127C90933C7658J30301
19544A67959n3813a65245E7473d4502k69070G0570J27028c7118O214A31928a59376
19532a5391A86240a34513O7180k04349G2179A2387O7638h2073k53228M1849E1203
19520b17387i8653j66647g1645j16773J6837L2115A7566L4047a46168J8742B9311
19508i2320I995b13267l9505J16355j17743k1650J04429C66195c14539e5358Q557
19497d6801j34887j73885J27948j88114I5290b74347J07758H4501c24012b8018
19486i1323A7204a34371o4937k62969A30822a61911e641J824k18817A31115a7448
19474a65675j27466B38886b14608A7903b54160E2425b34268b0763D3149K06424
$$ plain form
19464 249573 98195 51872 58512 -81335 20732 -34406 -322234 152502 -144054 -171404 -72195
19452 -39848 123511 -258014 -228013 -168035 -28815 199388 -283910 109311 48721 -61175 -100326
19441 -100326 -35392 -38931 159811 -272895 -4977 308956 55573 -92649 133083 -212525 -174794
19430 -174794 53843 -127997 -2250 5347 96301 -39986 -104529 129325 -286604 52666 91256
19419 91256 193780 336573 -332684 -207824 -579990 106199 -58516 -229609 137452 -24541
19408 -199884 -122815 -315374 -97813 -190311 20618 -133925 296264 6105 112629 -31080 -234579
19397 -234579 -138435 -25328 -17661 -27920 130454 -337967 -449023 -393608 9185 -163550 -225407
19386 -225407 215789 -387008 23148 -90770 -70790 -81987 -110811 -141839 -172218 -256217 199745
$$ packed form
19464B49573I8195m6323O640h1335B0732c4406k87828A52502a44054k7350g2195
19452c9848A23511b58014L0001N9978b8815A99388b83910A09311D8721f1175l9151
19441a00326c5392l539A59811b72895d977C08956E5573i2649A33083b12525L7731
19430a74794E3843a27997b250E347R0954c9986o4543A29325b86604E2666L8590
19419I1256J02524J42793c32684J24860l72166A06199e8516j71093A37452b4541
19408a99884P7069j92559i7813r2498B0618a33925B96264F105J06524c1080k03499
19397b34579R6144b5328P667j0259A30454c37967j11056N5415I185a63550o1857
19386b25407B15789c87008B3148i0770J9980j1197k8824l1028l0379q3999A99745
$$ plain form
19374 -172812 92243 71639 -36510 -172161 84164 -33194 -288812 -105663 71339 -303367 -139862
19362 -246326 -57782 -274120 265371 -55353 -317646 160024 -311927 211214 -206356 -76624
19351 287450 -99677 135012 -249237 -330615 -70822 -133806 -194990 59401 -34134 -252146 85551
19339 -104411 -329224 -96363 42124 -85679 118264 -262076 -52341 -200583 54025 -165871
19328 140393 52555 -340500 176627 -241690 -308181 44066 3146 2495 415278 -204903 375882
19316 286061 186754 -129361 -164283 -67995 229034 286585 51285 -158698 -148821 21402 178468
19305 178468 82460 -77111 -65588 -45678 -117350 98233 129980 -35483 -223719 75556 32430
19293 -249927 -129914 80700 -331983 -104261 -277962 -194045 -339246 238429 -88096 25362
$$ packed form
19374a72812I2243k0604c6510j35651H4164c3194k55618a05663G1339c03367a39862
19362b46326e7782k16338B65371e5353k62293A60024c11927B11214b06356g6624
19351B87450i9677A35012b49237q1378g0822o2984o1184E9401c4134k18012H5551
19339a04411k24813i6363D2124h5679A18264b62076e2341j48242E4025a65871
19328A40393E2555c40500A76627b41690o6491D4066C146o51M12783b04903C75882
19316B86061r9307a29361l4922f7995B29034N7551E1285a58698R877B1402J57066
19305A78468H2460g7111J1523J9910p1672I8233L1747c5483j88236G5556C2430
19293b49927J20013H0700c31983a04261j73701Q3917j45201B38429h8096B5362
$$ plain form
19282 142959 -187278 -31369 161976 -277394 75797 23634 1378 -110427 -167604 -167481 -165472
19271 -165472 -333942 152877 158155 -67292 46563 -65300 -53090 -389401 -208866 -128904 -36694
19259 -416514 1750 -154719 35041 -9512 -328800 166446 -120941 -126127 -48107 95104 -2350
19247 -74307 183236 214017 -11895 -83893 -139095 -240551 -30283 195942 -165867 160364 -81056
19235 7031 -118311 151409 -8729 24009 -117265 -491167 -52710 -229493 -104275 -272024 -266173
19224 -266173 -2678 -312 58179 -41600 -376708 -222588 11039 -7086 -169936 -399941 203753
19212 -2344 185498 -136261 -93808 -345266 -216680 276596 -69291 120042 -265331 160631
19201 18329 -65595 -459296 -88153 -65882 -272909 132395 54817 -336918 159656 138907 -135758
$$ packed form
19282A42959a87278c1369A61976b77394G5797B3634A378a10427n7177J23K009
19271a65472j68470A52877N278f7292D6563f5300J2210l36311J80535P9962c6694
19259d16514A750a54719C5041i512l19288A66446a20941n186d8107I5104b350
19247g4307A83236L0781a1895p1998n5202j01456c0283A95942a65867A60364h1056
19235G031a18311A51409h729B4009a17265l73902e2710j76783a04275j67749N851
19224b66173b678c12E8179d1600l35108J54120A1039g086j62850k30005B03753
19212b344A85498a36261M2453k51458J28586B76596f9291A20042b65331A60631
19201A8329f5595l93701h8153K2271k07027A32395E4817c36918A59656k0749a35758
$$ plain form
19189 -126781 -72077 -152404 -39442 -366159 62995 -42454 -179586 -20540 -136351 -135575 -258706
19178 -258706 140091 57242 -382655 47912 -297747 -226504 -180330 -161210 -100761 122788 9940
19166 12552 63834 -236411 -145579 -206105 5768 -165280 -218401 -274267 410686 179042 -319458
19154 117730 140309 -71955 -180371 185233 101765 212980 -7822 -106628 71632 21400 -183415
19142 45631 -185802 -101134 -344815 138315 -179361 102167 -77071 25136 -46647 -111786 408394
19130 -77553 -175893 -46832 -91825 -40011 205333 246362 166591 227988 109834 -420403 77231
19118 65083 38043 -220544 91096 -90479 -225474 21599 -267316 -150205 132744 37328 -51562
19106 -341420 75 -185415 -39951 86502 78862 57552 64549 251914 -58875 -457925 35027 130272
$$ packed form
19189a26781N4704q0327c9442l26717F2995d2454j37132b0540j15811P76j23131
19178b58706A40091E7242c82655D7912b97747P1243M6174J9120O0449A22788I940
19166A2552N1282b36411R0832o0526E768a65280n3121n5866D10686A79042c19458
19154A17730K2579g1955j08416A85233q3468J11215g822r8806G1632B1400a83415
19142D5631a85802Q4668k43681A38315a79361A02167g7071B5136d6647o5139D08394
19130g7553r8340d6832m4993d0011B05333M1029p9771O1397A09834d20403G7231
19118F5083k7040b20544I1096i0479j34995B1599b67316J17111A32744C7328e1562
19106c41420G5a85415c9951H6502p640k1310O997J87365e8875l99050C5027R5245
$$ plain form
19094 130272 129238 -229977 100285 146129 -168294 138728 -133212 146372 -468290 58979
19083 -295464 -266618 33899 -120229 14063 159667 89060 -9959 -180125 -236930 -554361 164153
19071 -127203 221503 -55443 -140267 19292 197887 237482 -173026 -293027 67334 -55817 -74351
19060 -74351 -118677 -58060 -29674 126521 -4005 63232 290723 80109 -239829 69184 224861
19049 224861 -142294 -27702 -180814 -29668 84916 6904 -16472 -47535 5663 12324 134893
19038 134893 -80047 133778 -286915 88675 60086 -91119 152047 -157002 152110 -149514
19027 -247076 -67081 118769 65588 156217 257887 62247 156213 231091 -68750 60007 100398
19016 100398 -382265 -110945 -181320 -9962 -151267 -41091 -2027 11987 -65458 15492 -235864
$$ packed form
19094A30272j034b29977A00285M5844a68294A38728a33212A46372d68290E8979
19083b95464K8846C3899a20229A4063J45604p0607i959j70166n6805l17431A64153
19071a27203B21503e5443q4824A9292J78595L9595a73026j20001F7334e5817j8534
19060g4351m4326e8060K8386A26521d005F3232K27491H0109b39829F9184J55677
19049B24861a42294b7702j53112b9668H4916F904a6472l1063E663O661J22569
19038A34893h0047A33778b86915H8675k8589i1119A52047a57002A52110a49514
19027b47076f7081A18769n3181R0629J01670F2247R3966P4878f8750F0007M0391
19016A00398c82265a10945p0375i962j41305d1091b027A1987f5458A5492b35864
$$ plain form
19004 69884 269114 -289621 -143887 -242566 -151564 -149009 211094 -217445 -74021 -61392 -247164
18993 -247164 -195621 -217017 -197235 49032 -35145 -429985 -154875 458467 270385 -18574 6582
18981 22000 -65205 79088 -217754 83983 13736 -79002 -143287 301867 -112290 -53932 156065
18969 -316741 -134883 -742 -167498 -192286 77144 -180118 16456 -133328 -227638 -46020 62681
18957 -103228 -220783 -234868 14272 222977 -25175 -156022 -409565 -96520 -159313 -172842 17085
18945 -53829 50197 -445729 225349 -26992 -133926 166255 159015 -498616 -137580 -368902
18935 -368902 228923 82782 139195 -110089 -342072 -94603 115322 -14251 -137969 171927
18924 20211 -315968 43479 183050 29269 -13060 158308 307587 131819 148150 99973 27148
$$ packed form
19004F9884J99230b89621a43887r8679R1002K555B11094b17445g4021J2629j85772
18993b47164N1543k1396J9782D9032c5145l94840a54875D58467j88082a8574F582
18981B2000f5205G9088b17754H3983A3736g9002o4285C01867a12290e3932A56065
18969c16741a34883g42j66756k4788G7144a80118A6456a33328r4310d6020F2681
18957a03228j17555j4085A4272K08705b5175j30847k53543i6520o2793j3529A7085
18945e3829E0197d45729B25349b6992j06934A66255p240d98616a37580k31322
18935c68902B28923H2782N6413a10089k31983i4603A15322a4251j23718A71927
18924B0211c15968D3479J39571B9269a3060A58308J49279A31819J6331m8177B7148
$$ plain form
18912 -375812 25361 -195550 48004 61994 -4643 -146199 -181297 44305 4681 -369174 100604
18900 -89235 -123983 -243390 -263230 -207157 -233982 -16068 -42145 -113198 -122384 -147978 70048 -23733
18887 -150213 217325 35027 192029 149693 87814 171966 201317 -309138 -237029 -7428 -83764
18876 -83764 -244995 115358 52029 -68078 38586 -143270 -70354 -368069 193122 135458 127510
18865 127510 171570 -36560 -164062 -138464 193229 181376 -189820 -153118 3811 -32457 299307
18853 -375654 -19679 -174727 -148154 -85953 53345 186008 324915 -66056 -61813 52650 -7170
18841 -179928 -232553 -378154 79020 -73530 -1234 236560 76702 -325430 -81083 -96212 -141050
18830 -141050 49823 119407 123151 -249385 4878 -66989 -74368 -44693 -262356 -82447 -259109
$$ packed form
18912c75812B5361a95550D8004J3990d643j41556l5098D4305D681c69174A00604
18900h9235l4748j19407j9840N6073k6825a6068k6077p1053r186k5594G0048b3733
18887a50213B17325C5027J57002m2336o1879Q4152K9351c09138P2109g428p6336
18876h3764j61231A15358E2029f8078C8586a43270g0354k97715A93122n7664p948
18865A27510M4060c6560j27502K5598A93229j1853a89820L6702C811c2457B99307
18853c75654a9679j55048K6573O2201E3345J32663J38907f6056M243E2650g170
18841a79928n2625j45601G9020g3530a234B36560G6702c25430h1083j5129m4838
18830a41050D9823O9584L744b49385D878f6989p379K9675k17663h2447j76662
$$ plain form
18819 -259109 187071 284710 -68784 -348671 115176 243140 -151826 55416 13901 169772
18809 169772 204408 67179 -45962 164425 71054 -31878 -15576 -66500 41377 -422471 10136
18797 -83049 101829 32850 -211974 43028 -133380 -14046 -31383 -233282 -52868 -45193 -222458
18786 -222458 -137837 -118393 -208589 -303390 -170397 252150 -144976 -44320 -116909 -100957 -184303
18775 -184303 27264 213910 162710 416330 299380 67825 117062 -19275 -158083 -186593 -168485
18764 -168485 -16268 -80293 319080 -536908 -15959 -155202 -598013 -86015 -97844 169134
18753 256687 12766 -61499 433296 -263912 -66941 33681 -351318 -17439 -271242 9182 42216
18742 42216 91309 -24713 66952 73821 -400774 -132914 -150966 -97511 -151447 122045 -127975
$$ packed form
18819b59109A87071R7639f8784k79887A15176J27964a51826E5416A3901J55871
18809A69772L4636F7179d5962A64425G1054c1878a5576n0924D1377d22471A0136
18797h3049A01829C2850b11974D3028a33380a4046j7337k01899e2868P675j77265
18786b22458Q4621J9444r0196r4801J32993B52150a44976d4320p2589J5952q3346
18775a84303B7264J86646n1200K53620j16950F7825M9237a9275j38808k8510J8108
18764a68485a6268o4025C19080e36908a5959j39243m42811h6015j1829A69134
18753B56687A2766f1499D33296b63912f6941C3681c51318a7439k53803I182L3034
18742D2216M9093b4713F6952O869d00774a32914j8052N3455n3936A22045a27975
$$ plain form
18730 -66720 288587 -104974 -80510 -259810 51825 10832 -26951 -186390 -383688 148198
18719 281139 -69122 -281961 -190178 -145648 -40895 120593 3751 195049 -38811 41674 -171708
18707 -112985 -199796 -100145 21129 270556 -96902 -317402 5607 -64789 -40505 -119837 127971
18695 85964 -143309 77742 14386 149401 -55469 39924 258986 278023 -217642 -164336 50292
18683 -251122 -182623 -70580 130132 48103 31168 -79058 -26855 -63538 45380 58426 79458
18672 79458 154070 18557 -313581 123881 -3457 78983 -188127 -46203 -106645 -345164 -180425
18661 -180425 172816 -55149 -250574 -17843 -174346 -212254 80991 760 -152356 49069 -71537
18649 78388 -248934 110949 -5910 324487 41195 -219488 -86176 287779 -502286 -68417 96294
$$ packed form
18730f6720B88587a04974K4464j79300E1825A0832b6951j59439j97298A48198
18719B81139f9122k12839R1783M4530d0895A20593C751J91298c8811D1674a71708
18707a12985q6811R9651B1129K49427i6902k20500E607f4789K4284p9332A27971
18695H5964a43309G7742A4386J35015e5469C9924K19062J9037b17642N3306E0292
18683b51122O8499g0580A30132D8103j6935g9058b6855l6683D5380J3046K1032
18672G9458P4612A8557c13581A23881c457G8983a88127d6203o0442k38519J64739
18661a80425A72816e5149j95425a7843j56503l7908H0991G60a52356D9069g1537
18649G8388b48934A10949e910C24487D1195b19488h6176B87779e02286f8417I6294
$$ plain form
18637 78495 220608 381942 -163954 74721 8260 -128784 -120596 5068 83493 -207816 -293306
18626 -293306 33092 178037 193349 -334976 -30826 -166998 -38170 47289 -39200 14441 -216276
18614 -73416 -411263 44047 102425 206495 87620 -21638 -49096 -34416 -29617 -72358 167165
18602 -76602 -72456 -95405 -172730 -142093 -175883 -157764 -20730 65009 63501 -27536 -43888 -236203
18590 -236203 -175287 -73161 47603 104081 -53660 -100667 -339033 -110896 112438 36253 -310786
18578 -366723 188137 24014 -42712 219257 -113880 -79659 -96592 191832 -329697 -364687
18568 -364687 83846 -159368 -170911 -46486 -317031 -16259 -677 -38113 -223105 -315783 69491
18556 51614 -236623 -17746 -303257 -232794 292845 -43583 72471 -63328 -68605 -85031 -94996
$$ packed form
18637G8495J42113J61334a63954G4721H260a28784Q188E068P8425b07816q5490
18626b93306C3092J44945J5312c34976c0826j36172c8170D7289c9200A4441b16276
18614g3416l37847D4047N8378J04070H7620b1638k7458J4680M799m2741A67165
18602g6602M146k2949p7325L0637l3790J8119b0730F5009j508b7536j6352j92315
18590b36203O0916g3161D7603N6478e3660m7007k38366a10896A12438C6253c10786
18578c66723A88137B4014d2712B19257a13880L4221j6933A91832c29697l4990
18568c64687H3846a59368j1543d6486k70545a6259f77l7436j84992r2678F9491
18556E1614b36623a7746k85511P0463B92845d3583G2471f3328n277j6426r965
$$ plain form
18545 -94996 398527 -68493 81547 -111229 146228 -34908 282849 -83570 126108 205802 -200468
18533 -130759 -313968 -44698 -72937 -60518 -115082 -148951 -180618 -117241 -169514 -139117 148080
18521 201974 -102753 -77031 60666 10711 -364806 351603 -232315 -393492 2730 401094
18511 401094 223803 -289661 186691 151670 31217 -68179 -160688 173722 -115710 259096
18500 522081 92377 -77748 77033 -242194 -151826 1391 -259798 124675 40604 -220596 160846
18488 -174790 -275821 276139 -111311 -378959 -153024 -235374 -1704 -27813 -7419 -78839 80304
18476 -196561 -106808 -341189 115063 -132460 -244410 465824 -238662 -262556 -343245 -121597
18465 202550 260443 -118792 -162736 62544 -215644 -186812 249383 -7665 168118 -41528 289629
$$ packed form
18545i4996C98527f8493H1547a11229A46228c4908B82849h3570A26108P9694b00468
18533a30759j83209d4698k8239J2419n4564l3869l1667O3377n2273L0397A48080
18521B01974a02753K5722F0666A0711c64806C51603b32315j61177B730L98364
18511D01094j77291b89661A86691l5021C1217f8179r2509A73722a15710B59096
18500E22081I2377g7748G7033b42194R0368A391b59798A24675D0604b20596A60846
18488a74790j01031B76139a11311k67648a53024q2350a704k6109g419p1420H0304
18476a96561Q9753k34381A15063a32460j11950D65824b38662k3894q0689a21597
18465B02550N7893a18792m3944F2544b15644K8832B49383g665A68118d1528B89629
$$ plain form
18453 114227 -169048 -459961 -126032 -93881 -355089 112050 2484 123802 -220205 144652
18442 -397102 -173609 -106818 91413 -157800 164757 -146037 141010 -132475 177074 -312836
18431 -87910 -320950 -218653 -305020 20143 -27053 -18686 254686 90685 -91413 -80791 52728
18419 -297582 -25589 -66498 118528 -80354 -282171 -29167 5798 -42011 142823 42278 206321
18408 206321 253372 -46474 106921 7735 97987 -136145 -86174 -105589 318918 -73641 125679
18396 -199695 266504 -105344 -209057 -215339 94539 303 -109122 298810 -61677 151198 -308468
18384 69534 171642 -91501 -133604 122864 -186992 -131869 -110319 172875 23473 314350 -217893
18372 266380 256526 85702 -30359 213747 -290377 304475 -252153 -366777 -44020 182434
$$ packed form
18453A14227a69048k90913a26032L2151k61208A12050B484J21318b20205A44652
18442c97102a73609O6791I1413a57800A64757a46037A41010a32475A77074c12836
18431h7910k33040J02297q6367B0143b7053Q367B54686I0685i1413J0622E2728
18419b97582b5589m0909A18528h0354k01817b9167E798d2011A42823D2278J64043
18408B06321M7051d6474A06921G735R0252a36145M9971j9415C18918g3641A25679
18396a99695B66504a05344j03713o282I4539C03a09122B98810f1677A51198c08468
18384F9534J02108i1501m2103A22864a86992N5123K1550A72875B3473K90877b17893
18372B66380r854H5702c0359B13747b90377C04475b52153j14624d4020A82434
$$ plain form
18361 -29966 71366 72383 34454 7100 196905 -94254 -204507 -82697 50983 -99445 201649
18349 -114591 -293051 -8112 244852 57581 -166670 54109 -68674 -71794 -33653 185228 -160631
18337 48490 -285952 187370 -127795 188614 -89569 -228672 201150 -82358 69286 -357856
18326 112772 -200322 -70483 22840 -111423 372050 -59387 -111031 -187257 -288467 250126
18315 289334 73560 -231639 -65670 -60323 -162093 -204534 6433 65168 46812 165231 273660
18304 273660 -183313 -36917 136729 212896 288203 -56 180530 -90471 -262189 11025 -24023
18292 96188 -210005 129976 -8099 50731 -23464 -34075 -33984 203558 -89642 -49324 76644 -43131
18279 697 -343405 -279453 -233714 -360314 -37180 -98658 189533 102510 43934 -207812 -44866
$$ packed form
18361b9966G1366J017C4454G100J89805i4254j10253h2697E0983i9445B01649
18349a14591j78460h112B44852E7581a66670E4109f8674l120c3653A85228a60631
18337D8490b85952A87370a27795A88614h9569j39103B01150h2358F9286c57856
18326A12772b00322g0483B2840a11423C72050e9387n1644p6226j01210B50126
18315B89334G3560b31639f5670N347j01770m2441F433N8735j8356J18419J08429
18304B73660a83313c6917A36729P6167P5307e6A80530i0471j71718A1025b4023
18292I6188b10005A29976h099E0731b3464j0611R1B03558h9642M0318G6644d3131
18279F97c43405O3952M5739j26600c7180o1478A89533q7023D3934b07812d4866
$$ plain form
18267 -76068 -327467 223324 -49876 -92974 117218 108428 212442 351599 -130110 -86422 -342592
18256 -342592 114690 46237 -192648 -165971 32191 11169 -92371 -95435 -361211 -37890 19770
18244 60384 -154278 -380090 -173744 -124065 -289023 -45869 -40768 -65565 -374210 -187547 97370
18232 -283876 13409 -142547 -82509 -243239 -182259 -192222 221697 -79429 -94278 -149938 -311793
18221 -311793 3843 -351177 21202 54075 177978 -25281 67406 -63395 -124186 -285662 -153492
18210 -153492 113888 20682 -3233 -207432 239186 -199569 304333 200414 -131535 -219598
18200 -219598 -47489 -299055 105006 -45195 -64462 50120 -24579 -371814 -57343 300156 -126870
18188 65842 103806 -102595 132088 -15659 248607 -324411 10256 -340898 -14598 -219300
$$ packed form
18267g6068k51399B23324d9876m3098A17218q790J04014J39157a30110M3688k56170
18256c42592A14690D6237a92648K6677C2191A1169i2371l064k65776c7890A9770
18244F0384a54278k25812a73744M9679j64958d5869N101k4797l08645J86663I7370
18232b83876A3409a42547O0038j60730O0980r963B21697g9429j4849n5660j61855
18221c11793C843c51177B1202L2873J23903b5281F7406f3395o0791j61476J32170
18210a53492A13888B0682c233k04199B39186a99569C04333j03919a31535q8063
18200b19598d7489k51566A05006d5195j9267E0120b4579l47235e7343C00156a26870
18188F5842L7964a02595A32088a5659B48607c24411A0256c40898a4598k04702
$$ plain form
18178 -219300 143717 -89090 161236 26083 -196836 -157447 -92801 69401 -194987 -355745
18168 -355745 -103621 -152250 202184 -296159 434640 66753 -172745 296538 146319 271210
18158 271210 213016 -84610 -109498 32625 -354092 -284939 -62683 72889 -101671 -259171 -208807
18147 -208807 60749 -49991 -218621 -300097 -125716 2236 -42373 106319 115635 143501 9506
18135 -200247 -78243 67122 86662 183421 -101475 -124817 37201 97144 -58574 -27798 -18422
18124 -18422 113054 -227840 -120492 -468142 38844 17346 102423 -211242 -176626 136785
18113 91366 112460 -15488 27640 -376386 188345 -299656 -12344 52045 22733 33328 -254343
18101 -123131 -50598 -102876 77519 177134 -225511 -56426 64791 253970 41300 -37466 -311316
$$ packed form
18178b19300A43717h9090A61236B6083a96836L9389O4646F9401a94987j60758
18168c55745a03621m8629B02184b96159D34640F6753a72745B96538A46319J24891
18158B71210n8194h4610k4888C2625c54092O9153f2683G2889a01671j57500N0364
18147b08807F0749d9991j68630q1476a25716B236d2373A06319R316K7866I506
18135b00247g8243F7122J9540R6759a01475k3342C7201N9943e8574b7798R376
18124a8422A13054b27840J07348l47650C8844A7346Q5077b11242L4616A36785
18113I1366K1094a5488B7640c76386A88345b99656a2344E2045B2733J0595b54343
18101a23131e0598n2278G7519R9615b25511e6426F4791J89179D1300c7466k73850
$$ plain form
18090 -311316 7383 -34063 -126837 -99445 -228617 2900 -144160 -81451 14942 5807 -49144 209038
18077 -234882 30401 182245 92467 252261 120089 264954 110535 87033 364427 11345
18066 -111324 -43513 15808 165735 -207395 -210976 39426 181944 -292720 -94769 -30491 208321
18054 -338952 -169155 -491532 -88900 97256 156610 -81538 204545 8225 182812 288766 -316464
18042 39911 110219 220172 -134264 172111 -187660 41707 -115253 -313783 -148287 322210
18031 70838 -42390 28182 29980 -267389 -190323 -72432 -155003 38947 -145277 -49706 -137636
18020 -137636 -112288 260292 88381 38637 -28382 -195146 -102077 387208 -197894 222699
18009 -92259 -239589 -344048 -47324 249699 215441 110160 -221765 231184 94739 -167713
$$ packed form
18090c11316G383c4063r2774K7392j29172B900a44160O2709A4942E807d9144B09038
18077b34882C0401J51844q9778J59794A20089J44865A10535k3502K77394A1345
18066a11324d3513A5808J49927b07395l581C9426J42518b92720i4769c0491B08321
18054c38952a69155l22377h8900I7256N9354h1538B04545H225J74587J05954c16464
18042C9911P0308J09953a34264A72111a87660D1707a15253j98530a48287C22210
18031G0838d2390B8182J798b67389P7066g2432q2571C8947a45277d9706q7930
18020a37636K5348B60292H8381C8637b8382j66764R3069C87208a97894B22699
18009i2259j47330j04459d7324B49699l4258j05281b21765B31184I4739a67713
$$ plain form
17998 -199336 -55438 -65751 -25334 -213116 51135 43540 91936 367685 -377799 138013 39644
17986 -109244 -269811 3508 29876 3927 -174971 -72442 108353 46755 -210506 -172919 -117144
17975 -117144 101010 42278 86612 -36424 -54747 149156 169277 155009 79770 -350731 -149098
17963 207011 -95541 -115808 -21435 34544 -208458 -262917 169750 -328542 -15344 162048 -90092
17951 -38916 114892 -69183 101825 -51572 -168818 -294482 -71312 -203177 -126167 -364370
17941 -364370 60470 114237 -79043 96933 -45053 -127477 11451 85365 -153192 28346 21861
17930 21861 154305 -20054 108677 33821 -43418 -71166 -107722 -220306 69064 281347 -79538
17918 -108960 19588 -12504 -225872 17070 -7618 -190162 -108150 228685 -57082 4979 5934 -116172
$$ packed form
17998a99336e5438j0313b5334j87782E1135p595M8396K75749c77799A38013C9644
17986a09244j60567C508K6368C927a74971g2442A08353D6755b10506L7587N5775
17975a17144A01010D2278M4334c6424j8323A49156K0121j4268p5239c50731a49098
17963B07011i5541k0267b1435C4544b08458n4459A69750c28542a5344A62048i0092
17951c8916A14892f9183A01825e1572j17246j25664g1312j31865P7010k38203
17941c64370F0470N3767g9043I6933d5053q2424A1451P3914a53192B8346o485
17930B1861J32444b0054A08677C3821d3418k7748l6556j12584F9064K12283g9538
17918a08960A9588a2504k13368A7070g618j82544Q2012B28685e7082D979R55a16172
$$ plain form
17905 476835 -9647 -175277 -127697 15506 156192 -155970 -44563 245193 -457430 69461 -187324
17893 71482 113430 -189691 343034 -76084 69375 118550 18520 -105331 -109108 -14042 -318442
17882 -318442 -114614 -284847 -50282 507371 74723 -165049 329022 83348 280312 -359859
17871 225006 13349 -36570 69959 238935 160353 -376144 -285639 51200 -237746 -257225 -29722
17859 8552 -240240 -133587 86582 158775 98221 237560 162432 136435 105153 268129 -89840
17847 189956 119523 106328 114326 55034 123952 106680 126219 -101517 -390908 130823 68058
17836 68058 149213 283773 10583 -196601 170569 13548 203421 138629 -125130 -487447
17826 -487447 355548 -183369 -7103 182905 -12109 51296 189559 -145330 -70589 181824
$$ packed form
17905D76835i647j65630M7580A5506J40686a55970d4563B45193d57430F9461a87324
17893G1482M1948a89691C43034g6084F9375M9175A8520a05331l777a4042l04400
17882c18442a14614j70233e0282E07371G4723a65049C29022H3348J96964c59859
17871B25006A3349c6570F9959J68976p8582c76144R0505E1200b37746j9479b9722
17859H552b40240J06653H6582P2193o0554J39339p5128k5997l1282J62976h9840
17847A89956p0433j3195P998E5034O8918j7272J9539a01517k89391A30823o2765
17836F8058Q1155J34560A0583a96601A70569A3548J89873o4792a25130l62317
17826d87447C55548a83369g103A82905a2109E1296J38263a45330g0589A81824
$$ plain form
17815 -57932 -98312 -94974 -89791 -228923 -183194 -65758 190177 -301237 137075 119014 2061
17803 -85177 110018 134360 -16052 197431 111855 258880 17466 154911 171754 199863 195002
17792 195002 114731 52878 454126 -39047 29418 60025 -180169 -338366 -10065 87453 -181934
17780 -59534 159622 184229 -47800 21662 -265631 13401 -33957 18031 363015 64993 -10143
17768 -385126 88414 210213 -61917 98548 -25133 -83496 231050 -145891 -83959 -525068 -194658
17756 -166925 -190977 -162424 24040 129822 -212600 300950 172077 102880 -30103 262865
17745 -233738 173509 -24445 -364427 153065 -92777 -51246 -123435 169561 -130463 -13353
17734 106192 -244889 -265313 -161167 251056 -75548 454939 73996 -93827 -149605 -169400 342765
$$ packed form
17815e7932m0380L338N183j39132M5729f5758A90177c01237A37075j8061B061
17803h5177A10018K4342a6052A97431q5576J47025A7466J37445J6843K8109m861
17792A95002q0271E2878M01248c9047B9418L0607a80169j58197a0065H7453a81934
17780e9534A59622K4607d7800B1662b65631A3401c3957A8031L44984F4993a0143
17768c85126H8414J21799f1917I8548b5133n8363B31050a45891O1932m41109a94658
17756a66925k4052K8553B4040J05782b12600C00950j28873o9197c0103B62865
17745b33738A73509b4445l39982A53065i2777M1531p2189A69561a30463a3353
17734A06192b44889k0424J04146B51056g5548D54939G3996i3827n5778j9795C42765
$$ plain form
17722 58940 -147142 -161520 -73493 19420 164704 76951 -34918 45409 -107554 36063 35303
17711 35303 -211001 468666 -162779 154469 -121605 -231516 -31125 -157589 326169 -224123
17700 -27696 -179353 192397 -58912 -175817 15612 16498 8447 -320193 13610 -132140 295131
17688 -61290 117975 59014 255153 -131909 71056 -71263 -62487 -150158 351629 185724 -306830
17676 -31532 -316893 -90752 311880 59574 59075 -59929 -33484 -255971 125431 -14281 -101308
17665 -101308 143892 73622 -117280 -24055 -113364 -88827 -178191 137590 190124 68580 -137021
17653 272054 332278 -171408 14689 23384 37500 169585 -154114 -147625 61938 81485 168429
17642 168429 172678 207100 -210786 66380 -165116 383507 11363 115898 81588 -91416 167474
$$ packed form
17722E8940a47142j4378g3493A9420J45284G6951c4918D5409a07554C6063p60
17711C5303b11001D68666a62779A54469a21605j09911c1125j26464C26169b24123
17700b7696j51657A92397e8912j16905A5612Q86q051c20193A3610a32140B95131
17688f1290A17975n8961J96139a31909G1056g1263Q776q7671C51629j65905c06830
17676c1532k85361i0752C11880E9574m99e9929K6445k22487A25431a4281q7027
17665a01308A43892p0270a17280b4055q9309K4537q9364A37590N2534F8580a37021
17653B72054O0224a71408A4689Q695J4116J32085a54114O489F1938J9547Q6944
17642A68429M249L4422b10786F6380a65116C83507A1363J04535l4310i1416A67474
$$ plain form
17630 256950 -209490 265667 -185337 -141715 112001 431305 -273008 203596 -203540 293163
17619 133560 158733 64815 43409 158894 224392 51667 -208751 8770 -89024 401443 -9219
17607 156620 19625 -378079 78814 -170129 -187132 -255856 119105 48197 139096 182133 1276
17595 62118 -61498 74010 -83801 105310 -429217 76249 58804 -224868 58182 -59315 356965
17583 -90869 -43157 50996 191070 -207674 -51592 61893 -5377 37698 68222 61150 160418 -183164
17570 8017 92319 355504 202097 189399 -152072 -12515 162795 46905 79667 22854 173411
17559 173411 347244 397808 -91373 230834 26688 457636 -278639 -156176 220438 476183
17549 476183 201484 -111359 -112264 73064 -141920 -259141 400742 248053 337477 215874
$$ packed form
17630B56950b09490B65667a85337M3622A12001L19304b73008B03596b03540B93163
17619A33560K5173F4815k1406J15485O5498E1667b08751H770h9024D01443i219
17607A56620A9625c78079G8814a70129j7003o8724A19105D8197R0899M3037A276
17595F2118f1498G4010h3801A05310d29217G6249j7445b24868E8182e9315C56965
17583i0869d3157E0996J40074b07674e1592F1893e377C7698L0524p072R9268a83164
17570H017Q4302K63185j53407j2698a52072a2515A62795D6905L2762B2854J50557
17559A73411J73833N0564i1373B30834B6688M30948b78639J22463B20438K55745
17549D76183B01484a11359r05G3064a41920j17221D00742j52689Q9424j21603
$$ plain form
17539 215874 298986 140241 -7554 11254 -22420 85297 84776 159727 -121368 -109509 2749 619570
17527 619570 207956 -109878 130830 328014 -154760 179137 -223157 554489 -104300 -238096
17517 -238096 146313 328807 -17864 75937 -251398 183226 -5642 9288 -27884 94651 99992
17506 99992 -18865 -45185 671717 17771 266199 -23018 133309 -96331 125766 87524 156120
17495 156120 195691 257161 303718 177267 -75910 193710 102277 118533 234531 85998 -216761
17483 -222454 64381 190686 -50024 -179892 -346542 -52755 314783 -164430 82277 141403
17473 141403 365866 -125715 234808 -235071 196162 36902 359356 189642 109352 -95123
17462 147545 -256191 142777 458118 129274 -271430 -44454 71736 105869 -59956 97958
$$ packed form
17539B15874Q3112A40241g554A1254b2420H5297n21P4951a21368J1859B749O16821
17527F19570B07956a09878A30830J97184a54760A79137b23157E54489a04300j33796
17517b38096A46313J82494a7864G5937b51398A83226e642I288b7884I4651N341
17506I9992a8865k6320F71717A7771K48428b3018A33309i6331A25766l8242O8596
17495A56120L9571O1470M6557j26451g5910A93710r1433J6256J15998H5998b16761
17483b22454F4381J26305e0024j29868j66650e2755C14783a64430H2277N9126
17473A41403K24463a25715B34808b35071A96162C6902L22454j69714q0290i5123
17462A47545b56191A42777L15341A29274b71430d4454G1736L4133e9956I7958
$$ plain form
17451 96227 141738 -221430 500012 304353 401616 410897 392383 336000 -106369 171181 360537
17440 360537 98607 85076 161518 -105335 325432 43478 240818 79796 -90858 255306 197404
17429 197404 155235 300774 556084 94498 -32603 -202907 246980 445403 265091 -19085
17418 311613 117021 410832 241478 363547 303576 330787 96721 466803 83924 418116
17408 418116 424120 235966 -32946 146725 237905 392148 274725 457472 157580 138810
17398 138810 164831 -53490 47227 408619 408523 244867 109902 -166006 148524 277279 309348
17387 309348 181513 173834 338113 125157 118601 281163 204527 217014 163644 211786 130643
17376 130643 93208 86573 156797 189452 34641 195134 -251680 123584 314609 -26827 371782
$$ packed form
17451I6227M5511b21430E00012j95659R7263R281j8514n6383a06369A71181J89356
17440C60537I8607j3531P6442a05335C25432D3478J97340G9796i0858B55306n7902
17429A97404m2169J45539K55310I4498c2603j70304B46980J98423j80312a9085
17418C11613A17021K93811j69354J22069n9971K7211I6721L70082H3924L34192
17408D18116O004j88154c2946A46725R1180J54243j17423J82747A57580j8770
17398A38810K6021e3490D7227L61392r6j63656A09902a66006A48524J28755L2069
17387C09348j27835p679J64279A25157o556J62562p6636J2487n3370M8142q1143
17376A30643l7435o635P0224L2655C4641J60493b51680A23584J91025b6827C71782
$$ plain form
17364 -4395 -6191 -25675 23889 316567 8475 -54328 575697 161618 -94263 -129253 346498
17352 63738 182513 743764 11938 174376 114794 81027 63302 29405 258114 194962 196250
17341 196250 88204 60878 -97951 44551 138328 52756 175080 -21039 134063 -195719 338238
17329 248780 364080 5679 141570 192534 69299 317182 177371 271063 296228 59643 -72878
17317 -120718 243446 609273 297855 -29182 251258 234096 -130034 394039 -161164 393027
17306 147261 260901 174637 295279 386868 148615 576846 262553 -157399 180642 -5032
17295 169628 506866 28466 280628 -9013 399062 22167 395853 292851 525881 87805
17284 56451 285240 222375 150911 187350 125540 294812 -68800 100413 381584 192855 -207270
$$ packed form
17364d395j796j9484B3889K92678H475e4328E75697A61618i4263l4990C46498
17352F3738J18775N61251A1938J62438n9582l3767j7725B9405K28709o3152J288
17341A96250H8204k7326i7951D4551R3777E2756J22324b1039A34063a95719C38238
17329B48780J15300E679J35891N0964F9299K47883j39811R3692K5165E9643g2878
17317a20718B43446L65827B97855b9182B51258j7162a30034C94039a61164C93027
17306A47261J13640q6264J20642R1589A48615M28231B62553a57399A80642e032
17295A69628L37238B8466K52162i013C99062B2167L73686j03002K33030H7805
17284E6451K28789o2865p1464L6439o1810J69272f8800A00413K81171j88729b07270
$$ plain form
17272 110905 321984 516278 328748 280546 332277 507881 -100068 143435 386214 -260928
17261 155093 293761 335680 168834 278493 226940 207444 -126459 245164 -164567 267337
17250 85607 22467 -211902 180622 401887 54641 278670 315596 183364 -124475 158946
17239 -82526 432498 106011 249601 138379 12076 322486 157436 156839 506317 154440
17228 258980 275126 424164 165593 154522 32594 444310 268241 174676 132062 174088 275608
17217 275608 279099 -21497 -111198 568926 234342 324881 252620 169979 -45311 120026 -162409
17205 116050 211995 167953 193669 66339 128511 65448 9435 309835 120978 233927 159594
17194 159594 394520 43875 493524 544290 1868 -4366 248216 346415 155260 459272 97421
$$ packed form
17272A10905K11079J94294j87530m8202N1731J75604a00068A43435K42779b60928
17261A55093J38668M1919j66846J09659n1553j9496a26459B45164a64567B67337
17250H5607B2467b11902A80622K21265E4641K24029L6926j32232a24475A58946
17239h2526D32498A06011J43590j11222A2076L10410A57436n97L49478A54440
17228B58980J6146J49038A65593j1071C2594M11716j76069r3565m2614M2026J01520
17217B75608L491b1497q9701E68926B34342R0539p2261q2641d5311A20026a62409
17205A16050R5945m4042K5716F6339O2172o3063I435L00400A20978J12949p4333
17194A59594K34926D3875M49649N0766A868d366B48216R8199A55260L04012I7421
$$ plain form
17182 195195 -10593 291596 115477 448624 268234 473646 113924 57986 219282 209403
17172 209403 587172 309356 441749 354645 234134 84821 625840 164964 451645 379533
17162 379533 637032 227795 186794 396244 571296 486272 178737 11661 163101 295323
17152 295323 103409 448479 209556 485302 474050 543232 -38089 428292 383652 413973
17142 413973 283439 645014 588192 370097 292532 410987 216190 193346 551026 265763
17131 18482 246998 206025 964807 635194 244793 368194 554415 409253 438836 43244
17120 527793 394440 214429 499431 378700 344934 301564 -101401 492664 280731 600743
17110 600743 373082 252183 369354 -105789 363502 183705 571375 368323 423217 491122
$$ packed form
17182A95195a0593B91596A15477L33147j80390K05412A13924n5938J61296r879
17172B09403L77769k77816J32393q7104j20511H4821N41019A64964K86681p2112
17162C79533K57499B27795m1001K09450J75052q5024A78737A1661J51440J32222
17152B95323A03409L45070B09556K75746j1252O9182c8089D28292m4640L0321
17142D13973j30534L61575n6822k18095p7565J18455j94797k2844L57680B65763
17131A8482K28516m0973P58782l29613B44793J23401J86221j45162K9583D3244
17120E27793j33353j80011K85002j20731l3766m3370a01401D92664k11933L20012
17110F00743k27661j20899J17171a05789C63502j79797L87670k03052N4894O7905
$$ plain form
17100 491122 348920 650076 705762 404038 450484 411708 -7940 516625 383954 305073 236082
17089 236082 446200 413351 479343 267212 603121 449101 214721 349487 530006 636611
17079 636611 540636 312159 580311 251797 644543 335979 249738 741004 521008 615161
17069 615161 468096 492598 391659 855302 534022 402910 356162 775538 816727 508014
17059 508014 574686 387244 622330 370139 471744 608747 657556 469174 405151 756176
17049 756176 705065 612541 568279 595002 545428 776951 491559 492638 342456 513934 553393
17038 553393 397088 609569 574266 736047 724411 708953 700534 1040053 750465 575576
17028 575576 578114 856234 835373 915596 634226 684322 330008 344962 461095 694786 851488
$$ packed form
17100D91122j42202L01156N5686l01724M6446l8776g940E16625j32671p8881o8991
17089B36082K10118l2849O5992k12131L35909j54020B14721J34766J80519J06605
17079F36611r5975k28477K68152B51797L92746l08564q6241M91266k19996R4153
17069F15161j47065K4502j00939M63643l21280j31112m6748M19376M1189l08713
17059E08014O6672j87442K35086k52191J01605J37003M8809j88382o4023L51025
17049G56176n1111r2524m4262K6723m9574K31523k85392J079j50182J71478L9459
17038E53393j56305K12481l5303J61781j1636j5458q419L39519k89588j74889
17028E75576K538K78120k0861Q0223k81370N0096C30008J4954J16133K33691J56702
$$ plain form
17017 851488 624375 456724 985375 666012 865892 509176 746800 654276 452791 631378
17007 631378 1013031 461281 651997 777347 835297 924588 403588 972181 716897 638396
16997 638396 820903 562328 860653 559023 828028 698360 911852 1227853 652678 954810
16987 954810 877664 861774 821314 751398 1101044 577049 379954 881555 840682 890573 730183
16976 730183 894988 833830 982653 761537 1234072 887567 468395 1077572 656702 1077802
16966 1077802 973297 994854 1020764 994837 987141 890773 926602 1024595 1356253 737585 946938
16955 946938 1317214 964815 1182772 1357355 1263390 1108773 1047740 1467848 1262213 1081414
16945 1081414 1564404 1316944 1364900 732835 847502 1240689 1342784 1397453 1182765 1443329
$$ packed form
17017H51488k27113j67651N28651l19363J99880l56716K37624r2524k01485J78587
17007F31378L81653D61281J90716J25350N7950Q9291D03588N68593k55284p8501
16997F38396J82507k58575K98325l01630K69005j29668K13492L16001n75175L02132
16987I54810p7146j5890m0460o9916L49646n23995j97095N01601m0873M9891j60390
16976G30183J64805o1158J48823k21116M72535l46505m19172O09177m20870M21100
16966A077802j04505K1557K5910k5927p696r6368L5829R7993L31658o18668K09353
16955I46938L70276l52399K17957J74583r3965j54617o1033M20108k05635j80799
16945A081414M82990k47460M7956o32065J14667L93187J02095N4669k14688K60564
$$ plain form
16935 1443329 1018314 1237374 1591151 1180312 1495884 1612075 1539006 1615219 1166101 1401504
16925 1401504 1477396 1532115 1442583 1625857 1565083 1303876 1132273 1692787 1589467 1543187
16915 1543187 1392410 1643667 1463654 1616035 1494248 1627707 1517912 1823571 1592479
16906 1592479 1831007 1931329 1998203 1547309 1838220 1861585 1877842 1785139 1813399 1927093
16896 1927093 1950350 1834436 2108641 1864594 2121165 1936972 2088211 2052566 2279542 2115736
16886 2115736 2031091 2601085 2158094 2248608 2352713 2571841 2001788 2134599 2850102 2304816
16876 2304816 2413458 2484559 2506321 2636470 2815302 2618133 2677592 2843116 2986368 2880604
16866 2880604 2764050 2654277 2684699 3024289 2943038 3122188 3065784 3160416 3215075 3164726
$$ packed form
16935A443329m25015K19060L53777m10839L15572J16191p3069P6213m49118K35403
16925A401504P5892N4719q9532J83274o0774k61207j71603N60514j03320m6280
16915A543187j50777K51257j80013J52381j21787J33459j09795L05659k31092
16906A592479K38528J00322O6874m50894K90911K3365J6257r2703K8260J13694
16896A927093K3257j15914K74205k44047K56571j84193J51239l5645K26976j63806
16886B115736q4645N69994m42991R0514J04105K19128n70053J32811P15503n45286
16876B304816J08642P1101K1762J30149J78832j97169N9459J65524J43252j05764
16866B880604j16554j09773L0422L39590q1251J79150n6404R4632N4659n0349
$$ plain form
16856 3164726 3620055 2718890 3435360 3134987 3447129 3560293 3656693 3655116 3776048 3696342
16846 3696342 3703463 3801465 3928577 4191311 3861388 4069456 4138463 3906424 4113204 3989406
16836 3989406 4288454 4397391 4684090 4674286 4739112 4611184 5189083 4660717 5046351 5433746
16826 5433746 5041250 5151099 5647358 5780145 5513133 5453490 5830947 5845828 6134978 6363822
16816 6363822 6428576 6295836 6539515 6712323 6522192 6798602 7262996 7064346 7558052 7425764
16806 7425764 7907370 8006485 7948542 8065875 8045804 8753837 9073888 8833372 9434402 9536863
16796 9536863 9852180 10075425 9966921 10704221 10598527 11081867 11223067 11461104 11912136
16787 11912136 12013418 12514092 12751897 13331396 13693482 14354968 14805572 14917541 15466027
$$ packed form
16856C164726M55329r01165P16470l00373L12142J13164R6400j577J20932p9706
16846C696342P121R8002J27112K62734l29923K08068O9007k32039K06780j23798
16836C989406K99048J08937K86699r804O4826j27928N77899n28366L85634L87395
16826E433746l92496J09849M96259J32787k67012n9643L77457J4881K89150K28844
16816F363822O4754j32740K43679J72808j90131K76410M64394j98650M93706j32288
16806G425764M81606R9115n7943J17333k0071P08033L20051k40516O01030J02461
16796I536863L15317K23245j08504P37300j05694M83340J41200K38037M51032
16787A1912136J01282N00674K37805N79499L62086O61486M50604J11969N48486
$$ plain form
16778 15466027 16011847 16711945 17011030 17714653 18194522 18902666 19352297 20301089 20932635
16769 20932635 21773545 22232136 23516877 24051492 24977421 25764502 26780534 28091650 29092819
16760 29092819 30669361 31902043 32989944 34524828 35996782 37574554 39073030 40876197
16752 40876197 43390163 45313405 47311446 50042427 52133794 55275063 58134263 60942696
16744 60942696 64594779 67791173 71510212 75711360 79994197 84769360 89669811 94817602
16736 94817602 100517074 106262140 112199604 118672357 125391097 132042239 139089133 146608250
16728 146608250 153714397 160904835 167879942 174442815 180329889 185641947 190292156 193503767
16720 193503767 195973990 197145322 196780827 195483752 192688676 189320859 184230323 179077747
$$ packed form
16778A5466027N45820P00098K99085P03623M79869P08144M49631R48792O31546
16769B0932635Q40910M58591J284741N34615R25929P87081J016032J311116J001169
16760B9092819J576542J232682J087901J534884J471954J577772J498476J803167
16752D0876197K513966J923242J998041K730981K091367L141269K859200K808433
16744F0942696L652083L196394L719039M201148M282837M775163M900451N147791
16736I4817602N699472N745066N937464O472753O718740O651142P046894P519117
16728A46608250P106147P190438O975107O562873N887074N312058M650209L211611
16720A93503767K470223J171332l64495j297075k795076l367817n090536n152576
$$ plain form
16712 179077747 172815599 165678606 158511941 151196894 143973682 136504792 129448770 122251825
16704 122251825 115290335 108749481 102660670 96611018 91138506 86129568 81391653 76490042
16696 76490042 72180340 68328253 64788275 61046006 57724823 54840103 52251677 49442266
16688 49442266 46969599 44350058 42172942 40557287 38461323 37057648 34912835 33678890
16680 33678890 32367444 30877786 29236520 28516218 26974390 25850908 24938972 24174018
16672 24174018 23172670 22366831 21443649 20903466 19735756 19283157 18532398 17961614 17527010
16663 17527010 16987277 16287737 15420525 15209254 14884135 14495086 13897298 13447030 13269368
16654 13269368 12779317 12414426 11915553 11324861 11098269 10973698 10602029 10379314 10183586
$$ packed form
16712A79077747o262148p136993p166665p315047p223212p468890p056022p196945
16704A22251825o961490o540854o088811o049652n472512n008938m737915m901611
16696G6490042m309702l852087l539978l742269l321183k884720k588426k809411
16688D9442266k472667k619541k177116j615655k095964j403675k144813j233945
16680C3678890j311446j489658j641266p20302j541828j123482r11936p64954
16672B4174018j001348q05839r23182n40183j167710m52599p50759n70784m34604
16663A7527010n39733o99540q67212k11271l25119l89049n97788m50268j77662
16654A3269368m90051l64891m98873n90692k26592j24571l71669k22715j95728
$$ plain form
16645 10183586 9971198 9745901 9273065 9491488 8640968 8473081 8408950 8684393 8344516
16636 8344516 7676136 7676130 7360249 7285432 6774518 7177858 6840978 6774075 6225260 6293502 6187075
16625 6187075 5911841 5639290 5789719 5497458 5545983 5304339 5229083 5040064 4924028 5093134
16615 5093134 5267008 4825016 4634241 4662670 4610476 4546383 4324053 4479677 4472645 4428569
16605 4428569 4050397 4211127 3816911 3919560 3920217 3700547 3780023 3708021 3807201 3843095 3354731
16594 3354731 3397592 3364193 3160362 3318330 3318614 3225560 3086315 3419303 2928154 2972536 2590232
16583 2590232 2836932 2716980 2971822 2716129 2349791 2662546 2857604 2645328 2862307
16574 2862307 2617383 2272449 2543012 2446761 2441232 2079863 1863493 1932307 2503401 2239352
$$ packed form
16645A0183586k12388k25297m72836K18423q50520j67887o4131K75443l39877
16636H344516o68380ol15881p4817n10914M03340l36880o6903n48815O8242j06427
16625F187075k75234k72551J50429k92261M8525k41644p5256j89019j16036J69106
16615E093134J73874m41992j90775K8429n2194o4093k22330J55624p032m4076
16605D428569l78172J60730l94216J02649O57k19670P9476p2002R9180L5894m88364
16594C354731M2861l3399k03831J57968K84r3054j39245L32988m91149M4382l82304
16583B590232K46700j19952K54842k55693l66338L12755J95058k12276K16979
16574B862307k44924l44934K70563r6251n529l61369k16370O8814N71094k64049
$$ plain form
16564 2239352 2137845 2548098 2240930 1945664 2029761 2454485 2052913 1917885 2187028 1886893
16554 1886893 1233312 1757095 1727217 1764564 1841628 1826078 2079971 1841795 1861488 1734326
16544 1734326 1393821 2043547 1623636 1868075 1483715 1700889 1429898 1726238 1314716
16535 1314716 1897174 1505940 1283319 1365720 1512931 1373768 1442234 1279844 1282112 1272279
16525 1272279 1698969 1031565 1310161 851076 987620 1269732 1307078 1247703 1142138 1068094
16515 1068094 1093151 988459 1232441 1039020 1170171 1110338 1411835 811145 794540 1143145
16505 1143145 1222658 1184846 965524 1136144 1140224 1030547 1032286 1198551 973225 862538
16495 862538 1021485 925308 978110 1409612 1048523 853756 1137434 798143 702048 769179
$$ packed form
16564B239352j01507M10253l07168k95266Q4097M24724m01572j35028K69143l00135
16554A886893o53581N23783k9878L7347P7064j5550K53893k38176J9693j27162
16544A734326l40505O49726m19911K44439l84360K17174k70991K96340m11522
16535A314716N82458l91234k22621Q2401J47211j39163O8466j62390K268r833
16525A272279M26690o67404K78596m59085J36544K82112L7346n9375j05565p4044
16515A068094K5057j04692K43982j93421J31151n9833L01497o00690j6605L48605
16505A143145P9513l7812k19322J70620M080j09677J739J66265k25326j10687
16495H62538J58947r6177N2802M31502l61089j94767K83678l39291r6095O7131
$$ plain form
16485 769179 672918 940728 815492 1043978 707979 971293 808165 899312 837424 962519
16475 962519 897423 589432 720906 687007 1015405 666478 1051748 696286 569782 845081
16465 845081 454165 739256 920986 659005 746015 709208 321085 595675 930992 528666
16455 528666 956131 710458 614135 762552 1089610 601402 433662 754104 903195 510666
16445 510666 578232 590166 740125 548231 572550 815523 597467 771040 605646 612503
16435 612503 566811 508104 513239 624461 390025 754442 488760 357314 395997 495439 622868
16424 622868 639060 628422 563462 451415 709315 559474 754279 661127 615773 602877 587821
16413 587821 328152 -3759 480708 365051 301242 381754 243416 522728 314070 314916 634969
$$ packed form
16485G69179r6261K67810j25236K28486l35999K63314j63128R1147o1888J25095
16475I62519o5096l07991J31474l3899L28398l48927L85270l55462j26504K75299
16465H45081l90916K85091J81730k61981Q7010l6807C21085K74590L35317m02326
16455E28666M27465k45673r6323J48417L27058m88208j67740L20442J49091l92529
16445E10666O7566J1934J49959j91894K4319K42973k18056J73573j65394O857
16435F12503m5692n8707N135J11222k34436L64417k65682j31446L8683R9442J27429
16424F22868J6192j0638o4960j12047K57900j49841J94805r3152m5354j2896j5056
16413E87821k59669c759D80708j15657o3809Q0512j38338K79312k08658Q46L20053
$$ plain form
16402 634969 491704 624865 180596 230438 239050 369433 626699 150094 277151 291808
16392 291808 415857 327857 369435 476967 117544 375775 437245 406315 289947 374635
16382 374635 243730 482311 328853 438844 115706 562440 295590 302107 80065 116213
16372 116213 330443 330446 257875 448375 470074 429360 285007 -65002 482468 433370 392216
16361 392216 175910 452878 419464 506495 382053 378058 219368 380430 394189 154340
16350 264006 73900 206857 329318 309426 355865 164154 102277 -66351 276597 569572
16340 569572 406326 163454 124810 197248 255717 60447 368896 157810 545574 275239
16330 275239 615519 501046 162196 304612 25985 414037 361743 339071 313874 428466
$$ packed form
16402F34969j43265J33161A80596M9842Q612J30383K57266A50094J27057J4657
16392B91808J24049q8000M1578J07532A17544K58231O1470l0930j16368Q4688
16382C74635j30905K38581j53458J09991A15706M46734k66850O517H0065L6148
16372A16213K14230Lp2571J90500K1699m0714j44353f5002D82468m9098m1154
16361C92216A75910K76968l3414Q7031j24442l995j58690J61062J3759A54340
16350B64006G3900J32957J22461j9892M6439A64154o1877f6351B76597K92975
16340E69572j63246A63454l8644P2438N8469F0447L08449A57810L87764k70335
16330B75239L40280j14473A62196J42416B5985L88052n2294k2672k5197J14592
$$ plain form
16320 428466 145441 581600 406256 229426 121033 294977 140324 276904 4797 268560
16310 268560 358958 101065 -31971 66367 252277 -81561 264074 439420 -103547 43541
16299 120882 324738 98422 213759 209760 664571 241644 128753 326884 351588 12365
16288 210156 163652 335356 296623 166313 79644 449573 458176 208001 102637 331565
16278 331565 217664 46930 -245748 600581 34017 -35445 471278 59169 141079 235836 470769
16267 470769 362212 166375 166684 318116 250065 -41504 127647 200055 -97588 335584 -257691
16255 20038 162561 150704 -116324 359891 55102 125715 2673 -19571 231158 157011 268569
16244 268569 15405 -207637 -52351 137751 139787 214202 234156 198476 -145258 248943 365934
$$ packed form
16320D28466A45441M36159j75344j76830j08393J73944A40324J36580D797K63763
16310B68560R0398A01065c1971F6367J85910h1561B64074J75346a03547D3541
16299A20882K03856I8422J15337l999M54811B41644j12891J98131K4704A2365
16288B10156m6504J71704l8733j30310G9644L69929Q603B08001A02637K28928
16278C31565j13901D6930b45748F00581C4017c5445D71278E9169Q1910R4757K34933
16267D70769j08557A66375L09J51432o8051d1504A27647P2408i7588C35584b57691
16255B0038J42523j1857a16324C59891E5102P0613B673a9571B31158p4147J11558
16244B68569A5405b07637e2351A37751K036P4415J9954l5680a45258B48943J16991
$$ plain form
16233 365934 295807 -14257 -52361 -188655 387785 280151 -94981 304285 231922 53148 -245056
16221 153298 64204 159809 388406 -182131 177304 243482 143754 290360 134929 52069
16210 30808 301473 -154764 -272264 247416 93207 -96434 128984 262710 -177806 -13985
16199 -121706 163931 313463 206156 -100504 132629 -71606 -22138 -137924 -19490 -175682
16189 -175682 295201 65094 -67597 88173 148640 288418 -12843 43573 174508 226294 -42519
16177 151442 247536 34647 222905 270783 -212415 72749 -4790 -65990 -7853 116244 -220349
16165 158389 250471 128746 348159 24215 86664 294755 -138271 15375 24113 177347 12576
16153 359018 -426389 -306690 169188 199477 -64902 -165875 159605 141996 38288 33756 -14958
$$ packed form
16233C65934p0127a4257l8104j36294C87785j07634i4981C04285p2363E3148b45056
16221A53298F4204R5605K28597a82131A77304O6178r9728J46606A34929E2069
16210C0808K70665a54764j17500B47416I3207i6434A28984J33726a77806a3985
16199a21706A63931J49532j07307a00504A32629g1606b2138j15786a9490j56192
16189a75682B95201F5094f7597H8173O0467J39778a2843D3573J30935N1786d2519
16177A51442R6094C4647J88258M7878b12415G2749d790o1200g853A16244b20349
16165A58389R2082j21725K19413B4215O2449K08091a38271A5375Q738J53234A2576
16153C59018d26389J19699A69188L0289f4902j00973A59605j7609C8288m532a4958
$$ plain form
16141 61576 107401 180541 55448 129949 286272 -131272 47615 -74051 242065 27766 -66839
16129 -72634 -64481 142369 -90127 353687 258227 264749 116180 184766 -71730 -77089 121218
16117 2401 271134 66211 272652 -170089 17961 -133938 -76382 75249 -182283 264339 -6447
16105 -199232 -150275 -183737 199115 278739 28833 23323 -31169 48397 187426 20082 110055
16094 110055 -273293 -253508 -180807 -146265 -79057 -247536 105618 -73379 170283 102511 -52088
16082 139362 72299 -156943 4358 -66378 214746 128658 -14235 71705 -298748 -103675 -295741
16071 -295741 47125 -99034 410628 -20592 64839 140673 -154868 202566 -40649 -117512 256525
16059 -260549 -252586 23804 -115412 185665 -111050 319394 -193815 47615 31100 -59203 175531
$$ packed form
16141F1576M5825P3140E5448P4501J56323a31272D7615g4051B42065B7766f6839
16129g2634Q153A42369i0127C53687r5460O522A16180O8586g1730n359A21218
16117B401K68733F6211K06441a70089A7961a33938N7556G5249a82283B64339f447
16105a99232M8957l3462A99115P9624B8833n510c1169D8397J39029B0082Q9973
16094A10055b73293J9785P2701L4542O7208j68479A05618g3379A70283o7772e2088
16082A39362o7063a56943D358f6378B14746q6088a4235G1705b98748a03675j92066
16071b95741D7125i9034D10628b0592F4839P5834a54868B02566d0649p6863B56525
16059b60549P963B3804a15412A85665a11050C19394a93815D7615j6515e9203A75531
$$ plain form
16047 -64187 -143740 19680 -381344 -110260 -83591 -157528 296957 -102481 28997 238466 -55992
16035 -265941 -187870 273740 -38458 53174 55658 337740 195255 -257012 13136 199852 -203113
16023 -196368 -157741 -180791 -144429 -224312 -23992 -40998 296048 87325 -13793 147054 45019
16011 -23505 -34200 -109975 236490 -163706 212248 48236 -360942 14832 114983 -388184
16000 114535 -54862 -19722 -120744 -221529 53798 -230099 -17430 -193242 -47499 93876 -1986
15988 -9818 161596 -350327 19660 74919 76048 352736 262719 194361 188631 348946 -145703
15976 226670 71010 157116 -33122 155608 -156113 -73762 78976 -212905 128365 -337869
15965 49814 -186637 410078 411260 -83893 -9366 67276 -216778 38853 479472 -102292 281382
$$ packed form
16047f4187p9553A9680c81344a10260K6669p3937B96957a02481B8997K09469e5992
16035b65941P8071B73740c8458E3174K484K82082j42485b57012A3136J86716b03113
16023a96368L8627k3050L6362p9883b3992j7006B96048H7325a3793A47054D5019
16011b3505j0695p5775B36490a63706B12248D8236c60942A4832J00151c88184
16000A14535e4862a9722j01022j00785E3798b30099a7430j75812d7499I3876a986
15988i818A61596c50327A9660N5259J129K76688r0017o8358n730J60315a45703
15976B26670G1010Q6106c3122A55608a56113g3762G8976b12905A28365c37869
15965D9814a86637D10078J182h3893i366F7276b16778C8853M40619a02292B81382
$$ plain form
15953 -223223 -234898 79918 7923 -231078 106294 52058 -103166 -38826 -34538 74464 -89795
15941 65478 102697 -71360 -320973 -536359 -292138 182089 -3602 146152 84880 119517 -95444
15929 -44161 -233887 -7265 -7654 -441106 115512 -234583 -334763 -96012 -102081 104068 -295165
15917 -190478 5676 -28791 -113244 -326591 132022 -13502 4469 24795 -80142 186549 90821
15905 153092 -304736 133555 -116095 56766 -12547 -57557 94749 35913 154438 -156890
15894 235719 95137 -72797 82732 -516605 156432 -121002 -63364 -167252 -75238 -56241 118945
15882 73417 125438 -153529 -33071 -123099 41211 -103571 -194987 -273338 -137851 -64885 -169990
15871 -169990 -20304 -285770 -68755 -171826 103385 -288439 112599 7896 129680 44966
$$ packed form
15953b23223j1675G9918G923b31078A06294E2058a03166c8826M288G4464h9795
15941F5478L7219g1360k49613k15386K44221A82089c602A46152o1272L4637i5444
15929d4161j89726g265l89m33452A15512b34583j00180i6012o069A04068b95165
15917a90478E676b8791q4453k13347A32022a3502D469K0326h0142A86549I0821
15905A53092c04736A33555a16095E6766a2547m5010I4749C5913J18525a56890
15894B35719I5137g2797H2732e16605A56432a21002N7638j03888g5238J8997A18945
15882G3417N2021a53529c3071r0028D1211a03571r1416p8351J35487f4885j05105
15871a69990b0304k65466f8755j03071A03385b88439A12599G896J21784D4966
$$ plain form
15860 79078 -37323 -5373 -113610 213742 86232 -42142 -152779 -148153 -396482 273918 71058
15848 -172163 100973 43387 -59023 -77907 75262 -371147 -51654 225720 -27577 -19947 -162495
15837 -162495 -16643 -273165 222070 -50487 92092 172284 -251034 30005 -19005 -187692 -106631
15826 -106631 143465 89822 -60441 -155993 193552 113075 15562 139209 -61420 50456 -228179
15814 7986 -155403 -312814 210472 -246723 -295649 -53205 299964 37613 -45267 211631 -33337
15802 -37952 38586 -641756 -417197 592 282350 -322415 256991 42407 -118861 67038 351727
15791 351727 34236 623 137922 -81502 223863 18523 -233804 -35084 -150010 -3126 -155982
15780 -155982 -198409 -58271 112187 -189870 -117308 -175014 -42981 -377172 403024 -213513
$$ packed form
15860G9078c7323e373j08237B13742H6232d2142j10637M626k48329B73918G1058
15848a72163A00973D3387e9023j8884G5262c71147e1654B25720b7577P630j42548
15837a62495a6643k56522B22070e0487I2092Q0192b51034C0005a9005j68687Q1061
15826a06631A43465n3643f0441r5552A93552q0477A5562J23647f1420E0456b28179
15814G986a55403j57411B10472b46723m8926e3205B99964C7613d5267B11631c3337
15802c7952C8586f41756K24559E92K81758c22415B56991D2407a18861F7038K84689
15791C51727C4236F23J37299h1502B23863A8523b33804c5084j14926c126j52856
15780a55982m2427e8271A12187a89870P2562n7706d2981l34191D03024b13513
$$ plain form
15769 12132 11682 -333341 -322648 -204251 -104085 -146196 253764 139591 -152617 -179891 -140922
15758 -140922 18483 737 -110729 -169164 154511 -272949 16905 -35434 -131284 -122927 274035
15746 49837 -51293 -197855 -90500 284425 -195217 183981 31698 180294 165635 -122129
15735 -34631 2846 94427 -214111 -394650 -192731 -81649 -109738 413559 -216903 29060 34879
15724 34879 -182222 46651 -8394 93088 -301024 -30548 -171358 43345 -249754 -14788 36626
15712 -111265 -362315 7008 168219 -593 71848 -65467 -119394 -130056 -169877 -108426 132031
15700 268460 -199683 -44208 -44641 -31547 -20298 2050 -6080 -220392 238436 -158339 -203637
15689 -203637 -124870 15257 -138087 69783 310981 -378889 -341931 -166485 9052 253791 125877
$$ packed form
15769A2132m50c33341J0693J18397J00166m2111B53764j14173a52617k7274L8969
15758a40922A8483G37a10729n8435A54511b72949A6905c5434r5850Q357B74035
15746D9837e1293j46562i0500B84425a95217A83981C1698J48596j4659a22129
15735c4631B846R1581b14111j80539a92731h1649k8089D13559b16903B9060N819
15724C4879a82222D6651h394I3088c01024c0548j40810D3345b49754a4788C6626
15712a11265k51050G008J61211e93G1848f5467n3927j0662l9821O1451A32031
15700B68460a99683d4208m33J3094J1249B050f080k14312B38436a58339m5298
15689b03637P8767A5257a38087F9783K41198c78889L6958a66485I052K44739A25877
$$ plain form
15677 54412 49790 86819 -367272 171230 57842 -41482 105229 313523 216962 -173317 106702
15665 -240019 -237603 122862 31355 -12367 21833 -233760 -54421 -88184 -228012 -327042 36671
15653 52704 165901 -355838 159438 -82366 -208094 43358 -122011 -124387 -114904 -89106 -108123
15642 -108123 27486 -29208 -294114 53151 -54194 5811 -99949 92486 -194908 -90161 -23227
15630 -65189 -129634 27173 1770 -414577 242520 -315426 -109099 52616 -106312 -270279 -92169
15618 -382802 52391 6292 -40802 66796 214753 -343465 84978 95682 -86371 54883 -102331
15606 -45796 -91389 98063 -152413 -150165 52401 -165492 -82906 83707 -44287 -230863 -157768
15595 -157768 -85095 -199437 81861 -90854 110545 224866 250737 -11495 -182057 -112324 313254
$$ packed form
15677E4412m622L7029c67272A71230E7842d1482A05229K08294r6561a73317A06702
15665b40019K416A22862C1355a2367B1833b33760e4421l3763j39828r9030C6671
15653E2704J13197c55838A59438h2366j25728D3358a22011k376R483K5798j9017
15642a08123B7486b9208k64906E3151e4194E811i9949I2486a94908i0161b3227
15630f5189o4445B7173A770d14577B42520c15426a09099E2616a06312j63967i2169
15618c82802E2391F292d0802F6796J47957c43465H4978J0704h6371E4883a02331
15606d5796m5593I8063a52413K248E2401a65492Q2586H3707d4287j86576P3095
15595a57768P2673j14342H1861i0854A10545J14321K5871a1495j70562O9733C13254
$$ plain form
15583 40551 -24029 98366 -37291 -51304 -15109 -43728 -184760 53101 -48889 -254498 -131774
15572 -131774 -309294 -88388 -392776 245720 -20110 -3178 -248571 119282 -52531 237190
15561 47025 -480571 4376 84218 -80249 130674 21599 -280744 105653 -247560 -55649 -280434
15550 -280434 -291147 -167183 -441474 131191 -207485 48597 111731 -45591 -72901 -256747
15540 -256747 196559 157832 189499 -24441 280457 -81548 -24035 -126912 -128091 -130846 -26154
15528 9909 -166283 192784 -292818 -578777 -81282 36771 90503 -125182 55705 240764 -101828
15516 41676 -29220 163572 -213253 -210066 252466 -407022 145387 10356 -60983 -5683 -28728
15505 -28728 -51396 305216 -179568 -225483 9220 221203 -115825 279858 161111 -105121
$$ packed form
15583D0551b4029I8366c7291j4013a5109k8619j41032E3101d8889k05609J22724
15572a31774j77520h8388l04388B45720b0110c178k45393A19282e2531B37190
15561D7025d80571D376P9842h0249A30674B1599b80744A05653b47560e5649k24785
15550b80434j0713J23964k74291A31191b07485D8597O3134d5591k7310j83846
15540b56747A96559l8727L1667b4441B80457h1548b4035j02877j179k755b6154
15528I909a66283A92784b92818k85959h1282C6771N3732a25182E5705J85059a01828
15516D1676b9220A63572b13253L187B52466d07022A45387A0356f0983e683k3045
15505b8728k2668C05216a79568m5915I220K11983a15825B79858j18747a05121
$$ plain form
15494 -86768 -26902 172602 -74593 -237132 -57141 -271977 144515 240389 -13484 72043 26904
15482 -177584 130966 -193215 -194754 69419 67523 -138816 177424 -247182 -120982 416731
15471 67181 152238 -83579 234618 69573 205211 178804 85165 261472 332577 200433 -235352
15459 -60633 87973 216681 150806 383180 -279228 -217832 -34052 267449 -46282 -227172 -27424
15447 -35668 -228209 78671 -31198 54524 277618 -24068 68725 99939 -37833 76878 34101
15435 -122958 -168043 41075 52349 60822 79957 92292 -146535 65274 139110 125916 -116981
15423 -65406 195475 1662 48447 -277694 56908 -189168 177828 -202545 131844 -74040 229003
15411 -135160 -199288 152490 -119966 -86715 -338778 9093 46885 15028 -430302 -73000 -134831
$$ packed form
15494h6768b6902A72602g4593j62539e7141k14836A44515R5874a3484G2043B6904
15482a77584A30966a93215j539F9419j896a38816A77424b47182a20982D16731
15471F7181Q5057h3579B34618F9573J35638k6407H5165J76307P1105j32144b35352
15459f0633H7973J28708o5875K32374b79228O1396c4052B67449d6282j80890b7424
15447c5668j92541G8671c1198E4524K23094b4068F8725L1214c7833G6878C4101
15435a22958m5085D1075J1274Q473J9135J2335a46535F5274P3836j3194a16981
15423f5406A95475A662M6785b77694E6908a89168A77828b02545A31844g4040B29003
15411a35160o4128A52490a19966L3251k52063I093L7792A5028d30302g3000o1831
$$ plain form
15400 -134831 -344709 -19107 -21043 79966 17056 -74609 146676 -99085 106395 -12729 278041
15388 -105884 -258699 220131 54826 209669 158886 226185 164744 -132466 72255 5190 148464
15377 148464 196384 331506 -118226 149553 -461725 158188 254357 82999 -367536 71152
15366 57210 86664 -165749 -262939 191283 35163 -32706 -8303 -2919 -296023 -218371 4517 -23710
15353 -120558 338078 37359 129563 -39549 -96332 -198822 -45175 92472 201869 -12974 266085
15341 -189274 -43274 -12656 136540 -33200 -35829 139988 77000 -47886 -202400 137087 -350828
15329 363678 -141534 -96270 -165715 -54042 60842 -200802 151502 117997 335697 416326 8476
15317 -15844 -106567 -53926 9398 -42540 166933 202377 28057 -25696 -135430 -148120 -47374
$$ packed form
15400a34831k09878a9107j936G9966A7056g4609A46676i9085A06395a2729B78041
15388a05884j52815B20131E4826J54843n0783O7299o1441a32466G2255E190J43274
15377A48464M7920J35122a18226A49553d61725A58188R6169H2999c67536G1152
15366E7210K9454a65749r7190A91283C5163c2706h303b919k93104P7652D517b3710
15353a20558C38078C7359R2204c9549n6783j02490d5175I2472J09397a2974B66085
15341a89274d3274a2656A36540c3200k629A39988o2988d7886j54514A37087c50828
15329C63678a41534M5264o9445e4042F0842b00802A51502l3505K17700Q0629H476
15317a5844r0723N2641I398d2540A66933L5444B8057b5696j09734j2690d7374
$$ plain form
15305 46161 7486 55545 125197 -10772 18473 -63254 -86661 128838 146855 216554 -48698 220604
15292 -121392 -118087 210847 273185 183822 -277841 34022 90565 -111572 263314 199014 142766
15281 142766 261715 -142879 -191688 174757 -97934 221820 114922 287921 279444 111973
15270 379637 370882 15065 -206800 66979 352516 81994 -414358 91607 134221 26436 11197
15258 193357 46832 82609 100435 -54119 -26345 238742 111494 -105859 -19476 587091 740883
15247 740883 2278712 1855991 1445514 1987537 673781 82818 -25982 64794 76065 287240
15237 287240 358529 -3082 104311 345994 100988 -314557 135923 -88621 22969 -147069
15226 79 281185 124177 274000 297813 -303043 53258 -16217 277872 85783 272215 -110638
$$ packed form
15305D6161G486M8059O9652a0772A8473f3254k3407A28838J8017O9699d8698B20604
15292a21392L305B10847O2338q9363b77841C4022N6543a11572B63314o4300n6248
15281A42766J18949a42879m8809A74757i7934B21820j06898J72999q477A11973
15270C79637q755A5065b06800F6979K85537H1994d14358I1607M2614B6436A1197
15258A93357D6832L5777J7826e4119b6345B38742A11494a05859a9476E87091J53792
15247G40883J537829m22721m10477N42023F73781H2818b5982F4794J1271K11175
15237B87240P1289c082A04311K41683A00988c14557A35923h8621B2969a47069
15226G9K81106A24177J49823K3813c03043E3258a6217B77872H5783J86432a10638
$$ plain form
15214 32513 177389 74983 256886 -76019 58547 -29996 330941 26531 78361 75066 4995
15202 -504228 -141682 253407 61166 226496 334215 250713 118225 294071 64794 516681
15192 516681 -23901 139127 -137579 -77689 -21080 -32096 79203 -54486 224530 12245 -237932
15180 -335739 74076 217430 -31202 -127096 162560 -20690 -87875 19310 69802 120316 199162
15169 199162 -17256 -6419 341034 104210 -36452 -62669 165734 -111432 99316 341778 362827
15158 362827 132904 -80442 53179 -312557 -148881 81502 242471 122144 -56919 142170
15147 -111556 19468 97693 -42377 54092 -53970 45748 128211 315025 45743 65389 247238
15136 247238 147108 179128 -186494 -37104 -8318 -159659 374129 509844 116373 237156
$$ packed form
15214C2513J44876G4983J81903g6019E8547b9996C30941B6531N1830l295D995
15202e04228a41682B53407F1166J65330J07719q3502A18225J75846F4794M51887
15192E16681b3901A39127a37579N9890b1080j1016G9203e4486B24530A2245b37932
15180c35739G4076J43354c1202r5894A62560b0690o7185A9310N0492N0514P8846
15169A99162a7256f419C41034A04210c6452k6217A65734a11432I9316K42462K1049
15158C62827A32904h0442E3179c12557a48881H1502J60969j20327e6919A42170
15147a11556A9468P8225d2377E4092e3970D5748Q2463J86814D5743J9646J81849
15136B47238j00130L2020a86494c7104h318j51341C74129J35715A16373J20783
$$ plain form
15126 237156 156076 296530 336441 195793 217609 254919 -2309 462760 94289 362828 -63649
15114 54056 -89535 -213596 127450 38849 46812 105829 -187567 343597 296489 157708 47989
15102 -62750 9582 -141045 -139087 284295 91315 3739 419721 33249 203871 252271 495593
15091 495593 30880 274124 135101 45939 82026 184354 189770 313934 -67224 214294 148536
15080 148536 121205 128315 301516 114835 66684 180596 10561 454152 270295 266754 310237
15069 310237 78591 162530 146223 -306333 -79572 152238 278569 199867 -138871 163566
15058 -156283 144291 252434 101458 264042 94386 140112 274141 268018 147892 401195
15048 401195 -41667 -160961 301758 316823 150524 347602 447385 446659 453028 247812 258853
$$ packed form
15126B37156q1080J40454L9911j40648K1816L7310b309D62760I4289K68539f3649
15114E4056h9535j24061A27450C8849P963N9017a87567C43597m7108j38781D7989
15102f2750I582a41045J958B84295I1315C739M15982C3249J70622M8400K43322
15091D95593C0880K43244A35101D5939L6087J02328N416J24164f7224B14294o5758
15080A48536k7331P110J73201A14835m8151J13912A0561M43591j83857l541M3483
15069C10237G8591Q3939j6307c06333g9572A52238J26331p8702a38871A63566
15058a56283A44291J08143A01458J62584I4386M5726J34029o123j20126K53303
15048D01195d1667j19294C01758J5065A50524J97078R9783p26O369k05216J1041
$$ plain form
15037 258853 331590 -59062 137458 241808 215050 374768 437169 88392 -15838 248754 322094
15026 322094 161709 215543 137913 109080 3643 346355 212869 331537 130313 341125
15016 341125 260355 302202 332603 622126 -19419 -335635 244735 -75240 147727 138722 200369
15005 200369 295343 -42719 400549 185922 178175 301356 36049 7858 101461 378067 162509
14993 541334 69974 209918 273020 244976 114700 285651 -46899 19556 168562 422273
14983 422273 137198 191818 296091 177378 186400 228425 79470 281190 -135322 515810
14972 225033 520478 150643 347352 265398 455270 77300 103884 314719 198889 176633
14962 176633 276751 146606 187841 178478 166027 351527 315608 303584 542385 149369 163200
$$ packed form
15037B58853P2737e9062A37458J04350k6758J59718O2401H8392a5838B48754P3340
15026C22094j60385N3834p7630k8833C643L42712j33486J18668A30313K10812
15016C41125q0770M1847L0401K89523a9419l16216B44735g5240A47727r005O1647
15005B00369R4974d2719D00549A85922p747J23181C6049G858R3603K76606A62509
14993E41334F9974J39944O3102k8044A14700J70951d6899A9556J49006K53711
14983D22273A37198N4620J04273j18713R022M2025G9470K01720a35322E15810
14972B25033K95445A50643J96709q1954J89872G7300K6584K10835j15830k2256
14962A76633J00118j30145M1235r363j2451J85500l5919j2024K38801A49369J3831
$$ plain form
14951 163200 149710 358833 393114 444377 170309 429646 194792 204035 83491 281971 400034
14940 400034 156751 -194184 74565 276692 103728 399703 468354 -42466 291984 360988
14930 360988 -34445 282961 171223 361914 494256 450275 284462 90776 133930 361095
14920 361095 344549 232359 381422 681741 215260 154355 437549 80364 193423 535134
14910 535134 225481 339902 460356 299504 12015 587821 466990 389658 25493 308967
14900 308967 596465 601223 296760 293861 290991 333412 455704 183831 439871 248669 68033
14888 664655 261968 142459 152833 440210 246198 284689 376693 451582 271991 592299
14878 592299 243288 218213 291848 175318 442511 655574 611054 592988 389206 67947
$$ packed form
14951A63200j3490K09123L4281N1263A70309K59337A94792R243H3491J98480J18063
14940D00034A56751a94184G4565K02127A03728K95975O8651d2466B91984O9004
14930C60988c4445B82961j11738J90691J32342m3981j65813I0776M3154K27165
14920C61095j6546j12190J49063L00319B15260o0905K83194H0364J13059L41711
14910E35134B25481J14421J20454j60852A2015N75806j20831p7332B5493K83474
14900C08967K87498M758B96760k899k870M2421J22292A83831K56040j91202F8033
14888F64655B61968j19509J0374K87377j94012L8491R2004P4889j79591L20308
14878E92299B43288k5075P3635j16530K67193K13063m4520j8066k03782F7947
$$ plain form
14867 138093 269808 285805 34287 264767 784632 438033 -38106 281303 430342 574282
14857 574282 427907 425963 540759 332662 621455 789287 298428 235472 504360 451016
14847 451016 336879 232837 492927 363564 696493 482613 712756 562275 88430 547669
14837 547669 601190 244917 395903 392915 624790 417519 260693 533079 647020 628957
14827 628957 331889 409837 335062 656626 619829 553122 848142 161478 464536 833845
14817 833845 573546 533955 282247 408495 500018 237357 687122 482224 414847 490837
14807 490837 392304 385252 330365 683249 656332 685730 890885 390993 633819 703665 692681
14796 692681 719289 576283 988272 660657 425689 734590 845965 524099 428568 284993
$$ packed form
14867A38093J31715J5997C4287K30480N19865l46599c8106B81303J49039J43940
14857E74282j46375j944J14796k08097K88793J67832B98428o2956K68888n3344
14847D51016j14137j04042K60090j29363L32929k13880K30143j50481H8430M59239
14837E47669N3521B44917J50986k988K31875k07271j56826K72386J13941j8063
14827F28957k97068P7948p4775L21564l6797o6707K95020A61478L03058L69309
14817H33845k60299l9591k51708J26248R1523B37357M49765k04898o7377P5990
14807D90837r8533p052n4887L52884k6917K9398K05155C90993K42826O9846j0984
14796F92681K6608j43006M11989l27615k34968L08901J11375l21866r5531j43575
$$ plain form
14786 284993 773815 639999 246039 398472 599290 1030705 545518 485538 680913 757341
14776 757341 717301 466537 685824 604569 742524 788350 1010498 295102 751144 463589
14766 463589 779411 732533 654620 894393 637904 804934 437534 499139 649672 620668
14756 620668 735563 565602 711516 546725 532922 606606 856696 827871 744180 822893
14746 822893 814099 436497 800674 859062 639889 673413 987467 1124656 662184 940849
14736 940849 661254 770054 618842 770153 753371 618585 544698 887602 548563 786934
14726 786934 1036469 565115 950156 709715 670420 1146769 818650 542042 660582 629178
14716 629178 1001384 677448 708270 702518 637852 1075090 1176998 678076 977047 249930
$$ packed form
14786B84993M88822j33816B46039J52433K00818M31415m85187n9980J95375P6428
14776G57341m0040k50764K19287q1255J37955M5826K22148B95102M56042k87555
14766D63589L15822m6878p7913K39773k56489J67030l67400O1605J50533k9004
14756F20668J14895j69961J45914j64791j3803P3684K50090k8825q3691P8713
14746H22893q794l77602L64177N8388k19173L3524L14054J37189m62472K78665
14736I40849k79595J08800j51212J51311j6782j34786p3887L42904l39039K38371
14726G86934K49535m71354L85041k40441l9295M76349l28119k76608J18540l1404
14716F29178L72206l23936L0822n752o4666M37238J01908m98922K98971B49930
$$ plain form
14705 1009434 885945 1028119 947359 935288 880183 646375 1028946 563526 1145322 674041
14695 674041 751735 1093494 1122810 1233254 1162572 837439 1344907 609778 1099545 1229693
14685 1229693 974764 720781 960568 885800 1186800 1099291 1057380 1084414 999560 1314860
14675 1314860 999015 1118931 1197921 961556 1011927 1477485 771706 1030911 888225 1003704
14665 1003704 1186825 948197 1540945 1370358 1206975 1130324 1374760 1000548 1263440 1282437
14655 1282437 827847 1207803 1174428 1282326 1365300 998126 1238290 1552507 1367729 1367673
14645 1367673 1239583 1157287 1599940 1395968 948677 1023480 1476903 1199159 1397095 1281374
14635 1281374 1272867 1309137 1318895 1407599 1666375 1382054 1621906 1329435 1492445 1573969 1303567
$$ packed form
14705A009434j23489J42174q0760j2071n5105k33808L82571m65420N81796m71281
14695F74041P7694L41759K9316J10444p0682l25133N07468F09778M89767J30148
14685A229693k54929k53983K39787p4768L01000q7509m1911K7034q4854L15300
14675A314860l15845J19916P8990k36365N0371M65558p05779K59205j42686J15479
14665A003704J83121k38628N92748j70587j63383p6651K44436l74212K62892J8997
14655A282437m54590L79956l3375J07898Q2974l67174K40164L14217j84778n6
14645A367673j28090q2296M42653k03972m47291P4803M53423k77744J97936j15721
14635A281374q507L6270R758Q8704K58776k84321K39852k92471J63010Q1524k70402
$$ plain form
14624 1303567 1772120 1472369 1662301 1588525 1413688 1508064 1448082 1589948 1514012 1674989
14614 1674989 1844705 1504369 1803093 1853497 1908169 1572235 1640606 1590272 1601783 1430679
14604 1430679 1418617 1890813 2107901 1918900 1913809 1677628 1896813 1815816 1897839 1835037
14594 1835037 1583040 1697916 1921004 1907020 2088311 2017031 1819533 1639130 2172228 1738129
14584 1738129 1931922 2141356 2079855 2135532 2069974 1999832 2091891 2296765 2218504 2372908
14574 2372908 2280039 2425287 2209099 2665014 2180772 2528716 2338427 2651737 2416743 2592271
14564 2592271 2735480 2846534 2703938 2938046 2781350 2917396 2880588 3408780 3272151 3594851
14554 3594851 3584188 4008064 4292883 5085106 6055099 7630777 11317049 19236153 41049833
$$ packed form
14624A303567M68553k99751J89932p3776j74837R4376n9982J41866p5936J60977
14614A674989J69716l40336K98724N0404N4672l35934O8371n0334J1511j71104
14604A430679j2062M72196K17088j89001n091k36181K19185q0997Q2023o2802
14594A835037k51997J14876K23088j3984J81291p1280j97498j80403N33098m34099
14584A738129J93793K09434o1501N5677o5558p0142R2059K04874p8261J54404
14574B372908r2869J45248k16188M55915m84242L47944j90289L13310k34994J75528
14564B592271J43209J11054j42596K34108j56696J36046l6808N28192j36629L22700
14554C594851j0663M23876K84819P92223R69993J575678L686272P919104K1813680
$$ plain form
14545 41049833 52236446 20933780 12515462 6174534 3370466 2557342 2006615 2398225
14537 2398225 2474662 2230086 2132523 2472350 2345789 2283728 2074213 2049486 2199889 2430778
14527 2430778 2164976 2557212 2586774 2361477 2527071 2491017 2808582 2910561 2701269 2747743
14517 2747743 2861449 2831150 3040230 2791845 3036050 2762550 2988767 2870570 2959165 2784637
14507 2784637 2958443 2942695 3196510 2999026 3064616 2977993 3238946 3343504 3012426 3767879
14497 3767879 3416859 3523229 3635370 3434397 3632786 3396030 3948179 3647569 3588251 3663110
14487 3663110 3777862 3539879 3939045 3935053 3858950 4198991 3779584 4142076 4118961 4089427
14477 4089427 4407504 4163327 4604631 4568429 4434124 4582578 4613578 4226416 4740015 4769904
$$ packed form
14545D1049833J1186613B0933780q418318F174534k804068q13124n50727L91610
14537B398225P6437k44576r7563L39827j26561o2061k09515k4727J50403K30889
14527B430778k65802L92236K9562k25297J65594l6054L17565J01979k09292M6474
14517B747743J13706l0299K09080k48385K44205k73500K26217j18197Q8595j74528
14507B784637J73806j5748K53815j97484O5590q6623K60953J04558l31078P55453
14497C767879l51020J06370J12141k00973J98389k36756N52149l00610n9318P4859
14487C663110J14752k37983L99166l992p6103L40041m19407L62492k3115k9534
14477D089427L18077k44177M41304l6202j34305J48454L1000l87162N13599K9889
$$ plain form
14467 4769904 4636703 4900905 4808742 4763001 4814214 4592491 5073621 5089548 5436712 5294108
14457 5294108 5365196 5217061 5435730 5211452 5541768 5698096 5539706 5757789 5739121 5860711
14447 5860711 5791226 5767648 5851475 6258717 6222041 6537397 6662413 6458117 6882229 6434190
14437 6434190 6714896 6684498 6953396 6765879 7098184 7206529 7501849 7373086 7065116 7889570
14427 7889570 7552654 7898676 7689752 8058349 8071596 8405408 8628865 8372271 8411508 8756397
14417 8756397 8726345 9040868 9154849 9042998 8999416 9561999 9389805 9906239 10212369 9966087
14407 9966087 10333552 10440394 10624730 10690115 10627715 10763960 11028644 11217500 11202020 11529403
14397 11529403 11714415 12162813 12225660 12577187 12456268 12863319 13235027 13415607 13307897
$$ packed form
14467D769904j33201K64202r2163m5741N1213k21723M81130J5927L47164j42604
14457E294108P1088j48135K18669k24278L30316J56328j58390K18083j8668J21590
14447E860711o9485k3578Q3827M07242l6676L15356J25016k04296M24112m48039
14437F434190K80706l0398K68898j87517L32305J08345K95320j28763l07970Q24454
14427G889570l36916L46022k08924L68597J3247L33812K23457k56594L9237L44889
14417H756397l0052L14523J13981j11851m3582N62583j72194N16434L06130k46282
14407I966087L67465J06842J84336O5385o2400J36245K64684J88856j5480L27383
14397A1529403J85012M48398O2847L51527j20919M07051L71708J80580j07710
$$ plain form
14388 13307897 13530625 13883082 14383782 14743051 14554811 14700690 15246585 15192231 15557518
14379 15557518 16081516 16312683 16590394 16747090 17553497 17845106 18267671 18286856 19033318
14370 19033318 19026489 19249126 19795353 19998701 20589778 21239880 21540256 21784279 22331647 22855478
14360 22855478 23507410 23679794 24362005 24878376 25852819 26259734 26732101 27115061 27999530
14351 27999530 28541606 29377685 30051760 30923324 31419422 32382329 33044745 33841979 34906981
14342 34906981 35457459 36560495 37745129 38794780 39676718 40728159 42148656 43646723
14334 43646723 44667401 45758081 47373188 48510272 50329093 51904135 53696542 54908359
14326 54908359 56874141 59151015 60932990 62995066 65066424 67459151 69584459 72352879
$$ packed form
14388A3307897K22728L52457N00700L59269j88240J45879N45895n4354L65287
14379A5557518N23998K31167K77711J56696Q06407K91609M22565J9185P46462
14370A9033318o829K22637N46227K03348N91077O50102L00376K44023N47368N23831
14360B2855478O51932J72384O82211N16371R74443M06915M72367L82960Q84469
14351B7999530N42076Q36079O74075Q71564M96098R62907O62416P97234J065002
14342C4906981N50478J103036J184634J049651Q81938J051441J420497J498067
14334D3646723J020678J090680J615107J137084J818821J575042J792407J211817
14326E4908359J965782K276874J781975K062076K071358K392727K125308K768420
$$ plain form
14318 72352879 75185750 77502304 80667869 83524919 86906147 90235681 93828900 97270878
14310 97270878 101597596 105682202 110364439 114926646 119998850 125060417 130549982 136675088
14302 136675088 142851635 149413410 156594057 163667481 171448827 179854197 188511288 197832464
14294 197832464 207542059 217642051 228456587 239865618 251798832 263986526 277144440
14287 277144440 290732954 304557342 319056441 333538378 348562216 363596572 378088428
14280 378088428 393369184 407233757 420966455 433482373 445275817 455336894 463708047
14273 463708047 469757446 473367457 474661128 474691540 473242574 470039343 465563498 459059584
14265 459059584 450306067 439635183 427717505 414260816 400018061 384583455 369280469
$$ packed form
14318G2352879K832871K316554L165565K857050L381228L329534L593219L441978
14310I7270878M326718M084606M682237M562207N072204N061567N489565O125106
14302A36675088O176547O561775P180647P073424P781346Q405370Q657091R321176
14294A97832464R709595J0099992J0814536J1409031J1933214J2187694J3157914
14287B77144440J3588514J3824388J4499099J4481937J5023838J5034356J4491856
14280C78088428J5280756J3864573J3732698J2515918J1793444J0061077Q371153
14273D63708047O049399L610011J293671L0412j448966l203231m475845o503914
14265D59059584q753517j0670884j1917678j3456689j4242755j5434606j5302986
$$ plain form
14258 369280469 353779723 338235276 322755336 307400751 293367253 280407836 266990266
14251 266990266 253973189 241373253 229566875 218271874 208462465 197919120 188583045
14244 188583045 180180397 171346199 163484392 156339074 148811013 142282833 136329240 130581678
14236 130581678 124949507 119553071 114575898 109623981 105451186 101658321 97624540 93872606
14228 93872606 89955289 86718331 83649296 80448646 77498051 74398536 72308848 69772883
14220 69772883 67283430 65277234 63087745 60967045 58827429 57054184 55862806 54165685
14212 54165685 52322688 50893432 48858912 47645368 46246057 45542228 44427509 42628001
14204 42628001 41424983 40319266 39626393 38545398 37819002 36668041 35356251 34668351
$$ packed form
14258C69280469j5500746j5544447j5479940j5354585j4033498j2959417j3417570
14251B66990266j3017077j2599936j1806378j1295001r809409j0543345r336075
14244A88583045q402648q834198p861807p145318p528061o528180n953593n747562
14236A30581678n632171n396436m977173m951917m172795l792865m033781l751934
14228I3872606l917317l236958l069035l200650k950595l099515k089688k535965
14220F9772883k489453k006196k189489k120700k139616j773245j191378j697121
14212E4165685j842997j429256k034520j213544j399311p03829j114719j799508
14204D2628001j203018j105717o92873j080995p26396j150961j311790o87900
$$ plain form
14196 34668351 33555886 32953918 32291639 31301387 30594474 29960982 29182397 28247278 27948888
14187 27948888 26801266 26305860 25444374 25289807 24700601 24293849 23383492 23258505 22782879
14178 22782879 22292721 21632827 21133605 21125923 20283357 20245050 19346477 19130241 18867548 18542995
14168 18542995 17907199 17955563 17525933 16960265 16969343 16146809 16076135 15977366 15587824 15221194
14158 15221194 15165439 14728320 14805071 14611281 14075547 13777984 13455814 13340562 13300397 12590631
14148 12590631 12785821 12500163 12251167 12064097 11914112 11604161 11392641 11366736 11068701
14139 11068701 11377754 11098088 10781273 10657077 10318005 10157171 9967831 9643112 9694347
14130 9694347 9726889 9504210 9410382 9432193 9329776 9220585 8651875 8664277 8552795 8401817
$$ packed form
14196C4668351j112465o01968o62279r90252p06913o33492p78585r35119k98390
14187B7948888j147622m95406q61486j54567n89206m06752r10357j24987m75626
14178B2782879m90158o59894m99222p682q42566l8307q98573k16236k62693l24553
14168A8542995o35796M8364m29630n65668R078q22534p0674r8769l89542l66630
14158A5221194n5755m37119P6751j93790n35734k97563l22170j15252m0165p09766
14148A2590631J95190k85658k48996j87070j49985l09951k11520k5905k98035
14139A1068701L09053k79666l16815j24196l39072j60834j89340l24719N1235
14130I694347L2542k22679r3828K1811j02417j09191n68710J2402j11482j50978
$$ plain form
14120 8401817 8411304 8314370 8376653 7979859 7933325 7702034 7934225 7769958 7460950 7424798
14110 7424798 7338524 7168935 7243405 7382746 6946234 7075432 6855433 6793458 6842664 6996716
14100 6996716 6492505 6676796 6122725 6647907 6629721 6462258 5945569 6375071 6092206 5842140
14090 5842140 5754076 6178185 6013460 5736236 5449566 5489316 5365184 5302879 5361529 5346092
14080 5346092 5431805 5154142 5191431 5256615 4811880 5318793 5076145 4931097 4734488 4682333
14070 4682333 5278157 4648721 4607525 4844183 4650588 4740122 4823029 4329144 4638580 4790629
14060 4790629 4106134 4157670 4424422 4202431 4389628 4278503 4063975 4204028 3845540 3788854
14050 3788854 3725770 3759965 3938298 3742113 3500965 3713478 3873067 3972304 3534577 3523113
$$ packed form
14120H401817R487r6934O2283l96794m6534k31291K32191j64267l09008l6152
14110G424798q6274j69589P4470J39341m36512J29198k19999o1975M9206J54052
14100F996716n04211J84291n54071N25182j8186j67463n16689M29502k82865k50066
14090E842140q8064M24109j64725k77224k86670L9750j24132o2305N8650j5437
14080E346092Q5713k77663L7289O5184m44735N06913k42648j45048j96609n2155
14070D682333N95824o29436m1196K36658j93595Q9534Q2907m93885L09436J52049
14060D790629o84495N1536K66752k21991J87197j11125k14528J40053l58488n6686
14050C788854o3084L4195J78333j96185k41148K12513J59589R9237m37727j1464
$$ plain form
14040 3523113 3430828 3515037 3513548 3530966 3897941 3705831 3370249 3292104 3090640 3313388
14030 3313388 3285921 3215610 3219606 3388426 3186383 2647494 2974034 3155937 3227980 2859585
14020 2859585 3044038 3026679 2865360 2943938 3027524 2920408 2804069 2670115 2607741 2661209
14010 2661209 2718475 2818577 2699613 2512738 2687681 2412124 2834251 2419905 2481803 2390444
14000 2390444 2360952 2075816 2353122 2309170 1964237 2034064 2091321 2460393 2386608 2692829
13990 2692829 2937562 3584852 5844218 11723221 31220737 55059674 28342086 13878072
13981 8341424 6641286 4945564 4214804 3745110 3572188 3338481 3133605 3628175 2726013
13972 2726013 2972699 3202485 2539061 2763568 2600545 2464653 2560758 2305749 2525338 2406184
$$ packed form
14040C523113r2285Q4209j489J7418L66975j92110l35582p8145k01464K22748
14030C313388k7467p0311L996J68820k02043n38889L26540J81903P2043l68395
14020B859585J84453j7359j61319P8578Q3586j07116j16339j33954o2374N3468
14010B661209N7266J00102j18964j86875J74943k75557M22127m14346O1898r1359
14000B390444k9492k85136K77306m3952l44933O9827N7257L69072p3785L06221
13990B692829K44733O47290K259366N879003J9497516K3838937k6717588A3878072
13981H341424j700138j695722p30760m69694j72922k33707k04876M94570r02162
13972B726013K46686K29786o63424K24507j63023j35892R6105k55009K19589j19154
$$ plain form
13962 2406184 2734523 2062197 2354177 2133954 2235364 2115611 1961711 2219784 1804392
13953 1804392 2265551 2088992 2141892 1921898 2201756 1996347 1878697 2053112 1833796 2098340
13943 2098340 2143553 1812132 1925374 2207057 1682261 2055577 1595692 1809758 1954764 1822933
13933 1822933 1677491 1852380 1634740 1477710 1911399 1875513 1890119 1616232 1751003 1613720
13923 1613720 1715268 1600007 1585061 1803525 1730555 1554689 1564157 1480790 1660914 1810925
13913 1810925 1148252 1636259 1460376 1477502 1550742 1480110 1459928 1505921 1335071 1725626
13903 1725626 1210603 1587711 1109480 1374979 1706955 1015310 1553815 1632248 1510766 1206907
13893 1206907 1413790 1309611 1360643 1069655 1399531 1031212 1386744 1543195 1293530 1082034
$$ packed form
13962B406184L28339o72326K91980k20223J01410j19753j53900K58073m15392
13953A804392M61159j76559N2900k19994K79858k05409j17650J74415k19316K64544
13943B098340M5213l31421J13242K81683n24796L73316m59885K14066J45006j31831
13933A822933j45442J74889k17640j57030M33689l5886J4606k73887J34771j37283
13923A613720J01548j15261j4946K18464p2970j75866R468q3367J80124J50011
13913A810925o62673M88007j75883J7126P3240p0632k0182M5993j70850L90555
13903A725626n15023L77108m78231K65499L31976o91645N38505P8433j21482l03859
13893A206907K06883j04179N1032k90988L29876l68319L55532J56451k49665k11496
$$ plain form
13883 1082034 1280242 1518556 1303091 1512720 1185912 1474107 1604482 1077404 1358519
13874 1358519 1186638 1151415 1598151 1342160 1409467 1146210 1141338 1862553 1513679 1273327
13864 1273327 1103830 1381170 1431058 1190736 1220971 1232313 818447 1041301 1410323 1216414
13854 1216414 1082885 1157848 963218 1284691 1463334 1394614 1168133 1155468 1273207 804185
13844 804185 962920 1118589 795514 1241624 1129018 1283439 1053979 1053182 622646 1001626
13834 1001626 935115 814964 984678 1127861 1231835 1096513 1237610 685086 703555 1153216
13824 1153216 1365178 662318 911711 927696 841713 1012023 1184875 1072414 1249254 444001
13813 922469 964041 1014768 595252 657898 947143 858370 898866 825437 875623 766539 1212451
$$ packed form
13883A082034J98208K38314k15465K09629l26808K88195J30375n27078K81115
13874A358519j71881l5223M46736k55991O7307k63257m872P21215l48874k40352
13864A273327j69497K77340M9888k40322L0235J1342m13866K22854L69022j93909
13854A216414j33529P4963j94630L21473J78643o8720k26481j2665J17739m69022
13844H04185J58735J55669l23075M46110j12606J54421k29460p97m30536L78980
13834A001626o6511j20151J69714J43183J03974j35322J41097n52524J8469M49661
13824A153216K11962F62318K49393J5985q5983J70310J72852j12461J76840D44001
13813I22469M1572N0727m19516O2646K89245q8773M0496p3429N0186j09084M45912
$$ plain form
13802 1212451 682641 896703 600952 822686 815904 920081 1048492 935251 775570 834437
13792 834437 983279 699970 762195 577940 1071350 814196 920034 535245 1143811 1063235
13782 1063235 939834 689009 536503 690369 1162499 699305 875295 840780 783396 849950
13772 849950 767187 873362 820315 875218 799569 663906 751632 649675 799805 479399
13762 479399 625402 738188 543953 706765 781799 707672 707775 523681 700181 562957
13752 562957 464360 724737 874362 608773 747479 739136 629455 669741 903839 647041
13742 647041 782554 789647 522842 547676 555086 839271 634476 513994 669120 1087405
13732 1087405 779889 501792 783599 738097 725991 561772 626466 689835 984751 822812
$$ packed form
13802A212451n29810K14062k95751K21734o782J04177J28411j13241j59681N8867
13792H34437J48842k83309O2225j84255M93410k57154J05838l84789O08566q0576
13782A063235j23401k50825j52506J53866M72130m63194J75990l4515n7384O6554
13772H49950q2763J06175n3047N4903p5649j35663Q7726j01957J50130l20406
13762D79399J46003J12786j94235J62812P5034p4127J03j84094J76500j37224
13752E62957r8597K60377J49625k65589J38706q343j09681M0286K34098k56798
13742F47041J35513P093k66805K4834P410K84185k04795j20482J55126M18285
13732A087405l07516k78097K81807m5502j2106j64219O4694O3369K94916j61939
$$ plain form
13722 822812 482486 655842 570710 837807 855850 395016 853891 783480 595655 622236
13712 622236 637512 224945 794644 625107 670787 668964 880398 420758 523315 460853
13702 460853 449758 320884 818999 598391 522085 356352 281469 918058 480842 501289
13692 501289 922869 733092 709137 762215 759307 597176 495112 305410 421230 671197
13682 671197 443238 794394 370470 675192 447790 203636 489025 637223 516280 793745
13672 793745 312441 740837 221374 640867 582358 736150 167091 533694 420487 447071
13662 447071 453140 764025 396060 341447 519529 447537 568148 457045 192673 313559
13652 313559 843264 499162 353941 267440 609485 232951 392640 327982 492854 627337
$$ packed form
13722H22812l40326J73356q5132K67097J8043C95016M58875p0411j87825K6581
13712F22236J5276B24945N69699j69537M5680j823K11434D20758J02557o2462
13702D60853j1095j28874M98115k20608p6306j65733p4883O36589m37216K0447
13692E01289M21580j89777k3955N3078k908j62131j02064j89702J15820K49967
13682F71197k27959L51156C70470L04722k27402B03636K85389J48198j20943K77465
13672G93745C12441M28396B21374M19493n8509J53792A67091L66603j13207K6584
13662D47071O069L10885l67965n4613J78082p1992J20611j11103A92673J20886
13652C13559N29705l44102j45221q6501L42045B32951J59689o4658J64872J34483
$$ plain form
13642 627337 529361 404380 551534 264651 538897 501069 324852 291338 260352 333688
13632 333688 466077 598294 523883 708658 644488 555443 732360 577139 264319 284838
13622 284838 712060 340120 184283 365448 512924 237919 375435 314802 377074 250027
13612 250027 287963 651440 598249 524823 305990 310493 537189 210085 356941 275143 276298
13601 276298 440935 369162 585451 277958 582996 209232 388689 398985 264508 217624
13591 217624 580860 500753 648423 341464 159382 375951 443287 355330 274892 342006
13581 342006 368332 70580 373388 175590 514255 297763 484361 642860 597974 142855
13570 210730 285740 336037 629787 414643 735726 -113095 399833 411896 289179 55434
$$ packed form
13642F27337r7976j24981J47154B64651K74246l7828j76217l3514l0986P3336
13632C33688J32389J32217p4411J84775o4170q9045J76917j55221B64319K0519
13622B84838M27222C40120j55837J81165J47476B37919J37516o0633O2272j27047
13612B50027L7936L63477n3191p3426k18833M503K26696B10085J46856q1798J155
13601B76298J64637p1773K16289B77958L05038B09232J79457J0296j34477m6884
13591B17624L63236q0107J47670l06959A59382K16569O7336q7957q0438O7114
13581C42006K6326G0580L02808A75590L38665k16492J86598J58499m4886A42855
13570B10730P5010N0297K93750k15144L21083a13095C99833J2063j22717E5434
$$ plain form
13559 314055 229709 -3754 259239 569553 -81206 539613 399550 414941 433715 499487 241808
13547 466748 532865 598422 336189 346115 319246 84385 211413 131264 314909 302921 425813
13536 425813 31489 525282 301872 124288 528609 410107 393085 350843 479377 75477
13525 658831 269056 136243 575808 481187 432718 176016 390344 452376 251725 282790
13515 282790 372381 464428 563734 449500 332270 240446 310992 315779 -96769 -18300 16724
13503 -79228 210490 174774 182149 517078 210227 492433 181071 -51054 196979 105179 302745
13492 302745 215046 473201 316788 210636 19487 309399 529428 162013 415408 321501
13482 321501 480310 326636 194027 270585 465819 301214 287321 261015 -7483 452185
$$ packed form
13559C14055q4346c754B59239L10314h1206E39613j40063J5391J8774O5772B41808
13547D66748O6117O5557k62233R926k6869H4385J27028q0149J83645j1988J22892
13536D25813C1489M93793k23410A24288M04321j18502j7022m2242J28534G5477
13525F58831B69056j32813M39565r4621m8469A76016K14328O2032k00651L1065
13515B82790Q9591R2047R9306j14234j17230r1824P0546M787i6769a8300A6724
13503g9228B10490l5716P375L34929B10227K82206A81071e1054A96979r1800J97566
13492C02745q7699K58155j56413j06152A9487K89912K20029A62013K53395r3907
13482C21501J58809j53674j32609P6558J95234j64605j3893k6306g483D52185
$$ plain form
13471 203628 338553 389500 393271 356755 325009 251472 430504 355801 175535 229874 64860
13459 249402 66539 531658 214084 293641 207236 263552 20046 170198 209602 287243 502906
13448 502906 204371 217934 139065 578739 453480 322909 102198 284395 358080 -21521
13437 588450 546293 168345 240650 574283 182265 55057 170699 189843 -181992 155164
13426 393899 165521 220596 80915 385648 90706 333606 137244 330390 136664 -267582
13415 370819 551976 342464 103792 135488 377673 172302 238022 125330 -97979 271559
13404 270478 394375 212817 122229 336663 370579 109938 198585 388635 352862 536895
13394 536895 344718 77772 106476 319306 431705 202627 40642 303354 172231 188090
$$ packed form
13471B03628J34925N0947L771l6516l1746p3537J79032p4703A75535N4339F4860
13459B49402F6539M65119B14084P9557q6405N6316B0046J50152L9404P7641K15663
13448E02906B04371J3563p8869M39674j25259j30571A02198J82197P3685b1521
13437E88450m2157A68345P2305L33633A82265E5057J15642J9144a81992A55164
13426C93899A65521N5075H0915L04733I0706K42900A37244J93146A36664b67582
13415C70819J81157k09512A03792L1696K42185A72302O5720j12692i7979B71559
13404B70478J23897j81558r0588K14434L3916A09938Q8647J90050l5773J84033
13394E36895j92177G7772K8704K12830J12399B02627D0642K62712j31123J5859
$$ plain form
13384 188090 236538 393175 377511 325665 75817 256517 570185 214045 126442 357006
13374 357006 -24319 294084 99447 379913 -202326 426949 265085 185403 398116 198173
13363 410005 369928 325511 3234 84708 29450 200817 133522 137667 206174 367758 101483
13351 328026 -23831 173395 394975 493925 162880 351709 257538 262596 201028 173350 475946
13340 475946 350376 278492 91934 94901 46105 391058 177866 36881 315999 104238 231630
13329 231630 89190 311608 463299 207213 109063 -95485 401414 -9960 121394 135778 313458
13318 313458 -399390 410817 221987 610383 116482 123155 290044 465808 96501 -156584
13307 -106302 225218 188973 -33270 119062 294705 97642 161583 237386 246027 493993 268301
$$ packed form
13384A88090M8448J56637j5664n1846G5817J80700L13668B14045q7603K30564
13374C57006b4319B94084I9447K80466b02326D26949j61864p9682K12713A98173
13363D10005m0077m4417C234Q1474B9450J71367o7295M145O8507J61584A01483
13351C28026b3831A73395K21580R8950A62880J88829r4171N058o1568k7678L02596
13340D75946j25570p1884I1934K967D6105L44953A77866C6881K79118A04238J27392
13329B31630H9190K22418J51691B07213r8150i5485D01414i960A21394J4384J77680
13318C13458c99390D10817j88830L88396A16482O673J66889J75764I6501a56584
13307a06302B25218l6245c3270A19062J75643I7642O3941P5803Q641K47966k25692
$$ plain form
13296 268301 90737 63062 -211517 222106 20157 -30366 129885 -154674 -128811 217202
13285 -37176 -78162 316601 121212 177343 243155 404552 72240 217613 34423 -10155 205225
13273 393034 290280 393613 -262902 98306 -55928 241119 203621 260353 170261 259426 281873
13262 281873 290539 -71692 316302 123100 126060 337394 282075 293771 504257 157902 66190
13250 380612 115560 12575 182754 219369 257711 24905 -12692 23268 102284 86584 78985
13239 78985 -156763 -40837 250038 -71856 -47812 525718 56317 203352 -25921 304701 76808
13227 220520 146142 -138091 76421 203023 176773 -103113 -134162 17882 148172 -284515
13216 17759 -250425 236146 26249 -369 454628 129414 230996 -91475 202130 109915 191536
$$ packed form
13296B68301I0737k7675b11517B22106B0157c0366A29885a54674K5863B17202
13285c7176m0986C16601A21212N6131O5812J61397G2240J45373C4423a0155B05225
13273C93034j02754J03333b62902I8306e5928B41119l7498N6732r0092Q9165K2447
13262B81873Q666g1692C16302A23100K960K11334n5319J1696K10486A57902F6190
13250C80612A15560A2575J70179L6615L8342B4905a2692B3268P9016j5700p599
13239G8985a56763d0837B50038g1856K4044E25718E6317J47035b5921C04701G6808
13227B20520p4378a38091G6421J26602k6250a03113l1049A7882J30290b84515
13216A7759b50425B36146B6249c69D54628A29414J01582i1475B02130r2215Q1621
$$ plain form
13205 191536 390046 218702 72254 -4525 369581 518821 119795 -49389 -144075 164907
13194 186223 180740 197211 106065 -8999 56240 141982 159800 393007 146977 7291 209187
13183 209187 224708 358730 92341 84144 192540 -70865 270599 -256151 276452 -146672
13172 294872 100148 308813 70443 47274 168535 328897 418401 308344 148580 -134250
13161 113245 108758 -170727 234850 93220 43602 -258102 98088 -53085 179770 95298 32406
13149 223386 172381 263377 -222145 -18165 102255 -89647 -262535 104074 265537 -24189
13138 228648 -12611 18990 17820 276160 6395 133663 126551 224549 120568 287645 95244
13126 162794 49880 -66081 73490 276415 131634 272436 -341514 206428 411615 104513
$$ packed form
13205A91536J98510j71344G2254d525C69581J49240A19795d9389r4686A64907
13194A86223n483J6471r1146h999E6240Q5742J7818K33207A46977G291K01896
13183B09187J5521J34022I2341q197J08396g0865B70599b56151B76452a46672
13172B94872A00148K08665G0443k3169J21261J60362Q9504j10057A48580a34250
13161A13245m487a70727B34850I3220D3602b58102I8088e3085A79770q4472C2406
13149B23386n1005R0996b22145a8165A02255h9647j72888A04074J61463b4189
13138B28648a2611A8990j170K58340F395J27268p112R7998j03981J67077I5244
13126A62794D9880f6081G3490K02925A31634J40802c41514B06428K05187A04513
$$ plain form
13115 -168304 108785 329747 -245317 209282 266081 -7566 -35510 228768 240792 360515
13105 360515 100167 135167 121738 170092 132036 190648 140880 -106716 -13094 109822 -223646
13093 -19872 -184805 267793 276171 -36142 -254439 82349 -152598 -50302 -185655 -41533 102655
13081 -175913 -73044 363899 209192 140116 255511 242792 -100858 -51882 -64375 275921
13070 130505 129268 232627 86557 87345 -45189 288523 -380 205078 340954 222761 19865
13058 -62305 -228173 17516 100840 219408 136079 -110401 340731 127492 271215 117089
13047 -115816 162561 -47714 231010 79348 354128 212876 145089 96686 -13640 255463
13036 86495 92882 206476 -28625 -121605 198764 186604 248590 134093 3 7444 296229 325548
$$ packed form
13115a68304A08785K20962b45317B09282N6799g566k7944B28768J2024J19723
13105C60515A00167L5000j3429M8354l8056N8612m9768a06716a3094A09822b23646
13093a9872j64933B67793Q378c6142k18297H2349a52598e0302j35353d1533A02655
13081a75913g3044C63899j54707o9076J15395j2719a00858M8976j2493B75921
13070A30505j237J03359H6557P88d5189B88523c80B05078J35876j18193A9865
13058f2305j65868A7516Q3324J18568q3329a10401C40731A27492J43723A17089
13047a15816A62561d7714B31010G9348K74780j41252o7787m8403a3640B55463
13036H6495O387J13594b8625r2980A98764j2160O1986j14497CP441K88785K9319
$$ plain form
13024 325548 361507 180033 135750 167410 289784 -32949 297725 123857 27449 451982
13014 451982 314948 -16135 39137 149043 279036 -5092 -72285 148069 125918 259710 159618
13003 159618 -317263 75566 224922 93821 296802 153595 -240986 205324 126037 -215205
12992 214648 -21746 107016 188999 268602 433655 73822 346658 91458 225269 -32296 158842
12980 37002 -67732 -95443 -42111 -33733 149763 13173 135038 -130887 -46650 160935 -350469
12968 98484 -110421 447981 87468 75856 46688 26592 -208144 306517 70377 -243956 -123223
12957 -123223 -262067 -47577 344122 -44170 369563 -318664 258293 15315 -204576 306485
12946 199868 -126305 213552 164069 -118133 113656 29400 275210 -58549 31399 99171
$$ packed form
13024C25548L5959A80033m4283L1660J22374c2949B97725A23857B7449M24533
13014D51982j37034a6135C9137J09906J29993e092o7193A48069k2151J33792j00092
13003A59618c17263G5566J49356I3821K02981j43207b40986B05324p9287b15205
12992B14648b1746A07016Q1983P9603J65053G3822K72836I1458J33811c2296A58842
12980C7002f7732k7711d2111Q378A49763A3173J21865a30887d6650A60935c50469
12968I8484a10421D47981H7468j1612k9168k0096b08144C06517G0377b43956J20733
12957a23223j38844d7577C44122d4170C69563c18664B58293A5315b04576C06485
12946A99868a26305B13552m9483a18133A13656B9400K45810e8549C1399O7772
$$ plain form
12936 99171 211574 -170041 64632 -22275 107611 -541208 -78374 187426 59527 -142501
12925 77200 109268 2480 311314 -121224 265166 25987 -4060 4755 31515 176783 157533
12914 157533 20492 33644 -222080 -50421 30755 95484 460102 -121957 293546 57404 -190383
12902 55353 -2555 -164237 61885 76977 230727 123108 -49022 -264659 23806 -34076 -177777
12891 -177777 208599 76635 176113 413708 156038 75656 8875 -126383 -269794 159806
12880 -232711 234290 -90384 106411 280417 -116294 75255 176464 -228018 268882 -107495
12869 -132046 56360 210564 -165544 -463329 -162549 -281769 76591 -71226 -400666 -1824
12858 255329 228342 268350 1211 132735 -198597 20565 -90429 -187637 285229 54197 -270963
$$ packed form
12936I9171J12403a70041F4632b2275A07611e41208g8374A87426E9527a42501
12925G7200L2068B480L08834a21224B65166B5987d060D755K6760J45268j9250
12914A57533B0492J3152b22080e0421C0755O4729L64618a21957B93546E7404a90383
12902E5353b555j61682F1885J5092J53750j07619d9022k15637B3806c4076j43701
12891a77777B08599G6635R9478K37595A56038G5656H875a26383j43411A59806
12880b32711B34290i0384A06411J74006a16294G5255J01209b28018B68882a07495
12869a32046E6360J54204a65544k97785a62549j19220G6591g1226l29440a824
12858B55329k6987M0008A211J31524a98597B0565i0429r7208B85229E4197b70963
$$ plain form
12846 113423 204806 114659 144485 -140723 241333 69193 165525 187561 414196 -143844 -179651
12835 -179651 195893 242 -16579 79212 38633 145255 52683 -235649 51464 333016 -99827
12823 190401 -19846 -2432 113426 119802 84666 -221425 3701 -80623 153577 37873 -60579
12811 272486 -31992 42060 -83812 111721 412719 -290595 99576 -61809 -169075 98783 316352
12800 316352 37043 -178205 -326220 78061 -105028 335917 -17782 -69005 4083 2878 -65363
12788 175092 -71450 -62776 226221 97494 -429207 5000 -399524 251853 -117826 -100190 242993
12776 320416 148880 -155068 31433 276151 121109 92189 188774 -186788 251783 -121778
12765 -141601 126340 197951 81063 297644 172794 52648 80241 11846 32706 -80247 489675
$$ packed form
12846A13423R1383r0147K9826a40723B41333F9193R6332K2036K26635a43844l5807
12835a79651A95893B42a6579G9212C8633J06622E2683b35649E1464K81552i9827
12823A90401a9846b432A13426O376l5136b21425C701h0623A53577C7873f0579
12811B72486c1992D2060h3812A11721L00998b90595I9576f1809j07266I8783K17569
12800C16352C7043a78205j48015G8061a05028C35917a7782n1223D083j205f5363
12788A75092g1450Q674B26221I7494d29207E000c99524B51853a17826J7636B42993
12776C20416A48880a55068C1433K44718A21109k8920R6585a86788B51783a21778
12765a41601A26340P1611H1063K16581j24850E2648K7593A1846K0860h0247D89675
$$ plain form
12753 -233515 44756 -7913 -276738 145195 -70954 188294 212476 63619 192 -130136 -196638
12742 -196638 -21780 105842 154267 127182 172537 -84518 34175 -22416 436861 132677 328574
12731 328574 121364 18523 167350 -361031 60672 180609 5199 585246 319711 -177802
12720 -265850 440479 -88697 375734 -138245 -49788 -24195 74008 -142491 302019 64713
12709 -216099 9391 -977 181052 241935 104800 -18222 242652 -7578 -138889 477328 -83666
12697 100113 -169135 278380 -148952 367309 -110025 -167207 -40337 129489 233998 -103200
12686 -64209 -73866 48378 -38216 -43160 292880 -46970 228266 221676 130737 -78431 311128 135072
12673 113094 119623 268970 138511 127791 -141421 162406 -166575 -1114 52613 -225178 -69441
$$ packed form
12753b33515D4756g913k68825A45195g0954A88294K4182F3619A92a30136o6502
12742a96638b1780A05842M8425k7085M5355h4518C4175b2416D36861A32677J95897
12731C28574A21364A8523J48827c61031F0672J19937E199N80047k65535a77802
12720b65850D40479h8697C75734a38245d9788b4195G4008a42491C02019F4713
12709b16099I391i77A81052O0883A04800a8222B42652g578j31311D77328h3666
12697A00113a69135B78380a48952C67309a10025n7182d0337A29489J04509a03200
12686f4209r657D8378c8216m944B92880d6970B28266o590r0939g8431C11128A35072
12673A13094O529J49347j30459j0720a41421A62406a66575a114E2613b25178f9441
$$ plain form
12661 63919 181229 -169331 42749 -354130 90472 -18928 385543 174185 39412 448182
12651 448182 473368 380210 85358 159794 140579 256610 175437 94523 -65377 -114223 -104996
12640 -104996 91736 150381 6487 -115381 194131 55601 109069 94240 191527 145493 64933
12628 16713 -139371 182241 163290 98780 122761 220841 192274 -102021 -103558 295360 224343
12617 224343 -261447 199368 -38822 -223604 -24496 263526 -84220 198283 54812 7226 -52962
12605 150595 30489 -150042 -16239 109050 230118 139744 142883 191702 179053 3480 359194
12594 359194 378873 153616 441863 34690 -176566 224782 403257 -181513 -50421 -132689
12584 -132689 4944 -279148 126104 -81554 12973 111018 35334 6388 238220 260493 425366
$$ packed form
12661F3919J17310a69331D2749c54130I0472a8928C85543A74185C9412M08770
12651D48182K5186r3158H5358P4436j9215J16031q1173q0914f5377m8846R227
12640a04996I1736N8645F487a15381A94131E5601N3468j4829R7287m6034F4933
12628A6713a39371A82241j8951o4510K3981R8080k8567a02021j537B95360p1017
12617B24343b61447A99368c8822j84782b4496B63526h4220A98283E4812G226e2962
12605A50595C0489a50042a6239A09050J21068r0374L139M8819j2649C480L55714
12594C59194J9679A53616K88247C4690a76566B24782J78475a81513e0421q2268
12584a32689D944b79148A26104h1554A2973R8045C5334F388K31832K2273J64873
$$ plain form
12573 425366 -82853 100072 65704 152109 258719 -508992 -241231 71864 -29497 30036 139168
12562 139168 -65998 7691 -127847 171760 76481 122351 75555 117637 99580 -20724 -33715
12551 -33715 -41515 -93480 -99909 -168068 93291 -431015 -5361 -78511 -169534 221180 99740 -72804
12538 -59167 -227267 -109463 7700 -28085 43675 113951 75830 -450595 188335 161763 82636
12527 82636 139709 159636 -140365 177362 8833 301516 -182378 321883 34951 86021 -272226
12515 173946 279619 98992 -245478 216359 -185621 80926 -165013 118523 100214 -19064
12504 188389 61287 61955 -239031 223716 272421 -59071 -135047 161997 -61259 -245185 100164
12492 152932 173864 137321 61183 56284 -178097 -111646 366401 -386259 46388 14321 1917
$$ packed form
12573D25366h2853A00072l4368Q6405J06610e08992b41231G1864b9497C0036J09132
12562A39168f5998G691a27847A71760G6481M5870m6796M2082j8057b0724j2991
12551c3715p800n1965o429o8159I3291d31015e361p3150r1023B21180I9740g2804
12538e9167j68100a09463G700b8085D3675P0276l8121d50595A88335k6572p9127
12527H2636N7073J9927a40365A77362H833K92683a82378C21883C4951N1070b72226
12515A73946J05673I8992b45478B16359a85621H0926a65013A18523j8309a9064
12504A88389F1287O68b39031B23716M8705e9071p5976A61997f1259j83926A00164
12492A52932K0932l6543F1183m899a78097O6451C66401c86259D6388A4321A917
$$ plain form
12480 130042 -73686 205667 -27105 -16463 -8478 105070 -106642 -46797 10824 107965 221863
12469 221863 -225000 199502 -109276 -17422 -184803 138515 -173553 306740 -95355 -7293
12458 62272 329045 177627 84142 -65089 12931 62430 -329306 -6615 282086 -126279 -109343
12447 -109343 206266 80641 100422 214413 -168833 126034 -169799 440285 138896 7592
12436 -271339 -48170 135490 -281316 -29452 -100697 -78119 -97834 83988 109739 214889 -206722
12424 10260 -105878 163144 112692 113968 -251492 362680 98174 -155065 -165977 -164906 -223115
12413 -223115 -165149 -97279 34509 -190247 -76668 -3224 104487 138553 -13170 229050 -40129
12401 -334906 -169906 145657 -236666 48717 80629 3240 24045 35852 -78302 74099 106030
$$ packed form
12480A30042g3686B05667b7105J0642P985A05070a06642d6797A0824R7141J13898
12469B21863b25000A99502a09276a7422j67381A38515a73553C06740i5355g293
12458F2272K66773j51418H4142f5089A2931M9499c29306f615B82086a26279J6936
12447a09343B06266H0641J9781J13991a68833A26034a69799D40285A38896G592
12436b71339d8170A35490b81316b9452p1245K2578j9715H3988K5751J05150b06722
12424A0260a05878A63144n0452J276b51492C62680I8174a55065j0912J071n8209
12413b23115N7966O7870C4509a90247g6668c224A04487L4066a3170B29050d0129
12401c34906J65000A45657b36666D8717L1912C240K0805J1807g8302G4099L1931
$$ plain form
12390 106030 304457 -118656 291552 -8534 -167683 213735 -72464 -125642 174252 -108817
12379 203137 266615 141287 452777 -277985 -65095 -17612 128769 -36141 28886 -141262
12368 -35269 -168422 28629 -89193 -141147 164763 -63599 14700 -173035 -323923 268414 35329
12356 48455 -29628 -142591 -184825 113894 -146357 -162557 -38695 24056 45075 288412 -139549
12344 169587 116612 169707 -105915 -5113 -56917 -221491 242721 64917 53763 -265332 43990
12332 -242740 -116007 90765 145063 -24755 -107477 -275287 -300542 157678 100124 102819 -80339
12320 267900 326316 -55692 195568 -192141 212380 82685 414294 5202 -247017 56841 -356243
12308 -215634 123936 64841 252292 206201 -80240 -140686 -82887 149598 20224 101965 101190
$$ packed form
12390A06030J98427a18656B91552h534j59149B13735g2464n3178A74252a08817
12379B03137O3478j25328L11490b77985f5095a7612A28769c6141B8886a41262
12368c5269j33153B8629h9193n1954A64763f3599A4700a73035j50888B68414C5329
12356D8455b9628j12963m2234A13894a46357j6200c8695B4056K1019K43337a39549
12344A69587n2975N3095a05915e113n1804j64574B42721F4917j1154b65332D3990
12332b42740a16007I0765N4298b4755q2722j67810k5255A57678n7554K695h0339
12320B67900N8416e5692A95568a92141B12380H2685L31609E202b47017E6841c56243
12308b15634A23936n9095J87451m6091h0240o0446N7799A49598B0224Q1741p75
$$ plain form
12297 101190 -30283 204589 290161 -222125 163365 13836 -22851 -204941 196680 316991
12287 316991 74072 232421 -115874 -22875 365827 -209868 379013 -244900 75164 79065
12277 79065 4994 147675 -45003 117962 4831 193299 -192093 351050 230379 190525 151427
12266 151427 -90034 101353 -98416 -223705 199912 177577 123037 109906 76495 -76452 258672
12254 -53657 62655 137792 97378 278989 196274 -50849 8705 92742 -183793 6444 -103604
12242 289217 -14876 -115272 7498 58106 368003 372648 50003 90835 227233 87942 213707
12231 213707 117093 -32418 156743 344822 6471 414355 237849 219125 -53160 143873 369942
12220 369942 111170 334774 96737 237262 -217159 -83369 -289867 207612 272579 345298
$$ packed form
12297A01190c0283B04589Q5572b22125A63365A3836b2851j82090A96680J20311
12287C16991G4072J58349a15874b2875C65827b09868C79013b44900G5164L901
12277G9065D994J42681d5003A17962D831J88468a92093C51050j20671l9854l9098
12266A51427i0034A01353i8416j25289A99912k2335n4540j3131l3411g6452B58672
12254e3657F2655P5137m0414J81611q2715e0849H705Q4037a83793F444a03604
12242B89217a4876j00396G498N0608L09897M645E0003M0832J36398H7942J25765
12231B13707r6614c2418A56743J88079F471M07884j76506j8724e3160A43873K26069
12220C69942A11170K23604I6737J40525b17159h3369k06498B07612O4967P2719
$$ plain form
12210 345298 257182 334648 229631 124068 181725 386157 364358 311531 315797 472473 183589
12198 -35214 99627 267000 -106615 239585 124268 530889 192704 468096 156611 183201
12188 183201 105169 111965 231860 -36967 -138754 33490 124179 -36504 136958 392076 -9596
12176 94180 -214637 356528 35437 165596 50946 92065 429742 99671 358954 183743
12166 183743 -81488 50807 -50793 354275 26215 187230 314219 50897 71616 -292957 -149081
12155 -149081 -48891 12005 -64833 -2891 23506 161556 -56092 -94102 358508 57368 -179221
12143 61276 121442 56173 -129890 1850 134699 -130792 279579 -360382 130049 392002
12133 392002 74241 490709 -145133 48871 10169 190280 -44993 -100177 412144 -277432
$$ packed form
12210C45298q8116P7466j05017j05563N7657K04432k1799n2827M266J56676A83589
12198c5214I9627J67373a06615B39585j15317M06621A92704K75392A56611K6590
12188A83201p8032O796J19895c6967j01787C3490R0689c6504A36958K55118i596
12176I4180b14637C56528C5437J30159E0946M1119L37677I9671K59283j75211
12166A83743h1488E0807e0793C54275B6215J61015J26989E0897K0719b92957J43876
12155a49081d8891A2005f4833b891B3506J38050e6092l8010C58508E7368a79221
12143F1276O0166E6173a29890A850J32849a30792B79579c60382A30049K61953
12133C92002G4241M16468a45133D8871A0169J80111d4993n5184D12144b77432
$$ plain form
12122 110043 -9284 -25691 -234880 -261860 -78620 91559 295369 100927 -56467 -19020 -150713
12111 -150713 -102023 -32220 -81511 -25670 69331 -2462 52435 252914 -115398 63696 -44612
12099 -80357 -283949 -55796 -254248 -15928 7857 -278169 87516 -174318 361941 -54669 332063
12087 217452 146144 -153545 -108595 -367671 -316367 275201 20663 -112513 -101889 -274275
12077 -274275 119384 64424 -76209 -358436 -20221 -22386 243233 323896 85157 891713 2223684
12066 2223684 962553 399622 96070 -89733 201278 50629 210489 91558 -34962 -151617
12056 -151617 167200 77834 80637 -181656 -273485 83037 -227557 -147216 63940 -146206 49927
12044 -19342 -407950 338587 14588 -218613 -156694 181627 220411 117083 69300 -150205
$$ packed form
12122A10043i284j6407k09189k6980g8620I1559K03810A00927e6467a9020j31693
12111a50713M8690c2220m9291b5670F9331b462E2435K00479a15398F3696d4612
12099h0357k03592e5796j98452a5928G857b78169H7516a74318C61941e4669C32063
12087B17452p1308a53545M4950k59076N1304B75201B0663a12513J0624j72386
12077b74275A19384n4960g6209k82227b0221k165B43233Q0663H5157Q06556J331971
12066B223684I62553C99622I6070h9733B01278E0629J59860I1558c4962j16655
12056a51617A67200G7834K803a81656r1829H3037b27557Q0341F3940a46206D9927
12044a9342l88608C38587A4588b18613O1919A81627L8784j03328m7783a50205
$$ plain form
12033 41738 -41723 32401 -178235 -209215 -66241 -232882 -23230 -419788 -16589 158932 159953
12022 159953 24892 -16549 4239 55581 38862 10803 265299 -68807 87951 141562 123371
12011 123371 -236364 -73973 -57874 -211246 -137389 394904 131252 27667 64704 160161 -15346
11999 -87295 28915 -89470 -212651 42255 6885 25416 67188 64974 -126777 135883 439999
11988 439999 12127 179662 93977 318974 8221 -168988 323736 73144 -315123 124770
11977 -152078 -17777 51596 -44387 -256768 67740 -197185 2248 20000 -25674 -288718 254869
11965 -150299 -373893 187409 -233 -289698 -194595 113852 -249670 159165 174634 -259832
11954 193746 3532 -37784 160354 -28739 -139573 -257864 -146128 28865 83958 -52019 -250471
$$ packed form
12033D1738d1723C2401a78235l0980f6241j66641b3230l96558a6589A58932J021
12022A59953B4892a6549D239N1342j6719A0803K54496f8807H7951N3611j8191
12011A23371b36364g3973J6099j53372P3857C94904A31252B7667L7037R5457a5346
11999h7295B8915h9470j23181D2255F885J8531M1772k214a26777A35883L04116
11988D39999A2127J67535q5685K24997H221a68988C23736G3144c15123A24770
11977a52078a7777E1596d4387k12381F7740a97185B248J7752b5674k63044B54869
11965a50299k23594A87409b33k89465R5103A13852b49670A59165J5469b59832
11954A93746C532c7784A60354b8739j10834j18291J11736B8865N5093e2019j98452
$$ plain form
11943 -250471 -91060 181030 8761 -77892 525430 -300796 -259016 -4562 89483 -42297 148145
11931 -152719 -60993 -47299 288561 52507 -150887 253487 -155529 94124 -83217 132383
11920 93893 317017 -88119 193268 -113077 -67957 -255134 -75154 129770 -186269 214163
11909 110850 92409 -220965 -7869 -168211 28813 200990 -118478 436484 34943 -141856
11898 56376 -220183 36611 -24832 -253039 318492 94359 -68021 -77660 -240420 -326840 -189806
11887 -189806 -175251 22440 -40624 -55707 -161186 222342 -136254 87338 6785 -234660 134322
11875 226399 -50645 23425 -84145 -206010 -168102 -119142 -196832 66604 -17378 -6926 -54288
11864 -54288 1149 -344239 30340 -242655 38312 89104 164915 -36189 -246164 -30359 74404
$$ packed form
11943b50471i1060A81030H761g7892E25430c00796M1780d562H9483d2297A48145
11931a52719f0993J3694B88561E2507a50887B53487a55529I4124h3217A32383
11920I3893K23124h8119A93268a13077M5120j87177g5154A29770a86269B14163
11909A10850j8441b20965g869j60342B8813J72177a18478D36484C4943a41856
11898E6376b20183C6611b4832k28207C18492I4359f8021r639j62760q6420J37034
11887a89806J4555B2440d0624j5083j05479B22342a36254H7338F785b34660A34322
11875B26399e0645B3425h4145j21865L7908M8960p7690F6604a7378f926m7362
11864e4288A149c44239C0340b42655C8312N0792P5811c6189k09975c0359G4404
$$ plain form
11852 15179 -278721 50072 178708 -19971 -210949 226005 -242773 -209249 -186542 -44552 495387
11840 185801 -121249 140895 -221270 -70929 -193542 -171278 -21481 86650 -31135 57097 213532
11829 213532 77912 -160689 226754 -190170 96518 84027 175656 -262298 -60908 180735
11818 -241174 -107943 72867 -298901 65096 60144 -129224 -116305 64870 -162795 -132224 117247
11806 -306449 -114923 127991 -230138 123116 -403978 -336621 46552 15024 212341 -11478
11795 -385569 57500 -4498 -315382 29041 -182135 -447713 -191670 -572 -46625 34857 -72318
11783 -38892 166748 -183752 14699 -103658 10043 -162532 -192587 243431 -111298 300542
11772 -264012 -175228 135828 79280 -40142 -22840 -169293 -164956 238938 -63925 -12175 272091
$$ packed form
11852A5179b78721E0072J28636a9971j90978B26005b42773L3524K2707d4552D95387
11840A85801a21249A40895b21270g0929j22613K2264b1481H6650c1135E7097J56435
11829B13532G7912a60689B26754a90170I6518j2491R1629b62298f0908A80735
11818b41174a07943G2867b98901F5096m952a29224J2919F4870a62795L0571A17247
11806c06449a14923A27991b30138A23116d03978O7357D6552A5024J97317a1478
11795c85569E7500d498l10884B9041a82135k65578a91670e72m6053C4857g2318
11783c8892A66748a83752A4699a03658A0043a62532l0055B43431a11298C00542
11772b64012Q8784A35828n6548d0142J7302j46453M337B38938f3925a2175B72091
$$ plain form
11760 -58449 -87982 160918 -189987 131275 -102403 335615 -173624 -386674 -31563 8512
11749 -21732 -164385 91642 57091 73794 -128361 -391023 410377 176790 127770 -50584 -165155
11738 -165155 254210 40243 95609 307056 422024 43698 -188576 -80200 354956 36778
11727 -135757 -158384 -37211 -350819 -207991 10068 -10227 292141 -64090 -277274 95029 -454830
11715 -57159 171187 -2113 181724 181886 -36629 246134 188235 160011 87341 -61664 357180
11703 -133086 -254353 -53307 1566 57979 -195594 -44959 63967 -32558 201721 -108816 -98038
11692 -98038 -179152 58165 75700 236122 -70160 -117029 212530 -3791 -108890 -64387 421372
11680 109018 123036 257097 -123239 161076 -43749 71907 -43293 -9495 43737 1475 202949
$$ packed form
11760e8449k9533A60918a89987A31275a02403C35615a73624k13050c1563H512
11749b1732j42653I1642l4551J6703a28361k62662D10377A76790m9020e0584j14571
11738a65155B54210D0243N5366K11447J14968D3698a88576h0200C54956C6778
11727a35757k2627c7211l13608J42828A0068a0227B92141f4090k13184I5029d54830
11715e7159A71187b113A81724J62c6629B46134n7899k8224p2670f1664C57180
11703a33086j21267e3307A566N6413a95594d4959F3967c2558B01721a08816J0778
11692i8038q1114E8165J7535J60422g0160m6869B12530c791j05099M4503D21372
11680A09018J4018J34061a23239A61076d3749G1907d3293i495D3737A475K01474
$$ plain form
11669 202949 -359553 39434 163312 -102072 287225 -33877 -150466 108173 246581 5537
11658 -139245 -139357 6711 872 472686 -23488 -166295 153072 100682 357889 62090 22670 24151
11646 24151 -183760 79621 45760 -11237 -152481 59211 -98680 105613 144448 -152066 97293
11634 -12762 -134563 72404 -152198 -54267 230470 71212 129068 -162077 -26639 49268 -207137
11622 221280 310008 -281470 105773 248700 -132419 68213 30242 108344 118476 77669 144229
11611 144229 -25417 299418 -193299 265964 -168806 61006 -170302 -43523 -218533 96689
11600 428153 156429 322591 -176595 61412 -160356 298057 368298 98354 -310366 -35777
11589 115323 -159318 19588 69657 454345 390412 31503 116120 65427 -72490 145769 291682
$$ packed form
11669B02949c59553C9434J23878a02072B87225c3877j16589A08173J38408E537
11658a39245j12F711H72M71814b3488j42807A53072n2390K57207F2090B2670J481
11646B4151a83760G9621l3861a1237j41244E9211i8680A05613L8835a52066I7293
11634a2762j21801G2404a52198e4267B30470G1212N7856a62077b6639D9268b07137
11622B21280Q8728b81470A05773J42927a32419F8213C0242P8102J0132m0807O6560
11611A44229b5417B99418a93299B65964a68806F1006a70302d3523j75010I6689
11600D28153A56429J66162a76595F1412a60356B98057P0241I8354c10366c5777
11589A15323a59318A9588N0069L84688o3933C1503Q4617n0693g2490A45769J45913
$$ plain form
11578 291682 3307 234808 -125381 120288 138404 105894 190896 -234916 -112958 248149
11567 151071 280101 14062 -227558 236159 177275 177424 -5837 186888 98932 19974 -271846
11555 91946 355443 83861 -287701 146958 2675 -42200 -355897 258627 78026 136472 -16744
11543 6388 -53766 136027 -47485 65300 32491 314320 96421 78418 454121 262672 422747
11532 422747 2582 12276 98668 93664 109941 -211242 78305 -124273 -189941 150134 -21221
11520 -99225 10671 274019 18974 -440091 -32170 -109525 -96510 187488 500272 259560 -295095
11508 201265 -243664 126862 251634 346206 92733 132615 232927 -2767 196578 148681 -120596
11496 88578 314395 -17022 -37193 39206 274174 -73147 121017 218199 185902 -10587 88111
$$ packed form
11578B91682C307K31501a25381A20288J8116l2510Q5002b34916a12958B48149
11567A51071J29030A4062b27558B36159n8884J49e837A86888q7956A9974b71846
11555I1946K63497H3861b87701A46958B675d2200l13697B58627G8026N8446a6744
11543F388e3766A36027d7485F5300C2491K81829I6421j8003L75703j91449J60075
11532D22747B582R694Q6392n004J6277b11242G8305a24273o5668A50134b1221
11520i9225A0671K63348A8974d40091c2170p7355J3015A87488L12784k40712b95095
11508B01265b43664A26862J24772R4572I2733L9882J00312b767A96578m7897a20596
11496H8578K25817a7022k0171C9206K34968g3147A21017R7182l2297a0587H8111
$$ plain form
11484 -48507 138946 -15226 36847 243854 26820 51369 128021 229758 283914 270533 -19028
11472 250958 121461 331733 150742 38369 7831 166651 39681 94874 407697 -148928
11461 417103 -113992 154368 97878 83579 374167 205366 -26279 302607 -18147 317670
11450 169503 -20113 135347 64942 -142299 1653 -48487 44581 388836 -178755 -76631 299725
11438 291314 211477 109818 109382 9718 35702 35220 -42247 63966 -71815 289321 -186567 -125057
11426 -125057 -400509 13326 -134294 -76961 82197 194306 292852 -138996 330186 -144167
11415 -139850 276780 -126386 -237131 -36455 22807 30583 91726 -39414 -262843 -67739 282820
11403 -78867 205981 -10110 182796 -97913 -299285 -315465 -52627 97303 -195729 249495 179552
$$ packed form
11484d8507A38946a5226C6847K07007B6820K4549P6652J01737N4156j3381a9028
11472B50958A21461K10272A50742C8369G831J58820C9681N5193L12823a48928
11461D17103a13992A54368n6490j4299K90588j68801b6279C02607a8147C17670
11450A69503b0113A35347F4942a42299A653d8487D4581L44255a78755g6631B99725
11438B91314p9837j01659m36I718K5984m82d2247F3966g1815B89321a86567O1510
11426a25057k75452A3326a34294N7333H2197J12109R8546a38996C30186a44167
11415a39850B76780a26386j10745c6455B2807P776O1143c9414k23429f7739B82820
11403g8867B05981a0110A82796i7913k01372j6180e2627I7303a95729B49495o9943
$$ plain form
11392 179552 -109891 363085 136902 -285098 -151654 -110799 299953 -125398 -179467 -202766
11382 -202766 129222 -116990 -163794 170140 -71893 224183 -165529 -335870 213863 104047
11371 -27173 21151 417994 265035 -138696 -177145 33210 158929 166747 -136906 -63555 23038
11359 -146258 107780 29562 -167037 -138518 -111566 -24696 -181477 -376216 -46635 -231121
11349 -231121 78149 82684 -153319 95802 -182374 -281917 -59092 12017 -157906 252105 25217
11337 -168578 -255240 112070 -189520 333205 -41671 214427 139251 -56603 -306903 -140070
11326 46236 -245897 -163030 -282432 222848 177817 -143729 112374 166340 -179499 59904
11315 -23476 -124306 -43399 65776 303753 261830 32914 -112421 -212478 283099 72228 26269
$$ packed form
11392A79552a09891C63085A36902b85098J33444M0855B99953a25398n4069k3299
11382b02766A29222a16990m6804A70140g1893B24183a65529j70341B13863A04047
11371b7173B1151L96843j52959a38696l8449C3210J25719P818a36906f3555B3038
11359a46258A07780B9562a67037K8519K6952b4696j56781j94739d6635j84486
11349b31121G8149M535a53319I5802a82374r9543e9092A2017a57906B52105B5217
11337a68578q6662A12070a89520C33205d1671B14427p5176e6603k50300a40070
11326D6236b45897Q2867j19402B22848m5031a43729A12374N3966a79499E9904
11315b3476j00830d3399F5776K37977m1923C2914a12421j00057B83099G2228B6269
$$ plain form
11303 27546 -124635 -257498 -297150 -177191 -159728 -66967 -16125 -58026 153683 -179105 123799
11291 257068 92391 300813 -133238 -248442 199598 2581 -64036 -12015 132106 -19092 -45931
11280 -45931 -202418 -24569 -284031 -57279 -73439 -129277 -80362 206074 -173714 -25783 162139
11268 93191 -156835 -112998 19256 234133 -382555 -108940 -210914 -64537 -125506 -57966 -228825
11257 -228825 6786 27206 -65726 -48349 42433 497344 -236201 -80511 261103 -77850 -255193
11246 -255193 -268418 254901 -298442 196735 -134981 -199571 -190806 25075 13897 -427978 -276171
11235 -276171 53913 -352844 160425 -23589 25461 -93163 -36293 -42200 -188495 292800 -113511
11223 292207 -27547 -110116 98138 -274980 86772 58543 89746 143411 77844 174787 -138357
$$ packed form
11303B7546a24635j32863l9652J19959J7463f6967a6125m1901A53683a79105A23799
11291B57068I2391K08422a33238j15204A99598B581f4036a2015A32106a9092k6839
11280d5931j56487b4569k59462e7279j6160n5838M8915B06074a73714b5783A62139
11268I3191a56835M3837A9256K14877c82555a08940j01974f4537o0969e7966j70859
11257b28825F786K0420f5726J7377D2433M54911b36201h0511B61103g7850j77343
11246b55193j3225B54901b98442A96735a34981o4590Q765B5075j1178d27978J51807
11235b76171E3913c52844A60425b3589B5461i3163c6293n907j46295B92800a13511
11223B92207b7547q2569I8138b74980H6772k8229L1203N3665o5567R6943a38357
$$ plain form
11211 -265681 -186838 -87310 -333917 -260322 -372863 -135243 103030 -125415 -133353 -136467 -168106
11200 -168106 140644 -277056 9436 -76991 3868 32214 -217207 105176 -158371 71766 249560
11189 249560 137307 -23386 125131 -279655 -177 71610 -115997 -134940 -222161 207268 -36897
11177 -87611 16123 -52504 90084 265240 -205861 195544 18085 -215807 12884 -174823 169268
11165 -79667 103350 113847 -117163 -140746 -179844 -193919 -12078 -245018 232920 69982 -212754
11153 15179 50488 -22869 -291085 2521 -5825 -207438 -179511 -181870 230739 -59950 -267612
11142 -267612 -88348 240109 -27848 -148239 -45647 39314 12891 271842 149102 60401 314582
11131 314582 205864 164668 108475 15968 19531 34824 -206825 89321 82903 48269 329719
$$ packed form
11211b65681P8843h7310k46607P3595j12541a35243A03030a25415p938l114l1639
11200a68106A40644b77056I436g6991C868K8346b17207A05176a58371G1766J77794
11189B49560j12253b3386A25131b79655a77G1610a15997j8943q7221B07268c6897
11177h7611A6123e2504I0084J75156b05861A95544A8085b15807A2884a74823A69268
11165g9667A03350J0497a17163k3583l9098j4075a2078k32940B32920F9982b12754
11153A5179L5309b2869k68216B521e825k01613K7927k359B30739e9950k07662
11142b67612h8348B40109b7848j20391d5647C9314A2891K58951j22740F0401K54181
11131C14582j08718m1196n6193A5968L563J5293b06825H9321o418l4634K81450
$$ plain form
11120 329719 -117863 23895 -205642 276182 -321848 -269275 9772 46182 31291 -145739 -170362
11109 -170362 200411 191709 195148 58117 177108 301737 158528 345310 216573 -45032 -104697
11098 -104697 372866 148413 386795 324162 76071 -146560 437433 207868 193836 478710
11088 478710 70187 118481 -140293 121372 306418 218781 -4027 261836 -20800 329821 394729
11077 394729 59008 371344 129658 -24982 122314 113203 265070 73013 215046 242380 193431
11066 193431 595357 324431 452321 168221 294693 470324 540112 855414 611313 567962
11056 567962 509182 599601 801297 662958 877757 881932 943586 701969 417281 790275
11046 790275 720043 1149633 726489 734624 698742 1118794 636334 975123 503988 801887
$$ packed form
11120C29719a17863B3895b05642B76182c21848N2573I772L6410j4891a45739k4623
11109a70362B00411q702L439E8117J18991J24629j43209J86782j28737d5032n9665
11098a04697C72866A48413K38382o2633G6071a46560D37433B07868j4032K84874
11088D78710G0187M8294a40293A21372J85046q7637d027B61836b0800C29821O4908
11077C94729E9008L12336A29658b4982A22314r111J51867G3013J42033K7334m8949
11066A93431M01926k70926J27890A68221J26472J75631O9788L15302k44101m3351
11056E67962n8780R0419K01696j38339K14799M175O1654k41617k84688L72994
11046G90275p0232M29590m23144Q135l5882M20052m82460L38789m71135K97899
$$ plain form
11036 801887 1036913 498418 792373 516800 1144610 658396 998177 925980 592891 658358
11026 658358 929781 841058 620717 893700 827688 578407 503368 802162 595471 511193
11016 511193 764264 452608 773438 421542 414497 340520 617217 626301 443309 334496
11006 334496 293572 724016 670272 552587 430823 587268 851347 213051 701815 868821
10996 868821 737551 370024 739766 901085 552201 749454 803290 619189 895688 396293
10985 868084 1125691 1021366 775998 1018806 1357352 1125424 1338503 1527601 1883266 2169425
10975 2169425 2116447 2412903 2970143 2925166 2658421 2920498 2861233 2646315 2309523 1808029
10965 1808029 1962204 1725190 1904570 1857359 2001952 2057068 2001517 1802789 1968814 1932756
$$ packed form
11036H01887K35026D98418K93955k75573O27810m86214L39781p2197l33089O5467
11026F58358K71423q8723k20341K72983o6012k49281p5039K98794k06691q4278
11016E11193K53071l11656L20830l51896p045p3977K76697R084j82992j08813
11006C34496m0924M30444n3744j17685j21764J56445K64079B13051M88764J67006
10996H68821j31270l67527L69742J61319l48884J97253N3836j84101K76499C96293
10985H68084K57607j04325k45368K42808L38546k31928K13079J89098L55665K86159
10975B169425n2978K96456N57240m4977k66745K62077n9265k14918l36792n01494
10965A808029J54175k37014J79380m7211J44593N5116n5551j98728J66025l6058
$$ plain form
10955 1932756 1783311 2073364 1405458 1248198 818309 893110 815713 693155 451351 396238
10945 396238 172910 430172 96014 452329 184441 288921 83264 -3487 266825 222067
10935 222067 241382 313650 324275 142422 -255844 22182 243133 161125 51288 104994 -9309
10923 175494 70365 42209 -4936 7200 -252315 148979 -363973 7308 -22242 38306 -30520
10911 -113375 60472 -211812 -315487 370950 7091 -107412 24543 -22425 66903 87249 237008
10900 237008 135852 -152914 330838 156315 68830 83146 193696 -295173 231154 -64489
10889 -159091 -45750 -91452 76693 45649 -131721 -262035 -55386 52647 10100 -24276 -80160
10878 -80160 64776 -139342 53522 -95573 148456 106791 -75236 140905 112350 -167651 161097
$$ packed form
10955A932756j49445K90053o67906j57260m29889P4801p7397j22558k41804n5113
10945C96238A72910K57262I6014L56315A84441J04480H3264c487B66825m4758
10935B22067J9315P2268J0625A42422b55844B2182K20951q2008E1288N3706i309
10923A75494G0365k8156d936G200b52315A48979c63973G308b2242C8306c0520
10911a13375F0472b11812j03675C70950G091a07412B4543b2425F6903K0346J49759
10900B37008j01156a52914C30838A56315F8830J4316J10550b95173B31154f4489
10889a59091d5750m5702G6693l1044a31721j30314e5386E2647A0100b4276n5884
10878h0160F4776a39342E3522i5573A48456m1665g5236A40905k8555a67651A61097
$$ plain form
10866 182427 -407480 -164445 32295 100844 22693 -38063 -18920 -155078 38637 246896 180512
10855 180512 -94897 78894 67092 -212403 92179 -131449 -133051 -76152 -133976 318083 32808
10843 191795 156188 -112474 35498 388174 105485 28649 -274860 -70630 -443481 88614
10832 -57667 -265335 -382869 -24189 257957 334328 -51671 -163012 -188945 -171057 -55086 -47988
10821 -47988 28716 -248437 137106 -129868 -24899 -181796 84958 33495 -55575 116801 42169
10809 -140123 -212000 -128588 -116522 -78021 -283065 83635 169881 11032 265425 146700 -102064
10797 284944 9952 105182 11366 13529 -250465 154004 -222296 -63370 -232749 -4131 -231656
10786 -231656 -602399 205830 -264297 -181719 -63717 -59726 -184460 97819 95970 2287 134771
$$ packed form
10866A82427d07480a64445C2295O8549B2693c8063a8920j36158C8637K08259o6384
10855A80512i4897G8894j1802b12403I2179a31449j602N6899n7824C18083C2808
10843A91795l5607a12474C5498L52676A05485B8649b74860g0630l72851H8614
10832e7667k07668j17534b4189B57957P6371e1671j11341k5933J7888e5086P098
10821d7988B8716b48437A37106a29868b4899j56897H4958C3495e5575A16801D2169
10809a40123p1877Q3412J2066L8501k05044H3635Q6246A1032K54393j18725a02064
10797B84944I952R5230A1366K163b50465A54004b22296f3370j69379d131k27525
10786b31656l70743B05830b64297Q2578f3717L991j24734I7819j849B287J32484
$$ plain form
10775 134771 -209565 92012 38763 -207282 -95333 54841 -28397 -1728 -14001 -176382 -65369
10763 1302 68024 -36277 190551 -184507 -35824 223965 43933 -63060 -39273 -232655 -296217
10752 -296217 -21702 269100 -347945 -119010 -194094 -49898 1584 177723 -162310 -351986
10742 -351986 -162596 3705 40919 93594 -438785 -208790 63995 -248679 -214712 158819 40057
10730 -77116 4221 4413 -320673 -153260 161083 -130611 -117455 -51428 -19448 -136544 283854
10718 77237 -804 45642 18354 -24131 -171041 149877 169543 -424026 -159938 109657 -476616
10706 -64806 -177982 -80141 -231635 73318 -91557 -369040 48020 -410267 -160031 -46254 -352804
10695 -352804 3247 -92710 -452543 -28870 -80131 -502475 125032 -117137 -484249 128447
$$ packed form
10775A34771b09565I2012C8763b07282i5333E4841b8397a728j2273j62381f5369
10763A302O6722c6277A90551a84507c5824B23965D3933f3060K3787j93382o3562
10752b96217b1702B69100c47945a19010p5084d9898A584J76139a62310j89676
10742c51986a62596C705L7214N2675d38785b08790F3995b48679L3967A58819D0057
10730g7116D221J92c20673a53260A61083a30611J3156e1428a9448j17096B83854
10718G7237h04D5642A8354b4131j46910A49877J9666d24026a59938A09657d76616
10706f4806j13176h0141j51494G3318i1557k77483D8020d10267a60031d6254l06550
10695c52804C247i2710l59833b8870n1261m22344A25032a17137l67112A28447
$$ plain form
10684 15727 -68470 -299771 146713 -117596 -333328 -177496 15037 30030 159556 141613
10674 141613 -217686 37419 -51740 133297 -16681 215742 -31269 45744 11396 104097 131361
10663 131361 -211606 -86793 -158796 31391 8940 -22437 155143 -140571 -243524 -287154 2376
10651 42917 -151119 -82756 94909 -39051 -26570 27932 -104515 201226 -364214 21373 173600
10640 173600 -337125 -6765 217473 142815 228128 317568 -59751 -408674 -151086 -355557 -108361
10628 172903 -24085 126378 186637 -261244 -56452 80237 -32306 -33021 -47288 -138757 -311823
10617 -311823 -6392 -292325 153769 70336 -133091 -165431 -292030 -71696 117633 -91212 47980
10605 20644 164862 -46898 106345 -269120 -198233 376823 9622 49115 -89970 -159013 11560
$$ packed form
10684A5727f8470k31301A46713a17596k15732J55832A5037J4993J29526j7943
10674A41613b17686C7419e1740A33297a6681B15742c1269D5744A1396R2701K7264
10663A31361b11606h6793p2003C1391H940b2437A55143a40571j02953m3630B376
10651D2917a51119O8363I4909c9051J2481B7932a04515B01226c64214B1373J52227
10640A73600c37125f765B17473p4658Q5313Q9440e9751l48923a51086k04471a08361
10628A72903b4085A26378O0259b61244e6452H0237c2306p15j4267r1469j73066
10617c11823f392k85933A53769G0336a33091l2340j26599g1696A17633i1212D7980
10605B0644J44218d6898A06345b69120P0887C76823I622L9493h9970o9043A1560
$$ plain form
10593 84712 -4927 41729 193406 -15524 -270133 -19992 9277 -142675 -122439 -255348 154113
10581 236280 -119092 -114283 147222 -332890 -166303 -89314 190714 -198766 149952 -258936
10570 200828 206865 323192 68014 -287157 -2293 -128974 -93580 -36788 -72491 -34587 60367
10558 34836 -1150 55690 -276279 -35267 33665 141897 -207612 -97513 96850 -315954 210889
10546 -82749 31160 105874 226881 13093 -252603 -240152 -395162 191270 270221 -154236 -172459
10535 -172459 167220 -164110 -12465 -217221 -48217 -236175 -127982 170871 -154095 172213
10524 -102426 -310459 -296396 -17449 206610 -146649 -131153 -432027 -177084 -14011 -129598
10514 -129598 -308887 109412 -417071 24902 5124 -339299 191240 -17798 147439 151978 -160212
$$ packed form
10593H4712d927D1729J51677a5524k54609a9992I277a42675K0236j32909A54113
10581B36280a19092M809A47222c32890a66303P6989A90714a98766A49952b58936
10570B00828O037J16327F8014b87157b293j26681L5394c6788l5703c4587F0367
10558C4836a150E5690b76279c5267C3665J08232b07612i7513I6850c15954B10889
10546h2749C1160P4714J21007A3093b52603J2451j55010A91270P8951a54236j8223
10535a72459A67220a64110a2465k04756d8217j87958J08193A70871a54095A72213
10524a02426k08033J4063a7449B06610a46649J5496l00874a77084a4011j15587
10514a29598j79289A09412d17071B4902E124c39299A91240a7798A47439M539a60212
$$ plain form
10502 25073 -346666 213964 -98233 178806 -107093 -347806 -8743 -10807 -104818 39360 256045
10491 256045 -145998 183855 -245015 334503 210384 47524 252050 82159 3821 113094
10481 113094 338393 101207 532153 -159178 124822 66531 -105711 -88086 133077 -184323
10470 19340 -662658 -239109 3137 201818 -140676 93344 47199 -168093 -86349 6074 -117991
10458 -98693 282547 -293587 -291463 236899 99688 -110741 -54008 169790 52836 3054 -198481
10446 -175016 -207338 3998 322997 110843 -210789 3405 -104832 223501 -253840 -411576
10436 -411576 -7427 -165758 -26984 264082 -102430 -292007 -172288 -25753 -34791 142075 -227144
10424 -162119 174492 -62822 -167432 -45224 -318257 307655 188484 -413508 -190134 -23460
$$ packed form
10502B5073c46666B13964i8233A78806a07093k40713h743k064r4011C9360K16685
10491B56045a45998A83855b45015C34503j24119D7524K04526H2159C821J09273
10481A13094K25299A01207M30946a59178A24822n8291a05711J7625A33077a84323
10470A9340f62658b39109C137J98681a40676I3344m6145a68093Q1744F074a17991
10458i8693B82547b93587K124B36899I9688a10741e4008A69790E2836C054a98481
10446a75016l2322C998L18999A10843b10789C405a04832B23501b53840j57736
10436d11576g427j58331b6984B64082a02430j89577J19719b5753r038A42075b27144
10424a62119A74492f2822j04610d5224k73033C07655j19171d13508a90134b3460
$$ plain form
10413 -166831 366662 172803 -12074 310776 117449 -141122 360800 237149 -264440 -38965
10402 -223462 -201550 59659 41300 -390632 -163514 79967 -10941 337229 246677 154357 216223
10391 216223 226436 52486 287076 -72601 -96095 -29158 46437 203412 23252 62122 154300
10380 154300 147728 379130 1847 192576 211975 235147 280416 328608 80806 261836 264646
10369 264646 125641 135947 362907 240653 448487 288074 397809 513330 179081 185578
10359 185578 231490 -116144 391250 85362 93143 272116 360794 69000 338107 674475 344437
10348 344437 551784 546760 260160 127727 557083 365427 351449 339947 593246 410805
10338 410805 213752 417419 -39024 243993 84291 368097 512614 95125 224240 -16190
$$ packed form
10413a66831C66662A72803a2074C10776A17449a41122C60800j23651b64440c8965
10402b23462K1912E9659j8359c90632a63514G9967a0941C37229r0552r2320O1866
10391B16223J0213E2486K34590g2601k3494b9158D6437J56975B3252L8870R2178
10380A54300o572K31402A847J90729J9399K3172M5269M8192H0806J81030K810
10369B64646A25641J0306K26960j22254K07834j60413J09735J15521A79081O497
10359A85578M5912a16144C91250H5362P781J78973Q8678F9000K69107L36368l30038
10348C44437K07347n024B60160A27727M29356j91656j3978j1502K53299j82441
10338D10805j97053K03667c9024B43993H4291K83806J44517I5125J29115a6190
$$ plain form
10327 65947 198454 106480 274916 50440 298545 -161591 380326 -65569 198363 -65272
10316 -211277 -327474 169434 61427 13170 337460 50033 36268 316149 -143242 -39091
10305 -157963 -80326 24973 120799 257891 -211183 -25004 -248331 -199394 92855 -345557 -95961
10293 344984 440936 -201102 -151028 -288345 -108978 -147103 -64957 7717 -149805 92674 -755
10281 77924 -156132 208106 120731 -143553 75812 -15179 -134213 -32265 255142 -359813
10270 -126287 296417 19516 -390551 31804 -273303 -2238 45276 290889 -25917 298448 -157876
10258 156354 220986 475715 -21907 444447 122677 208242 -3594 171413 65612 -214535 105915
10246 -64571 -13671 -67395 -245946 -43246 -403644 -122938 72821 -98908 -164300 -99297 -312201
$$ packed form
10327F5947J32507r1974J68436E0440K48105a61591C80326f5569A98363f5272
10316b11277j16197A69434F1427A3170L24290E0033j3765K79881a43242c9091
10305a57963P7637B4973R5826J37092b11183b5004k23327M8937I2855c45557i5961
10293C44984R5952b01102N0074j37317a08978l8125f4957G717a49805I2674g55
10281G7924a56132B08106q7375a43553G5812a5179j19034c2265B55142c59813
10270a26287B96417A9516c90551C1804b73303b238D5276K45613b5917B98448a57876
10258A56354O4632K54729b1907D44447A22677Q5565c594A71413F5612b14535A05915
10246f4571a3671n3724j78551d3246l60398a22938G2821i8908o5392O5003k12904
$$ plain form
10235 -312201 -46771 -284812 46480 194492 97449 202009 -368129 173619 -148331 26894
10224 17043 -20830 -202302 -179447 83919 -192010 -109427 16934 -159649 61148 -191254 67962
10212 -98495 21591 169256 89372 39707 47041 -18218 99471 -46774 -193976 91031 198457
10201 198457 -53647 -185960 15225 -134214 147438 332172 -131766 -6579 -103634 -15638 156962
10189 -105128 -176604 5099 -317048 -286580 -53007 -56681 -119274 139670 50329 111874 -13236
10177 -179428 -17768 -171151 69626 29629 -150978 -60672 -211136 -176255 -314535 -98473 -205961
10166 -205961 109446 184981 136804 51495 -408973 198848 -25539 -136084 -60995 12530 144149
10155 144149 103272 -97121 186372 33929 -417161 59169 -365486 286620 -54392 123998
$$ packed form
10235c12201d6771k38041D6480J48012r7043J04560c68129A73619a48331B6894
10224A7043b0830j81472K2855H3919a92010Q2583A6934a59649F1148a91254F7962
10212i8495B1591J47665p9884C9707P334a8218I9471d6774j47202I1031J07426
10201A98457e3647j32313A5225a34214A47438J84734a31766f579r7055a5638A56962
10189a05128p1476E099c17048L0468e3007l674o2593A39670E0329O1545a3236
10177a79428a7768j53383F9626B9629a50978f0672j50464L4881j38280i8473j07488
10166b05961A09446P5535m8177E1495d08973A98848b5539j10545f0995A2530J31619
10155A44149m0877i7121A86372C3929d17161E9169c65486B86620e4392A23998
$$ plain form
10144 -396786 95632 365045 -152156 205761 -138691 -29381 203901 -56405 127533 -76250
10133 64305 -89633 -93469 -39172 9438 -30640 -320855 -24512 20051 -187401 -276783 -65255 -7522
10120 34532 10126 135043 -365633 -41608 86487 -91223 -299699 23188 73600 -137758 31262
10108 -307985 -238230 -409195 -69501 -148659 1006 -121206 151494 311866 141863 -114986
10097 -197529 84419 47748 130077 -112602 27952 43405 -26968 -64848 140607 -289796 7546
10085 -82524 228252 -139410 -182056 237131 -161469 -279041 -317962 -366733 86696 -216827
10074 17606 216562 231808 -489061 224120 -86302 174452 -379957 -135931 -94129 125054
10063 -283776 -86304 -180405 -44017 54603 -39446 54394 -272291 17631 -113347 -206803 119904
$$ packed form
10144c96786I5632K69413a52156B05761a38691b9381B03901e6405A27533g6250
10133F4305h9633l836c9172I438c0640k90215b4512B0051a87401q9382f5255g522
10120C4532A0126J24917c65633d1608H6487i1223k08476B3188N0412a37758C1262
10108c07985O9755j70965f9501p9158A006a21206A51494J60372A41863a14986
10097a97529H4419l6671Q2329a12602B7952J5453b6968l7880A40607b89796G546
10085h2524B28252a39410m2646B37131a61469j17572l8921m8771H6696b16827
10074A7606J98956J5246d89061B24120h6302A74452c79957a35931M1802A25054
10063b83776h6304r4101d4017E4603c9446E4394b72291A7631a13347r3456A19904
$$ plain form
10051 21871 -17910 -102686 -135439 -36485 -264389 115761 -319503 79516 -230837 114275 -120129
10039 -215754 88190 321976 187071 -298093 -121738 117847 -168093 109305 39439 -7768
10028 -227996 -248498 -15065 -149993 70150 -304862 78171 -143955 -234195 241438 254024 98831
10016 -183525 163233 68326 -61422 -487766 -455031 -16255 43627 -37633 -11574 -67574 -133189
10005 -133189 54239 -164278 -366171 -210060 -145596 -99165 10844 -166907 -84846 -259783
9995 -259783 277540 -157148 -66842 -134482 -120315 27924 -89486 -228330 -15918 -141852 -31722
9983 45379 -123836 -98396 -8680 289227 -161866 -230986 127112 -162596 71787 59308 -188861
9971 13227 -73299 352057 418366 -257363 -478695 120669 -128756 -44807 -268495 -128753
$$ packed form
10051B1871a7910q4776l2753c6485k27904A15761c19503G9516b30837A14275a20129
10039b15754H8190K33786j34905b98093a21738A17847a68093A09305C9439g768
10028b27996k0502a5065j34928G0150c04862G8171a43955r0240B41438J2586I8831
10016a83525A63233F8326f1422m26344L2735a6255D3627c7633a1574n6000o5615
10005a33189E4239a64278k01893J56111O4464M6431A0844a66907Q2061j74937
9995b59783B77540a57148f6842o7640J4167B7924h9486j38844a5918j25934c1722
9983D5379a23836K5440h680B89227a61866o9120A27112a62596G1787j2479a88861
9971A3227g3299C52057O6309b57363k21332A20669a28756d4807k23688a28753
$$ plain form
9960 225174 -237224 -16187 -159491 -140906 -135029 -94090 17304 20421 -482509 -98093 -12841
9948 -184374 -250182 -53077 -118209 -260191 -18169 215055 35657 9987 -174488 -31317 58247
9936 -85064 -16023 19723 3842 -22194 -137008 -258231 -199343 44080 81723 -42070 2101 -356783
9923 -89351 -223321 202722 -108230 -195676 -71245 -143401 265359 -274007 -106846 -67654 -126924
9912 -126924 -47813 -408383 -233989 -139460 -5659 190154 -251328 -17417 25792 -51626 -312519
9901 -312519 -24072 71950 -272485 -244090 -20039 -151070 -98237 128486 -157266 -25372 133601
9889 173727 -36385 168562 94039 -82023 -6043 -79807 -66083 -43253 34831 59214 -139814
9877 -140910 -117868 -322823 -8133 -111700 -227780 127791 -150376 -37176 -16324 -236671 -189473
$$ packed form
9960B25174b37224a6187j43304J8585N877M0939A7304L117d82509i8093a2841
9948a84374o5808e3077o5132j41982a8169B15055C5657I987a74488c1317E8247
9936h5064a6023A9723C842b2194j14814j21223N8888D4080L7643d2070B101c56783
9923h9351j33970B02722a08230q7446g1245p2156B65359b74007a06846L9192n9270
9912a26924d7813l60570J74394R4529e659A90154b51328a7417B5792e1626k60893
9901c12519b4072G1950b72485K8395b0039j31031N2833A28486a57266b5372A33601
9889A73727c6385A68562p4523h2023f043p3764J3724K2830C4831K4383a39814
9877a40910K3042k04955h133j03567j16080A27791a50376c7176a6324k20347M7198
$$ plain form
9866 -189473 -91440 156211 -118475 -269743 32587 -183386 137478 101362 -115620 283657
9855 -165193 -189467 16184 37912 220354 46089 -266150 71635 65323 -130968 -13920 -203201
9844 -203201 246921 60518 154028 96958 -265586 -237259 -98591 -94501 -161225 -290782 167803
9832 303161 -176467 -120246 -239255 9397 76002 -174071 141129 -458011 -15708 -3999 -101350
9821 -101350 132003 -223688 11199 -5492 -132673 -372709 -461737 -123583 223043 -218597
9810 147132 65860 -167647 19067 -72676 273550 -396828 -39893 -379226 -309753 -122882 245216
9798 -88385 -234560 -252335 -220564 -169778 162870 -120243 -110601 -118879 261098 -114241 -74048
9787 -74048 154630 103148 -124652 -133521 109039 -33120 87087 92799 -68217 -158192 -56886 -347229
$$ packed form
9866a89473i1440A56211a18475j51268C2587a83386A37478l6116a15620B83657
9855a65193k4274A6184K1728J82442D6089b66150G1635o312a30968a3920j89281
9844b03201B46921F0518R3510n7070b65586K8327i8591M090o6724j29557A67803
9832C03161a76467N6221j19009I397O6605a74071A41129d58011a5708c999r7351
9821a01350A32003b23688A1199e492j27181k40036q9028a23583B23043b18597
9810A47132F5860a67647A9067g2676B73550c96828c9893l39333O9473a22882B45216
9798h8385j46175j7775L1771N0786A62870a20243R642q278B61098a14241M0193
9787g4048A54630n1482a24652q869A09039c3120H7087N712f8217q9975e6886k90343
$$ plain form
9775 -347229 -157640 298160 6530 -125159 181717 -70151 -75910 -93355 -112933 36477 -102831
9763 -85858 121625 -59743 -37772 -5326 55236 6954 250341 248197 -10430 -274714 -132614 -115091
9751 -115091 15489 -450346 -189533 -239384 84837 255836 -173717 -97301 20277 -183315 -49297
9739 129523 -31365 -410023 -133321 74644 -155028 15387 -116863 175933 62730 1251 -219512
9727 -134602 -58646 12945 171728 -414194 104002 -333536 25106 105471 -235252 -273340 -88405
9715 17978 40987 -291373 -104654 -142271 -151205 -59038 136691 47331 -270151 -30387 23370
9703 297104 284592 -2517 -201360 -157264 -224507 309161 -66643 46090 -142440 -314371 -84416
9691 -26415 50026 -394990 -262589 148991 -135112 -188109 14496 -162095 144304 -20615 31805
$$ packed form
9775c47229a57640B98160F530a25159A81717g0151n759j7445j9578C6477a02831
9763h5858A21625e9743K1971e326E5236F954K43387k144a0430k64284a32614J7523
9751a15091A5489d50346a89533m9851H4837J70999a73717P6416B0277a83315d9297
9739A29523c1365l78658a33321G4644a55028A5387a16863A75933F2730A251b19512
9727a34602e8646A2945J58783d14194A04002c33536B5106Q0365b35252l8088h8405
9715A7978K3009b91373a04654l7617q934e9038A36691D7331b70151c0387B3370
9703B97104j2512b517j98843M4096o7243C09161f6643D6090a42440j71931h4416
9691b6415E0026c94990J32401A48991a35112n2997A4496a62095A44304b0615C1805
$$ plain form
9679 25058 -50314 -50865 -66558 -42255 5236 126233 -25028 -327498 -111078 150887 -71400 66599
9666 135190 -32223 2612 -261400 103421 -100337 -141943 -215359 -12510 -272897 -307938 -37176
9654 -74224 -131039 11136 -34696 -80708 -101805 -88434 76658 2306 -159832 -88433 -261304 -335167
9642 -335167 -136259 -142931 -140214 -66979 -83186 73944 -193067 -291122 67915 -303565 -271831
9631 -271831 77451 57741 121589 -469292 -115347 -210715 25661 -160177 -52126 -182382 200354
9619 -196433 -192836 193769 -137292 169151 -63394 -151376 -268937 88677 -178942 36739 -65785
9607 -232198 -348038 92206 -268026 33977 -49122 -289048 -133541 -263919 8797 -437126 -148101
9595 -245166 36986 -106572 -195142 -155850 -189008 45353 -204832 -226494 -348492 88893 -121676
$$ packed form
9679B5058e0314n51j5693K4303E236J20997b5028l02470a11078A50887g1400F6599
9666A35190c2223B612b61400A03421a00337m1606p3416a2510k60387l5041c7176
9654g4224n6815A1136c4696m6012k1097J3371G6658B306a59832P1399j72871p3863
9642c35167a36259o672K717f6979j6207G3944a93067r8055F7915c03565L1734
9631b71831G7451j9710O3848d69292a15347r5368B5661a60177e2126j30256B00354
9619a96433L597A93769a37292A69151f3394q7982j17561H8677a78942C6739f5785
9607b32198j15840I2206b68026C3977d9122k39926a33541j30378H797d37126a48101
9595b45166C6986a06572q8570L9292l3158D5353b04832k1662j21998H8893a21676
$$ plain form
9583 -212934 -96774 -15540 72741 -213726 -428108 -201641 92065 187445 -196625 -91405 301826
9571 -101671 -202799 -14689 323891 -269241 -45140 -185538 120602 -154363 83928 20902
9560 52269 -57753 -56307 -139433 -49665 86287 -154684 92958 -93568 -180423 -203359 -256841 -293646
9548 -293646 73773 -9763 -79865 41421 -265341 -201446 -199895 120282 100052 67156 -236231
9536 -112430 -355386 173694 -374904 30898 207371 242611 -293631 -336611 36685 179376
9526 179376 -308491 -156181 -90260 -201937 -46329 -368495 43397 145461 -245153 220330
9515 -372115 411805 106957 -542125 259857 -51494 -65143 -134583 -154581 245184 -135392
9504 86629 -95370 -44409 -283527 -487755 -64468 -219056 -5420 88562 90640 22248 -208550
$$ packed form
9583b12934i6774a5540G2741b13726k14382b01641I2065R5380a96625i1405C01826
9571a01671j01128a4689C23891b69241d5140j40398A20602a54363H3928B0902
9560E2269e7753J446q3126d9665H6287a54684I2958i3568q6855k2936n3482l6805
9548b93646G3773i763p0102D1421b65341O3895J551A20282k0230l2896b36231
9536a12430k42956A73694c74904C0898J76473L5240b93631m2980C6685J42691
9526A79376c08491J52310O5921j11677d6329l22166D3397J02064b45153B20330
9515c72115D11805A06957e42125B59857e1494j3649o9440j9998B45184a35392
9504H6629i5370d4409k39118k04228f4468j54588e420H8562K078B2248b08550
$$ plain form
9492 -68697 -25777 -148532 -68410 -94887 -121460 -45385 -30059 -276891 357923 -254145 -281240
9481 -281240 157017 77663 99312 -63920 -150000 203969 73849 -110089 -163639 52226 156180
9470 156180 -149099 -121535 -361478 -93551 -203182 -325233 -137518 -56214 74405 -35668 -34351
9459 -34351 -64973 84646 -172502 75990 -347956 -146779 -248514 -295444 52788 29915 157989
9448 157989 43526 -261222 43930 -218812 116384 259087 269918 -272233 -149602 26711
9437 -179233 -231383 192837 37874 211899 137883 -198422 -120219 123099 -304055 -77153 -126761
9426 -126761 -52962 95694 -260145 -80798 -258355 157072 -264397 -201346 -93987 -138954 -447979
9415 -447979 -178128 2237 -145630 -155248 60677 288819 113680 -116180 -28615 29677 -138235
$$ packed form
9492f8697b5777j22755f8410k6477k6573d5385J5326k46832C57923b54145k7095
9481b81240A57017G7663K1649f3920q6080B03969G3849a10089n3550E2226J03954
9470A56180a49099K7564k39943i3551j09631j22051a37518e6214G4405c5668J317
9459c4351l0622H4646a72502G5990c47956a46779j01735m6930E2788k2873J28074
9448A57989D3526b61222D3930b18812A16384J42703J0831b72233J22631B6711
9437a79233n2150A92837C7874J74025p4016a98422P8203A23099c04055g7153m9608
9426a26761e2962I5694b60145h0798j77557A57072b64397O3051i3987m4967l09025
9415d47979a78128B237a45630r618F0677K28142A13680a16180b8615B9677a38235
$$ plain form
9403 -168636 116693 59832 -358957 -36120 -57480 -235615 -73557 311376 -92694 -205987 -60723
9391 -57726 -292506 23793 144869 -401614 -210291 -28668 -338802 -344762 -124344 -391868 368985
9379 -2341 202529 51701 13065 -236736 213830 -271958 -261854 -111177 9521 -31307 -3441
9367 -165635 -104974 47418 -149591 -119931 107188 -209172 -100354 -273312 -133309 40013
9356 -294170 -371247 -131205 111226 343160 -224820 -122765 221269 3089 -224596 -93829
9345 -400763 136693 15872 133245 -156948 60319 -196007 -174194 82884 -423370 120762
9334 -38411 125045 165985 -131963 32709 -168536 157772 5484 -200490 -95060 101765 -125966
9322 269507 -241746 30308 -73148 64176 -305855 42150 -260919 92268 -24161 -90874 -87165
$$ packed form
9403a68636A16693n6861c58957c6120k1360j78135g3557C11376i2694j13293f0723
9391e7726k34780B3793J21076d01614J91323b8668l10134n960a24344k67524C68985
9379b341B02529E1701A3065b36736B13830b71958J0104a11177I521c1307c441
9367a65635O0661D7418a49591K9660A07188b09172a00354j72958a33309D0013
9356b94170p7077a31205A11226K31934b24820J02055B21269C089b24596i3829
9345d00763A36693A5872J17373a56948F0319a96007K1813H2884d23370A20762
9334c8411A25045M0940a31963C2709a68536A57772E484b00490i5060A01765a25966
9322B69507b41746C0308g3148F4176c05855D2150b60919I2268b4161o6713L709
$$ plain form
9311 -87165 -214857 159063 -381990 -455920 -301925 -91675 105596 72325 -31344 42013 -397041
9299 -179044 -46944 -55200 -19969 -161572 -114983 -76125 -158137 -43714 117665 20677 -94118
9287 215677 -223498 259580 -188170 -120795 17244 42663 -36201 44562 -323013 149648 -314638
9275 92185 -120133 -272270 -197600 -67186 148471 69770 -153243 201680 -102579 115357
9264 -25995 -87509 -46194 -82601 -81902 -168170 -284214 -137145 -18826 89994 -12064 69423 -249430
9251 -70954 87126 211334 -96230 -398426 -167866 132775 -501686 320802 -237533 76588
9240 -335216 128882 -223877 -231280 -179139 286465 -16218 -120778 43083 -2521 -153591 -298693
9229 -298693 -311508 -282415 6333 -120691 -128820 -240260 81035 -47611 359455 -137530 -191088
$$ packed form
9311h7165j27692A59063c81990p3930J53995i1675A05596l3271c1344D2013c97041
9299a79044d6944q256a9969j41603M6589L8858q2012d3714A17665B0677i4118
9287B15677b23498B59580a88170O7375A7244K5419c6201D4562c23013A49648c14638
9275I2185a20133j52137P4670f7186A48471F9770a53243B01680a02579A15357
9264b5995o1514M1315l6407O99q6268j16044a37145a8826H9994a2064F9423b49430
9251g0954H7126J24208i6230l02196a67866A32775e01686C20802b37533G6588
9240c35216A28882b23877p403N2141B86465a6218j04560D3083b521j51070j45102
9229b98693j2815K9093F333a20691q129j11440H1035d7611C59455a37530n3558
$$ plain form
9218 -191088 409421 -356268 -472110 -257124 -47043 -67822 -68408 32367 127422 7853 -47396
9206 -441469 -149138 105754 175683 -112418 105496 -265911 -173016 81876 229195 -13135
9195 -32094 147291 -165304 170291 38429 -125266 189288 -206785 -213961 -164026 -70804 -381037
9184 -381037 -512983 -117442 65485 -240034 58959 335968 -272095 -77409 12816 102184 50736
9172 -273034 114331 -352344 -304540 -145712 33140 187372 10549 114405 221734 18569
9161 -129757 884 -531031 79067 37780 33081 -111934 193283 -32155 132861 -126177 -302203
9150 -302203 -167088 -34623 -343782 -274236 -129896 84676 -164785 -203247 146521 -544578
9139 -462537 62014 -339260 41652 -257243 306478 -47205 66259 162932 -122117 41060 40791
$$ packed form
9218a91088D09421c56268j15842K14986d7043k0779n86C2367R5055G853d7396
9206d41469a49138A05754O9929a12418A05496b65911R2895H1876J47319a3135
9195c2094A47291a65304A70291C8429a25266A89288b06785p176M9935g0804l10233
9184c81037j31946a17442F5485b40034E8959K77009b72095g7409A2816Q9368E0736
9172b73034A14331c52344M7804a45712C3140J54232A0549J03856J07329A8569
9161a29757H84e31031G9067C7780m699a11934A93283c2155A32861a26177j76026
9150c02203J35115c4623l09159O9546a29896H4676a64785l8462A46521e44578
9139d62537F2014c39260D1652b57243C06478d7205F6259R6673a22117D1060k69
$$ plain form
9128 40791 -153616 -449842 45664 176582 -255726 -112812 124323 -73934 420653 -65696
9117 -74861 -325429 35113 -88611 -85614 -83733 -77648 439779 -30931 -127519 242116 180408 -399951
9104 9974 -217013 54548 17534 -179468 -244489 165155 -125707 158753 47748 -85869 -204519
9093 -204519 80505 -113747 -274626 -273835 -54599 -102479 -172099 2569 -388394 174249 220579
9082 220579 -60352 125655 -92803 73005 -94584 -121297 -9670 120862 297845 -27147 -399652
9071 -399652 -285962 -364419 30533 -173570 165810 -171345 275460 -177341 -240668 -369153
9061 -369153 -38300 -80637 -120503 -173813 -203404 36866 -169891 14287 -309902 -420519 59243
9049 -124919 -58454 47897 204753 59064 -456494 -388361 88456 -155204 -11979 -358250 -76182
$$ packed form
9128D0791a53616k96226D5664J30918b55726a12812A24323g3934D20653f5696
9117g4861k50568C5113h8611K997J881O085D39779c0931r6588B42116o1708c99951
9104I974b17013E4548A7534a79468o5021A65155a25707A58753D7748h5869j18650
9093b04519H0505a13747j60879P91e4599m7880o9620B569c88394A74249M6330
9082B20579f0352A25655i2803G3005i4584k6713i670A20862J76983b7147l72505
9071c99652J13690p8457C0533a73570A65810a71345B75460a77341o3327j28485
9061c69153c8300m2337l9866n3310k9591C6866a69891A4287c09902j10617E9243
9049a24919e8454D7897J56856E9064d56494O8133H8456a55204a1979l46271g6182
$$ plain form
9037 54647 97301 280636 -95955 -61252 -128219 -165444 21601 -33338 192612 -246738 -216549
9026 -216549 89160 -57012 175213 -132031 58668 65852 -65312 -234154 -230607 -3727 203421
9014 -13742 -8553 -82412 -88107 -63270 -182428 -207434 -1058 -298711 -52189 192454 -282676 -67080
9001 -104058 138584 150415 -75788 -88633 -9148 -103778 137827 19247 -112311 106972 221740
8990 221740 -105742 78541 -222446 -108879 -153364 -12857 53020 -84190 -57937 -272143 -129065
8978 -117437 -12571 79320 69533 -149637 -280735 -297365 73959 -136035 -40207 76217 -323608
8966 94563 -61463 -87261 85114 -12884 13938 -173091 -324010 -128623 -272864 -367636 -117123
8954 -139315 170473 -48944 -32161 235008 -235113 -74004 -62058 88779 -143498 -281445 312771
$$ packed form
9037E4647M2654J83335i5955L4703o6967l7225B1601c3338A92612b46738L0189
9026b16549H9160e7012A75213a32031E8668P184f5312j68842L547c727B03421
9014a3742N189p3859n695K4837j19158k5006a058k97653e2189A92454b82676f7080
9001a04058A38584J1831g5788j2845i148r4630A37827A9247a12311A06972J14768
8990B21740a05742G8541b22446a08879m4485a2857E3020h4190K6253k14206a29065
8978a17437a2571G9320r787a49637j31098j6630G3959a36035d0207G6217c23608
8966I4563f1463k5798H5114a2884A3938a73091j50919a28623j44241r4772a17123
8954a39315A70473d8944J6783B35008b35113g4004J1946H8779a43498j37947C12771
$$ plain form
8942 -106904 41678 -353033 -55203 -497508 -123767 14801 -10654 52891 -26613 -85993 136772
8930 -80382 182067 -165235 -124109 40204 130810 421652 943621 2100242 8519327 19879732
8920 19879732 4438231 1445241 708315 787176 288235 339842 167727 -72958 84677 438647
8910 438647 -15360 -191903 602609 51366 -120718 -54190 -79997 68973 127330 189195 7015
8898 218465 51938 73689 -95383 -156834 310600 151424 -81592 39794 233479 316611 -68465
8886 -182458 67499 -71984 -68521 19275 -251606 -224536 73536 -85658 153565 260844 -61222
$$ packed form
8942a06904D1678c53033e5203m42305a23767A4801a0654E2891b6613n9380A36772
8930h0382A82067a65235M1126D0204R0606K90842N21969J156621O419085J1360405
8920A9879732D438231A445241G08315P8861B88235N1607A67727g2958H4677L53970
8910D38647a5360j76543F02609E1366a20718e4190k5807F8973N8357O1865G015
8898B18465E1938K1751i5383o1451C10600A51424h1592C9794J93685Q3132f8465
8886a82458F7499g1984L463A9275b51606K7070G3536h5658A53565J07279f1222
$$ [...]
##END NTUPLES=NMR SPECTRUM
##END=
