
##TITLE=UV1249_M10_1340-1211_5_7409397_KHW9QBcY3a
##JCAMPDX= 6.0         $$ Bruker NMR JCAMP-DX V2.0
##DATA TYPE= NMR SPECTRUM
##DATA CLASS= NTUPLES
##ORIGIN= BRUKER
##OWNER= Administrator
$$ 1.72 TOPSPIN		Version 2.1
$$ 2013-01-24 19:17:26.983 -0500  Administrator@X
$$ Compression mode = diff/dup
##.OBSERVE FREQUENCY= 400.02188249412
##.OBSERVE NUCLEUS= ^1H
##.ACQUISITION MODE= SIMULTANEOUS (DQD)
##.ACQUISITION SCHEME= undefined
##.AVERAGES= 8
##.DIGITISER RES= 22
##SPECTROMETER/DATA SYSTEM= spect
##.PULSE SEQUENCE= zg30
##.SOLVENT NAME= COFFEE_meoh
##.SHIFT REFERENCE= INTERNAL, COFFEE_meoh, 1, 14.98509
##AUDIT TRAIL= $$ (NUMBER, WHEN, WHO, WHERE, PROCESS, VERSION, WHAT)
$$ ##TITLE= Audit trail, TOPSPIN		Version 2.1
$$ ##JCAMPDX= 5.01
$$ ##ORIGIN= Bruker BioSpin GmbH
$$ ##OWNER= Administrator
$$ $$ E:\/data/COFFEE/nmr/UV1249_M10_1340-1211_5_7409397_KHW9QBcY3a/10/pdata/1/auditp.txt
$$ ##AUDIT TRAIL=  $$ (NUMBER, WHEN, WHO, WHERE, PROCESS, VERSION, WHAT)
(   1,<2013-01-24 19:17:18.936 -0500>,<Administrator>,<X>,<go>,<TOPSPIN 2.1>,
      <created by zg
	started at 2013-01-24 19:16:12.998 -0500,
	POWCHK enabled, PULCHK disabled,
       configuration hash MD5:
       86 BA 57 50 F2 9D 5C 9B 26 00 A9 28 5F 66 2E 89
       data hash MD5: 64K
       90 DC 3D 6A C4 6F 67 C0 5C 9E D2 93 78 98 E5 51>)
(   2,<2013-01-24 19:17:21.983 -0500>,<Administrator>,<X>,<proc1d>,<TOPSPIN 2.1>,
      <Start of raw data processing
       efp LB = 0 FT_mod = 6 PKNL = 1 PHC0 = 0 PHC1 = 0 SI = 32K 
       data hash MD5: 32K
       DC 61 ED 63 26 D8 45 5F 5D 5F 2F A8 14 08 CC A7>)
(   3,<2013-01-24 19:17:22.436 -0500>,<Administrator>,<X>,<proc1d>,<TOPSPIN 2.1>,
      <pk PHC0 = 98.96484 PHC1 = 0 
       data hash MD5: 32K
       AB F5 5B DA 5B 65 06 B8 38 09 3C 62 E0 F1 EB 45>)
(   4,<2013-01-24 19:17:22.670 -0500>,<Administrator>,<X>,<proc1d>,<TOPSPIN 2.1>,
      <abs ABSG = 1 
       data hash MD5: 32K
       01 E9 88 8F D1 ED 7A 1C 58 E7 40 43 0B 8D 11 86>)
(   5,<2013-01-24 19:17:22.811 -0500>,<Administrator>,<X>,<proc1d>,<TOPSPIN 2.1>,
      <abs ABSG = 2 
       data hash MD5: 32K
       56 89 69 11 2D 42 B5 62 1E 7F A5 F4 86 69 F3 F3>)
(   6,<2013-01-24 19:17:22.951 -0500>,<Administrator>,<X>,<proc1d>,<TOPSPIN 2.1>,
      <abs ABSG = 3 
       data hash MD5: 32K
       07 97 06 82 9C 02 D2 2C F7 41 EC 6D C5 58 2E 25>)
(   7,<2013-01-24 19:17:23.108 -0500>,<Administrator>,<X>,<proc1d>,<TOPSPIN 2.1>,
      <abs ABSG = 4 
       data hash MD5: 32K
       71 2F 46 3C 7D AD 14 85 49 ED 20 B7 A4 DB 69 5A>)
(   8,<2013-01-24 19:17:23.248 -0500>,<Administrator>,<X>,<proc1d>,<TOPSPIN 2.1>,
      <abs ABSG = 5 
       data hash MD5: 32K
       38 44 28 BA 83 EF F9 CA 99 6A F9 16 5A 0B 6F 17>)
$$ ##END=
$$ 
$$ $$ hash MD5
$$ $$ BD 81 26 74 98 D3 F8 6D 20 C2 48 9C 54 B9 B1 A2
##$RELAX= 
##$RELAX= 
##$RELAX= 
##$RELAX= 
##$RELAX= 
##$RELAX= 
##$RELAX= 
$$ Bruker specific parameters
$$ --------------------------
##$DU= <E:\>
##$EXPNO= 10
$$ [...]
##$TP= (0..7)
150 150 150 150 150 150 150 150
##$TP07= 0
##$TPNAME0= <>
##$TPNAME1= <>
##$TPNAME2= <>
##$TPNAME3= <>
##$TPNAME4= <>
##$TPNAME5= <>
##$TPNAME6= <>
##$TPNAME7= <>
##$TPOAL= (0..7)
0.5 0.5 0.5 0.5 0.5 0.5 0.5 0.5
##$TPOFFS= (0..7)
0 0 0 0 0 0 0 0
##$TUNHIN= 0
##$TUNHOUT= 0
##$TUNXOUT= 0
##$USERA1= <user>
##$USERA2= <user>
##$USERA3= <user>
##$USERA4= <user>
##$USERA5= <user>
##$V9= 5
##$VALIST= <valist>
##$VCLIST= <CCCCCCCCCCCCCCC>
##$VD= 0
##$VDLIST= <DDDDDDDDDDDDDDD>
##$VPLIST= <PPPPPPPPPPPPPPP>
##$VTLIST= <TTTTTTTTTTTTTTT>
##$WBST= 1024
##$WBSW= 4
##$XGAIN= (0..3)
0 0 0 0
##$XL= 0
##$YL= 0
##$YMAX_a= 627137
##$YMIN_a= -534749
##$ZGOPTNS= <>
##$ZL1= 120
##$ZL2= 120
##$ZL3= 120
##$ZL4= 120
##$ABSF1= 14.98509
##$ABSF2= -5.573092
##$ABSG= 5
##$ABSL= 3
##$ALPHA= 0
##$AQORDER= 0
##$ASSFAC= 0
##$ASSFACI= 0
##$ASSFACX= 0
##$ASSWID= 0
##$AUNMP= <proc_prof1d_extract_pilot.lims>
##$AXLEFT= 0
##$AXNAME= <>
##$AXNUC= <1H>
##$AXRIGHT= 0
##$AXTYPE= 0
##$AXUNIT= <>
##$AZFE= 0.1
##$AZFW= 0.1
##$BCFW= 0
##$BC_mod= 0
##$BYTORDP= 0
##$COROFFS= 0
##$CY= 15
##$DATMOD= 1
##$DC= 0
##$DFILT= <>
##$DTYPP= 0
##$F1P= 0
##$F2P= 0
##$FCOR= 0.5
##$FTSIZE= 32768
##$FT_mod= 6
##$GAMMA= 0
##$GB= 0
##$INTBC= 1
##$INTSCL= 1
##$ISEN= 128
##$LB= 0
##$LEV0= 0
##$LPBIN= 0
##$MAXI= 10000
##$MC2= 0
##$MEAN= 0
##$ME_mod= 0
##$MI= 0
##$NCOEF= 0
##$NC_proc= -8
##$NLEV= 6
##$NOISF1= 0
##$NOISF2= 0
##$NSP= 0
##$NTH_PI= 0
##$NZP= 0
##$OFFSET= 14.98509
##$PC= 1
##$PHC0= 98.96484
##$PHC1= 0
##$PH_mod= 1
##$PKNL= yes
##$PPARMOD= 0
##$PPDIAG= 0
##$PPIPTYP= 0
##$PPMPNUM= 2147483647
##$PPRESOL= 1
##$PSCAL= 4
##$PSIGN= 0
##$PYNMP= <proc.py>
##$REVERSE= no
##$SF= 400.02
##$SI= 32768
##$SIGF1= 0
##$SIGF2= 0
##$SINO= 400
##$SIOLD= 32768
##$SPECTYP= <>
##$SREGLST= <1H.CDCl3>
##$SSB= 0
##$STSI= 32768
##$STSR= 0
##$SW_p= 8223.68421052631
##$SYMM= 0
##$S_DEV= 0
##$TDeff= 65536
##$TDoff= 0
##$TI= <>
##$TILT= no
##$TM1= 0
##$TM2= 0
##$TOPLEV= 0
##$USERP1= <user>
##$USERP2= <user>
##$USERP3= <user>
##$USERP4= <user>
##$USERP5= <user>
##$WDW= 1
##$XDIM= 32768
##$YMAX_p= 440010388
##$YMIN_p= -908449
##$CURPLOT= <Network HP LaserJet P1505>
##$CURPRIN= <$Network HP LaserJet P1505>
##$DFORMAT= <normdp>
##$LAYOUT= <+/1D_H.xwp>
##$LFORMAT= <normlp>
##$PFORMAT= <normpl>
##$SURQMSG= 1
$$ End of Bruker specific parameters
$$ ---------------------------------
##NTUPLES= NMR SPECTRUM
##VAR_NAME=  FREQUENCY,     SPECTRUM/REAL,   SPECTRUM/IMAG
##SYMBOL=    X,             R,               I
##VAR_TYPE=  INDEPENDENT,   DEPENDENT,       DEPENDENT
##VAR_FORM=  AFFN,          ASDF,            ASDF
##VAR_DIM=   32768,         32768,           32768
##UNITS=     HZ,            ARBITRARY UNITS, ARBITRARY UNITS
##FACTOR=    0.250966925370066, 1,           1
##FIRST=     8223.43324360094, -10095,       -192593
##LAST=      0,             -105701,         54439
##MIN=       0,             -908449,         0
##MAX=       8223.43324360094, 440010388,    0
$$ Real data points
##PAGE= N=1
##DATA TABLE= (X++(R..R)), XYDATA
$$ [...]
23850 -93296 143482 195713 -152931 4430 -200617 232862 176035 -205502 -140021 -208149 36871
23838 -71034 -153156 -67330 -70198 9535 -67313 232877 211293 8171 -119319 -144673 -112331 146831
23825 135852 -46154 84567 324739 -143411 -232638 -97766 5604 -81898 -47223 56586 187478
23814 187478 306009 -268098 -13440 155526 5839 -148724 -124188 -40670 4972 -98560 25664
23802 109422 -192730 -3667 69567 -170930 -94104 -96493 -82788 -136816 -56432 -16893 89372
23790 156713 2368 -69825 182186 -66112 79858 222299 125418 -180620 -24037 284072 19762
23778 -7135 -253317 137427 255817 57438 538950 319307 74785 -131000 62048 142170 -142825
23766 -57783 8397 -294987 291773 127679 335545 30382 -251651 331752 -172289 -38080
23755 -48218 -116624 82048 -135897 -260610 -79258 91238 -191264 -97121 312978 -272 46447
23743 -122280 -15512 50567 387275 6655 -121255 107696 -103232 -146040 -330088 20211 261173
23732 261173 30579 208280 -71178 107247 293531 -73840 -22079 93256 161045 409273 24380
23720 59396 66598 109575 -34972 -105211 124583 132285 -71223 52127 -46631 -235981 -175540 -52270
23707 193346 -203565 17196 -6889 -143762 -477021 157223 73092 -167560 244964 167509
23697 167509 112101 -128026 -367246 -27944 123258 153954 57288 -48249 -105314 137974 542338
23686 542338 -167775 116330 -53696 -201475 23748 -1372 -290 48197 79984 128907 -219296
23674 -67329 -107568 -50548 207549 -54103 -93108 172663 -48995 183936 44682 -132763 24457
23662 -454779 -25526 -12188 -85070 -52044 -87148 -281474 -92296 307301 203323 -406950 345078
23650 35781 113674 -35104 4608 176211 -100467 44270 234540 121318 175922 78932 -146538
23638 13264 -109456 -21344 193556 -225449 114790 91320 166661 -90929 -290771 201348
23627 -139186 38318 -81048 -114332 104528 21795 242697 -103255 -416167 25942 166572
23617 166572 12922 -87744 212694 -52773 -95521 34230 -12273 -196492 -129271 -110250 -114206
23606 -114206 -270662 48780 -98658 -95121 -159582 -298891 -186513 -303840 74500 -280372 208536
23594 2444 -40092 65982 -157032 166841 14835 283760 128654 -102865 181910 -81836 -29096
23582 67464 -65722 98679 212728 238688 -45804 146676 79693 -10505 150115 66118 -223106
23570 22975 25461 -28142 -164031 109200 -67677 64006 -279244 68488 -261572 -24486 245537
23558 23607 -255947 -303342 133275 -242969 -96935 -248587 -63124 208184 -315973 130655
23547 174194 241571 -223478 -125093 -182437 -415030 -374122 -84713 173276 203925 -393739 90150
23535 -181840 237326 44027 -420985 -184177 43641 -185423 252386 -186149 13150 -22588
23524 -158749 74986 -364183 397731 -55193 -71432 305909 -328831 118333 -25675 183538
23513 -66167 -125384 -20472 -42542 74280 -360262 2081 54442 44679 60851 128891 91397 -28899
23500 -170119 170052 -287857 -66290 -404894 196147 -287692 275365 -35341 -52542 13194
23489 6126 63609 -187587 -148423 -153201 -251063 221401 235266 -3524 26315 95891 -33722 58740
23476 -9889 -96460 -14124 -23815 -59046 170035 -131996 239453 117086 -17955 -184387 -88711
23464 487210 28564 38604 -372329 -174721 -245025 16979 -42177 -180190 -261007 4293 41763
23453 41763 174781 127614 292242 241694 89283 123430 5749 -206662 -28704 -30509 131412
23441 -246705 -91597 -162843 28380 194175 -146472 56964 -47181 -294290 -120496 61290 -20417
23429 -62901 -246598 -148186 6924 8363 -361562 -62954 -344787 121826 -130908 -95348 207394
23417 -198881 34309 137524 -90623 -191161 111746 -26797 26708 63864 44142 123055 -90
23405 119113 89817 79327 -90015 90445 105222 -151239 107662 272667 -88730 19581 -669
23393 -65584 38034 214439 173349 60355 245685 295519 -199910 -226421 231073 33388 -84817
23381 32408 -35066 -116529 45354 232221 67096 -71138 -128984 -155056 276421 -71637 72213
23369 -253466 -10086 -122508 23514 37297 -112540 -123301 145498 -148460 23264 -184060
23358 177816 -337761 -110261 15269 291820 86938 -172927 -112080 -76440 -40494 81975 6565
23346 227706 3226 113212 77254 94172 -68105 211849 -161148 -136519 172056 160709 -69974
23334 132979 -321588 -78702 -265411 -254704 53140 -251958 170840 -258466 47704 -91783
23323 -202058 -254797 165829 -26305 175625 -25536 -317051 -30123 89611 168935 -62892 -305276
23312 -305276 -208458 -289880 67941 260670 -164299 -78023 -241044 -237399 -275977 24116 9774
23300 163862 144254 -3635 -55383 234799 128125 -283243 -296186 -15989 52392 -430859 -16976
23288 -131131 -97590 265614 -286508 29639 366591 360066 -209700 70057 -335262 -86381 242467
23276 -171624 -27948 -622485 7422 -285731 -105331 -167105 -213693 -260798 -191377 -101666 231650
23264 -129319 74603 -314569 -62869 -181006 85845 45456 -259306 -138934 -35262 319519
23253 -187965 -4898 -150914 231777 175800 -25155 8193 134574 -212822 212587 71499 -20919
23241 282948 -47693 -23034 -321256 -2867 66167 83934 150672 -143379 -97823 -210658 215323
23229 -184625 38804 -336138 182645 -117061 -340615 -51984 -206309 -46139 136000 42523
23218 -372288 -81000 102258 -48215 44743 -337 -49483 109040 98447 -115687 -29534 -84249
23207 -84249 147602 224992 -42453 -70198 215637 -173131 -182453 47511 58704 117738 443075
23196 443075 290295 235889 -67662 101654 113372 348677 3766 42101 -212649 43475 76130
23185 76130 -209329 102364 -257187 236254 146644 115633 135427 -194973 163870 -266666
23174 -168218 -136089 68914 -73511 107690 -33584 -60215 -51773 244239 -39560 41494 -154016
23162 -199658 -134876 53249 -42293 -84152 320142 13396 -271613 139839 225574 129238 -152589
23150 232200 -155941 -125080 76649 -152200 -207976 -272059 -191412 -153176 253972 -101993 -7964
23138 -249526 -42522 -317399 114947 203353 205227 -251410 -309387 73308 -22062 -6679 31035
23126 23341 30129 -381200 -25673 -161086 120949 226961 -119990 80620 -7198 322484 -14492
23114 -92676 -47280 -154286 50714 -116169 -40032 -406734 -153320 199217 221155 278932 -64281
23102 164655 -295796 -179518 117412 37266 -73629 -390422 -180873 126784 -324974 -39076
23091 197785 176182 36679 37854 -147687 -309650 93831 43342 43782 -103705 44129 -92539
23079 191276 -41180 31129 305987 -184764 -100306 94279 81437 78326 -22338 -186461 -65665
23067 90276 -120705 137181 278021 -318286 -117049 -428324 -349256 31004 -72203 -197286
23057 -197286 418426 139066 34221 313508 -425585 8649 -200321 57797 252810 -30271
23046 20803 -33185 247570 201037 -74586 -5965 132969 -275462 -156319 34588 173976 243842
23035 243842 83849 77671 -150720 80272 -53590 -204440 -98020 94911 31814 -593978 97218
23023 -74749 102594 75798 -105147 217782 -324434 347657 214499 -169323 155965 118492
23013 118492 279295 217357 182341 66749 161194 75617 25309 -81503 225871 14395 229193
23002 229193 -27441 276651 -288012 -265290 15145 -320604 -5665 -224209 54059 -114797 35986
22990 -208493 195818 205771 -259960 -29236 -182219 -181772 -298993 -297986 -1940 103785 24376
22978 61557 -155198 146453 -156061 -122566 96269 -47592 -42642 55028 184035 -115373 149170
22966 309458 78533 92168 65999 137211 -192700 -245096 8771 -24266 73042 310406 -192657
22954 44556 28738 41146 -202979 -91874 -93026 139236 192047 227808 -46550 -100663 32318
22942 218391 144984 -266384 6472 43619 -184181 72730 -116925 -237802 191439 -234492
22931 -241958 -98527 -291577 -97733 -242324 -271526 -107095 -248222 35279 -150938 -121653
22921 -121653 69883 -266596 26038 62330 80258 -81310 -149867 -31008 -97442 -334459 -13342
22909 249573 58375 312222 -52175 110997 -180034 36004 -315741 183591 -206557 -174884
22899 -174884 146099 201537 -40781 151865 -480668 -95818 -248902 20031 198660 53005
22888 -101988 -585271 -17193 59281 -244168 8986 354087 -298284 -83800 103306 -155464
22877 -171550 72889 127686 -5641 -77196 124162 -447756 -137767 35019 33009 180048 404912
22866 404912 -185997 281829 -165925 -200437 40246 92625 -461798 -62464 166051 116807
22856 116807 11655 -109532 -260133 -137428 99203 369725 -331137 -231040 -9989 -133216
22846 -133216 -112167 -80117 -289597 -229220 279995 -53782 -258689 -177350 24219 113066 166101
22835 166101 -144264 221623 -41479 61420 -25104 58467 -41044 52733 -38519 171891 15816
22823 143540 -97709 158808 -267957 14498 -92969 -315672 -91728 -293025 -377915 -90825 169880
22811 574443 31780 -223444 -106911 -145206 -96182 101081 -155420 -152687 198837 -163577
22800 185720 -347208 -287377 -206889 -9353 134253 96492 -94760 -147860 51614 117248 102158
22789 102158 -10862 39279 156168 -41404 -39997 -218986 -37860 -59466 280085 -24763 -30533
22778 -30533 40865 -154575 -42209 -106651 16416 -86442 -346034 16025 -235690 173039 -125204
22766 -177673 -268794 -217704 97905 107755 -215449 -73306 25535 -192433 -67197 98072 -66541
22754 63633 -218099 85163 36556 -131873 236583 -243716 183973 -176874 -217424 151360
22743 -301397 -17472 41216 420038 -370251 234007 -287912 -16188 -210871 229657 -30811
22732 96458 -149784 -251468 110014 -58610 37170 -68259 18689 6579 68594 -173463 167797
22720 -146562 -42161 2581 -638 -476411 84645 -719669 -21430 -123970 -325739 -27996 -365193
22709 -365193 252892 269151 -473983 -159992 -189678 58758 -422521 195603 403296 -93089
22698 -278829 19523 -193004 -32760 1277 -5383 98273 156536 87982 78993 24226 165032 -109754
22685 198871 -25204 162904 -948 -182612 114855 -212503 -18208 12255 23281 314882 -141462
22673 13560 -35344 63599 -11817 -39769 79383 66222 228415 -330088 144423 -57097 52477
22661 -8173 452822 43297 -145322 302116 -134566 -513878 317816 278045 -70110 91295 102292
22650 102292 58637 165627 -83250 279762 -154582 -175512 88475 154868 383359 -279192
22639 -34122 -145562 -35640 -1270 -351518 -94941 41207 -70776 -162895 -188031 -187964 -43360 -171027
22627 -171027 114861 -55963 -203527 -134897 2908 146513 -33809 -172933 -113584 30893 304496
22616 304496 17334 85332 103272 -177216 438043 -236729 -68750 -57840 -41461 -82822 -104744
22605 -104744 179205 -520060 -92180 -34194 2611 78480 -9068 -301668 -192248 3251 89905
22594 89905 -113049 -551200 41096 -219868 73954 239760 -22911 88406 -141134 -73088 32363
22582 16059 -146528 -27768 -239384 91250 -120297 -118670 -412924 172080 106244 -51589 65223
22570 -214839 -44378 246068 -172441 107890 -143451 89782 -319843 -211644 151930 -17428
22559 22897 -1507 -72797 163911 201989 -118654 28716 -44611 471520 -156567 116377 -193451
22547 -146587 -179938 -179465 275215 -82141 -440837 -261531 -137258 50656 88590 -200334 -15573
22535 -150691 -297605 -232391 -345832 256819 -146304 -224587 51311 237375 -108751 155584
22524 61588 -1062 -315077 40326 193585 -228541 233891 30003 -196571 -288643 76038 280570
22513 280570 244077 181168 -80615 -173598 -139397 -79288 73677 -118483 -44801 30337 -8658
22501 10802 210214 -114530 14429 14091 -66097 109388 -225589 6835 77168 -56161 2470 -176905
22488 247367 -416239 384687 -72148 228353 515976 205012 -99981 54975 -123558 8629
22477 36526 -330123 154018 -212248 -159429 90318 -45546 36275 -163503 -201570 -54864 -110376
22466 -110376 -37877 106722 79056 52455 -97988 -17776 -143183 312605 -220884 -91966 -154500
22455 -154500 -76270 144924 -66280 164449 -283539 -253014 17167 -118581 79967 595 -38742
22443 -254747 14550 53522 122566 -207473 48100 -29795 201128 -27551 -351639 -32781 -170200
22432 -170200 -286317 109214 154922 -89227 364953 -352389 15735 201979 -106618 -71868
22422 -71868 -117472 31438 -126581 42071 -261545 70935 -83639 -133990 102007 -82200 45730
22410 -293432 192926 -40435 26206 -112842 171151 -57224 -161498 -286645 46769 277930
22400 277930 -450845 192514 -9156 44046 -186261 -224593 -93344 -159313 -354481 -91685 -144927
22389 -144927 70342 392980 -138770 159025 62578 272204 107748 105368 -119952 -248357
22379 -248357 -133489 -174426 -12300 -29257 -220479 10033 131039 320236 92588 -388471
22368 -94993 -446911 290495 -183390 48087 -110950 131756 -198489 -231439 -97432 -34636
22357 230158 123935 6727 120528 138460 49812 -4257 -242319 -352593 184207 217664 -63220
22345 -130413 49040 256098 -123445 207334 -4316 17657 -143395 53896 -26193 461262 58832
22333 176710 -130906 154339 -191461 17777 -37162 219695 -109245 198692 -113341 1406
22322 -194453 130470 488955 -98490 -217192 1915 170648 149249 -22179 -119934 -149977 15143
22310 -154925 -351933 308110 -177004 -350114 -71400 -108933 397360 120281 26340 -24707
22299 -38146 -151383 343194 -193937 -63649 8876 275616 -57831 -121041 46601 47360 -5171 41012
22286 136407 -242768 88399 113738 -276541 -230936 -40721 -368443 80682 139955 -181801 7346
22274 54519 -173301 248984 91166 -216946 -246030 52040 -135779 -22119 -46848 -37613 -192759
22263 -192759 30858 -138977 118108 -73445 124405 -46423 -41953 114211 -228488 73799 -517320
22251 -304950 -68537 37607 -71813 -203531 -170981 -262623 167343 -22201 104635 -143353 -404504
22240 -404504 -374749 -19876 -21924 -182517 -348748 15099 24299 12462 25919 -20841 -51529
22229 -51529 -122358 52480 235299 175109 -131898 -51535 -170001 -111184 36469 241515 55499
22217 -122511 -195352 317516 -425522 -246387 -54490 -140718 -98950 -19446 181498 198179 -169332
22205 -225134 412546 -92764 186488 -53685 32748 -145323 -65619 46786 114028 217265 -331289
22193 114126 -255601 -223561 -65447 -175701 -11213 17408 -24166 183090 -117222 -182749 269578
22181 216197 -42839 -285421 94272 -40264 108259 39043 -481772 -236388 78065 226373
22171 226373 -262057 -220590 -45952 8883 -137402 -199944 -130096 -32806 -199339 -285921 -144668
22160 -144668 -90723 -93692 44538 -25530 22400 239439 173438 -162755 69754 -131861 324121
22148 142035 16885 -175697 -198550 974 454271 -289404 -47660 -138519 70891 -99677 -143602
22137 -143602 72075 412244 201848 -348670 -140389 -112250 98719 -51195 -55080 -82422 -169820
22126 -169820 84739 17598 -382222 -50075 -183902 286207 -804134 -71806 -4215 116124 49784
22114 -80260 -210041 -202067 -318005 -38375 -54319 146280 -381954 -281553 -433965 204198
22103 46255 -228267 3268 -245617 296290 129095 -96646 -277315 -326646 200305 -89106 -81634
22092 -81634 -37480 152251 40874 34959 -95595 -106317 73857 171084 -73363 88904 -105249
22080 -219909 200052 -118815 -130158 -201600 30557 129169 51488 -39075 -25497 2926 -274351
22068 25004 -132197 382285 -66958 -236461 -310354 -314516 283838 -16970 34611 -310072 -250924
22057 -250924 -125075 -138451 -295850 -483209 143771 -222012 57524 -167257 -122403 -178900
22047 -178900 -21651 -3769 -175920 -107986 317352 87229 -309792 192824 -364001 47596 205835
22036 205835 156177 -111884 187795 125634 233151 92566 -101521 -10736 -55661 -231903
22026 -231903 133347 -262581 352052 159945 -179880 42882 211012 -192849 -356157 55520
22015 -180421 -9155 -288044 -259332 168540 208104 -83468 225652 10076 350560 23558 -231607
22003 114787 299284 -233253 270638 115827 -128677 193658 -55876 51022 11578 -13640
21992 -67735 -244729 -83849 271193 68674 -51013 -39751 62004 218290 -55161 129428 -116520
21980 -25562 21698 -12695 127612 144428 -117482 -395853 -155619 298218 -158588 57374
21969 -16876 -182423 -118944 -398156 -4690 -63779 217218 -95355 -282204 -98668 -241263 90844
21957 -73808 -193190 4705 -56086 -174278 7837 -356383 136501 -38734 -61569 -235625 -170491
21946 -170491 -339793 -28677 124414 34224 8030 116374 -136402 -93232 -213010 -328306
21936 -328306 74759 -173134 -127460 289372 72519 -238788 132877 62362 -412942 -164670
21925 120955 -52468 210128 104259 217604 95945 -90847 106202 -908449 -75907 -331547
21915 -331547 -176358 -86898 219417 -97204 113359 -104232 -46529 -89022 -6692 -56671 -211967
21904 -211967 108098 -12058 -259596 33563 27165 11704 60287 -101767 -147336 -9829 -52078
21893 -52078 -386498 -4516 -27500 -246861 128224 5352 51052 -5353 217226 225958 109641
21881 -38076 -12312 -231412 423814 162967 92385 -192436 -553410 -162889 -216441 -165618
21871 -165618 191971 -187023 96440 -257958 4604 -120402 22024 99503 -172789 -36952 -216598
21860 -216598 314346 -112934 -81180 -46746 -133880 -33701 -275405 -20383 -361027 -117 159876
21848 14793 33780 -141358 887 -3064 -230897 -26008 -84539 168628 168020 98788 215043 -41117
21835 161953 124892 25651 -119697 -315784 270231 326766 1782 -115190 50178 55606 99375
21824 99375 129324 -41143 145358 22968 59822 59190 137786 -12125 147647 47851 -165951
21812 42997 153477 -37859 202506 137707 -193420 49421 -264693 210460 -86134 10555 -109646
21800 98204 -35369 -27522 95552 54445 27327 -173048 56510 -267849 -151726 80860 -66617
21788 -299690 -103490 16180 264139 114024 120122 179109 53749 -4779 -121449 86791 -325728
21776 12286 -109243 104933 -174285 30114 -226614 -52147 120711 130739 350383 188791
21766 188791 -123637 136618 153925 45376 -110527 -93212 -228581 230106 -408068 -82297
21755 12822 -56705 364152 17207 -95688 -3945 134054 102837 14417 46289 -58031 103240
21743 -145073 -71196 -17410 110906 -117597 -22078 -252019 -233913 109436 226037 200396
21733 200396 98306 -34853 110317 -359234 -104042 -259232 -270680 177537 -73725 -402549
21723 -402549 -280307 270299 -94162 -181009 -178781 -207129 -186092 -340782 -214226 -80601 -224603
21712 -224603 -69149 -380326 -300393 150243 -74818 -275140 -172145 105984 -85325 -38442
21701 75360 -120794 310250 421495 68825 -232735 -8245 -147168 -243716 -48251 131710 -292457
21689 -228302 -121188 206596 -246253 254069 3289 -237737 -6774 81359 20958 10609 143136
21678 143136 -68328 -26258 32578 -45479 -172543 -109776 -82363 -28851 104848 -201328 -167452
21667 -167452 -27589 -124881 124327 -14948 -30500 33961 16082 -35527 298837 126214 -250074
21655 -44247 -356233 59079 -77623 -148189 -137416 171403 183387 -198358 121204 -138847 240581
21643 56728 -3417 27133 64956 -44032 -48820 100101 28642 82659 -12291 -166374 -184552 309281
21630 115968 -228408 12256 -245438 -132600 -15114 -298203 172864 23430 69433 126075
21620 126075 -58725 109948 21734 -103116 -306024 236157 -55853 -196269 138105 -75257
21609 114604 -116617 99053 -15587 -22780 116992 -267984 38080 69153 -80525 59944 -525447
21597 -166349 93516 -154994 3300 -125536 70306 -86185 -73446 28328 225861 -260865 -134242
21586 -134242 -282867 153502 -41747 72961 -252601 -147606 -361089 -130061 41196 37880
21576 37880 -9056 -59802 -153571 -114127 23765 301822 -262868 -209095 -10418 -6475 95702 92939
21564 92939 -1972 147278 -163582 -15137 80073 -384375 257166 42264 380814 97196 -29159
21552 -152810 5886 80851 -161349 -62166 -51627 -301283 -120464 -74916 -154286 -225927 -29381
21540 18881 145852 -78443 37316 -54261 -342747 -219787 -16083 -271504 -64550 -112952 -54076
21528 51734 -327858 -263538 -192911 47605 232647 27094 -149307 -72438 -25586 -52788 153434
21516 -260263 38958 236895 -31578 -197540 -285297 88368 299792 -244142 -205015 -140660 411800
21504 -19453 67422 -313694 -132298 -37520 -31882 -73053 -148601 -7285 179996 181362 -257785
21492 -142241 24257 82732 -69928 173341 20219 92163 190152 85010 -58506 187887 109034
21481 109034 -269433 -283258 -28017 -234331 -8678 258132 -292302 -66862 320691 -65748 -35934
21470 -35934 -100088 29972 -211785 -61048 163346 -52220 -131739 -221802 -175975 -268874 -68684
21458 36007 -208482 -64769 -250350 86577 -276616 -154392 -45745 -157692 47498 -354352
21447 -272129 27298 -198984 -70219 -69572 -97690 154615 -91031 204689 277677 147299 148832
21436 148832 287590 276453 415384 -81926 -343542 278921 43281 -8284 -81761 157989 -48052
21424 149200 42202 -336790 -316205 131424 -245270 43856 214357 346201 -149794 -148151
21414 -148151 -177098 -56213 -292522 -186847 43139 18388 24715 -161536 -349134 314032 -142925
21402 112825 393571 130407 -55215 -63627 -280908 -186836 -91159 -170402 49769 82970 1216
21390 -39168 -180502 -101540 25210 -169009 -159574 -400108 -110862 365666 56498 -57917 -44104
21379 -44104 195247 -352068 133691 -27986 -12804 -196216 124268 339535 81821 -43630
21368 68236 288472 153847 -49983 -9082 -302851 144890 79836 130566 31341 -209489 -56310
21356 -16266 -2667 202107 10422 186749 -97025 -123711 -15530 140287 11823 -74573 141327
21344 -119516 -81968 73359 -14904 -85726 59973 102068 -243643 55400 228664 4877 84136
21333 84136 -141606 -267983 -33394 -265549 -121586 -33606 -341103 -231452 -292507 -222685
21323 -222685 61360 -134646 -320537 -512438 -191393 -112855 137289 64346 78988 -194581
21312 -258523 -371827 -175429 -169060 -144762 171259 -505813 168854 -107086 -315825 -34251
21301 -125136 -428702 -284807 -319582 -252818 -84131 -84030 51424 9927 -348395 174436 121656
21290 121656 112995 97920 28205 -187101 197356 57406 -338634 -263075 -64460 23090 -198005
21278 -202081 -277779 -63687 -160384 224299 240 46672 78670 -42198 -244896 -77354 -76029 -268172
21266 -268172 -303899 228364 68550 -56200 -115180 -79995 -34034 21659 -255948 -166371 -283712
21255 -283712 -163469 6856 146648 -58286 119104 34675 51699 479087 106032 6116 -242683
21243 -489304 -70642 -185804 261256 57572 -201425 160299 -173427 108321 2833 35669
21233 35669 -84295 -183930 -46107 12436 538 -91858 -267106 -10304 -105763 -102367 -29651 -43800
21221 -43800 13773 -50976 -47239 -1019 -28581 20652 -187410 -69205 -173245 -185966 193664
21209 -182912 136241 -165585 177957 -52266 18847 24863 -113629 -234265 -63148 -101408 106503
21197 -263525 45911 -12751 43034 67120 -208445 195175 -183450 -383216 -170358 21185
21186 -133240 126635 52999 8664 -212671 -232686 133299 90975 2204 109635 138337 94204
21175 94204 42133 -266880 156096 38354 125146 -378 201111 -303066 -178111 185964 -266456
21163 -171095 -11625 226334 -255171 -2581 -392996 68301 -116484 -102913 314369 71 -33828
21151 120420 -338982 7371 88124 -18777 -142812 -99918 143662 -241983 94442 77587 -128762
21139 106105 97194 154105 -122918 -129272 -149244 -115031 195217 -18702 -151825 -242460 95055
21127 191092 -49510 -245651 -75708 -76406 -174931 -48785 155728 238287 223966 -145778 -80505
21116 -80505 165091 -293711 -310822 -36127 -385392 140193 213136 102392 -188160 11540
21105 -154166 -160693 -72361 -161966 -58395 -129795 117714 -62331 -211671 -147692 -145261 -118628
21094 -118628 -236468 -285775 146206 -52200 81589 -188304 -236220 -90096 73654 338992 333712
21083 333712 25644 -117417 -131555 37658 -11933 -143407 -196665 -201312 -268439 -433613 -74550
21071 38827 -207020 16304 44987 153297 160747 -238803 -115849 16880 99546 -146356 -15702
21059 -179165 167605 -232351 84525 -143816 -130043 -80778 -70418 -75012 -115265 -53730 -151004
21048 -151004 -183887 -70311 122925 2928 14763 265820 -171465 174501 63516 182967 2831
21036 -173243 -145688 10362 211806 -14047 -58674 295520 -106901 -148953 382219 -111980
21025 -84126 127775 -188074 -51202 55780 -53546 -17555 -107300 -187767 162273 -86362 -230865
21014 -230865 -61896 -18437 65246 -135049 56177 -391340 -127704 293821 1413 -185768 -126657
21003 -126657 87285 -271486 69850 -253236 -1446 160495 14930 -86457 -324925 -148793 41534
20991 -127864 291844 -219945 117285 -107024 -99832 111172 -259208 -325368 -102534 208864
20980 85216 -362015 63842 -170484 83171 -88220 -87031 33841 -175819 -37582 -63482 31941
20968 -68860 -116870 -103785 -281523 239969 -25166 -84555 -19492 305369 -45782 38103 -157872
20956 -219319 -284227 -68372 126076 -23060 65545 29831 182974 72482 -68257 175472 -257330
20944 -473544 -299842 -87753 39947 185313 -398529 -116602 -10570 -75443 36118 -161823
20933 -12123 156549 123376 190231 452672 25062 -71431 -23530 -212862 -159405 -79380 -247174
20922 -247174 285843 -141836 -168762 55548 111660 -543264 324756 -11206 13909 -81844 -260548
20911 -260548 193076 -127212 96147 -56698 -214033 -186843 -203473 -222321 -195324 191312 173953
20900 173953 -432395 -13897 -8344 -15536 -136957 -100963 162994 8956 70597 -231048 151614
20888 -37540 -286571 -377435 -87651 -384 -64165 -34235 -365082 -3014 -25305 -236748 172431
20876 -291121 -96892 -150270 -71720 -448472 -383906 86334 135634 208835 -128160 128374 -356308
20864 235440 466754 -94153 -170675 -256677 -165421 -109385 162901 -249554 346376 -352756
20853 149765 69122 -80372 181481 35108 7884 10630 84658 -149950 -51408 7332 -209157
20841 34603 -456915 -104609 -142778 -125055 -21711 243433 201920 197538 -130254 174864 26897
20829 5955 -138136 -80815 178580 -320107 137429 81344 53358 -29936 -272513 100301 -370463
20817 398803 301809 -126380 -104469 123198 -23786 137816 30518 -160548 -264828 -242553
20807 -242553 -26619 23565 -85312 -308673 40497 25972 -46200 -192631 46487 -294962 6387
20795 -1844 66205 -2305 28274 47332 -50442 116530 -81519 -250273 7409 77033 -146125 -153238
20783 -153238 6237 293379 -45576 367696 -106662 111538 -76234 10225 -330167 -125061
20772 36706 -170447 245207 -246422 -96400 2909 -84410 -92376 -114129 372127 -289141 26918
20760 43979 81997 238548 -110919 83205 -150689 -51131 -188417 198071 288880 -148480
20749 -31069 -36727 295730 -64150 -86279 -64113 -269341 -329149 -281418 137910 -120435 -42296
20737 2492 34166 45416 -74952 55495 -448286 -165227 -79421 -17102 88279 -110441 -103140
20726 -103140 -129326 -11244 -45215 -80440 76875 -328298 58986 -58978 -62605 -237645 9152
20714 212438 166617 46722 -205013 -94994 -17367 -590002 82384 79150 133021 -7103 39339
20702 -199148 -46042 -1226 -89209 -115121 167879 -161806 -44808 -50566 -228416 -56517 43044
20690 -123489 -155838 -176912 -330979 -98410 -8063 111667 -103628 85302 -245031 -300051 -88395
20678 136285 -265651 5313 114856 -138454 -404102 -116515 -315046 372990 -360619 -394919
20668 -394919 258543 -459761 -139930 -168279 2577 -388534 63434 250853 10887 157444
20658 157444 -2201 68345 -1861 -263210 -205247 31212 -246347 -171997 -93388 165833 -77353
20646 89247 103559 67985 -139174 -168323 -202930 -312327 12298 112980 166718 -4600 -49061
20635 -49061 198373 -125632 -76579 -210962 -126740 -154600 125696 254618 -296138 -8558 52983
20623 -247182 -2133 4824 121958 118050 -132951 -221366 184864 -93428 257703 4027 113981
20612 113981 -48279 -175003 -57921 29883 -140943 -279809 -364395 238909 -12798 -299093
20602 -299093 -107496 -160237 32128 58456 46737 -330785 -142774 158030 -293010 -10360
20591 -173890 -212605 -318212 -334683 -196226 143623 50793 -126810 17241 1179 132498 129090
20580 129090 3737 154752 -468245 269671 18778 -133735 -47658 84719 -244481 64752 82480
20569 82480 20091 -182376 -41505 -8134 191593 31922 -43043 352430 -146433 -33310 -97638
20558 -97638 25703 -41205 137883 -2730 238113 101992 -153017 -276597 121692 -107352
20547 -405610 187949 227462 -166083 -59145 -85383 -15836 -94587 -65763 -218474 127472 115843
20536 115843 46523 106554 -404728 57878 39787 -152464 -194695 -176547 -35361 -32523 110489
20524 -193244 18471 -300309 19400 138460 166806 254053 -303955 -46160 -574204 -131754
20513 -172754 -316079 -174093 -64525 -97443 -391300 -104962 73513 87916 195769 -85434
20502 129534 -125864 -284467 161363 -239880 -98195 -249047 -81480 -85596 -15605 -170224
20492 -170224 -282520 -267298 -156449 210359 -270036 157824 39336 18706 -107291 -87840
20482 -87840 -112727 -160689 -59073 73164 -157753 67182 -27550 -287724 -285382 213118 116642
20471 116642 -41332 -215955 80216 44177 -3750 -517076 -351597 63458 -164254 -219712 167062
20459 -1119 6961 -226897 -7927 -319046 123471 -142888 188231 104575 -5089 250796 -390005
20447 28100 -200258 -140689 -2512 -328606 9200 12072 -285438 34111 -184318 144520 193169
20436 193169 -150713 32071 -232660 -88725 207805 -465402 -268581 -274744 -326157 -196009
20426 -196009 95525 -171249 -91834 99377 -3081 301179 -172288 -86678 -228811 140215 202437
20415 202437 -193139 -77859 57482 127675 -170417 136941 187508 -41791 -27231 117062 41633
20403 -223400 55677 -15262 12682 -101517 55797 -131989 -60227 62624 -109502 9299 21309
20392 21309 -11317 194420 115906 -70682 -42628 196425 72573 -69896 -276282 -331690 195272
20380 -78526 188634 -1207 89751 -33585 -175884 195515 -176890 -126402 28370 370416 193655
20369 193655 -156916 40722 380230 120454 -282119 -88755 -102607 -97800 -43217 -315746 84374
20357 -241406 -191203 194443 45183 -110264 78265 116807 86433 -72748 -132756 97911 -408627
20345 2778 271353 13258 140278 -265331 -25887 26953 -61894 -2423 100817 -257515 -30155
20333 -186767 -98346 -135616 -76225 103161 -50200 -74556 298910 -180871 -125060 -287088 -58142
20321 157648 -56936 31277 -195349 -516161 14894 -535834 422470 -322191 -245105 -27052
20310 7809 -422819 27385 56326 2672 -271268 32447 93574 9217 97785 -236708 -158941 -66483
20297 31428 91980 13230 -200309 -132882 -196316 80065 -61165 103063 -211791 170625 27729
20285 -116933 -299627 140876 -251188 25505 68726 35229 -130209 -117756 -111099 247631 -81435
20273 -80309 180344 188893 -328279 -26678 -97659 -49789 270131 292842 -134010 59854 -122021
20261 -84716 28489 234337 343666 -3610 -275941 -210359 2204 -169159 -222240 238419 261365
20250 261365 146527 -210148 120347 54051 -138728 -95343 -234091 103782 81780 -2415
20239 293011 221957 -268549 42176 -305961 -178410 -89814 -322585 94622 107188 -135393
20228 -373268 -98884 2842 -51928 -491356 18922 -82476 -139814 196272 -127583 -63157 34764
20216 -140712 -28366 55486 -203848 -43424 -89712 -143131 -243378 222239 -334418 -119774
20205 -84002 215779 -34924 -232820 41020 -479679 -56451 116581 -6337 184766 25468 182268
20194 182268 214943 -56699 -221378 272526 -192709 14413 -185348 74740 -241831 -1251 81124
20182 -59253 31179 -102361 -241649 -473557 378884 -139757 -44919 -82273 -137663 -160068 -251200
20171 -251200 187998 72981 -22455 -102357 313392 -451824 -435287 143047 36366 51921 160601
20160 160601 -154408 218072 153305 -2822 76392 -35259 -599037 -394907 262831 77937 -633114
20148 56536 36437 -291893 -71014 -157485 32728 295387 -56326 -418689 -428971 25898 327294
20137 327294 16346 564331 246260 -159437 -192868 -70526 -3025 -1010 -18913 21375 -311942
20125 -84670 61613 -29311 -154730 -212374 -276850 72198 -21219 198982 -135590 -52600 -555344
20114 -555344 -374352 49361 327110 20076 127604 -371840 -443496 17418 13491 200000 -87343
20102 16013 -274059 -43026 93370 181223 -322333 -192407 219410 -136386 -252123 -45628
20091 -299363 -480110 -45908 149453 -197900 521 -93866 -56698 -209705 245751 -387096 -195631
20080 -195631 96650 -33421 64310 -623836 -86571 -464657 -139881 10223 182242 393558
20070 393558 -96117 -244179 -95318 207436 -41808 -219201 107099 99870 -141397 115583
20059 -190081 205148 -207325 91816 -220047 -188489 254322 82770 15823 121604 153481
20049 153481 -62586 253594 -195233 18 -245081 -270735 -169245 -75762 -76344 55 -127661 52710
20036 -382730 -247342 -113958 -146642 -80991 -251941 -73187 182616 -99018 10259 215168
20026 215168 153140 -52107 211740 -108105 -82790 -41261 -335202 23465 -80928 -373620 -159942
20014 -354789 192740 -56598 92935 -224618 -88173 -141082 42248 -258700 -39548 135417 -452076
20002 -142544 -49382 -264496 -2284 149949 -80524 -213627 -210507 -369499 -327122 -172827 549291
19990 135562 -109329 -14442 -88111 -31178 -155222 -168300 -182058 225000 -95524 -10006 -61580
19979 -61580 283735 -136813 -309478 -106010 -175833 -347931 286309 64574 127336 -172805
19968 -243482 111760 -280252 18128 -126356 -168428 -61758 97860 -327651 -75214 -193514
19958 -193514 -169973 -95424 -305644 77623 -290454 -132040 -379951 -612716 -437883 142129
19947 295406 -146285 -311237 83935 -63089 -32776 136836 -38849 -99042 -265884 -72842 67407
19935 -245561 -42771 -128641 100458 -9487 -23165 -350098 128375 -342050 41617 -145348 -66460
19923 19849 70981 -202889 -166995 -208005 -210904 -315430 138856 -311979 56027 64453 -248547
19911 -140074 -25271 60967 141972 -160557 -401324 3516 -33585 -112601 -438209 -160975 -42109
19899 38776 182382 74553 -271101 -29033 115790 -216352 12713 -369321 17590 32372 -63010
19887 27306 156746 233563 -190033 146344 125558 -39108 256344 227816 264214 -421638 -163863
19875 -21763 -86826 58684 172069 -90415 316027 109383 -280418 209646 -199615 139850
19864 -105999 -71585 -353585 -47064 -116217 -141518 -230168 5113 -123008 -16096 -79157 -28391
19852 168799 221331 -192469 -184471 -1203 -400816 -116541 31904 -27817 78278 8002 297910
19841 297910 95244 -27591 62182 -60563 -127479 -33946 -184913 47158 -130818 -138425 -235094
19830 -235094 84834 -286088 37087 103519 -363361 -226727 -382245 140314 -32579 90555
19819 -254672 2163 -179915 -349643 -107327 -23484 -296991 -159003 -123319 -193163 20732 -285303
19807 -182487 -310982 62022 -43700 159874 -241496 154523 222478 -176246 -42436 250925
19796 -102920 -46640 -40980 181517 24868 -211142 -81540 -328980 86219 -208631 10195 82973
19785 82973 198523 -2022 130398 -301767 60126 -370357 -270725 -201791 242976 144044 -191531
19773 -68241 119695 164529 208336 -133748 111593 -155410 118191 -244625 135912 -64945
19762 -250724 -8592 -26175 -138290 -172336 382044 64930 -2755 -266185 9854 -191983 -216597
19751 -216597 -77109 -237684 -56322 181911 72235 108944 -66429 36999 -115827 -126420 -172904
19740 -172904 -285397 -198313 -220554 68031 31897 -118859 -395138 89957 283237 -154065
19729 114634 -262308 99215 -96482 334354 308208 218272 -169622 -197513 241897 175218 227971
19718 227971 -282951 -305126 222212 -3399 19280 -19769 -175422 -68890 87432 -270309 -401099
19707 -401099 78591 30694 -16288 42605 160432 -307188 102571 -15202 -6419 120395 14552
19695 -344351 -33021 -270290 181376 165909 -63947 63961 182224 -63729 178694 -36213 282619
19683 -176258 -46790 -129720 -52929 -67631 -156854 -72150 -104787 -136883 387593 -57346 -28299
19671 -116059 -53864 -68837 13010 -162333 21040 36581 72954 -314518 946 43591 -268337
19659 -1060 -189150 204755 -61779 -39942 -285755 -130017 -200269 -78118 72041 22623 -214052
19647 -119955 -136746 -214817 -155777 -183514 118300 -483 -51707 -110024 -314833 -265155 2047 21241
19635 21241 -64495 214380 9647 -213882 -74976 -82390 -206146 172038 -309052 112089 -33540
19623 17250 134339 129474 -56321 42322 146175 -154263 -172199 -66031 -152390 25560 -4941
19611 -132528 18848 15917 -101851 173663 -68387 11488 -382125 57275 -56352 -100233 -214927
19600 -214927 -227643 112159 -203708 68975 148113 -138670 265354 -34979 -199521 -111554
19590 -111554 -142615 14808 40659 220163 -88416 34554 97388 -388071 188366 251260 -221453
19578 -270137 -312729 -16967 -181273 -220354 179291 141170 -218968 3714 112093 -326074 -111947
19566 -13477 365087 -70704 63023 158241 -306919 -24816 -81078 24622 -447355 -281430 216841
19554 19581 -471239 -11392 104676 145744 140404 46138 -20354 -33844 39056 362653 -200389
19542 -210005 236448 -85102 50281 -453694 -116496 313412 390746 204716 313829 -194105
19531 -208436 -27543 -57263 203424 87884 74867 -701 -111420 -27842 -10911 -171608 -70258
19519 139684 -46755 -177490 66939 230236 157610 197876 -354460 -133428 224487 -282997
19508 -56367 81342 73688 -255219 -39181 34805 -169870 -399146 146427 276686 -46095 -79767
19497 -79767 139985 134032 32727 -148978 -133413 -207432 -24553 -152396 75268 -134999 39235
19485 -123349 -202044 -73236 15956 -368740 -196508 139266 -68842 228200 -324973 151732
19474 -19980 -196047 -7382 120363 223741 -58050 49141 -239228 -180249 20900 -189848 -300108
19463 -300108 28821 137487 193946 4042 170625 292675 -109988 -287373 -268071 -139407
19453 -139407 -259268 239670 -234843 -96721 28457 -83459 -314682 -122438 55321 -439950
19442 311611 22137 -281825 6978 187982 23697 135277 -430227 92912 -34380 180736 211533
19431 211533 -332169 -350453 183719 -43766 -185673 -30344 -41717 -173722 -158804 -177524 271950
19419 -162259 43122 50815 26298 -234964 6414 110401 -267943 -148500 -98923 -410231 -22956
19407 238027 -1024 98098 217279 -64900 -234534 -158386 118314 165646 -143725 75341 -7736
19395 -119709 115881 -159073 -6765 188204 -120559 99459 -212631 -111062 46528 -99803
19384 55460 -165738 25956 -85595 138326 28665 -186029 909 30499 168906 10256 -112973
19372 118240 -285146 20791 116736 105128 -105174 52376 103906 -305453 -345026 -395755 -220148
19361 -220148 -182839 -45895 -289856 99953 -63032 -223443 -1193 -52216 203906 43120 -172501
19349 214019 -277802 -106930 -10017 -121819 -234149 8525 21800 -340034 -197297 24266
19338 -324388 -207839 -358375 248370 -103871 61152 54122 67695 -179051 124537 -163685
19327 -9065 -36562 228135 -184394 14110 -279856 83388 57189 533 360708 178762 110259
19316 110259 -59647 -233723 -100609 75725 3594 -241201 -170750 -51001 4776 -393370 -152880
19304 -150551 136197 -206464 -2558 231034 355570 -16598 24793 -134724 277662 -379427
19293 -235617 146039 -223949 -81104 -34072 13518 -157238 -803 325644 279571 -65316 -120018
19282 -120018 -95730 -188082 -246748 -315660 -94211 -285234 -9375 189889 238503 -7808 46440
19270 -175591 -206229 -300222 -55905 -149343 -176301 -167272 -33693 290504 -269971 -127926 -18256
19258 -91326 -354996 139933 53572 -247187 -128751 -162951 -365600 -4529 43958 -15970 -128626
19247 -128626 -249051 22060 -111228 -15236 -62138 -85351 -78167 74460 -60102 115228 34830
19235 -318241 -328074 -335325 -79393 -104001 112931 -605899 -178973 25886 90188 -83045 6629
19223 -60048 -266294 -54358 -140415 1585 32069 -264521 -226672 450265 -12479 -72503 142268
19211 -166032 -59 -67630 -9589 60697 150694 254819 -84907 -60660 6980 -31698 70970 -101955
19198 100403 34939 233667 -262094 -329350 198081 -491683 28326 -266855 -200752 -3773 -185903
19187 -185903 443328 -316670 -41388 157871 -497716 -195435 -378261 52602 -139801 -175266
19177 -175266 -288132 -74574 -21216 -53096 3336 164589 137704 -60981 -10182 66980 96388
19166 96388 86399 -261827 54494 384258 71233 107386 -91099 -115208 104668 13117 126007
19155 126007 17007 -179237 -257767 -83814 -199359 -21505 123833 163242 144316 -250858 266952
19143 -212299 86552 -287561 -65553 -476100 204952 -288299 -323264 -37756 -25376 -196520
19133 -196520 84511 -161081 -83553 76797 -21043 -259858 466157 -437831 -297997 66981
19122 -230216 -215192 -132082 242768 -185794 -395879 -33626 -261264 -143919 -153445 83369 -115365
19110 45749 170106 -31946 -132083 15790 -120102 -7667 143159 -32235 -159071 -615746 -216062
19098 -9302 -188089 -62906 175837 -177119 -371109 15815 -222094 175755 -334842 -91712
19087 199928 -53109 109269 14791 -131761 -61480 -46755 -121389 -167606 -174869 -85669 148312
19075 -62048 -290687 190600 -114233 213967 65296 -83112 138119 -169242 -102867 -68633
19065 -68633 -181149 -31365 -212825 220338 153381 -97559 159732 17136 -59841 129747 -31088
19053 -119097 371238 -78707 -58936 2408 -158841 -189995 -240951 281422 123417 -273272 -187485
19042 -187485 -66944 174920 -249292 -65711 -20980 -23508 -181426 -317638 -72769 -212275 -78644
19030 95995 9045 11596 -142188 -34453 -85964 215821 80679 -3790 85990 -10302 414676 67880
19017 35781 -22397 -136178 -125288 -290927 216684 28470 -410251 114327 54299 37705 -248066
19005 -63487 -171205 -167801 43953 -95121 57722 -162890 148074 -52014 -46793 -42612 218681
18993 -68302 -141400 190926 131557 4774 -146596 193769 -15766 -201238 82590 -222888 -57134
18981 78278 -329438 -99696 204752 63485 -304880 28722 82708 -317519 -117231 124349
18970 835 -66444 -407111 205469 -193241 338294 -11575 -49049 196321 13902 31207 -335138
18958 54412 69777 -379243 8473 -127920 -248215 31591 -170148 198097 3261 57884 57239
18947 57239 -78923 -10413 -79912 46199 -214354 232734 -317829 -348879 -118938 200468 -116286
18935 401731 -60831 -187004 -7123 -35585 10430 -52404 3753 -75115 143584 -134769 337025
18923 -65572 81602 -472983 -153111 -141554 -55283 156887 -158533 30912 14794 232166 -197663
18911 149767 88112 -32830 -348766 -511050 -79100 246476 -26423 3019 -59597 -203317 37965
18899 119584 243616 55041 132411 38867 -258063 -24348 80274 177545 -1361 185871 179159
18888 179159 11554 56342 -149738 18953 -182082 -294236 -122220 -264892 34388 -220912
18877 71957 -50887 189539 -451476 3754 -209554 -181509 180748 -103228 -7733 -603668 -358156
18866 -358156 -410437 -287113 -186973 17336 -221888 -496707 95277 -129273 57979 -164387
18855 139052 8481 -122773 -178485 144129 -232450 -2717 -3780 73288 137728 -237452 -289064
18844 -289064 -183486 48737 183010 376009 -144681 -298060 154696 -95709 -393951 -111569
18833 106035 -193884 52624 192518 -61792 -99144 -226521 -386637 -111598 -92870 -112069
18823 -112069 16227 -192397 -130513 -238858 425325 169657 118912 -301731 -164991 -130286
18813 -130286 23810 -112656 89771 249153 8824 -182337 -59708 -164153 -244154 -358513 -32189
18801 -213479 36876 367089 169032 -50104 -265356 -50238 -156891 -101947 -63517 106438
18790 -68579 167276 -25018 -176667 103838 -114566 -3620 220242 -150608 -142229 -53560 -23458
18778 46121 369606 -73437 661 -61042 -36094 -251552 -222837 109010 2575 -90546 17114 -105120
18765 70335 -82536 -99302 -190458 -4181 65619 114158 -98223 120389 -163312 78286 319754
18754 319754 154117 -73000 -176230 -268512 -15799 210668 -236200 -159014 44608 130499 -86640
18742 -2612 239547 1782 -4289 87856 189234 -223535 -42535 -275612 156281 97375 -239665
18730 -131179 -278119 -17103 -166414 70086 -302127 -314060 -207763 139471 -3863 -35895 40209
18718 245866 -224948 -62754 88439 82476 -41022 -423407 83847 127314 -418413 -353041 29470
18706 -8608 35409 187210 282478 -10170 -213198 -123628 33629 96759 -240660 210589 258134
18695 258134 91017 129704 -73077 -212829 -96021 48447 274218 -58474 -405271 -202568 -152033
18684 -152033 56584 78852 -88876 -12069 120253 -424875 -268420 -340712 -4358 -466347 355643
18672 -314074 -135969 -107773 140875 -241344 -293742 -85656 50397 -19556 138998 192048 -77620
18660 -59722 59926 -227762 -16785 -187285 164679 151426 -7631 -46928 -111267 335637 12797
18648 -184084 -147056 114416 217559 276540 -119768 62685 -90117 -83761 39875 -218476 277508
18636 -143546 377575 -11409 -127443 -363922 -168281 18285 -156248 -120614 51658 -131286
18625 -166359 -12200 118060 93735 48250 77035 154605 200205 -61203 -188481 122248 -223640
18613 -36969 -562 -104682 -334259 118721 -197197 344751 140252 -208500 -318866 -249610
18603 -249610 247064 58110 -69669 -163728 -99199 -115205 20618 165174 -289362 134722 -179509
18591 -283575 169354 -249716 6110 -139880 24790 -133599 227721 -81912 170725 70402
18580 -130181 -214465 -13077 -109731 35862 -230192 -560986 20650 -236206 102183 77067 102722
18569 102722 229599 184422 77525 -214651 -201941 -106838 -301374 -113082 -173191 150796
18558 52151 220958 219436 -133 -172175 -60934 302571 -64161 -67966 46687 85417 -165069 -154179
18546 -154179 -12254 139266 -80417 -44237 96738 -230568 116932 70761 -53638 60129 -189625
18534 -102915 -58117 245935 146028 25073 206557 29407 40954 31132 37488 -208466 -172206
18523 -172206 -448643 -157550 -18594 90427 -245954 -314845 -11542 -278492 -295397 236973
18512 129297 -262467 -422274 61824 64249 71939 -244990 -283850 257767 -238319 -5259 -149309
18501 -149309 81574 325649 90476 150628 -81011 -319878 -576837 -106986 279142 734 -63257
18489 140842 115443 -16016 100863 83465 -231174 -22046 -97495 -21007 -11417 -55079 77585
18477 247909 -311872 -344791 -210437 -32834 32877 -138605 -190361 -94889 -291175 -240643 -155529
18466 -155529 -221165 22537 53196 68627 -1872 -28189 57246 145674 -195749 108452 182761
18455 182761 316631 -109099 -50654 -69083 -225026 -301674 74447 -60539 -130289 -195586 48019
18443 -68715 32236 -281135 -211823 -91640 -140981 -6999 177239 -291274 138771 396108 203872
18432 203872 -69104 -353653 -96831 -144141 -90231 3120 -315675 -168099 249196 89195 -197920
18420 -319838 236977 150430 130137 -74511 -207559 35660 160136 -276173 284296 305707
18410 305707 168944 -23139 -97995 159991 -74796 -67097 -344649 141935 -297612 286312
18399 470985 131943 -74968 -125569 21519 278597 -205169 -77642 -251525 -440888 -184099
18388 122805 -80409 71881 -267611 -132798 -18280 305655 -275469 -187903 -169076 -89215 68078
18376 -236899 -80621 -167676 94734 -106225 219544 -72091 -254505 -100062 -22765 179710
18365 250674 -75037 127034 -175010 67875 252687 65518 101103 -138825 133354 174629
18355 174629 49866 129236 -173011 172100 -39736 -112394 -247758 -204656 -177197 -149756 17739
18343 201534 76029 -35856 -90893 197968 146272 88248 -84550 -295493 12393 -427836 -271645
18332 -271645 -22294 -119801 -200593 53846 66907 -307901 93215 -5979 -14434 132231 -49311
18320 -162112 -211476 373244 -306485 -58730 90129 40639 -232329 -18056 -19032 -171982 -256715
18309 -256715 -14729 -333578 -59866 66967 -116685 237857 58707 -91638 4532 337873 -336890
18297 -255427 166034 67634 4281 15366 4620 103121 -61875 -311714 -131681 433628 81026
18285 -234725 -314370 -4389 197513 -359185 42453 139441 -161774 -438598 -141053 -48395 -35118
18274 -35118 -65771 -11956 -66667 116415 4109 -362815 144609 78120 40362 -186799 69455
18262 -265968 94335 -299839 66489 -60023 -455417 -50861 -157814 219161 -166454 -21872
18251 -169285 -288617 -91648 -174824 122149 -192488 -186503 164934 -310313 -148327 68087
18240 37076 -257137 213291 50283 -110525 -392060 -101575 -288702 -33556 33357 142483
18230 142483 59772 44113 1787 102951 368637 -114219 -31386 -149637 18790 9446 -228448
18218 30609 -169597 -23053 -172402 -12014 -28927 212925 141894 -235216 -264658 351654 63989
18206 -148564 125876 -119888 45346 -266433 108418 -10991 1453 -243017 -221271 -67278 -263453
18195 -263453 170335 -201010 -148303 -184980 -323128 100898 19664 -365709 74364 -85428
18184 -128139 -32263 447818 -131221 451280 -235939 287911 153899 -153722 -23511 285701
18173 -194004 328821 65331 180143 -84321 -164271 -79382 -148254 103172 99323 -416021 -73675
18161 262278 -103609 -124773 149221 79103 -116902 59494 -266376 -50576 -129798 -236716
18151 -236716 156719 51743 151184 401009 -104412 101087 8331 59217 298654 -183614
18140 -122347 230429 -167342 -239972 110294 -241727 -99805 -204121 182799 97928 290031
18130 290031 -70323 -92518 -8605 -242630 -190439 264046 296542 164497 -41131 -210276 -14456
18118 -48517 -37073 93642 180394 103085 -213746 -8602 -329509 238497 -30558 -116205 77230
18106 -89393 61102 63437 -38057 -284247 -104295 48853 -407392 -14905 -243797 -168284 6380
18094 262285 -186654 67685 507694 124583 73165 -91472 178378 -545387 349339 -139934
18083 -214381 -105892 11710 -146645 -170907 -56937 -15539 7986 -92629 15110 -36634 -55206
18072 -55206 225735 -61722 141099 76225 26050 348798 -199172 -420569 -281904 -255090
18062 -255090 123370 -150563 137910 -63725 -130899 -115601 903 -223042 -21666 197954 257345
18051 257345 -137756 262718 9785 -259261 -245365 -91038 -260702 -166113 10980 -168471 -258879
18040 -258879 -237882 -326104 -174120 -235928 -188394 -294408 -107007 -182852 102525 38197 195706
18029 195706 -176325 103810 -30290 -42959 85686 -86145 -12867 -300543 -169776 -170000 -33957
18017 -292521 134300 140330 -41847 -284030 -248235 -4258 228954 -437865 34616 -23123 67157
18005 -306911 -230832 -289525 -198467 -96253 -27682 -72955 -368529 -184063 109781 -175006 -344575
17994 -344575 -172700 -259496 490989 255728 -79901 134760 383173 -33883 -219048 -279594
17984 -279594 -326350 141476 -159642 -143901 -108632 -95757 -75464 324937 -69507 29136 111937
17973 111937 60849 -207103 -153428 5624 -41951 110688 -25179 321797 91679 85260 -199990
17961 85400 303957 152874 180610 -26312 59308 -267668 -9433 29354 260233 -137517 281881
17949 -24872 -148120 83653 66691 -55351 -152034 73543 212669 -54644 442589 237826 35923
17937 -161562 120003 47334 276484 135353 -82695 -33432 -137164 96783 62197 123854 -145491
17925 -258273 122619 -82335 -190439 184749 37030 27182 -118850 -177994 -153266 -124763 86845
17913 -35253 -59522 -99363 331833 162912 210987 191127 226742 167827 54735 -22538 181334
17901 -162570 40324 21828 -6680 -215296 101599 -55311 36523 -146026 237317 107360 -114063
17889 248394 -96279 227418 -88415 257712 30585 14896 11994 51755 -257098 255939 236033
17878 236033 -264313 136448 -134359 -109247 97916 -12126 -17882 87878 -130252 -5428 -13434
17867 -13434 -176539 -336272 -67002 -123726 177840 -92675 153307 -235677 414635 252625
17857 252625 -8825 94260 -283785 96657 -277109 22863 -106346 156239 -232967 192996
17846 -305391 187564 16968 41478 71869 83755 -102357 -165968 58607 24477 -75215 68124
17834 131507 87759 140407 -318641 38393 -216547 -187609 80130 18063 54285 -66124 -7059
17822 44892 41443 154618 -65482 158766 164147 120497 -38076 -215842 -276869 -140800 -438625
17811 -438625 -151000 161115 243242 -189889 164126 235853 207583 270633 -53276 -36719 -126459
17800 -126459 434225 -42371 123430 -317796 -205095 3173 -108746 68487 150938 213328 117610
17789 117610 244052 101406 75681 130162 249126 13543 207690 55703 118619 -115358
17778 297922 100544 207999 -182547 -169388 313216 136404 -95856 278389 155231 -187390
17767 -18814 -46394 14011 -57812 168684 -12745 246742 -74234 17083 -85069 161257 -274223
17755 -504626 14445 -227256 -27969 -28590 -173018 -159152 226671 143706 -430375 111363 -122282
17743 128323 18641 -86791 89454 -38595 -129494 -11108 87495 -76053 69904 -184769 -268613
17732 -268613 214924 307261 15828 -85153 262725 -38115 -136413 -177318 -255352 167122 118426
17721 118426 154599 -219396 -282072 -202660 -187354 33984 124625 -91659 -165141 -92428 -159664
17710 -159664 201548 68781 294328 -3937 -78948 73311 78139 -323892 -5486 317548 153145
17698 181740 2434 185174 54233 -161306 126456 90646 -106604 136493 -168352 52678
17687 144238 190109 -247526 -25872 -21144 215975 2872 -37673 127051 -156948 118221 211673
17676 211673 -233836 80976 172643 -4604 -97665 -173927 -47217 3497 32092 265786 309560
17665 309560 71400 -301939 -143464 -207804 33872 -25219 140106 -95184 -114846 -34850 -266675
17654 -266675 -244998 -99573 -121614 104187 205848 -217746 51347 22808 -367751 166397
17643 51516 -572205 11452 -19720 -102927 205131 -162125 5970 -88728 -301587 249362 -88153
17631 400425 43656 -132929 -227872 126870 -72428 -496843 180079 -48372 -121880 293414
17620 -83737 86208 -64786 -172970 31132 8348 -104486 217529 120449 139133 82389 46403
17609 46403 -123808 148721 114254 144384 -323186 -157647 243642 137480 -31666 -25310 132699
17597 138632 105048 252148 -229251 225638 -225009 -74797 -84373 103229 215127 -160734
17586 -46086 136162 -150719 -94911 208932 -126197 13669 180837 219549 -11239 -120027
17576 -120027 -156509 358197 45439 135369 121724 90985 -63416 -25516 175286 275694 286214
17565 286214 438478 205464 262016 -49880 265472 -206427 -120914 -186048 154243 50457
17554 241232 -94920 159353 -92444 123991 48535 246798 23271 110359 -143245 -4007 -193773
17543 -193773 114059 180325 158113 99209 -30936 127952 -319312 -133091 55538 17925 52858
17532 52858 211880 276959 -243408 136281 -45626 -75941 203039 -129823 56859 -84987 274259
17520 370339 237276 23650 -8248 38986 -25984 173197 -6969 145262 132930 209787 42751
17508 90220 174153 59728 -65313 7917 -124178 209250 5673 98184 -233605 314215 323850
17497 323850 91830 -34299 65591 222730 205588 20864 100003 142759 466959 -21963 -72418
17486 -72418 90726 -93219 347315 317826 284666 259085 11868 71106 66641 215943 63532
17474 370628 -202933 -374933 120684 248552 -63755 170743 93618 42335 -50626 267285
17463 6602 207288 -24625 37944 -53471 -239964 38698 228739 182163 116631 227019 200865
17452 200865 69860 304924 335753 -99355 -164870 110954 218017 254291 380652 422028 121995
17440 337709 280351 404466 95994 54026 428222 86253 -156712 307594 460718 -223618
17429 218199 29826 380973 -12557 -12461 328188 222172 110767 277869 1533 339050 384486
17418 384486 323890 46666 280930 113430 422259 357290 167477 -51631 -74494 291500
17407 111464 230849 60899 -16747 -47543 246024 -106038 39783 142542 -47834 -11051 162719
17395 233452 -61863 161676 524649 -172204 170193 88483 175422 -81733 168956 166846 117418
17384 117418 -25927 278893 90521 301166 389916 6655 128550 111866 -5934 252101 -93798
17372 172287 356088 84434 343944 143518 -251755 -36044 -2397 7437 300817 -20192 -378856
17361 -378856 -104025 -169977 37031 278592 -219307 93975 243978 97790 62601 248708
17351 248708 244351 412631 -228576 -196410 144806 520239 430737 234360 207191 -149324
17340 379432 150690 249615 440503 124317 -6775 110489 59053 240261 222503 -23874 182981
17328 -87590 272463 190955 -132915 69472 234324 -118656 388028 193632 236238 184539
17318 184539 311482 137037 80896 230881 323966 364612 205570 60965 -148993 205745
17307 -16661 268287 153719 290520 323382 303418 14848 127283 262879 237295 185813 90412
17295 99786 261648 -253351 -20346 133146 332934 368171 214445 87881 162602 -231556
17284 -79163 73993 253896 173711 120131 209587 37532 290732 207656 156692 131651 42891
17272 122054 215634 465918 35896 234365 199397 549678 177524 69230 -11755 85674 28718
17260 352473 85083 329195 324764 124047 26523 70778 165178 380499 56356 25335 83204
17249 83204 138338 -118390 308115 303286 233045 105585 8317 200003 16372 284164 83303
17237 144555 72517 386038 149109 123212 653658 161884 224591 220276 400062 353690 20674
17225 386491 48092 158343 342581 301474 72174 286948 64879 160820 241161 428401 191707
17213 5217 238788 -176786 -82078 99357 257557 142550 182935 -45185 355974 337528 309172
17202 309172 430604 195809 210842 270557 325713 74565 528941 -17655 193008 225266 439328
17191 439328 18279 365596 -28362 243491 33131 298567 -7557 423098 114287 -21424 182811
17179 -23183 139976 372363 149781 367366 649157 191556 211730 413621 133038 -19088
17168 573251 672290 262123 128426 211248 431421 358039 98805 50558 193807 -6728 115181
17156 158343 77590 274099 107967 322211 119132 227972 -110551 209115 -23158 464101
17145 -18572 274116 279879 463944 204779 726552 504244 328978 75109 304372 211492
17135 211492 347605 277180 387881 210646 420129 187649 229885 492741 63248 554284
17125 554284 478618 569692 657009 384519 55219 343052 359295 553292 234983 393189
17115 393189 47590 498151 635350 233016 576411 542479 702356 527020 179982 330423
17105 330423 9477 490259 135088 451266 570057 434638 306313 625493 108692 698709
17095 698709 420375 408946 305494 310169 559556 270195 255398 313037 607820 351634
17085 351634 321608 451753 316195 449884 514413 810015 273493 539359 320602 440894
17075 440894 265629 521219 291472 522547 543114 398123 261335 525648 557380 382079
17065 382079 469962 486495 497363 337931 268657 582269 27254 585822 493615 698098 612113
17054 612113 202279 495815 409890 544520 582465 530682 580398 571377 499010 631977 756612
17043 756612 562024 935070 290339 525507 796240 568120 255226 1064066 410990 662102
17033 662102 305987 910991 565357 676145 507022 752830 753981 451532 439112 825296
17023 825296 631397 588925 511991 594065 723521 671945 403568 442616 602344 605294 686016
17012 686016 577596 706999 419102 636457 345567 642276 914112 555592 554988 556406
17002 556406 673297 835809 960565 362294 714873 625914 883703 561235 762084 846268
16992 846268 727592 686652 467259 800413 579336 1214940 828385 925305 750411 961507
16982 961507 864560 1046574 1148996 850845 1200004 487352 992948 877306 570106 919850
16972 919850 1061866 1093622 765165 801964 865664 1204463 1058407 833623 665582 1010622
16962 1010622 888485 790485 899746 724821 881093 808149 1093650 998447 755608 914992
16952 914992 1167980 989820 1009113 1148879 1083625 1107861 1180891 964323 857808 1201648
16942 1201648 1174652 905601 1244754 1289387 1163939 1353348 1255075 1095473 1338877 1205524
16932 1205524 1642343 1265643 1450961 1226204 1347623 913148 1209799 1302560 1174823 1451381
16922 1451381 1410985 1191529 1526831 1354797 1625864 1214924 1400364 1690802 1210655 1529170
16912 1529170 1408278 1654883 1659385 1483621 1508659 1625098 1219058 1607765 1949262 1837330
16902 1837330 1484137 1809554 1939592 1828804 1807117 1661197 1880806 1743226 2168144 1830266
16892 1830266 1637909 1923611 1930315 1746186 1987340 1910023 1758642 1594807 1789210 1791065
16882 1791065 1712569 2097629 2083594 2152040 1728829 2064080 2022320 2293344 2497308 2236110
16872 2236110 2468428 2568567 2454604 2406401 2677290 2215900 2425894 2811935 2791944 2518424
16862 2518424 2673969 2777983 2886514 2969823 2844187 2630081 2880228 2992216 2750011 3276178
16852 3276178 3050423 3408330 2984575 3240400 3205670 3212014 3378221 3430156 3376239 3590584
16842 3590584 3849690 3650238 3783099 3611936 3604749 3805129 3883911 3976734 4213404 3795315
16832 3795315 4321337 4341268 4677552 4324066 4434879 4400171 4517581 5086506 4913659 4822195
16822 4822195 4898639 5019312 4999699 5186722 5037611 5572073 5326221 5768077 6018869 6006886
16812 6006886 6044734 5706838 6461445 6435145 6758592 6680371 6780339 7364200 7136948 7044735
16802 7044735 7459486 7731520 7914895 7919088 7872617 8364050 8478964 8711290 8907429 9213001
16792 9213001 9761931 9715879 9985610 10365040 10348950 10736369 11033794 11537731 11609332 12086687
16782 12086687 12255433 12567958 12841795 13304683 13786534 14254032 14550965 15261612 15494546
16773 15494546 16275359 16868912 17104589 17574556 18646736 19128895 20021915 20310806 21387820
16764 21387820 22312468 22865851 24083180 24741110 25930455 27016760 27945494 29029814 30742582
16755 30742582 31442271 33339895 34838314 36331689 38086715 39880185 41490322 43652756
16747 43652756 45715458 48085240 50636898 53332308 56252002 59319612 62591402 66426831
16739 66426831 69592895 73959296 78077108 82486542 87579422 92633297 98467087 104211818
16731 104211818 110039771 116587264 123155882 130040561 137081178 144103276 151195968 157778381
16723 157778381 164059674 170471171 175176325 179820660 183571781 185414519 186555379 186111948
16715 186111948 184640172 181590885 177822753 173065965 167339661 161018249 154193446 146981824
16707 146981824 139855758 132697674 125394757 118456868 111535826 105250128 99019225 93392842
16699 93392842 87713970 82751913 77663669 73538344 69531522 65272405 61867977 58451024
16691 58451024 54939302 52101053 49402646 46673438 44549036 42103709 39899694 38186409
16683 38186409 36203689 34732571 33164927 31547595 30385338 28768037 27429453 26531905
16675 26531905 25272151 24239436 23170299 22423914 21179226 20911599 20023850 19166620 18397375
16666 18397375 17791524 16884620 16291799 15662135 15639094 15112613 14439918 13622506 13438100
16657 13438100 13213734 12817545 12314899 11964556 11705807 10926183 10790304 10474812 10090006
16648 10090006 9900464 10070454 9285689 9005178 8908866 8854497 8345222 8237984 8130952 7783929
16638 7783929 7271469 7201282 7617559 7120567 6830316 6450869 6649383 6426672 6577167 5950900
16628 5950900 6085352 5949982 5567786 5443293 5221338 5589987 5289232 5123894 5121857 4547253
16618 4547253 4558746 4601211 4423615 4520909 4578151 4513516 4405610 3979089 4102145 3705857
16608 3705857 4279912 3759358 3337389 3516185 3709713 3495523 3493676 3295589 3246912 3534841
16598 3534841 3346843 3012919 3124738 3199504 3364316 2815817 2655483 3314618 2452823 2768777
16588 2768777 2611158 2909646 2808801 2696081 2690363 2800856 2553049 2603230 2113073 2120727
16578 2120727 2384111 2092931 2376731 2569551 2352354 2204085 2002205 2107046 2056164 2036970
16568 2036970 1991452 2101248 1688728 1463813 1920483 2185013 1930861 1799540 1771936 1737473
16558 1737473 1779446 1909393 2043854 1659532 1825602 1804774 1284533 1725837 1303072 1721582
16548 1721582 1387464 1592010 1655965 1487670 1649817 1545305 1384484 1464882 1421020 1625388
16538 1625388 1422864 1565068 1185901 1639392 1275071 1189503 1007198 1402309 1097691 1157105
16528 1157105 1014188 1231516 985589 1332641 1140125 1488051 1197591 939498 1306295
16519 1306295 1267778 849622 1018347 1245106 900636 903492 835327 1181153 933902 681993
16509 681993 783480 674012 1033879 736174 1039276 1006643 745214 959221 960566 689520
16499 689520 803788 915790 742675 1021846 564813 867036 602039 344218 548391 918860
16489 918860 466910 470415 374653 1186274 923787 901213 493222 534718 795685 688378
16479 688378 603249 95313 593695 504976 819099 659830 625015 708384 786118 574020 797386
16468 797386 793310 298723 738180 406766 443191 596397 626312 489714 733754 911616
16458 911616 534550 574046 442894 671364 537552 591463 105641 431584 758664 506582
16448 506582 552452 779671 534808 668207 715504 303240 584977 391711 396360 800546
16438 800546 726411 522624 421211 679507 761411 517904 189165 410356 312625 420177
16428 420177 428860 597499 539445 404029 398035 376983 423881 260367 643134 644920 402752
16417 402752 257559 523467 523686 480499 419792 68168 701492 347253 327192 446546 256254
16406 256254 525591 443150 -54292 380949 173632 523144 549332 360257 304651 -37591
16395 631147 253827 197863 523814 325495 540180 525855 281555 226227 223084 569500
16385 569500 316523 348003 195938 213633 607434 459226 86822 249907 207387 15905
16374 455468 449419 418718 314673 120643 732770 721107 295361 216645 -51036 351371 177673
16363 177673 111690 282742 306818 275435 220061 116530 228630 259332 337628 223260 120542
16352 120542 138012 50277 318457 223780 307082 378539 378507 201913 231343 514504 203489
16340 35931 32662 122204 279580 -173519 435955 164772 389966 -23855 520344 363925
16330 363925 229825 64428 10981 317358 539703 145935 22438 -148973 286184 8859
16319 30989 89684 544639 603126 -635 297836 49227 443583 116273 -4275 238769 158386
16308 158386 216435 -61173 125703 300515 216444 -115351 137107 160702 -107536 15000
16297 134082 243053 -217513 142157 124994 203072 285986 199244 -260174 28233 135646
16287 135646 300692 131400 292893 164235 35658 63932 -26675 105178 322862 -115834
16276 246042 356953 435770 238280 380676 -145421 223436 226527 279588 83697 105585 219755
16265 219755 69880 -555 13936 -6610 -122529 154371 273434 142905 -41154 65347 94999
16254 94999 152641 153801 104568 111159 130499 204445 178293 -86481 297776 -390117 169297
16242 444558 126277 -122476 153398 14702 190035 128472 97085 101148 465878 73757 -72903
16230 84290 -20079 -52500 282665 -159823 -361752 395066 293185 -149053 103975 56660
16220 56660 164332 73274 94985 414448 153212 39366 107104 155479 -238048 -66517 -108768
16209 -108768 118783 51558 51103 35375 330560 169467 39442 100370 184207 -151198 4633
16197 251620 224791 201896 -147206 16704 227549 158329 169907 -367852 431765 181849
16186 67686 -49607 228871 -95200 147078 -35555 -399898 207769 -31757 -100146 176144 -72823
16174 185374 -127295 -196076 -66854 114257 -117299 144460 82748 79674 -23927 80391 -42446
16162 -19869 74463 169040 -3390 -133897 -404864 96590 -278423 -108788 -49414 -175900 44848
16150 -253273 -272064 364795 101235 -135146 55893 233424 -56239 365226 -26561 262420
16139 181709 33759 119609 170676 273172 385394 39640 -317002 32099 -301199 -30599 109558
16127 109085 138622 269366 -20949 -274880 -159012 -43216 208021 -190116 -155003 18873
16116 -10055 137414 354568 -50636 -62461 259345 29031 163143 10521 357222 47404 128113
16105 128113 233558 -83615 288216 257305 173232 -10093 168881 -3757 -216252 99236 389169
16094 389169 69 112203 -36640 47238 -78619 -183207 134699 381306 93440 -11901 142561
16082 142355 52888 -57290 181463 5823 -323978 -260305 -142261 -115311 -151654 -199656 -189244
16071 -189244 48150 -124266 141871 -93256 -274028 256135 100274 93014 -38150 -120225 50769
16059 -125377 -6570 81714 -338286 296539 -61893 81358 -16160 -23465 -347805 101497 41540
16047 -15546 154523 -163228 95620 -307695 243911 -118883 -126138 -116371 200563 3454 -221695
16035 -50245 -259498 11794 -86546 -78692 223238 -396485 99265 -178634 -113297 162235 -53775
16023 -300537 238857 30726 165094 188214 140952 85104 -91893 67394 -259588 352261 -169475
16011 -190129 -98744 -277217 -136936 144787 16762 96178 -172193 -91011 144699 -141547
16000 -185026 229566 76992 1764 -53425 30770 -69626 -50383 168770 -204329 154794 127470
15989 127470 -294991 -411397 136372 28017 -292647 -3523 218079 -170813 401245 228006
15979 228006 -23302 54628 350368 -74295 -163376 284625 -104214 -2223 -88005 -42600 69127
15967 40429 -4252 -207038 105069 -28368 -155376 -53837 -249146 -184416 -98058 -155717 420235
15955 -122876 -19241 -243449 -19789 38929 7818 -42229 -146581 -15931 -141940 129695 -124133
15943 -124054 72787 164463 -102807 88297 93064 75552 233506 -264686 7733 190643 201207
15932 201207 276504 151135 61714 95103 -190920 -458070 -102258 -22113 -44795 -33068 -60708
15921 -60708 -88420 -49102 -125299 -273884 -218891 197756 47512 60940 -136916 -191783 -147456
15910 -147456 -115132 -20845 64442 69004 -133621 -66063 62665 -343052 193505 -108951 -5570
15898 39889 40173 -196593 -331267 -53302 9539 288391 -382021 -103441 -96109 180123 36937
15886 -147627 169712 -255916 -45013 -45823 2883 73706 -41671 -221241 -138187 -118689 -53461
15874 -258461 -100245 83672 -203563 80646 -142308 -197162 -33303 -80932 -149243 -251598 -236480
15863 -236480 -64141 -189566 -2564 -197617 221320 194309 -102229 -122400 9775 62370 -66563
15851 12117 134550 68563 -64901 -205990 59732 62788 -172651 432836 -68294 33696 96743
15840 96743 -256467 -160835 339229 -66059 -111599 104179 -144657 -111653 85571 -258938 -49834
15828 239012 -24829 150086 254591 -242038 3988 109696 205324 -23588 48120 -733 215113
15816 -434439 35751 135616 21827 -18795 25012 -418015 -20354 1931 -25698 -182889 -196247
15805 -196247 84343 -14851 -100930 -56233 55934 97009 31018 -97910 -69643 -178989 310295
15793 -206236 89953 45703 46629 -221275 -9786 -241314 -239443 167637 -401212 269210 177356
15782 177356 -13482 -3537 24339 115467 -179980 -157260 -32662 116331 -137334 147634 -371451
15770 -26904 -280891 -61163 201990 59535 79591 65569 83215 92117 -211619 -46896 -73433
15759 -73433 236738 99296 114818 98628 148875 -249890 -248271 -47645 -44877 -5488 223192 -22828
15746 138982 270845 52391 28985 -220574 52870 -176407 -353168 -30251 179612 86529
15735 -89525 -108773 126373 -78649 -22149 228173 -309451 -96280 48310 -224119 -295093 -168360
15724 -168360 -453109 -246692 71141 -44000 88878 258936 1389 164376 -21098 -336003 -34524
15712 -63714 88174 28052 160932 41251 -304481 -71855 102629 -307517 -153877 -315295
15702 -315295 -164179 38365 318619 58300 -255315 54537 -260162 173800 81011 -190402
15691 -265514 241168 125809 869 -57602 66081 125826 -141337 -69972 291086 121414 -104677
15679 -143246 -135526 -174485 -18145 20328 -218953 -11456 182820 -30821 -204440 299064 -296527
15667 -174862 165278 177123 68728 -310258 -427043 -262084 -118462 -176676 -154928 124023
15656 -209614 168607 -224575 -445759 170005 34085 -77664 276401 -312948 190304 130805
15646 130805 70584 -32483 -82649 -127660 46347 -540248 16329 100250 172638 -121121 245002
15634 -41486 -198038 63411 -178966 -23134 -308116 157829 155112 -65579 -7654 -270276 118736
15622 -125800 33505 149554 28350 -100020 -78221 211889 -1673 -238382 -40220 -166793 3698
15610 -252720 38199 -196964 303190 -87335 127480 -210674 -6502 -86234 -77589 109566 60798
15599 60798 -162233 170309 -225094 -308172 338986 159591 -133821 12227 -303436 111583
15588 178390 14944 4855 80595 77130 -178350 -143385 -66041 -23886 234270 -174716 -194559
15577 -194559 -203439 -11519 -281164 -21130 12942 83245 896997 -28186 -48756 -168058 94717
15565 130972 -152789 73184 -86797 194041 -43940 -214029 166449 5073 -40488 111772 -69177
15553 -33815 -327569 -263882 5376 36921 -423523 578813 96563 -169507 45986 -67115 328762
15541 -9513 -398470 -55696 -59042 74761 -68786 72945 36947 -282089 93948 -111733 -130220
15530 -130220 19176 -34276 364812 179847 24177 89393 192695 234932 97906 -256952 -224034
15519 -224034 416652 -223364 -20005 -2835 -240966 298751 -225331 286255 -73702 126574
15508 -127742 -9788 13866 -238677 -190450 -154990 345437 -407905 51462 152654 286891 172808
15497 172808 -68105 -199189 168569 237245 177055 243541 147745 -364136 -257966 136254
15486 -228778 -71132 -34922 51714 -20741 -482227 106338 243170 30004 -24816 -180361 -184818
15475 -184818 201773 118892 -171650 6977 6869 71066 -49239 -69740 -137884 -128959 50114 88270
15463 88270 -138488 99810 -185526 -63246 -34028 -39814 178207 254252 40425 -55371 12319
15451 29496 -50061 -393129 -132316 -311097 84153 -138271 221499 216840 280783 -143822 -113613
15440 -113613 -202621 -194199 143993 78452 281214 84892 348564 -25175 -109264 -18572 11898
15428 -39214 -83813 386996 270343 -98135 -111 135212 -85221 -27956 170137 166657 83671
15417 83671 86009 -150692 40725 83544 -162633 277776 151154 -101461 116630 -230671
15406 147734 -87114 -370 38984 -240176 -58235 -160269 120236 -75480 10944 198515 314403
15395 314403 -58088 -10855 91620 130042 -695 170273 -166081 2399 -270196 51481 -354386
15383 -258676 -265965 -198648 22998 110018 -18269 119888 22218 105906 -657 296560 273782 136963
15371 136963 63567 -188403 -105893 -319537 -223942 -288257 -3321 -339461 190410 34092 22068
15360 22068 150262 -339588 222664 -20087 -25572 75033 -253528 301327 -158900 187744
15349 -687 -180642 66855 187829 -37352 211148 72351 -151710 18761 -69953 -78855 -11819
15337 -284658 -80150 -196391 293684 -65516 278019 339086 18172 -50246 -62000 192887 138252
15326 138252 87875 230977 76198 218663 412892 336260 -188416 -34232 -142306 80704
15315 18896 123173 185914 314312 50152 200698 -101893 22709 161868 -255336 -8686 27149
15303 -622990 -150009 185884 89009 183387 -62655 69462 -228551 75967 -278724 344655
15292 109714 -246327 -20090 -39868 50352 -94670 306292 261879 -128026 86409 121180 171067
15281 171067 60007 151570 16117 11023 269364 279175 -92296 217048 64122 6757 108777
15270 108777 67221 341143 369227 164506 116588 -45856 -81079 73633 -215037 526870 140162
15258 189703 160203 -33877 39896 76913 175958 79285 27618 353308 378488 220975 1000491
15247 1000491 1438856 1097231 1900655 943330 84614 159916 105515 36578 -22412 301054
15236 -135495 38374 166448 -205820 97364 303359 -132216 -198396 -305911 51667 109243
15226 109243 -122507 221019 -106705 -40835 186978 1955 -29526 277126 386403 -154927
15215 428411 -46493 273734 -346196 -101812 -5307 124542 242096 15611 -44060 -358946
15205 -358946 125585 -21649 103356 126539 306553 299926 -6333 420113 -107810 -98667 170617
15193 -56208 76367 -795 96647 20529 -43509 75183 129941 413934 157765 -81366 93667 -177244
15180 -318240 492148 -55900 265812 -139878 -220536 408179 364509 -22625 67113 -150506
15169 -252855 -327168 64744 114777 -47962 -188 -55843 63023 217377 470188 -141850 -5844
15157 -3177 -16990 1979 107098 422836 203902 -76242 133991 -123303 -118438 168900 -65422
15145 -69260 327781 61953 252224 -81499 108472 -25002 234101 22936 111017 343583 -26069
15133 -161160 193437 -170674 358010 212406 326222 416544 332757 340900 124455 268383
15123 268383 92597 62992 58696 -164971 264444 120418 105726 -177373 118874 151260 31101
15111 3016 -30945 184455 166970 201277 -172227 110438 232516 -32237 -225442 -101936 298344
15099 340704 -48253 64349 -428701 265184 197729 159067 114101 237533 8582 150278 286530
15088 286530 -43484 153210 149043 454049 -208341 51156 180307 195266 230535 197713 279255
15077 279255 262647 477783 -98120 387768 127945 245410 202642 8207 408231 -156172
15066 481869 93543 88116 54447 203086 303939 182213 400247 -14446 -18254 55682 100539
15055 100539 102760 167427 -137004 216270 58378 140624 -18305 225181 311393 143663 -117589
15043 219274 17792 103490 79611 188864 247159 70539 81270 221389 122681 -106166 245999
15031 -62852 195571 495931 118221 145773 417419 183360 421032 287338 -93413 114994
15020 144918 104388 163789 189172 376140 681321 119119 283729 23400 -192408 153921
15009 151788 32156 107306 231705 46274 35402 -102397 -111342 337806 61315 -386230 32488
14997 242491 304471 535650 279054 194019 23012 96253 174086 308886 268408 218723 -67869
14985 137112 227842 301675 236546 289020 175267 340340 261936 137576 249169 163768 162180
14974 162180 248433 414068 407083 200255 170145 335153 358842 54827 57496 139173 277789
14963 277789 197128 61212 505573 12774 165962 281213 394348 429972 480674 217613
14952 440829 356838 329594 312332 313603 354734 455924 72122 166022 279351 383690 127852
14940 487381 70088 126591 255012 331328 460212 301825 455554 599731 157542 133640
14930 133640 248570 132516 356190 203439 158368 395405 123289 258216 61475 173875
14920 173875 434603 147087 236524 490311 312059 468662 289677 323380 124030 267443
14910 267443 312560 357255 261782 165784 294641 237730 151490 -26066 245080 512109 594752
14899 594752 250172 302942 341403 242479 614383 536442 422376 313399 170215 438159
14889 438159 -63822 337374 203059 658341 267925 217833 571988 392483 398672 278840
14879 278840 316466 175377 227323 444296 377674 419761 287745 457256 357837 346729 254564
14868 254564 415668 4842 96855 628471 329322 285278 389909 483499 431984 478923 271955
14857 271955 317865 478553 497689 278537 170850 340936 395209 466560 408975 175714
14846 428997 418663 677458 541839 470468 480477 230376 585901 505464 479546 232226
14835 493964 103782 671565 554690 581167 161969 321767 516506 541712 645994 464454
14825 464454 105283 500573 276803 306785 555901 563234 324617 354815 289540 26728 338839
14814 338839 621953 668007 577416 632802 406303 709716 634173 440020 506302 448277 462635
14803 462635 626029 380504 634124 684077 449724 441132 633428 519924 262296 354742
14793 354742 523143 638358 666092 334535 897043 548092 499279 698590 340974 485805
14783 485805 626202 590513 879094 721041 744551 656753 693177 489707 721800 559075
14773 559075 667212 681993 603490 466390 533771 488181 582199 481027 531985 774912 791485
14762 791485 717497 993284 562847 485475 783490 858401 656707 769130 599106 736529
14752 736529 233430 325208 594949 779251 499979 660372 742156 677308 670981 804733
14742 804733 1000202 814767 794277 745219 1137816 686461 809044 555201 434849 789710
14732 789710 1257099 1222705 446549 560448 722348 702555 778000 697629 461107 625851
14722 625851 723699 884788 953942 604076 1033915 621269 866071 975415 985925 968583
14712 968583 1001051 917912 922586 918987 524140 1006463 643311 936789 1164003 915657 993041
14701 993041 916432 651003 679678 1040196 949650 1050953 666448 1033303 956737 1007155
14691 1007155 846495 743290 899156 853280 1062596 1004568 771076 865632 898434 1088527
14681 1088527 925960 1184275 948411 725043 899787 991012 989370 1163740 1160315 1107499
14671 1107499 961145 1373959 834333 1163037 1038484 1031800 853479 1028505 1056441 1094195
14661 1094195 1398890 1354339 954252 1023601 1052389 1201682 913172 1374901 875743 942123
14651 942123 824811 1044497 1468946 1121734 955038 1137568 988126 1106434 1126546 1136383
14641 1136383 1365039 1345407 1334393 1412032 1101987 1430872 867126 1089717 1445008 1159659
14631 1159659 1295875 1656692 1291792 1414977 1612121 1367310 1333616 1161153 915041 1477350
14621 1477350 1492758 1409798 1254967 1458365 1390775 1514083 1489487 1305297 1427609 1746925
14611 1746925 1246391 1484258 1653947 1749755 1326216 1976235 1503886 1793567 1804101 1547534
14601 1547534 1638945 1387940 1756375 1522668 1435795 1658204 1664793 1577045 1922383 1788967
14591 1788967 1820205 1756558 1687499 1590551 1702589 1705578 1556916 1778601 1622794 2272527
14581 2272527 1925248 2030991 1938529 2092986 1885997 2239278 1660963 1585296 2045905 2318065
14571 2318065 2133749 2145711 1943498 2507619 1914942 2210797 2562423 2448701 2656916 2497883
14561 2497883 2616222 2793540 2765022 2926846 2967581 3183235 3440765 3343993 3832177 4029680
14551 4029680 4664319 5648551 6789679 10107890 17600404 36433551 46792186 21928450
14542 9790379 4567274 3119714 2491260 2368338 1769771 2073819 1963360 1967175 2061884 2026229
14532 2026229 2409347 1877420 1969519 2488788 2072483 2187705 2582944 2658516 2396180 2562117
14522 2562117 2234468 2407473 2497294 2344039 2777963 2233141 2576079 2936328 2658994 2645169
14512 2645169 2868561 2430194 2691744 2732034 2659104 2858530 2928891 3078604 2816543 2726971
14502 2726971 3214528 3264751 2906191 3151277 3470134 3386508 2818900 3631083 3201924 3676565
14492 3676565 3617010 3541842 3629716 3676087 3778099 3975237 3570908 3559252 3646035 3434475
14482 3434475 3799366 3897826 4287597 3829007 3809228 4296397 4152842 4052514 4101903 4187829
14472 4187829 4167455 4242295 4537269 4473786 4524334 4497294 4711188 4486529 4689194 4864028
14462 4864028 4975835 5111346 4902598 4357336 4686904 4987075 4845721 5026400 5142230
14453 5142230 5318861 5314718 5389173 5348075 5394930 5692934 5517436 5725336 5699655 5914288
14443 5914288 6156328 6030189 6033204 5976518 6185054 6084968 6280824 5936911 6383091 6740742
14433 6740742 6644467 7034757 6944941 6945110 7100497 7107894 6835039 7198213 7396149 7192978 7844762
14422 7844762 7803518 7719665 7702811 7916855 8228185 8082767 8158283 8778395 8424047 8875750
14412 8875750 9054884 8990506 8863866 9232268 9601709 9105532 9629054 9453997 10139753 10311901
14402 10311901 9938500 10419730 10738776 10646187 10931050 10931235 11588893 11259056 11618451 12052507
14392 12052507 11977090 11843051 12312803 12489005 12546093 12684013 12988821 13437827 13814606 13830089
14382 13830089 14248823 14257370 14931896 15100344 15081216 15527487 15793391 16224604 16443558 16753355
14372 16753355 17132840 17629596 17832648 18262923 18281772 19111765 19017650 19572451 19703313 20508852
14362 20508852 21156659 21340088 21729598 22775100 22715489 22843626 23894806 24232939 25115674
14353 25115674 25612714 26205616 26711379 27198362 27979993 28841793 29264994 30325021 30741004
14344 30741004 31834308 32607775 33326979 34383551 35129232 36416044 37130631 38014426 39478142
14335 39478142 40266019 41666895 42907737 44266491 45421277 47087035 48678235 49746735
14327 49746735 51447001 53289057 54354251 56839974 58707188 60557193 62867973 64962941
14319 64962941 67167985 69710385 72090243 74743502 77824586 80574174 83830377 87299203
14311 87299203 90623017 94203134 97787518 102394690 106696749 111057436 115874333 121080853
14303 121080853 126383750 132069835 138119003 144841822 151342937 158071972 165733310 173980356
14295 173980356 182123024 191057644 200442451 210434554 220526838 231296640 242510793
14288 242510793 254540599 266468712 279190262 292068194 305478708 318925415 332657343
14281 332657343 346806742 360407659 373615463 386463834 398421583 409683372 419915205
14274 419915205 428460700 435069634 438743926 439901170 440010388 438833998 435137545 429519235
14266 429519235 423320260 414864478 405046631 393772951 380851417 367355089 353352873
14259 353352873 339001260 324176111 309760296 295473000 281776716 269441842 256539673
14252 256539673 243976682 232126939 221045116 210168893 199894734 190431100 181245207
14245 181245207 172647731 164677029 157507540 150156262 142766433 136340440 130495626 125049614
14237 125049614 119705239 114462375 109497656 105196109 100524139 96408248 93247561 89660707
14229 89660707 86013258 82512482 79422887 76206168 73604426 71108563 68390235 65966233
14221 65966233 63595518 61583344 59528186 57626415 55927290 54110993 52155137 50852170
14213 50852170 49737161 47949143 46548386 44594686 43614700 42526963 42375772 40820549
14205 40820549 39037394 37683724 37284384 35623066 35384438 34770601 33246722 32383675 31497812
14196 31497812 30828698 29827697 29353951 28571008 27654196 27201075 26493939 25941138 25414485
14187 25414485 24404988 24286456 23550749 23168508 22785101 22150790 21644193 21188124 20570574
14178 20570574 20353803 19949814 19549874 19021533 18759168 18258576 17892723 17325970 17192180
14169 17192180 17024757 16585051 16230422 16202191 15844590 15577192 15232287 14946712 14491366
14160 14491366 14533146 14104788 13938733 13429000 13554186 13346176 12930419 12512380 12397304
14151 12397304 12384948 12500868 11933786 11572964 11655745 11302890 11054728 10884032 10672590 10501164
14141 10501164 10403347 10844071 10043150 10211174 9828951 9662976 9594312 9596545 9130694 9063779
14131 9063779 9175934 8953897 8813030 8996303 8909447 8490043 8372115 8299423 8320238 8242733
14121 8242733 8054995 7806924 7843193 7520353 7539581 7368782 7026392 7428849 7199231 7184607
14111 7184607 6951285 6925037 6659817 6658834 6492811 6590576 6350459 6348398 6333284 6290804 6402080
14100 6402080 6115615 5864138 5932298 5897696 5690142 5538866 5277338 5537657 5278245 5282326
14090 5282326 5513777 5558230 5350469 5463463 5088935 4808301 5179554 5108618 5103197 4952873
14080 4952873 5032169 4712884 4577204 4398081 4483897 4321992 4684023 4600688 4225941 4592677
14070 4592677 4484410 4208546 4429764 4225224 3890180 4202773 4119301 4081239 4003917 4116976
14060 4116976 4040793 3973123 4069714 4192065 3645180 3948339 3603151 3575480 3803286 3547706
14050 3547706 3220803 3486505 3626937 3650383 3356822 3238499 3616516 3314424 3575287 3508260
14040 3508260 2963903 3074518 3241401 3039005 3299074 3113409 3452461 3158973 3171367 3146844
14030 3146844 3213218 2969531 2971133 2950435 2892093 3130619 2552462 2943102 2440062 2367470
14020 2367470 2438303 2771029 2540632 2551788 2674938 2530629 2433581 2430002 2334637 2439103
14010 2439103 2105840 2472917 2567316 2311159 2034930 2279888 2273997 2170347 2228348 2380754
14000 2380754 2119175 2210753 2329510 2164550 2041759 1734735 2223421 2563577 2441006 2341821
13990 2341821 2892065 3462840 5301655 10669142 28411024 48172096 25529576 13308040
13982 13308040 8000779 5660153 4908038 4075331 3507657 3434924 3101773 3262873 2643319
13973 2643319 2554508 3011034 2958461 2235580 2632740 2335512 2347636 2645051 2344899 2082212
13963 2082212 2139401 2128733 2313668 2125236 1866778 2111182 1931919 2029672 2045042 2204197
13953 2204197 2139539 1938348 1917454 2230207 1983452 2016738 1927887 1940760 1915512 2174072
13943 2174072 1708233 1621623 1857713 1871461 1624489 1708991 1661193 1465303 1593810 1694383
13933 1694383 2113812 1600285 1796053 1527463 1791068 1441752 1493577 2035821 1972163 1577235
13923 1577235 1915078 1475305 1688736 1243366 1555447 1659071 1734757 1591272 1386668 1604009
13913 1604009 1334584 1587864 1449413 1524208 1377289 1445836 1577693 1343800 1459079 1294841
13903 1294841 1221311 1309435 1463066 1453684 1405010 1530115 1550476 1107438 1117632 1087659 1416675
13892 1416675 1397578 1302021 1334247 1289702 1478432 1370678 1199571 1284240 997315 1085734
13882 1085734 1370342 1322012 1073545 1105830 1358122 1398633 1278445 1054493 935059 1073874
13872 1073874 1181635 1390062 1047337 1251343 1278832 921393 1096135 1128448 1165182 1121224
13862 1121224 968853 913688 1341372 1227777 1011472 1130292 993939 1045570 1000833 764588
13852 764588 1149134 1080844 872143 986679 1116808 1087825 1171304 1202030 1070959 933218
13842 933218 1156312 815642 756661 894691 870769 846989 955047 1281913 932916 830827
13832 830827 611989 1054018 926689 1140947 677158 1065092 999783 899457 925923 1140053
13822 1140053 912309 930848 800172 876019 901604 602095 760414 934938 1021936 676162
13812 676162 972006 722909 999416 784448 1132427 732484 655306 704492 555973 709083
13802 709083 473748 1047315 926061 1000175 671553 1045113 542414 854709 1149994 1118916
13792 1118916 946118 650556 658637 767799 600240 318499 747982 666647 876361 562747
13782 562747 820657 766872 699218 849202 479945 683140 689307 756585 1221111 713382
13772 713382 866747 734919 648931 1010335 454370 828946 648500 1004729 728296 396735
13762 396735 852263 618081 377360 1048640 628444 935365 226595 997722 614248 126415
13751 551096 676725 570131 625831 203849 727389 953593 497041 677579 480634 775208
13741 775208 871620 743950 446264 436900 587515 114076 919146 597710 856573 279942
13730 521614 559728 487273 656395 405275 755295 602306 573391 874969 212905 752268
13720 752268 542731 424894 354524 289306 551234 628126 475963 409027 472030 802956
13710 802956 432758 795754 297379 988641 619992 629042 393912 324031 490212 391228
13700 391228 355597 806898 655134 494691 633810 796598 451499 288574 651040 276404
13689 789062 547473 675097 367782 439798 780494 480916 606601 754603 256332 602144
13679 602144 -5827 78851 593143 195338 258233 461857 515865 489362 545117 556982 379751
13668 379751 269679 456541 394360 511942 581527 626910 544261 501497 525144 369544 212792
13657 212792 690496 289841 602115 483630 605462 348202 149558 528226 416067 504851
13647 504851 368970 485614 186467 533846 114147 366684 633022 444665 536849 553883
13637 553883 471351 222843 271830 132745 371238 586981 -1814 694330 402820 252843
13627 252843 318040 306302 262543 271984 292659 351172 244066 240650 760169 301382 267718
13616 267718 316220 277113 -29753 330740 379333 453952 197635 480410 767171 335549
13605 -18821 506297 353774 251407 224395 237118 223834 441861 504154 282392 403656
13595 403656 664398 -110407 445892 220863 348932 225719 606609 352569 240629 551550
13585 551550 242688 501188 430128 471766 -6329 361354 294888 194637 517132 661916
13575 661916 307715 -13382 200414 290584 187101 -93084 512893 450580 280066 155544
13565 155544 -154126 -56452 671179 248425 192554 304428 103298 446479 331157 106226
13554 293922 424681 480212 295029 652580 159444 210475 464515 15182 -149000 416550
13543 427823 307730 498562 288421 281035 167346 347226 439770 306274 744767 31778
13532 276061 321809 486213 23968 284413 504987 94744 442074 246797 -56580 76862
13521 598179 497717 469293 40899 328073 173912 358066 111692 117676 248107 12108
13510 130896 -760 543419 412091 74409 434278 52826 315363 -11625 437296 252643 39867
13498 196710 375185 491540 481686 238255 228123 287741 137190 181369 -64134 320117 103292
13486 379103 107961 197383 131424 85453 437313 46458 353909 568081 243359 202185
13476 202185 338572 200855 13073 140425 125251 547931 -2073 254973 297416 305316 228116
13465 228116 252430 210650 270241 237709 -7883 66519 255773 49123 323333 247410 458217
13454 458217 238186 170341 69728 128419 125073 348785 256197 136481 35631 364516 100139
13442 201191 303515 509363 242792 -62946 337127 105570 183830 46226 388784 32563
13431 355330 483145 415624 40947 50027 523829 159506 36379 232269 198741 330646 42290
13419 42958 326633 -222107 -20936 -41669 349948 91428 -305640 203841 51315 -6722 365796
13407 213549 137679 156480 14695 -92475 137105 -107568 -58218 -3164 74831 192363 238064
13396 238064 372493 310340 42641 183602 287160 335753 199703 77349 317783 457061
13386 457061 350415 248283 63011 208742 250339 346995 133624 499221 336742 254218
13376 254218 239697 465766 -38567 112841 454813 262436 203239 -25777 129646 231186
13366 231186 451090 30972 -14490 520957 70173 295965 439682 271723 163313 123724
13356 123724 19069 383630 5880 160608 278376 334246 138606 404754 69139 367625
13346 367625 268052 415818 413840 167852 432331 684784 170801 397671 -36844 426657
13335 -123794 90281 110612 26419 474111 275563 202496 128306 11272 79681 250799 -53570
13323 127865 165411 323252 281801 6976 -3867 162455 101449 146486 4970 -16158 148635
13311 288221 262626 342207 250823 182284 -322449 167039 202622 165108 221600 136908 249190
13300 249190 353736 349104 365399 210256 -1728 61934 274708 272636 -58493 71862 109303
13289 109303 59048 -119720 59854 -20819 473136 -70956 -3297 131371 181704 117013 331072
13278 331072 55621 212596 -19721 320029 181626 131848 -10542 54881 50173 209885 -7112
13266 258261 196433 91315 298694 485730 379953 73526 -269001 117954 69140 228821
13256 228821 -96202 364607 182964 453535 -30137 309706 220268 87122 261851 137963
13246 137963 -226596 -76051 -38710 7650 324051 186363 -53731 43519 -37439 143255 -79690
13234 -85122 246751 -145027 39759 -182855 -132710 -36040 287255 -44598 -39908 -149940 -1365
13222 197103 141849 -10434 56468 -23722 -71205 103695 29940 69577 107230 102384 -244635
13210 345754 -47135 320280 -192907 436204 73159 49538 48741 154530 -123142 142840 -105524
13198 170099 -71125 85603 329057 -93982 134547 59715 224560 270808 26460 -94576 365283
13186 42913 347388 75022 194922 -1958 88952 -327316 65321 37737 32062 533635 -61713
13174 164067 -152075 87023 -79564 159239 166074 -49400 233023 -228076 178784 126820 -18043
13162 316766 346547 119111 5436 120010 -232069 179402 356581 97592 235902 16585
13151 231522 431070 53808 237645 111544 235849 39978 187531 -53285 139265 -168784
13140 -54882 251330 120459 327689 -80563 -128969 412464 -64720 -154416 -122383 105875 109568
13129 109568 -7774 -301923 149685 189656 -266550 94209 -168541 116109 6220 -523787 93791
13117 23964 485369 -42915 -156837 -184331 -36337 268742 236212 217681 -11759 103914 -119406
13105 29834 -207255 23011 -72027 136924 -90437 148547 294147 111451 116114 -174557 -105233
13094 -105233 -97498 328818 -102896 -118556 24031 58123 163709 -17477 -1302 144784 6574
13082 -175680 -181908 -150808 235724 -149454 241778 -523952 270837 59801 -261039 -58491
13071 95230 296903 -324070 -21050 267471 -53206 194188 250384 73493 94691 149427 547202
13060 547202 -56195 80837 65417 -147322 -23857 -32932 80008 76665 -220272 -56281 62523
13048 -257158 111753 143848 100545 322744 539015 -138346 18813 -100023 64720 33683
13038 33683 322512 247219 282306 125152 -129737 -49925 305875 108034 149803 251614
13028 251614 38984 8375 47938 91670 -230439 489501 261622 -122455 105314 -26855 114390
13016 93506 266214 167918 -109146 98663 -36299 173528 483963 -254597 259420 253681 -8532
13004 369506 -6649 183081 205936 84126 368323 -104434 39421 -102088 281154 -228638
12993 140639 182388 82029 366080 209642 5986 -284503 247017 276840 142842 105584 320104
12982 320104 -251020 67635 236394 169769 -123416 -139112 -205213 251790 -388339 -214394
12972 -214394 155979 -33711 57913 -51767 -406823 -195305 389283 -95549 -373440 -33930
12961 -203925 -147476 -181800 311224 29190 -288496 141479 -224812 189338 -13194 69899
12950 98246 82069 -116619 314810 68783 87530 -391806 37029 -145022 -190859 -41865 15184
12938 -66046 78647 74716 144046 139052 -73690 17279 -19063 346071 9124 113369 -62732 108005
12925 246843 16367 232282 43711 -69858 -147722 46168 4378 -136210 -214227 1320 -91424
12913 -6891 -5299 146005 -119710 74629 -17476 -128624 25476 13320 -158980 -243241 -146167
12902 -146167 170087 162096 52728 -41135 140514 -141227 269706 -54629 63455 -116960 14334
12890 6163 147205 -252134 241471 13533 291931 174078 -97371 -17755 206203 200504 33823
12878 -43444 120020 74830 55871 128419 -85425 111063 -99054 -221351 223232 32769 48674
12867 48674 205967 -50028 -245923 -35805 -79619 27321 124797 -23671 168811 -112138 -182912
12856 -182912 149095 71844 -16623 -89626 274035 130219 -33792 76359 -198299 201025
12845 189288 -35762 -319847 120948 57558 101923 208317 113995 224301 -61194 -215127
12835 -215127 -208177 256929 -43294 -49013 248523 80549 -45351 148864 -326600 -40313 -210511
12824 -210511 -108558 28372 98876 -50183 350823 -273419 178055 -357068 11967 -137291
12813 -140969 -49377 72573 -51779 -342533 89229 59866 -45480 159677 -55385 52171 311697
12802 311697 -181541 293122 -217017 244254 27270 2319 -123497 -53458 -10043 -178475
12792 -178475 -318989 -152426 9124 -18858 290041 213233 235212 317003 -246845 -199272 255778
12780 159144 167608 -57274 -119990 48181 178346 -32385 -251006 5817 207965 -336530 -193578
12769 -193578 117157 -217688 -64129 -194971 -15483 65605 144311 -20935 243100 147840 271174
12758 271174 297076 -170578 -20548 316982 -59213 137879 -171294 -153471 353674 333741
12748 333741 -33070 -187361 433366 26133 -82936 -272158 2202 -152730 25073 -74784 352926
12736 55684 351966 217113 -133687 -150686 -85381 455636 -344297 108750 -174288 -75421
12725 -115895 147233 -142111 1872 230642 -112671 234491 -222604 93337 76923 162142
12715 162142 128255 63723 -65071 172139 41854 130670 151064 26546 83403 192262 9209
12703 60791 505759 28120 202557 -132636 149292 130735 -159320 -90431 101059 58915
12693 58915 -70683 42234 -29647 95654 40640 121800 -71142 123753 350358 37502 355431
12682 355431 -17075 239706 322267 205060 -223171 493863 77054 146875 100075 -245328
12671 434451 -7213 158142 -115898 -457064 5265 100930 238336 293177 938 335128 -116800
12659 -37397 285904 51096 -110724 195737 157058 28442 -159627 435390 -252453 19836
12648 67842 -102864 72582 15355 22904 40863 232807 348257 161100 190343 279196 -134148
12636 -262746 56779 115314 285889 362816 -83445 -20769 151751 203560 352831 407559 67135
12624 248496 214743 29592 -29944 143418 174683 129497 341365 -21758 -77820 -259794 -58817
12612 177111 -239466 -243704 -76264 16266 -168307 80359 -97225 -89988 358903 -30501 314539
12600 208206 -173739 -79524 46601 52737 -369419 103828 73551 4524 31969 -35993 78116
12588 111288 97065 110336 421143 196431 -66080 -45689 -180091 -54581 -143458 31498 -40085
12576 -8373 -46956 67482 77405 22565 341771 489264 -14690 90165 32641 -80216 -104858 99980
12563 -246561 207237 11727 174751 38131 306130 47839 35779 -87778 -2934 128446 230764
12552 230764 148398 -174742 14723 63258 -84303 171738 -356891 -167165 -77360 64897 28941
12540 101969 -79157 91881 171342 -89118 -41334 -21841 125348 -234587 -159966 -229027 -251195
12529 -251195 -27361 134765 -58588 94524 -28857 -213439 110192 64143 -154343 -193029 -3702
12517 -33045 336772 30807 237662 -187438 236078 105209 -287357 311325 -55225 25774
12506 6659 5696 317089 -68554 52808 -42059 -325129 89885 39122 -57163 -264316 39561 195224
12494 195224 -163040 -156512 -473012 -23753 330062 -131749 -60199 -229649 -43447 -86985 -16280
12482 -191489 190959 -30580 -188915 -246378 198011 102564 143404 -276947 214188 -149617
12471 148268 -97691 79484 -172189 59087 -367731 165738 -277876 -46485 84437 -46439 -147731
12460 -147731 142267 109026 -197978 198023 -141690 -250996 289787 258688 -314996 186847
12449 76442 -74711 383702 108315 14676 140794 19879 108273 446 46997 259709 45213
12437 -66153 -90746 23689 -349372 -293199 74244 171500 148353 -7322 -53419 230372 -134632
12425 43020 83319 70448 116102 183106 -89981 -350877 219789 -253173 83653 -154776 -259518
12414 -259518 -115541 -216568 -256426 -89541 37880 -125429 -26820 -101634 34063 104274 -79766
12402 -297734 -336995 -39000 9478 -66654 -331352 -69634 12905 -39929 -70109 -117805 -83829
12391 -83829 -323950 -82124 -42821 -1508 -67597 44341 98379 60018 -985 218029 121929 101951
12379 101951 61822 462098 -77387 321367 109755 239161 -199142 -86253 90564 51436
12369 51436 -193248 6336 120592 -63507 31153 358112 -19640 -80105 -213756 -160492 -391906
12358 -391906 -123546 -49879 448364 182290 -18657 131643 135604 -218465 253886 146960
12348 146960 -58286 -64162 -152883 108538 -145274 -199722 177196 -145036 235308 161254 -215709
12336 -417397 -118733 87609 253386 82355 301344 190114 312697 344057 31510 -264610
12325 193003 -39646 -104104 138317 -65948 168818 514674 112311 66028 -34208 184839
12314 -260013 -396541 355 -35142 49694 -123647 -89970 114152 -257600 -300465 -45385 5675
12302 -431421 -30408 -56965 179116 -17425 95182 273517 -351921 -313374 -71725 151527 -18784
12290 27015 -153009 9745 -71610 102496 -58297 85724 -105706 74279 -9993 -80450 162343
12278 69357 102699 413033 334212 -184078 35370 79264 258597 -32541 220257 53051 215583
12267 215583 278561 -56710 230233 127814 17161 -214915 -224222 155786 204595 71221 93023
12256 93023 -221903 11051 -56331 174021 -70254 -26374 32447 212699 -52652 -127802 -252647
12245 -252647 -153854 -240450 36718 154991 -146911 177331 -7126 77659 250438 64441 127914
12234 127914 -85607 -45549 -404531 100083 117126 -35856 241160 414650 340929 176863
12224 176863 76910 -133034 258761 382377 -37638 38138 -222955 258930 495050 204790
12213 137821 228577 115771 175822 -107936 168353 239146 172445 101393 237890 342370
12203 342370 -533515 17004 61566 96829 48807 686011 71130 323609 354136 -314310 269838
12191 -236969 -25453 243563 152765 280072 404745 89445 143602 293114 -9709 114034 336011
12180 336011 147570 133810 57405 262545 64154 -82905 33951 178391 -38884 163197 191900
12169 191900 240710 -75854 42244 211097 128679 517217 546386 505851 290093 201410 -182118
12157 -41515 47607 393707 24614 -202059 18286 -107478 195985 -37795 147175 11017 66866
12146 66866 42047 -220762 218046 168420 265046 40502 -8701 338732 76803 41320 -12598
12134 -45703 204174 -165202 -13839 227057 -28001 -290618 190824 -40897 241698 257856
12124 257856 -72569 57959 -8834 41451 -92671 91466 75103 -112142 232465 211188 79240
12112 -63198 38006 122529 -26453 -92891 -68351 8785 -282197 32294 13947 -28163 -20554 406983
12099 141372 -35216 -37751 -99032 -140155 -112940 -111441 199702 -74006 32410 -384297 -134883
12087 294237 239997 237245 444358 -185728 201648 -16834 -120355 -166159 -19999 -233322 332838
12075 138461 100619 260307 888362 2157383 792720 114960 91845 212272 205193 -171038
12064 -141688 -130543 30510 -141497 47658 -110581 -30189 113267 -297832 207006 87358
12053 11222 212211 201255 26016 32160 -76134 35400 -260399 100505 -36304 4285 56985
12042 56985 220323 -181530 -43038 5998 -44932 2398 123319 65440 68809 358266 -109527
12030 116067 60945 -266102 -316548 8606 -82004 -145847 -222386 -202741 172430 208169 -271184
12018 -63989 -344884 -286492 89999 172216 18953 102204 19635 21131 -99580 -248788 -292358
12007 -292358 53986 -237491 -96546 -331528 -46504 -235495 -118655 -73163 -29170 330907
11996 164966 -85559 501193 22999 181515 510055 -274277 -39627 -73838 145920 -176062
11985 78877 -13559 56006 -39896 136829 229392 -375203 147057 37352 -206503 59075 -265445
11973 -14123 -86756 -494492 2584 128390 -288006 -454433 15097 66749 -179623 -196965 -99442
11962 -99442 178503 18302 88250 1943 139593 123143 318646 -130546 257683 -72386 33196
11950 -20870 99872 63161 167147 45778 173524 -132294 -457208 -81334 -63710 81432 47400
11939 47400 216549 -86418 344371 -68882 -78748 178245 4564 412156 415903 53703 45490 -54420
11926 252518 -217378 77512 138405 48572 47394 -47688 -122441 189750 24418 138905 -217940
11914 168284 -84544 64888 -50090 -47767 -49664 73396 41899 74298 -312779 -136808 102478
11902 -344223 54499 -70257 230764 -68206 -46739 -25660 -152040 -269298 -158418 100263
11891 -278321 268468 -225203 6955 -30011 -43492 49608 -182947 124937 -95310 -102643 -20615
11879 8253 -231050 -103126 -138603 -109384 36140 -88295 290676 -331008 -58815 317297 22755
11867 199130 -136656 48862 -38242 8440 -39534 -176694 217258 -73636 -191778 277366 88978
11855 96394 -153044 136793 136904 -260577 -115387 68350 158417 118961 -192802 -269299 155142
11843 -168908 120342 -344545 -362101 -4163 117303 -98410 224327 -285162 -427922 -409900
11833 -409900 59606 -156537 -69758 -31855 -53615 -111333 -71292 -9552 142787 292007 -271144
11821 -29991 -232585 124979 93539 99004 -118600 -170787 214628 100620 -223107 279065
11810 4388 -214508 -43799 124229 -165607 1291 66754 46390 349664 188899 -124094 -299368
11799 -299368 -79475 122578 -181932 -15370 184928 -33060 -85996 -48022 49143 59805 387
11787 52959 105845 -34165 -185194 -95270 -182517 -276978 170069 -77729 18304 -98500 129724
11775 -162033 -22390 -215498 -62738 40537 -2804 -349642 302699 164373 86278 197097 54560
11763 236551 325526 171598 -63355 17723 -308668 -39378 196791 -74466 322392 -245395
11752 183517 50618 44330 333366 55146 -369555 -192247 -227730 -32509 64736 28210 184872
11741 184872 -493603 -55563 -155684 23368 -278726 39584 -173540 -85475 44145 -311788
11730 58973 71907 -279824 -398222 150670 89348 -29178 -122034 -426254 210874 -260306
11719 -25574 261514 -148680 91284 31825 -101620 -27024 561 -197828 -86385 71261 -93316
11707 141295 12746 -148712 156368 -178419 -192744 -392389 -274833 23491 3767 -38844 164680
11695 -26756 212331 -169363 250308 -114470 54922 38369 198223 188026 21639 -130464
11684 -161260 289897 167161 272143 -76844 241882 194847 -74132 147487 -111799 54099
11673 -134949 -209871 299322 -25793 -58050 -215295 -60542 -146017 64599 -187541 -107754 -16746
11661 24515 197983 100687 -84684 -135551 -32942 141258 263774 -57573 302500 -91721 -186594
11650 -186594 176467 52740 52121 -42743 187072 41447 -65848 -220561 99883 136514 70562
11639 70562 -140689 10156 76444 229546 37954 -200245 -562593 -56053 -71501 -3541 264695
11627 198868 -383 -36036 40202 322236 -23801 39940 -32448 422592 163214 -27015 3766
11615 34767 56311 -27399 -167413 2474 159235 -26013 245923 -40721 111842 -182938 -376585
11604 -376585 4225 184827 337517 142959 148045 -246107 -145911 -116105 122096 133307 63029
11592 -252453 152200 343819 -71285 -56276 148102 194048 -115394 102281 -136592 -114591
11582 -114591 232232 213519 -2380 -39582 -162484 122929 223764 -335653 -71616 344834
11571 293963 -3419 284111 -186762 264535 88540 5023 -32722 -159861 -20589 306991 -166356
11559 76862 -156687 -153706 -105425 -89083 -42161 -53589 -146072 -36913 -85313 -72451 377339
11547 96390 -28147 264095 -232053 150408 -63551 -120524 -28586 -63212 160986 111165 -360566
11535 -144585 186140 -62429 -198699 -157252 -102673 403045 -100252 172294 415497 87147
11524 -86815 -127883 156318 2837 60617 164447 -234701 104612 243606 261328 36472 125785
11513 125785 -88811 285625 290785 -7859 310415 286089 70090 -1794 10180 6960 -18097 143326
11500 -21116 326355 265351 259896 247135 -255891 165102 -7642 25549 -23616 -56029 -205737
11489 -205737 -20026 284811 -166061 218549 68351 88382 296853 129257 41157 45039 -2225
11477 200672 155930 -92604 -76931 -22651 -47813 91273 -367658 167632 254786 150528 217673
11466 217673 124253 70041 -102174 158198 153529 179582 171151 255791 125155 260444 100811
11454 146748 51998 -46851 339443 2477 88521 198555 -41689 345567 85441 116851 218636
11443 218636 105846 -66148 255313 -176665 8383 -46958 32563 -175834 250706 -263035
11432 104306 -124265 -167978 -185515 -14856 57776 337802 62968 242352 442807 13497 312878
11421 312878 96395 -263951 -27694 228105 -126790 277343 -130181 224238 -82540 -1159
11410 48877 -83496 -55351 106925 -90737 -245830 137390 300232 -50053 92423 62875 388138
11399 388138 -249922 106825 210226 100073 8128 31512 32843 46177 -43017 571093 252165
11387 376467 200864 -152551 -71752 23950 -686 -80647 -152386 -424475 -167031 18633 -10730
11375 287586 -71454 -150714 401514 -175394 -108343 -159304 9248 88110 66980 -44316 35376
11363 -151518 -6968 105332 -35793 3362 198507 -606757 3059 -2704 -244008 77696 -295508
11351 85961 -110228 179060 -15933 -62927 -389526 25892 8167 -198 42918 -124304 117267
11339 -294577 -40435 119595 -112318 256330 216277 214043 42770 -209797 -499534 -244533
11328 48208 -268378 290855 -24479 55342 43382 221438 -69228 183407 272398 98695 237261
11317 237261 373766 -175985 -46792 -24182 124104 -20723 169410 12073 398016 -61038
11306 117100 -197377 -54739 -243541 25576 62409 119690 -329159 -70431 21159 4943 -55064
11294 -80667 -167091 153 -22705 -66464 -345138 187185 -180275 -312667 -296859 -14781 190540
11282 -181052 275480 86184 -202305 -200074 -113328 -11792 36737 -165710 -232486 -72436 33280
11270 20809 212426 375205 175391 -139921 25556 -164995 -2641 -269507 152059 -78960
11259 5829 -16740 -46225 67639 -77826 10033 94448 71431 -225087 -167598 -73363 234136
11247 -179016 -99681 -329050 216104 7531 -181241 14557 -295291 -274682 -616260 51901 68811
11236 68811 -79961 118496 151272 97604 97996 172152 -138241 63959 -202943 152635 120250
11225 120250 -194825 -130645 68634 -19991 -63247 196030 103622 13150 69519 -237225 -70241
11213 60541 -52729 -401777 -445220 -6301 -134746 -410784 -181180 268118 55317 -409830 312421
11201 113802 21969 -55440 -334858 25826 -184042 160501 -153766 -46378 -191331 -14305
11190 -181171 -27945 -363964 55553 -274389 104138 -210135 -376592 -199821 -206846 -302458
11180 -302458 132380 52646 -305117 -38944 -185270 -52580 380412 9405 135252 -309429
11169 131767 -26973 -28652 245181 173226 56346 -34010 -299841 181191 -7256 -399806 97558
11157 21358 224739 104061 62968 -181480 -128867 105948 -321295 -161404 113526 263201
11147 263201 -320501 -151133 184586 43911 -55073 72434 -310731 -250757 -47061 -40811 -131009
11136 -131009 -6665 36121 16306 -50537 178183 -316117 -36716 -236704 28275 76674 -90090
11124 -81571 -20901 435966 205948 -92120 74715 -197414 -184481 38434 71530 48575 150852
11113 150852 132552 48014 -138825 190736 51038 151771 268088 -157354 33064 52285
11103 52285 172008 181489 99560 219004 146693 271370 269931 172733 305679 -96740 163231
11091 147092 170478 -12473 155431 40683 350411 320449 124630 96079 291944 395825
11081 395825 249083 113636 398458 201892 17266 371644 58964 27622 106276 155579
11071 155579 248235 326666 403067 250687 532901 347705 475888 177343 480628 738296
11061 738296 365101 122915 503085 383433 871158 710178 759297 984613 581424 712940
11051 712940 993353 775248 792382 666592 789560 826599 532874 821548 419781 531438
11041 531438 745402 491305 432248 434790 592225 834892 989721 621642 715887 802183
11031 802183 348422 851445 417080 580459 674426 994859 706614 535097 350963 558608
11021 558608 308603 479254 288947 792521 704991 411825 547155 663234 575346 406634
11011 406634 607931 539780 658848 720449 521004 353530 768706 570966 597021 658937
11001 658937 815673 290218 477730 443059 859214 314705 755102 305915 271720 568034
10991 568034 700519 489928 781308 822695 754560 563745 859001 580278 1070664 739993
10981 739993 1054486 1069988 1010697 1420655 1233126 1888145 1727424 1755134 2544355 2533509
10971 2533509 2336091 2617181 2369976 2013372 2095537 1861576 1424823 1321996 1435954 1517125
10961 1517125 1520413 1559761 1414490 1349604 1390582 1345795 1803397 1198387 1327836 742207
10951 742207 801787 842464 342775 498895 147885 53042 144518 79929 253471 80210 190717
10940 190717 188304 212663 90118 40648 53299 144941 136692 51083 -80866 184294 -28435 121069
10927 -47277 197318 35804 -268006 -211636 56607 166449 170169 138135 -202277 -243939 178311
10915 113154 118654 -95727 -83885 -43526 -171337 38758 -22230 -57224 -117418 176343 -90591
10903 -91574 -133910 188033 130191 -311361 146437 142014 228308 -119297 190321 -347908 249184
10891 182553 64912 -264059 391769 163505 -167857 -221878 -20842 96669 -204976 59176
10880 244441 -513633 -52931 71573 -18493 219445 34987 -174413 -34721 24063 -124229 35183
10868 198395 152352 104548 -32835 170415 -138651 270042 220362 66606 -73781 -155993 3962
10856 -464985 44183 -303005 -64459 60421 -131633 -139099 -121973 230287 -65446 248821 87536
10844 -204462 194160 15217 -14965 -143507 -148557 24837 -223678 -273712 170569 69757 -224381
10832 60944 -234322 -494385 290783 -29944 72264 -21754 -336978 -55458 -315934 -10409 -67734
10821 -67734 111577 73715 -635018 -223612 -328265 -181311 -176023 112034 -89080 -100594 22668
10809 -224898 -75748 -251313 423812 -84209 -27865 -339887 -86352 190697 -192052 -286884
10799 -286884 -128048 -25172 145809 23110 9807 57451 -97066 6195 -299116 -19218 -295783
10788 -295783 201824 17542 -120887 -36778 126438 -38995 10478 -46711 -254216 221376
10777 -32002 -122280 89236 -44321 -156254 366336 1447 327979 -50761 -46274 194634 -202565
10765 -184342 -257846 -25004 -102195 99522 -88611 60646 163439 87853 292734 -110502 278031
10753 -153089 -82213 21531 -384185 -397435 97127 138844 -282885 -53407 163897 -190508 -89485
10741 -181847 -257139 50133 -94870 -159341 -16263 -266502 -289916 -136379 241912 91341 48045
10730 48045 142216 7086 -305438 -186837 -94230 -58163 -139971 -264842 96584 -45646 143188
10718 -142951 61510 -75023 -234452 81164 -337429 58106 340046 108614 -81854 -116006 7031
10706 171162 -148517 174794 -56287 -106981 -440538 -315563 -205771 -155044 -139270 49714
10695 34858 78973 -78134 -76377 84628 -491893 -186173 -49109 -56743 112919 83779 68 -141305
10682 -248432 -97014 -265298 197439 179712 -84256 300776 -114132 10725 110676 320259
10672 320259 38365 -163406 -43077 75611 127603 129308 -195175 -374664 -195308 -43146 74217
10660 161340 207135 -81302 71099 127344 -136861 397222 30750 -21950 -262741 174855 -165105
10648 -390257 247087 -84753 27822 127966 -309571 -245212 228982 -169760 -37756 -65377
10638 -65377 167000 104179 -70717 -77004 89410 282607 237308 69852 15839 45588 158469
10627 158469 -53692 106607 200754 -136514 -341397 136025 169932 -215501 -162865 -339376
10617 -339376 -8019 -360008 -361325 -233959 -41949 -210643 -253375 -215826 -111150 -129286 -482818
10606 -482818 -154534 -55093 -173917 -59595 68741 -280121 147295 -14133 -238076 -54798
10595 62388 126040 40344 -473502 -111594 -308825 127259 -294630 -113556 53019 -157958
10584 -280341 -161291 -125485 -313518 -153894 -374322 110431 -78074 -322922 -21786 229492
10573 -191068 -213317 -132853 -254746 28091 -10835 205416 -253137 -66065 207040 32486 -330176
10561 -17704 -70110 -169355 101613 -40331 72642 453452 -97510 -93794 -177054 -185027 -39245 217940
10548 49671 157873 86544 47537 180495 26758 43752 -110794 -72416 -17038 62719 -315953
10536 -334645 121028 -100914 88727 25120 -239241 -15925 92397 -207784 112801 -293866
10525 -167563 121583 -78202 209047 -377658 -45040 -115718 -88074 -81919 -346872 55863 37104
10514 37104 -183395 63529 121502 -250726 32604 -95353 134650 -85618 35524 -423836 33172
10502 87278 -137099 -35951 18071 -26852 -406796 -265929 211625 157942 -139744 82604 -111930
10490 48182 -186195 -166382 -53510 138071 77703 223227 309152 17982 126680 571754 325032
10479 325032 792836 342303 143243 87863 -66040 -136668 -28098 21699 -14997 220362 130770
10468 130770 25839 -175893 38784 3189 -358407 -23289 28751 -223754 -67179 191791 110601
10457 110601 191598 -69547 -31941 261154 -208556 -9898 -116902 -133801 226748 172594 80909
10445 -112273 -121386 292391 -136300 -209757 54536 181057 -26699 101039 114912 -247962 -203148
10434 -203148 225162 -398015 -98420 188517 -175313 -236265 316823 -464058 -221996 -149277
10424 -149277 71132 -45920 -288638 -122965 37869 120451 -2727 130411 156491 -296009 -77417
10412 222223 258442 2783 -237481 278362 -446502 -172671 239625 151522 -243340 -110277
10401 67069 -127458 -153835 -9501 -160435 146994 48607 -147695 -144580 -56204 -106177 -19754
10389 29645 24703 22475 -28751 101895 222022 15956 112978 -58046 -146598 5688 142604 -47086
10376 -50679 278464 321289 454238 297182 475654 384568 504227 420004 547955 359417
10366 359417 410109 443470 477170 448729 -18775 99907 24875 84813 36621 55114 144551
10355 144551 264761 300257 496537 533063 662297 25334 638288 85254 2005 265072 200884
10344 200884 326405 401753 -14109 219639 104132 29141 -70522 273880 211375 303973 568095
10333 568095 109269 200632 161791 84402 55685 341751 -11120 39261 -36458 189974 28543
10321 77542 80956 203827 321486 -4556 -37558 41753 128674 131636 -158856 15577 42885 -237427
10308 -257627 -18698 49630 24156 284051 -155987 114024 130081 -31442 47686 -3177 -80582
10297 -80582 -27755 -55945 -244278 -72545 -38808 177602 -118083 -399476 39949 1020 -153478
10285 -51294 74335 212082 7088 128720 -4369 73588 -5328 74944 288904 104439 63173
10274 63173 -190267 115652 -45688 -132954 34098 -60320 -104177 53445 42985 52091 234611
10263 234611 19077 59969 13198 302292 154148 198870 92586 360044 412270 -2423 143746
10251 41209 63458 -210307 -340280 -132262 -10317 321229 -119947 -79445 -139827 13098 74912
10240 74912 -331393 -158853 -3692 324246 -289847 -56816 266121 -59447 -270529 57142 42797
10229 42797 -108679 -361305 183147 309143 -7597 24976 -71300 -52960 -233772 -76977 -85835
10218 -85835 -111293 110619 176582 -134881 -259868 -129075 -152784 -126483 208897 -240571
10207 285346 25720 -111105 -121929 -131191 64181 147072 -184484 132308 -273215 -208909 -119159
10196 -119159 -297618 317162 -84949 -106693 -151080 118897 -44321 -18126 42997 59806 108587
10185 108587 161079 -297397 -241203 70350 -30887 -5211 -155479 -93888 -216347 -105257 -66482
10174 -66482 88353 -319721 -27519 -57870 -170407 -194214 49749 338007 109587 105106 -6900
10162 -167439 228657 37030 -57230 -156777 -155204 -66292 -140870 -379446 -163791 126436 135352
10151 135352 20066 316347 -387700 -263680 -162930 -340029 -145787 18857 32351 42202
10141 42202 -304293 -445298 -16415 -14940 -135660 -43308 -281505 113577 126161 -84602 -27889
10129 -27374 -90549 -35147 -57670 -88808 -223285 -226764 -155352 -254449 -97828 280987 -81257
10117 311226 213740 -459386 -77308 -105980 -270736 75104 -421956 71405 -87480 -196458 -69971
10105 -126091 118984 -185451 -164455 -122283 72750 148971 -149228 25830 -316805 57545 56179
10094 56179 -423042 79916 -328272 -77463 82999 -124585 -41791 -186053 -65871 29353 277692
10083 277692 -195453 -145540 86145 -37359 -415457 -77455 58909 282906 -198757 -466233
10073 -466233 -445984 -32990 -116916 -101361 -183725 -474135 -247850 297634 3378 161646 108028
10062 108028 -156086 -202519 -91551 -204568 -340 244969 -171488 -19222 -390969 161761 -33714
10050 20213 48915 77953 -116944 -205550 -172639 -27753 188323 38326 -319899 371460 -82422
10038 72592 -110574 171658 155706 42655 -445746 404146 69370 121902 -46686 -28661 -132987
10027 -132987 -39724 -396830 -16677 92425 194188 -57861 -81621 59240 -23722 277589 -244756
10015 136051 174704 -213638 -420731 167886 -324303 25459 -165773 -242442 -173774 -123686
10005 -123686 -284007 -115429 -183232 108864 -90249 82953 -11737 -211271 -183949 49198 -41492
9993 -163303 -367700 79035 -23256 -147898 221996 -220287 -182723 -255155 -110537 -173217 -147021
9982 -147021 161164 -98501 -34364 -209665 -420064 -89423 -76768 -257269 -244131 294480 190796
9971 190796 -122485 -101417 -221415 150941 -219963 154066 -87980 -295334 -141511 -61462
9960 -158573 -35094 151227 -170928 -7505 323277 -150067 -108960 -128581 133048 -192491 65412
9948 96759 -90237 -29255 -7468 16123 -79954 221182 317852 -135633 227777 -205343 -38749
9936 -114298 161848 -81326 159000 -68268 -239187 81768 -188294 -151932 -188973 -16545 48528
9924 -213660 -116794 -318289 -74996 -137279 -12186 9490 -257889 -368955 -84855 100808 15251
9912 28894 161859 74706 -84504 -149766 -24984 -72743 46317 43990 317478 -112275 165007
9900 -252181 -222565 -5618 318317 340799 80793 -30480 -212467 99981 50894 -135498 -114845
9889 -114845 97715 -234827 116166 -171612 -25576 -290575 -404069 -215391 -110169 -71858
9879 -71858 -290348 -139439 -49926 -46012 -65820 -124020 -130424 6147 -410789 154008 -84155 119994
9866 -32065 -53369 19459 87613 88957 56919 -45087 -28535 261128 454125 -521177 -49121
9854 -186053 35719 -83186 190123 5339 9549 -152688 -101815 -33452 -44853 -42077 -112722 364529
9841 -93617 -246102 -118470 -273264 -266504 256839 -147130 -67767 -95455 -134432 -302419 -500507
9830 -500507 78120 -305740 25731 -166954 76150 -30640 -153347 -216899 277393 -313022 -3608
9818 -212772 -226043 -122780 -45837 -118461 -278586 -204871 -55375 -125809 -239383 101753 43057
9806 -335707 -259815 -46602 60095 -274050 -14005 -236729 -190065 73552 420185 -37050 -305791
9795 -305791 -215184 13337 -101551 32054 -138781 -365070 -4086 -116563 127085 -245834 186842
9783 64742 -100338 266539 285109 -65130 -356900 -105456 504365 -141147 -102388 -358538
9773 -358538 400614 -185506 -147023 -438429 -43657 3388 819 -150818 -51353 356433 -84427
9761 -120594 -201182 -187947 -6889 25491 -275557 -552149 114454 -269590 222978 -106240 -37326
9749 167430 79769 371147 47276 -60035 -30636 -198619 -235189 -28677 -93384 -106739 -340365
9738 -340365 379065 290859 199719 92227 -430056 -129914 -176945 -263728 -284356 185448 240331
9727 240331 -254767 130945 -280797 -268841 -183533 344939 -105370 2150 130966 19903 -124430
9715 -97107 -188531 230523 36514 -59278 -172132 -33192 42658 -168536 75916 -187691 -184649
9704 -184649 -224505 117144 35568 -116734 61535 158926 40231 -136004 314673 -30141 138562
9692 111178 96123 -143159 -250046 -107189 29648 -139032 43751 -170164 -147536 43739 226188
9681 226188 126236 47029 -16856 -239669 -65950 -248227 108106 -322443 -14042 -291120 -523714
9670 -523714 48722 -98094 -491302 -182549 -17547 -70971 43080 -371664 -137647 -178657 355129
9658 -488519 -180374 -110810 -41324 259206 -141518 -30277 273719 -123040 -21010 -283999
9648 -283999 -213807 -120559 -237197 -67167 166349 21975 26896 63296 -4943 -334801 279519
9636 -173901 -83074 -203998 -69880 180986 -76988 -323905 -131877 6904 90696 -315924 162711
9624 -224343 -158300 -29815 -228877 230261 -87224 -28395 -122784 -342355 -267568 -33276 -78301
9613 -78301 69422 167712 -546450 -156060 -381541 136822 60468 -99536 -90184 -143381 427971
9601 -23398 -434292 113643 -227929 123570 -81963 -137979 -158224 98163 -145852 127093 78857
9590 78857 26149 284401 89335 -250510 6447 -143756 162168 -250220 -227655 -203432 143605
9578 -80304 -233181 -110516 -157890 441788 79276 -300130 181277 71203 9672 -52552 102369
9566 20885 103566 1479 104349 -181002 -177782 -93806 192361 -350616 -374560 51396 -66839
9554 -337980 -83106 -92419 24762 -234226 -48345 -146618 -142914 220945 -508929 94956 -8111 -162478
9542 -162478 -181623 77068 229048 -86736 61901 128242 -130524 216080 192782 159598 -505511
9530 -279008 8249 197731 -303929 -570068 -22454 -171949 200738 -21964 -62690 240193 -74261
9518 -190305 74618 25065 194007 283379 -85753 -27241 -109078 -149267 316184 33013 22355
9507 22355 186685 -53047 -303072 508702 -4877 -259045 -22669 -255431 -267214 163268 -76980
9495 -183262 -34921 183913 -106670 -337570 -381722 -30279 228376 -99984 -115678 -58920 145046
9483 105060 -116920 -57482 118547 159108 -67296 2222 157569 168762 28086 -297726 89397
9471 -246473 -156893 357190 -103671 -302236 -270236 161075 -32627 203598 182632 -20257 -141177
9460 -141177 70562 262922 1041 -205094 -318697 206030 -176548 -88865 131778 50841 -193387
9448 -113149 -314277 -30234 10394 -194454 -35784 255344 -104730 178838 -31556 34890 -112573
9436 2318 -4457 -77801 -21534 171656 -43051 182797 -188443 -53030 183627 48330 131473
9425 131473 -276313 -123851 -12344 -119153 295097 -193316 81471 -90084 75141 -246791
9414 -224106 -72797 -67912 311043 -298410 -252592 21055 -48154 -94802 -98406 -206851 -251358
9403 -251358 -60962 -181670 -158507 -329865 -56480 212203 126066 -251211 54389 -23808 57218
9391 -260225 -91544 303820 -27131 -330839 60148 -282356 -375363 -69852 -211948 2665 -107253
9379 -12948 161908 173753 -200002 -174563 286198 -153365 -393061 -311617 -173683 143866
9368 52979 98267 80643 -609291 -86383 -106637 -341462 278816 46997 -326865 -205992 -111099
9357 -111099 -356769 -135986 -30407 -44131 -75442 -89495 85192 -261976 -181148 122353 -318037
9345 20352 -53844 165774 290560 25115 109432 -13172 86218 -158869 226033 78882 3885
9333 19044 3336 89850 17124 -104113 -125236 -123138 86706 -43184 303369 -147122 360324
9321 -77155 -210809 -23812 -181053 -8042 -162887 -245315 -143984 -82707 -309435 177298 -82658
9309 -83336 103892 -166099 -145029 235727 -46720 -362930 -158677 -67434 13742 199459 33024
9297 148845 84119 -437249 -119616 -458245 66182 161943 256594 -178749 141396 -371552
9286 -241306 -330810 -293550 -184763 -68564 -1957 -104107 -263804 60496 114356 -165285 112707
9274 29738 188307 116000 221153 -118628 31510 8758 -92875 -125597 -127557 -179699 7416 -178791
9261 -274981 33317 91133 -139125 -55706 -393143 -62892 87292 -202162 336384 -174598 -117658
9250 -117658 -122821 167660 -225512 -201093 -219255 -168763 -37698 -289324 -85276 -127324 -108042
9239 -108042 57701 -62784 -17330 -89423 -90908 14172 -63073 -81861 -26660 -241372 40121 -149956
9226 -215768 -34201 -69158 -100549 209629 -62764 -48168 62074 4728 -52776 -81164 437772
9214 -88690 39431 -377042 -80354 389105 -276316 -63340 -178334 179134 98285 106610 -87851
9202 12486 -8276 27784 -45312 145784 -198853 -252593 -257847 36019 -227518 -258418 -76408 26949
9189 33477 -20493 -144796 -429617 -15099 -90751 18990 -31444 237815 -164129 160676 -131295
9177 -96783 113564 -84158 201797 -331785 -188793 14059 -61717 99765 -148178 -280966 280059
9165 -128917 96823 -88434 -256644 222120 78782 -14533 -43571 44205 -147166 -374 -522603
9154 -522603 154122 -39920 1790 -188280 57775 -185151 -154533 -195011 -137566 -146798 27817
9142 134598 133234 125543 -219483 225622 -265745 -71285 152627 -126914 78646 -258372 -126448
9130 35493 -143535 77014 -237726 -127485 -69106 -168191 -115021 -100828 -125872 354316 -299001
9118 198681 -101228 42768 -121315 -70078 -77641 104678 453128 -75646 -283114 -217314 167897
9106 51810 28244 266593 -45822 -168738 179428 -264813 -31685 -216706 -2668 239773 -640208
9094 -182496 -40752 63368 -41551 23587 92834 257505 -321393 -403401 -47452 39237 -74919
9082 43279 238661 -73312 214296 -130469 -166453 -125921 -234498 18269 -124584 110870 -51575
9070 69732 28918 39663 -4338 -125806 92535 -189917 -45476 -53161 297661 55497 174544
9059 174544 3923 362028 -144082 103972 -73649 -5607 -520463 102380 -176079 15978 112254
9048 112254 -12193 -89228 -300365 -94334 -86796 -376085 59911 169844 15646 -411071 -2778
9036 -113291 -163803 -73037 79087 9197 6167 25496 183964 205497 -267872 -149605 -208214
9025 -208214 254533 -360149 -249749 178184 -325169 -227633 107446 32215 101630 -66888
9014 104145 -226902 241358 -162804 78463 27213 -102819 -117828 10144 69994 47838 -234153
9002 -44702 -10601 -12751 17189 8244 -197222 -329414 -129181 -153073 -35263 8533 -123947 -388462
8990 -388462 -169142 -120113 173648 -319739 -115087 -107204 -214709 -250162 -68017 102331 169060
8979 169060 -361937 269588 -129956 -196141 110527 -117686 -114670 136675 137287 -182981 241283
8967 -101111 18142 -26587 108232 183292 -147569 -226479 -312135 -57690 -105824 36186 857 120500
8955 120500 -182756 -16475 -239158 -345883 -345922 12945 32279 -48449 -449458 -182680 161816
8943 171139 -120599 -86100 156721 -99257 189683 -140179 246648 214699 403733 501445
8933 501445 -199403 102787 243111 -110738 92892 109715 466373 316379 474348 1090260
8923 1090260 2816597 11738706 16209588 4510909 1036102 801450 744488 437218 -99439
8913 72390 228787 173478 63619 345936 10789 651177 282830 213381 -44426 -131422 37803
8901 -119817 228984 138951 -209149 -82441 -387305 -6753 -228499 -308815 149339 176361 -289468
8889 -544378 -55464 -500053 352112 142360 -20801 -90196 -905 63572 -283005 277830 -70738
8877 -326430 -167217 -148537 -24102 -41766 31780 -49136 -190330 -253479 -229343 -8300 -264014
8866 -264014 -146681 -43111 242873 276196 -210985 93409 -233827 161874 153469 49153 -54830
8854 77608 -23689 -59066 -250887 241469 -11098 15498 -202449 -48295 5145 190233 -120905
8842 175513 -337673 -129880 -133455 344389 -437033 -377151 -275546 -115518 124290 31994
8831 -265479 85668 -214173 71267 -77901 -210515 -9347 -156483 -166486 -93478 80968 -353104
8819 -209358 -137074 -87965 -191805 208763 44770 145728 12545 -107227 -110639 -5955 -429780
8808 -429780 -156173 -152656 29273 -147904 284630 -161962 323957 121355 -1468 -321113 294129
8796 67086 -569495 65331 -137105 55259 97290 356159 -52094 -101385 -207186 -33353 -67918
8785 -67918 -52064 -50386 74702 -108257 -213557 -86168 164537 49321 -157364 -103535 -52399
8774 -52399 41948 -124791 48346 77007 -158439 103084 6978 -261490 -53507 -170492 -23532
8762 100700 -106801 148141 82613 -39979 -173415 -164584 57549 -37577 -242882 -22595 97589
8750 -75240 -189767 63218 -186069 -121010 -113301 -9097 -35691 246810 -180135 -61409 -208917
8739 -208917 6100 -184920 -94353 159399 -177630 151667 -112302 96385 -199370 452536
8728 274887 -91976 -239088 -57893 -35328 -110731 114570 -100087 -112022 94848 185511 93928
8717 93928 86019 49860 -155067 -245766 -77726 -170726 -59881 -227884 -271275 -107785 -95488
8706 -95488 -51509 25072 187556 -2119 65319 -263406 -220904 13027 36044 287667 -94066
8694 -211302 25220 61578 58962 258305 -448553 31115 258637 -26165 156382 129609 -2189
8682 133477 -42910 -169299 -18046 -404046 -59750 166678 69774 -164595 -110661 -15469 -337484
8671 -337484 -27808 -149147 40152 -155523 -102918 -386118 -45121 -247483 -232490 -39328 256257
8659 -288161 -213654 -82561 162098 -330074 -304804 -27688 -357048 -241189 -134989 122876
8648 65738 -127038 -44437 80296 -193705 169119 215828 205501 243620 -161689 -236901 32371
8636 -24751 110151 247371 -11360 -308161 -417135 6293 -32264 64780 -77448 137226 -90630
8624 -58679 -54465 -8900 54381 -28308 -101993 -57957 -179352 113028 -82452 -307181 -51618 -108893
8612 -108893 -11693 -238255 -41701 -351297 -110495 -144239 6636 44020 45090 196926 -156873
8600 -316903 69486 62813 -118661 -46035 -261356 -268266 -3001 70992 -25073 61755 5635 -95711
8587 46872 -376414 -1836 -322012 -134388 -173021 -178601 69362 85331 -327430 -185826 238398
8575 86567 17919 279218 -114439 -50757 41840 -428127 -5908 -49048 180370 -133476 4228
8563 239933 9015 -1451 60791 105222 -46606 -107840 178257 220497 348191 26452 -34530 -86462
8551 -86462 278543 -282997 -303071 112281 -139467 -81363 -174702 33271 278091 -27737 -197417
8540 -197417 -148953 -20686 -213357 -255058 -9589 219312 -288332 272551 -58860 53257 -305578
8528 -200036 -94514 -64665 -137352 111553 -66141 103092 -228048 239819 10238 77142 496209
8517 496209 13793 -21707 -105545 184523 268919 117912 126834 84981 -173964 -65447 -223254
8506 -223254 26113 241996 -307834 -62902 25390 130150 -170785 -155302 -235239 92501 76814
8495 76814 -344181 -24437 -266514 -295015 -64122 -235100 123023 -132012 -10524 22966 237873
8484 237873 -26277 -73538 202851 -150280 -236288 -84056 -202847 -118522 -190234 -117267 -103430
8473 -103430 58381 -121197 80541 -21441 -112033 211130 -100515 45913 -249393 -149202 -239246
8462 -239246 73525 -77436 165975 -338957 18032 93388 -32714 -282030 -288227 96842 -44508
8450 -49334 -298461 -419418 -9057 -250827 293987 -107374 239297 117614 138072 -316450
8439 92158 -83172 -319123 -91271 -51529 -51726 -66255 -203131 -8016 -193467 -139893 -10835 -61759
8427 -61759 302627 1151 -150214 -423040 -115751 68224 -207907 -176517 116179 -6870 177181
8415 2388 -158623 -176157 -179538 50299 -37985 -81138 -149670 158293 -236519 102805 -67845
8403 70850 -397154 169267 -196939 93274 -82057 -189404 -377948 -43619 -391119 16114 -82137
8391 -40733 -133273 60424 -363450 145166 47737 -18986 63510 194379 131030 144581 250979
8380 250979 -298437 -124483 -3127 -23206 104327 -390857 -222608 -143959 149359 50506 280158
8369 280158 -66655 -173100 93105 22084 -131451 37932 -120356 160805 -131645 -127296 -116713
8358 -116713 -230430 131756 -19490 -31185 -61013 82260 65446 -182962 -123809 34869 324875
8347 324875 -37777 -135270 -175315 -134261 -151480 -294423 137038 -54025 6038 -190825 89977
8335 -131825 -251034 -91146 6297 193727 -249423 -90910 20986 -307935 159495 83714 64032
8324 64032 -224120 -206790 -142931 -499240 -139841 273997 -232636 189067 206817 240050 -73648
8312 93312 -61934 -235884 -143108 -110663 -42025 -167632 -303293 -101929 9352 -155042 -295871
8301 -295871 -108867 215354 24808 -107068 28373 -46154 -227510 -129507 -121371 -10635 209413
8289 43507 83255 354682 -237857 -105746 -53291 76145 -77254 118980 -26874 15466 -109959
8277 -116018 214152 105814 93067 -84116 -189290 -254254 98378 -56877 20291 53057 317000
8266 317000 25064 8570 -190594 100186 489937 -129187 92954 -9634 189339 -80934 162992
8254 -196351 -333865 -93854 182725 -15765 48875 -21376 171656 -12451 128599 -246769 -367415
8243 -367415 290742 139717 -132044 85332 303207 220893 97082 -56418 -58211 -63380 -33502
8232 -33502 -34638 109139 22600 -127604 -154874 -206933 -92722 -177060 -254571 16271 -122400
8220 122138 192795 -83163 -42130 40454 -360484 -223096 261720 -124502 -121891 -301817 -19235
8208 23931 -393303 -79647 183327 8331 36275 79263 111280 -11456 -84351 -128846 -38206 -261945
8196 -261945 -197092 -263764 61710 10696 -49818 -296166 264635 218516 -83405 128234 180485
8185 180485 -102814 27378 233760 -268857 140904 144173 -286768 -126673 25339 8433 333803
8174 333803 -27999 29648 26223 -259105 5092 -68979 -90295 168325 -152121 -201458 -202640 -135917
8162 -135917 -9538 -122576 154300 8159 90119 83628 -33133 -118872 -250123 15270 190480
8151 190480 25505 38889 -42284 244733 -165865 92562 36303 -343435 -112112 59572 -6098
8139 -27709 -216698 124897 -80565 -68031 109852 269912 -93599 -36852 39360 -90727 106121
8127 -239462 405978 180641 188338 133702 224872 -252824 -143301 -138400 -45994 250295 -131227
8115 124454 -194028 140176 84147 89453 -279186 -259884 126951 -308845 -293907 -92338 -105163
8104 -105163 -78851 3509 8735 -125395 244465 40271 122292 -256653 -97245 114379 -228066
8092 -305377 -137862 -174217 142547 -124218 34730 -168439 -22253 42458 -234201 160114
8081 -242242 -150067 -54428 -35179 92188 -158043 -28938 -163678 116179 38124 -182247 -216489
8070 -216489 245490 -206067 56015 215850 -36177 147367 197043 107455 -429403 -171352
8059 -172280 -157216 -192832 -128541 76775 194854 -59202 -139777 -107688 -183816 -72900 50848
8047 -210488 94105 72484 -171562 51701 -53781 217049 -164741 -210777 -97510 65663 -218690
8035 -6676 -266808 -326266 -136900 -99893 -267843 -240964 309918 -8940 -147025 -172484 110911
8023 -196394 5791 109482 400558 -314990 -200502 141023 -63307 -19941 -56817 -108770 60131
8011 -43766 -83153 -43727 -516810 -227235 77264 -20060 -101965 -28650 47717 -29468 288706
7999 -195946 44573 -451478 -149476 227347 278898 81124 -6985 -380597 -512182 108719 214291
7988 214291 110401 200560 -5221 -134086 -367441 116703 2232 86580 -111575 -92549 -31155
7976 -11455 -78170 69024 217229 59976 -125475 -143444 -303716 69096 126268 146052 -41427
7964 30417 -20380 -21900 64857 -211940 203107 147119 -87396 -162016 12118 94104 -25400 169843
7951 -211511 -14074 -61831 -1202 236082 -31366 66975 91585 43411 201027 -80594 -67677
7940 -67677 -135790 -197607 -435312 -119925 -124963 227331 -160180 -238959 20443 -352910 87469
7928 -276504 237335 -324781 301447 124557 92427 -74166 357304 -153543 -166624 -13096
7917 -269844 -98905 61029 -306089 -276857 239913 -98283 -203895 -251303 6403 -92798 104270
7905 28488 -229879 -14974 -191863 132590 38311 14921 -59219 147082 -61751 -256541 230416
7893 156165 -131121 39273 -94129 -135367 -204068 197537 -230130 -78148 -378412 -253450 22168
7881 93278 5387 -321519 42871 164244 263191 55082 50057 215946 32861 -66706 -275056
7870 -275056 -292707 -23154 1263 41201 244116 30022 -331550 -61079 233636 115135 -98843
7858 -281845 75 -157245 669333 65632 2812 -156108 373080 -61634 128277 -145447 -5986
7846 85524 -202884 -14257 -75417 -111182 205582 -23146 -67078 121845 4949 -8696 -438241
7835 -438241 -198919 -144861 -221925 -45960 -172635 273336 78235 204105 2428 -40436 -7249
7823 -8598 -90699 38665 -258960 374975 -72151 -53775 68018 -53404 293785 -117033 -67628
7812 -67628 312873 -210044 -163542 -119436 49762 6329 244243 -431030 -178551 -155309 -119462
7801 -119462 -69307 -28344 -80046 368995 -224062 -128047 -46498 213993 -208653 30827 -149462
7789 -191811 51256 -375125 -317913 190083 -267692 -60790 -100299 114087 -103618 -159620 215576
7777 -4907 110812 -26380 -222936 -63677 -147061 -278488 -500451 -13726 58747 48848 -60030
7765 162473 -47798 129528 -62022 -34464 -36781 -177841 -216243 -124170 139346 -125038 11941
7753 -402199 12852 -132513 -351666 5924 -201965 3116 204368 137557 -95610 260886 101788
7741 27586 193759 195017 89248 -13869 -104182 143377 39431 -154286 -368142 -5655 37462
7729 -313331 -67786 -73949 -83001 -406947 -103737 81287 -178992 47852 264502 26733 -35296
7717 48639 -204274 291299 -410302 -243039 226413 -118307 -251288 -255584 -173955 -414392
7707 -414392 -106664 220613 -189237 -930 -169258 -45819 -197327 271063 502158 -19289 354017
7695 -190025 4679 -14947 53965 -159467 -55354 -154431 165767 189279 135152 -21331 -12608 5165
7682 69896 262467 105212 -341459 -150176 -274537 940 -62628 -37277 143463 -205218 222372
7670 256796 124289 118723 -169701 -252342 -68383 -239461 144775 234618 388909 73891 -223786
7658 -382992 -213448 -50964 -31171 201582 -190068 -57230 -58665 173120 -324427 -26145 -159499
7647 -159499 -3045 141970 -173831 -147852 -140960 -426911 160799 401971 -99604 -257980 110786
7635 319590 -111230 158653 -29483 -99615 -334560 -200923 -235372 204569 262358 -262282
7624 -24185 -26788 -95530 77134 60289 -207963 149032 16492 -137288 -39018 69989 -19504
7612 -8209 61810 -225152 78256 -9417 -39387 -152806 9882 -23778 -295166 -53620 -302022 335890
7599 274079 51387 169235 -69846 -162012 -185638 227409 61635 -94431 -9172 -181113 80144
7587 174824 157074 -82504 273402 135682 -211095 -211900 -214468 -77490 -406789 206345 270515
7576 270515 38635 -299658 -422519 365760 -73497 -135464 -370934 -19023 62987 192459 360769
7565 360769 -73863 -79297 -125337 -123198 -19158 155033 -195352 -20510 -122169 -230990 53715
7553 -214280 -359906 -126548 191957 44259 -39704 19748 -56214 5708 -133364 182693 -418029
7541 181545 -207340 150236 -142246 -69046 -70765 169691 74531 -36344 -232044 -122206 -10125
7529 -42902 294980 -91502 73232 -132353 161873 -46393 312543 -73045 -109907 197130 63675
7517 -99437 -221563 261694 -126240 -36049 -164503 33355 42124 169412 -234200 -7598 -39744
7506 -39744 68224 87075 17980 54355 356389 47310 13870 72541 -261799 19082 17149 8434
7493 53780 216639 -4375 -143598 -51965 36060 -124669 -299004 -56599 -205316 -266291 -180612
7482 -180612 108131 53192 -154927 -190680 -41540 -105003 148028 -59746 192320 -36879 -308921
7471 -308921 80532 132146 -76969 -138231 -243925 -382344 43944 -61541 -230403 -76632 257925
7459 -186502 28811 -106774 -159594 -313544 -155631 -80008 626232 -64359 -226136 186997
7448 -81659 338157 37581 64195 941 75233 161203 -199412 169513 -67938 65285 82567 120981
7436 120981 203307 159462 1549 -70027 147497 -333257 326972 -99237 -207307 -182999 -308679
7425 -308679 186728 -142360 -224396 76830 -45383 -276418 24618 -61212 -254563 1998 16778
7414 16778 205535 -311314 107981 63542 -166630 43299 -31288 -108128 175897 -76710 250139
7402 -283062 -25599 -249967 -99294 -40068 26906 -192887 -259735 -284198 201800 -94750 109068
7390 -93788 -215697 -15124 346105 -68510 179270 146596 -174810 -156965 128119 -58899 -100642
7379 -100642 -314582 -28179 3297 -246478 -445910 -222772 -242186 196618 42009 -85202 159845
7367 -88929 -1318 -201368 -163757 -83879 858 293699 83715 325042 109402 169603 -71124 -347232
7355 -347232 -60340 -106759 -76207 -148353 -187785 -104220 -173729 104516 -141972 -3048 43348
7343 4238 343604 82476 17234 -80854 -111126 -124858 217345 -209914 206410 -125335 -411767
7332 -411767 -306617 -230460 164703 -24506 -190552 -84939 110830 -47641 -238585 14025 7937
7321 7937 -152898 111410 71267 94004 124581 -93352 25396 79768 192483 -63177 -338955
7310 -338955 -129342 28310 207429 52290 64381 7244 -2190 -291331 -75988 439670 62603
7298 124803 93597 -76334 292150 -5019 -405664 -13234 -112993 -108061 -287367 246369 91847
7286 -80348 -18546 -93522 95963 -367646 1968 403032 -367133 124637 -173135 -272011 -13529
7274 40173 25473 147270 112220 465311 -182396 10273 172899 98664 283003 -141258 -224917
7263 -224917 -495993 -125542 106071 -218309 -4498 -115888 -83063 235428 -292079 -260355
7253 -260355 -18835 271071 -158391 -82978 175391 107895 -143900 120522 36070 34392 -162802
7241 157271 30059 325391 211955 -174905 -256463 -107590 -124777 103530 -123139 48269
7230 -183238 -190403 121604 -307658 93387 395812 105092 324937 -45269 225419 70817 -280265
7218 -19902 -125966 -218961 -557694 229170 -66478 -162577 -81434 341020 -53916 29308 38539
7207 38539 -313290 -149141 -63290 202251 -296094 -44937 -171505 -169843 -232853 85941 -66479
7195 224517 -118377 -154754 63217 -126961 95075 -67509 329239 -82041 243766 208863 -38819
7183 43938 16284 143519 -333247 88935 -206970 -150156 -194287 4008 273151 17822 -11907
7171 119506 47209 -151283 38829 -376495 35286 -234747 47498 128975 -115782 -252176 -24619
7159 -310543 7682 -89309 -223214 38730 -29719 -262504 32772 2252 -347600 106112 142332
7148 142332 192841 49164 -154753 -88385 6849 279061 257356 151916 -111760 518665 77853
7136 -57303 -229594 21205 191442 336067 -160816 75403 -382444 62106 76504 -46722 162553
7124 -172638 96426 37310 152256 161862 -282097 -86330 -253015 11547 -349041 -55986 -97958
7113 -97958 -59170 -8953 186082 -847 -108987 38506 -324728 -102595 -116469 -270499 -149113
7102 -149113 -193550 34193 -291252 -137645 -9228 -24349 -133056 -317450 -66969 -290443 -187084
7091 -187084 -43052 -612 15175 -290499 -281534 -421524 -69453 164562 192336 222534 55221 -110285
7078 210673 323846 137639 -192449 228727 66070 -41570 245962 33380 -63338 -143551 209642
7066 -202544 -32507 25578 -140941 -173602 92500 -159294 127779 42609 116305 -40695 -229783
7055 -229783 -55264 -108078 37652 226555 68914 -356616 -297467 -79863 102333 -49959 441121
7043 -93417 -155877 113389 -190437 10299 293109 -160116 -190236 107065 216805 -155555
7032 -18572 32387 164677 93234 -323189 148798 403277 -130294 136885 91975 -139684
7021 506909 -291611 99690 -235046 127935 -347598 259902 -97381 -311477 -191374 -193315
7011 -193315 -66940 -373259 136830 80241 -179808 199404 -302691 -180911 50215 -13475
7000 -166284 247352 49661 117701 33690 91115 -57138 -13587 -220345 300509 -165055 16686
6988 145520 142897 22614 -55802 170830 28769 292948 -238724 106810 -152847 115916 381179
6977 381179 117733 -144005 -29202 -31064 259339 -313399 76946 -14711 177884 -81761 27045
6965 241456 222363 12061 -15470 -15904 -141483 104875 235122 -150223 424764 -225888 297759
6953 -55856 -36165 -201239 -52208 -2988 -2894 35223 -48895 -63724 142574 4559 -73456 -153794
6941 -153794 -127288 -172690 73718 -308567 -120272 9654 -97401 146800 252436 -190179 -66383
6929 -173643 -67823 297064 -111144 94916 111582 105338 330415 -138561 -55735 -123061 -4454
6917 121927 -73605 153567 -252575 99057 11361 23087 -292284 109836 -64955 -131129 -78912
6906 -78912 -257802 54501 247187 -46281 -297432 -47176 -184343 -277913 130410 -137872 -116676
6895 -116676 -213885 179841 -161825 -192766 348626 -24772 94736 415057 56131 -62999 141684
6883 -4517 119900 -82945 -186917 -167438 -265984 264984 12384 128927 21646 -99603 -259051
6872 -259051 18589 173968 328456 -429622 178660 -130252 49712 209170 -96523 -139458
6862 -139458 -106903 220881 -36411 -154834 283252 25912 293184 129554 162411 -111026
6851 -79385 -121795 42077 66216 -28348 -189145 -368450 -379244 152455 -8035 133366 -60457
6839 142568 -209358 90575 -85697 -107259 -63140 -323213 102028 -203385 -267596 -90257 -353401
6828 -353401 39561 -62037 265559 -284547 -135496 164074 -176147 14562 -133713 -743 -86544
6817 -86544 -43108 -315443 146279 -115557 -4405 -394475 -161074 -201856 -123279 14178 -246876
6805 263936 281321 26232 230488 -255637 -46683 143561 -344490 -94154 57066 -58943 169937
6793 33104 -151847 -399561 206899 -48494 -48545 -50446 -20170 362459 18728 -178445 -56279 -27221
6780 -11701 -89063 -126914 244496 -137451 -90185 -28374 66458 195641 -177108 -305976 159545
6768 -260742 56797 -205534 62068 -213931 -28217 64611 -35593 -228108 -9704 -109828 113980
6756 -77327 127389 117049 65025 -215672 290109 -68194 258328 99338 -109327 -241597 44206
6744 154289 148429 195576 -81921 131387 130881 -47822 95651 -72021 210795 -87960 -137686 -110485
6732 -110485 45481 47850 82440 -156857 -18231 40770 96867 -187355 -356290 -155235 -298462
6721 -298462 -135408 -153399 106964 399224 -149943 -438926 -222551 -88567 91858 -43267
6710 -93974 -35401 -59567 25965 171024 132762 -83319 94896 -186154 93525 189678 331140
6699 331140 320298 -16071 -76864 125227 71012 -157805 164536 218528 35708 -267660 -175599
6688 -175599 126695 -187476 -62244 -337577 -97682 80271 -34444 190505 -245333 303740
6677 79386 2759 148287 437771 47830 92905 -79901 -53725 231381 40647 -200922 114321
6665 -143864 337707 225872 -3938 -20698 -27071 168183 83798 -201782 -329633 115653 46163
6653 163951 -45566 -99712 -93401 -183279 -68354 267630 -64796 67326 78986 -88705 14540 171211
6641 171211 81403 -34860 169074 62286 -18333 -149622 -99160 -166715 187503 11666 -130521
6629 -150344 432179 67296 -202147 377971 -382306 53688 -62777 -193800 137408 -94567
6618 -228156 -50853 229356 -11799 -214480 -69133 163888 193479 57124 -116851 -3690 24718
6606 48988 -260095 164066 -96743 -36245 -152091 -26961 55357 -36647 -5462 -145748 -221725
6595 -221725 -85190 -68578 -24271 -227140 125092 -161509 -148885 58646 -234226 -244243 56757
6583 159009 -461296 -35773 91556 130124 2381 -166048 132515 262918 -226100 -17007 -176631
6572 -176631 -13942 92760 10341 -23957 -40884 -64373 -168921 21814 -74046 -90674 69989
6560 -170729 -203047 139423 98359 165099 175419 -408422 100402 -322853 -212418 46536 -83665
6548 51436 -238101 -24326 377274 -226932 207259 -25468 -235830 382396 187176 248849
6538 248849 442500 -108523 -190162 -129135 12537 -117127 -175408 -158761 176504 210147 -181345
6526 332418 -125140 13555 -290719 258128 -231147 -60981 83041 -37362 -91207 219581 -181998
6514 -35160 -172928 18018 347808 171700 -95212 -39048 -135790 112462 108117 211122 76596
6502 -162124 138812 62689 176399 -393762 -9612 -25145 -63800 -153988 420624 -233595 -193837
6491 -193837 9813 -161300 -163510 -101710 -262799 157765 287292 -11765 154854 -4150 129032
6479 95296 74756 -13870 -94966 53138 131612 -224456 -233864 -42958 -201668 208975 -50502
6467 -170509 -181528 132117 145148 48127 -4335 1883 -159171 -18399 -77951 -23176 31853 20991
6455 20991 298922 30462 -13985 50165 162894 2294 -161471 -104322 322992 -173748 42630
6443 -120013 -48544 93909 -67209 -71356 -206787 -108010 -25226 87228 -301962 -318658 290053
6431 -118387 -286296 -68162 74132 -94357 -68723 480821 268064 -127591 35228 -48950 93471
6419 -156737 -165456 221865 11464 -38823 -228549 109828 -110355 -27000 -151525 -24269 299931
6407 -157257 226471 -112013 -189896 -11421 -196127 -6754 -163922 168734 17007 -27854 -283946
6396 -283946 -40400 178489 -280578 204667 -252893 188090 86079 -10230 64709 -245552
6385 -17651 76975 153441 -32194 -35280 -64192 4233 180643 184073 -194656 3956 20932 129341
6373 129341 -244505 -230634 400601 340154 -43965 -245332 -345272 -23131 28122 196166 -122415
6361 -150846 299093 8983 54229 -50632 -195068 83149 170734 -73030 39275 -112546 -75046
6350 -75046 178406 -235016 151183 -131021 -99659 -79482 -199657 -384064 -73814 -13442 -18282
6339 -18282 -385016 2617 28343 128916 -127685 -57513 110177 -252763 203470 166541 -33607
6327 -198682 -152191 290389 -159241 47916 314864 48530 -77628 -72977 -138471 -268846 -155483
6316 -155483 206652 100465 -151388 -158497 124442 134906 207690 12382 -367431 6119 160504
6305 160504 -1918 -35974 -8917 22764 -220063 -342424 -114407 101818 -148825 -334368 125798
6293 -110659 -92172 254822 -266189 3641 27103 -269090 -51347 -439066 -471114 -282664 304804
6281 -29630 -307905 32947 -94460 46639 24790 9763 124406 -138665 314970 52994 6117
6269 95139 322371 -187823 239426 73329 153855 303932 -153640 116093 -523 59013 198138
6258 198138 -252503 82559 227061 179945 -29643 202121 -93200 271862 197474 -141111 309826
6246 248433 -212561 -116225 -43510 55705 -104900 224141 299447 -177375 213626 -287346
6235 -21791 12860 114778 -18555 -46681 -128966 -187328 150521 -290383 17629 59431 304816
6224 304816 94862 -68801 226162 -107242 307306 -222655 -155348 476639 309997 10707
6213 -89300 21407 -83260 -106508 93057 108471 52757 -43651 -24673 -22708 36428 -28702 -132342
6201 -132342 14694 293749 -19972 15041 -158884 -6828 344660 -236593 129881 -116753 55613
6189 42435 69463 -38439 87648 -143907 91249 264201 219936 48766 -276420 1507 170906
6178 170906 -43617 151218 -340409 -205328 203502 -18571 30048 -230376 264247 -116738
6167 65831 190076 -124050 -244861 298084 -64858 -115201 104097 305499 -250225 -229114
6157 -229114 -23185 15264 15432 -283359 148071 -377982 31070 -316712 124134 -245228 -40668
6145 -346551 235557 -163505 -53366 5746 312298 -277005 346464 114074 -125284 32636
6134 -190666 8019 54721 -8195 -192534 -888 -25057 -282130 -328042 -31350 121681 -387492 -60294
6121 26784 123670 -281268 -181269 135267 488443 33109 111413 -329468 52762 -115185 -55373
6109 160760 21084 99037 -69927 238618 -43063 -100397 -27539 210076 68784 -305038 153986
6097 207514 -79152 -199105 -505695 -353965 221339 247016 -200890 -191353 9253 113431 -297672
6085 -185049 31126 122769 26432 19258 198161 191649 -269520 -145515 -243956 -45916 396089
6073 202186 -68830 -41986 -244320 161329 -46990 -123782 -92134 -288508 244864 156250 351316
6062 351316 10000 -182863 -193581 62526 -15721 -54926 25548 187646 81551 148813 53977
6050 320983 -54969 255846 -88284 -301532 -404480 243597 164704 -345444 150151 9024 -130049
6038 94362 -11817 -55951 -129482 -232680 125264 125019 144412 -21944 -113331 -111097 -128568 -11060
6025 -226348 141436 192446 -99035 113001 307036 10310 33425 306577 -144224 -140545 -154974
6014 -154974 17882 5871 54170 -169455 -477918 -63663 89811 -79583 17598 62378 108931
6003 108931 103366 77478 230159 -25212 33567 184263 38475 -18483 -108177 -234762 38117
5991 358121 73686 -34870 28732 167372 123391 99235 -17512 -130510 -166726 190774 49911
5979 -181342 -151229 164445 244256 -82711 -170542 -13116 -86790 123989 79266 149411 -119583
5967 11468 176537 43741 -308562 21697 62830 96733 -71911 467800 -58645 -240020 191213
5955 -271553 -155068 -295712 -291354 8759 13913 -60609 -56239 -74772 100329 -133384 289154
5943 85429 -86435 309686 -43308 11414 -12273 118727 -174436 -229878 -352413 115655 -89942
5931 239497 156554 -614278 -120167 335030 60587 -168735 -87465 -210637 70593 -280620
5920 -246046 -291632 10563 -243614 7600 40654 -36942 -57585 -82383 177841 -129805 -128086
5909 -128086 103634 -49612 -126531 -83408 10002 158187 96074 -10562 58231 -103730 -21343
5897 -16749 358235 254913 46533 371424 111198 -129512 128394 -25341 61759 101443 209647
5886 209647 129606 180860 48206 81761 -152980 -111360 8883 193096 424795 -43999 -44131 -139434
5874 -139434 -29009 -77533 -259316 -275765 53003 214607 147773 -9405 -150106 -40225 133418
5862 140695 195846 65172 -214257 -199783 -247902 -152506 -73251 76574 -97826 -159611 -77204
5850 208626 -194381 -254101 98499 -270724 120774 -52878 66744 49238 -62399 -151077 -221676
5839 -221676 -30119 -126872 -280766 79975 -41471 26217 239604 392502 168068 96197 -30885
5827 53451 -333800 27462 -294777 97340 -73289 -79822 106099 -229899 -27587 -57378 180309
5815 12884 31058 -268689 53986 177955 43749 103355 72056 -96741 -68397 116855 6306
5803 -1217 57774 128417 -201481 -52505 -118527 85082 164323 44798 58369 88600 -234918 237649
5790 187200 8206 10227 -285198 -72328 16393 86420 367132 -194223 92483 -211204 100306
5778 52683 -182009 227587 47894 -85145 -113736 -3838 -14820 118542 -105663 101568 -37795
5766 10657 210225 -259520 26884 -343071 9909 -180887 105677 -101266 -28024 -10430 105772
5754 -112829 -118291 94961 -12742 -105032 280061 32837 -34877 -195276 -57406 24103 255540
5743 255540 98990 -348794 -24451 34155 -81872 -72641 -203388 244794 -11139 261074 89540
5731 -378497 33272 201738 -148265 12666 -215758 5900 -95064 -172082 139785 -84343 172843
5719 -276107 -135392 -166968 -48136 -56838 -46623 197520 -73491 -120106 150729 129351 -11941
5707 -281106 72833 -125012 76629 214424 -234794 5066 14608 -61840 -224415 136327 31841
5695 106784 -62688 -44784 19552 -57603 6189 134120 -312171 200345 -37794 -74721 -231073
5684 -231073 72884 -76964 -197276 140274 -370216 -238340 15315 129031 -15466 103222
5673 162881 -99911 338515 -6579 -36799 168250 148156 69707 142881 -108850 132601 -163828
5661 91429 -123571 125765 -212602 42368 -64104 471197 148905 -215780 -88794 54227 220382
5650 220382 149038 107986 -218458 159467 98773 270825 182165 23575 17406 -82946 -42033
5639 -42033 67645 -176211 188967 121270 -64141 103309 -16695 -127547 -228975 466873 3498
5627 -122650 -90371 -33525 -97628 -57788 214164 318487 -272559 -241309 31064 -157040 -28963
5615 -38972 276638 178359 36502 141414 163111 -24447 25184 46173 103667 76639 248691
5604 248691 306449 -141709 -163512 -305837 -184265 -84860 198073 -49760 174470 229939 86301
5592 47156 -93481 72733 -119802 -313398 -47727 82327 -210994 -120004 -209310 -384668 147
5580 -79155 -397397 -13743 -135500 111136 -5153 59430 -196786 203226 -30896 -325012 -263321
5569 -263321 -46924 -91619 -181869 -207881 -143113 179309 14839 5256 -11073 -85594 -55617 253673
5556 43758 51312 156774 67098 57643 -130743 -1231 -40357 18596 7434 -61695 118529 64447
5544 64447 458156 -200368 58222 109024 52986 -170816 -64958 363308 237361 24553 50221
5533 50221 13358 -24468 -91284 49655 154254 84247 -83355 -73215 88914 71504 -326113
5521 -154333 41540 103303 -270220 -103442 271418 -229326 157044 -43652 -190888 55727
5510 250546 -204051 -272733 77127 -429237 259339 -51850 -160032 167757 264508 -41713 253666
5498 -3901 -130220 -22062 49571 121060 109030 172903 -260546 -234471 48285 -28603 -8363 23790
5485 -161428 -53897 137682 125605 -107169 148021 -68409 99161 -122302 -11998 -104090 8977
5473 -113734 -183529 23683 -65829 3939 -241223 90429 153185 -204373 186312 143636 -148809
5461 244591 89173 60751 114754 -47137 -98143 -153372 132193 -130100 24918 -2653 -42806
5450 -42806 186374 -113323 -98102 17175 151970 99602 80298 130406 25665 -145927 104534
5438 258392 -182705 -138837 -426337 -104803 102512 21822 -21127 21778 137843 34838 61845
5427 61845 -200355 -53012 -443829 -16789 -39704 119348 142964 -93786 -60021 59702 -158014
5415 104208 -165769 81895 273136 -216392 -96749 -84783 -549862 -331 178349 88804 68518
5404 68518 87210 303048 -37135 -272614 124866 -286313 -208234 -22248 193226 -19875 -82193
5393 -82193 -280140 -224174 33759 -67569 8637 -5277 114395 144299 -47790 -125415 -354594 -281492
5381 -281492 -22793 201936 7576 177755 305721 58327 -14134 116480 49149 -297635 -185241
5370 -185241 124561 -279091 212022 -126425 121559 93144 -100889 -194641 18785 -297262
5359 -79457 187151 -248024 -143211 158724 360308 -164989 231339 -59686 -174022 139808
5348 -96492 1556 272749 43205 -2192 392524 -13744 27267 -426883 -79937 185777 112179
5337 112179 53927 -245276 79197 82517 99839 122652 9632 280673 109510 -287810 190210
5325 -194267 174424 -24756 -89348 -54263 -35412 175750 122067 -13994 -29335 55357 -82700
5313 39479 -71934 -109131 346065 368310 -112774 81315 533891 190653 85444 237352 -124497
5301 64147 62751 -83715 -118830 -460390 264544 -9569 170174 162670 -12120 300848 -199971
5289 -113037 51369 -181237 -198641 -34982 257958 -71512 -209807 7377 246508 -173490 29447
5277 58906 -225318 -10420 -103956 -142542 53003 32069 -261860 486560 91863 -125490 37592
5265 133064 14739 -223188 -97513 302951 -266066 242 182031 -11240 -100317 -182199 204546
5253 2717 134240 180452 114517 -81522 98122 6856 -138618 87713 119961 -136171 248650
5241 148305 119339 124508 -192967 -44720 153002 169196 -158788 -50178 -126531 -138930 226232
5229 -90900 -160889 -172745 -387685 -27994 -196337 206223 -83709 -20227 -97648 -222749 58424
5217 68819 -166637 -308410 415144 -267357 32476 -162152 224243 20301 286181 -58783
5206 -163798 203947 198061 76695 144938 61062 125610 -36977 -187919 -170891 -5758 302176
5194 537972 -44189 227439 180197 8704 9410 -74021 -147179 -322903 -53528 -72906 -153478 80364
5181 -27888 69634 -228589 -24168 -219010 -309337 183598 233379 -220402 127581 71997 -72261
5169 -238765 49877 24822 -23388 -34766 67568 -163543 129162 27972 -49472 34995 231132
5158 231132 27569 -266887 329537 -207195 -243486 205295 -297817 -121582 -80421 37025
5147 59521 -163180 -184914 76400 146782 -110909 -3876 187587 -41292 -136278 57535 207283
5136 207283 -222404 -192347 -213489 -9748 174954 226710 54102 -38521 -37691 -151813 -459693
5125 -459693 257011 48297 -45693 -155683 -261659 104070 144548 149392 30713 23706 -236080
5113 -216829 22313 176113 52738 -98832 -156366 50129 36254 -25295 232752 -58652 -140722
5102 -140722 58116 212378 -48220 42374 -153882 -216228 -149810 -99052 44179 65034 -272609
5090 129081 128186 -215465 54024 238909 37864 -4971 -146368 -68396 269079 -150100 -21308
5078 -99275 315468 -164762 32278 -79196 410133 -161644 121312 -61922 114325 -88139 -283204
5067 -283204 216001 -33717 -54956 -305359 -43046 -172168 80868 -378673 -79791 73032 -371578
5055 210407 163510 49918 109440 -41314 53503 17867 -181650 181427 9031 111013 -100398
5043 -245724 -277548 419948 -48709 -52228 60065 45980 121889 -61801 71843 168161 -97879 97632
5030 -80753 80811 201565 -40655 50632 182668 111942 35420 24744 189638 -317606 -332444
5019 -332444 84631 -32339 325748 -89045 43086 47195 -51510 -337790 288768 -126512 -60401
5007 -57069 -294192 206264 -84212 40973 -56859 138729 -233530 -276633 8463 30045 202185
4996 202185 463538 -112863 54707 40110 -124246 -89806 199110 247900 -37402 -86787 15644
4984 52343 -72093 -100636 -108904 151948 10856 63053 -247553 -88924 -142963 38210 298738
4973 298738 -217405 -409314 101734 -260866 -119416 287025 -19649 70948 -344053 191423
4962 218929 -58322 25368 202755 257176 41075 141503 38919 234955 171568 208419 49372
4950 143488 -177098 38821 -273547 213379 -57682 85500 -33172 -84945 263411 96440 -25004
4938 -90564 -27085 24492 -20232 211394 64670 57753 61680 108821 129849 188978 -6190 912 -127754
4924 70688 -75061 -192253 -152830 -246592 -117300 191787 -132470 226320 166233 -224587 -413526
4913 -413526 -115364 139253 -330617 403737 261008 -138434 -140829 -221855 150784 -164867
4902 -57833 254722 -67694 69106 115711 -102841 -319892 -126179 -262732 -92635 -280491 -7933
4890 -228737 221549 143593 -85115 300996 68733 -101049 255788 -29019 128237 -164255
4879 312735 20321 -221973 -32839 -58003 -189814 -187324 226648 47445 -138720 97128 79788
4868 79788 -50348 -92170 -348772 -146523 -67736 -395780 70474 -233588 91548 49677 98200
4857 98200 76126 88305 104413 -313262 98238 26832 -20822 -179350 -34764 -385216 110812
4845 -178753 207094 -168003 -152851 -86861 79467 40914 159796 -190157 -54316 49572 171739
4834 171739 83805 123299 307325 435652 188278 -269438 329687 115331 278567 101069
4823 49462 -33513 -68738 482987 -119525 -263652 -36612 45962 170805 -52584 -40424 -514676
4812 -514676 -4109 -231132 -184023 -98363 167721 -55547 -239097 -16924 119661 124458 99428
4801 99428 157623 296515 130957 -145738 42531 -102303 -131933 288716 19983 125938 31914
4789 -242484 -97932 -101852 -20917 59587 118496 87086 -242116 216705 59748 50762 57312 97550
4777 97550 -193853 52205 19088 418735 94325 -1449 52204 -268737 22734 145838 -133078
4765 389833 291214 -317303 11846 -200376 29838 -179690 68202 139778 134430 23688 293130
4754 293130 -87467 207465 236410 64176 -154055 -128003 -10556 276232 -226041 -92555 227510
4742 31984 -180367 190258 193263 215073 -222822 8379 202094 -356982 -141723 -138152 270127
4730 213431 3386 -214360 -111968 215001 -257996 1961 166694 63704 46647 47990 -26246
4718 46307 228320 -129902 -123604 -147255 -91451 -70994 16907 -61738 257554 -75678 80883
4706 51582 232270 -133282 96038 57170 88402 -180647 -87744 28111 38466 276441 -171827
4694 215378 -156723 310704 65046 18822 252672 -292034 -95303 18038 48448 -9384 -188743
4683 -188743 -134712 5778 -128783 92941 -264042 -218254 -269663 153740 -160028 272133 197182
4672 197182 -69245 -122824 -3770 134342 -253163 -106342 66017 -24599 50060 293469 162718
4661 162718 -225246 5910 -221869 -38950 -75734 72113 186783 318126 201721 -54626 -82476
4650 -82476 78260 105361 -340698 -95380 65279 -67405 -121282 -229417 151922 76386 55877
4639 55877 353770 -49352 34605 112768 335026 158158 373763 107762 -217688 -52307 145602
4627 -321898 -95762 -257954 -268433 462342 69774 46373 -68411 -135056 151996 305953 130697
4615 42065 39512 -91748 -64384 -6299 -127037 135515 110488 -91622 -55728 -123905 34412 -243291
4602 391470 -213886 -43023 -116470 -450818 168234 -268504 -211311 100504 -228162 54382
4591 -119286 102311 -77918 -19123 93035 76053 -19701 -331512 32151 -62194 -90050 19414
4579 -7404 100232 91228 204392 -52823 171376 136091 243513 -26424 44147 -66605 -116614
4568 -116614 418217 -68400 -265659 117879 129737 -43109 -88009 -223025 326793 180762
4558 180762 50418 218735 310775 48747 -15206 5459 -89377 168389 93845 -59217 278450
4546 -228311 -164443 -238329 267991 -114377 -45092 146814 134129 43125 -23921 179267 -124154
4534 39646 57384 -524428 -127967 -110394 370115 175678 -165605 199554 186024 -411531
4523 107784 -84336 -78454 283526 -51543 164811 430871 53826 173605 -242902 214883 119698
4512 119698 -187221 -55139 -3675 11377 -223002 -17603 150374 -66770 -138895 -121840 41832
4500 -12733 135719 -143692 51918 -127677 64331 159357 -210057 -14174 153805 353277 -225856
4488 176132 -96690 -20626 -46998 -76377 -195045 -16188 -140374 125775 -23333 -39790 -5040
$$ [...]
##END NTUPLES=NMR SPECTRUM
##END=
