
##TITLE=UV1250_M10_1340-1211_10_7409705_FYXwsFkp2I
##JCAMPDX= 6.0         $$ Bruker NMR JCAMP-DX V2.0
##DATA TYPE= NMR SPECTRUM
##DATA CLASS= NTUPLES
##ORIGIN= BRUKER
##OWNER= Administrator
$$ 1.72 TOPSPIN		Version 2.1
$$ 2013-01-24 19:53:56.471 -0500  Administrator@X
$$ Compression mode = diff/dup
##.OBSERVE FREQUENCY= 400.02188249412
##.OBSERVE NUCLEUS= ^1H
##.ACQUISITION MODE= SIMULTANEOUS (DQD)
##.ACQUISITION SCHEME= undefined
##.AVERAGES= 8
##.DIGITISER RES= 22
##SPECTROMETER/DATA SYSTEM= spect
##.PULSE SEQUENCE= zg30
##.SOLVENT NAME= COFFEE_meoh
##.SHIFT REFERENCE= INTERNAL, COFFEE_meoh, 1, 14.98509
##AUDIT TRAIL= $$ (NUMBER, WHEN, WHO, WHERE, PROCESS, VERSION, WHAT)
$$ ##TITLE= Audit trail, TOPSPIN		Version 2.1
$$ ##JCAMPDX= 5.01
$$ ##ORIGIN= Bruker BioSpin GmbH
$$ ##OWNER= Administrator
$$ $$ E:\/data/COFFEE/nmr/UV1250_M10_1340-1211_10_7409705_FYXwsFkp2I/10/pdata/1/auditp.txt
$$ ##AUDIT TRAIL=  $$ (NUMBER, WHEN, WHO, WHERE, PROCESS, VERSION, WHAT)
(   1,<2013-01-24 19:53:48.252 -0500>,<Administrator>,<X>,<go>,<TOPSPIN 2.1>,
      <created by zg
	started at 2013-01-24 19:52:42.142 -0500,
	POWCHK enabled, PULCHK disabled,
       configuration hash MD5:
       86 BA 57 50 F2 9D 5C 9B 26 00 A9 28 5F 66 2E 89
       data hash MD5: 64K
       4F 7D E4 BA 31 0F BC 67 DD 2A F9 43 9E CD 06 1D>)
(   2,<2013-01-24 19:53:51.439 -0500>,<Administrator>,<X>,<proc1d>,<TOPSPIN 2.1>,
      <Start of raw data processing
       efp LB = 0 FT_mod = 6 PKNL = 1 PHC0 = 0 PHC1 = 0 SI = 32K 
       data hash MD5: 32K
       74 6E A5 F3 AC BF 9A F6 ED B0 40 A0 F2 13 FB 67>)
(   3,<2013-01-24 19:53:51.908 -0500>,<Administrator>,<X>,<proc1d>,<TOPSPIN 2.1>,
      <pk PHC0 = 97.75635 PHC1 = 0 
       data hash MD5: 32K
       14 90 09 E7 76 19 3A E5 80 60 CA C0 C8 5F E7 C8>)
(   4,<2013-01-24 19:53:52.127 -0500>,<Administrator>,<X>,<proc1d>,<TOPSPIN 2.1>,
      <abs ABSG = 1 
       data hash MD5: 32K
       21 8C 36 C2 D5 C3 AA 3B D8 72 53 73 9E 30 6F 8A>)
(   5,<2013-01-24 19:53:52.299 -0500>,<Administrator>,<X>,<proc1d>,<TOPSPIN 2.1>,
      <abs ABSG = 2 
       data hash MD5: 32K
       6D DB DD 07 BB 78 16 9C A9 36 57 BF C3 87 25 66>)
(   6,<2013-01-24 19:53:52.439 -0500>,<Administrator>,<X>,<proc1d>,<TOPSPIN 2.1>,
      <abs ABSG = 3 
       data hash MD5: 32K
       DF CF 5C 48 7F 8D F1 17 87 1D 90 78 DB 26 1D 3F>)
(   7,<2013-01-24 19:53:52.580 -0500>,<Administrator>,<X>,<proc1d>,<TOPSPIN 2.1>,
      <abs ABSG = 4 
       data hash MD5: 32K
       EE A0 56 B9 A1 05 79 FC 95 0E 08 DA E3 D7 25 5D>)
(   8,<2013-01-24 19:53:52.721 -0500>,<Administrator>,<X>,<proc1d>,<TOPSPIN 2.1>,
      <abs ABSG = 5 
       data hash MD5: 32K
       0C F7 30 49 1C CC 19 62 1F 91 70 74 7F 02 A8 1E>)
$$ ##END=
$$ 
$$ $$ hash MD5
$$ $$ 5B E9 BB 10 E2 8E 77 A0 02 71 4B B3 5F BC 0E 76
##$RELAX= 
##$RELAX= 
##$RELAX= 
##$RELAX= 
##$RELAX= 
##$RELAX= 
##$RELAX= 
$$ Bruker specific parameters
$$ --------------------------
##$DU= <E:\>
##$EXPNO= 10
$$ [...]
##$TP= (0..7)
150 150 150 150 150 150 150 150
##$TP07= 0
##$TPNAME0= <>
##$TPNAME1= <>
##$TPNAME2= <>
##$TPNAME3= <>
##$TPNAME4= <>
##$TPNAME5= <>
##$TPNAME6= <>
##$TPNAME7= <>
##$TPOAL= (0..7)
0.5 0.5 0.5 0.5 0.5 0.5 0.5 0.5
##$TPOFFS= (0..7)
0 0 0 0 0 0 0 0
##$TUNHIN= 0
##$TUNHOUT= 0
##$TUNXOUT= 0
##$USERA1= <user>
##$USERA2= <user>
##$USERA3= <user>
##$USERA4= <user>
##$USERA5= <user>
##$V9= 5
##$VALIST= <valist>
##$VCLIST= <CCCCCCCCCCCCCCC>
##$VD= 0
##$VDLIST= <DDDDDDDDDDDDDDD>
##$VPLIST= <PPPPPPPPPPPPPPP>
##$VTLIST= <TTTTTTTTTTTTTTT>
##$WBST= 1024
##$WBSW= 4
##$XGAIN= (0..3)
0 0 0 0
##$XL= 0
##$YL= 0
##$YMAX_a= 663835
##$YMIN_a= -565791
##$ZGOPTNS= <>
##$ZL1= 120
##$ZL2= 120
##$ZL3= 120
##$ZL4= 120
##$ABSF1= 14.98509
##$ABSF2= -5.573092
##$ABSG= 5
##$ABSL= 3
##$ALPHA= 0
##$AQORDER= 0
##$ASSFAC= 0
##$ASSFACI= 0
##$ASSFACX= 0
##$ASSWID= 0
##$AUNMP= <proc_prof1d_extract_pilot.lims>
##$AXLEFT= 0
##$AXNAME= <>
##$AXNUC= <1H>
##$AXRIGHT= 0
##$AXTYPE= 0
##$AXUNIT= <>
##$AZFE= 0.1
##$AZFW= 0.1
##$BCFW= 0
##$BC_mod= 0
##$BYTORDP= 0
##$COROFFS= 0
##$CY= 15
##$DATMOD= 1
##$DC= 0
##$DFILT= <>
##$DTYPP= 0
##$F1P= 0
##$F2P= 0
##$FCOR= 0.5
##$FTSIZE= 32768
##$FT_mod= 6
##$GAMMA= 0
##$GB= 0
##$INTBC= 1
##$INTSCL= 1
##$ISEN= 128
##$LB= 0
##$LEV0= 0
##$LPBIN= 0
##$MAXI= 10000
##$MC2= 0
##$MEAN= 0
##$ME_mod= 0
##$MI= 0
##$NCOEF= 0
##$NC_proc= -8
##$NLEV= 6
##$NOISF1= 0
##$NOISF2= 0
##$NSP= 0
##$NTH_PI= 0
##$NZP= 0
##$OFFSET= 14.98509
##$PC= 1
##$PHC0= 97.75635
##$PHC1= 0
##$PH_mod= 1
##$PKNL= yes
##$PPARMOD= 0
##$PPDIAG= 0
##$PPIPTYP= 0
##$PPMPNUM= 2147483647
##$PPRESOL= 1
##$PSCAL= 4
##$PSIGN= 0
##$PYNMP= <proc.py>
##$REVERSE= no
##$SF= 400.02
##$SI= 32768
##$SIGF1= 0
##$SIGF2= 0
##$SINO= 400
##$SIOLD= 32768
##$SPECTYP= <>
##$SREGLST= <1H.CDCl3>
##$SSB= 0
##$STSI= 32768
##$STSR= 0
##$SW_p= 8223.68421052631
##$SYMM= 0
##$S_DEV= 0
##$TDeff= 65536
##$TDoff= 0
##$TI= <>
##$TILT= no
##$TM1= 0
##$TM2= 0
##$TOPLEV= 0
##$USERP1= <user>
##$USERP2= <user>
##$USERP3= <user>
##$USERP4= <user>
##$USERP5= <user>
##$WDW= 1
##$XDIM= 32768
##$YMAX_p= 472991203
##$YMIN_p= -719066
##$CURPLOT= <Network HP LaserJet P1505>
##$CURPRIN= <$Network HP LaserJet P1505>
##$DFORMAT= <normdp>
##$LAYOUT= <+/1D_H.xwp>
##$LFORMAT= <normlp>
##$PFORMAT= <normpl>
##$SURQMSG= 1
$$ End of Bruker specific parameters
$$ ---------------------------------
##NTUPLES= NMR SPECTRUM
##VAR_NAME=  FREQUENCY,     SPECTRUM/REAL,   SPECTRUM/IMAG
##SYMBOL=    X,             R,               I
##VAR_TYPE=  INDEPENDENT,   DEPENDENT,       DEPENDENT
##VAR_FORM=  AFFN,          ASDF,            ASDF
##VAR_DIM=   32768,         32768,           32768
##UNITS=     HZ,            ARBITRARY UNITS, ARBITRARY UNITS
##FACTOR=    0.250966925370066, 1,           1
##FIRST=     8223.43324360094, 35090,        24627
##LAST=      0,             -92285,          -133080
##MIN=       0,             -719066,         0
##MAX=       8223.43324360094, 472991203,    0
$$ Real data points
##PAGE= N=1
##DATA TABLE= (X++(R..R)), XYDATA
$$ [...]
19528b19625D168h7146B16073a95876B97511b8468k9834p8609M4200H471Q7242
19517I5713f3281B5672O7791J5803D1997h154m676A18235i5214n0441B08048a68269
19504b60239l911A3144L0637h6655q9341F9619K11579G475J7732M7962a61462
19492c10640O3361H4448P7385Q5149e82059a77331l6057k33290J7377B23638a67368
19480a39985A57911a18637C25843i0236B88023b79839J11789B81393e5532l052
19470e8584j20063Q265H8993b91408B11384b41222R5448A42284J084b44943c0408
19458f6441H3136c39836H0476K92335A61180K22451J38325b26417g7361p7742
19448a55103P0539j14230c75A59324c66737D30071H7504i9688a8462A6662g9237
$$ plain form
19528 -219625 4168 -87146 216073 -195876 297511 -28468 -58302 -136911 -92711 8471 95713
19517 95713 -63281 25672 93463 109266 41997 -8154 -12830 118235 -95214 -145655 208048 -168269
19504 -260239 -264150 13144 43781 -86655 -175996 69619 281198 7475 25207 73169 -161462
19492 -310640 -247279 84448 161833 246982 -582059 -177331 -213388 -446678 -429301 223638 -167368
19480 -139985 157911 -118637 325843 -90236 288023 -279839 -168050 281393 -55532 -58584
19470 -58584 -178647 -170382 88993 -291408 211384 -241222 -145774 142284 143368 -244943 -30408
19458 -66441 83136 -339836 80476 372811 161180 383631 521956 -226417 -77361 -155103
19448 -155103 -84564 -198794 -375 159324 -366737 430071 87504 -99688 -18462 16662 -79237
19436i7614p7672J7590B90949a45128I8665A8658K15943b96704h2555B4144e31289
19424a78906d1992m31196C1024e2924j44755l1775j20374M0643f6584n1849A19335
19412b49910l4308b1839B16278a78108A86537a87267j65155C24539b94505g1617
19401B8676c86382q779f4212k09815j17812b8588l41872E2018a56004k31579i6222
19389E8800a4202n3503F5752e5687I9633f4130q767j68177A31419c00468q9819
19378c90287M4865J23273f7660j21221c9012j71337O6990B4068J56491F5295b30949
19366c4275A63580i9947B99683a57109j05069e2890j76074B96871c37386a45989
19355B42608a26430A5091a10954j23035g6401A58553h0694B24833C0031b86296
$$ plain form
19436 -97614 -175286 -157696 290949 -145128 98665 18658 234601 -296704 -82555 24144 -531289
19424 -178906 -41992 -473188 31024 -52924 -197679 -229454 -349828 -309185 -66584 -118433 119335
19412 -249910 -284218 -21839 216278 -178108 186537 -187267 -352422 324539 -294505 -71617
19401 28676 -386382 -395161 -64212 -274027 -391839 -28588 -370460 52018 -156004 -387583 -96222
19389 58800 -14202 -67705 65752 -55687 99633 -64130 -72897 -241074 131419 -300468 -390287
19378 -390287 -345422 -222149 -67660 -188881 -39012 -210349 -143359 24068 180559 65295 -230949
19366 -34275 163580 -99947 299683 -157109 -262178 -52890 -228964 296871 -337386 -145989
19355 242608 -126430 15091 -110954 -233989 -76401 158553 -80694 224833 30031 -286296
19344e6649o2264A80167a28161A20513h8959j01108N917m4543i5517r6455B179
19332A43029d4890q4283B32638b10187R4886A63110b56815A44833a99532A04604
19321A52255C9723P4655I61b89905R9294f1160A09919B2782J33703c7250A13473
19309A8968Q4315k1188a52878C2128a31278B7168O9183B1119Q539O0101g2371
19297A04096a4566j4219K376E6402b52072K7386P4658K2574b9841o0334A20638
19285A30971a22812d6624k10338g8458A64245a02305j91874p171i7574j53782
19275b51356a00913B2800a41157G1989K31076b04580E9423a27742J0781m2129
19265a59090A10947K25463E106a76207D9909J1895J06371b01570B18566a43729
$$ plain form
19344 -56649 -118913 180167 -128161 120513 -88959 -190067 -184150 -228693 -95517 -191972 2179
19332 143029 -44890 -129173 232638 -210187 -115301 163110 -256815 144833 -199532 104604
19321 152255 39723 114378 961 -289905 -190611 -61160 109919 22782 156485 -37250 113473
19309 18968 103283 82095 -152878 32128 -131278 27168 96351 21119 29658 89759 -72371
19297 104096 -14566 -28785 -26409 56402 -252072 -224686 -150028 -127454 -29841 -90175 120638
19285 130971 -122812 -46624 -256962 -78458 164245 -102305 -294179 -301350 -97574 -251356
19275 -251356 -100913 22800 -141157 71989 303065 -204580 59423 -127742 -116961 -159090
19265 -159090 110947 336410 5106 -176207 49909 61804 168175 -201570 218566 -143729
19254b81026e4836j32311B21256e8172P175r1684E0195a30804j58721M6807j53006
19243c95724A84759L0464b65299D582b11697a5635l9909K6339r7707Q090N9380
19232e9442n7483N4133j33128A10202b83956d0170A22021f3871f986j59600B91867
19220a52973B67933b06498f7663B7278d25110c0433k59104J27395A15833a57504
19209A01635C3086b8124j61990J4129k76143a31672K2366j29529m2026a32790
19198b68707M3344L1413A66161H2636J38601l1820b10268e3090k9182j19426c2204
19186A53649c81749a55849g0024C9276J41129E0421A1197h5721j04573B03517
19175A71536b60689J10596a4884m63081A87201b34582B44254a71918b660j67367
$$ plain form
19254 -281026 -54836 -187147 221256 -58172 -50997 -142681 50195 -130804 -289525 -242718 -395724
19243 -395724 184759 215223 -265299 4582 -211697 -15635 -55544 -29205 -126912 -118822 -59442
19232 -59442 -116925 -62792 -195920 110202 -283956 -40170 122021 -63871 -6986 -166586 291867
19220 -152973 267933 -206498 -67663 27278 -425110 -30433 -289537 -162142 115833 -157504
19209 101635 33086 -28124 -190114 -175985 -452128 -131672 -109306 -238835 -280861 -132790
19198 -268707 -225363 -193950 166161 82636 221237 189417 -210268 -53090 -82272 -201698 -32204
19186 153649 -381749 -155849 -70024 39276 180405 50421 11197 -85721 -190294 203517
19175 171536 -260689 -150093 -14884 -477965 187201 -234582 244254 -171918 -2660 -170027
19165a70027f8498A1133J0171c23459B65949A13718A8668c97849a17312C26348
19154a56212A5276b57748A19854B2489d7477A21922b08087k44745J09567D9741
19143c01682J06833j99583d2368j190j14095D8896J93445h7161m0109j43101b9496
19131A47898h1350j52644I7836M3515C2946N0689i7225a5088k57278f1246q1149
19120a42395C72773i2197k13548g7280C912b62471M4982L7265b3578j1950A39734
19108B8131a05115k11733J36746j34892a03039k9021B2485c24649G8568b21085
19097a49715b4073D9060h3563A83760C7005b27176H1031a40682k27505r7833A05374
19085d0386h622p6120l406j36022g1381a9040B05214b54589e9697k00431g8356
$$ plain form
19165 -170027 -68498 11133 21304 -323459 265949 113718 18668 -397849 -117312 326348
19154 -156212 15276 -257748 119854 22489 -47477 121922 -208087 -452832 -343265 49741
19143 -301682 -194849 -394432 -42368 -43558 -157653 48896 242341 -87161 -127270 -270371 -29496
19131 147898 -81350 -233994 97836 141351 32946 83635 -97225 -15088 -272366 -61246 -142395
19120 -142395 372773 -92197 -305745 -77280 3912 -262471 -217489 -180224 -23578 -35528 139734
19108 28131 -105115 -316848 -180102 -314994 -103039 -132060 22485 -324649 78568 -221085
19097 -149715 -24073 49060 -83563 183760 37005 -227176 81031 -140682 -368187 -466020 105374
19085 -40386 -8622 -84742 -88148 -224170 -71381 -19040 205214 -254589 -59697 -260128 -78356
19073b43538A62723G2590d7911B07807a54394A89090A3246i3099I5795d18286
19062a35639m0865c7673A01596J61352G2837b71770F812b8350k38837a05845l26726
19051d32571J90306J06725j46678P6773A31559n9645b60263a22936j06028A26942
19040B6993Q1202C5410c76460G5791f1403l72803K12225h9486c438k10306A63595
19028e8549k1125A72636A019a12560j61770c6699A10512J03478b2056j88776g6922
19016A73501a00399c0473D1006c58713J46071G4192a31406n4247g2856k70125
19006c42981a07304j1403k29630J61244q0370O5655d3675K0421C17773c1503j63162
18995a94665F1166c4783a992l76419e6856I2604e2952k7205K8357I1089c26841
$$ plain form
19073 -243538 162723 72590 -47911 207807 -154394 189090 13246 -93099 95795 -418286
19062 -135639 -176504 -37673 101596 262948 72837 -271770 6812 -28350 -267187 -105845 -432571
19051 -432571 -242265 -135540 -282218 -205445 131559 71914 -260263 -122936 -228964 126942
19040 26993 108195 35410 -376460 75791 -61403 -434206 -221981 -89486 -3438 -213744 163595
19028 -58549 -79674 172636 1019 -112560 -274330 -36699 110512 213990 -22056 -210832 -76922
19016 173501 -100399 -30473 41006 -358713 -212642 74192 -131406 -185653 -72856 -342981
19006 -342981 -107304 -118707 -348337 -187093 -267463 -201808 -43675 -23254 317773 -31503 -194665
18995 -194665 61166 -34783 -1992 -378411 -56856 92604 -52952 -80157 -51800 91089 -326841
18983a12548B31517a03565C40545E5623b40642L835R9394A97891R5066h7965K2798
18972f5167o0202A38515b52558A9340b37446C87742b26636A15627i043j69228
18962a78271B79115A5193f485q0202k72195Q20J61682O1410B1327Q8763f9229
18950F0767i3532A15651J6174F2487i3645C85427c9487r1809F2203g1286L5356
18939c5930j67151H6628d2363J3308M220j3099m4120a9071k32499B10020c93976
18927A2367e3391G4827b6016o9743B06310e1969o8223n5556k43596e0486A39168
18915a57354p6921K0146j10181M0045J40655C1266a62948F8656A3272a63653Q0430
18904h3223o3618M3937J2223a3202C4811K5855a25433N5790m4643J5067B17770
$$ plain form
18983 -112548 231517 -103565 340545 55623 -240642 -236807 -137413 197891 292957 -87965 -65167
18972 -65167 -125369 138515 -252558 19340 -237446 387742 -226636 115627 -9043 -178271
18962 -178271 279115 15193 -6485 -86687 -358882 -358062 -196380 -134970 21327 110090 -69229
18950 60767 -93532 115651 131825 62487 -93645 385427 -39487 -131296 62203 -71286 -35930
18939 -35930 -203081 86628 -42363 -29055 -24835 -37934 -82054 -19071 -251570 210020 -393976
18927 12367 -53391 74827 -26016 -95759 206310 -51969 -120192 -175748 -419344 -50486 139168
18915 -157354 -234275 -214129 -324310 -284265 -143610 31266 -162948 68656 13272 -163653 -83223
18904 -83223 -146841 -102904 -90681 -13202 34811 60666 -125433 -69643 -114286 -99219 217770
18892A83714a98738b5185n9534c6523K826r4842L3897B4085b99665J21518B52517
18880H5249a56241F7134L02766e099B5716J44378a03641A18915a82509M5489A30075
18868a92364j07091A11258a52637B30955c5262a2242A87730F6535k3903J4255
18858E6887c85169a35896E5086a76691K5196c4966r3499A34545a23285C35405
18847C0326b86241E1442a75266e9272A48592b10458e5232j1515j11179H3687l637
18836H0050b06256D2580Q6497g3633B4689b48397O5491a163k84209R6624A33551
18824d546j64275P0311C8271J00727b13859b8646D0056K37862j00674a44000C83988
18812e3569J7946j83063a5299A74330A1720d0798n338C8603K38309d3317j84181
$$ plain form
18892 183714 -198738 -25185 -84719 -36523 -33697 -128539 -94642 24085 -299665 -178147 252517
18880 85249 -156241 67134 369900 -5099 25716 170094 -103641 118915 -182509 -137020 130075
18868 -192364 -299455 111258 -152637 230955 -35262 -12242 187730 66535 42632 56887
18858 56887 -385169 -135896 55086 -176691 -151495 -34966 -128465 134545 -123285 335405
18847 30326 -286241 51442 -175266 -59272 148592 -210458 -55232 -66747 -177926 83687 80050
18836 80050 -206256 42580 129077 -73633 24689 -248397 -182906 -1163 -285372 -188748 133551
18824 -4546 -168821 -98510 38271 138998 -213859 -28646 40056 277918 177244 -144000 383988
18812 -53569 -35623 -218686 -15299 174330 11720 -40798 -46136 38603 276912 -43317 -227498
18801b27498L3021l1126F0292c34182O3866G8023J76514J20256F7620a53299f6772
18789a85420q2925h4465l227p6054l9149p7381k9406a42661B08426a68912C2618
18777a04894k21254a33177k66359Q1073J22999A58564J17507a16166D8278b49756
18766a06572j11317i4180k68104n4548a47790k0536j07705H7457C3306a28166
18755a76017k91416J18798C8298A6459J54300d95311h7796r304m1776A00776a6612
18743E674a44670L9687l12429p4619a48384c932A3341a62318N3855m1575J2104
18732a37934A26182a015k50353a18276A40504a19496L3462A4480c67854h0073
18721D6357K5715K5012k4525l0132g3982p7956I2904B7152b15761j08159A21283
$$ plain form
18801 -227498 -194477 -225603 60292 -334182 -270316 78023 254537 374793 67620 -153299 -66772
18789 -185420 -268345 -84465 -87692 -163746 -202895 -280276 -309682 -142661 208426 -168912 32618
18777 -104894 -326148 -133177 -399536 -318463 -195464 158564 276071 -116166 48278 -249756
18766 -106572 -217889 -94180 -362284 -416832 -147790 -168326 -276031 87457 33306 -128166
18755 -176017 -467433 -348635 38298 16459 170759 -495311 -87796 -97100 -138876 100776 -16612
18743 5674 -144670 -104983 -417412 -492031 -148384 -3932 13341 -162318 -108463 -150038 -137934
18732 -137934 126182 -1015 -251368 -118276 140504 -119496 -86034 14480 -367854 -80073
18721 46357 72072 97084 72559 42427 -73982 -151938 92904 27152 -215761 -323920 121283
18709b12451B71339j07111a35824C42037j44060h4959J7559a5378j16431H459
18698b9258D7632J39585B9668b18948j60671a58436K7569K0739B58236a26779
18687A33432g302j59983l2286g0988D5356b95880h2447E4319N0136c5919h764
18675b05182j74496E6605H976a53618j6370j93852A737J12940b5580j6782a2925
18663a29650M1761p6155j36710d6593k45425P852F3048b81831H705b32521a2586
18651b35935C43294A5119b46004h9083j73346i1596k02605H002i5765K0783B26685
18639f4373j5636C28366A53561J5799b47815k1464B80633b05431R2307M5129j60866
18628b28861k0429C4130O9274d3313j26332A18958P6548a13887A08446b26193
$$ plain form
18709 -212451 271339 164228 -135824 342037 197977 -84959 -67400 -15378 -131809 8459
18698 -29258 47632 187217 29668 -218948 -379619 -158436 -130867 -110128 258236 -126779
18687 133432 -7302 -167285 -199571 -70988 45356 -295880 -82447 54319 104455 -35919 -8764
18675 -205182 -379678 56605 8976 -153618 -169988 -363840 1737 114677 -25580 -42362 -12925
18663 -129650 -87889 -164044 -300754 -46593 -292018 -284166 63048 -281831 8705 -232521 -12586
18651 -235935 343294 15119 -246004 -89083 -262429 -91596 -294201 8002 -95765 -74982 226685
18639 -64373 -80009 328366 153561 169360 -247815 -269279 280633 -205431 -113124 -67995 -228861
18628 -228861 -249290 34130 103404 -43313 -169645 118958 195506 -113887 108446 -226193
18617f5049A55908b47368B86915I797L61332A13847f468q2434c9182j39922k34476
18606d13580B5719N6314c81118i2578H4781c36945A37215A0846J40995c2085k67957
18595c00042A3310N2616J6351a35465B1525e3869j36352b1292j62083j8220r3573
18584b95168i814A71953a49447A57098d28772J97320A41802a13848i875j00253
18574a10128c50B34796b90753J30561C2998a66199c172j96320B17857r8480a45603
18562c68073i8850j66547k63404E2030M1182j2939a8138j9673j67389e3256j03669
18551a56925j32084j85107D3964a45300b2543q6123L0641A56209b43994J19152
18541a24842M1830j1859A90149b0547k12551A0292a96516A37121J09653a42803
$$ plain form
18617 -65049 155908 -247368 286915 9797 371129 113847 -6468 -88902 -39182 -179104 -413580
18606 -413580 25719 82033 -381118 -92578 84781 -336945 137215 10846 151841 -32085 -300042
18595 -300042 13310 65926 82277 -135465 21525 -53869 -190221 -21292 -183375 -201595 -295168
18584 -295168 -9814 171953 -149447 157098 -428772 -231452 141802 -113848 -9875 -110128
18574 -110128 -350 234796 -290753 -160192 32998 -166199 -3172 -199492 217857 119377 -145603
18562 -368073 -98850 -265397 -528801 52030 93212 80273 -18138 -37811 -205200 -53256 -156925
18551 -156925 -289009 -474116 43964 -145300 -22543 -108666 -78025 156209 -243994 -124842
18541 -124842 -83012 -94871 190149 -20547 -233098 10292 -196516 137121 246774 -142803
18530a6612k26025C5357b57476J18844A1081c46478B65656a04155B863a83765
18519D07787F3153h88p2830c095k635q9949H8829d80071e1932k45653a13231b5467
18506b98762L6721G2926K97791A18409a5015A147J11360n4055J51069a37423A22472
18494B13917a22787k0857k76649B50821b29306C6880Q8374j3333b9917H1699f1870
18482a55945e2983j30828k52137a28678N811n6779O6424k81283E0005L4103b69400
18470A78333h0751B02461c78046B5154c28763E2239i3245j29798e573l1038l2234
18459f8845p1416F798b09516A95859b43897J8188b9023B6206a99403a5957j4099
18448c0056G3846b28101B67134a42890q3684q9848a18476J9766q8493d3586A59610
$$ plain form
18530 -16612 -242637 35357 -257476 -138632 11081 -346478 265656 -104155 2863 -183765
18519 407787 63153 -888 -73718 -3095 -5730 -95679 88829 -480071 -51932 -297585 -113231 -25467
18506 -298762 -262041 72926 370717 118409 -15015 1147 112507 58452 209521 -137423 122472
18494 213917 -122787 -143644 -420293 250821 -229306 36880 125254 111921 -29917 81699 -61870
18482 -155945 -52983 -183811 -435948 -128678 -122867 -179646 -113222 -394505 50005 84108 -269400
18470 178333 -80751 202461 -378046 25154 -328763 52239 -93245 -223043 -5573 -36611 -68845
18459 -68845 -140261 6798 -209516 195859 -243897 -225709 -29023 26206 -199403 -15957 -30056
18448 -30056 73846 -228101 267134 -142890 -226574 -316422 -118476 -98710 -187203 -43586 159610
18436a44466k33591D4294L45647F5236a40703A68857a29899a1976m31920a58707
18425a82172h3617A68565b64295Q084J8438J06649n372j0294A36840b11334O3260
18414a48074f3044I0265B6582J06240g2293j83320a5192B0560K08439B8942M2218
18403G1160C4180a83150c6774j01767L6377e583A23859O5296m4601J41292m7833
18392B38013J17766b96224N6360p8A87814N3603a75837H7292P6542b70358J12453
18381a57905n661G7168K66081l2334a74162c7947j77736B1992K5080b20401c7619
18369b3729k16856K9544A192d62989a46541h773k6725A20117a3511j83637c4188
18357A18072M0a212j18432C057a74548m25894A6629a154D28321a9282k99964a1188
$$ plain form
18436 -144466 -378057 44294 389941 65236 -140703 168857 -129899 -11976 -443896 -158707
18425 -182172 -83617 168565 -264295 -256211 -237773 -131124 -136496 -146790 136840 -211334 -148074
18414 -148074 -63044 90265 26582 132822 -72293 -255613 -15192 20560 228999 28942 71160
18403 71160 34180 -183150 -36774 -138541 -102164 -5583 123859 189155 144554 285846 238013
18392 238013 355779 -296224 -239864 -239942 187814 241417 -175837 87292 163834 -270358 -157905
18381 -157905 -163566 77168 343249 310915 -174162 -37947 -215683 21992 47072 -220401 -37619
18369 -23729 -240585 -211041 1192 -462989 -146541 -8773 -35498 120117 -13511 -197148 -34188
18357 118072 118112 -1212 -119644 3057 -174548 -600442 16629 -1154 428321 -19282 -319246 -11188
18344b2062g651m9097j83706Q0010m917I7484b13472j78421c4546r0119B58280
18332D839a17637k60567C2626K83837C7457A873c08817M3652c7547A0612b70090
18320d23427a06521G7672d2585k5720A9016R0378c89383J49889D6538e0156l7830
18309h7986A9446a14239l05026J89745i2894j32177D7117J83582b0012c365j20182
18298a23547A05851b68864J20550j08725G2962c26623a20951a6998B54837a73835
18287a44820J9329d3536H7916J97960j15994c17875D6265b03301F8675i9797F3262
18275A45218c56554L8311A03961b97380J07961C23904A57107R1727b78152E6079
18264a88754F4334K9506c1048j42299A11941a84027r4438K1602j0665n3788A45169
$$ plain form
18344 -22062 -7651 -56748 -240454 -160444 -165361 97484 -213472 -391893 -34546 -124665 258280
18332 4839 -117637 -378204 32626 316463 37457 1873 -308817 -265165 -37547 10612 -270090
18320 -423427 -106521 77672 -42585 -68305 19016 109394 -389383 -239494 46538 -50156 -87986
18309 -87986 19446 -114239 -419265 -229520 -92894 -225071 47117 230699 -20012 -3365 -123547
18298 -123547 105851 -268864 -148314 -257039 72962 -326623 -120951 -16998 254837 -173835
18287 -144820 -125491 -43536 87916 285876 169882 -317875 46265 -203301 68675 -99797 63262
18275 145218 -356554 -318243 103961 -297380 -189419 323904 157107 248834 -278152 56079
18264 -188754 64334 93840 -31048 -173347 111941 -184027 -278465 -256863 -267528 -321316 145169
18252a01679k75380J23868R163a0115k04669f2630o5278k1599H5259c6291I3823
18240E0143a56438L5736p9664k59550K06660f2802l02520C7827h7k53772A66406
18228D2745f2663o1784r731K2564D22121a76559B89821b09360n1988B37168d03831
18216a94692A06094k0793b02130F7436J22848a74002J4051j9146d9229O933B11297
18204I5827k2893K40367c98684J51889e1769k84376A34367K20676A25542g9826
18193C13839b32394e9883j3099l58098g6387q1798M4014F1740a57063J5751B08641
18181b59397B6947m182a86660M851f0656p1920q590A84003a06751k58403A78002
18169A76573J43255A34934C3711J46690D8668b8045B03203a03872n4739n6858
$$ plain form
18252 -101679 -377059 -253191 -244028 -10115 -214784 -62630 -127908 -149507 85259 -36291 93823
18240 50143 -156438 -120702 -200366 -459916 -253256 -62802 -365322 37827 -87 -253859 166406
18228 42745 -62663 -124447 -134178 -111614 422121 -176559 289821 -209360 -261348 237168 -403831
18216 -194692 106094 85301 -202130 67436 190284 -174002 -159951 -179097 -49229 -42296 211297
18204 95827 72934 313301 -398684 -246795 -51769 -336145 134367 355043 125542 -79826
18193 313839 -232394 -59883 -72982 -431080 -76387 -158185 -114171 61740 -157063 -141312 208641
18181 -259397 26947 22765 -186660 -181809 -60656 -132576 -141166 184003 -106751 -365154 178002
18169 176573 319828 134934 33711 180401 48668 -28045 203203 -103872 -158611 -215469
18159b15469a5241j55347A50118k9158b49250C03088b13642R0558M3596j32041
18149b11529h1507A78755o6199c56034a26199B38869I027d12744d5737j46440
18139a92177N6558b057j95254B5455c55833A49227a83106l4642A84103a87836
18128C32693c17397C7995K4484b29429A40781j4889B4215J5537L4043K82112D0153
18116B6024a87398C5551g122l0907B66473B3892a53504e6800K6053j03517D5268
18104C4699R7915h0167C92827B1652b50055M0292B91129b52271J08624d6609j68658
18093b15267B62142F4033h918j3886k49280A30062a40137A10589d7095j52158
18083a99253B1538M9892K97713a71787m05035I2010a49533j9769F5391C5a43097
$$ plain form
18159 -215469 -15241 -170588 150118 120960 -249250 303088 -213642 -123084 -79488 -211529
18149 -211529 -81507 178755 112556 -356034 -126199 238869 9027 -412744 -45737 -192177
18139 -192177 -135619 -2057 -197311 25455 -355833 149227 -183106 -217748 184103 -187836
18128 332693 -317397 37995 62479 -229429 140781 125892 24215 39752 73795 355907 40153
18116 26024 -187398 35551 -7122 -38029 266473 23892 -153504 -56800 -30747 -134264 45268
18104 34699 132614 -80167 392827 21652 -250055 -209763 291129 -252271 -143647 -46609 -215267
18093 -215267 262142 64033 -8918 -22804 -272084 130062 -140137 110589 -47095 -199253
18083 -199253 21538 71430 369143 -171787 -576822 92010 -149533 -169302 65391 35 -143097
18071b98203g2543j8068n1673k00863N0012b3442A03958i1020K7158A33589K2823
18060A56412F0574j5683J05338h6582o3573B01369a67913B45424a99152H6282
18049a44399e1085I85a80585A71197g8112l2469j82202K0155A04574G197a92325
18037f3652j24331m0242g1836B95096a9426k42694f8897j05734b9566j00333e2442
18025h2050C8589c30280g4453B41306D4734e73849a07866c1412A0606i4005C52730
18013A26164d4439I142b48331f9007A68357i2299j69643G3442f0334E0410e1757
18001a85065E46c78240d3611B8235e7436q8732d7601B0501a34772o9708k302A09246
17988b29672d2162j43416B4011a48884j79933a20253B02401a7420j62761P6424
$$ plain form
18071 -298203 -72543 -90611 -142284 -343147 -293135 -23442 103958 -91020 -63862 133589 156412
18060 156412 60574 44891 150229 -86582 -150155 201369 -167913 245424 -199152 86282
18049 -144399 -51085 985 -180585 171197 -78112 -110581 -292783 -272628 104574 7197 -192325
18037 -63652 -187983 -228225 -71836 295096 -19426 -262120 -68897 -174631 -29566 -129899 -52442
18025 -82050 38589 -330280 -74453 241306 44734 -573849 -107866 -31412 10606 -94005 352730
18013 126164 -44439 9142 -248331 -69007 168357 -92299 -261942 73442 -60334 50410 -51757
18001 -185065 546 -378240 -43611 28235 -57436 -146168 -47601 20501 -134772 -204480 -206782 109246
17988 -229672 -42162 -185578 24011 -148884 -328817 -120253 202401 -17420 -180181 -103757
17978a03757q5174k31019B4399b818A58506a64374M7096n571a9087j33265O4938
17967h7414C5944d8431k97673A5703e6471o1151j1044l8426H1972L7940a31841
17955a74910F7206f3609A40308P9786a48323B34633q1681d7402k18955A16658
17944e4821C13967b67679d2943A90236K38922A6984M0793L764N5885n2360a57778
17932a13003N1713q4398B68162i5545L941C1078b68503a28378A97304h7828j52524
17921b40352h7467H9644c22413N9889a01473B80868b0070C48906A25015a12656
17910b95024a06148A32124e7922j54188J8285I58L12738a55559k030N9793d8040
17898a8187q4406F3543a38665j82568A39559a15352A09077J773d6052B05916i1396
$$ plain form
17978 -103757 -188931 -419950 24399 -2818 158506 -164374 -117278 -122849 -19087 -152352 -87414
17967 -87414 35944 -48431 -346104 15703 -56471 -117622 -128666 -167092 81972 119912 -131841
17955 -174910 67206 -63609 140308 220094 -148323 234633 152952 -47402 -266357 116658
17944 -54821 313967 -267679 -42943 190236 429158 16984 57777 61541 117426 65066 -157778
17932 -113003 -61290 -145688 268162 -95545 -91604 31078 -268503 -128378 197304 -87828 -240352
17921 -240352 -87467 89644 -322413 -262524 -101473 280868 -20070 348906 125015 -112656
17910 -295024 -106148 132124 -57922 -212110 -193825 958 313696 -155559 -157589 -97796 -48040
17898 -18187 -102593 63543 -138665 -321233 139559 -115352 109077 110850 -46052 205916 -91396
17886A5966a96664c7363q8578e9364b745E2011j5986a84997C3385a96026N2370
17875a43656B82567g7368C30407a7328B6588J36031e3216F4339a52088q1507G1344
17863b57936e5917p3846o9832A38046n0695i0335C2485M4602J82606a91565A56900
17851A69456G3246c13663A28214a53434j2353f4310B52196A5158b7070p7595k4216
17840a28881F9600a31158j45519P4932A52600c42861f6910C79841a99599L3862
17830a65737G2797h9410A85105b84758J41018M4329A64553c1387p2415j42238
17820b46040B56660a18131k19857a8149n8234m2250A10383e5908C4524L03746
17810C38270D6460b58467g6437j54528B3098Q7328J37255a86520j62399a22148
$$ plain form
17886 15966 -196664 -37363 -125941 -59364 -2745 52011 36025 -184997 33385 -196026 -143656
17875 -143656 282567 -77368 330407 -17328 26588 162619 -53216 64339 -152088 -233595 71344
17863 -257936 -55917 -129763 -199595 138046 87351 -90335 32485 77087 259693 -191565 156900
17851 169456 73246 -313663 128214 -153434 -165787 -64310 252196 15158 -27070 -104665 -128881
17840 -128881 69600 -131158 -276677 -201745 152600 -342861 -66910 379841 -199599 -165737
17830 -165737 72797 -89410 185105 -284758 -143740 -99411 164553 -31387 -103802 -246040
17820 -246040 256660 -118131 -337988 -18149 -76383 -118633 110383 -55908 34524 338270
17810 338270 46460 -258467 -76437 -230965 23098 110426 247681 -186520 -348919 -122148
17799a54918j83215A95852E79a22136R069n8394B55939a14531B6155K1389g8262
17787f5182G1988O3484b3158A41331n8643J45778a4803j06974B13363a51899a1695
17775A45469A0474N4711a27653e2594B29201a29437j1703j46296f1488I1668b42434
17763B69391M0186a23690c9233B57287j18615g8726A12805a21917N0010k06605
17753b78512a14396d2089k83580A22607E7273b4947l7587l51470A10380h041j1844
17742a9885A06561e3172k6733B85154A1077J06251J86252q9737m427G0740a71114
17730a25796A22908Q6904i9831M8617A15834K70507e1332I6531C7278f1796i937
17718a83985P5691A00438J46457O185E1605g3218l4892B63274b58780D2410b50062
$$ plain form
17799 -154918 -338133 195852 579 -122136 -113067 -171461 255939 -114531 26155 47544 -78262
17787 -65182 71988 135472 -23158 141331 82688 228466 -14803 -121777 213363 -151899 -11695
17775 145469 10474 65185 -127653 -52594 229201 -129437 -141140 -287436 -61488 91668 -242434
17763 269391 309577 -123690 -39233 257287 138672 -78726 112805 -121917 -71907 -278512
17753 -278512 -114396 -42089 -325669 122607 57273 -24947 -62534 -414004 110380 -8041 -19885
17742 -19885 106561 -53172 -79905 285154 11077 117328 303580 213843 209416 70740 -171114
17730 -125796 122908 209812 -99831 -51214 115834 386341 -51332 96531 37278 -61796 -9937
17718 -183985 -108294 100438 246895 253080 51605 -73218 -108110 263274 -258780 42410 -250062
17706e1202n9121M0778j49226l6611B90615l2743m59a90730N8956B6495D007L8534
17694D2541L6903R4912J595b74530J06062A72012J8125B0266a45410A76146a09835
17682A79755G5554P2993b61987C79292C9166J38086P8909b11319M8133A10439
17671F5434g3730B08568k5941b52857A82430J09704m2326a7651n960G50N353O3753
17659F9856a19255A11568h5915C30753h7709A91904i1584E348K38728F4407j6510
17648D7897b17446B11b79584d9822B3457d4372C0674K2251n426c5048l18948A6801
17635A40408J47778j1544I0409b43790C10798a55339H9914J53403B5334d0866
17624A83990D9061d31673A02689Q5422l4530O6704b72791I107N9843L42573e0128
$$ plain form
17706 -51202 -110323 -69545 -218771 -255382 290615 257872 257413 -190730 -131774 26495 4007 42541
17694 42541 79444 174356 175951 -274530 -168468 172012 190137 20266 -145410 176146 -109835
17682 179755 75554 148547 -261987 379292 39166 177252 256161 -211319 -163186 110439
17671 65434 -73730 208568 182627 -252857 182430 292134 249808 -17651 -23611 750 6103 69856
17659 69856 -119255 111568 -85915 330753 -87709 191904 -91584 5348 244076 64407 47897
17648 47897 -217446 211 -279584 -49822 23457 -44372 30674 52925 47499 -35048 -353996 16801
17635 140408 288186 276642 90409 -243790 310798 -155339 89914 243317 25334 -40866
17624 183990 49061 -431673 102689 188111 153581 220285 -272791 9107 68950 411523 -50128
17612A68613K6486d53385a61799A39732a01726A10029J9188B7206o163a91258
17601a6381n5135j62513A68259c33070J17974N9702j49729F6234O7610k8815D883
17589f083B0202B717J8304L7354N1238a65096P2243A92986B6000N1666L03418
17578C81084i6093j94113j97782g1593B71403G6579g2418D8575K03112a67390
17567a05051A8430h1231l0416a5418j11772C16250o7724g07A18295e7005B2440
17555B14718b07932b2907B97176A00058a31138C15372H0558a80678a5497E4399
17544B44492a18721L4716A76643J93105A22223b91778B7043G963J33728a76593
17533c502A9746b89470A4519J99980J2909j7492m3773f4262D0061J78750a42630
$$ plain form
17612 168613 195099 -453385 -161799 139732 -101726 110029 129217 27206 21043 -191258
17601 -16381 -71516 -234029 168259 -333070 -215096 -155394 -305123 66234 133844 105029 4883
17589 -6083 20202 2717 21021 58375 109613 -165096 -92853 192986 26000 77666 381084
17578 381084 -96093 -290206 -487988 -71593 271403 76579 -72418 48575 251687 -167390
17567 -105051 18430 -81231 -111647 -15418 -127190 316250 248526 -707 118295 -57005 22440
17555 214718 -207932 -22907 297176 100058 -131138 315372 80558 -180678 -15497 54399
17544 244492 -118721 -84005 176643 369748 122223 -291778 27043 7963 141691 -176593
17533 -3502 19746 -289470 14519 214499 227408 209916 166143 -64262 40061 218811 -142630
17521C5169b20807h6010l0572A6414a63676A13546R4121F9716j835J69566n7264
17510A80183N0853M379I7928a44099B0365J86942n7946J71293A17839C3745P8824
17499A12569O0271a56303d6292l0065B57313c33953a47073C35885j31365P0748
17489B75268E416J44735a88724H348Q0999P8567N7862a54906e2070A05845k7791
17478G8054J30629E3107P9178J636J45286f7115I6937J26919O4257a98711A79240
17466B74807A03418d0231A63049k0811b4096E5606j3576a36391E96873C5801N7866
17455I3667C5602K75316j00107K51605j43646H3431K54845l6153k7017A06753
17444A10309K13876H1205c0291C99720h1475B61982J71511H5858k2170J32655
$$ plain form
17521 35169 -220807 -86010 -116582 16414 -163676 113546 207667 69716 67881 237447 180183
17510 180183 231036 235415 97928 -144099 20365 207307 149361 320654 117839 33745 112569
17499 112569 172840 -156303 -46292 -76357 257313 -333953 -147073 335885 204520 275268
17489 275268 5416 150151 -188724 8348 89347 167914 225776 -154906 -52070 105845 78054
17478 78054 208683 53107 132285 133921 279207 -67115 96937 223856 288113 -198711 179240
17466 274807 103418 -40231 163049 142238 -24096 55606 42030 -136391 596873 35801 93667
17455 93667 35602 310918 210811 462416 318770 83431 338276 302123 275106 106753
17444 110309 324185 81205 -30291 399720 -81475 261982 433493 85858 63688 196343
17434A96343K21226A85878n9990C4424K99275A00013K2572M6950L328H5796a2322
17422A58899K3026a5914A07572A6055N0636J73081Q417L06163H7152J26163p9797
17411A33518Q3289j3447a91149B23605o2388J80440j65951b8995J2828B89118
17400G1852g7292D0892a98009M912A64151o7239c7055B77155A19661M4370Q6278
17389B50309k2871A09770J09189b23419C9582J98505d1441B3127K50264G4242
17378B43154R7108i028l4535j3056B3788O57626l04235E0666O3504a8189A48148
17366B08649C7035A3779g0940C58793a02632k885B69454j25485C1624a6514D02219
17354D18228j99862J14255B7132L0898J37633g4483H7362M472b49129a6339F9254
$$ plain form
17434 196343 417569 185878 125888 34424 333699 100013 122585 169535 172863 85796 -12322
17422 158899 181925 -15914 107572 16055 66691 239772 248189 554352 87152 213315 133518
17411 133518 216807 203360 -191149 223605 161217 341657 175706 -28995 -16167 289118
17400 71852 -77292 40892 -198009 -193097 164151 96912 -37055 277155 119661 164031 250309
17389 250309 227438 109770 218959 -223419 39582 238087 -41441 23127 273391 74242
17378 243154 340262 -9028 -43563 -56619 23788 681414 377179 50666 114170 -18189 148148
17366 208649 37035 13779 -70940 358793 -102632 -105517 269454 143969 31624 -16514 402219
17354 418228 218366 332621 27132 58030 195663 -74483 87362 91834 -249129 -16339 69254
17342b1641A27191R8702H9511J44539j00360j4357M6673D2090K5168l3409K10401
17331B44250A0398J10415K14563j17080k2081i8984F6045K66073j18963o5563
17321A47592J88131E0620J39703d0102A22758J65276p2028O4594m7602a95557
17310D79781b12381d9840B90344a07079j04055c1952E00753A34156a03660C12554
17299a4831H5631a68402A04082L12515G6860a73525D4154a52689A87489K19619
17289D07108A41660J2000J74232A32402B5822c8057C13532F6633K8545a67367
17278g6937D72934r3031A00023J36961h0127D85184F3046J81818e1551B25092
17267C24083b8671B84616A39962K72397A59066K13119R6140c8984C02599j4488
$$ plain form
17342 -21641 127191 225893 89511 234050 133690 119333 166006 42090 67258 33849 244250
17331 244250 10398 120813 335376 218296 196215 -98984 66045 332118 213155 147592
17321 147592 335723 50620 190323 -40102 122758 288034 216006 280600 232998 -195557
17310 479781 -212381 -49840 290344 -107079 -211134 -31952 500753 134156 -103660 312554
17299 -14831 85631 -168402 104082 416597 76860 -173525 44154 -152689 187489 407108
17289 407108 141660 153660 327892 132402 25822 -38057 313532 66633 95178 -167367
17278 -76937 472934 379903 100023 236984 -80127 485184 63046 244864 -51551 225092
17267 324083 -28671 284616 139962 412359 159066 372185 468325 -38984 302599 288111
17257B88111j12028m0691L19436A7939L91090b0626A25261K28683f9326B07466
17246A61756K9323K69415A48675J0478m5829M86825D0485K12962p308e7870M290
17235e3580A68935J61952o7126d12420B04827b7377C10930m4488q6251j4269K76423
17224D42345j74757A26955Q1615L43636B47275A21444P6493I0035O3327K00756
17214C54118a0477B37352L5556j34038c2034B65107J05663G8404a29172C38186
17203C62225j25392o4305E9058J09540k2265J97658J1652L89455i5961B61378
17192D1548J85249j11936M5777g4711C25143P7216j73849G2887Q3083p2084L06671
17181C90557P7160j09846j60617I7961L41719k03993e7098A64116E6853L30581
$$ plain form
17257 288111 176083 135392 454828 17939 409029 -20626 125261 353944 -69326 207466
17246 161756 191079 460494 148675 159153 113324 600149 40485 253447 246139 -57870 -53580
17235 -53580 168935 330887 263761 -412420 204827 -27377 310930 266442 180191 165922 442345
17224 442345 267588 126955 208570 552206 247275 121444 197937 90035 153362 354118
17214 354118 -10477 237352 272908 138870 -32034 265107 370770 78404 -129172 338186
17203 362225 236833 172528 59058 168598 146333 343991 355643 745098 -95961 261378
17192 41548 226797 114861 160638 -74711 325143 402359 228510 72887 155970 83886 390557
17181 390557 467717 357871 197254 97961 439680 235687 -57098 164116 56853 387434
17171C87434j01869P496L81166B86793M2758j27645L9255b5790A20522o488C4428
17159C34843o4511J04170j26830J85193M3218j86559J42117A57178K03974j13967
17149B47185j11891m4483K70588a9205C99714I4702L13558p3653j16499M7197
17139B65305O5271Q6274D3984J71436Q1910J72169I5223J38947o4148L64335j87281
17128C47076n6837J40218B10914J65494o9895m9986o2995j4870F0302N42236j68674
17117D33864k02541p132K70296A81454K64972J29620A69902Q8619M6186J3309
17107C18016j24292O70J89882j38845K21811l5701R3760A07838N4458J52549A22822
17095D92742j04742P764J3623A01645M97810j36365k962q6182A44952K59954A38165
$$ plain form
17171 387434 285565 293061 674227 286793 329551 201906 241161 -25790 120522 114034 34428
17159 334843 270332 374502 247672 432865 476083 289524 431641 157178 361152 247185
17149 247185 135294 90811 361399 -19205 399714 94702 408260 334607 218108 265305
17139 265305 330576 416850 43984 215420 297330 469499 95223 234170 170022 534357 347076
17128 347076 290239 430457 210914 376408 306513 256527 193532 178662 60302 602538 433864
17117 433864 231323 224191 494487 181454 446426 576046 169902 258521 304707 318016
17107 318016 193724 194394 384276 245431 467242 431541 525301 107838 162296 314845 122822
17095 492742 388000 395764 409387 101645 599455 463090 460128 373946 144952 404906 138165
17083A93983L35485j28753o5544m8884J34705l9479r9224j4117H7581M48268K70791
17072H06640k36958j4852k1858N409k34546o4176J88483j24237J36932j63016
17062B77821K31078J99306l41391A6604N47141J30773j79886o4485N4715K213
17052E07075q5709l7237Q7407K19068O7326j64430L9173j88556K12214l16674
17042C39657J77457P4251q8611J51859j8913M9437R0471B87696q6648K46154M4444
17031D91646L47343D01653o9549K91118J04850q610j39058n1103L84700l51634
17021E62367J45444n2647L2671j01023L20139l84078L31764C51533J38930J94207
17011F84670K1091J24497l34456K41639k06645K95628j99319k82144L44194J97126
$$ plain form
17083 193983 529468 400715 335171 286287 420992 381513 282289 268172 87581 535849 806640
17072 806640 569682 554830 532972 538381 303835 239659 428142 303905 440837 277821
17062 277821 508899 708205 366814 16604 563745 694518 514632 450147 504862 507075
17052 507075 421366 384129 471536 690604 757930 593500 632673 444117 656331 339657
17042 339657 517114 591365 502754 654613 635700 685137 775608 287696 201048 447202 491646
17031 491646 838989 401653 332104 623222 728072 719462 580404 529301 914001 562367
17021 562367 707811 655164 687835 586812 906951 522873 854637 351533 490463 684670
17011 684670 705761 830258 495802 737441 530796 826424 627105 344961 689155 886281
17001H86281j08067q0359n5954J28647k1545Q0409j9121k75020J62600j30135
16991E67736K58281J06449k74647K20618J05139m57944K98708p6165J81921j14349
16981H15747J68716N1508k93950L07303j49866M6673k23630R7582r5519M79808
16971A204372j29645k96733L03648j55748k57127L64671k74755M35450k11155
16962I82978l70389R3423L32610k56423J34682P5696J22921j33427N1275j13502
16952I19844n661K5943R470l56827K56906P7708J27175j3881J37364r626J03549
16941A271964J28810k18185k60331J28177J48552j00946J34006o4326n7650J26041
16931A236112k00897J51972J18608j56166L1456L19016j45269k3036N4006l4113
$$ plain form
17001 886281 778214 697855 641901 770548 749003 829412 810291 535271 697871 567736
16991 567736 826017 932466 657819 878437 983576 525632 824340 748175 930096 815747
16981 815747 984463 1035971 742021 1049324 899458 946131 722501 820083 724564 1204372
16971 1204372 1074727 777994 1081642 925894 668767 1033438 758683 1194133 982978
16962 982978 612589 706012 1038622 782199 916881 992577 1115498 982071 1033346 919844
16952 919844 914183 940126 949596 592769 849675 927383 1054558 1040677 1178041 1168415 1271964
16941 1271964 1400774 1182589 922258 1050435 1198987 1098041 1232047 1167721 1110071 1236112
16931 1236112 1035215 1187187 1305795 1149629 1181085 1500101 1354832 1331796 1385802 1351689
16921A351689p8890L73405m10618K4057o8846R8762M50558k42134Q3956j51925
16911A430014L1897q2098J3227M61390l38669M6813l9555J05591l4450j84539
16901A409621K09682j95451L10932r2240K16661k67301l8749R8084L52014R7950
16891B101203J78830m67373K20142j96297K65205o6038k99460K76219L95759o69156
16881A739034M74289k94125M06903K13943n88202N44984l6192P9835l6968j66167
16871B337334J42620n1096P9016j63846L11816r0703l4157L7465Q7145L55162
16861C010756q7012j75073k11630L39667k55164M18861k41407K93305j66094K88221
16851C214430j94610L69992L01942k93730J62361K00329k18132k56207J34488
$$ plain form
16921 1351689 1272799 1646204 1235586 1259643 1190797 1289559 1740117 1497983 1581939 1430014
16911 1430014 1461911 1379813 1393040 1854430 1515761 1562574 1523019 1628610 1594160 1409621
16901 1409621 1619303 1423852 1734784 1642544 1859205 1591904 1553155 1651239 2003253 2101203
16891 2101203 2280033 1812660 2032802 1836505 2101710 2035672 1736212 2012431 2408190 1739034
16881 1739034 2213323 1919198 2326101 2540044 1951842 2496826 2460634 2540469 2503501 2337334
16871 2337334 2479954 2428858 2507874 2344028 2655844 2565141 2530984 2568449 2655594 3010756
16861 3010756 2923744 2748671 2537041 2876708 2621544 3040405 2798998 3092303 2926209 3214430
16851 3214430 3019820 3389812 3691754 3398024 3560385 3760714 3542582 3286375 3420863
16842C420863j45J60722L68614l88067M39107p8843O8795o50L90998J41912m66267
16831D057039M54710m5478M8099l2632K6392J43656L28381J02263O0306J3897
16821E156633j89589N19849J3208J59245K9924K44645k91544N40456r777K66550
16811F439600Q4391K8415J95134l14055N87409J46983j27063L37985J62571K63874
16801G805244J44301J52705K75785J6117K62143K61036L15461K78833K6091N18510
16791A0056226j16980o4154O93048N54413K09544O9913M06669K09617O82180N8530
16781A2759006M87072O30643L14280M58035J44799O67981L27301L91049Q06552
16772A6986718P13631L15124P16873O33699M56227P22271P53323J059810N04469
$$ plain form
16842 3420863 3420718 3581440 3950054 3561987 4001094 3922251 3991046 3990396 4381394 4523306 4057039
16831 4057039 4511749 4466271 4514370 4481738 4508130 4651786 4980167 5082430 5142736 5156633
16821 5156633 4967044 5486893 5500101 5659346 5689270 5933915 5642371 6182827 6173050 6439600
16811 6439600 6523991 6552406 6747540 6433485 7020894 7167877 7040814 7378799 7541370 7805244
16801 7805244 7949545 8102250 8378035 8394152 8656295 8917331 9232792 9511625 9537716 10056226
16791 10056226 9939246 9875092 10568140 11122553 11332097 11402010 11808679 12018296 12700476 12759006
16781 12759006 13246078 13876721 14191001 14649036 14793835 15461816 15789117 16180166 16986718
16772 16986718 17700349 18015473 18732346 19366045 19822272 20544543 21297866 22357676 22862145
16763B2862145J223529J357794L60262J153679J152078Q11373J363791J096252
16755C1380903J583650J415789J872931J504454J722756K020502J473024K758756
16747D5732765K191986K534148K755532K621522L164841L129080L304197L972457
16739F9406528L815024M419992M279231M843025M904884N621540N852972O126815
16731A09270011O217863O648257P192013P022193P118035P474569P227706O883610
16723A65054257O612345O229746N302822M592221L498128K736471J038642K28499
16715A95293131j466418l082440l229057n251970n175106o411706o739659p451757
16707A56485018o985481p428752p507314p051174p193466o702808o408750o420587
$$ plain form
16763 22862145 24085674 25443468 25803730 26957409 28109487 28920860 30284651 31380903
16755 31380903 32964553 34380342 36253273 37757727 39480483 41500985 42974009 45732765
16747 45732765 47924751 50458899 53214431 55835953 59000794 62129874 65434071 69406528
16739 69406528 73221552 77641544 81920775 86763800 91668684 97290224 103143196 109270011
16731 109270011 115487874 122136131 129328144 136350337 143468372 150942941 158170647 165054257
16723 165054257 171666602 177896348 183199170 187791391 191289519 194025990 195064632 195293131
16715 195293131 193826713 190744273 187515216 182263246 177088140 170676434 163936775 156485018
16707 156485018 149499537 142070785 134563471 127512297 120318831 113616023 107207273 100786686
16699A00786686n323373n648164n469731m654507m057245m577318l851921l698917
16691F3505510l288343l175458k725007l044121k544494k326597k435568k378680
16683D1587242j675526k165587j466849j964626q73383j488842k031180r77883
16675B8943366j083221j225124j226818q55372r69923r56607j022302m30495q26762
16666B0346742p54024p04146j055959K8559q62494o89506n79629l90550k51476
16657A5087517o12990m65508n10981l72580j32201q31729m88432j71486J5220
16648A1516830r34575o7085k50899l1187l99838k02454k44716k68939O8894o11502
16638H574529k90396l30231L5682J9399m19959l647j46338l99790k57357K96K5712
$$ plain form
16699 100786686 95463313 89815149 84345418 79690911 75633666 71056348 67204427 63505510
16691 63505510 60217167 57041709 54316702 51272581 48728087 46401490 43965922 41587242
16683 41587242 39911716 37746129 36279280 34314654 33441271 31952429 29921249 28943366
16675 28943366 27860145 26635021 25408203 24552831 23582908 22626301 21603999 21173504 20346742
16666 20346742 19592718 18888572 17832613 17861172 16998678 16309172 15729543 15338993 15087517
16657 15087517 14474527 14009019 13498038 13125458 12993257 12161528 11673096 11501610 11516830
16648 11516830 10582255 10515170 10264271 10233084 9833246 9630792 9386076 9117137 9186031 8574529
16638 8574529 8284133 7953902 7989584 8008983 7589024 7585377 7439039 7039249 6781892 6782188 6807900
16627F807900k40121r4244m23319j17017J7590P2259l74631K31796l53979q939
16617E517295j37164l34569p6388R5538k15889p3010q2867O9523p1255l42972
16607D348242j86075k4375k91474o7510L91859k05088J09419m2161l10662k95538
16597C426637K427J07531q3128k20068k26495N42598k93632L36354l50852j15603
16587C125769m6935k44659j7723j00643M23830J2002l83294J41989k2583j82847
16577B704906j29954m6595J46199p3221k37842J46507m045O9744k82774j704k15217
16566B076004L90302N4156l37722j46219k88544M5606M05M81982k75558J31556
16556B131968k47444L27509o74389L61423m2457p2156J21224j56672J50717N9453
$$ plain form
16627 6807900 6567779 6473535 6050216 5933199 5950789 6023048 5648417 5880213 5526234 5517295
16617 5517295 5380131 5045562 4969174 5064712 4848823 4775813 4692946 4762469 4691214 4348242
16607 4348242 4162167 4137792 3846318 3778808 4170667 3965579 4074998 4032837 3722175 3426637
16597 3426637 3429064 3536595 3453467 3233399 3006904 3549502 3255870 3592224 3241372 3125769
16587 3125769 3078834 2834175 2816452 2715809 3139639 3151641 2768347 2910336 2887753 2704906
16577 2704906 2574952 2528357 2674556 2601335 2363493 2510000 2505955 2575699 2292925 2291221 2076004
16566 2076004 2466306 2520462 2182740 2036521 1747977 1793583 1793988 2275970 2000412 2131968
16556 2131968 1884524 2212033 1537644 1899067 1856610 1784454 1905678 1749006 1899723 1959176
16546A959176l47954j81200J91385K66170j16713l50272K21918k87599M24443
16537A779354j33796j6365k47466J43324j91273N4149J16396O9669k15793L8328
16527A396527r7422k74240L07067k6554J8615J27314l78217K55843R488P6102
16517A414523j32966l57896O69806P9787m85814K96847l44580J7896M9618k56674
16507I50547j44250M24650j23019J38283k01043L8029k20577K94851m00777M40852
16497A197546j06609J7168L07435l07009J90397j87700j62949j21159M2839j92677
16487F77282K49434j03283L7956J68948J02540j12273r1500C97774O30072k09200
16477H18646l63127M62477K1729j25951J0001l8466P2512l49925N41757k58342
$$ plain form
16546 1959176 1611222 1430022 1621407 1887577 1770864 1420592 1642510 1354911 1779354
16537 1779354 1645558 1629193 1381727 1525051 1333778 1387927 1504323 1573992 1358199 1396527
16527 1396527 1299105 1024865 1331932 1305378 1323993 1451307 1073090 1328933 1338421 1414523
16517 1414523 1281557 923661 1593467 1673254 1187440 1484287 1139707 1157603 1207221 950547
16507 950547 806297 1230947 1107928 1246211 1045168 1083197 862620 1157471 756694 1197546
16497 1197546 1090937 1108105 1415540 1108531 1298928 1111228 948279 827120 869959 677282
16487 677282 926716 823433 861389 1030337 1132877 1020604 929104 397774 1027846 818646
16477 818646 455519 917996 939725 813774 823775 785309 857821 507896 1049653 791311
16467G91311j07672n1777K08341m8995k51985K08315j42442j3442Q8645l0521
16457F49778R2821k13084L14823J03812n1857k23577J12546o3337J05536k39496
16447E87965K5271l01493L46779N1464p120B89485J31921J35549L2444j50150
16437D39249A24565l9881O00285k21936P9707k14254l2792M78414k06613m8885
16427E18610k1695k662K11630k15493J5579p8549r4804K09468J51493k49742n2075
16416C91760L83085B22605K21407K78420n2877p3435k60213l2170J01595J2429
16406D17761j03951M47960l40698j4138J95078k56296O7248N8074r9475P1538
16396D43101q3019A48734M12106k50818R2804j26849R7497B7681M94465k31004
$$ plain form
16467 791311 683639 631862 840203 791208 539223 747538 605096 591654 680299 649778
16457 649778 742599 529515 844338 948150 896293 672716 785262 721925 827461 587965
16447 587965 613236 311743 658522 709986 702866 289485 421406 556955 589399 439249
16437 439249 124565 84684 684969 463033 542740 328486 295694 774108 567495 518610
16427 518610 496915 494253 705883 490390 505969 427420 332616 542084 693577 443835 391760
16416 391760 774845 222605 444012 722432 669555 596120 335907 303737 405332 417761
16406 417761 313810 761770 421072 406934 602012 345716 412964 471038 371563 443101
16396 443101 360082 148734 560840 310022 402826 275977 373474 27681 522146 291142
16386B91142K7087p9475J62926J67877B45008K40660A50127N25278C08543k3247
16376B85296L0283o4850K9772J49162A72517J76942j60128L97118A45909O8982
16366B14891M6499P975N2939K7265N1051J66342j51015P5365q2019j45457J61648
16355D25484j89461K8930Q4551G5811J58085m5082L11561j9035j69856o474J18873
16344D23883L8803n4672A25580M45536B16659K55408A78137R8305O7422r3802
16334B50062p2111M6625K8382O9394q7527K866J5095o3474K6898f8414E1998L8594
16322I0592P0824Q632K3326n4574K62276N0794A18608j1872a9807A67011a30436
16310B23846l6514L6238K9883L7245q5939O6953K8285I2517j8274K39051G0617
$$ plain form
16386 291142 318229 238754 401680 569557 245008 485668 150127 675405 308543 285296
16376 285296 315579 250729 280501 429663 172517 349459 189331 586449 145909 214891
16366 214891 261390 269365 322304 349569 400620 566962 415947 491312 409293 263836 425484
16355 425484 236023 264953 349504 75811 233896 188814 500375 481340 311484 305010 423883
16344 423883 462686 408014 125580 571116 216659 472067 178137 276442 343864 250062
16334 250062 177951 224576 252958 322352 234825 237691 252786 189312 216210 -68414 51998 90592
16322 90592 161416 170048 193374 138800 401076 451870 118608 106736 -19807 167011 -130436
16310 223846 187332 223570 253453 290698 204759 271712 299997 92517 74243 313294 70617
16298A42460g8335A20263l6767M25550b908A80435l4135D484L86842I1815D5144
16286A83611O0172m8722K2502F6826R194J92426j14659m8570D3092R9657L06386
16275D49135j04311e300q9462C82298b84782A60139D1368K51744K19833A96805
16264A38704Q7546r3506K144J56029A06054l1998O2822a60716b827E56282A69163
16252a24317B31032Q0508A34572c49554A3427Q9846C7298a22211A75047a73959
16241A14794m2234a5526A40246P2927J29273a15261C09076p0889B4647L48324
16231C72971I1826J02332R8604A4916a27889B45201D7707J76852d7318D89121
16220A45160A9406N04487b3042A61552d7364A96205b00959B59612a80630A80687
$$ plain form
16298 142460 -78335 120263 83496 509046 -2908 180435 146300 4484 391326 91815 45144
16286 183611 243783 195061 217563 66826 76020 268446 153787 105217 43092 142749 449135
16275 449135 344824 -5300 -94762 382298 -284782 160139 41368 293112 512945 196805
16264 138704 226250 132744 134888 290917 106054 74056 136878 -160716 -2827 556282 169163
16252 -124317 231032 311540 134572 -349554 13427 103273 37298 -122211 175047 -173959
16241 114794 72560 -15526 140246 213173 342446 -115261 309076 238187 24647 372971
16231 372971 91826 194158 292762 14916 -127889 245201 47707 224559 -47318 489121
16220 145160 19406 523893 -23042 161552 -47364 196205 -200959 259612 -180630 180687
16209g4816K8899A15149K46798a44092G827M43583c5263E3885b35035C73113E8126
16197A63905j919J0954R4213b98065a8162o5747i125A10888K0981J24610M700
16186B61179c05227g4249o480B85537B6711b68527B48868o090D634L15066A55100
16174a83941Q5171p4217C85545A09982c40860D7070D001N7641h9085B03835K46420
16163D50255C493J26275h8519H7077B1099L10122E864K08177o1117p0837b01844
16151A90155j7809G2250d4192A25017K3292A8945N5559P8713K57160A85644F4173
16139a18634H0027Q0629C6057h1591k1447A39257G817O8272B0385N3057a97145
16127b27922g3374B95730a53598I1297a41416q7927B24648J2203j12872a28615
$$ plain form
16209 -74816 -45917 115149 361947 -144092 7827 451410 -35263 53885 -235035 373113 58126
16197 163905 161986 172940 267153 -298065 -18162 -83909 -9125 110888 131869 256479 261179
16186 261179 -305227 -74249 -80729 285537 26711 -268527 248868 242778 4634 319700 155100
16174 -183941 -98770 -172987 385545 109982 -340860 47070 4001 61642 -89085 203835 450255
16163 450255 3493 129768 -88519 87077 21099 331221 5864 214041 152924 82087 -201844
16151 190155 172346 72250 -44192 125017 148309 18945 74504 153217 410377 185644 64173
16139 -118634 80027 160656 36057 -81591 -103038 139257 7817 76089 20385 73442 -197145
16127 -227922 -73374 295730 -153598 91297 -141416 -229343 224648 236851 123979 -128615
16116b322j86972f2604o7915b0020B05076b40959i9472k15642A55849d15147A38306
16104A53381m6443a09092B12662k7686P9900m096o5668A6480a44508l5846r1991
16093b72345e2634C04551A0841J95191c5977j68355o591G0784c60654B17554q349
16082B09205a5735I8730l8190N78094C00473b8391l65445A55261e882G1056C3365
16070A79908m7950Q1007D4694f4259E2244a9828j88393j34567P0289d4566j51936
16059a96502E6290J08817f3245A59185n8892K7820b9341k9434K5563r8783d5944
16047C7749a99575A04825c8446p733f123j49852A75606F1535a28276M3031j83144
16036b68389J07095q5502B83053c8744j50611p7813A61035C8946a38783G6637
$$ plain form
16116 -2322 -189294 -62604 -130519 -20020 205076 -240959 -99472 -315114 155849 -415147 138306
16104 153381 106938 -109092 212662 184976 264876 260780 195112 16480 -144508 -180354 -272345
16093 -272345 -52634 304551 10841 206032 -35977 -204332 -210923 70784 -360654 217554 209205
16082 209205 -15735 98730 60540 638634 300473 -28391 -393836 155261 -5882 71056 33365
16070 179908 131958 212965 44694 -64259 52244 -19828 -208221 -342788 -272499 -44566 -196502
16059 -196502 56290 165107 -63245 159185 100293 128113 -29341 -58775 -33212 -131995 -45944
16047 37749 -199575 104825 -38446 -46179 -6123 -155975 175606 61535 -128276 -85245 -268389
16036 -268389 -161294 -246796 283053 -38744 -189355 -267168 161035 38946 -138783 76637
16025a46743q9986a9150l99558R1449H0851M438l0803K6740j1185b04088B60389
16013g4262B01835a61312B71532f4298B95073a00748B74993A04408H049N5079
16003F3128e2861C0322J13758E6034B378J02078b93574B87811b57071G1453H001
15991H3252b98949c5852E0447O11032l09364a78014O4182A85731D8687M05807
15981D54494j41483a1381A32611f4983A51386j2768J3691a08291J7308o786B35463
15969d32005h6219b9458j51514f3354a9911B7575b31859B24916A11736c6920j62665
15958a99585M0624P3188k21643A03738B1976c81706D4474d7320m8391o7701B36751
15946f479q4679j03992D8154g5609E3638d5624A8685e0055A38123F1824f6652
$$ plain form
16025 -146743 -236729 -19150 -418708 -327259 80851 85289 54486 81226 70041 -204088 260389
16013 -74262 201835 -161312 271532 -64298 295073 -100748 274993 104408 8049 63128
16003 63128 -52861 30322 144080 56034 2378 104456 -293574 287811 -257071 71453 8001
15991 83252 -298949 -35852 50447 661479 352115 -178014 -113832 185731 48687 454494
15981 454494 313011 -11381 132611 -64983 151386 138618 152309 -108291 -90983 -97769 235463
15969 -432005 -86219 -29458 -180972 -63354 -19911 27575 -231859 224916 111736 -36920 -199585
15958 -199585 -158961 -85773 -307416 103738 21976 -381706 44474 -47320 -95711 -163412 236751
15946 -6479 -91158 -195150 48154 -75609 53638 -45624 18685 -50055 138123 61824 -66652
15934C678c74800a24554q4934K523D021a81816j86170B6766a75132L9677B09493
15922a7436k10234e0142B52776b97593a7331k33260A19853R7054J03629i1174
15911b52330K5007e6652k85556B33873a31913n0195B61205L6403j12878c54441
15900I771K04010d3499l87462J69067e1909H9253b11089j41873H2864B4463k238
15889B2225a04306B7217G123g8733E0766J70927b47099r6878c9161B2985P5030
15878I8015b6081k69538D0925b32546A25931c67169A03773g9909o4789L5319j33628
15867b43007A24350l7772d5241o2130D8314K18918e1136j93939j47421l3249A46108
15855G1894P4336A7209L6099J21985K5180a3443D7750M8402K7861a24402l3466
$$ plain form
15934 3678 -374800 -124554 -209488 -206965 4021 -181816 -367986 26766 -175132 -135455 209493
15922 -17436 -227670 -50142 252776 -297593 -17331 -250591 119853 216907 320536 -91174
15911 -252330 -227323 -56652 -342208 233873 -131913 -182108 261205 297608 184730 -354441
15900 9771 213781 -43499 -430961 -261894 -51909 89253 -211089 -352962 82864 24463 22225
15889 22225 -104306 27217 7123 -78733 50766 221693 -247099 -343977 -39161 22985 98015
15878 98015 -26081 -295619 40925 -232546 125931 -367169 103773 -79909 -144698 -109379 -243007
15867 -243007 124350 86578 -45241 -107371 48314 267232 -51136 -245075 -392496 -425745 146108
15855 71894 146230 17209 53308 175293 200473 -13443 47750 96152 124013 -124402 -157868
15844a57868j57699A1337J96504l7771F0383M9136A4085c49338a04853k77181
15834c82034Q3624G711a48639c7111B37588f697c91A25791f4577A19970M3070
15823A63040b5215k24352g2197A68005a00495A14162m0035J36087a00568j24098
15813b24666D3299f0574A74829a59613P421j16934A92141k6860N0801e6185k76785
15802c32970E8996K1533l4413b2426I3904a25148A3013b18348d5684k49216E2533
15790e38450b67919d2074p2876G5956d6329j56m7751A26058c28054B04192m5592
15779A58600e20509a89438R0644j51953h2531a8339H2631a76720A55887i834B1037
15767h0587k9526c8089A11754f5926j17662B8669M39428e6426E6228K74249b76710
$$ plain form
15844 -157868 -315567 11337 207841 170070 60383 109519 14085 -349338 -104853 -382034
15834 -382034 -298410 7711 -148639 -37111 237588 -6697 -391 125791 -64577 119970 163040
15823 163040 -25215 -249567 -72197 168005 -100495 114162 74127 210214 -100568 -224666
15813 -224666 43299 -60574 174829 -159613 -152192 -269126 192141 165281 216082 -56185 -332970
15802 -332970 58996 80529 46116 -22426 93904 -125148 13013 -218348 -45684 -294900 52533
15790 -538450 -267919 -42074 -114950 75956 -46329 -46485 -94236 126058 -328054 204192 158600
15779 158600 -520509 -189438 -98794 -250747 -82531 -18339 82631 -176720 155887 -9834 21037
15767 -80587 -110113 -38089 111754 -65926 -183588 28669 468097 -56426 56228 330477 -276710
15755D37436j08974A38830c1833B4048N5546c19308M8488A2268J6402h9032B70234
15743I5668d10832O9727a67139K5403B7783D307N8137b00527B87953a35255k78342
15732d13597B9967e1575K0836J2997G7983c8398l56304i2494A58330c1374j07178
15721a38552L2194D4034d4530A42877D8973J29481G4988a90570A31751a64450
15710b71009g2618B59990F3103a13384r9309n8916g9704r6267A35085N373h1441
15698B20041a34585B3368R5102c3985A07312L03980I3190a02290j01771C66555
15687c3061j46621O8138A37330a38897E5479F337a96941A39592b57803i7347B95093
15675B9597i6616L5352A33502a07610A31804e7708q7008A56268a41998E403a70831
$$ plain form
15755 437436 328462 138830 -31833 24048 79594 -319308 -270820 12268 28670 -89032 270234
15743 95668 -410832 -341105 -167139 -141736 27783 4307 62444 -200527 287953 -135255 -413597
15732 -413597 29967 -51575 -30739 -17742 77983 -38398 -394702 -92494 158330 -31374 -138552
15721 -138552 -106358 44034 -44530 142877 48973 178454 74988 -190570 131751 -164450
15710 -271009 -72618 259990 63103 -113384 -212693 -271609 -79704 -175971 135085 140458 -81441
15698 220041 -134585 23368 118470 -33985 107312 411292 93190 -102290 -204061 366555
15687 -33061 -179682 -111544 137330 -138897 55479 6337 -196941 139592 -257803 -97347 295093
15675 29597 -96616 -61264 133502 -107610 131804 -57708 -144716 156268 -141998 5403 -170831
15663a46795C6426O9344m9830J77505a75207o9295o0611O0090N4428O7061E276
15651B64386G601P666J4742a56572b6062B0685b37815A03460L0965b9394k4029
15640e3423A78492m0286o8530J97805c7759B94900i3579A63165a9015h202k23154
15629b31356k5379A81200e15402b742l27927C53311a23527H1986a72075k7536
15619a99611b427A33272K9637g1523j89107C4399b073k18475A56115J72767i7017
15607a37130r4026A6575c9418B03772L2G6110d6290k7154C11854j15945c11168
15595c32431J36536g9630j19860B04076d22644J75897I903b51371A07774b56132
15584C69488D5538b54874d2512k8451q8730N8080A6759p183i1075d674k62703
$$ plain form
15663 -146795 36426 105770 55940 233445 -175207 -244502 -305113 -245023 -190595 -123534 5276
15651 264386 7601 15267 30009 -156572 -26062 20685 -237815 103460 134425 -29394 -53423
15640 -53423 178492 138206 69676 267481 -37759 294900 -93579 163165 -19015 -8202 -231356
15629 -231356 -256735 181200 -515402 -2742 -330669 353311 -123527 81986 -172075 -199611
15619 -199611 -2427 133272 162909 -71523 -260630 34399 -2073 -220548 156115 328882 -97017
15607 -137130 -231156 16575 -39418 203772 203804 76110 -46290 -73444 311854 195909 -311168
15595 -332431 -195895 -79630 -199490 204076 -422644 -246747 9903 -251371 107774 -256132
15584 369488 45538 -254874 -42512 -70963 -159693 -101613 16759 9576 -91075 -4674 -267377
15573b67377l5477B42282b82905I2872c03310j19402g6540c6843M287I015b55906
15561c44288J06395A8603J41854B1386L14270n7277a89948j3355O5073f6581K466
15550f4115l4643B19845c0514D1165c0086A29385j4563a28174G9546b81751f9493
15538e8381A53771E2960N0485b09187j58571A9308a77116C76400i464k8339q3661
15527a21464B57706a86796M0268M0136j50119a27321A08501c2816j48099A8863
15516g5001p9165B43105D6516e7536A9440m487a9271F3865j0678A2165O6849M1250
15504A20264c0094j16449o1234g8853B35134C4071O7702J00027c17615A0763b52266
15492A7212a00891C87812a79448P7851n1711d4361F60869A15088a27972G7207
$$ plain form
15573 -267377 -302854 242282 -282905 92872 -303310 -422712 -76540 -36843 -32556 9015 -255906
15561 -344288 -237893 18603 160457 21386 335656 278379 -189948 -203303 -138230 -66581 -64115
15550 -64115 -98758 219845 -30514 41165 -30086 129385 114822 -128174 79546 -281751 -69493
15538 -58381 153771 52960 103445 -209187 -367758 19308 -177116 376400 -9464 -37803 -121464
15527 -121464 257706 -186796 -146528 -106392 -256511 -127321 108501 -32816 -180915 18863
15516 -75001 -154166 243105 46516 -57536 19440 14953 -19271 63865 53187 12165 79014 120264
15504 120264 -30094 -146543 -207777 -78853 235134 34071 101773 201800 -317615 10763 -252266
15492 17212 -100891 387812 -179448 -101597 -153308 -44361 660869 115088 -127972 77207
15481A24718c55589A81308f3170k2557A11815L355M0213L9181b18348f9637a970
15469D31554A52202N5593c05169g2383j17929I519J30381b15694R0235D7431c9199
15457A7940K526a17730A43640L4760q5802a27451A85901J37764E0088a24528A14883
15445C558b7002A51692A7974a33858K4087B3857J11968m8410f4543k38111H7070
15433a24019I4604M0514K11727b51184B66091a93494o181H3703J01162J81440
15423C66305c8943l37383J57438N174e2138j02316k460A10582f8031A40681b00120
15411h5991k7720j6704D7081f6949k93690A9368a71998B11755a3227k28053B30040
15399a84338L8195O6727j31747M0730B11493d37219h8673C71212b20570J03175
$$ plain form
15481 124718 -355589 181308 -63170 -85727 111815 115170 155383 194564 -218348 -69637 -1970
15469 431554 152202 207795 -305169 -72383 -190312 9519 139900 -215694 -125459 47431 -39199
15457 17940 20466 -117730 143640 178400 92598 -127451 185901 323665 50088 -124528 114883
15445 3558 -27002 151692 17974 -133858 -109771 23857 135825 87415 -64543 -302654 87070
15433 -124019 94604 135118 346845 -251184 266091 -193494 -199675 83703 184865 366305
15423 366305 -38943 -376326 -218888 -213714 -52138 -154454 -156914 110582 -68031 140681 -200120
15411 -85991 -113711 -130415 47081 -66949 -360639 19368 -171998 211755 -13227 -241280 230040
15399 -184338 -146143 -79416 -211163 -170433 211493 -437219 -88673 371212 -220570 -117395
15389a17395D4707L02217c92032J64514k39761a49503I7282O040a68335a7568
15378C12931K8162a47728A9020b30729b758A11481f8077j05661C84287G2464M5594
15367A18058a17769A76355c15309A93860b5837A41348b01373Q8873i080k45981
15357b55061A5804d6794J5647m0723j45005B31563b07096A20459e2129A1507b49019
15345f7914C06380a15499r8421c9023j36909c2897E9280J85318e2140H6890a16857
15333A58674L58026B1726J84231a61672F950c5945J2259D1055b08860D9476J22436
15322A71912b17653a07725B34467A4995f2919l2451C3671K81622a28040O3823
15312f4217A07438c24820A53827b39408B19324A508d1926p5863B03769o5304E917
$$ plain form
15389 -117395 44707 346924 -392032 -227518 -467279 -149503 97282 103322 -168335 -17568
15378 312931 341093 -147728 19020 -230729 -2758 111481 -68077 -173738 384287 72464 118058
15367 118058 -117769 176355 -315309 193860 -25837 141348 -201373 -112500 -9080 -255061
15357 -255061 15804 -46794 -31147 -71870 -216875 231563 -207096 120459 -52129 11507 -249019
15345 -67914 306380 -115499 -213920 -39023 -175932 -32897 59280 244598 -52140 86890 -116857
15333 158674 516700 21726 205957 -161672 6950 -35945 -23686 41055 -208860 49476 171912
15322 171912 -217653 -107725 234467 14995 -62919 -95370 33671 315293 -128040 -64217
15312 -64217 107438 -324820 153827 -239408 219324 1508 -41926 -117789 203769 138465 5917
15300H324f7288A64158e6597A8908J22923B9256J76510L380q6853a2673E0491
15288i8237E6454j0710h2644E0117J39636d59612I6059a83677B954M7191M7728
15277I7873d64481A53135K53595a03205A91200M9639n7672e1265A68280j8849
15267A49431h3498L6135H2600K81628j25837b3452H236a24641E423a15606A04876
15255A55252g7194j57115A73185Q770c6271C60645N49440L66966K18371K8916
15245A524338l28638D16591p6840O038A06468d993C83207C228J4870K17485O0783
15234B96366A23407d6419I8852k86O2439a63813F774O1913L20389H8516r551j8819
15222F0146J40030I1281d0228B95424b8026B08314a19655G3287a7031C7817K37810
$$ plain form
15300 8324 -67288 164158 -56597 18908 141831 29256 205766 209146 122293 -12673 50491
15288 -98237 56454 45744 -82644 50117 189753 -459612 96059 -183677 2954 50145 97873
15277 97873 -464481 153135 406730 -103205 191200 240839 183167 -51265 168280 149431
15267 149431 -83498 -47363 82600 364228 238391 -23452 8236 -124641 5423 -115606 104876
15255 155252 -77194 -234309 173185 181955 -36271 360645 910085 1277051 1495422 1524338
15245 1524338 1195700 416591 339751 345789 106468 -4993 383207 3228 18098 235583 296366
15234 296366 123407 -46419 98852 98566 161005 -163813 6774 68687 389076 88516 78965 60146
15222 60146 200176 91281 -40228 295424 -28026 208314 -119655 73287 -17031 37817 275627
15211B75627b71048A88961d7832A39245K74711a74321A62100Q3088G0769g2362
15200B72027C7975c820k22155b2788B38277J06759o4158D9407a75791A70619a15645
15188h5150j85147E9025c9101D6697P8175K2904g8161D6921K30483b70690F3265
15176B35393c11654C7364c9674j10215A90690h9788D5220N12456B29558i1402
15165B78362C0628c120A28834B7538a90759E8976J07397l1302n4148K18192i460
15153A63999Q2342F52J94857J72181e0704B16340E3660O3121l2254c06174B71437
15141a8057I9849M3155d8890A75337g7432C55297A58984L9596K1959p7267n6416
15130H6856c656C80472a05053c4142H3620K6583i0679B73574E6762b4578k4229
$$ plain form
15211 275627 -271048 188961 -47832 139245 413956 -174321 162100 245188 70769 -72362
15200 272027 37975 -3820 -225975 -22788 238277 345036 280878 49407 -175791 170619 -115645
15188 -85150 -270297 59025 -39101 46697 124872 147776 -78161 46921 277404 -270690 63265
15176 235393 -311654 37364 -39674 -149889 190690 -89788 45220 557676 229558 -91402
15165 278362 30628 -3120 128834 27538 -190759 58976 166373 135071 80923 299115 -9460
15153 163999 246341 652 195509 367690 -50704 216340 53660 116781 84527 -306174 271437
15141 -18057 99849 143004 -48890 175337 -77432 355297 158984 198580 220539 143272 86856
15130 86856 -3656 380472 -105053 -34142 83620 110203 -90679 273574 56762 -24578 -48807
15119d8807B55040A2041d7096A30202J34128E4188P6169a49184f0743a158B24920
15107E4242J16412a19657B33983j0016J03175a04468A99405B9057a47144B04590
15096A38996C3100a637A62127D7161K10011o3939F4992N4989O4029a95574A72854
15084h0842A09631J47413H4405j972K13172A24515Q4552O0559j30200b9429B18223
15072g3491a4184j18748A69481n4390K12167L4630p6185k5615e039B5354L9229
15061F4583J1128J32996K2273a4349D8585J07117c519r3771B57528q7009J82664
15050C53183n3514J69748A33608a17044B8636P0518h7252I5367d7176K1700B22269
15038A60836h6167B56013O7211k8519b9222A54981N2206j2097d7258K2082m9332
$$ plain form
15119 -48807 255040 12041 -47096 130202 264330 54188 130357 -149184 -60743 -1158 224920
15107 54242 170654 -119657 233983 223967 327142 -104468 199405 29057 -147144 204590
15096 138996 33100 -1637 162127 47161 257172 193233 64992 119981 184010 -195574 172854
15084 -80842 109631 257044 84405 82433 295605 124515 209067 269626 139426 -29429 218223
15072 -73491 -14184 -132932 169481 115091 327258 361888 285703 260088 -5039 25354 64583
15061 64583 75711 208707 230980 -14349 48585 155702 -3519 -97290 257528 170519 353183
15050 353183 299669 469417 133608 -117044 28636 99154 -87252 95367 -47176 -25476 222269
15038 160836 -86167 256013 323224 294705 -29222 154981 207187 195090 -47258 -25176 -74508
15027g4508B08656b2390A70467K2973q6421J00942K60591B3291K33949E3957A9647
15015D22232C7897J23049K78792A56423E4481J70604e6757B79234A7237L12371
15005C29608e4010A27927a26502B89254g2167C14060A02237R0238E6698J21978
14995A78676J36729n5798r8794L40271C910L65828i3582A94280G1178K79116k3702
14984C26592I8903K07622r0865O961p9906k8284L84968E5474H383J19891K78943
14973D07217K0786C6772L19549j24261P8753n9139f9544C38062j15100K37362
14963D60324C8963J36948K01640A06306J75071B7169L02444A53228K59099j13407
14953B98920k592j27741E4730M39065j53726E1217K42695a41048B56368Q5046
$$ plain form
15027 -74508 208656 -22390 170467 193440 107019 207961 468552 23291 257240 53957 19647
15015 422232 37897 160946 439738 156423 54481 225085 -56757 279234 17237 329608
15005 329608 -54010 127927 -126502 289254 -72167 314060 102237 192475 56698 178676
14995 178676 315405 259607 160813 501084 3910 369738 -93582 194280 71178 350294 326592
14984 326592 98903 306525 215660 222621 142715 114431 499399 55474 8383 128274 407217
14973 407217 428003 36772 356321 232060 310813 251674 -69544 338062 222962 460324
14963 460324 38963 175911 377551 106306 281377 27169 329613 153228 412327 298920
14953 298920 296328 168587 54730 493795 340069 51217 293912 -141048 256368 341414
14943C41414M7830H4165a8192A96297M2572Q6102K22138B40070P3628j46754N762
14932A72706L29987A78553J92947n9970Q605M9923Q2438M3404j43963A51560N2727
14921B04287F8924J49664K34122D5993K90157o3925J49588j2793n0564l5564j01041
14910B21851G4894P9758M18587B05945M88917A7139L14466F7461K03775l1377
14900B39859q9431L40355A61170c2948D70946j87009I6891K80920K86000C24244
14889C41898A26521K86299B04452J78097A44243J87188O7175H4962a63831C61309
14878D44119j98405r9324J53220N7323j16558j08138P0540O934J31555j2323p9753
14867B49190R9432A67600K10419M2438J76881k11222P716n2852J87951k58087
$$ plain form
14943 341414 389244 84165 -18192 196297 238869 324971 547109 240070 313698 166944 172706
14932 172706 502693 178553 371500 311530 320135 370058 452496 495900 351937 151560 204287
14921 204287 68924 218588 452710 45993 336150 272225 421813 409020 358456 322892 221851
14910 221851 74894 154652 573239 205945 694862 17139 331605 67461 271236 239859
14900 239859 150428 490783 161170 -32948 470946 283937 96891 377811 663811 324244
14889 341898 126521 412820 204452 382549 144243 331431 398606 84962 -163831 361309
14878 444119 245714 146390 299610 356933 240375 132237 202777 209711 341266 328943 249190
14867 249190 348622 167600 378019 420457 597338 386116 393832 340980 528931 270844
14857B70844L24389A68637N8607l228N9897N180J14460A96203L42163k62353O2344
14846C38357p7444m8225L3469K17383K29665J03498m1981C14511J93766K98080
14836H06357l19916A92163L61367M4308K04514H2217M65745q1963A87161K78586
14826D65747J80090A89189K56115J92613D7290L37097A28545K66953r2294K23855
14816E27059J7890K7318j38585L03324k79168J40245l3054l458m2664J0119m8324
14805D80702j74269L30274P757O6930B75459p806Q4034J69823k12467J44783J22004
14794E75830R1300N9381l49263M9901P0593k06166O7065p1539L72753J1595k93159
14783C78291L05287l00679O8908n4132J18601J3006k41938J36220P3403L3570
$$ plain form
14857 270844 595233 168637 227244 224016 283913 289093 403553 196203 538366 276013 338357
14846 338357 260913 212688 246157 463540 693205 796703 754722 314511 508277 806357
14836 806357 486441 192163 553530 597838 802352 82217 547962 465999 187161 465747
14826 465747 645837 189189 445304 637917 47290 384387 128545 395498 303204 527059
14816 527059 544949 572267 433682 737006 457838 598083 565029 561571 518907 529026 480702
14805 480702 306433 636707 644464 711394 275459 267653 351687 521510 309043 453826 575830
14794 575830 667130 726511 377248 427149 497742 291576 358641 287102 659855 671450 378291
14783 378291 683578 382899 451807 397675 516276 529282 287344 423564 496967 530537
14773E30537K99561j24890j86879M6992o9695K11033j03589j12911j45783K63967
14763F08343R347J08979J9482P4650j1124k72295K90590K4655l76675J42476k48994
14752C69434J39140J44667J8854q7593A09857L22258M05764l4164k05165J00552
14742F99102J66042q6535B69182K64137M3856k10562L7293N52403n3251k97353
14732F05705J81332C91678R6697M63390j75647q1363R1284K85952m02904K28949
14722H98036j29526j05568J47884j33603L6622J63752j76290J61309K1667j88200
14712F96083r2443L94122m44602j15059L71958m3749K50435j16087M0309k85147
14702F55820J12744J12105k15588Q2677P9291k66381K63719L2009J75876k70893
$$ plain form
14773 530537 830098 705208 518329 565321 495626 706659 603070 490159 344376 608343
14763 608343 617690 726669 746151 820801 809677 537382 827972 852627 475952 618428 369434
14752 369434 508574 653241 672095 584502 109857 432115 837879 803715 598550 699102
14742 699102 865144 778609 269182 533319 577175 366613 403906 956309 903058 605705
14732 605705 787037 391678 488375 951765 776118 694755 786039 1071991 669087 898036
14722 898036 768510 662942 810826 677223 713845 877597 701307 862616 884283 696083
14712 696083 603640 997762 553160 438101 810059 766310 1016745 900658 940967 655820
14702 655820 768564 880669 665081 747758 827049 560668 824387 856396 1032272 761379
14692G61379J50019l77269O61560m53695P3097J39652J09808K3488l50229J11380
14682H49190K4010R173J18002k03126K91265n13328N36375j63863j00154k02392
14672F45152K85974j8518J64582j10613P3614j29826J53619j31855L13700k00555
14662A045274J10956j03834M36055k20740J20014j32888j60408m2351L9368p2583
14652A018863p6695K20651j32391J87487j6272L0509J27883l86501J37965J5769
14642A127268p6389L43993m05540L09511J52661j30963l72556N32696l10820p3253
14632A096608K81606j23069K66589k62742K57358j98642J44898j15446k6278M57723
14622A778605n52866J28648j37612J08874j65575K32249j11764K28641J0823p0702
$$ plain form
14692 761379 911398 534129 1195689 741994 815091 954743 1064551 1088039 737810 849190
14682 849190 873200 882373 1000375 797249 1088514 575186 1111561 947698 847544 645152
14672 645152 931126 912608 1077190 966577 1040191 910365 1063984 932129 1245829 1045274
14662 1045274 1156230 1052396 1488451 1267711 1387725 1254837 1094429 1052078 1091446 1018863
14652 1018863 942168 1162819 1030428 1217915 1201643 1232152 1360035 973534 1111499 1127268
14642 1127268 1050879 1394872 989332 1298843 1451504 1320541 947985 1480681 1169861 1096608
14632 1096608 1378214 1255145 1521734 1258992 1516350 1317708 1462606 1347160 1320882 1778605
14622 1778605 1225739 1354387 1216775 1325649 1160074 1392323 1280559 1509200 1520023 1449321
14612A449321o8079j0398q7956K13061K58205k72568K97696l16580o4869M78990
14602A876823m24157L12611j27451J22871q8342n035j56745L13940j48984o8015
14592A607516L01854J58080l57316P1187J02372j15222J14449o9651j59166k1934
14582A632169J54974M82323l67529r3285r2161L92729o20643N60672K42240J45612
14572B437101j07176j2305j95016O01627l06891J19881j40220k71548K07829K35936
14562B569218J93445l46996M08432j15843J26990K08739J76060K85485j73299
14553C332231J95667P90034L64286J319449J737036M074559Q924330J6246193
14545C6983785R211407k0087712A1446002D784018j347509q84732m66868j72062
$$ plain form
14612 1449321 1381242 1370844 1282888 1495949 1754154 1481586 1779282 1462702 1397833 1876823
14602 1876823 1452666 1765277 1637826 1760697 1672355 1667320 1510575 1824515 1675531 1607516
14592 1607516 1909370 2067450 1710134 1781321 1883693 1768471 1882920 1813269 1654103 1632169
14582 1632169 1787143 2269466 1901937 1808652 1716491 2109220 1488577 2049249 2291489 2437101
14572 2437101 2329925 2317620 2122604 2724231 2417340 2537221 2397001 2125453 2333282 2569218
14562 2569218 2762663 2415667 2824099 2708256 2835246 3043985 3220045 3505530 3332231
14553 3332231 3527898 4317932 4682218 6001667 7738703 11813262 20737592 36983785
14545 36983785 46195192 26107480 11446002 4784018 3436509 2551777 2084909 1912847
14537A912847o6555K61713K27754k07792J02602m2756j21909J9673J84768k18809
14527B051536K94601k14255N06107n23549J58067K04608j38189Q9988K94686l48720
14517B374880L82479k70522K37683k37650N9305J48626L27889l71454J20207L21024
14507C092467l70047J66674K04412k15352j68546L53621l37531J80356N31640
14498C437694l44518L31433l44842K48164K58409j11095k54085J02069K28250
14489C551479j20965L29692l40723N16786l30555m12483M17740J81655J51248
14480C943874k94171J64777J69432l0534l29124L27284r7658M66897j90884p1411
14470D058482K76186L27337o0436j29686j84718j02077K41379K23370r8387K82527
$$ plain form
14537 1912847 1846292 2108005 2335759 2127967 2230569 2187813 2065904 2085577 2270345 2051536
14527 2051536 2346137 2131882 2637989 2114440 2272507 2477115 2338926 2428914 2723600 2374880
14517 2374880 2757359 2486837 2724520 2486870 2546175 2694801 3022690 2651236 2771443 3092467
14507 3092467 2722420 2889094 3093506 2878154 2709608 3063229 2725698 2906054 3437694
14498 3437694 3093176 3424609 3079767 3327931 3586340 3475245 3221160 3323229 3551479
14489 3551479 3430514 3760206 3419483 3936269 3605714 3193231 3610971 3792626 3943874
14480 3943874 3649703 3814480 3983912 3953378 3624254 3951538 3853880 4320777 4129893 4058482
14470 4058482 4334668 4662005 4601569 4471883 4287165 4185088 4426467 4649837 4551450 4833977
14460D833977j17881l1145N18792j82294J23039k90320L40895N827L14153l36370
14450E178673K12676L18161j60488k8086O4854K55129K04842k25092K94713j76019
14440E939363J8279L69157p738Q8320J81921l70295K73351r762M90846l13485
14430F659957L64993j98951M71723R1718J37626N3723R4351j90811L30315p5034
14420G739610J3626N54261j37425j9134L15673M04865k30329L66361m80194O26628
14410I153942k7407K69004R5550J13639r5000K23586J91643Q8492L37786j01394
14400A0249841K32112M09419K14771K23887J00643L71822o5170L28589J50825
14391A2216739q8239L34741J15984L91691L01396J61558L53370L05095J49481
$$ plain form
14460 4833977 4716096 4684951 5203743 5021449 5144488 4854168 5195063 5200890 5515043 5178673
14450 5178673 5391349 5709510 5549022 5520936 5585790 5840919 6045761 5820669 6115382 5939363
14440 5939363 5957642 6326799 6319061 6407381 6589302 6219007 6492358 6482596 6973442 6659957
14430 6659957 7024950 6825999 7297722 7389440 7527066 7580789 7675140 7484329 7814644 7739610
14420 7739610 7753236 8307497 8170072 8150938 8466611 8871476 8641147 9007508 8527314 9153942
14410 9153942 9126535 9395539 9491089 9604728 9509728 9733314 9924957 10013449 10351235 10249841
14400 10249841 10481953 10891372 11106143 11330030 11430673 11802495 11737325 12065914 12216739
14391 12216739 12128500 12463241 12579225 12970916 13272312 13433870 13787240 14092335 14241816
14382A4241816J31633L49174M57486n3046P56519j1605K81378N00622K10918K76969
14372A7141864M58470O5807N82122L54231K57196M52994M14021M6714R56171K51072
14362B0980662L01179N10277L12451O45569N87457M86594L21527J162707M32595
14353B5741018L35883O18321M82175Q68567R15109L09325Q22647N52114J121000
14344C1766159J094728M40777J029877Q40450R30830R79909J378020R59148J147742
14335D0567640J114783J126837J176877J775562R51856J553833J225480J889460
14327E1382328J348523J962215J668696K086304J947490K279960K037711K361140
14319F7074367K114643K581208K891530K890603K845045L088806L389373L590820
$$ plain form
14382 14241816 14373449 14722623 15180109 15127063 15883582 15871977 16153355 16653977 16864895 17141864
14372 17141864 17600334 17666141 18248263 18602494 18859690 19312684 19726705 19773419 20729590 20980662
14362 20980662 21281841 21792118 22104569 22750138 23337595 23824189 24145716 25308423 25741018
14353 25741018 26076901 26695222 27177397 28045964 28961073 29270398 30093045 30645159 31766159
14344 31766159 32860887 33301664 34331541 35171991 36102821 37082730 38460750 39419898 40567640
14335 40567640 41682423 42809260 43986137 45761699 46713555 48267388 49492868 51382328
14327 51382328 52730851 54693066 56361762 58448066 60395556 62675516 64713227 67074367
14319 67074367 69189010 71770218 74661748 77552351 80397396 83486202 86875575 90466395
14311I0466395L526413L683776M141150M827384L907601N699991M436692N481284
14303A26170686O185238O074774O423659O708019P572847P855148P832646Q719779
14295A83542796R135487R929151J0261656J1091856J1222794J2027543J2436326
14288B59647609J3280140J3950318J4360493J4531700J5246633J5444565J5341583
14281C61803041J5426896J5437816J4773483J4182175J3396500J2149843J0367939
14274D57537693Q323671N589131J540708o75455k185785j426133j865136k644408
14266D64194286n527969r020711j1847196j3009154j4429083j5450203j5918443
14259C78991527j5673404j6052870j5969925j5531973j4768927j4030575j3703530
$$ plain form
14311 90466395 93992808 97676584 101817734 106645118 110552719 116252710 120689402 126170686
14303 126170686 132355924 138430698 144854357 151562376 159135223 166990371 174823017 183542796
14295 183542796 192678283 202607434 212869090 223960946 235183740 247211283 259647609
14288 259647609 272927749 286878067 301238560 315770260 331016893 346461458 361803041
14281 361803041 377229937 392667753 407441236 421623411 435019911 447169754 457537693
14274 457537693 465861364 471450495 472991203 472315748 470129963 468703830 466838694 464194286
14266 464194286 458666317 449645606 437798410 424789256 410360173 394909970 378991527
14259 378991527 363318123 347265253 331295328 315763355 300994428 286963853 273260323
14252B73260323j3697139j2885826j2118587j1461638j1133557j0528781r596134
14245A91838661q911183q674393q136964p877801p145245p253223o243536n558365
14237A32037951n699113n553608n215877m994036m627461m294148l740202l727499
14229I4186007l808925l709475l265567l028096k848937l261077k560708k251143
14221F9452079k286807k626876j598668k598424j773963j987839j693772j698261
14213E3187469j570706j336209j920931j541124j167661j360710n68080j170024
14205D2552024j754684r08998j323337q22013p78789r42836m30213j541943q91857
14196C3157354r20558o17876p98303n09950r47236m66599j301781k65186n41791
$$ plain form
14252 273260323 259563184 246677358 234558771 223097133 211963576 201434795 191838661
14245 191838661 182927478 174253085 166116121 158238320 151093075 143839852 137596316 132037951
14237 132037951 126338838 120785230 115569353 110575317 105947856 101653708 97913506 94186007
14229 94186007 90377082 86667607 83402040 80373944 77525007 74263930 71703222 69452079
14221 69452079 67165272 64538396 62939728 60341304 58567341 56579502 54885730 53187469
14213 53187469 51616763 50280554 48359623 46818499 45650838 44290128 43722048 42552024
14205 42552024 40797340 39888342 38565005 37742992 36964203 36021367 35591154 34049211 33157354
14196 33157354 32236796 31618920 30820617 30310667 29363431 28896832 27595051 27329865 26788074
14187B6788074j067945j72576q65016k83655o13733m73132n05876n39758o73676
14178B1592707k94161n95130m01853k56700n55643j64335n97606p6140m35673
14169A8215466l81518k08257l96335n89133k79209N2483n67499l65655M1654o01574
14159A4920423m4162o61593L13092n51300q0475n56550Q646r3090J0532l10272
14149A2955251l56325l49485j68703j89330j96788Q7699J18027n64648j9185m27794
14139A0888719r4931l83031j20892J66502l64266k41766j71951L9232J61798l62625
14129I516789l51149J59327m06792K11884m25708j42458m8165N6316m92681O9923
14119H147286p4779K71406l80208m40499J30269j03409p692k59849M105J7443
$$ plain form
14187 26788074 25720129 25547553 24682537 24398882 23785149 23312017 22806141 22266383 21592707
14178 21592707 21298546 20703416 20301563 20044863 19489220 19324885 18727279 18651139 18215466
14169 18215466 17833948 17625691 17229356 16640223 16361014 16413497 15845998 15480343 15521997 14920423
14159 14920423 14876261 14214668 14527760 13976460 13895985 13339435 13348081 13254991 13265523 12955251
14149 12955251 12598926 12249441 12080738 11891408 11694620 11782319 11900346 11335698 11316513 10888719
14139 10888719 10793788 10410757 10289865 10456367 10092101 9850335 9678384 9717616 9879414 9516789
14129 9516789 9165640 9324967 8918175 9130059 8704351 8561893 8513728 8570044 8077363 8147286
14119 8147286 8072507 8343913 7963705 7523206 7653475 7550066 7542374 7282525 7286630 7304073
14109G304073l06842J77420O1859m26016l50064Q486J63401j41813K54380k85405
14099F459479k54623L96852m47794r7316L90085o53582Q8050n7292j42109n5181
14089E626569R2055j95840J92931l37000o7805n2279j21777q8677N99064n75722
14079E071519p9527M08258l68750l9915P0919l21327L4475J44389l05660K67969
14069D882350l49922J18284j30828J37208k88237J96889k03467K44981l73049
14060D234209K31402p5564o9418j70899j26797J17352m4351k65679L9121q8808
14050C780568q2734Q4263J88518N163n7569j23671l07534J39165k537L144j23282
14039C503494R750n22072L37630j89644K72179k68974l6138K42349n2321R5574
$$ plain form
14109 7304073 6997231 7174651 7236510 6810494 6460430 6468916 6632317 6490504 6744884 6459479
14099 6459479 6204856 6601708 6153914 6056598 6446683 5793101 5881151 5823859 5681750 5626569
14089 5626569 5718624 5522784 5715715 5378715 5310910 5258631 5136854 5048177 5647241 5071519
14079 5071519 4991992 5400250 5031500 4991585 5062504 4741177 4775652 4920041 4614381 4882350
14069 4882350 4532428 4650712 4519884 4657092 4368855 4565744 4362277 4607258 4234209
14060 4234209 4465611 4390047 4320629 4149730 4022933 4140285 4095934 3830255 3869376 3780568
14050 3780568 3697834 3782097 3970615 3975778 3918209 3794538 3487004 3626169 3623632 3626776 3503494
14039 3503494 3513244 2991172 3328802 3139158 3411337 3142363 3106225 3348574 3296253 3391827
14029C391827l42003j08515K38561M1800k4391o7785o66009M03906O0908l019
14019B925280j23394J73043j73418k00164n2999L90855l12782k50491K76573m19789
14009B232714J70268L54579j10885j99052M651j78805K11158j29464J46392k10067
13999B291489K6067J29024j90833n1078P7496J35754m56728Q3849L77334L23544
13989B745918J019617K775011P176763J6195677J5732481j5564031j4291873o488910
13981I300653l084688r71268p87575n02611k03072n30902j38070j90012k34650
13972B657805K56742k68025j70362r2697J17392k50371O6603K72238n92336K91595
13962B288584k5985K49223l78379J26229l14510N78518m04319J32795k90917P0453
$$ plain form
14029 3391827 3049824 2941309 3179870 3221670 3197279 3129494 2463485 2867391 2928299 2925280
14019 2925280 2801886 2974929 2801511 2601347 2548348 2939203 2626421 2375930 2652503 2232714
14009 2232714 2402982 2757561 2646676 2447624 2452275 2273470 2484628 2355164 2501556 2291489
13999 2291489 2317556 2446580 2255747 2204669 2282165 2417919 1961191 2045040 2422374 2745918
13989 2745918 3765535 6540546 13717309 29912986 45645467 30081436 15789563 9300653
13981 9300653 6215965 5244697 4457122 3954511 3751439 3220537 3082467 2892455 2657805
13972 2657805 2914547 2646522 2476160 2383463 2500855 2250484 2317087 2589325 1996989 2288584
13962 2288584 2262599 2511822 2133443 2259672 1945162 2523680 2119361 2252156 1961239 2031692
13952B031692J32157j34871J48422r4943L35801m33925J6330j82112K81525m2559
13942B057517k19944q581Q4302j5264j04457J85014P857o409k89216K26256j19411
13931A797664j51023l8621K89416j12632q2060p5065L78606m26178M4484l59724
13921A264867N28113M5197m28195J40285L72658n50004L87838p2340m5472k39713
13911A403234L57421k29479L59689o66919M65672l5360M5709k76722K3106j29805
13901A316546j11217M35491k38653K50117k51600K13610k11472M6931K63931l96826
13891A316858j18343j00815Q5427K01991K1931N8177o8827J56295l00887K05412
13881A457219J1324m3313j0026l53210m2688L78425l70421L52941l1094j24520
$$ plain form
13952 2031692 2163849 2028978 2177400 2082457 2418258 1984333 2000663 1818551 2100076 2057517
13942 2057517 1837573 1828992 1913294 1898030 1793573 1978587 1986444 1980035 1690819 1917075 1797664
13931 1797664 1646641 1608020 1897436 1784804 1702744 1627679 2006285 1580107 1624591 1264867
13921 1264867 1792980 1838177 1409982 1550267 1922925 1372921 1760759 1688419 1642947 1403234
13911 1403234 1760655 1531176 1890865 1223946 1689618 1654258 1699967 1423245 1446351 1316546
13901 1316546 1205329 1640820 1402167 1652284 1400684 1614294 1402822 1449753 1713684 1316858
13891 1316858 1198515 1097700 1183127 1385118 1407049 1465226 1396399 1552694 1251807 1457219
13881 1457219 1468543 1425230 1415204 1061994 1019306 1397731 1027310 1380251 1349157 1224637
13871A224637q2408J65673j00118M01281m76071J5690j81487K38985M5764r6872
13861A155074J22314j73085j73124J66819J67006m112j56722J83862j6140O9335
13851A341227j5118k81448J51614j56359O918j51274j5279J58198Q2656K69741
13841A390876m74148L8687j1127P2319j83662J78392j29975M3283K18482L9439
13831A182566l61998J95499j63555K78209j93916k1137M08034l99302l6310O6000
13821I54090m5136N5683K69867l14002J30261p8032L81898n20615L93097j4456
13811A212655l11021J9210n088L2906l34697J24968L61610l03131p9422j44538
13801E73452L16705j34608k1152J62227N0153n4192m0401k17656j57636M14685
$$ plain form
13871 1224637 1142229 1307902 1207784 1609065 1132994 1148684 967197 1206182 1251946 1155074
13861 1155074 1277388 1104303 931179 1097998 1265004 1260892 1104170 1288032 1271892 1341227
13851 1341227 1326109 1044661 1196275 1039916 1046834 895560 880281 1038479 1121135 1390876
13841 1390876 916728 955415 944288 1016607 832945 1011337 881362 924645 1143127 1182566
13831 1182566 820568 1016067 852512 1130721 936805 915668 1323702 924400 888090 954090
13821 954090 908954 964637 1234504 920502 1050763 972731 1354629 834014 1227111 1212655
13811 1212655 901634 920844 915756 948662 613965 738933 1100543 797412 717990 573452
13801 573452 890157 755549 734397 896624 946777 892585 852184 634528 476892 891577
13791H91577N7167J1436k5415m37468K04748K03517k19929K50499l72687J766
13781E65211L90972l13336J79833p4201Q7736J22231L2071j33788R9404k65259
13771F90874r0355J30932J24557j19575K90962l69192M79994k16254O5592k19137
13761G68398j3178n811O2458j06492M3619J29552K7099k31274L53854l54006L54328
13750A028547j51433J4547L8854m20677q147L11186R0468l72287M4665N5880M9859
13739F81462j14288j806Q8159r1522Q1868J1246k14035J86771J84682m0023l25273
13728D47241M56870l01199J32222K9586k20012j27241J77945o0944L13382J6415
13718H64265J07808l82499q1726J29698J5704r2240M1412J17895j51119N09392
$$ plain form
13791 891577 948744 960180 934765 497297 702045 905562 685633 936132 563445 565211
13781 565211 956183 642847 822680 748479 836215 958446 990517 856729 956133 690874
13771 690874 600519 731451 856008 736433 1027395 658203 1138197 921943 987535 768398
13761 768398 755220 749409 811867 705375 748994 878546 905645 674371 1028225 674219 1028547
13750 1028547 877114 891661 930515 509838 501691 812877 903345 531058 575723 631603 681462
13739 681462 567174 565368 653527 562005 643873 655119 441084 627855 812537 772514 447241
13728 447241 904111 602912 735134 764720 544708 417467 595412 534468 847850 864265
13718 864265 972073 589574 507848 637546 653250 561010 602422 720317 569198 1078590
13708A078590j77514m29532K99683C24315M60581B84848N5889Q3623L6423J35683
13698E96466B14614J08196L70319j86612l0545r320J92469q3021A65924L56517
13688E22441O451R526J2164m1226M71980m25360J33404J46275m14007J55009j18640
13677D58017K15215L8007k41032K12594j0029p5893j95976M70903l35439M9153
13667E85520r8395R4596j34832O9149J38785M3950k64111K80693k18414B45625
13656E19780j46077j4655J03749J20823J69927P3553l2057l56693L40340j79473
13646E99217J67531C02453N1505K28524B00592J94088J24646o8581j49795r2997
13636B07953J76891j0365K49399l449k04032P8076j40229A13008M72644P120j59839
$$ plain form
13708 1078590 901076 471544 771227 324315 784896 284848 340737 424360 460783 596466
13698 596466 214614 322810 693129 506517 475972 466652 659121 576100 165924 522441
13688 522441 528892 538418 550582 509356 981336 555976 689380 835655 421648 576657 458017
13677 458017 673232 711239 470207 682801 672772 596879 400903 871806 536367 585520
13667 585520 487125 581721 446889 516038 654823 698773 434662 715355 496941 245625
13656 519780 373703 359048 462797 583620 753547 827100 795043 438350 778690 599217
13646 599217 766748 302453 353958 582482 200592 394680 519326 450745 300950 207953
13636 207953 384844 374479 623878 620429 416397 494473 354244 113008 585652 592772 432933
13625D32933M189l8851j96971K35490L26958l61765j14668K90928k10592M6514
13615D14165K12905k64769j2002L95979k90753K05194k78054K60321k85392M51705
13605H09299j84563k59092Q0028j21955O6819e7473C88931j94225l9212L3895
13595A89389R510M60672k32154m7568o9041R9465j4313J67477j37990M4913J16290
13584E86650j40025A35276K71227j88122L15404k13582J19005A72632L55523B23262
13573E66931j8811k08736J43134k26021J65117q306l0979N570P2650j75251L3274
13562C18572P1129A85195f8955F81251l32259J17365A42083K43662r6282b7875
13551B73758P8350O4982K8807B20940J35077G4382L7966L55804K1877K46157A08720
$$ plain form
13625 432933 437122 398271 201300 436790 763748 401983 287315 578243 367651 414165
13615 414165 627070 362301 350299 746278 455525 660719 382665 642986 357594 809299
13605 809299 624736 365644 445672 323717 390536 -57473 388931 194706 155494 189389
13595 189389 198899 659571 427417 379849 310808 410273 395960 563437 425447 470360 586650
13584 586650 446625 135276 406503 218381 533785 320203 439208 172632 528155 223262
13573 566931 548120 339384 482518 256497 421614 413308 382329 387899 460549 285298 318572
13562 318572 389701 185195 -68955 681251 348992 466357 142083 385745 289463 -27875
13551 273758 352108 417090 445897 220940 356017 74382 112348 468152 490029 736186 108720
13539D49572j91720R4686J79356p5099A88664P539k4262K28392r2698K7674p7134
13528B58175K8437N6439K5864G5499M92680I0713J72426K04718O3290j48229A58589
13516E85411k68166D1674J62041G8462L37883J23608g5631D21549o7364j22587
13506B31598L91997A38962J73317M5372A53425K88704J94259k72161j69494J39041
13496C33774j0736k9911j45050G029M66887K05802B08064M45470C15621A08786
13485A51501J65141J42388A93727L39634j61759A17392K37355j15781q0788K85926
13475D44104B17606J0865J80576N3604j13912A73484J68220j02326M5253J06993
13465C91624j21312l354J54915b45088B88666O3245c0341F1290L41792J14529
$$ plain form
13539 449572 257852 352538 531894 456795 188664 196203 171941 400333 307635 335309 258175
13528 258175 286612 343051 368915 75499 568179 90713 263139 467857 531147 382918 158589
13516 585411 317245 41674 203715 78462 416345 539953 -75631 421549 354185 231598
13506 231598 623595 138962 312279 357651 153425 442129 636388 364227 194733 333774
13496 333774 323038 293127 148077 7029 473916 679718 208064 653534 315621 108786
13485 151501 316642 459030 193727 533361 371602 117392 354747 238966 158178 444104
13475 444104 217606 228471 409047 462651 348739 173484 341704 239378 284631 391624
13465 391624 270312 266958 421873 -245088 288666 351911 -30341 61290 403082 517611
13455E17611j64217b36899B01882o8505a55053H2169E421L05343R0581j14220
13445B87125P079j25064K34192j28556K94992k65329E062R1205m310L08175j94138
13434B05994J73951M212A3851L32216j61978n0468P0727j8048D165K42708J23973
13423C70846A18951l795J90105j2493a0624A97952a06251A46165J15671G4385
13412A84181n086m2466L54693j00965j48096k0101p1185L39323A21901K50437
13402C72338A68890R8098N911l7275a21931G510J24067F5098J58114J13057A53220
13390A63004l5626K9178n619K84915A19955K88258l683A12496J12969J08619j05954
13379B28130O1791J11094a80636C47980D9413J15184J86256a72132C34438a75516
$$ plain form
13455 517611 353394 -236899 201882 133377 -155053 82169 5421 310764 401345 287125
13445 287125 294204 169140 403332 274776 569768 304439 5062 96267 91957 400132 205994
13434 205994 379945 384157 13851 346067 184089 133621 204348 186300 4165 246873 370846
13423 370846 118951 115156 305261 292768 -10624 197952 -106251 146165 261836 74385
13412 184181 179095 136629 491322 390357 242261 222160 150975 490298 121901 372338
13402 372338 168890 266988 272899 235624 -121931 7510 131577 65098 223212 336269 153220
13390 163004 127378 156556 150937 435852 119955 408213 404530 112496 225465 334084 228130
13379 228130 289921 401015 -180636 347980 49413 164597 350853 -172132 334438 -175516
13368a65910B10704K3209J08322j58513L2951J12498A33129O7668o8758F1197
13357B90631j33615J44348B0503q064K49264B0068a76995B10891K18236j05874
13347C23253o7384K06969B06576N9416M0352J12772n878O6116j92994N2563r0195
13336B48728p466l6115l2781J5356J49358A50042J69852k1244k7954K5583B9526
13324B70438p3248b1860A49582L00488c99605D53564A77488O9002o4056o293p1752
13313A04389J97583n9013q8774J39809Q0583C4272J63098n1152L57866A01870
13302D34182H5837a49708A10580K55571H6814a27225C97028I0236a77188C12195
13291a32699B82849G1589L27448H4978K00697A12847K2983J85685I4757d954F73
$$ plain form
13368 -165910 210704 233913 342235 183722 216673 329171 133129 200797 132039 61197
13357 290631 157016 301364 20503 12439 261703 20068 -176995 210891 429127 323253
13347 323253 255869 462838 206576 265992 306344 419116 413238 479354 286360 338923 248728
13336 248728 241262 205147 172366 187722 337080 150042 319894 298650 270696 296279 29526
13324 270438 197190 -21860 149582 450070 -399605 453564 177488 246490 182434 176141 104389
13313 104389 301972 242959 154185 293994 374577 34272 197370 146218 504084 101870
13302 434182 85837 -149708 110580 366151 86814 -127225 397028 90236 -177188 312195
13291 -132699 282849 71589 399037 84978 285675 112847 135830 321515 94757 -4954 673
13279B21843J69748a8404B83875M4831K8152D6988a15940B5821O6956M4J36020
13268B28841a9750B86246J2482O9465b8032C11315l0665I3233C0381M2985a30433
13256B69939H4972c9108D15279B9039b6661C80308J52510D418J03796a74485A57160
13244B45755J20482A18791d6648o4308C79433A02630b56566B47802c3140B07039
13233B33431j14249c0182A86893J3338K5781K9021j08079h0584A50755l7259J9571
13222A33067a9134C68047q3411J8282a06725A11180r929J29513N349M163k1164
13211B19112d5341K1503A41004D312a25991H5784a04210C9321a59259c6873B40561
13199a70526m0983A13196e0229B3840M4154K73336A22923J04267L03786a07613
$$ plain form
13279 221843 391591 -18404 283875 328706 356858 46988 -115940 25821 92777 92821 228841
13268 228841 -19750 286246 298728 368193 -28032 311315 280650 93233 30381 73366 -130433
13256 269939 84972 -39108 415279 29039 -26661 380308 532818 4418 108214 -174485 157160
13244 245755 366237 118791 -46648 -110956 379433 102630 -256566 247802 -33140 207039
13233 233431 119182 -30182 186893 200231 226012 255033 146954 -80584 150755 113496 133067
13222 133067 -19134 368047 284636 302918 -106725 111180 101251 230764 236113 240276 219112
13211 219112 -45341 -23838 141004 4312 -125991 85784 -104210 39321 -159259 -36873 240561
13199 -170526 -211509 113196 -50229 23840 67994 341330 122923 227190 530976 -107613
13188C00744E1203K41324H9322f7142A60076E6224L68533F2861M61928B14806
13177F08905A79037C1699L70712D1796J05535g2439A92617A5346K68194R7254
13167C80794I2578f2975B54042r4816m2399b18020b7390j61036B7824P0347Q0897
13156A79068a27214M0260G7025g5294m5445A06753e2628B12027d0474A02717n892
13145I6825J2557L12606a39171L0071F1980M05991E2901K80011A46050M6410b05521
13133a50339C32000A57052c171k41241B40696d851C10308J24552k01455l9623
13123A93782H601K9635J52278J48913a04022M7706A27828j63f9353j9323d4221
13111a20040a6841l437I1237a5725B91818a58495A88133C71d0041A23747n2457
$$ plain form
13188 300744 51203 292527 89322 -67142 160076 56224 424757 62861 524789 214806
13177 608905 179037 31699 402411 41796 147331 -72439 192617 15346 283540 380794
13167 380794 92578 -62975 254042 159226 116827 -218020 -27390 -188426 27824 98171 179068
13156 179068 -127214 -86954 77025 -75294 -120739 106753 -52628 212027 -40474 102717 96825
13145 96825 109382 421988 -139171 -109100 61980 467971 52901 332912 146050 192460 -205521
13133 -150339 332000 157052 -3171 -244412 240696 -4851 310308 434860 233405 193782
13123 193782 8601 38236 190514 339427 -104022 -56316 127828 127665 -69353 -88676 -44221
13111 -120040 -16841 -20278 91237 -15725 291818 -158495 188133 371 -40041 123747 71290
13100G1290K12860G7879P7388A2164b2742b764B93157A505b08626C79404a3595
13088b32957D30536G1727b7132B24085O8117j18553p8628M69327B22020P1395
13078B93415a27592B48389n1835P599J77433A77087K3189J02031A39846J69621
13068C09467B2453f4557a6346B72455j15195n860A0716M99081I853K58763q3725
13057A84891k0171l1607m6940J41481A02237C167R902P2531a72864A39802M5307
13046A85109M1032L0036r4326l7254n1979a9840A06990A7107a2537M547q384F3686
13033B71849d211B19772n8404a50186B27904o6730o3555F318Q7997g8955j01986
13022a80941A40967J93252n8593J22365m4939K9267A37528J20100P4204g3940
$$ plain form
13100 71290 284150 77879 155267 12164 -22742 -2764 293157 1505 -208626 379404 -13595
13088 -232957 430536 71727 -27132 224085 292202 173649 95021 564348 222020 293415
13078 293415 -127592 248389 196554 204153 381586 177087 200276 302307 139846 309467
13068 309467 22453 -64557 -16346 272455 157260 151400 10716 509797 9853 268616 184891
13057 184891 164720 133113 86173 227654 102237 3167 13069 85600 -172864 139802 185109
13046 185109 226141 256177 161851 124597 72618 -19840 106990 17107 -12537 -7990 -16374 63686
13033 271849 -4211 219772 161368 -150186 227904 161174 97619 6318 94315 -78955 -180941
13022 -180941 140967 334219 275626 397991 353052 382319 137528 257628 331832 -73940
13011i8711A45436K765J76072O074E0580O9384C4797f9541b3203j60401A2973
12999e612B13338h4177C27950G8453N1267a6940A47391a77264B9815L13541j67303
12988A76053N96O8996a06472M3799B37919A6660i307j45424e5635D47182F7187
12976D31754j79386j03955P7813J55084A4373J59106R5602J14980g0534k2330
12966i2864B35529n4591H6735a27750B30514g9191C72013b27138k2674b9545Q213
12955b1332B29624m0502R3505k7211j11921D7726A4377P2648a76986E6197a97224
12943C08286D8797h4594L0009D0398d8189j17783m8971B1956f8766j18622b8716
12931B01160k1169a85985g4738k07935A35939k525E4447L6507K20144D4351c7095
$$ plain form
13011 -98711 145436 148201 324273 330347 50580 119964 34797 -69541 -23203 -183604 12973
12999 -5612 213338 -84177 327950 78453 129720 -16940 147391 -177264 29815 343356 176053
12988 176053 176649 245645 -106472 -62673 237919 16660 -9307 -154731 -55635 447182 67187
12976 431754 252368 148413 226226 381310 14373 173479 269081 384061 -70534 -92864
12966 -92864 235529 180938 86735 -127750 230514 -79191 372013 -227138 -249812 -29545 -21332
12955 -21332 229624 189122 282627 255416 143495 47726 14377 87025 -176986 56197 -197224
12943 308286 48797 -84594 -54585 40398 -48189 -165972 -214943 21956 -68766 -187388 -28716
12931 201160 179991 -185985 -74738 -282673 135939 133414 54447 90954 311098 44351 -37095
12919b0094H4748l459c20168A49300i1803B41647A4652P2644c7410l9639A99357
12907E165M8605M6758a8415A63327G0487b36925A15436J29842I1481a02680d4027
12895A65079f492B98011a74698E0780p952d0471k44005A47635B8216e0492j41357
12884a91849j9994a0196C26449A60021A7845J90965b46396k2671B5728J73862
12874A99590c2842B35995a41093A40042d7419I2682a42624A88246d16323a49718
12863f3960E2354A7825N2429d9600B18442M1499d46961e9239o3354C4155i4115
12851a51722L1468C24678b00160C95885h6249j07718G5245K47636A24755N3813
12841A78568a81865B27179n5966j1011l3310B1525d22j54539A90560K1685q8465
$$ plain form
12919 -20094 84748 81289 -320168 149300 -91803 241647 14652 87296 -37410 -77049 199357
12907 5165 53770 100528 -18415 163327 70487 -236925 115436 245278 91481 -102680 -44027
12895 165079 -6492 298011 -174698 50780 42828 -40471 -284476 147635 28216 -50492 -191849
12884 -191849 -211843 -10196 326449 160021 17845 208810 -246396 -269067 25728 199590
12874 199590 -32842 235995 -141093 140042 -47419 92682 -142624 188246 -416323 -149718
12863 -63960 52354 17825 70254 -49600 218442 259941 -446961 -59239 -122593 34155 -94115
12851 -151722 -120254 324678 -200160 395885 -86249 -193967 75245 322881 124755 178568
12841 178568 -181865 227179 171213 160202 126892 21525 -422 -154961 190560 212245 123780
12830A23780J99603k3388a96878d2999A14558h5726B18040c2236a929A08332K6402
12819A34734C433f6664E10895h0892D9014b15908a9087H9187K05418D4169b72759
12807I8931J01912e2461j39387G8556R2953b92274e8239k9435A00116D3294j0052
12796C3242d8057j57726f7990m0129o9132A12926J0224P3334F5081J0796d3988
12784A63265b11777d1556j47877A18791J55987e18B27831q5518f8112r1343p2892
12773b32347I6722J78827A37690F1565Q0814E1566h0285A19592R8814F8066b48910
12761A23592h0062H5132A8072L0703a55544L1466K2555C29450E0338g7755C19943
12749F7140e13251B62654c26284J05949f8879C35951A914K28439I081K27335h3404
$$ plain form
12830 123780 323383 299995 -196878 -42999 114558 -85726 218040 -32236 -1929 108332 134734
12819 134734 3433 -66664 510895 -80892 49014 -215908 -19087 89187 294605 44169 -272759
12807 98931 200843 -52461 -191848 78556 171509 -292274 -58239 -87674 100116 43294 33242
12796 33242 -48057 -205783 -67990 -108119 -177251 112926 123150 196484 65081 75877 -43988
12784 163265 -211777 -41556 -189433 118791 274778 -518 227831 142313 -68112 -159455 -232347
12773 -232347 96722 275549 137690 61565 142379 51566 -80285 119592 218406 68066 -248910
12761 123592 -80062 85132 18072 48775 -155544 -124078 -101523 329450 50338 -77755 319943
12749 67140 -513251 262654 -326284 -220335 -68879 335951 1914 230353 9081 236416 -83404
12737A78383B4129p123J8298a80233D9175K01536a07157G1729L37526A32857e1824
12725c3979k32595J23482A84519h1813D46147F1722g1382D08555c29943G8375
12714C72930I2705J38426m5465K07103g2375G1363K21340K8062Q4622j99644g7021
12702I4892K37096F2731Q8436c8241I3443e9103j23589B90749a40180H8152e9168
12690A52504h574k66522G0957b2259D0413M3528K20501q9121a00871B89855H4949
12678G1415K5010O0862a23445G0194O7237K1499C8825A7283c27891C698J40101
12667A43799e8993A93823h9993B67205A01558J95137k0115D7007f6371j7617A60403
12655B16179f6843C54598b02631B5652J40647n5836J26120K16170a72035D53994
$$ plain form
12737 178383 24129 17006 35304 -180233 49175 250711 -107157 71729 409255 132857 -51824
12725 -33979 -266574 -143092 184519 -81813 446147 61722 -71382 408555 -329943 78375
12714 372930 92705 231131 185666 392769 -72375 71363 292703 320765 405387 205743 -77021
12702 94892 331988 62731 151167 -38241 93443 -59103 -182692 290749 -140180 88152 -59168
12690 152504 -8574 -275096 70957 -22259 40413 83941 304442 215321 -100871 289855 84949
12678 71415 96425 157287 -123445 70194 137431 158930 38825 17283 -327891 3698 143799
12667 143799 -58993 193823 -89993 267205 101558 296695 276580 47007 -66371 -83988 160403
12655 216179 -66843 354598 -202631 25652 166299 110463 236583 452753 -172035 453994
12644C33611q7206C1624J66380a43709A96607b13840B12109q5312J32365J2568
12634B71730L79143B67279o9571n9692n4493J11250K49594G4368L53431G0155
12623C19415H7149b51388D74771d7261k0546B32855h1233K2864k81005P6779B141
12611a37203C18694g5409j15734E2392L760k5229J97627K88625g0485A04015J24905
12600B28920l2306a24950C92063A9420a9023B67053d054l04021i198F8196a8966
12588F7144B1882J6570f174j6215r6366D3725J61846J88331C1007J74629h7722
12576C7174b53361G5895b27902B71293B6998J03638a60068B4813e5821B553L19351
12565C21904j18827C2416L73285a38277a4173B99988L1654a10700A96672b8716
$$ plain form
12644 333611 246405 31624 198004 -143709 196607 -213840 212109 126797 259162 271730
12634 271730 650873 267279 197708 138016 83523 194773 444367 74368 427799 70155
12623 319415 87149 -251388 474771 -47261 -67807 232855 -81233 -58369 -339374 -262595 2141
12611 -137203 318694 -75409 -191143 52392 56152 30923 228550 517175 -70485 104015 228920
12600 228920 196614 -124950 392063 19420 -19023 267053 -4054 -308075 -9198 68196 -18966
12588 67144 21882 38452 -6174 -22389 -118755 43725 205571 393902 31007 205636 -87722
12576 37174 -253361 75895 -227902 271293 26998 130636 -160068 24813 -55821 2553 321904
12565 321904 203077 32416 405701 -138277 -14173 299988 331642 -110700 196672 -28716
12554a07635A87515J72523j74620a13418G2813K12598A09006l940M5426a55056
12543B06063h7119j8538p7871j57910e8471A07476a26054C8522J03973a92547
12532A43926g6030B09118J6531j09848b21522G078a53097B92086j42607D1530
12521B39893d8135B23118a62811D0159f4222b0224I9850b39702f6717A43402J35259
12510B78661I2852B4957K38812H937b38255C18406D3331K62673A21479C047d22736
12498A58645b51257D41913a23868p8209i3889B47820A03096b17051B40096O0882
12488C00978g5171r5390b8736A10104J2635d6823j43896Q4266A20150c21657a2771
12476C49855A40492g5954B95954D1842L8195k6719a01171D1024a05759J8922A3770
$$ plain form
12554 -107635 187515 360038 185418 -113418 72813 285411 109006 105066 150492 -155056
12543 206063 -87119 -105657 -183528 -341438 -58471 107476 -126054 38522 142495 -192547
12532 143926 -76030 209118 225649 115801 -221522 7078 -153097 292086 149479 41530
12521 239893 -48135 223118 -162811 40159 -64222 -20224 99850 -239702 -66717 143402 278661
12510 278661 92852 24957 263769 8937 -238255 318406 43331 306004 121479 3047 -422736
12498 158645 -251257 441913 -123868 -202077 -93889 247820 103096 -217051 240096 300978
12488 300978 -75171 -170561 -28736 110104 122739 -46823 -190719 -106453 120150 -321657 -12771
12476 349855 140492 -75954 295954 41842 80037 53318 -101171 41024 -105759 -86837 13770
12464b47719B08487o6499J6672a45073M3070r020A83927b1611A2356a87634j0957
12453a98591C08541a78839B39591Q3140L5145b2900A6440b08807H174J85037E5737
12441a18163j56526a00266j19125d2836m275F1003f48334b75819j7590d6916j93332
12430b40248j05461B15876D3405a81632A55462a77538J3427A21922M3273a40754
12419a0638D16459I7055J09589b36506g3727C20111B4600L667a02840D3057K97911
12408C40968D6598O3452P4883j6934G3288B9456b86498K8886j09001A50551K59360
12397D09911d0240j69070j98558a07289C5878i95m3181B0699i6596B78598G7573
12385I0293c3280D1051J70448f5466A72195F7169a56544P4560J262A87032a17499
$$ plain form
12464 -247719 208487 141988 158660 -145073 -102003 -111023 183927 -21611 12356 -187634 -198591
12453 -198591 308541 -178839 239591 322731 357876 -22900 16440 -208807 8174 193211 55737
12441 -118163 -274689 -100266 -219391 -42836 -47111 61003 -648334 -275819 -293409 -46916 -240248
12430 -240248 -345709 215876 43405 -181632 155462 -177538 -164111 121922 165195 -140754
12419 -10638 416459 97055 206644 -236506 -73727 320111 24600 28267 -102840 43057 340968
12408 340968 46598 110050 184933 167999 73288 29456 -286498 -257612 -366613 150551 409911
12397 409911 -40240 -209310 -407868 -107289 35878 -995 -44176 20699 -96596 278598 77573
12385 90293 -33280 41051 211499 -65466 172195 67169 -156544 -81984 -80722 187032 -117499
12373B28659i5114d0512A53551n8980l2357d1655B32736a78307h2289A20098C8396
12361c93508J71887d5989G2696j7382a63875A07227J82193j27935a01385L2786
12351f8599o1610K1240m0275B80412b63139b6438j24267A84437j7944c76409A12699
12339B45052g3683k09334K4557L8183A94904L02350A39688d7699A20742n2324
12329F8418b47189D9813J22647h7735G5142N3910J61348a93200N6152j31237H3146
12317B56765b09977A87478P3776A21559b03254j66865a76498I17J6164a49560
12306B79163j39068m5809b62998A28755J40641J53290j32475a9667A74495h6706
12295F5376L11609a16570A44640K8037h975k7045h749B54942j10991B2150J52757
$$ plain form
12373 228659 -95114 -40512 153551 94571 62214 -41655 232736 -178307 -82289 120098 38396
12361 -393508 -221621 -45989 72696 55314 -163875 107227 289420 161485 -101385 -68599
12351 -68599 -130209 -108969 -149244 280412 -263139 -26438 -150705 184437 166493 -376409 112699
12339 245052 -73683 -283017 -258460 -220277 194904 497254 139688 -47699 120742 68418
12329 68418 -247189 49813 172460 -87735 75142 129052 290400 -193200 -137048 -268285 83146
12317 256765 -209977 187478 261254 121559 -203254 -370119 -176498 917 17081 -149560
12306 279163 140095 94286 -262998 128755 269396 422686 290211 -19667 174495 -86706
12295 65376 376985 -116570 144640 172677 -8975 -36020 -8749 254942 143951 22150 174907
12284A74907Q4244c21363A2073J48249a05926k5579E7468f633C90077b36145A43606
12272B91667j10358k8924L480J12182A22887K1988E4836b50543A868a1387A94855
12260e0220C06638a22019I0325j7718J6871e0690m7149B82860A06772k2816M17889
12249E01845a8372C6743J19350g8003B17413a66531C71165i7080A94828c6639
12238b77407D037M63751A59602m2797J23274b40327B56083D4777e5271K5354A73502
12226A87327M0226f1663B8740N62635B00614d4327H7728K02092H4894O9817E1086
12214B9898Q8710J15119A11254h486A87066J58346l9661a366A29517K73906A97933
12202A03916a9735R019C6755J43933J15724j20008K6385n3983e129C90746J27266
$$ plain form
12284 174907 259151 -321363 12073 160322 -105926 -131505 57468 -6633 390077 -236145 143606
12272 291667 181309 152385 155865 268047 122887 144875 54836 -250543 1868 -11387 194855
12260 -50220 306638 -122019 90325 72607 89478 -50690 -97839 282860 106772 83956 501845
12249 501845 -18372 36743 156093 -78003 217413 -166531 371165 -97080 194828 -36639
12238 -277407 4037 467788 159602 116805 240079 -240327 256083 44777 -55271 -29917 173502
12226 187327 227553 -61663 28740 591375 200614 -44327 87728 289820 84894 154711 51086
12214 29898 118608 233727 111254 -8486 187066 345412 305751 -1366 129517 403423 197933
12202 103916 -19735 -10716 36755 180688 296412 176404 202789 148806 -5129 390746 518012
12191E18012i6762A09255j5115K69698f9074B60796c5522D9983a19878h116E93676
12179f9637F9402a92201B78518j28663J70755c47533H9239f2804l9496D4159J94055
12168B38214a5328A19945b12514D30400H1759f1893j0188j07127e2048A1363b11904
12156H3878D947b62995A19336B9022b26034B47916p2315K94659k25094D2203J8856
12145F1059i3050I1392a8150A01924C7992J09780h2640p3380b3819j56582e4799
12133c5415m1005B80568d4269J9291n3429j13705a3948B55263M7530a12600D0033
12121A84274C4938I132b22663K5805A49106c4679j03584A65540c583C8440e8600
12109b96280B7223K21941p9832k6832a58286G1330A8882a49990B74004j04002
$$ plain form
12191 518012 -96762 109255 94140 363838 -69074 260796 -35522 49983 -119878 -8116 593676
12179 -69637 69402 -192201 278518 149855 320610 -347533 89239 -62804 -102300 44159 238214
12168 238214 -15328 119945 -212514 430400 81759 -61893 -72081 -179208 -52048 11363 -211904
12156 83878 4947 -262995 119336 29022 -226034 247916 175601 470260 245166 42203 61059
12145 61059 -93050 91392 -18150 101924 37992 147772 -82640 -156020 -23819 -180401 -54799
12133 -35415 -76420 280568 -44269 -24978 -78407 -192112 -13948 255263 302793 -112600 40033
12121 184274 34938 9132 -222663 -196858 149106 -34679 -138263 165540 -3583 38440 -58600
12109 -296280 27223 249164 169332 142500 -158286 71330 18882 -149990 274004 170002
12099A70002l6258l5290a33965E8481J41317b2227k454C15149F7544g4763m12063
12088d86826O9472C55908D5271a98182f6289J8367A46880a23760D30573a17228
12077A05672e5836E2702k3256J33173M05146J251468m97530C15512I7165b04047
12066i6327N668F1290J5592k9728M4222B8852N9326N5408l4238a49008D1358P3266
12054A14624d8688C12838j19931q0649C7137c39326a11330M315A0023h4652R442
12043g5210F761K5318a2365B17033k5867a75102C4961q391E727a18192A66033
12031A78298b1897A59097e7064B29754p9672J29601f3487B74043a00214G1060
12020A35681L4165E7539J07146a13913j75893c7717A91454C6878J4000J13899
$$ plain form
12099 170002 133744 98454 -133965 58481 199798 -22227 -24681 315149 67544 -74763 -486826
12088 -486826 -417354 355908 45271 -198182 -66289 -47922 146880 -123760 430573 -117228
12077 105672 -55836 52702 29446 162619 567765 1819233 1321703 315512 97165 -204047
12066 -96327 -90659 61290 76882 47154 91376 28852 88178 143586 109348 -149008 41358 114624
12054 114624 -48688 312838 192907 112258 37137 -339326 -111330 -107015 10023 -84652 -75210
12043 -75210 6761 32079 -12365 217033 191166 -175102 34961 26570 5727 -118192 166033
12031 178298 -21897 159097 -57064 229754 150082 279683 -63487 274043 -100214 71060
12020 135681 169846 57539 164685 -113913 -289806 -37717 191454 36878 50878 164777
12010A64777a45789p4558a3137H7216J77948j06188a13829m2458A02993j5163
12000H7830d5425C8870a30337L3698k90309e9250j03008Q0588l00874F5039J21773
11989A86812i0239A24074b36971A31434a6276A06823f0851q4398c7681A31569
11978f6652A4976L04247d3941E4374f0998j1306b6924k49448A8438f0402F7283
11966A93413d6851j1207b611A66727f2531k89997G446J21550b31869e9836A55097
11954d96159b43957a06963c2206F394i4858B60154h074j08110B02387J3000c21376
11942C9469J02522a38132a8895k1885E5710e1974F2832f3324n3917G1641A9017
11930h9812B10554G6684c2518B1448b34747g8482j07976P352d065H877R28a69564
$$ plain form
12010 164777 -145789 -220347 -13137 87216 265164 158976 -113829 -156287 102993 87830
12000 87830 -45425 38870 -130337 -96639 -386948 -59250 -162258 -81670 -382544 65039 186812
11989 186812 -90239 124074 -236971 131434 -16276 106823 -60851 -145249 -37681 131569
11978 -66652 14976 319223 -43941 54374 -60998 -72304 -26924 -276372 18438 -60402 67283
11966 193413 -46851 -58058 -2611 166727 -62531 -352528 7446 128996 -231869 -59836 155097
11954 -496159 -243957 -106963 -32206 6394 -94858 260154 -8074 -116184 202387 215387 -321376
11942 39469 141991 -138132 -18895 -40780 55710 -51974 62832 -63324 -117241 71641 19017
11930 -89812 210554 76684 -32518 21448 -234747 -78482 -186458 -179106 -4065 8877 9805 -169564
11917D749Q7840N6879c27431C00741I8011b12347F4178J42149a29945J0129o3108
11906a82924c3440B5328d5582k30803A55505e277A4286J64082A5378K1993j7732
11895A9639e2990a4826r6985a5309A78760b01247r5143A93684b33304l4804C1611
11883A00120a30122B04c68419A45800o7163j9912a61499M4853D0484K70985I1452
11871D0838L16047a01954r4649C1831b21916m887a09813m1213c7507N614A31376
11859i857C66321i7118C5323a26119G3965a20862A19160h352j09645j17878J15789
11848a20086K6972A9616f0942b0341n2401B0619J29643D1353a90987j65894J15884
11837b40997e2329E17747g5797j43657J05243B50351q4036b68708L6286j26830
$$ plain form
11917 4749 92589 149468 -327431 300741 98011 -212347 64178 206327 -129945 -119816 -182924
11906 -182924 -33440 25328 -45582 -276385 155505 -5277 14286 178368 15378 37371 19639
11895 19639 -52990 -14826 -111811 -15309 178760 -201247 -296390 193684 -233304 -268108 31611
11883 100120 -130122 204 -368419 145800 78637 58725 -161499 -116646 40484 311469 91452
11871 40838 356885 -101954 -196603 31831 -221916 -226803 -109813 -151026 -37507 -31893 131376
11859 -9857 366321 -97118 35323 -126119 73965 -120862 119160 -8352 -117997 -235875 -120086
11848 -120086 -93114 19616 -60942 -20341 -72742 20619 150262 41353 -190987 -356881 -240997
11837 -240997 -52329 517747 -75797 -219454 -114211 250351 166315 -268708 -232422 -359252
11827c59252A34274L7093b07004A9209M20237c22418J58203j3047C70334j79815
11817A90519b20176a6605l01509B02653a65515d5087k10736Q0402N4737B19199
11806e5617j48070d8151j21631L189l1376F96167a92756j21116B45609D9667L41565
11795C91232B2901a08760D7872B0920J93939a0690B15708a14119A05481i2425
11784a33669O617B285c31505A43475c59715D8440i9198l64480g9132A15550d6483
11772C0434b06720I7133J466L972a11050F0426K15432F3901N71850c28010J48607
11761a79403B31172a72422j3815I7069m3536b9434E8524M26375a67053J7803A13914
11749B2470g0524E6631c9585B21602d7762A89859L6906o0287b61304J27777B01955
$$ plain form
11827 -359252 134274 171367 -207004 19209 439446 -322418 -164215 -177262 370334 190519
11817 190519 -220176 -16605 -318114 202653 -165515 -45087 -255823 -175421 -120684 219199
11806 -55617 -203687 -48151 -169782 -166593 -197969 696167 -192756 -313872 245609 49667 391232
11795 391232 22901 -108760 47872 20920 214859 -10690 215708 -114119 105481 -92425
11784 -133669 -127052 2285 -331505 143475 -359715 48440 -99198 -463678 -79132 115550 -46483
11772 30434 -206720 97133 98599 102571 -111050 60426 275858 63901 635751 -328010 -179403
11761 -179403 231172 -172422 -186237 97069 53533 -29434 58524 484899 -167053 -149250 113914
11749 22470 -70524 56631 -39585 221602 -47762 189859 226765 166478 -261304 -133527 201955
11737b0025B0673P2127g4264B77683a12635c3130l12390G1759i5097F9127a90448
11725A35289c5282F4838k3623g8229m3730A49701l7745L5585b55005C37811a19640
11713i8899C60202A57591J18937j28465E8510L3605K7738J06589b37052B0617
11702B1441Q6657g7267B0068N4056c9654r2579B01544a85464C10505a27744D3842
11690A08627L8183K4697B449O6360Q7770E5293J07756c4124A90628a24723C05825
11678e0932C96479A13692N38D6533K73600a32561B27616a25840d4813r2156A75177
11666b37282I2909a52795m0343P2253I2756k4572J40887C3480K10493b35084f585
11654i9425C71205o6199b94226B12082b13694I0760d6208C13147b2673B44045
$$ plain form
11737 -20025 20673 92800 -74264 277683 -112635 -33130 -345520 71759 -95097 69127 -190448
11725 135289 -35282 64838 41215 -78229 -121959 149701 111956 147541 -255005 337811 -119640
11713 -98899 360202 157591 276528 148063 58510 92115 119853 226442 -237052 20617
11702 21441 108098 -77267 20068 74124 -39654 -132233 201544 -185464 310505 -127744 43842
11690 108627 146810 171507 2449 68809 156579 55293 163049 -34124 190628 -124723 305825
11678 -50932 396479 113692 114230 46533 320133 -132561 227616 -125840 -44813 -136969 175177
11666 -237282 92909 -152795 -193138 -120885 92756 68184 209071 33480 243973 -235084 -6585
11654 -99425 371205 305006 -294226 212082 -213694 90760 -46208 313147 -22673 244045
11643f8160m04566A49245a00921j64343A9823M4834g4815i727B00990J9328B0262
11631A83047a1298D1728g4650B82391e2974j22262B3528J62429A663J99831m9710
11620A51784C4087J05573E6862a70405J2882a3754k27270i6407a6484B0489a87176
11608C3244N2303A6740N1937J38754b55138D0735a89519B69344D7278J32102k2700
11597A56680Q468N4365J1010D0728J10087R7184c294j05130R616E09966A35534
11585e4929l8132j64862a3608B30171a21025M1990n5191A79852D9756R0564c5957
11573f5224H7164K03700a20238E5948b10581a3155C80629A22532c40B61656a54196
11561A8028J04651B102J37625a0087r2055A26173h5175j47692A1343J00866J48705
$$ plain form
11643 -68160 -472726 149245 -100921 -265264 19823 64657 -74815 -9727 200990 220318 20262
11631 183047 -11298 41728 -74650 282391 -52974 -175236 23528 185957 1663 201494 151784
11620 151784 34087 139660 56862 -170405 -157523 -13754 -241024 -96407 -16484 20489 -187176
11608 33244 85547 16740 68677 207431 -255138 40735 -189519 269344 47278 179380 156680
11597 156680 165148 219513 230523 40728 150815 247999 -3294 -108424 -98808 509966 135534
11585 -54929 -93061 -257923 -13608 230171 -121025 -79035 -134226 179852 49756 140320 -35957
11573 -65224 87164 290864 -120238 55948 -210581 -13155 380629 122532 -340 261656 -154196
11561 18028 122679 2102 139727 -10087 -102142 126173 -85175 -232867 11343 112209 260914
11550B60914j5340a1975G6749c11539D59182B26539g7831B72858A09928J40129
11540B50057d5590I6883a54091C05774K7005C8427a02812B11763a67652D17525
11529B99745A39916J20975n9789c39764A77689a38610B20480G1387J18115m5385
11519A44117a18174b8584A62518J38207K5738b6923a2145A31521O8883n2750b5953
11507A58548J11221e8782B16475m4154n5365K66424A68784d5984B00023D16J12911
11496A13327k5469K5413J47938j25709L68279I0677g1893c1032E5381j1175J45968
11485A90174i0143L2811B45920l5175Q5489K5384D9979J36052G0362K38267b5153
11473B12675J99885H9865K95810q4366G9051K30052A4923N3596K31275C3657K39446
$$ plain form
11550 260914 245574 -11975 76749 -311539 459182 226539 -77831 272858 109928 250057
11540 250057 -45590 96883 -154091 305774 332779 38427 -102812 211763 -167652 417525
11529 299745 139916 260891 201102 -339764 177689 -138610 220480 71387 189502 144117
11519 144117 -118174 -28584 162518 300725 326463 -26923 -12145 131521 200404 147654 -25953
11507 158548 269769 -58782 216475 172321 116956 383380 168784 -45984 200023 416 113327
11496 113327 87858 113271 261209 135500 503779 90677 -71893 -31032 55381 44206 190174
11485 190174 -90143 -57332 245920 210745 296234 321618 49979 186031 70362 308629 -25153
11473 212675 412560 89865 385675 301309 79051 309103 14923 68519 299794 33657 273103
11462B73103p00H7241k6130P1755n817E8901M9988K47724f5794A9378c782j0306
11450a4088A09644b23483A06860J0013C2372A1367Q3116d7381j46243G050a55885
11438F376N9578o659J04586K6381b3532k4388D2285j7415K23062A01207J43515
11427B44722E5652N5602K25833L4160a83600k333A46807a94187A82953o6271c74135
11415B5934f4301A88231c01658J47967B7673a93236m2569F8353c7752A62844a68811
11403b38218B81684d4277B35417a98004A3353a69191b7273A03264N733P5975o6721
11392A18251c83640e1904B9563P1673J96884E9897a69058n1703j8763A02897a78741
11380G8125a45709d869A76011M8656a09562E4366K8868a80894H0879L3469L1925
$$ plain form
11462 273103 272403 87241 61111 132866 127049 58901 108889 356613 -65794 19378 -3782 -14088
11450 -14088 109644 -223483 106860 116873 32372 11367 94483 -47381 -193624 7050 -155885
11438 6376 65954 59295 163881 190262 -23532 -47920 42285 24870 247932 101207 244722
11427 244722 55652 111254 337087 371247 -183600 -185933 146807 -194187 182953 116682 -374135
11415 25934 -64301 188231 -301658 -153691 27673 -193236 -235805 68353 -37752 162844 -168811
11403 -238218 281684 -44277 235417 -198004 13353 -169191 -27273 103264 108997 184972 118251
11392 118251 -383640 -51904 29563 101236 298120 59897 -169058 -220761 -239524 102897 -178741
11380 78125 -145709 -4869 176011 224667 -109562 54366 83234 -180894 80879 114348 146273
11369A46273A4309J49813F6496f5260A17592a21592c1949j93368A54449k627b34904
11357i526m61037C68582k3117f3821a9921R41A5028a30971B7574J6039a79310
11345A15883M23079B3890a27210D69O560i18j59850b3086G6601a93960P7151J1597
11333a05212A0527b10055h8222A12529C8454K26996i3840K692O647B49570c03286
11321a41533D2351h1510c6199A05881k3158a89029E1391d4349j34922A24513a02304
11309a12348B4264P5711l6548B3514J0581d51377B24459c8663B9731b46699b1327
11297f0934J294B23084D3022d8366j9257j63746J12026A12581K26909D2720b3535
11285c132l99832I7994a37135C83197j79620a4749j3530p9159k8108j23389I0742
$$ plain form
11369 146273 14309 164122 66496 -65260 117592 -121592 -31949 -225317 154449 151822 -234904
11357 -9526 -470563 368582 345465 -63821 -19921 -18980 15028 -130971 27574 43613 -179310
11345 115883 538962 23890 -127210 469 7029 -918 -160768 -23086 76601 -193960 -116809 -105212
11333 -105212 10527 -210055 -88222 112529 38454 265450 -93840 -91148 -84501 249570 -303286
11321 -141533 42351 -81510 -36199 105881 82723 -189029 51391 -44349 -179271 124513 -102304
11309 -112348 24264 99975 63427 23514 34095 -451377 224459 -38663 29731 -246699 -21327
11297 -60934 -59640 223084 43022 -48366 -67623 -231369 -119343 112581 339490 42720 -23535
11285 -3132 -402964 97994 -137135 383197 203577 -14749 -28279 -107438 -135546 -258935 90742
11273F7586N9a35734e0123A29675J10913a31696j761B61350H3364a0773j62406
11262a73179A05022a37944k31689J78314H7886L1160B5479d04042A844e8110B898
11250B39717i1685a3203j66111B25471A3451J26247a39628A34926a28560A51241
11239A35717b62109a18806j36495A6030g1137C28868c868C35565r7478c077C1494
11227e2367b5075j61874j02563E3833c5278A37535c52772a1861k31330h3840L0505
11216e3335k11657m2986g6749j28252k6689F7653f5025A2534M5073A2934b77487
11204B43972I586K43086D641L07742j43853o2313a51064o3339n4784B8206a08626
11192g8564n3658N8367k25594A6323M9124g4558j58913B1176h8134A9207A226
$$ plain form
11273 67586 67645 -135734 -50123 129675 240588 -131696 -133457 261350 83364 -10773 -173179
11262 -173179 105022 -137944 -369633 -191319 87886 119046 25479 -404042 1844 -58110 2898
11250 239717 -91685 -13203 -179314 225471 13451 139698 -139628 134926 -128560 151241
11239 135717 -262109 -118806 -255301 16030 -71137 328868 -3868 335565 238087 -3077 31494
11227 -52367 -25075 -186949 -289512 53833 -35278 137535 -352772 -11861 -243191 -83840 -53335
11216 -53335 -264992 -307978 -76749 -205001 -231690 67653 -65025 12534 57607 12934 -277487
11204 243972 9586 252672 4641 312383 168530 106217 -151064 -214403 -269187 28206 -108626
11192 -78564 -132222 -73855 -299449 16323 65447 -74558 -233471 21176 -88134 19207 1226
11180E5436c82516C5886K098b03715N3265A35732n6345b1696j00012A56673a79046
11168b24865O3608G1893b64395J07647k66908i3613B3825J11023b30896h6831
11157h8535B11422b07817e2132l80215A34537c3726l10217C4733a24691g434H6295
11145d3636j35291A7222J5214J1224R6152g7099J1770k52493A04573j4411d03015
11133a86313B95948l0834j9916A1793K29948K5235b01505e2945A74060G7691L2562
11122A10253f2983C95922H0244J65180L1820g977m6112A02493a88556H2343k3456
11111E8887J2314k1430c8207A95210J3615K08019j7541l6128O0008j60801h631
11099E9086J42331O1380J8153g3766A45905k6991R8036I1461J40453H8690J03614
$$ plain form
11180 55436 -382516 35886 37984 -203715 -150450 135732 79387 -21696 -121708 156673 -179046
11168 -224865 -161257 71893 -264395 -156748 -423656 -93613 23825 134848 -230896 -86831
11157 -88535 211422 -207817 -52132 -432347 134537 -33726 -343943 34733 -124691 -7434 86295
11145 -43636 -178927 17222 32436 43660 139812 -77099 -65329 -317822 104573 90162 -403015
11133 -186313 295948 265114 245198 11793 241741 266976 -201505 -52945 174060 77691 110253
11122 110253 -62983 395922 80244 245424 277244 -7977 -54089 102493 -188556 82343 58887
11111 58887 71201 49771 -38207 195210 208825 416844 399303 363175 423183 262382 -8631
11099 59086 201417 262797 280950 -73766 145905 118914 216950 91461 231914 88690 192304
11088A92304i7090L1090I4090K33513G3566Q23O9140C3887K96177k9122J09403
11077D10345r6386J47902E4871N29938A24381J15468J93837N1282A09525m906
11067A04619J41522J16950L9351j68148J112L9166r7232L52686J9091p274A92109
11055B60929O5257K95008Q0526K03962k48129J70603J051k49718r031J5957J60018
11044G46433j36377n6337J51613n833j29088k9071K72333j00216J44956l04803
11034E53610L91128k83722j49112R6922J89050j96503j3703k88117K33747L76662
11024I09962C76868K66624K13570l63315N00336j52283m172O143l20460O1513
11014E84824l7175J10525k95905K73182m3185k60045K00173J80067j51467B48017
$$ plain form
11088 192304 -97090 -66000 94090 327603 73566 74389 143529 33887 330064 300942 410345
11077 410345 313959 461861 54871 584809 124381 239849 433686 484968 109525 104619
11067 104619 246141 363091 402442 234294 235406 274572 177340 530026 549117 541843 192109
11055 260929 326186 621194 701720 905682 657553 828156 829207 579489 570458 586415 746433
11044 746433 610056 553719 705332 699499 570411 541340 813673 713457 858413 553610
11034 553610 944738 661016 511904 608826 797876 601373 587670 299553 533300 909962
11024 909962 376868 643492 857062 493747 994083 841800 837628 843771 523311 584824
11014 584824 547649 658174 362269 635451 592266 332221 532394 712461 560994 248017
11003F05023j02364J43732Q7181j81085P5649B50053L10551J01973j72745k3062
10993D66770K76314n8646K0655j38016L08535N6633j14229n257k09858K79789
10983H82690k21119J54400L18882J61846J49313l42435P9461N32550n2025N96288
10973B259851J41756L39508k02370j75042j94879L80280n31824N5380l79315J06246
10963A799591k84724l65657J67347J89661k62841M54494J64768n28383K62790
10954A597046j72199l58015M4500k19412J54381k20791k37921j63956l8634N5819
10944D40818k14138J33809J263A55903J3953K5791N2894H3388A4277a51402C04485
10932A06266j2057K17759F0229a36460A16133f310H0568L475A6709L481a12814
$$ plain form
11003 605023 502659 646391 733572 552487 628136 250053 560604 662577 489832 466770
10993 466770 743084 684438 705093 567077 875612 932245 818016 812759 602901 882690
10983 882690 661571 815971 1134853 1296699 1446012 1103577 1183038 1715588 1663563 2259851
10973 2259851 2401607 2741115 2538745 2363703 2168824 2549104 2017280 2072660 1693345 1799591
10963 1799591 1514867 1149210 1316557 1506218 1243377 1697871 1862639 1334256 1597046
10954 1597046 1424847 1066832 1111332 891920 1046301 825510 587589 423633 384999 440818
10944 440818 226680 360489 361752 155903 169856 195647 248541 83388 14277 -151402 304485
10932 106266 94209 311968 60229 -136460 116133 -6310 80568 84043 16709 20190 -112814
10920A0431B28J34727D2943K02264d4470G4207a22844p6544a0534k61789a6822
10908B16339a46479A26071k5165c7102k61755A40293R3304c23070H2822j9721
10898F3101r997i9785A16849J06418a97707a5100n557j79365A49966a79789N48
10887a79241D22999F2380J2762J81319b86153c5720m5356c0826C10207g2991j70424
10876b43415P1456b9633A30952h5860c2365C64507h3171A35978F1601a55983N9976
10865i6007A19022J44002b21118C3501a10900A59827L7667a19180A32255o4687
10855F7568j3887J87015j15509c7220F6978M3182J7610b30472G7587a07248C8781
10843c9955l2377l711G6852A4930a67705A53923a31343d8771q3540N769C1925
$$ plain form
10920 10431 228 134955 42943 245207 -44470 74207 -122844 -199388 -10534 -272323 -16822
10908 216339 -146479 126071 100906 -37102 -298857 140293 233597 -323070 82822 63101
10898 63101 53104 -99785 116849 223267 -197707 -15100 -20657 -200022 149966 -179789 -179241
10887 -179241 422999 62380 75142 256461 -286153 -35720 -81076 -30826 310207 -72991 -243415
10876 -243415 -171959 -29633 130952 -85860 -32365 364507 -83171 135978 61601 -155983 -96007
10865 -96007 119022 263024 -221118 33501 -110900 159827 197494 -119180 132255 67568
10855 67568 53681 240696 125187 -37220 66978 110160 127770 -230472 77587 -107248 38781
10843 -39955 -72332 -76043 76852 14930 -167705 153923 -131343 -48771 -132311 -126542 31925
10831f9049F1523a60382a9973n0320A56034j3008a66739l43364K41557B70844
10820f3165r938B3618a42392l3835B32898a94922A25113o001c2055j33880A64553
10808b0384A2581P9289R4212Q294c43157D3168a87310A16532M6057a09493A92413
10796A9798b09907B16049b87630a136G362K81027c99690A51352b3452A54191O1819
10785B16010b70706a31541F8847a41954o9829j01295A7872O413Q2239K00743H1557
10773A75089a39554b950q2071j50002d8158B39029r5267a35435A04537B2274J7131
10762C9405j3443F080c84722A47393c73622B9129c9139l015j92049D0819m257
10751C6562J13121c61796A29552Q147J11848n9670Q5000e6198k7135E4717c45683
$$ plain form
10831 -69049 61523 -160382 -19973 -70293 156034 143026 -166739 -510103 -268546 270844
10820 -63165 -73103 23618 -142392 -176227 232898 -194922 125113 119112 -32055 -165935 164553
10808 -20384 12581 91870 186082 194376 -343157 43168 -187310 116532 162589 -109493 192413
10796 19798 -209907 216049 -287630 -1136 7362 288389 -399690 151352 -23452 154191 216010
10785 216010 -270706 -131541 68847 -141954 -211783 -313078 17872 24285 106524 307267 81557
10773 175089 -139554 -2950 -85021 -235023 -48158 239029 143762 -135435 104537 22274 39405
10762 39405 25962 6080 -384722 147393 -373622 29129 -39139 -42154 -234203 40819 36562
10751 36562 149683 -361796 129552 137699 249547 189877 274877 -56198 -83333 54717 -345683
10739D6945b65778D0805L55119a3675D10695a62266B37386E0094c0066A43702
10728B9599M6784a39935I2115J13709C0705b29950A34218a42683l3975l0418D3055
10716c21318J30122c8336n2425I0310a56769A54243B7247a1454k8140r4593k04752
10705c38939D1538e6036D0523j603R968K02195c72291E3837J2724b19186d6665
10693a71420a5412a032k89195A78667P7061g940I6212b64076a24126F0060a124
10681G696R842L7814a57243A75507c52711E0259b58959a15330E8726A6815c56580
10669c40620B1747N7230c80521B43499a93126A90278c60495D9856c3987j17314
10659a51301J1267H0471A3183i247l21725B41273K87623A91899c38937F6385a50910
$$ plain form
10739 46945 -265778 40805 395924 -13675 410695 -162266 237386 50094 -30066 143702
10728 29599 76383 -139935 92115 205824 30705 -229950 134218 -142683 -176658 -207076 43055
10716 -321318 -191196 -38336 -90761 90310 -156769 154243 27247 -11454 -39594 -134187 -338939
10705 -338939 41538 -56036 40523 38920 48888 251083 -372291 53837 66561 -219186 -46665
10693 -171420 -15412 -1032 -290227 178667 255728 -7940 96212 -264076 -124126 60060 -1124
10681 7696 17538 55352 -157243 175507 -352711 50259 -258959 -115330 58726 16815 -356580
10669 -340620 21747 78977 -380521 243499 -193126 190278 -360495 49856 -33987 -151301
10659 -151301 -140034 80471 13183 -9247 -330972 241273 528896 191899 -338937 66385 -150910
10647A64204b75225b243k30300A30157b25037f8645l85339a39402B640b83782
10636b89188B2998L7048d1010A87374p4479J59392a35623F1466a44382D6700K92363
10625C39063c34100a41701L8439M0916l5036a1520k62625i333j22507j8136f043
10613b8297B2418a28386r6237Q4620N0083K1855a4791G4598a48268A01121O202
10602A07323b81535E6525o184Q9145b05116p5128A0413J81200a22798B33228j00552
10591A32676a04449P448j80445j6162b4554B97472B435b36190B2017J75910I5753
10579B99454b7943l03988b3220A92606c84968A07468b10579C37405j01215G5906
10568f9724j30610N9520A6141c22911A19669a26795N9031k84885a37738l28998
$$ plain form
10647 164204 -275225 -2243 -232543 130157 -225037 -68645 -453984 -139402 2640 -283782
10636 -289188 22998 60046 -41010 187374 112895 272287 -135623 61466 -144382 46700 339063
10625 339063 -334100 -141701 -103262 -62346 -97382 -11520 -274145 -9333 -131840 -149976 -6043
10613 -28297 22418 -128386 -224623 -140003 -89920 -68065 -14791 74598 -148268 101121 107323
10602 107323 -281535 56525 50341 139486 -205116 -280244 10413 191613 -122798 233228 132676
10591 132676 -104449 -97001 -277446 -293608 -24554 297472 2435 -236190 22017 197927 95753
10579 299454 -27943 -331931 -23220 192606 -384968 107468 -210579 337405 236190 75906
10568 -69724 -200334 -140814 16141 -322911 119669 -126795 -67764 -352649 -137738 -466736
10558d66736a95921A02726b56444F0902j6567h7040p4603g2693B6644G699i1550
10546b08661A17923h3934M528B1404a9010F8906a48166A03695h9852A41652e0042
10534A51815c35161A58714b08403A97204J05614a51584E1490b38392B89796I3181
10523f9257C18013A41950g0806B29624n2082F5633b86614b5307A81449b58301
10512H808J89206a95887G2313i598k37688d3512k57914J47539o8411f7975j14906
10501a82881m5452j77558C8538K5085N996A6979g4163j62287L1755A94883I5564
10489A46155b29893D3707o7M185M9997K6209L31684p5170K60934B27514B858N50405
10477E53263B75983H0193P0066F553a09337j2691A89853c9300l02616A7866a98166
$$ plain form
10558 -466736 -195921 102726 -256444 60902 44335 -87040 -161643 -72693 26644 7699 -91550
10546 -208661 117923 -83934 -79406 21404 -19010 68906 -148166 103695 -89852 141652 -50042
10534 151815 -335161 158714 -208403 197204 302818 -151584 51490 -238392 289796 93181
10523 -69257 318013 141950 -70806 229624 177542 65633 -286614 -25307 181449 -258301
10512 8808 198014 -195887 72313 -9598 -247286 -43512 -301426 -153887 -222298 -67975 -182881
10501 -182881 -228333 -405891 38538 63623 69619 16979 -74163 -236450 -204695 194883 95564
10489 146155 -229893 43707 43640 47825 97822 124031 455715 380545 641479 227514 2858 553263
10477 553263 275983 80193 150259 6553 -109337 -122028 189853 -39300 -341916 17866 -198166
10465E7668i1300A61407b12490D1001J96783b15229K3333B51708A2244O9778d95562
10453c53900A38116l9382R0176P1332b78478c7787A62501a00791L8254l19670
10443c82207A4160J97968I9725B6834a30379B97443a87027c1232q5519b9006E9336
10431c00938a23309B82613k2517A06496a50575j98787F3390f8444A07737b90824
10420C23278C6449a27542B45474B891J7705M0989a46746D7049J33734c52798i7332
10408a89788a7712j1952d022j6347k20783R6220A27895b81651D115P5899L95598
10397D75612b69854A18604B9473Q8606Q238O882J79360A03297B8178E105g9590
10385G6595a29889N1828b5318G1914G373M08437a52246j05106A99355F4901J2145
$$ plain form
10465 57668 -91300 161407 -212490 41001 237784 -215229 -191896 251708 12244 82022 -495562
10453 -353900 138116 98734 188910 260242 -278478 -37787 162501 -100791 -62537 -382207
10443 -382207 14160 212128 99725 26834 -130379 297443 -187027 -31232 -116751 -29006 59336
10431 -300938 -123309 282613 260096 106496 -150575 -349362 63390 -68444 107737 -290824
10420 323278 36449 -127542 245474 2891 20596 61585 -146746 47049 180783 -352798 -97332
10408 -189788 -17712 -29664 -4022 -20369 -241152 -144932 127895 -281651 4115 80014 475612
10397 475612 -269854 118604 29473 118079 126317 133199 312559 103297 28178 5105 -79590
10385 76595 -129889 -78061 -25318 71914 7373 415810 -152246 -257352 199355 64901 77046
10374G7046a22287C86954j06788A36415J13626o9573M51840m8726B69181J95582
10364D64763k08378o3012n7854Q6400j2783n2278E0473L09042j01293K64137a23640
10352A97250J32352k4122K64584B70487E8159f113A36614J48029K48363k12192
10342C20814j22580q1122j4419J35289A05636N8733J44155a35219A74257b90880
10331B44695n2730r4611d38009A03J59280l574b21507C58946K87153J42382A63272
10319B31959q1119B2806K35154q4444R8909f6696l18885C09997J04932A62270
10308B38860b70694f2115A03430D6578b31103D4266a39672D9316b06055J0705
10298a95350F7386i386A63904d1022J8031F8835N208b02352A17312E8643j5601
$$ plain form
10374 77046 -122287 386954 280166 136415 250041 180468 632308 583582 269181 464763
10364 464763 256385 193373 135519 221919 209136 156858 50473 359515 258222 522359 -123640
10352 197250 329602 305480 570064 270487 58159 -6113 136614 284643 533006 320814
10342 320814 198234 117112 102693 237982 105636 164369 308524 -135219 174257 -290880
10331 244695 191965 97354 -438009 103 159383 155809 -221507 358946 646099 788481 163272
10319 231959 150840 22806 257960 173516 272425 -66696 -385581 309997 414929 162270
10308 238860 -270694 -62115 103430 46578 -231103 44266 -139672 49316 -206055 -195350
10298 -195350 67386 -9386 163904 -41022 -22991 68835 74043 -202352 117312 58643 43042
10287D3042a01865A17556a13880j08140Q2570k91648K04495B33940b84719A93285
10276g1357D979K3494e472Ge8056E6455f9379j6386m1818B90000D6039i8081n3365
10263a51446k64415D12199m792A54836J19808P1566p5110K1882K86700G4985J63119
10252B38104J3182a64725A59068R326n7468E0067a33938j79386a34347C5664a8513
10240E8902P2691c95960c38m5713j3304r1576J7568B33692a3455E7355J46911
10229B04266k8839m9192r168g479m1553A08867c4667l120A4272a50743j64252
10218c14995E6980c2019B88956a77361B55073D7693h0743c5817k0381j65865B28423
10206a46084l09999A73399d11888g1860k21126k4704a5071A19972a82904O5131
$$ plain form
10287 43042 -101865 117556 -113880 -222020 -139450 -431098 -226603 233940 -284719 193285
10276 -71357 4979 28473 -5472 7 -58056 56455 -69379 -85765 -127583 290000 46039 -98081 -151446
10263 -151446 -415861 412199 407407 154836 274644 346210 271100 292982 579682 74985 238104
10252 238104 251286 -164725 159068 168394 110926 50067 -133938 -313324 -134347 35664 -18513
10240 58902 131593 -395960 -338 -46051 -59355 -150931 -133363 233692 -13455 57355 204266
10229 204266 175427 126235 117067 -7479 -49032 108867 -34667 -37787 14272 -150743 -314995
10218 -314995 56980 -32019 288956 -177361 255073 47693 -80743 -35817 -56198 -222063 228423
10206 -146084 -456083 173399 -411888 -71860 -292986 -317690 -15071 119972 -182904 -117773
10196a17773j55480F3538b94091G7944l4583a01660b1540l0938A40745A5024a45194
10184c9375B10728A0797b79582i243q5389I0623j1678a46181c1320H6936a68330
10172b65986k6478B4453a89842O1803d2464n4502B31650G7541D610J22595r01
10161A26304C3845M7450d21905h9638A58213b14475K6682a8718q8606C3558K26776
10150B60334a66411A534J3865b32318h0003l1977P594l1811K4540F0974L4427
10139I5401a96361J5708B27138b1370A0793c4088B32664a84352C84725j59244
10129B25481b3741k3744q1182J3630j22413a6244k31533o2111Q2428m6044C73042
10117D5358J5536b50352j9004A33449R2739i9490l02812E2255a41541L3089a4366
$$ plain form
10196 -117773 -273253 63538 -294091 77944 43361 -101660 -21540 -52478 140745 15024 -145194
10184 -39375 210728 10797 -279582 -9243 -94632 90623 78945 -146181 -31320 86936 -168330
10172 -265986 -292464 24453 -189842 -128039 -42464 -96966 231650 77541 4610 127205 126304
10161 126304 33845 81295 -421905 -89638 158213 -214475 -187793 -18718 -107324 33558 260334
10150 260334 -166411 1534 15399 -232318 -80003 -111980 -104386 -136197 -111657 60974 95401
10139 95401 -196361 -180653 227138 -21370 10793 -34088 232664 -184352 384725 225481
10129 225481 -23741 -47485 -128667 -115037 -237450 -16244 -247777 -309888 -227460 -273504 373042
10117 45358 60894 -250352 -269356 133449 226188 -99490 -402302 52255 -141541 -108452 -14366
10105g729B78975c236m9270J3693p6076p0375N8078C5190K5980L9582m513O994
10093A03233c3799l9867j16870C497i4845j49065J14436k9063p0030R8848A8079
10081B543J12512L5465a07785j9689m1905C22705B9565a35727a5905o0781j65617
10070b42303A33084a75304C3570a44542D9492a10427a9799j99178L6591C27786
10059c11872A60537J8725e8058i366B55524b31845H028g2217l88207F2443E325
10047a71974p4221B83592l9274C7414a60752d2938j75155B91254a77391B6401
10036F7236c36336g6030A27650C9870e9253K5737A3965a62786p6439a08975L2265
10025g6710A88706a3188A00009D2201a03103j4029k91716A4945a8597k604m0494
$$ plain form
10105 -7729 278975 -3236 -52506 -38813 -114889 -185264 -127186 35190 61170 100752 96239 103233
10093 103233 -33799 -73666 -190536 3497 -94845 -243910 -129474 -158537 -228567 -129719 18079
10081 2543 115055 150520 -107785 -127474 -169379 322705 29565 -135727 -15905 -76686 -242303
10070 -242303 133084 -175304 33570 -144542 49492 -110427 -19799 -218977 -182386 327786
10059 -311872 160537 179262 -58058 -9366 255524 -231845 8028 -72217 -460424 62443 5325
10047 -171974 -246195 283592 244318 37414 -160752 -42938 -218093 291254 -177391 26401
10036 67236 -336336 -76030 127650 39870 -59253 -33516 13965 -162786 -239225 -108975 -76710
10025 -76710 188706 -13188 100009 42201 -103103 -117132 -408848 14945 -18597 -21201 -61695
10014f1695A15264b9738I1907Q3721a7004k04670C3104c19868h1283J5372F7162
10002b85971d0284C14003b29548C5483h7470j22744B58003a50215M8689q3494
9992a85020j97124G7499K5978a56855A7620d2378F452b88353A3285J0428O0225
9981H3938a97024F8378h375B53319a03620j41576A2043a23142D9794H508Q1468
9970H9976c7094n3665B97129b61558c3741C6421d23913I3195j9444f8055C1235
9958a95870B8151f4630l23563J04615f3944A50115b70830A7653b80222d5668B40578
9946a45272e5673q3659A46020a02509j09529j20516a23755H8445a42231b3161
9935A04980e7427D4834A0297c51822i456D9128a85121O2478J9447q6996c8775
$$ plain form
10014 -61695 115264 -29738 91907 175628 -17004 -221674 33104 -319868 -81283 -65911 67162
10002 -285971 -40284 314003 -229548 35483 -87470 -210214 258003 -150215 -101526 -185020
9992 -185020 -382144 77499 103477 -156855 17620 -42378 6452 -288353 13285 23713 83938
9981 83938 -197024 68378 -8375 253319 -103620 -245196 12043 -123142 49794 8508 89976
9970 89976 -37094 -90759 297129 -261558 -33741 36421 -423913 93195 73751 -68055 31235
9958 -195870 28151 -64630 -388193 -283578 -63944 150115 -270830 17653 -280222 -45668 240578
9946 -145272 -55673 -139332 146020 -102509 -212038 -332554 -123755 88445 -142231 -23161
9935 104980 -57427 44834 10297 -351822 -9456 49128 -185121 -122643 -103196 -190192 -38775
9923c75491a53380B6323A0462e01701g0818B07447p4509a11601A44666A9778a9869
9911I4331b05160o5060K5286a05457A19122b44955j07965a19795j02561k5931
9901b48287i4858L6961j95359A4469O535c21825b0517j32655N996C9269e7695
9889d30234a77225r9722d8720j56666i4053A09723e0405j89977G3194k5439d127
9877b03819j69490a31880C6596c16692b9043k48775f7938A03238L35338G31a0271
9865a29381a6663E2042c01160a02345K4611A68785b0753j0412J4829I8178a76544
9853c31945a35912f3023j0859H2101R7173d6577j88819b1851A5355K3581g6253
9841a49656E5946O4297M1055c4469A38181A3608b73818h7441A12118c51001A6041
$$ plain form
9923 -375491 -153380 26323 10462 -501701 -70818 207447 132938 -111601 144666 19778 -19869
9911 94331 -205160 -270220 -244934 -105457 119122 -244955 -352920 -119795 -222356 -248287
9901 -248287 -94858 -57897 -253256 14469 21004 -321825 -20517 -153172 -147176 39269 -57695
9889 -430234 -177225 -276947 -48720 -205386 -94053 109723 -50405 -240382 73194 47755 -4127
9877 -203819 -373309 -131880 36596 -316692 -29043 -277818 -67938 103238 438576 731 -10271
9865 -129381 -16663 52042 -301160 -102345 -77734 168785 -20753 -31165 -16336 98178 -176544
9853 -331945 -135912 -63023 -73882 82101 179274 -46577 -235396 -21851 15355 38936 -76253
9841 -149656 55946 120243 161298 -34469 138181 13608 -273818 -87441 112118 -351001 16041
9829c86631l6826i9599M5357q656j12712B24781J5435D726K14614a36672c137
9817e6072I6406a29940e054o490j81854d896p9232j94604c5702B05406H3414J12651
9805A96065k5959e96362a1898l8854A24836c83580J18283B68789g6017A55487
9794b61605r7559C25674d25756A30438b87364a06744N1017B09969F2407J6504
9784G8911c3034F8079d8554r9483A2808J55460c13355E431O4864B3143M9604A5850
9771e5721j61709B56740E5471J7175l1645c87553a36347A3168h5348B7762J28940
9760A56702E7084M6031a91328K856n9042g4110L62I387J49518G5733J48322q8552
9748A35503b38581a5982j64882K5249E464R6434A5426M7876L8948B9215d02333
$$ plain form
9829 -386631 -423457 -99599 -54242 -62898 -175610 224781 240216 4726 219340 -136672 -3137
9817 -56072 96406 -129940 -5054 -11544 -193398 -4896 -84128 -278732 -35702 205406 83414 196065
9805 196065 170106 -596362 -11898 -50752 124836 -383580 -265297 268789 -76017 155487
9794 -261605 -359164 325674 -425756 130438 -287364 -106744 -55727 209969 62407 78911
9784 78911 -33034 68079 -48554 -148037 12808 168268 -313355 5431 70295 23143 72747 15850
9771 -55721 -217430 256740 55471 72646 41001 -387553 -136347 13168 -85348 27762 156702
9760 156702 57084 103115 -191328 -188472 -247514 -74110 -73748 9387 158905 75733 224055 135503
9748 135503 -238581 -15982 -180864 -155615 5464 101898 15426 63302 102250 29215 -402333
9736a1293o4258j24984R5383M0853b7495B26365h1099A12413j00h4403A35564
9724b25885H6804a39250L338d4511L509k0982k41978j11064a76362q8673a12714
9712g7230A42685c6365r1705A00380h2506l18307d6595n0404A28770k1526c2282
9700G6485b47705P2597A70206h4810G1338b56273A02612I48a10167n7057o2321
9689b29545n7392a948j29449o2227J2925n8391Q3816b7818A4270a85733h8976
9677A49778M9056a10085n4853h1123A56023J59620b34105n5675D9948a70551P7748
9666i2803A97938d13605A23073a45171A98852a2280H8103b65863c3670C35353
9655A13378M8924c96947J61880g9927j64973i237n84l15310J27165R2901G0882
$$ plain form
9736 -11293 -75551 -200535 -105152 -64299 -27495 226365 -81099 112413 112313 -84403 135564
9724 -225885 86804 -139250 -135912 -44511 -41002 -61984 -303962 -415026 -176362 -265035 -112714
9712 -77230 142685 -36365 -128070 100380 -82506 -400813 -46595 -96999 128770 107244 -32282
9700 76485 -247705 -175108 170206 -84810 71338 -256273 102612 948 -110167 -167224 -229545
9689 -229545 -286937 -1948 -131397 -193624 -180699 -239090 -155274 -27818 14270 -185733 -88976
9677 149778 198834 -110085 -164938 -81123 156023 315643 -234105 -289780 49948 -170551 -92803
9666 -92803 197938 -413605 123073 -145171 198852 -12280 88103 -265863 -33670 335353
9655 113378 162302 -396947 -235067 -79927 -244900 -9237 -9821 -325131 -197966 -105065 70882
9643a41906k6599L8119G9723a02945A28386a45006C77439j25402B8820c06934
9632C8862a70989C5710N9373R5584D5989b9456q0120H4688a98849b3980p4932
9621i8912m6580e4727j17333A17673a04882A64380g3714H042a53384M6220M1119
9610f6045j72130C6238J00532O4072I2146a14141L8672m7160j89530a05544n6044
9599a61588G059K05347d12907C42063c89747a54084E6440b05957g7640B0839Q9461
9588A10300a37647m5033A35268a27039l6079B41304b68652J00322e262B2014b93887
9576B9509J28869a14744C2442e8506B59893b67705b5590k8253B41537m3186E4990
9564B24994c1680r8387A15995c4221c331j74881B09862a13728C74781a74155a6536
$$ plain form
9643 -141906 -168505 -130386 79723 -102945 128386 -145006 377439 252037 28820 -306934
9632 38862 -170989 35710 95083 190667 45989 -29456 -109576 84688 -198849 -23980 -98912
9621 -98912 -145492 -54727 -172060 117673 -104882 164380 -73714 8042 -153384 -107164 -66045
9610 -66045 -238175 36238 136770 200842 92146 -114141 -75469 -122629 -312159 -105544 -161588
9599 -161588 7059 212406 -412907 342063 -389747 -154084 56440 -205957 -77640 20839 110300
9588 110300 -137647 -182680 135268 -127039 -163118 241304 -268652 -168330 -5262 22014 -293887
9576 29509 158378 -114744 32442 -58506 259893 -267705 -25590 -53843 241537 198351 54990
9564 224994 -31680 -130067 115995 -34221 -3331 -178212 209862 -113728 374781 -174155 -16536
9552E4291c10579B27688a33397I0318A5036b85968a2710A6088a32683q9199A95073
9540a70206B7648a03026C6315b50302A85268j5072f1107p8263r5558B6441J28972
9529A55413b99125J29772N6363p7751f1011A69299a78717C16480a58442l89004
9519e47446K30241A19228C6489a16633m9336d8866k17243g891r2466k84114J06159
9508b78312d4976j16909C3709e3246D3392b33418f2617j52695b5936r220D984
9496C3483c3365j391m802k7751l65181a59159c0672o837r9576H5569a82345e9739
9483a9544l57155A35537b6207A28545a62858B9934R7884m6562l9311i70l4285
9472c5255A87624L5354b57425e7431b2747j86352d6954p225B26427F6455P7262
$$ plain form
9552 54291 -310579 227688 -133397 90318 15036 -285968 -12710 16088 -132683 -221882 195073
9540 -170206 27648 -103026 36315 -250302 185268 170196 -61107 -139370 -234928 26441 155413
9529 155413 -299125 -169353 -112990 -190741 -61011 169299 -178717 316480 -158442 -547446
9519 -547446 -317205 119228 36489 -116633 -165969 -48866 -266109 -7891 -100357 -384471 -278312
9508 -278312 -44976 -161885 33709 -53246 43392 -233418 -62617 -215312 -25936 -35156 4984
9496 33483 -33365 -34756 -39558 -67309 -432490 -159159 -30672 -37509 -137085 85569 -182345 -59739
9483 -19544 -376699 135537 -26207 128545 -162858 29934 127818 81256 41945 -970 -35255
9472 -35255 187624 222978 -257425 -57431 -22747 -209099 -46954 -54179 226427 66455 143717
9461A43717b50208B03063b85651a18390j22229l46014b9259k88886a44475q208
9451a52683q3604J17003l3502M0277B9894o472a41602A25290B5062b16270j24554
9440c40824B02041D3503b02736H9173a55852F0901J46037b80615D42539C6051
9429B46654A06693b43344f1452j25208j57996c8494j89126f0828l0710H0935J57
9418H1092r037f8157j29844k33176I5755a05908m4530N0966a7248k99444a48056
9406C25102A58314b93937g4113G8284N2603g9745k15369A94219D2109a09368A8597
9394E4446K86161A8860c53745d820k95052J02512k49439R6712k32161a46788j79166
9383c25954B04123G7622N8976c38019A6497c1570j03112A67529b72640g1074k20547
$$ plain form
9461 143717 -250208 203063 -285651 -118390 -240619 -586633 -29259 -318145 -144475 -152683
9451 -152683 -236287 -119284 -152786 -112509 29894 23422 -141602 125290 25062 -216270 -340824
9440 -340824 202041 43503 -202736 89173 -155852 60901 206938 -280615 442539 36051
9429 246654 106693 -243344 -61452 -186660 -344656 -38494 -227620 -60828 -91538 80935 81092
9418 81092 72055 -68157 -198001 -431177 95755 -105908 -150438 -99472 -17248 -316692 -148056
9406 325102 158314 -293937 -74113 78284 130887 -79745 -295114 194219 42109 -109368 18597
9394 54446 340607 18860 -353745 -4820 -299872 -197360 -446799 -350087 -582248 -146788 -325954
9383 -325954 204123 77622 136598 -338019 16497 -31570 -134682 167529 -272640 -71074 -291621
9372b91621B02084N9408b94137C5933c74182L2508a23567j55473c0889B67771
9361H2170b592A76871c9124J1147A01477b55033r0857A45798e6326A95966a66170
9349b7604I402J9551d5697r4894P0128j29639K0638G8317A4519g7075E8575b14115
9336b67684A8896d1201p3906D781h1302E5334a68595C2768a89737h9946j04619
9325a94565C36433G1487a47307j38847A12098a12904A12389b16472p0594B6928
9314E4996b4093o2960G5536B0374i1695A93187q6842a98859J3568A62227N7174
9303B19401a65232m6042a4314D501Q6155a25828A43861J26562k4155b37849l2896
9292b70745B54889k5087A3508J13034c07930e7796B0821C267J21888d45110C0299
$$ plain form
9372 -291621 202084 261492 -294137 35933 -374182 -341674 -123567 -279040 -30889 267771
9361 82170 -2592 176871 -39124 -27977 101477 -255033 -345890 145798 -56326 195966 -166170
9349 -27604 9402 28953 -45697 -140591 -70463 -200102 -179464 78317 14519 -77075 58575 -214115
9336 -267684 18896 -41201 -115107 4781 -81302 55334 -168595 32768 -189737 -89946 -194565
9325 -194565 336433 71487 -147307 -286154 112098 -112904 112389 -216472 -287066 26928
9314 54996 -24093 -87053 75536 20374 -91695 193187 106345 -198859 -185291 162227 219401
9303 219401 -165232 -211274 -14314 4501 90656 -125828 143861 270423 246268 -237849 -270745
9292 -270745 254889 229802 13508 126542 -307930 -57796 20821 3267 125155 -445110 30299
9280a45720O4675D621a10247L8846k53503c8899m9495F7520d9520j60201B50922
9268a26030m6126A00972C7363b7701k72964a2180r8415a0068B27301a17249D1439
9256E0532j0925P1145c9525B5801d65024B82005r8276b55891K7904B28290r5180
9245A33110a11889j7551G9464g5152C83088F9156J25167J05888A47573b6828j78343
9234b05171d335q7174r3536I9876f979C03689b54157g8427b0648k4417j60693
9223b05758A69032d46645J09379D451J2597a35298A20413b36095i1399J9122l6071
9212a08348A09184b5501j07888j09099J15635A46305f9587j77780q2028e85j28326
9201a28911c8377m36357A75450C9265a45884K5131f0040m2261B9117i5141A52703
$$ plain form
9280 -145720 -81045 4621 -110247 -71401 -324904 -38899 -88394 67520 -49520 -209721 250922
9268 -126030 -172156 100972 37363 -27701 -300665 -12180 -110595 -10068 227301 -117249 41439
9256 50532 39607 110752 -39525 25801 -465024 282005 183729 -255891 -227987 228290 133110
9245 133110 -111889 -129440 79464 -75152 383088 69156 194323 300211 147573 -26828 -205171
9234 -205171 -4335 -91509 -185045 99876 -6979 303689 -254157 -78427 -20648 -45065 -205758
9223 -205758 169032 -446645 -337266 4451 17048 -135298 120413 -236095 -91399 -72277 -108348
9212 -108348 109184 -25501 -133389 -242488 -126853 146305 -69587 -247367 -329395 -585 -128911
9201 -128911 -38377 -474734 175450 39265 -145884 -120753 -60040 -102301 29117 -95141 152703
9189a54436j60495C69311A55604b46753c0311I4048a35187o8665i1704B7201n880
9178B1321b48775F909b88055b8288F8627b52206l0768F7842g733p2947p5026D354
9165e5245l73813A10767M5637k7219n1950J68701d02395A65612J95260f8110A10773
9153A16916C2629J2368L3667h9237A2602a7944l58204e5859k9265K1591l9956
9142a03489n3546A84528g2486n0438j84577J11405N1971B00757b88198E0380c67876
9130h8938q9615j89365J32326h0809k66504a31687A05239J51133c14813o0069
9120c74882a82701N2069r8732a13103a8665m0040m86709f0986n5644b2067k27845
9109b49912C09127b24995e3797j13489p9491e5616B1124J10571b6991j33079J4380
$$ plain form
9189 -154436 -314931 369311 155604 -246753 -30311 94048 -135187 -203852 -91704 27201 21321
9178 21321 -248775 6909 -288055 -28288 68627 -252206 -282974 67842 -7733 -80680 -155706 4354
9165 -55245 -429058 110767 156404 129185 77235 245936 -402395 165612 360872 -68110 110773
9153 116916 32629 44997 78664 -89237 12602 -17944 -376148 -55859 -85124 -63533 -103489
9142 -103489 -157035 184528 -72486 -122924 -307501 -196096 -144125 200757 -288198 50380 -367876
9130 -88938 -178553 -367918 -235592 -80809 -347313 -131687 105239 256372 -314813 -374882
9120 -374882 -182701 -130632 -229364 -113103 -18665 -58705 -545414 -60986 -116630 -22067 -249912
9109 -249912 309127 -224995 -53797 -167286 -246777 -55616 21124 131695 -26991 -160070 -145690
9098a45690k9087E4843a96900j02166a09200C5324e5614j20338B34317d1831A63697
9086C1095a53235L139B87833A18655k1512J57610j24127a00068B67538b45248
9075d2593o8066j69078A44530d397k51723J17038M3696j1517H3826c39061a61826
9063G5643c09496B4289f7373C1992K8363a69870C9821c52186C8650a61017A58433
9051H9310d36997A5914f4911B43502f4758k02823j23111a40371h688B1265b1586
9039I876a00365j30275A117c41856A1825e58899b02539j55562c6021H6473b4448
9027A52339A2986b8665k77841A67544F5959b08300k58996A84495a54738C21522
9016H1110d2389l8981c1203k16089J18981c2691A9467L3934b33175e845A38320
$$ plain form
9098 -145690 -174777 54843 -196900 -299066 -109200 35324 -55614 -175952 234317 -41831 163697
9086 31095 -153235 -150096 287833 118655 97143 254753 130626 -100068 267538 -245248
9075 -42593 -110659 -279737 144530 -4397 -256120 -139082 -95386 -106903 83826 -339061 -161826
9063 75643 -309496 24289 -67373 31992 60355 -169870 39821 -352186 38650 -161017 158433
9051 89310 -436997 15914 -64911 243502 -64758 -267581 -390692 -140371 -8688 21265 -21586
9039 9876 -100365 -230640 1117 -341856 11825 -558899 -202539 -358101 -36021 86473 -24448
9027 152339 12986 -28665 -306506 167544 65959 -208300 -467296 184495 -154738 321522
9016 81110 -42389 -81370 -31203 -247292 -128311 -32691 19467 53401 -233175 -5845 138320
9004h9428A77446c8373G716J71763C1333c73766a10561k08836l2627K9808B3884
8992b67235r1463a19422G3400K27012h3453K885A08019C6272b23548m5365A8988
8980a80351d2253C198P3157d8743k17652B57480A171g0786F0242a12303I9096
8968e9365b8899k19321R0311k96292i0775K5190B62122b10064f9290A84988a55121
8956b14661C4284c04848A01526K09584C1429c32079a34946o1769D471b45723A09963
8944e6169K6140j96754h7384l2195A81754b24832B5539a86610B27637q2128K28048
8933C73557F876a96995k7475A7631a32165C06984p1682k9016M42091Q34881L391086
8922D874344Q976069K621703E195162A425549o93095q4320C03245h3022B21789
$$ plain form
9004 -89428 177446 -38373 7716 179479 31333 -373766 -110561 -319397 -352024 -322216 23884
8992 -267235 -358698 -119422 73400 300412 -83453 -80568 108019 36272 -223548 -268913 18988
8980 -180351 -42253 3198 76355 -48743 -266395 257480 1171 -70786 60242 -112303 99096
8968 -59365 -28899 -248220 -157909 -454201 -90775 -65585 262122 -210064 -69290 184988 -155121
8956 -214661 34284 -304848 101526 311110 31429 -332079 -134946 -196715 4471 -245723 109963
8944 -56169 -30029 -226783 -87384 -119579 181754 -224832 25539 -186610 227637 145509 373557
8933 373557 6876 -196995 -224470 17631 -132165 306984 235302 206286 648377 1483258 4874344
8922 4874344 13850413 16472116 5195162 1425549 732454 648134 303245 -83022 221789
8912a89048L7211E2913J79464C5882K54766q7816G395a92949I3737R0606k5638
8901A58705a03573j81180i4031L8932F9435K10526b25631J9599h5986J9569M56
8890f5961A71050a8344A19109J60253G5691a88031A20870e4112j00145c9245q8906
8879a28151l4182g8286j03019L1444e1062k8212k04875a8427q3652m7939j07430
8868b57448a21951g42k23027A83181g8122j21099P1120M3393j77178A5264a96872
$$ plain form
8912 -189048 -151837 52913 232377 35882 290648 202832 7395 -192949 93737 184343 158705
8901 158705 -103573 -284753 -94031 -55099 69435 279961 -225631 -206032 -85986 -66417 -65961
8890 -65961 171050 -18344 119109 279362 75691 -188031 120870 -54112 -154257 -39245 -128151
8879 -128151 -162333 -78286 -181305 -149861 -51062 -79274 -284149 -18427 -102079 -150018 -257448
8868 -257448 -121951 -742 -223769 183181 -78122 -199221 -128101 -84708 -261886 15264 -196872
$$ [...]
##END NTUPLES=NMR SPECTRUM
##END=
