
##TITLE=UV1252_M10_1340-1211_30_7409573_IvnXkjSUgS
##JCAMPDX= 6.0         $$ Bruker NMR JCAMP-DX V2.0
##DATA TYPE= NMR SPECTRUM
##DATA CLASS= NTUPLES
##ORIGIN= BRUKER
##OWNER= Administrator
$$ 1.72 TOPSPIN		Version 2.1
$$ 2013-01-24 20:30:18.629 -0500  Administrator@X
$$ Compression mode = diff/dup
##.OBSERVE FREQUENCY= 400.02188249412
##.OBSERVE NUCLEUS= ^1H
##.ACQUISITION MODE= SIMULTANEOUS (DQD)
##.ACQUISITION SCHEME= undefined
##.AVERAGES= 8
##.DIGITISER RES= 22
##SPECTROMETER/DATA SYSTEM= spect
##.PULSE SEQUENCE= zg30
##.SOLVENT NAME= COFFEE_meoh
##.SHIFT REFERENCE= INTERNAL, COFFEE_meoh, 1, 14.98509
##AUDIT TRAIL= $$ (NUMBER, WHEN, WHO, WHERE, PROCESS, VERSION, WHAT)
$$ ##TITLE= Audit trail, TOPSPIN		Version 2.1
$$ ##JCAMPDX= 5.01
$$ ##ORIGIN= Bruker BioSpin GmbH
$$ ##OWNER= Administrator
$$ $$ E:\/data/COFFEE/nmr/UV1252_M10_1340-1211_30_7409573_IvnXkjSUgS/10/pdata/1/auditp.txt
$$ ##AUDIT TRAIL=  $$ (NUMBER, WHEN, WHO, WHERE, PROCESS, VERSION, WHAT)
(   1,<2013-01-24 20:30:10.675 -0500>,<Administrator>,<X>,<go>,<TOPSPIN 2.1>,
      <created by zg
	started at 2013-01-24 20:29:04.550 -0500,
	POWCHK enabled, PULCHK disabled,
       configuration hash MD5:
       86 BA 57 50 F2 9D 5C 9B 26 00 A9 28 5F 66 2E 89
       data hash MD5: 64K
       E5 9B 3F 25 49 6C 9B F3 4C 38 A4 A2 22 7B 83 B4>)
(   2,<2013-01-24 20:30:13.722 -0500>,<Administrator>,<X>,<proc1d>,<TOPSPIN 2.1>,
      <Start of raw data processing
       efp LB = 0 FT_mod = 6 PKNL = 1 PHC0 = 0 PHC1 = 0 SI = 32K 
       data hash MD5: 32K
       C7 C3 B8 AE 7B CB 40 F6 AE CB 72 99 A7 04 E5 94>)
(   3,<2013-01-24 20:30:14.175 -0500>,<Administrator>,<X>,<proc1d>,<TOPSPIN 2.1>,
      <pk PHC0 = 96.97632 PHC1 = 0 
       data hash MD5: 32K
       2C 86 D4 8B 5E AC 58 5C 9D 73 C4 2D 70 EC 13 53>)
(   4,<2013-01-24 20:30:14.410 -0500>,<Administrator>,<X>,<proc1d>,<TOPSPIN 2.1>,
      <abs ABSG = 1 
       data hash MD5: 32K
       91 EC DA 91 FE 98 13 96 D2 CA C2 BD E2 FE 1B B3>)
(   5,<2013-01-24 20:30:14.566 -0500>,<Administrator>,<X>,<proc1d>,<TOPSPIN 2.1>,
      <abs ABSG = 2 
       data hash MD5: 32K
       BB D2 72 EF 46 6D 0D D6 81 89 F7 E3 D2 86 97 2B>)
(   6,<2013-01-24 20:30:14.707 -0500>,<Administrator>,<X>,<proc1d>,<TOPSPIN 2.1>,
      <abs ABSG = 3 
       data hash MD5: 32K
       E2 6A 9B B6 C1 3A FF 83 FF 87 8B 89 13 3C EC 31>)
(   7,<2013-01-24 20:30:14.847 -0500>,<Administrator>,<X>,<proc1d>,<TOPSPIN 2.1>,
      <abs ABSG = 4 
       data hash MD5: 32K
       3E 52 B5 1F 35 D1 1D FD E0 79 E5 E8 BA 2D 89 26>)
(   8,<2013-01-24 20:30:15.019 -0500>,<Administrator>,<X>,<proc1d>,<TOPSPIN 2.1>,
      <abs ABSG = 5 
       data hash MD5: 32K
       80 47 2D F5 65 68 E7 26 F3 EB 49 D0 21 5A 1B 8D>)
$$ ##END=
$$ 
$$ $$ hash MD5
$$ $$ E1 ED 5F CD 23 34 B8 8A 9B 8B 51 26 D6 51 C8 80
##$RELAX= 
##$RELAX= 
##$RELAX= 
##$RELAX= 
##$RELAX= 
##$RELAX= 
##$RELAX= 
$$ Bruker specific parameters
$$ --------------------------
##$DU= <E:\>
##$EXPNO= 10
$$ [...]
150 150 150 150 150 150 150 150
##$TP07= 0
##$TPNAME0= <>
##$TPNAME1= <>
##$TPNAME2= <>
##$TPNAME3= <>
##$TPNAME4= <>
##$TPNAME5= <>
##$TPNAME6= <>
##$TPNAME7= <>
##$TPOAL= (0..7)
0.5 0.5 0.5 0.5 0.5 0.5 0.5 0.5
##$TPOFFS= (0..7)
0 0 0 0 0 0 0 0
##$TUNHIN= 0
##$TUNHOUT= 0
##$TUNXOUT= 0
##$USERA1= <user>
##$USERA2= <user>
##$USERA3= <user>
##$USERA4= <user>
##$USERA5= <user>
##$V9= 5
##$VALIST= <valist>
##$VCLIST= <CCCCCCCCCCCCCCC>
##$VD= 0
##$VDLIST= <DDDDDDDDDDDDDDD>
##$VPLIST= <PPPPPPPPPPPPPPP>
##$VTLIST= <TTTTTTTTTTTTTTT>
##$WBST= 1024
##$WBSW= 4
##$XGAIN= (0..3)
0 0 0 0
##$XL= 0
##$YL= 0
##$YMAX_a= 664937
##$YMIN_a= -565604
##$ZGOPTNS= <>
##$ZL1= 120
##$ZL2= 120
##$ZL3= 120
##$ZL4= 120
##$ABSF1= 14.98509
##$ABSF2= -5.573092
##$ABSG= 5
##$ABSL= 3
##$ALPHA= 0
##$AQORDER= 0
##$ASSFAC= 0
##$ASSFACI= 0
##$ASSFACX= 0
##$ASSWID= 0
##$AUNMP= <proc_prof1d_extract_pilot.lims>
##$AXLEFT= 0
##$AXNAME= <>
##$AXNUC= <1H>
##$AXRIGHT= 0
##$AXTYPE= 0
##$AXUNIT= <>
##$AZFE= 0.1
##$AZFW= 0.1
##$BCFW= 0
##$BC_mod= 0
##$BYTORDP= 0
##$COROFFS= 0
##$CY= 15
##$DATMOD= 1
##$DC= 0
##$DFILT= <>
##$DTYPP= 0
##$F1P= 0
##$F2P= 0
##$FCOR= 0.5
##$FTSIZE= 32768
##$FT_mod= 6
##$GAMMA= 0
##$GB= 0
##$INTBC= 1
##$INTSCL= 1
##$ISEN= 128
##$LB= 0
##$LEV0= 0
##$LPBIN= 0
##$MAXI= 10000
##$MC2= 0
##$MEAN= 0
##$ME_mod= 0
##$MI= 0
##$NCOEF= 0
##$NC_proc= -8
##$NLEV= 6
##$NOISF1= 0
##$NOISF2= 0
##$NSP= 0
##$NTH_PI= 0
##$NZP= 0
##$OFFSET= 14.98509
##$PC= 1
##$PHC0= 96.97632
##$PHC1= 0
##$PH_mod= 1
##$PKNL= yes
##$PPARMOD= 0
##$PPDIAG= 0
##$PPIPTYP= 0
##$PPMPNUM= 2147483647
##$PPRESOL= 1
##$PSCAL= 4
##$PSIGN= 0
##$PYNMP= <proc.py>
##$REVERSE= no
##$SF= 400.02
##$SI= 32768
##$SIGF1= 0
##$SIGF2= 0
##$SINO= 400
##$SIOLD= 32768
##$SPECTYP= <>
##$SREGLST= <1H.CDCl3>
##$SSB= 0
##$STSI= 32768
##$STSR= 0
##$SW_p= 8223.68421052631
##$SYMM= 0
##$S_DEV= 0
##$TDeff= 65536
##$TDoff= 0
##$TI= <>
##$TILT= no
##$TM1= 0
##$TM2= 0
##$TOPLEV= 0
##$USERP1= <user>
##$USERP2= <user>
##$USERP3= <user>
##$USERP4= <user>
##$USERP5= <user>
##$WDW= 1
##$XDIM= 32768
##$YMAX_p= 473724120
##$YMIN_p= -770113
##$CURPLOT= <Network HP LaserJet P1505>
##$CURPRIN= <$Network HP LaserJet P1505>
##$DFORMAT= <normdp>
##$LAYOUT= <+/1D_H.xwp>
##$LFORMAT= <normlp>
##$PFORMAT= <normpl>
##$SURQMSG= 1
$$ End of Bruker specific parameters
$$ ---------------------------------
##NTUPLES= NMR SPECTRUM
##VAR_NAME=  FREQUENCY,     SPECTRUM/REAL,   SPECTRUM/IMAG
##SYMBOL=    X,             R,               I
##VAR_TYPE=  INDEPENDENT,   DEPENDENT,       DEPENDENT
##VAR_FORM=  AFFN,          ASDF,            ASDF
##VAR_DIM=   32768,         32768,           32768
##UNITS=     HZ,            ARBITRARY UNITS, ARBITRARY UNITS
##FACTOR=    0.250966925370066, 1,           1
##FIRST=     8223.43324360094, -196066,      -173618
##LAST=      0,             14825,           -113003
##MIN=       0,             -770113,         0
##MAX=       8223.43324360094, 473724120,    0
$$ Real data points
##PAGE= N=1
##DATA TABLE= (X++(R..R)), XYDATA
$$ [...]
19530a33556l17858A76735i4962e870B02852b04572C1316a39013O2827q176o27
$$ -133556 -451414 176735 -94962 -5870 202852 -204572 31316 -139013 -76186 -84362 -84989
19519h4989B94358h4445k34922J37639A90359d5442k18949q86a8131D6932c07476
$$ -84989 294358 -84445 -319367 -181728 190359 -45442 -264391 -265277 -18131 46932 -307476
19507c3474n9141k7304j8659i99m9817A36930J9369i193l07928B66632a88157
$$ -33474 -92615 -119919 -138578 -999 -50816 136930 156299 -9193 -317121 266632 -188157
19495c48883d7288G1472k9042m208a42978n9896g0139K6197q1597a992m0328J5748
$$ -348883 -47288 71472 42430 38222 -142978 -202874 -70139 -43942 -125539 -1992 -42320 -26572
19483b6572j74929A7591R715e4859H1721J18330l3739a67987c6832o5913c0208
$$ -26572 -201501 17591 27306 -54859 81721 200051 166312 -167987 -36832 -102745 -30208
19471b94454N1709k05001a26778l86118a62544C6917b05046d090r3309k17698
$$ -294454 -242745 -447746 -126778 -512896 -162544 36917 -205046 -4090 -97399 -315097
19461c15097a48923D2929P8214c19073a13412I3932a00605j90544b2949r8905
$$ -315097 -148923 42929 121143 -319073 -113412 93932 -100605 -291149 -22949 -121854
19451a21854A21182b63436L1167B38565a84029B35475b9131B1023a31991b5120
$$ -121854 121182 -263436 -232269 238565 -184029 235475 -29131 21023 -131991 -25120
19440A52672j7325A7285d207j10143j39620J23944I103P2305l1123L6751e4230
$$ 152672 135347 17285 -4207 -114350 -253970 -130026 9103 81408 50285 87036 -54230
19428C34150a14764F5549a74696C7051a4120r0008A55453c95847A77751a14751
$$ 334150 -114764 65549 -174696 37051 -14120 -104128 155453 -395847 177751 -114751
19417B48121j6968a38709b4997A08621m1521a17525D8870M8804J14979a95959
$$ 248121 231153 -138709 -24997 108621 67100 -117525 48870 97674 212653 -195959
19406a03535C06214b37384J01405k1745B8836a67575B9343c66539D909a37119
$$ -103535 306214 -237384 -135979 -157724 28836 -167575 29343 -366539 4909 -137119
19395b72813c0096B19052a05491j18450O6354G007N0767h9124B6639L6287k7094
$$ -272813 -30096 219052 -105491 -223941 -157587 7007 57774 -89124 26639 62926 35832
19384C5832O4760b59693A25830P1099f4919l19211B13598q1713c67831I8090e5984
$$ 35832 100592 -259693 125830 196929 -64919 -384130 213598 131885 -367831 98090 -55984
19372D2257a58767A04925e5911a7023B11867H7620Q260g6878D3545a5756l25347
$$ 42257 -158767 104925 -55911 -17023 211867 87620 95880 -76878 43545 -15756 -341103
19361c41103f1415k1368c5163C1170b32928A68614J76717a49395k8636B0234a29029
$$ -341103 -61415 -82783 -35163 31170 -232928 168614 345331 -149395 -178031 20234 -129029
19349I1339a55822L3070D4160J17332a17134K8705b8649C4732J15077h5602O063
$$ 91339 -155822 -122752 44160 161492 -117134 -88429 -28649 34732 149809 -85602 -79539
19338g9539L7276m1718C8295a93934c8963a0726k02578B01728a31509A90077a01692
$$ -79539 -42263 -83981 38295 -193934 -38963 -10726 -213304 201728 -131509 190077 -101692
19326a38966e2739j27891d9967k25498O8585c0975l38043g3621j22515h2097K345
$$ -138966 -52739 -180630 -49967 -275465 -206880 -30975 -369018 -73621 -196136 -82097 -79752
19315g9752L947j90109A6771f797k09583A18267a43269k62525a66597j7031D1583
$$ -79752 -75805 -265914 16771 -6797 -216380 118267 -143269 -405794 -166597 -183628 41583
19303g3042m54316K29309J25132B12824i5155A44542l2432a87736C57365A8034
$$ -73042 -527358 -298049 -172917 212824 -95155 144542 112110 -187736 357365 18034
19292d12895f765l50721B8803f5464K607j38732j70983a3971B9888p632d68772
$$ -412895 -6765 -357486 28803 -65464 -62857 -201589 -372572 -13971 29888 22256 -468772
19280a79543A7217D124P5298b08075H398b04418n4894b1765B18079p8676a31944
$$ -179543 17217 4124 79422 -208075 8398 -204418 -259312 -21765 218079 139403 -131944
19268A51062a0042C39712C3852c64194A52455N050K7557i5231j25181e7145b1640
$$ 151062 -10042 339712 33852 -364194 152455 157505 185062 -95231 -220412 -57145 -21640
19256a25536A55138b64069h5846n7603j01014A17137a03034D5791b36860B28275
$$ -125536 155138 -264069 -85846 -143449 -244463 117137 -103034 45791 -236860 228275
19245a20538k4742A6599c5045l01670f6549A46324b61714N7421G6112h1187k4403
$$ -120538 -145280 16599 -35045 -336715 -66549 146324 -261714 -204293 76112 -81187 -105590
19234a05590D7276A2968a92888L8749A87724G1334A4397R7563a61913p4435g2095
$$ -105590 47276 12968 -192888 -154139 187724 71334 14397 111960 -161913 -236348 -72095
19222a38496C03993g4781A69934L7344a70243A09081a30970A3931L5151a30971
$$ -138496 303993 -74781 169934 207278 -170243 109081 -130970 13931 49082 -130971
19211A0799J2389P3936J41058b24056e2159n5219A64936a70342A56976c71956
$$ 10799 23188 97124 238182 -224056 -52159 -107378 164936 -170342 156976 -371956
19200D5478m804b70457B70184a96347l4857j72236A2031K89287a17105e0384l3555
$$ 45478 40674 -270457 270184 -196347 -231204 -403440 12031 301318 -117105 -50384 -83939
19189h3939a6245A96290C7171a24974O935K9100K4119K5887k29413A29853a97477
$$ -83939 -16245 196290 37171 -124974 -118039 -88939 -64820 -38933 -268346 129853 -197477
19177d9752l3527o6045B66668F0071j8006N520b7598B39032F9961a19895C981
$$ -49752 -83279 -149324 266668 60071 42065 47585 -27598 239032 69961 -119895 3981
19165C630a3940j85925g356B582O4707b47872M2472a4476G4848O2852g1509o2745
$$ 3630 -13940 -199865 -7356 2582 67289 -247872 -205400 -14476 74848 137700 -71509 -134254
19153a34254j01435E2013a33105j74207i4214A74504j3457i821j88556K5216g08
$$ -134254 -235689 52013 -133105 -307312 -94214 174504 161047 -9821 -198377 -173161 -708
19141B2744b6961m46873A50007e6090B29247a06938A00107a17001n1721B14839
$$ 22744 -26961 -473834 150007 -56090 229247 -106938 100107 -117001 -168722 214839
19130i7334C1296A5585J07561g2919j23725j09644e6320j81215N3745j97637a90644
$$ -97334 31296 15585 123146 -72919 -196644 -306288 -56320 -237535 -183790 -381427 -190644
19118B66968B973a16030C2531K99291a95805j92611i8005A07696J4526a14220
$$ 266968 2973 -116030 32531 331822 -195805 -388416 -98005 107696 122222 -114220
19107g9642A66029l9998D3791K29701j36506e48989E53727b18381B01975A4359
$$ -79642 166029 126031 43791 273492 136986 -548989 553727 -218381 201975 14359
19096E7808o609O4894a06114B30882c188p4843A58283C0479b34910B3815Q0731
$$ 57808 51199 116093 -106114 230882 -3188 -78031 158283 30479 -234910 23815 104546
19085A04546a83242A38014b10539f6010j72675A6051K03353M4564l6256D6252
$$ 104546 -183242 138014 -210539 -66010 -238685 16051 219404 263968 227712 46252
19074g98A35599A6132a85863J990f8929A14273g6650r2247D1570c10527J13593
$$ -798 135599 16132 -185863 -183873 -68929 114273 -76650 -168897 41570 -310527 -196934
19063a96934Q6110j39966a6538l44821R7737o2206e4995A21739a0270j45617g6560
$$ -196934 -110824 -250790 -16538 -361359 -263622 -325828 -54995 121739 -10270 -155887 -76560
19051a18217p6338k5035c3280k28548A41549d07956B43484F8857b71716i7863
$$ -118217 -194555 -219590 -33280 -261828 141549 -407956 243484 68857 -271716 -97863
19040b97523A16042K21499h2042B33941c63271d45C6848f7078a801A9989a17617
$$ -297523 116042 337541 -82042 233941 -363271 -445 36848 -67078 -1801 19989 -117617
19028B37558f2073A64608E1504J50034E2083j210Q9250j8738D5957a74678F3647
$$ 237558 -62073 164608 51504 201538 52083 50873 140123 121385 45957 -174678 63647
19016a19543M0783j2323I5061a61628b2631j77507o2611g0273j75581d7396M650
$$ -119543 -78760 -91083 95061 -161628 -22631 -200138 -262749 -70273 -245854 -47396 -42746
19005d2746A36317a11668k7212j52588A50121e90383J94585a943j34431e8771
$$ -42746 136317 -111668 -138880 -291468 150121 -590383 -395798 -1943 -136374 -58771
18994c61842O2981L0792C62924H216f2839A24507a04410e1003l9038B80368f7019
$$ -361842 -298861 -268069 362924 8216 -62839 124507 -104410 -51003 -90041 280368 -67019
18982b81364G8593b49545C3372b04627N1719K7899d9209r1700j8859k7656A66909
$$ -281364 78593 -249545 33372 -204627 -152908 -125009 -49209 -140909 -159768 -187424 166909
18970a71617M6383b3851B34852l2659b70009l4689H2744J3115h3675c4303l22309
$$ -171617 -125234 -23851 234852 202193 -270009 -304698 82744 95859 -83675 -34303 -356612
18959c56612i7373H9664b44682j24392B20362a43004m13927b14468A09689M6350
$$ -356612 -97373 89664 -244682 -369074 220362 -143004 -556931 -214468 109689 156039
18949A56039B1328J98223b0206C95001A61607e0007A59192D4737c75246R8482
$$ 156039 21328 219551 -20206 395001 161607 -50007 159192 44737 -375246 -276764
18939b76764M8324B07693b1013o0267C97361i1152m3500k52780b1211l67175J31637
$$ -276764 -228440 207693 -21013 -81280 397361 -91152 -134652 -387432 -21211 -388386 -256749
18928b56749c4136C58851b36900E590c1861j1411n5690L8776k37996B31451L4525
$$ -256749 -34136 358851 -236900 5590 -31861 -43272 -98962 -60186 -298182 231451 265976
18917B65976a33357g82B03750r0186J94843b48320e3378l02585B7317L48881b39829
$$ 265976 -133357 -782 203750 113564 308407 -248320 -53378 -355963 27317 376198 -239829
18905g4236r8511P8771n609j35059P4748j5448L7227c0036k74409L0376Q3663
$$ -74236 -172747 -93976 -99585 -234644 -159896 -175344 -138117 -30036 -304445 -274069 -190406
18894a90406e8782K4663A48789g6111j44152d3005A33778c41076B74362A26590
$$ -190406 -58782 -34119 148789 -76111 -220263 -43005 133778 -341076 274362 126590
18883d78879C82157a26994A32274d66850g942k06747C50010A03676b01542M9933
$$ -478879 382157 -126994 132274 -466850 -7942 -214689 350010 103676 -201542 -151609
18873a51609d9273q015A53587B5001g0118A2691R4072b47460c7958B66749c04039
$$ -151609 -49273 -57288 153587 25001 -70118 12691 106763 -247460 -37958 266749 -304039
18861c6244k90275A54622o2870e0865A33127a9273C4589J43116G892a23099B64744
$$ -36244 -326519 154622 91752 -50865 133127 -19273 34589 177705 7892 -123099 264744
18849A61935c04133A46289P8977l3568a32252e4315A71684A5320b60729r7099
$$ 161935 -304133 146289 225266 191698 -132252 -54315 171684 15320 -260729 -357828
18839c57828c779F2293h4656C73745j50321D1024c27677G5304K08824G8659P1462
$$ -357828 -3779 62293 -84656 373745 223424 41024 -327677 75304 284128 78659 150121
18828A50121e4523A71436a25428F408b60711A10443b23269R0595o0024A98031
$$ 150121 -54523 171436 -125428 6408 -260711 110443 -223269 -132674 -192698 198031
18817A15603C7791N1452a56264B61268H2446c3676F5672b05259B12656a169A05449
$$ 115603 37791 89243 -156264 261268 82446 -33676 65672 -205259 212656 -1169 105449
18805B21556G8072c71293J49219h0729a2619A12022a50853n5435K6344g8179F07809
$$ 221556 78072 -371293 -222074 -80729 -12619 112022 -150853 -206288 -179944 -78179 607809
18793f6003C9585e3083m2346j39964r6088A87369h2706m5541d575A45659M887
$$ -66003 39585 -53083 -95429 -235393 -331481 187369 -82706 -128247 -4575 145659 150546
18782A50546D0029J9690b39061B16817b94665a39383I6056C8030K3771d03131
$$ 150546 40029 59719 -239061 216817 -294665 -139383 96056 38030 61801 -403131
18771D0089K7105c18229E7665a98580A34930c08212F7013I670b00947q4086h2309
$$ 40089 67194 -318229 57665 -198580 134930 -308212 67013 9670 -200947 -285033 -82309
18759A57817b56792A66048e1134B18786L099a03354j82201a24273A92865a29754
$$ 157817 -256792 166048 -51134 218786 221885 -103354 -285555 -124273 192865 -129754
18748a09684P558A51597j901L3582a0758k63256c3758j4233j16820A37163K34094
$$ -109684 -102126 151597 149696 183278 -10758 -274014 -33758 -47991 -164811 137163 371257
18737C71257e9362r8182G3853a65728q2548m1358J15378M9322a9050j38338a081
$$ 371257 -59362 -157544 73853 -165728 -248276 -289634 -174256 -124934 -19050 -157388 -1081
18725c7530l53543r8811a22346b890k23487E3758R0716d9036D9665b51128i8485
$$ -37530 -391073 -489884 -122346 -2890 -226377 53758 144474 -49036 49665 -251128 -98485
18713a64160C40656j61637a51969E4129J7294E398a95961F7504p143b74929B27854
$$ -164160 340656 179019 -151969 54129 71423 5398 -195961 67504 60361 -274929 227854
18701a25062B52646D9430b90455g905k2877A982b09101k3021L5433b055q8303
$$ -125062 252646 49430 -290455 -7905 -30782 1982 -209101 -232122 -196689 -2055 -90358
18690i0358k42554K5461B1908J02361b37145A21319a89420I0912l9121c24832
$$ -90358 -332912 -307451 21908 124269 -237145 121319 -189420 90912 51791 -324832
18679a5733A1275J03868j6312K57a08028A99268c27008D8568K21984D4365M8316
$$ -15733 11275 115143 98831 99088 -108028 199268 -327008 48568 270552 44365 92681
18668I2681j0626P2778C9259b11629n2086A69154b85589a21775J4775k07917J56027
$$ 92681 82055 154833 39259 -211629 -263715 169154 -285589 -121775 -107000 -314917 -158890
18657a58890e3887A63849i9359k20200l397e3752G8303a56820j32125A99154j8715
$$ -158890 -53887 163849 -99359 -319559 -322956 -53752 78303 -156820 -288945 199154 180439
18646A80439L20916b31216g0022A01675a40835j80982F6025L1139b09299L0758
$$ 180439 501355 -231216 -70022 101675 -140835 -321817 66025 97164 -209299 -178541
18636a78541j63733I2855K708b14610c0207o5377A6910a76241e0107G6810c44322
$$ -178541 -342274 92855 95563 -214610 -30207 -95584 16910 -176241 -50107 76810 -344322
18624e0148A01810a42906j20821B03831b11877A14536j7470b39802a19013B48064
$$ -50148 101810 -142906 -263727 203831 -211877 114536 97066 -239802 -119013 248064
18613a13192k72939C0968J41459b56738O3516I8727b32096B85230H6299b18064
$$ -113192 -386131 30968 172427 -256738 -193222 98727 -232096 285230 86299 -218064
18602A92865c9890a4572m2081C0400e3540l02828a56045d6810k12919A67802h0170
$$ 192865 -39890 -14572 -56653 30400 -53540 -356368 -156045 -46810 -259729 167802 -80170
18590a64949A04891b04018M5071f0387H3526O6394L5953N4330a51780l5139n1006
$$ -164949 104891 -204018 -158947 -60387 83526 149920 185873 240203 -151780 -186919 -237925
18579b37925O4416f0323G3098A4855P4011J62463a38240J2895H6808J32609f27050
$$ -237925 -173509 -60323 73098 14855 88866 251329 -138240 -125345 86808 219417 -627050
18567c12000C3545a76899I1018M9288a81409L3345H1320b0365A11381c14393e3516
$$ -312000 33545 -176899 91018 140306 -181409 -148064 81320 -20365 111381 -314393 -53516
18555b21334a06666o0640C27614c98121C2206M1590b39183C54805b19369E7067
$$ -221334 -106666 -167306 327614 -398121 32206 73796 -239183 354805 -219369 57067
18544c0364A74839a65402k60742a97562F6757a77702B1186d67999a21095C1241
$$ -30364 174839 -165402 -426144 -197562 66757 -177702 21186 -467999 -121095 31241
18533A68718b15986k7891j88748M9396P2648D62209a78778B04898a38169A87545
$$ 168718 -215986 -243877 -432625 -383229 -310581 462209 -178778 204898 -138169 187545
18522F4959L2198b15772j28971J25129i9689L4662B06507f1636j41386O3560c3245
$$ 64959 97157 -215772 -344743 -219614 -99689 -65027 206507 -61636 -203022 -139462 -33245
18510A23129M168c11552M3410a31538A22134e9631j89017j57151Q3447a31947
$$ 123129 127297 -311552 -268142 -131538 122134 -59631 -248648 -405799 -322352 -131947
18499g0469E0831i5549B2865a98490j58326B50466A16183a67384K8918D9772a1261
$$ -70469 50831 -95549 22865 -198490 -356816 250466 116183 -167384 -138466 49772 -11261
18487A58366a16351p4333C6552g3650j23904A3498h7335B40705a79176A30727
$$ 158366 -116351 -190684 36552 -73650 -197554 13498 -87335 240705 -179176 130727
18476C561J35015M2623n0456d34079h471E1611Q5158J82901c83629J62072h0674
$$ 3561 138576 181199 130743 -434079 -8471 51611 136769 319670 -383629 -221557 -80674
18464A55931g8921B65355a5087j16201j68638k2025B4156b71709N0817l5447b7592
$$ 155931 -78921 265355 -15087 -131288 -299926 -321951 24156 -271709 -220892 -256339 -27592
18452C55907A14272a94165c5666B24041K4891a7218j77295A34983c23408E2515
$$ 355907 114272 -194165 -35666 224041 248932 -17218 -194513 134983 -323408 52515
18441C4504c66677J22407j03003f4095k4191C0574a25745c4683o8258o3466f219
$$ 34504 -366677 -244270 -347273 -64095 -88286 30574 -125745 -34683 -102941 -166407 -6219
18429B02856J600c9875J7506j45329j24028A42849l6922i2502n8311p4855O495
$$ 202856 204456 -39875 -22369 -167698 -291726 142849 105927 -92502 -150813 -225668 -219173
18418b19173C10536q0168c07732C1174J42117E3780j5095l686b20618G3801J57573
$$ -219173 310536 230368 -307732 31174 173291 53780 38685 34999 -220618 73801 231374
18407B31374b05892i0413A38528j3350L7841g1036j05973N9595C4525a84723o541
$$ 231374 -205892 -90413 138528 125178 163019 -71036 -177009 -117414 34525 -184723 -191264
18396a91264A18160J32249E4231b132A77326d5811E9284K76875c1483j52797B28413
$$ -191264 118160 250409 54231 -2132 177326 -45811 59284 336159 -31483 -184280 228413
18384a07610r1247A75622i8793A70142a18328C63102A45107e2314A40217h2908
$$ -107610 -198857 175622 -98793 170142 -118328 363102 145107 -52314 140217 -82908
18373A3932b15119d1186A56857m3806f9986B4999a57660g2899P959m3080H5668
$$ 13932 -215119 -41186 156857 113051 -69986 24999 -157660 -72899 -64940 -108020 85668
18361G7628a61094j07249A09996j9897B6537Q181J3761b9872H2282c49333f8627
$$ 77628 -161094 -268343 109996 90099 26537 34718 48479 -29872 82282 -349333 -68627
18349E1682J47386a29173B0719a94609N6137C36008a20308q804C7387L9447a61966
$$ 51682 199068 -129173 20719 -194609 -138472 336008 -120308 -129112 37387 76834 -161966
18337a05039G1008a38745f8862l38994f98k14191A05609b87451J31180A04346
$$ -105039 71008 -138745 -68862 -407856 -698 -214889 105609 -287451 -156271 104346
18326b16693d1938l23402J50661K9260B07554g543j6373l6751F4510a23983j08181
$$ -216693 -41938 -365340 -214679 -185419 207554 -7543 -23916 -60667 64510 -123983 -232164
18315b32164H9337c19402a01233j31444j93113f2324b8479D2317N4916a8794B6152
$$ -232164 89337 -319402 -101233 -232677 -425790 -62324 -28479 42317 97233 -18794 26152
18303b8016D853f9161o4716m62340B56718c9600j21418c7667E9825R4815b28587
$$ -28016 4853 -69161 -133877 -596217 256718 -39600 -161018 -37667 59825 154640 -228587
18291C10629h8213c6763k79717O1081d1379q4436a9503D490i9195A07155n605
$$ 310629 -88213 -36763 -316480 -255399 -41379 -125815 -19503 4490 -99195 107155 101550
18280A01550J39262A0616O5286h3729B70135R223J78955A46949J6609d50370a06013
$$ 101550 240812 10616 75902 -83729 270135 279358 458313 146949 163558 -450370 -106013
18268A06020J23522C073b7804o3345b8800B59190a20229j69463A82083a12664
$$ 106020 229542 3073 -27804 -91149 -28800 259190 -120229 -289692 182083 -112664
18257A1022Q5472j0352b68560h5741I0026A8974b7858n6778K055A56559l9184
$$ 11022 96494 86142 -268560 -85741 90026 18974 -27858 -84636 -82581 156559 117375
18246A17375b5457j48101b5333o1782E4087K30424D3806a01182p2854L8679L3796
$$ 117375 -25457 -173558 -25333 -87115 54087 284511 43806 -101182 -174036 -135357 -101561
18235a01561j10152a7662k37158Q9120e9965A9277M34120b27910i3798a7171r6582
$$ -101561 -211713 -17662 -254820 -165700 -59965 19277 453397 -227910 -93798 -17171 -113753
18224a13753O135l3669a6006A95576b15872A01024b28749J01237k1127B32712
$$ -113753 -107618 -141287 -16006 195576 -215872 101024 -228749 -127512 -148639 232712
18213D93317g6061b6032l3B9231J81210M2030A16787d9166k0354b6905A5371J13233
$$ 493317 -76061 -26032 -26065 29231 210441 252471 116787 -49166 -69520 -26905 15371 128604
18201A28604a06466D5023J19300b68793J14015m0901A8999a44977D969a5027r4880
$$ 128604 -106466 45023 164323 -268793 -154778 -195679 18999 -144977 4969 -15027 -109907
18190a09907j07643A8863c8058I6737g5487c5848j00764K2675A07265j0886f3263
$$ -109907 -217550 18863 -38058 96737 -75487 -35848 -136612 -113937 107265 96379 -63263
18178I8796c9442A340h2556l2017A7926J68171b44526a05850A5386h8108L835
$$ 98796 -39442 1340 -82556 -114573 17926 186097 -244526 -105850 15386 -88108 -84273
18167h4273E6367b79392a34264k47740G8880a96788A01891a69822b887k3376r4813
$$ -84273 56367 -279392 -134264 -382004 78880 -196788 101891 -169822 -2887 -26263 -121076
18156a21076E1801b43442g2993k7118o0664a1251r7814A89382a16079j1919A01045
$$ -121076 51801 -243442 -72993 -100111 -160775 -11251 -109065 189382 -116079 -127998 101045
18144D211a19271p2888H3603Q4888a40486b7886A1176a27369H122a30441j95649
$$ 4211 -119271 -192159 83603 168491 -140486 -27886 11176 -127369 8122 -130441 -326090
18133c26090a24758H4800b8080B37228C3448K93114b62848J25488A72416E255
$$ -326090 -124758 84800 -28080 237228 33448 326562 -262848 -137360 172416 5255
18122C66961B6089K86521a65225A9951d08881g8424j45412j6088E8700c22147
$$ 366961 26089 312610 -165225 19951 -408881 -78424 -223836 -239924 58700 -322147
18111A63904b83816B00540d11205B7439b6991F5120c29102C12850c58996A78066
$$ 163904 -283816 200540 -411205 27439 -26991 65120 -329102 312850 -358996 178066
18100h7584B77582j19547K48438G8909a91515O5787d702j66486j73216c9477D8265
$$ -87584 277582 158035 406473 78909 -191515 -125728 -4702 -171188 -344404 -39477 48265
18088A20284l5707R1446a69462B33798r1744E3617a54773e1132j20779E6467e9382
$$ 120284 84577 176023 -169462 233798 142054 53617 -154773 -51132 -171911 56467 -59382
18076A35309P0991f4905l6227A18008d5273A18470c54416A3844P630a24465k75012
$$ 135309 206300 -64905 -101132 118008 -45273 118470 -354416 13844 21474 -124465 -399477
18065c99477g5508p0639N0019M3479A40414b62795i1329L3160a7223E30076A80747
$$ -399477 -75508 -146147 -96128 -52649 140414 -262795 -91329 -58169 -17223 530076 180747
18053d0584B13934p1013M5615I2002a97839p3597a22018m4269A73325B3054g0883
$$ -40584 213934 142921 188536 92002 -197839 -271436 -122018 -166287 173325 23054 -70883
18041a19446D14194c4605A66585a09467m810M4791m3979E6606c77705f3090B05657
$$ -119446 414194 -34605 166585 -109467 -114277 -69486 -113465 56606 -377705 -63090 205657
18029a01292l06300a89315O2806a4209B72541b62759J07652A34484a87808B46016
$$ -101292 -407592 -189315 -126509 -14209 272541 -262759 -155107 134484 -187808 246016
18018B34244d49714B69597a65982A02995j7954d25682B2110d35138A20918C7517
$$ 234244 -449714 269597 -165982 102995 85041 -425682 22110 -435138 120918 37517
18007F9556a43818A99978h2413k07711b2608A8000J12539h644q9685M560J92A20636
$$ 69556 -143818 199978 -82413 -290124 -22608 18000 130539 -8644 -98329 -93769 -93577 120636
17994C18533A56179j3906m6931a36045A0130e1971k60038C9616K35492e2962A50472
$$ 318533 156179 142273 95342 -136045 10130 -51971 -312009 39616 275108 -52962 150472
17982B6942B372a65693A165K78500a03114b0208q4775j52980h4464B48996e184
$$ 26942 2372 -165693 1165 279665 -103114 -20208 -104983 -257963 -84464 248996 -5184
17970c36115a19042m0321m0895A02899c92122i3127j36076f3358j42412O2350
$$ -336115 -119042 -159363 -200258 102899 -392122 -93127 -229203 -63358 -205770 -143420
17960a43420k54457a38080c1238q8377A18637H824a71484d6676A77600e8613j88063
$$ -143420 -397877 -138080 -31238 -119615 118637 8824 -171484 -46676 177600 -58613 -246676
17949b46676J18470A85095b758j80483D14268a59073H0500f0599K4368I9757m5275
$$ -246676 -128206 185095 -2758 -183241 414268 -159073 80500 -60599 -36231 99757 54482
17938E4482J89367A10080C3782c81788a63783e6013O077q8002B4875D99a18061
$$ 54482 243849 110080 33782 -381788 -163783 -56013 -49936 -137938 24875 499 -118061
17926I8503J29837j09089c134B25222e6827k33864a13218b4832l24697A6191b61147
$$ 98503 228340 119251 -3134 225222 -56827 -290691 -113218 -24832 -349529 16191 -261147
17914C66007h7604A11858b4611G5441M37479c20108h607A25685C3981O7508l1358
$$ 366007 -87604 111858 -24611 75441 512920 -320108 -8607 125685 33981 101489 70131
17903G0131A198M3961J32429E0803J37561a72584M6845j8803D5193a33691b4699
$$ 70131 1198 45159 177588 50803 188364 -172584 -125739 -144542 45193 -133691 -24699
17891A56811b64251j00110J3249A60496G2586a0871m28093J91013I6435l8296
$$ 156811 -264251 -364361 -351112 160496 72586 -10871 -438964 -247951 96435 58139
17881E8139f1016C06409a89419A2609Q8322d190C11040c83990A80324e657k21754
$$ 58139 -61016 306409 -189419 12609 100931 -4190 311040 -383990 180324 -5657 -227411
17870b27411A5144J83845L3263J5204A4412b71859I540J40746e1775B1453a39421
$$ -227411 15144 198989 232252 247456 14412 -271859 9540 150286 -51775 21453 -139421
17858d92256b2844j04899d2177A21302C8764K54433C2055A2272a17560b4720A23561
$$ -492256 -22844 -127743 -42177 121302 38764 293197 32055 12272 -117560 -24720 123561
17846a87540A1904a41520p811P0179B20575f36011b9808m0159A03471l3613J2398
$$ -187540 11904 -141520 -149331 -79152 220575 -636011 -29808 -69967 103471 69858 82256
17835H2256M1941L71503j31655A64061c00407c7724j3507A95520F4661e79697
$$ 82256 124197 495700 364045 164061 -300407 -37724 -51231 195520 64661 -579697
17824B27216a82487E4471P5248a4661r88B4077c1666j74850a1117C54350a15952
$$ 227216 -182487 54471 129719 -14661 -15649 24077 -31666 -206516 -11117 354350 -115952
17812b28268I4223J36190a18265M5378A37982Q8163I6443J77852B5466M2182d37107
$$ -228268 94223 230413 -118265 -72887 137982 226145 96443 274295 25466 67648 -437107
17800A56932c12252A76498b08713e136j58011Q1297C50848b18922b3520A88237
$$ 156932 -312252 176498 -208713 -5136 -163147 -81850 350848 -218922 -23520 188237
17789C8609a80157A20451a93091A67204N7311a02185J3841A92466F3008e4521
$$ 38609 -180157 120451 -193091 167204 224515 -102185 -88344 192466 63008 -54521
17778f1853o3594N6386C63185a77716L0950A22288c04634L0149J12033A1226a20248
$$ -61853 -125447 -69061 363185 -177716 -146766 122288 -304634 -274485 -162452 11226 -120248
17766A45018a68013b762m3036j13290d9560j18447O7241A53937c4085C52435r9406
$$ 145018 -168013 -2762 -45798 -159088 -49560 -168007 -100766 153937 -34085 352435 253029
17755B53029a61246A35386b5482q0640j57544C75315m6238d335k49854B29661
$$ 253029 -161246 135386 -25482 -106122 -263666 375315 329077 -4335 -254189 229661
17744F3603O4272o1080k0555a08183b4099B46374A12967R1893A0640J27122J6148
$$ 63603 127875 66795 46240 -108183 -24099 246374 112967 204860 10640 137762 153910
17733A53910a02869I2372D3398P301A4275P094M7680a37823B68149J81778a27988
$$ 153910 -102869 92372 43398 50699 14275 21369 69049 -137823 268149 449927 -127988
17721B67145a55099A064K45051a8150L370j31323j09505f9505o7557O3411F6592
$$ 267145 -155099 1064 246115 -18150 -14780 -146103 -255608 -69505 -137062 -73651 66592
17709F3265a77211A51658J3751o8001B5979f6453A20049M7684F8182l2348M4035
$$ 63265 -177211 151658 165409 97408 25979 -66453 120049 167733 68182 35834 79869
17698G9869f6283A8476J7790K63630e7090A14108A3790J55169h7859E9708b5364
$$ 79869 -66283 18476 36266 299896 -57090 114108 13790 168959 -87859 59708 -25364
17686g1190a6061E4146c10831J20012i1806C24665C444L57513d597r1424B58732
$$ -71190 -16061 54146 -310831 -190819 -91806 324665 3444 360957 -4597 -96021 258732
17674C91190h9611A31354m0728K76856J16319c24681B7856J61049b2784A50137
$$ 391190 -89611 131354 90626 367482 483801 -324681 27856 188905 -22784 150137
17663A01569i4437d4677A00306B3751R2647b5006B4078A0730c3675l6925A14584
$$ 101569 -94437 -44677 100306 23751 116398 -25006 24078 10730 -33675 -70600 114584
17651c34239a55531B22573a34860B99858h1421j35485F6290a16698B61771D7246
$$ -334239 -155531 222573 -134860 299858 -81421 -216906 66290 -116698 261771 47246
17640H9689b39846A61117a60081A2673R318a2339C5167a8381k21652J07678e0339
$$ 89689 -239846 161117 -160081 12673 21991 -12339 35167 -18381 -240033 -132355 -50339
17628I8197M9949J12701a56317C80906b31490J4717q2159J24028A66048J05063
$$ 98197 148146 260847 -156317 380906 -231490 -216773 -298932 -174904 166048 271111
17618B71111E9828J14640H4244O7068K18257j41585R6600f8345r198m5716B0759
$$ 271111 59828 174468 84244 151312 369569 227984 324584 -68345 -77543 -123259 20759
17606b39699f4019C40576F596a21238p2676e065A00205e4092C4981R9552E2010
$$ -239699 -64019 340576 6596 -121238 -193914 -5065 100205 -54092 34981 134533 52010
17594h7158N307j71734A15102c08174D73724A43409e8577j36997J9382c9329A8114
$$ -87158 -81851 -253585 115102 -308174 473724 143409 -58577 -195574 -176192 -39329 18114
17582b45125A05080a30925d1030F9306K51N1334L23817A65829h8439K9358l85034
$$ -245125 105080 -130925 -41030 69306 69557 120891 444708 165829 -88439 -59081 -444115
17571d44115A52191h5235L9906C39214a13018b7464l3377a4302M045C19917A9009
$$ -444115 152191 -85235 -45329 339214 -113018 -27464 -60841 -14302 -10257 319917 19009
17559d4646C11402I7960N3642n4358B4545d8242A26327B2124K96796c08386C4707
$$ -44646 311402 97960 151602 97244 24545 -48242 126327 22124 318920 -308386 34707
17547C29136a54178F2235h9884j294A81949p345J70533A37225E5519a07897B31339
$$ 329136 -154178 62235 -89884 -91178 181949 174604 345137 137225 55519 -107897 231339
17535g6876I7557b60299J30095k01285A59424a40465e6786k4494I5862C8125c4890
$$ -76876 97557 -260299 -130204 -331489 159424 -140465 -56786 -81280 95862 38125 -34890
17523I6510m1372A7375h4301C35044d3672B94970c82817A55469a29935C48270
$$ 96510 55138 17375 -84301 335044 -43672 294970 -382817 155469 -129935 348270
17512C07914E4873J39275o2422J81147G3677K70864b01672A8047l59b0695D770
$$ 307914 54873 194148 131726 312873 73677 344541 -201672 18047 17688 -20695 4770
17500a63198B92468r5536J4212q5053M6917J64143G8812R2348P1900A14269J28609
$$ -163198 292468 196932 211144 126091 173008 337151 78812 171160 243060 114269 242878
17489B42878J38608a58200A27540A9751M7269L22313A82041R0293D527a31722
$$ 242878 381486 -158200 127540 19751 67020 389333 182041 272334 4527 -131722
17478A29343g6519A24902e1831B98198C3792K21606I5940b43016A10965c32013
$$ 129343 -76519 124902 -51831 298198 33792 255398 95940 -243016 110965 -332013
17467C26765A34491b1374j30540A79789q6104J20587i0916d0316A47427i2011
$$ 326765 134491 -21374 -151914 179789 93685 214272 -90916 -40316 147427 -92011
17456A22204J00663J05766I9093J25670J6366J85207J27808A53101K2584J42947
$$ 122204 222867 328633 99093 224763 241129 426336 554144 153101 175685 318632
17446C18632A01745n224n396Q0105q5280Q2445a43888E35053j06486l5206b22049
$$ 318632 101745 96521 91125 171230 85950 168395 -143888 535053 428567 393361 -222049
17434C69606f5890B84689l6316M4242i7641C80003a23121C62781A52189A0428
$$ 369606 -65890 284689 248373 292615 -97641 380003 -123121 362781 152189 10428
17423A55342J74923J31650j50340Q0875A92635a03494C19423q7019J31531j12968
$$ 155342 330265 461915 311575 392450 192635 -103494 319423 232404 363935 250967
17413B50967A02659g9858p0547B51135H0587J17150h0602D49219q7563q3777F6212
$$ 250967 102659 -79858 -150405 251135 80587 197737 -80602 449219 361656 277879 66212
17401a8772j15606C47544b5670E9500L1440A3072R2738J91426I2630a05946A34031
$$ -18772 -134378 347544 -25670 59500 90940 13072 105810 297236 92630 -105946 134031
17389A67731F2864J40297C3403O03625C13423d10640A42339K34882j86964K60715
$$ 167731 62864 203161 33403 637028 313423 -410640 142339 377221 190257 450972
17379D50972k05699M5948c6352C05618A24921K55353m1205c09805C60099A21007
$$ 450972 245273 291221 -36352 305618 124921 380274 339069 -309805 360099 121007
17368a6427B43743o6093J04381g0802C5818J04162l7365K7679A659J71296J16501
$$ -16427 243743 177650 282031 -70802 35818 139980 102615 130294 1659 172955 289456
17357B89456r2272E6904a2469A19908L1506G2643a03655B43565K16812G1116L0585
$$ 289456 197184 56904 -12469 119908 151414 72643 -103655 243565 460377 71116 101701
17346A01701L56m8187K80296a61679D6188P8801N9289K8063K14187E5367K65203
$$ 101701 102057 53870 334166 -161679 46188 124989 184278 212341 426528 55367 320570
17335C20570m2498K31289a46304g615I756L89408A8411a22586B86887b81704D8237
$$ 320570 278072 509361 -146304 -7615 9756 399164 18411 -122586 286887 -281704 48237
17323E09821B29710a7431I9265J39130J77766C9736Q0376n61K34229j03577a62813
$$ 509821 229710 -17431 99265 238395 416161 39736 120112 119551 353780 250203 -162813
17311B99530A45573m4483e4950D00295F6672K50784j20314b15400A45933f1610
$$ 299530 145573 101090 -54950 400295 66672 317456 197142 -215400 145933 -61610
17300h9455D05373a1676k6994A52418B1818b62776A32987J9791K64857A10969
$$ -89455 405373 -11676 -38670 152418 21818 -262776 132987 152778 417635 110969
17289B76211j818G4862L49062B08564J26056k9779F0351K10838K49630H4212J16966
$$ 276211 274393 74862 423924 208564 334620 304841 60351 271189 520819 84212 201178
17278B01178b67A55636N8174H3278N02731B217K52536j01750m5973K11210a02586
$$ 201178 -267 155636 213810 83278 586009 2217 254753 153003 107030 318240 -102586
17266B86721J80544n421B28306J85104j50373K04776A7651M70609A20593J41415
$$ 286721 467265 461844 228306 413410 263037 467813 17651 488260 120593 262008
17256B62008g1361A40608J55693Q4316r6834b46105B01066B7717K14333j17122
$$ 262008 -71361 140608 296301 380617 283783 -246105 201066 27717 242050 124928
17246A24928a71886A12151J40527A11150L0193D8288K35105B1109l114K3926K4313
$$ 124928 -171886 112151 252678 111150 141343 48288 283393 21109 17995 41921 66234
17235F6234M41371k31942H5637K44030n4474j37377K35052j75810l2336K9244
$$ 66234 507605 275663 85637 329667 275193 137816 372868 197058 164722 193966
17225A93966H7362a60690g6643b7840E4277M5758M89264A20012J49895j06562
$$ 193966 87362 -160690 -76643 -27840 54277 100035 589299 120012 269907 163345
17215A63345E2239K90182j04149p0997n520J52432o3756Q0555r5741r9365Q1038
$$ 163345 52239 342421 238272 167275 161755 314187 250431 330986 235245 135880 216918
17204B16918k593M50130k22032k01957C1802a71145B63673l0796d3962j12914
$$ 216918 214325 664455 442423 240466 31802 -171145 263673 232877 -43962 -156876
17194a56876a6657A74765J24551c1683D4701J74854J19843A28176K38299n0587
$$ -156876 -16657 174765 299316 -31683 44701 219555 339398 128176 366475 315888
17184C15888j50513A971L23097m9495o6802J33571L02910j54807k03487G5746
$$ 315888 165375 1971 325068 275573 208771 342342 645252 490445 286958 75746
17173A79894J70959r7309p165J93405A28383J21664j9045o0215L65492k05237
$$ 179894 350853 253544 246379 439784 128383 250047 231002 170787 536279 331042
17163C31042J0912j21856m6153J16011K55513k71185O2029K61038D8693K2854
$$ 331042 341954 220098 173945 289956 545469 274284 336313 597351 48693 71547
17153G1547K73780J2271m0150N3364H3253J56106J52628C0133K24832J32777Q7184
$$ 71547 345327 357598 317448 370812 83253 239359 391987 30133 254965 387742 474926
17142D74926j71211L67905l20932G9052J7575j8282J33240Q3961j37512J81857
$$ 474926 303715 671620 350688 79052 96627 78345 211585 295546 158034 339891
17132C39891q022A19218K58111K69150j59422k01666B4277N29566l268B10146
$$ 339891 331869 119218 377329 646479 487057 285391 24277 553843 550575 210146
17121D53046P9516k01561j18231J70129M26020C74503o8382l7760L8779K57937
$$ 453046 532562 331001 212770 382899 808919 374503 306121 268361 307140 565077
17111E65077j78449l8732O6319O4529q7070J00373q4994j38963L19719j89631
$$ 565077 386628 347896 414215 478744 391674 492047 407053 268090 587809 398178
17101C98178l27A78153J98069P4872A26818N43074l07621J84803K19895l5646
$$ 398178 397851 178153 376222 451094 126818 669892 362271 547074 766969 731323
17091G31323j53982j83941J05596A73032L240K50196A89502J32176m0952L20662
$$ 731323 577341 393400 498996 173032 176272 426468 189502 321678 280726 601388
17081F01388B11248M41849r8113B74833K43919O0968r0172j31794K53611j42933
$$ 601388 211248 653097 554984 274833 518752 579720 489548 357754 611365 468432
17071D68432j95192J23836J29838p1039j37287M90952A72691N76730l39391J04247
$$ 468432 273240 397076 526914 455875 318588 809540 172691 749421 410030 514277
17061E14277j66311J21743J67313k28748J75458k33741J36855n570Q8717J1328
$$ 514277 347966 469709 637022 408274 583732 349991 486846 481276 569993 581321
17051E81321p5616k11637K54521j50851M41532C79912K99902j92285J2629L4680
$$ 581321 505705 294068 548589 397738 839270 379912 679814 487529 500158 534838
17041E34838K21066p2291k40823Q3202k0253L19817k68629o3861J92294B89296
$$ 534838 755904 683613 442790 525992 505739 825556 556927 493066 685360 289296
17030F61426k0834Q3646B65957K29677L27800l5756l18935O9387K42091k87350
$$ 661426 640592 724238 265957 495634 823434 787678 468743 538130 780221 492871
17020D92871A95441J50476J79738M4214j51073L31175j92261R9357K42764m09729
$$ 492871 195441 345917 525655 569869 418796 749971 557710 657067 899831 490102
17010D90102M14274B05446N47498j23661m5018N4777J88612k24140J51469K16344
$$ 490102 904376 205446 752944 629283 584265 639042 827654 603514 754983 971327
17000I71327j80337M4899k39737o0067L10800J88050k78851K6402K31077m15584
$$ 971327 790990 835889 596152 536085 846885 1034935 756084 782486 1013563 597979
16990E97979L22925o4695r2564K37300l07863q6314J29068j01289M31681l17187
$$ 597979 920904 856209 763645 1000945 693082 606768 735836 634547 1066228 749041
16980G49041J56981r2365k56881J14190N2775J74633p8987O2246j42937j06472
$$ 749041 906022 813657 556776 670966 723741 898374 819387 881633 738696 632224
16970F32224L83622j29275l3952j64759K03721J13129l25401O9411N76618l43537
$$ 632224 1015846 886571 852619 687860 891581 1004710 679309 748720 1325338 981801
16960I81801l6712L1344L23272l08796N586j80079r9925R7553L70372l2277k43426
$$ 981801 945089 976433 1299705 990909 996495 816416 716491 814044 1184416 1152139 908713
16949I08713K74185K2082k79541L99081l99188j23727M02948J34413j21784Q2120
$$ 908713 1182898 1204980 925439 1324520 925332 801605 1204553 1338966 1217182 1299302
16939A299302n0989O6487m12342L75151k41979r1193L14688J034j59461J38279
$$ 1299302 1248313 1314800 902458 1277609 1035630 944437 1259125 1260159 1100698 1238977
16929A238977P2103r2763R8738Q9790J59167r2932j34055o3619k1793J54640J06623
$$ 1238977 1311080 1218317 1317055 1406845 1566012 1473080 1339025 1275406 1253613 1408253 1514876
16918A514876O031o7945J20247j11746J30264k91678J94117K08592k60342m958
$$ 1514876 1520907 1452962 1573209 1461463 1591727 1300049 1494166 1702758 1442416 1437458
16908A437458J36356j02792K88956j21851J46130j27539O6860j80930m3419K65956
$$ 1437458 1573814 1471022 1759978 1638127 1784257 1656718 1723578 1542648 1499229 1765185
16898A765185j53172J39661j2531p087L28750j24744q044o9781R4645q231J82462
$$ 1765185 1612013 1751674 1739143 1732056 2060806 1936062 1928018 1858237 1952882 1944651 2127113
16887B127113k89579K34516p6246r7748J30840N13952m6230R8345l72414R1029
$$ 2127113 1837534 2072050 1995804 1898056 2028896 2542848 2496618 2594963 2222549 2313578
16877B313578o9590R003K39146p82230L57307J35375J275N03560j32858k4352
$$ 2313578 2243988 2252991 2492137 1709907 2067214 2202589 2203864 2707424 2574566 2550214
16867B550214l4194K07756k6353J60999j52758Q0244k4446J53678M0495J7059
$$ 2550214 2516020 2723776 2697423 2858422 2705664 2785908 2761462 2915140 2955635 2972694
16857B972694J56182l17831K12300L36649l94785O9809J90105M2583l42502N89433
$$ 2972694 3128876 2811045 3023345 3359994 2965209 3035018 3225123 3267706 2925204 3514637
16847C514637l38007J8149j27502J96421N04122J45393l45059n0846K23812r0164
$$ 3514637 3176630 3194779 3067277 3263698 3767820 3913213 3568154 3517308 3741120 3650956
16837C650956J45434Q3361q290J59549K20795J19869P3984J80460L46092l39298
$$ 3650956 3796390 3879751 3871461 4031010 4251805 4371674 4445658 4626118 4972210 4632912
16827D632912k2821K35091j96237L22697l6596Q1516Q3643M55242N1609K2948
$$ 4632912 4610091 4845182 4648945 4971642 4935046 5016562 5100205 5555447 5607056 5630004
16817E630004J66874k18299O44454k03792L26008r3623k16319L04351n8188M12634
$$ 5630004 5796878 5578579 6223033 6019241 6345249 6251626 6035307 6339658 6281470 6694104
16807F694104o1803N39727Q2802K4766M44932m09864L66657M57642J70777j52556
$$ 6694104 6632301 7172028 7254830 7279596 7724528 7314664 7681321 8138963 8309740 8157184
16797H157184M35099J75395K0010M13046M70991R218K55190J02930N66904K65251
$$ 8157184 8592283 8767678 8787688 9200734 9671725 9680943 9936133 10039063 10605967 10871218
16787A0871218J53090J93822L58401O02905L35871L62625J20497N55719J23697
$$ 10871218 11024308 11218130 11576531 12179436 12515307 12877932 12998429 13554148 13677845
16778A3677845L56485P41075K14638J62812J165120L45794M65422N50627P98386
$$ 13677845 14034330 14775405 14990043 15152855 16317975 16663769 17129191 17679818 18478204
16769A8478204N37419N80504P94290J098642L80913Q13229P74210P74237J074641
$$ 18478204 19015623 19596127 20390417 21489059 21869972 22683201 23457411 24231648 25306289
16760B5306289J183898J425703N49800J271397J321297J342586J646171J505918
$$ 25306289 26490187 27915890 28465690 29737087 31058384 32400970 34047141 35553059
16752C5553059J405580J890124J846337K063399J742616K331749K327156K666338
$$ 35553059 36958639 38848763 40695100 42758499 44501115 46832864 49160020 51826358
16744E1826358K512265K991555L073858L529407L317833L686690M533815M073708
$$ 51826358 54338623 57330178 60404036 63933443 67251276 70937966 75471781 79545489
16736G9545489M564209M868570N268880N764565N533749O496166O426225O472655
$$ 79545489 84109698 88978268 94247148 100011713 105545462 112041628 118467853 124940508
16728A24940508P144215P358915O844229P593238O873217O563515O722141N767052
$$ 124940508 132084723 139443638 146287867 153881105 160754322 167317837 174039978 179807030
16720A79807030N040861M450796K670223K186509R68731m01735k127888l056665
$$ 179807030 184847891 189298687 191968910 194155419 195124150 194722415 192594527 189537862
16712A89537862l857893n185067o068536n980695p019643o872947p983605p117664
$$ 189537862 185679969 180494902 174426366 168445671 161426028 154553081 146569476 139451812
16704A39451812p352572p142699o825716o581250o533804o292776n551749n300870
$$ 139451812 132099240 124956541 118130825 111549575 105015771 98722995 93171246 87870376
16696H7870376m737850m978313m252458l853571m169222l475330l353859l288324
$$ 87870376 83132526 78154213 73901755 70048184 65878962 62403632 59049773 55761449
16688E5761449l043853k469474k455057k389373k185594k139522j902984j745264
$$ 55761449 52717596 50248122 47793065 45403692 43218098 41078576 39175592 37430328
16680C7430328j840389j460434j493248q74833k004979j225718j067394j344206
$$ 37430328 35589939 34129505 32636257 31761424 29756445 28530727 27463333 26119127
16672B6119127m3008j662935r51498r67632j247433l49387p51303m64387j055201
$$ 26119127 26076119 24413184 23461686 22494054 21246621 20897234 20145931 19681544 18626343
16663A8626343q22198l16604m93961o40573n35088m10584o61211n83900k83695
$$ 18626343 17804145 17487541 16993580 16353007 15817919 15407335 14746124 14162224 13878529
16654A3878529k83735p25296Q754k57166p51349j67193k49498k10221n07719m49707
$$ 13878529 13594794 12869498 12878252 12621086 11869737 11702544 11453046 11242825 10735106 10285399
16644A0285399k65718m59676J0624l57212P3131k19553k62400k69179l69065n0990
$$ 10285399 10019681 9560005 9570629 9213417 9286548 9066995 8804595 8535416 8166351 8115361
16634H115361m315j90707l15953l55178l37398l02599R4052k93057L0385m02510
$$ 8115361 8111046 7920339 7604386 7249208 6911810 6609211 6703263 6410206 6440591 6038081
16624F038081L1768o7972m67684M22582j47535j08562k85868j64159L8210L7320
$$ 6038081 6069849 6001877 5534193 5956775 5809240 5700678 5414810 5250651 5288861 5326181
16614E326181m23022L19064l33012R4629l11670j33549p6691Q364j16202J9667
$$ 5326181 4903159 5222223 4889211 4983840 4672170 4538621 4461930 4470294 4354092 4373759
16604D373759j22471J01811j67675k09564J70370m65768j89185J09785J51579
$$ 4373759 4251288 4353099 4185424 3975860 4146230 3680462 3491277 3601062 3752641
16595C752641j10211q5365k45774l5717K92594R1560k21079o3509L9442n57205
$$ 3752641 3642430 3557065 3311291 3275574 3568168 3659728 3438649 3375140 3414582 2857377
16585B857377j8843l1090M23007n51026j8783p1905J02640k58379K80432K48218
$$ 2857377 2838534 2807444 3230451 2679425 2660642 2588737 2691377 2432998 2713430 2961648
16575B961648o03917M82886m86185J96962L2715q4224l09871j59536L09216J16977
$$ 2961648 2357731 2840617 2354432 2551394 2584109 2499885 2190014 2030478 2339694 2456671
16565B456671l91844J48852j31864K30408k28381r2353J02402p2581p4970l37850
$$ 2456671 2064827 2213679 2081815 2312223 2083842 1991489 2093891 2021310 1946340 1608490
16555A608490N34619J4958K2818J07633m65065j01702J49478j41453j52629M69266
$$ 1608490 2143109 2158067 2180885 2288518 1823453 1721751 1871229 1729776 1577147 2046413
16545B046413m93356K36207M9130l7974j42162M0349K9462j91358K55604m94445
$$ 2046413 1553057 1789264 1838394 1800420 1658258 1698607 1728069 1536711 1792315 1297870
16535A297870N93000l86786J6170m35605N30611M3812l0850l09498O8039J38243
$$ 1297870 1890870 1504084 1520254 1084649 1615260 1659072 1628222 1318724 1386763 1525006
16525A525006l13563k07078M50491J2209j99485k06133K17621j70241l3104K1200
$$ 1525006 1211443 1004365 1454856 1467065 1267580 1061447 1279068 1108827 1075723 1096923
16515A096923K87661k58469k5872j4980L490J00789K37255l53236j15347P3839
$$ 1096923 1384584 1126115 1100243 1085263 1088753 1189542 1426797 1073561 958214 1032053
16505A032053J27155o2675O4924J91882l71492M65528m06400j22698J90439j39830
$$ 1032053 1159208 1096533 1161457 1353339 981847 1447375 1040975 918277 1108716 968886
16495I68886Q931J5256j34757Q9069l07310j70570L44261K72481l3685p7034J38562
$$ 968886 977817 993073 858316 947385 640075 469505 813766 1086247 1052562 975528 1114090
16484A114090l9147l27773K25449j50154M4957o8966j02465M25583m84966L74813
$$ 1114090 1074943 747170 972619 822465 867422 798456 695991 1121574 636608 1011421
16474A011421J06175o2134p4671L5218j27959k00641j08700L09818k91160m9153
$$ 1011421 1117596 1055462 980791 1016009 888050 687409 578709 888527 597367 548214
16464E48214J9238K46731k88513L04535j26708r2635K89175k17455J84639L01857
$$ 548214 567452 814183 525670 830205 703497 610862 900037 682582 867221 1169078
16454A169078m95919k41175L60846j5424o8032J03140j7476r5904K13458j12309
$$ 1169078 673159 431984 792830 777406 709374 812514 795038 699134 912592 800283
16444H00283j12515R1945O7081m03026M4622L3361N1101j23401r2272K73352j98010
$$ 800283 687768 779713 846794 443768 488390 521751 572852 449451 357179 630531 432521
16433D32521J17902j02718J77893J45709k69882j92291M9037O8048J33141m1372
$$ 432521 550423 447705 625598 771307 501425 309134 358171 426219 559360 517988
16423E17988L81646C06185N02306l80851M9434m7704P0417K10604l45556K11456
$$ 517988 899634 306185 808491 427640 477074 429370 499787 710391 364835 576291
16413E76291j61363K92274p9966B31516L71984B35758K65045o9461j12218R028
$$ 576291 414928 707202 627236 231516 603500 235758 500803 431342 319124 328152
16403C28152J85054A96218L74775K76971A75410K48157O7205B01585K9533K97122
$$ 328152 513206 196218 570993 847964 175410 423567 490772 201585 231118 528240
16393E28240k5756j36737M32936D3012N49581B74356J82405o1461G8894J10381
$$ 528240 502484 365747 798683 43012 592593 274356 456761 395300 78894 189275
16383A89275O6904J98785j74413k77E3472K17770J46430p10l7207j42837J47673
$$ 189275 256179 454964 280551 280274 53472 271242 417672 416962 379755 236918 384591
16372C84591j72724l1740K70248J12026a91704F27895b9114E26551k26361m2983
$$ 384591 211867 180127 450375 562401 -191704 627895 -29114 526551 300190 257207
16362B57207I5119j0268K86558j76167O2801J50710m929J39774B4797N27608B39845
$$ 257207 95119 84851 371409 195242 258043 408753 403824 543598 24797 552405 239845
16350A63898O2907K13463j06041j2211J95732k722J3425m8498p1081j28491O5348
$$ 163898 226805 440268 334227 322016 517748 515026 528451 479953 408872 280381 345729
16339C45729A20826K03031L48565j66479B48272L60619j75193k07520n920I8388
$$ 345729 120826 323857 672422 505943 248272 608891 433698 226178 220258 98388
16328C6353c9790B13965E7804R6199B8372K47122i0435C7765L60674F4756L75921
$$ 36353 -39790 213965 57804 154003 28372 275494 -90435 37765 398439 64756 440677
16317D40677A33981J7911l5609R0814N199b21093D58414B17732M3501p1265K57609
$$ 440677 133981 151892 116283 207097 212296 -221093 458414 217732 261233 189968 447577
16306D47577q3495j20530K59185j68102m5032K4398j17692a5770G69148C52374
$$ 447577 364082 243552 502737 334635 289603 314001 196309 -15770 769148 352374
16295B2067O5935r411h933E31394B65495m3752a7141D64606B10343R5295I3185
$$ 22067 88002 78591 -8933 531394 265495 221743 -17141 464606 210343 305638 93185
16283E5760J49958M42039E2683J79713K02774A76686F3586J10987b1297E33550
$$ 55760 205718 647757 52683 232396 435170 176686 63586 174573 -21297 533550
16272A27921F1755K32619n6511Q8132K9275A21013a24738A53212K59336E1294
$$ 127921 61755 294374 237863 325995 355270 121013 -124738 153212 412548 51294
16261B49401A20018L33750b12836C36658I8109K53213M5812q7510j02014p7694
$$ 249401 120018 453768 -212836 336658 98109 351322 397134 309624 207610 129916
16251A29916a3594C06601k0838J9465J97599D6381N429J40985J53759o5786o8198
$$ 129916 -13594 306601 285763 305228 502827 46381 51810 192795 346554 280768 212570
16240B12570J81688A29207K31497n6619h5303f777D20751j32453f5568m9280D6072
$$ 212570 394258 129207 360704 304085 -85303 -6777 420751 288298 -65568 -114848 46072
16228A79935B1440a46716A17908h121b511q9943A12340l5781K58740j41858J03315
$$ 179935 21440 -146716 117908 -8121 -2511 -92454 112340 76559 335299 193441 296756
16217B96756A03145d1049j25151B82949a10445B27182i1698C68400I8219a00995
$$ 296756 103145 -41049 -166200 282949 -110445 227182 -91698 368400 98219 -100995
16206A47133K67959h3843A68841q924l5926M7682a44249B29131c1348B91372a8664
$$ 147133 415092 -83843 168841 159917 123991 171673 -144249 229131 -31348 291372 -18664
16194A61082q427P692K94811E7425N4095k7557N2742E2341A8739N74252a55023
$$ 161082 152655 160347 455158 57425 111520 83963 136705 52341 18739 592991 -155023
16182A03337k6788a27477K4732D7896b5521A92486b38362A65499J29711j07016
$$ 103337 76549 -127477 -102745 47896 -25521 192486 -238362 165499 295210 188194
16172A88194M5781l5827m5215O9098P4125g0172J4385A95288d1888A13303B3018
$$ 188194 233975 198148 152933 222031 296156 -70172 -55787 195288 -41888 113303 23018
16160B1243J14161N6378q6680D4993L75890d4321B51977j03895i6918A4018J77472
$$ 21243 135404 191782 105102 44993 420883 -44321 251977 148082 -96918 14018 191490
16149A91490F8236b53567a9113E4890g551m0253k07773D8379a76951H0237J36901
$$ 191490 68236 -253567 -19113 54890 -7551 -47804 -255577 48379 -176951 80237 217138
16138B17138g0257B64036A1671P4807d7B42677l9513q4410E4159f2417A64739
$$ 217138 -70257 264036 11671 86478 -47 242677 203164 118754 54159 -62417 164739
16126b9163p6995B93978j41325k8330A0059J62211N4911b17502N9731m1155f5134
$$ -29163 -106158 293978 152653 124323 10059 172270 227181 -217502 -157771 -198926 -65134
16114B00792a50969G6811b41286G590P0595M6912k8700L20275H4673b36149Q6910
$$ 200792 -150969 76811 -241286 7590 78185 125097 96397 416672 84673 -236149 -149239
16103a49239e4303B25404c5316A50718D1115J63835q5123R7660c0498F1811a63284
$$ -149239 -54303 225404 -35316 150718 41115 204950 119827 217487 -30498 61811 -163284
16091b0939C49490j55509a33039e3399F6651a87972O0053E4133a78120k7322C5355
$$ -20939 349490 193981 -133039 -53399 66651 -187972 -127919 54133 -178120 -205442 35355
16079a95691C06833j44078G1340C1681J74203N977b02199J6795a5139A85013A961
$$ -195691 306833 162755 71340 31681 205884 211861 -202199 -185404 -15139 185013 1961
16067b6679q6547L4262B9864h4203E0730b70376a12351B06108C0141c26917d5206
$$ -26679 -113226 -78964 29864 -84203 50730 -270376 -112351 206108 30141 -326917 -45206
16055D2012c31018D6646k1742d6920O260A07896J66770E7042Q7153c4367q5871
$$ 42012 -331018 46646 24904 -46920 -40660 107896 274666 57042 144195 -34367 -120238
16044a20238B6788r124Q1731a60932r4327A72932c1083B21481f5144J9297B38202
$$ -120238 26788 17664 99395 -160932 -255259 172932 -31083 221481 -65144 -45847 238202
16032D7629P2914k5535D0805J03606a14712j59843B14665B7281a70975G2501a50334
$$ 47629 120543 95008 40805 144411 -114712 -274555 214665 27281 -170975 72501 -150334
16020B2429J18102a78158B86341a26502l08847A53272a9110m4344n7614C5624
$$ 22429 140531 -178158 286341 -126502 -435349 153272 -19110 -63454 -121068 35624
16009e1595q9735B98766E0334b5055p8199J1647A52473k5938D5829K5157L6556
$$ -51595 -141330 298766 50334 -25055 -103254 -91607 152473 126535 45829 70986 107542
15998A07542C0325A3253R721a14034j98405A17564D082J54523b79420J01220A90386
$$ 107542 30325 13253 22974 -114034 -312439 117564 4082 158605 -279420 -178200 190386
15986d03501B93949r9380c4413I1538K67058j62466J79163b91925D7241P9846
$$ -403501 293949 194569 -34413 91538 358596 196130 375293 -291925 47241 127087
15976A27087K59381e4549C8281J57063n5683K1448l4940a41819j74674A78449
$$ 127087 386468 -54549 38281 195344 139661 161109 126169 -141819 -316493 178449
15965C60047j42167D3494b80399C7541L83658c63026a76487I3597i8270p9358
$$ 360047 217880 43494 -280399 37541 421199 -363026 -176487 93597 -98270 -177628
15955a77628a481j35451E494f1685E8808K30140a05741F1185k6683h1397A19691
$$ -177628 -1481 -136932 5494 -61685 58808 288948 -105741 61185 34502 -81397 119691
15943A06862a8045C7293b15348j40069A13653b21110h7846l23195J50568h2986
$$ 106862 -18045 37293 -215348 -355417 113653 -221110 -87846 -411041 -260473 -82986
15932A92916a77305j29420R241N6138h8407C00930a24934B1214d5823k85481J11788
$$ 192916 -177305 -306725 -297484 -241346 -88407 300930 -124934 21214 -45823 -331304 -219516
15921b19516b4166j41860A05338e8246j61228l3653R6300j20279H9201J9973a43879
$$ -219516 -24166 -166026 105338 -58246 -219474 -253127 -156827 -277106 89201 109174 -143879
15909C68760f8903B91890a07009A46242J29710a40049C9582b35049J5216a08063
$$ 368760 -68903 291890 -107009 146242 275952 -140049 39582 -235049 -219833 -108063
15898a54274I9473J16951c2914l7624B26191c47257h8792A64186l4289B5878c39989
$$ -154274 99473 216424 -32914 -70538 226191 -347257 -88792 164186 129897 25878 -339989
15886H2373a3014A72641D5944a32004A49812b2900H7666f5696A66767d3141l34343
$$ 82373 -13014 172641 45944 -132004 149812 -22900 87666 -65696 166767 -43141 -377484
15875c77484a35679K8678l5228a20A07186e4687C780Q8878m0684l878b31654f8966
$$ -377484 -135679 -107001 -142229 -120 107186 -54687 3780 92658 51974 48096 -231654 -68966
15862a61704E3646h0067B43961a25622A85327a07942j37586h9518n9384m063B4733
$$ -161704 53646 -80067 243961 -125622 185327 -107942 -245528 -89518 -148902 -152965 24733
15850a18599l9743B30463D6560f2644G2397J05923n5224l2700J6888C3107D56
$$ -118599 -158342 230463 46560 -62644 72397 178320 123096 90396 107284 33107 456
15838A28880h03I5195J70796r7402a59911P6140F5390J36280a03177c4532j09557
$$ 128880 -803 95195 265991 168589 -159911 -83771 65390 201670 -103177 -34532 -144089
15827a44089d1212j79936L7137A80405m6839b18811E210J32252d6174l06647c9388
$$ -144089 -41212 -221148 -184011 180405 133566 -218811 5210 137462 -46174 -352821 -39388
15815E5338M64240a02595M9835B34547r9381a46794L3631k60365i2106i713o3102
$$ 55338 519578 -102595 -52760 234547 135166 -146794 -113163 -373528 -92106 -9713 -72815
15804g2815j27092O0767B8152N1392L3926F940a01749B1833J02227a2310k33505
$$ -72815 -199907 -139140 28152 79544 113470 6940 -101749 21833 124060 -12310 -245815
15793b45815M2806L6860K4495J6022k6518G4227n844J05040J7868a94509m1394
$$ -245815 -203009 -166149 -141654 -125632 -152150 74227 68383 173423 191291 -194509 -235903
15782b35903p8776J26202e0141l5871j43442d4592l9649m9294D8388i9294j55122
$$ -235903 -314679 -188477 -50141 -86012 -229454 -44592 -84241 -133535 48388 -99294 -254416
15771b54416p5864g9266l45748C4664C701c4100j22892B1412J11923a04594m2440
$$ -254416 -330280 -79266 -425014 34664 3701 -34100 -156992 21412 133335 -104594 -147034
15760a47034f9632K3022l361l2481k7162C33237a11521A74376a6646E911a07366
$$ -147034 -69632 -46610 -49971 -82452 -109614 333237 -111521 174376 -16646 5911 -107366
15748b3303A93735i2751j38780M6852O0268b5229C66939a6084B9646b0707k41766
$$ -23303 193735 -92751 -231531 -184679 -124411 -25229 366939 -16084 29646 -20707 -262473
15737b62473a22853m3220h1899a6595n3054o7252j60228e9976O794a0881A02143
$$ -262473 -122853 -166073 -81899 -16595 -69649 -136901 -297129 -59976 -53182 -10881 102143
15725a02096a6544E7313a57386k35382A90827m2744b60371J16868G3067c43917
$$ -102096 -16544 57313 -157386 -392768 190827 148083 -260371 -143503 73067 -343917
15714A00330c56004i8843k09503I0483l8493P5983a79173A61737d1650B58552
$$ 100330 -356004 -98843 -308346 90483 51990 127973 -179173 161737 -41650 258552
15703c8110o3569b0518l08980D5631i97l7140B75338b78136l3313J04118L3486
$$ -38110 -101679 -20518 -329498 45631 -997 -38137 275338 -278136 -311449 -207331 -173845
15692a73845B9708K79381d8857K0768j28259A17958E1689b50240a02054M4972
$$ -173845 29708 309089 -48857 -28089 -156348 117958 51689 -250240 -102054 -57082
15682e7082j49450r3755F7693A3022J86069b2010j31727C2843a0650B42272b34873
$$ -57082 -206532 -300287 67693 13022 199091 -22010 -153737 32843 -10650 242272 -234873
15670D72085m1232c3203I0626b43706H0942R956a57959A62034h6883C33761B8847
$$ 472085 430853 -33203 90626 -243706 80942 90898 -157959 162034 -86883 333761 28847
15658A58438J4934d0339A46687a64264o0383C73912g94m1571A648L13518a15191
$$ 158438 173372 -40339 146687 -164264 -224647 373912 -794 -42365 1648 315166 -115191
15646A7990R7424C25f1946j74307A6386b27543H9038b86869i3164A80709H954
$$ 17990 115414 325 -61946 -236253 16386 -227543 89038 -286869 -93164 180709 8954
15634e7149A40983i0812k7323d7792A31360l4389J08662b6487E0813J76450q3298
$$ -57149 140983 -90812 -118135 -47792 131360 96971 205633 -26487 50813 227263 143965
15623A43965J54914a32851B15802I7895a13769A02672A1282a0543A37288c9263
$$ 143965 298879 -132851 215802 97895 -113769 102672 11282 -10543 137288 -39263
15612C06976j29194c09265A49807J15966j00216a97992e4144j64342f2251j86843
$$ 306976 177782 -309265 149807 265773 165557 -197992 -54144 -218486 -62251 -249094
15602b49094M4620j54299G8221a56065j2550m5439A28641c6143A48517C6872J61484
$$ -249094 -204474 -358773 78221 -156065 -168615 -214054 128641 -36143 148517 36872 198356
15591A98356j9378b4820F4078j4865J64378a18171C45347b74710F3995g3977o1198
$$ 198356 178978 -24820 64078 49213 213591 -118171 345347 -274710 63995 -73977 -135175
15580a35175o167k30344e3097G937h6860J6571A70991i1410A40537C9591J80252
$$ -135175 -141342 -371686 -53097 7937 -86860 -70289 170991 -91410 140537 39591 219843
15569B19843a64567L3338q7515A55213A9722a11398I0987g125A9030J05817a08371
$$ 219843 -164567 -131229 -218744 155213 19722 -111398 90987 -7125 19030 124847 -108371
15557b00261h9209l8467C61482c86651a21983A99088I228J10485o429q723K46509
$$ -200261 -89209 -127676 361482 -386651 -121983 199088 9228 119713 113284 104561 351070
15546C51070a66046A7024n627J2056b30925a7496B33380M2800j24686k5525h6306
$$ 351070 -166046 17024 11397 23453 -230925 -17496 233380 276180 151494 125969 -86306
15534a68084g5791k19901I3748b90338i1025E475M1272a85852M5510j7581a9612
$$ -168084 -75791 -295692 93748 -290338 -91025 5475 46747 -185852 -140342 -157923 -19612
15522b01570A38360c18753A91450n0143a48152F7005J3698L78356j41986j13011
$$ -201570 138360 -318753 191450 141307 -148152 67005 80703 459059 317073 204062
15512B04062b6444F9636h0612l69639h3647I7294a01334B3993P2223d016B73155
$$ 204062 -26444 69636 -80612 -450251 -83647 97294 -101334 23993 96216 -4016 273155
15500F1079R8152e8441b3198J1526r3256A13762J92286A51079O140A7415b51130
$$ 61079 159231 -58441 -23198 -11672 -104928 113762 306048 151079 157219 17415 -251130
15488a12185F9983a07905c2200k78167B74938a59565L6289A9946K45001h5773
$$ -112185 69983 -107905 -32200 -310367 274938 -159565 -123276 19946 264947 -85773
15477A3755J60755J2116O8055a20313B4397L08527i3311D9526a96736A80110B1860
$$ 13755 174510 186626 254681 -120313 24397 332924 -93311 49526 -196736 180110 21860
15465b0753B34497i8805k62203H3916Q4986f1997o5978M2910j31503A4895K98404
$$ -20753 234497 -98805 -361008 83916 168902 -61997 -127975 -85065 -216568 14895 313299
15454C13299D886e2814E9837p081N3946m3475a33313A58834a10829b7888F3092
$$ 313299 4886 -52814 59837 52756 106702 63227 -133313 158834 -110829 -27888 63092
15442a13658A05870a5007A95414K83789A31880l7453a69905J7317B32368A06356
$$ -113658 105870 -15007 195414 479203 131880 94427 -169905 -152588 232368 106356
15431e8439I5294b42371f4251j93737A62744i6780J185E7060L5418a33865A02331
$$ -58439 95294 -242371 -64251 -257988 162744 -96780 -95595 57060 92478 -133865 102331
15419C0240b91499A94344H4476o470c6587k40755h8802k72415A32125b7416q6376
$$ 30240 -291499 194344 84476 78006 -36587 -277342 -88802 -361217 132125 -27416 -113792
15408a13792j8091M9497E9181L9076h0851k1145k6214B79472a29730A20426c50203
$$ -113792 -131883 -82386 59181 98257 -80851 -101996 -128210 279472 -129730 120426 -350203
15396I8285K62415f5219G917b75332P36B05713a15358A97321C0023J13420b00859
$$ 98285 360700 -65219 7917 -275332 -274596 205713 -115358 197321 30023 143443 -200859
15384A13146K72422l6585K0462b5210A18199c52528b0455F3565K61851a48866
$$ 113146 385568 348983 369445 -25210 118199 -352528 -20455 63565 325416 -148866
15373A72844E9107c60707A12702O7299D3194J9243K19337b28975a3598B08714
$$ 172844 59107 -360707 112702 180001 43194 62437 281774 -228975 -13598 208714
15362A13357L001K0415a02366j56580B2120b71372A4817K7294d21286J64363A19031
$$ 113357 116358 136773 -102366 -258946 22120 -271372 14817 42111 -421286 -256923 119031
15350a44431B56011D788g8777r7625O8562k27025I5653k274j2711c8581A51671
$$ -144431 256011 4788 -78777 -176402 -107840 -334865 95653 93379 80668 -38581 151671
15338g4312B01251q6245b33421A6246K59668b00841j89993A40662b28200E1557
$$ -74312 201251 115006 -233421 16246 275914 -200841 -390834 140662 -228200 51557
15327a86626C9240j8069c58147H871J46479p4351g4012E3848a26018C7806K77626
$$ -186626 39240 21171 -358147 8871 155350 80999 -74012 53848 -126018 37806 315432
15316C15432C2001P2684L44999d7116A53355K05251a71416K3197H717Q5866R9154
$$ 315432 32001 104685 449684 -47116 153355 358606 -171416 -148219 8717 94583 193737
15305A93737D4979R198b8224G3153b55682J8608g3947r799B12470J05763F6613
$$ 193737 44979 54177 -28224 73153 -255682 -237074 -73947 -83746 212470 318233 66613
15293A65201J84655A5294K5796L36067A59089E5664N3176Q2372K6201B0879K49085
$$ 165201 349856 15294 41090 377157 159089 55664 108840 191212 217413 20879 269964
15282B69964C5680K73397j30179B2288J00000D2154J10058D0599j2790J2603M7911
$$ 269964 35680 309077 178898 22288 122288 42154 152212 40599 27809 40412 88323
15271H8323L5267Q6535N8917A17482J49355K49496D2820F141a65886J7690A39215
$$ 88323 123590 210125 269042 117482 266837 516333 42820 6141 -165886 -148196 139215
15259E814a09324A67061m8004e8698B36685o3004M9049m4132H8451M66106k05532
$$ 5814 -109324 167061 119057 -58698 236685 173681 222730 178598 88451 554557 349025
15248C49025R33786O40003o05823M16105l34162E96359k00372C8275K1566G711
$$ 349025 1282811 1922814 1316991 1733096 1398934 596359 395987 38275 59841 7711
15237i0900E12202A63547a83008I9690O3983a31083N5786C4094Q7347M6573a23759
$$ -90900 512202 163547 -183008 99690 163673 -131083 -75297 34094 121441 168014 -123759
15225F0159a00175E3965j6119K26734F989b56444f131j49132A32895C5400R2513
$$ 60159 -100175 53965 37846 264580 6989 -256444 -6131 -155263 132895 35400 127913
15214A27913a30424B39787E8949j5945N43868E5314p311b0223j70797E5711K29252
$$ 127913 -130424 239787 58949 43004 586872 55314 48003 -20223 -191020 55711 284963
15203B84963g2309G0274a01321I5668a12580C4743K26012J80135A70140D6706
$$ 284963 -72309 70274 -101321 95668 -112580 34743 260755 440890 170140 46706
15192a56255C9097N8284J9624b09972C64972b32961h1747B51779b82929C63445
$$ -156255 39097 97381 117005 -209972 364972 -232961 -81747 251779 -282929 363445
15181D8885h3389A80966G9023i1732p2866C74463a39670f5082j04722A73041P0555
$$ 48885 -83389 180966 79023 -91732 -164598 374463 -139670 -65082 -169804 173041 243596
15170B43596b2510B45568b31517A27235C1124h9210c3622D28141c296P11D29079
$$ 243596 -22510 245568 -231517 127235 31124 -89210 -33622 428141 -3296 -2585 429079
15158A50410e9686J9094j4971F2676A6200n748J26293f5851A74425K30825j74124
$$ 150410 -59686 -40592 -55563 62676 16200 10452 136745 -65851 174425 405250 231126
15147B31126F6789K41602H5960R1690j4415A5100K65603q2801b1092j2693B94771
$$ 231126 66789 308391 85960 177650 163235 15100 280703 197902 -21092 -33785 294771
15135E7294O1226J37031a76363C45788D1981J84178k8357B6308d330r889A53488
$$ 57294 118520 255551 -176363 345788 41981 226159 197802 26308 -4330 -14219 153488
15123E5011L97753A19052k7286M12942j04594j76694R865J82955b65993B46671
$$ 55011 452764 119052 91766 504708 400114 223420 233285 416240 -265993 246671
15112A10982J52540A24343a35519A04374l8266e1695A76253F867N45675j99041
$$ 110982 263522 124343 -135519 104374 66108 -51695 176253 6867 552542 353501
15102C53501D6684a2760B12020J7243j02382D7284L0857b50347D0572J21011J26382
$$ 353501 46684 -12760 212020 229263 126881 47284 78141 -250347 40572 161583 287965
15091B87965G5129K24854J18138a0440B66954I9790b5349A93941e8517B72832
$$ 287965 75129 299983 418121 -10440 266954 99790 -25349 193941 -58517 272832
15080A11539K45067a0668A52929C6369K59464A36214P7665N7393J66703G7566
$$ 111539 356606 -10668 152929 36369 295833 136214 213879 271272 437975 77566
15069h8376I6447f3074D3177J2030J68986K40984A08396N98754A06202K9370J06707
$$ -88376 96447 -63074 43177 55207 224193 465177 108396 707150 106202 135572 242279
15058B42279c717B41640F7160J22981a55535C1776a52265N2597F6379d3108C42043
$$ 242279 -3717 241640 67160 190141 -155535 31776 -152265 -99668 66379 -43108 342043
15046F47255a85437E0398L18326n3673A09480Q9805P3486j4900K5619a18941C21871
$$ 647255 -185437 50398 368724 315051 109480 199285 272771 257871 283490 -118941 321871
15034C52449F2202M67766B9340h0386A69053J29173B5515a32209C05212O844i9963
$$ 352449 62202 529968 29340 -80386 169053 298226 25515 -132209 305212 312056 -99963
15022a3028E26850k29542A37795K6969J13038a50144C10652A34137M2482F7707
$$ -13028 526850 297308 137795 164764 277802 -150144 310652 134137 176619 67707
15011E2097L83538c0911A40206K65539j68394c6091B20215a41109G3605M63817
$$ 52097 435635 -30911 140206 405745 237351 -36091 220215 -141109 73605 537422
15001E37422B41471Q9439I5955L05238A44279K28012j75770d2762E31280A25534
$$ 537422 241471 330910 95955 401193 144279 372291 196521 -42762 531280 125534
14990h6693D83970k09850C4505K19651Q5724j33415n6615K25071r5861P7335j00637
$$ -86693 483970 274120 34505 254156 339880 206465 149850 374921 279060 356395 255758
14979B55758p0063R8367A01769L01409K7010n3332q120H0627M11882m4469j17691
$$ 255758 185695 284062 101769 403178 430188 376856 368736 80627 492509 448040 330349
14968C30349I1835J59876k4486J58197A10557O32L05726k07634R6030A41698k6903
$$ 330349 91835 251711 227225 385422 110557 111189 416915 209281 305311 141698 114795
14957A14795O6301R392L25O1883J9618f4674A6668a36587B20512Q9675P5600A87392
$$ 114795 181096 190488 190813 252696 272314 -64674 16668 -136587 220512 310187 385787 187392
14944B0729O47812l17679j11308k9123K47521N7151A46014K78850N1927k06852
$$ 20729 668541 350862 239554 210431 457952 515103 146014 424864 476791 269939
14934B69939J16999J09232A45363M61777k02256q1846q4231J52140r0815k7829
$$ 269939 386938 496170 145363 607140 404884 323038 238807 390947 300132 272303
14924B72303b00373C55896J6424j19202K39778r4807P5407o5854j02681j01838
$$ 272303 -200373 355896 372320 253118 492896 398089 473496 407642 304961 203123
14914B03123l9735K68974A63759M01380k08817q5734o6307m4533M65613B46221
$$ 203123 163388 432362 163759 565139 356322 270588 204281 159748 625361 246221
14903B51645H3621L67646K38897C00219M27239d3626B57954A6836L56346j34698
$$ 251645 83621 451267 690164 300219 727458 -43626 257954 16836 373182 238484
14893B38484L27712K18300l72951A73004K6898J18125K38994k66656K0081K91779
$$ 238484 566196 784496 411545 173004 199902 318027 557021 290365 310446 602225
14883F02225M9660J00655j13220k84251j77307L69192j76490j54486J37831K19013
$$ 602225 651885 752540 639320 355069 177762 546954 370464 215978 353809 572822
14873E72822a23335E29091p8628J73761B01306K29131P6738j22200A85597M22482
$$ 572822 -123335 529091 450463 624224 201306 430437 507175 384975 185597 608079
14863F08079j47416j5548n5837A62116M90279B69655K78843r1235o8041A89085
$$ 608079 460663 445115 389278 162116 652395 269655 548498 457263 389222 189085
14852B48856L8180J93338R2353R895B83043K59012O2124A37153M32544J74260
$$ 248856 287036 480374 572727 582622 283043 542055 604179 137153 569697 743957
14842G43957C12902K02775J41734A64411J4121L82760k21613J17427B12778M03253
$$ 743957 312902 515677 657411 164411 178532 561292 339679 457106 212778 616031
14832F16031j80768j35019L39304B90329K01603J48660q4836n4413L1328L24024
$$ 616031 435263 300244 639548 290329 491932 640592 555756 501343 532671 856695
14822H56695j28163L7085k45398N4263Q7804C24517L09318K15139j2506k23871
$$ 856695 728532 765617 520219 574482 662286 324517 633835 848974 836468 612597
14812F12597j402l7633j04283q571j77438M68540P817l5813k38629K71737l38022
$$ 612597 611195 573562 469279 460708 283270 751810 759627 723814 485185 756922 418900
14801D18900R598O2640Q8458j69427K38668l8453j24695j19536M55632j38378
$$ 418900 428498 491138 579596 410169 648837 610384 485689 366153 821785 683407
14791F83407k45681L50778C59230j69868L07181P8437L04287D13321R3965J87958
$$ 683407 437726 788504 359230 189362 496543 574980 879267 413321 507286 695244
14781F95244j24880J15056O3822j33670J7577R6891l8803j21051L35498C46389
$$ 695244 570364 685420 749242 615572 633149 730040 691237 570186 905684 346389
14770H16140j77592J43899l6796l26295J12418J82360m2786k09047N01021k96283
$$ 816140 638548 782447 745651 419356 531774 714134 671348 462301 963322 667039
14760F67039j21991J17776K635k2099M7937k05198J28511K48267l40813K91345
$$ 667039 545048 662824 665459 643360 691297 486099 614610 862877 522064 813409
14750H13409k96670K50486K2818k76871K32172j48806R5206j63609J20681J48291
$$ 813409 516739 767225 790043 513172 745344 596538 691744 528135 648816 797107
14740G97107l43852K63289R1592J236k11968j80603K11644M1016K14051Q2896
$$ 797107 453255 716544 808136 809372 597404 416801 628445 669461 883512 966408
14730I66408k16706P4143J33703k54896n8347M5212r2959J95040k83999L37903
$$ 966408 749702 823845 957548 702652 644305 689517 596558 791598 507599 845502
14720H45502q104N6071q1869J87926l81979L39998j34148J10291j58870J29605
$$ 845502 837398 893469 811600 999526 617547 957545 823397 933688 774818 904423
14710I04423j06807L46967k25166k5137Q1028R6162j75021R401Q9815j00602k83303
$$ 904423 797616 1144583 919417 894280 975308 1071470 896449 905850 995665 895063 611760
14699F11760j92324P9907N32229j8999j37507M68761n08569J05889m35772N66613
$$ 611760 419436 499343 1031572 1012573 875066 1343827 835258 941147 505375 1071988
14689A071988m1573j8944k73787r6588J81995n2347J6149q5888M17587j62091
$$ 1071988 1030415 1011471 737684 641096 823091 770744 786893 701005 1118592 956501
14679I56501J94104k80829K61333N5642k78776K26502l17746O5155L8924j30975
$$ 956501 1150605 869776 1131109 1186751 907975 1134477 816731 881886 920810 789835
14669G89835K94927K70812k16260K48814k41950j77810L04094o5999k21383N1792
$$ 789835 1084762 1355574 1139314 1388128 1146178 968368 1272462 1206463 985080 1036872
14659A036872L9584K26577j70692J42169l05932K34991M2147l5129n5353J92155
$$ 1036872 1076456 1303033 1132341 1274510 968578 1203569 1245716 1210587 1155234 1347389
14649A347389l50959K9381J51073J46105j53735p5947L26775j34516j09130J39408
$$ 1347389 996430 1025811 1176884 1322989 1169254 1093307 1420082 1285566 1176436 1315844
14639A315844M15005j90530j71482J32040J38503m24197J4738n2570K44775n4391
$$ 1315844 1730849 1540319 1368837 1500877 1639380 1215183 1229921 1177351 1422126 1367735
14629A367735J92785m0293j04073k1573k88663K37502K09666k59862L55831q3408
$$ 1367735 1560520 1520227 1416154 1394581 1105918 1343420 1553086 1293224 1649055 1565647
14619A565647j5200r8716r5086j6617M43026j89543j21749l40988N22709k36881
$$ 1565647 1550447 1451731 1356645 1340028 1783054 1593511 1471762 1130774 1653483 1416602
14609A416602M29647r8691o2823K99433m17396Q2804K9936k964m7391l1944q8986
$$ 1416602 1846249 1747558 1684735 1984168 1566772 1649576 1679512 1676548 1629157 1597213 1508227
14598A508227j3500J87271L6605l9842K42902m7014m25012K14758J60564J325
$$ 1508227 1494727 1681998 1718603 1678761 1921663 1874649 1449637 1664395 1824959 1826284
14588A826284J34144N6428j92001N0049K07353L398Q1053k35999K09359n5455
$$ 1826284 1960428 2016856 1824855 1874904 2082257 2085655 2166708 1930709 2140068 2084613
14578B084613M3510N8507j64197L61171o7243m65695N44546L14732o27694N20974
$$ 2084613 2128123 2186630 2022433 2383604 2316361 1850666 2395212 2709944 2082250 2603224
14568B603224L8115j62088Q8957l66071L33985N704O0738K14868l13327L94408
$$ 2603224 2641339 2479251 2568208 2202137 2536122 2541826 2602564 2817432 2504105 2898513
14558B898513j4282P7231K49096l2649N38807J62166O60694O32292O34396J739500
$$ 2898513 2884231 2961462 3210558 3177909 3716716 3878882 4539576 5171868 5806264 7545764
14548G545764L289792P660344J6643783J4037141k1929527A2424235E898711k540516
$$ 7545764 10835556 18495900 35139683 49176824 27247297 12424235 5898711 3358195
14540C358195q27855r8769j34578P2352j7318K47428m35761J87917k47196J60098
$$ 3358195 2530340 2431571 2296993 2369345 2352027 2599455 2163694 2351611 2104415 2264513
14530B264513M03889l31557j46576M09017p6324p8903j26653J05847J55819N3930
$$ 2264513 2668402 2336845 2190269 2599286 2522962 2444059 2317406 2423253 2579072 2633002
14520B633002N60886m68974j25209m74K12915N6968k68746K06502J64871l20515
$$ 2633002 3193888 2724914 2599705 2599231 2812146 2869114 2600368 2806870 2971741 2651226
14510B651226L6512K87627J60774m91963M78550j12461R4075m8944M44451l17110
$$ 2651226 2687738 2975365 3136139 2644176 3122726 3010265 3104340 3055396 3499847 3182737
14500C182737K15281j2610l44822L09819K11384R2674j18453l07810L03243M64551
$$ 3182737 3398018 3385408 3040586 3350405 3561789 3654463 3536010 3228200 3531443 3995994
14490C995994l68512Q580N10436l20480k0500j871J57625N4088k87906N1028M56241
$$ 3995994 3627482 3636062 4146498 3826018 3805518 3803647 3961272 4015360 3727454 3778482 4234723
14479D234723l86554J26178K31190K34425l43115J54607j46346L62768k08066
$$ 4234723 3848169 3974347 4205537 4439962 4096847 4251454 4105108 4467876 4259810
14470D259810P3512K82319l39402L53610L12747o9191l73954M33254k33726M62423
$$ 4259810 4333322 4615641 4276239 4629849 4942596 4873405 4499451 4932705 4698979 5161402
14460E161402n7006l22956K21325J81495q3067J84225M1746K56872j5806J55355
$$ 5161402 5104396 4781440 5002765 5184260 5101193 5285418 5327164 5584036 5568230 5723585
14450E723585N11j76021K53767n17r6581J36015L17951M4958Q6040R2874j69316
$$ 5723585 5724096 5548075 5801842 5801325 5704744 5840759 6158710 6203668 6289708 6382582 6213266
14439F213266M11033j09972l24809M89314J47951O0000M2358N5792k10483J98776
$$ 6213266 6624299 6514327 6189518 6678832 6826783 6886783 6929141 6984933 6774450 6973226
14429F973226K71122R635j94283K61363L55350P9118j04433J20772M83267p3873
$$ 6973226 7244348 7253983 7059700 7321063 7676413 7755531 7651098 7771870 8255137 8181264
14419H181264J20520M06816l2592j66423L31782j38819M70715m60184J14845N43577
$$ 8181264 8301784 8708600 8676008 8509585 8841367 8702548 9173263 8713079 8827924 9371501
14409I371501l581K12835L4315L80741K25789k75778L77544L8548N40216J68580
$$ 9371501 9367920 9580755 9615070 9995811 10221600 9945822 10323366 10361914 10902130 11070710
14399A1070710M51735q1311l7529L36083J18680r1066M93844L63019k01904M21366
$$ 11070710 11522445 11441134 11403605 11739688 11858368 11767302 12261146 12624165 12422261 12843627
14389A2843627K18208K40260j15030M99099J12971L39800R1988L33459L91798
$$ 12843627 13061835 13302095 13187065 13686164 13799135 14138935 14230923 14564382 14956180
14380A4956180J33652K13564O02215K96204m5815M01266L18605O02460K11780
$$ 14956180 15089832 15303396 15905611 16201815 16156000 16557266 16875871 17478331 17690111
14371A7690111L90510L16828M72128L67136N705N55331M02228L50263O48442M91720
$$ 17690111 18080621 18397449 18869577 19236713 19242418 19797749 20199977 20550240 21198682 21690402
14361B1690402K69100K61218O68892O90737O20678N31219O02828N31442O69537
$$ 21690402 21959502 22220720 22889612 23580349 24201027 24732246 25335074 25866516 26536053
14352B6536053N15968N79213P72908O65049N99750Q62524Q45194O87222N20617
$$ 26536053 27052021 27631234 28404142 29069191 29668941 30531465 31376659 32063881 32584498
14343C2584498J239551P33314J071068J113504J222105J062936Q39458R85614
$$ 32584498 33824049 34557363 35628431 36741935 37964040 39026976 39866434 40852048
14335D0852048J304790J401503J252784J246765J248207J843465J282865J590770
$$ 40852048 42156838 43558341 44811125 46057890 47306097 49149562 50432427 52023197
14327E2023197J555066J825734J818944K007289K426877J921034K072305K043273
$$ 52023197 53578263 55403997 57222941 59230230 61657107 63578141 65650446 67693719
14319F7693719K590560K890169K757317K806410L149192L171480L164785L557785
$$ 67693719 70284279 73174448 75931765 78738175 81887367 85058847 88223632 91781417
14311I1781417L762864L922542M239518M442638M439626N017343N719194M922552
$$ 91781417 95544281 99466823 103706341 108148979 112588605 117605948 123325142 128247694
14303A28247694N807131O263961O726251O830762P480517P736876Q121483Q805690
$$ 128247694 134054825 140318786 147045037 153875799 161356316 169093192 177214675 186020365
14295A86020365R142982R874794J0461297J0588994J1738226J1714121J2609024
$$ 186020365 195163347 205038141 215499438 226088432 237826658 249540779 262149803
14288B62149803J3148220J3469244J4121877J4743075J4913155J4714197J5384217
$$ 262149803 275298023 288767267 302889144 317632219 332545374 347259571 362643788
14281C62643788J4947234J4782700J4687613J3665642J2878565J1717515J0147696
$$ 362643788 377591022 392373722 407061335 420726977 433605542 445323057 455470753
14274D55470753Q509859O441401K920930L81177j200154j373285l808249m693741
$$ 455470753 463980612 470422013 473342943 473724120 472523966 471150681 467342432 462648691
14266D62648691p285129r007486j1093627j2919367j3921009j5174945j5391219
$$ 462648691 455363562 446356076 435262449 422343082 408422073 393247128 377855909
14259C77855909j5975510j5779585j5623179j5561766j5126135j3270748j4091519
$$ 377855909 361880399 346100814 330477635 314915869 299789734 286518986 272427467
14252B72427467j3154753j2766856j2558911j1224435j1004548j0365629r737888
$$ 272427467 259272714 246505858 233946947 222722512 211717964 201352335 191614447
14245A91614447r122566q541889p888446q023659p345607p078453o133417o185668
$$ 191614447 182491881 173949992 166061546 158037887 150692280 143613827 137480410 131294742
14237A31294742n388962n346044n306459m869676m377343l979991m217737l564853
$$ 131294742 125905780 120559736 115253277 110383601 106006258 102026267 97808530 94243677
14229I4243677m008721l362927l369075l104156k741197k996715k695990k302512
$$ 94243677 90234956 86872029 83502954 80398798 77657601 74660886 71964896 69662384
14221F9662384k392206k543330j906182k308155k104272j633708k024666j324016
$$ 69662384 67270178 64726848 62820666 60512511 58408239 56774531 54749865 53425849
14213E3425849j286935j886843j829314j406479j135099j510401o92189j057399
$$ 53425849 52138914 50252071 48422757 47016278 45881179 44370778 43678589 42621190
14205D2621190j432730j239903j195648j258756o49409m59728j126535j402007
$$ 42621190 41188460 39948557 38752909 37494153 36844744 36385016 35258481 33856474
14197C3856474o19519p37930q98555q57923o05337p62267q56254n69166n05309
$$ 33856474 33236955 32499025 31600470 30742547 30137210 29374943 28518689 27949523 27444214
14188B7444214o08456q19277q20601k98149p21215l25r68582l65692r40741M6063
$$ 27444214 26835758 26016481 25195880 24897731 24176516 24176191 23207609 22841917 21901176 21947239
14178B1947239m11222o64030J11646r39415m33389o199p36888o15575J21194n39626
$$ 21947239 21536017 20871987 20983633 20044218 19610829 19604630 18867742 18252167 18373361 17833735
14168A7833735l4922n46952j12662q19856o4528n6509m26550m59367K05582l20750
$$ 17833735 17798813 17251861 17139199 16319343 16254815 16198306 15771756 15312389 15517971 15197221
14158A5197221n40872l41788K09687m48981o97621J49966m75975j53491l98000
$$ 15197221 14656349 14314561 14524248 14075267 13377646 13527612 13051637 12898146 12500146
14149A2500146q37P6472m51532k67675l3759l65433K84485o55504J23560j67224
$$ 12500146 12499309 12575781 12124249 11856574 11822815 11457382 11741867 11086363 11209923 11042699
14139A1042699l19889j63162j89240o2410l10728Q1727k64880m9629q7688k81488
$$ 11042699 10722810 10559648 10370408 10307998 9997270 10078997 9814117 9764488 9676800 9395312
14129I395312k43746j82984J45778k06570J53253m14403O042l33795q0740j17537
$$ 9395312 9151566 8968582 9114360 8907790 9061043 8646640 8652682 8318887 8238147 8120610
14119H120610m6107Q7885l21413j90458J06896k94025K92360m30468j72642R955
$$ 8120610 8074503 8162388 7840975 7650517 7757413 7463388 7755748 7325280 7152638 7162593
14109G162593Q7111m53696o5219M18444j52137l68647J78403m46242M518q9391
$$ 7162593 7249704 6796008 6730789 7149233 6997096 6628449 6806852 6360610 6365128 6275737
14099F275737Q0557q2023k03283j76285r3607J62270k33002K97887l60735J23251
$$ 6275737 6356294 6274271 6070988 5894703 5801096 5963366 5730364 6028251 5667516 5790767
14089E790767k49072M1160k12481j70983M89646k75603k57910p8918p0057J05960
$$ 5790767 5541695 5582855 5370374 5199391 5689037 5413434 5155524 5076606 5006549 5112509
14079E112509k21333L01251k29242m17383O6414J47266j96576j02173L6201J53309
$$ 5112509 4891176 5192427 4963185 4545802 4612216 4759482 4562906 4460733 4496934 4650243
14069D650243l36627j29628K78849l59390J24383K9706j92827q9854K34253k07604
$$ 4650243 4313616 4183988 4462837 4103447 4227830 4257536 4064709 3974855 4209108 4001504
14059D001504J27209J09981m35059L40567o00l52810K78975l65666j78550N1259
$$ 4001504 4128713 4238694 3803635 4144202 4143602 3790792 4069767 3704101 3525551 3576810
14049C576810O4028J26241j25398j40780m4159J69169j73873J89001l32188l22896
$$ 3576810 3640838 3767079 3641681 3500901 3456742 3625911 3452038 3641039 3308851 2985955
14039B985955M43509L05091p2941j5058k27244k89557M4738l1918j4732Q3184
$$ 2985955 3429464 3734555 3661614 3646556 3419312 3129755 3174493 3142575 3127843 3211027
14029C211027m1119q2398j66831L88941n49191L89973M7978l30785K26683m02512
$$ 3211027 3169908 3087510 2920679 3309620 2760429 3150402 3198380 2867595 3094278 2691766
14019B691766j26614q0043R4789K21688j36255m3853l43280R5390M48076k33661
$$ 2691766 2565152 2485109 2579898 2801586 2665331 2621478 2278198 2373588 2821664 2588003
14009B588003m7657n3766K7389j62805p1231l7389j95734M31610M7072l2110o3399
$$ 2588003 2540346 2486580 2513969 2351164 2279933 2242544 2046810 2478420 2525492 2493382 2429983
13998B429983j98203p2295J59766O9002j65711j71146K79183K85262M42880N98016
$$ 2429983 2231780 2159485 2319251 2388253 2222542 2051396 2330579 2615841 3058721 3656737
13988C656737K342354N819206J5490181K0545219j6951159j5093505o488833k784787
$$ 3656737 5999091 11818297 27308478 47853697 30902538 15809033 9320200 6535413
13980F535413j481744m74109q51895r9197m05747j77772L7411M5828n82781R6508
$$ 6535413 5053669 4579560 3727665 3628468 3222721 3044949 3082360 3128188 2545407 2641915
13970B641915k76648K167K25081N2580j35311M6713j86657K41219j23887m69646
$$ 2641915 2365267 2367434 2592515 2645095 2509784 2556497 2369840 2611059 2487172 2017526
13960B017526Q8627K52996j39044R9715j19774J21429m14037R5281l2941M6332
$$ 2017526 2106153 2359149 2220105 2319820 2200046 2321475 1907438 2002719 1969778 2016110
13950B016110n5951m937o4211R2754n7653Q3282l01406R5371k33860P00898l35635
$$ 2016110 1960159 1955222 1891011 1983765 1926112 2009394 1707988 1803359 1569499 2270397 1934762
13939A934762j29614J21307j33422M1635k37208J4181j83786N82566j96443j72134
$$ 1934762 1805148 1926455 1793033 1834668 1597460 1611641 1427855 2010421 1813978 1641844
13929A641844Q1345j53871O4221j14374L18675k57587J71458l45413J07746L8838
$$ 1641844 1723189 1569318 1633539 1519165 1837840 1580253 1751711 1406298 1514044 1552882
13919A552882J30623l4148l89320M67114l2115k53299k3130K11783k41199J20708
$$ 1552882 1683505 1649357 1260037 1727151 1695036 1441737 1418607 1630390 1389191 1509899
13909A509899j53667L0790R198R5630R9920j03498k91495L62811J01481o18066
$$ 1509899 1356232 1387022 1396220 1491850 1591770 1488272 1196777 1559588 1661069 1043003
13899A043003J87618L85156l1596k51810l0472K9382j15665Q4290L3820Q1237
$$ 1043003 1230621 1615777 1584181 1332371 1301899 1331281 1215616 1299906 1333726 1414963
13889A414963m0639J59600k70661r1241J0240L27173j95113K76160n32280R94
$$ 1414963 1374324 1533924 1263263 1172022 1182262 1509435 1314322 1590482 1058202 1059196
13879A059196N24337n93493K00868K2047O303k21916N67053k86285L58803l20349
$$ 1059196 1583533 990040 1190908 1212955 1219258 997342 1564395 1278110 1636913 1316564
13869A316564l24070J07957M6159n6683J64225k63900R8782K32653k57714q0803
$$ 1316564 992494 1100451 1146610 1089927 1254152 990252 1089034 1321687 1063973 983170
13859I83170o4122r1032N58397j93542j37137L20473n88850Q5325L2931M1484
$$ 983170 919048 828016 1386413 1192871 1055734 1376207 787357 872682 905613 947097
13849I47097O24349o72154q0318M42931k04199L4200O9554l59598k1669K99970
$$ 947097 1571446 899292 818974 1261905 1057706 1091906 1161460 801862 780193 1080163
13839A080163n925K02916j03347l39096N53200j63986k95741k80952L49984J73105
$$ 1080163 1074238 1277154 1173807 834711 1387911 1223925 928184 647232 997216 1170321
13829A170321K4538j8622l31455q807R0438j74563k96070N73056j13576Q8848
$$ 1170321 1194859 1176237 844782 835975 926413 751850 455780 1028836 915260 1004108
13819A004108k06163l2078L24318k96807J37013o1722j47590L25793r3547l52715
$$ 1004108 797945 765867 1090185 793378 930391 868669 721079 1046872 953325 600610
13809F00610L39281j29844L064K46840l55768k94399J67107K32296p5760Q2679
$$ 600610 939891 810047 813111 1059951 704183 409784 576891 809187 733427 816106
13799H16106l3692k1606J8853M7620l62867N81141m28877L93527k75424K33165
$$ 816106 782414 760808 779661 827281 464414 1045555 616678 1010205 734781 967946
13789I67946k21356R1387l00459K59499L85175n40779R6887k21959L25643l0635
$$ 967946 746590 837977 537518 797017 1182192 641413 738300 516341 841984 811349
13779H11349j03846N6993j47264J35898K99009m33085k4356B85616L47983J54751
$$ 811349 707503 764496 617232 753130 1052139 619054 594698 285616 633599 788350
13769G88350j08160L04977l62165R9342k5194O0280J83787k48587M00858j62331
$$ 788350 680190 985167 623002 722344 697150 757430 941217 692630 1093488 931157
13759I31157L0718J44865m15559K3702l30485N25356m09406J47448q6387K81102
$$ 931157 961875 1106740 691181 714883 384398 909754 500348 647796 561409 842511
13749H42511k22294J58040j1271k85369L1477J76603k70381J91780L4349r7020
$$ 842511 620217 778257 766986 481617 513094 689697 419316 611096 645445 548425
13739E48425j5866L43842k64851l8526J16086B39102N92833C21085L25559K45791
$$ 548425 532559 876401 611550 573024 689110 239102 831935 321085 646644 892435
13729H92435j64555J3363C05400J59957M39690k51451l5943p4830J61390J31083
$$ 892435 727880 741243 305400 465357 905047 653596 617653 542823 704213 835296
13719H35296B81535M95810q6967K61677l56946O5043k32452M05031B26903M79119
$$ 835296 281535 777345 690378 952055 595109 660152 427700 832731 226903 706022
13709G06022k12641p7885O31599l68994o0680J3087m9990J99600O5090k50883
$$ 706022 493381 415496 1047095 678101 617421 630508 580518 780118 845208 594325
13699E94325N5206k18589L29344j14491j39744J41028j88857A86197J19744A18802
$$ 594325 649531 430942 760286 645795 506051 647079 458222 186197 305941 118802
13688B76108M67001B78757L48303C08968L7634K59553k20901K54746k10805K07859
$$ 276108 743109 278757 627060 308968 346602 606155 385254 640000 429195 637054
13678F37054o2371j1148A67470L26169J24865q5005K9612k26166N61642k11402
$$ 637054 574683 563535 167470 493639 618504 533499 563111 336945 898587 687185
13668F87185j4754q1176K4894r8255n5985O7806k51864J87462K2098K6080j79222
$$ 687185 672431 591255 616149 517894 461909 529715 277851 465313 487411 513491 334269
13657C34269J15977Q7310k27057N5708J63202K50774B14214M7626K67149K35844
$$ 334269 450246 537556 310499 366207 529409 780183 214214 261840 528989 764833
13647G64833A60955K02023l0408J62692l972J20654q8512B48075r138J22232J28783
$$ 764833 160955 362978 332570 495262 491290 611944 523432 248075 238937 361169 489952
13636D89952j87511L02347j99384o2385j16581J6495K66199J34074k48384m6933
$$ 489952 302441 604788 405404 343019 226438 242933 509132 643206 394822 347889
13626C47889K14856k46782K54345k32103P2557A86465K89333M3497p0315o9078
$$ 347889 562745 315963 570308 338205 410762 186465 475798 519295 448980 379902
13616C79902M9754j02725j35065Q2253J40492J46464k12889K53126j29357K09920
$$ 379902 429656 326931 191866 274119 414611 561075 348186 601312 471955 681875
13606F81875k43330p2766j00659L27023j89801A84085J40236G5673L59860N0853
$$ 681875 438545 365779 265120 592143 402342 184085 324321 75673 435533 486386
13596D86386j10647A38847J78309j3871P9431R821j15571J32365o9937R5135q5902
$$ 486386 375739 138847 317156 303285 382716 392537 276966 409331 339394 434529 348627
13585C48627j27642R4271R6418r5861j53567o0427M3817M06872A29158L91537
$$ 348627 220985 315256 411674 315813 162246 101819 145636 552508 129158 520695
13575E20695I2755h9125B6626M82303j48842M9410K92996l46000J83750j51634
$$ 520695 92755 -89125 26626 508929 360087 409497 702493 356493 540243 388609
13565C88609F1432K16327J19999A67134n5818J25639a9216D23325k0265J4F8518
$$ 388609 61432 277759 397758 167134 111316 236955 -19216 423325 403060 403074 68518
13553D06766K48534k23656o8887q0044p4094K60748r7850d5516C66581n7399j0863
$$ 406766 655300 431644 362757 282713 208619 469367 371517 -45516 366581 309182 298319
13542B98319J22023A80029O4463R655a29564E49821B22685K20991j64707J1230
$$ 298319 420342 180029 244492 254147 -129564 549821 222685 443676 278969 290199
13532B90199J59229Q360j07369A69054m5047K87010A82449C4862L9195l504d6521
$$ 290199 449428 457788 350419 169054 124007 411017 182449 34862 74057 70553 -46521
13520B35924Q1688m1992j375m7744M00752h2733C23656H5289Q3771J14050n2666
$$ 235924 317612 275620 274245 226501 627253 -82733 323656 85289 169060 283110 230444
13509B30444l6099J22862K27091H5882L29379A07026N13188C05275r1980O9267
$$ 230444 194345 317207 544298 85882 415261 107026 620214 305275 213295 282562
13499B82562J05978j73500N3202n2890e7111B08444N8571a24250C30501l8521
$$ 282562 388540 215040 268242 215352 -57111 208444 267015 -124250 330501 291980
13489B91980a57084A41807J27941j0002F3348M0423L40007A17079K04181p6377
$$ 291980 -157084 141807 269748 259746 63348 103771 443778 117079 321260 244883
13479B44883L27499n1521a31133D13538A04210K26198k5063P9912A36363J26540
$$ 244883 572382 520861 -131133 413538 104210 330408 305345 385257 136363 262903
13469B62903O8795j63809J69910Q3221b6041B14106H8036L43581q9266D3222c9357
$$ 262903 331698 167889 337799 421020 -26041 214106 88036 431617 342351 43222 -39357
13457A80154L23322g4753A24772K89482A81382b3000A36611L59601B18337I1825
$$ 180154 503476 -74753 124772 414254 181382 -23000 136611 496212 218337 91825
13446C51367p9440Q1162k0163o9607L1490D9102N01606j99325M2729A85872P5512
$$ 351367 271927 353089 332926 263319 294809 49102 550708 351383 394112 185872 261384
13435B61384j21239K93091b059A44517Q7164q419J54539r7575J1722A05410k106
$$ 261384 140145 433236 -2059 144517 231681 223262 377801 280226 291948 105410 103304
13424A03304O4232l7383M42076A44622O8164L2759D1881n437L00852j5383j40103
$$ 103304 167536 130153 572229 144622 212786 245545 41881 36444 337296 321913 181810
13413A81810n5376M58164a04071F7678L15008E2687a1743I9248a51021C4038K43428
$$ 181810 126434 584598 -104071 67678 382686 52687 -11743 99248 -151021 34038 277466
13402B77466J9319j26514K56916A13182a5119C03126j00749r8959j7156B6575
$$ 277466 296785 170271 427187 113182 -15119 303126 202377 103418 86262 26575
13391C61887r2236p403j24583R2811K8310N6221J13655A67613c6422I8951D118
$$ 361887 269651 262248 137665 230476 258786 315007 428662 167613 -36422 98951 4118
13379A53250L4606B9565J35069L32520B15728N8769A01037K2451E3991J86879
$$ 153250 187856 29565 164634 497154 215728 274497 101037 123488 53991 240870
13369B40870L7986o1044G4496d087I2370a65663B30567r8575c27479g332C8046
$$ 240870 278856 217812 74496 -4087 92370 -165663 230567 131992 -327479 -7332 38046
13357F27067H280K04119K3642j1578H4897J32019m9778L30593j07021i5452C47146
$$ 627067 8280 212399 236041 224463 84897 216916 167138 497731 390710 -95452 347146
13345I6566K91158r2481l8860Q7609j03709m0665n2337m5400l2096J15706L7387
$$ 96566 387724 295243 256383 343992 240283 199618 147281 101881 69785 185491 222878
13334B22878K07697R7126F0354L64499e5650B90787A07544R6404n3318J0334R4426
$$ 222878 430575 527701 60354 424853 -55650 290787 107544 203948 150630 160964 255390
13323B55390J51720j01863A09231J72688K41320A53273M14675k22602J541j01702
$$ 255390 407110 305247 109231 281919 523239 153273 567948 345346 346887 245185
13313B45185E8146L662B7427l642K52899p2569a14238E6484Q4339a60006R291
$$ 245185 58146 61808 27427 23785 276684 204115 -114238 56484 140823 -160006 -150715
13302a50715C87278R9823D6587r153e5331B68378a25838C0260J20599A2146J22284
$$ -150715 387278 487101 46587 37434 -55331 268378 -125838 30260 150859 12146 134430
13291A34430L48226j55461J58829k35326i8374B34205F5509D843J39496q793K47978
$$ 134430 482656 327195 486024 250698 -98374 234205 65509 4843 144339 135546 383524
13280C83524l1832F3169a03529B0159J82324a55877B32116b1124C00596j15672
$$ 383524 351692 63169 -103529 20159 202483 -155877 232116 -21124 300596 184924
13270A84924J35019C4968P3304l2612e6933A07089d004o6248A50328F7813N4814
$$ 184924 319943 34968 108272 75660 -56933 107089 -4004 -70252 150328 67813 122627
13259A22627J4958K00889f3552B95105J08992j21155m2030J17614f2901B84840
$$ 122627 137585 338474 -63552 295105 404097 282942 240912 358526 -62901 284840
13248B22583f089B07887F4776J75114J17586J6484A82359j505L900D8719K77435
$$ 222583 -6089 207887 64776 239890 357476 373960 182359 180854 184754 48719 326154
13237C26154r2188b36645A55349b54806B53882A05699a29332G5645N6017J24332
$$ 326154 233966 -236645 155349 -254806 253882 105699 -129332 75645 131662 255994
13227B55994a73010d6197N571l8430A55901c8332k6339B42340K1385j27168g665
$$ 255994 -173010 -46197 -40626 -79056 155901 -38332 -64671 242340 263725 136557 -7665
13215B70075M7120k62l4425J2368G4986J38997R3873E5475N7920K9756D7910Q3006
$$ 270075 317195 316933 282508 294876 74986 213983 307856 55475 113395 143151 47910 130916
13203A30916f1943l9236L4254k7102C10413d2627A67669K63896e1833H229J10961
$$ 130916 -61943 -101179 -66925 -94027 310413 -42627 167669 431565 -51833 8229 119190
13192A19190A1492O6384a25169c2490l12220a8249A08521M3298b4962m15749I8454
$$ 119190 11492 77876 -125169 -32490 -344710 -18249 108521 151819 -24962 -440711 98454
13180A08839K90851A92660J8190L81601a78058J6982L5360e5526B54235e1995
$$ 108839 399690 192660 210850 592451 -178058 -161076 -125716 -55526 254235 -51995
13169a87532F3367a52509A97726k817A0486O5619J91590J27968A69171M6436O2338
$$ -187532 63367 -152509 197726 194909 10486 76105 267695 395663 169171 215607 277945
13158B77945G1418J53824a53859C30551O9216C1996a632B46763j20032R5498I5402
$$ 277945 71418 225242 -153859 330551 399767 31996 -1632 246763 126731 222229 95402
13146a65563B63880i5784B20704d50481C8947K79299a62401g7641A55862n0593
$$ -165563 263880 -95784 220704 -450481 38947 318246 -162401 -77641 155862 105269
13136A05269J06700a68733G956R8873K10122n1738a40513A55547e2543B391b18288
$$ 105269 211969 -168733 7956 106829 316951 265213 -140513 155547 -52543 2391 -218288
13124B37591r1059J27479I0657O9343J65085I9866N3844q407I053J97304n0631
$$ 237591 146532 274011 90657 160000 325085 99866 153710 145303 9053 206357 155726
13113A55726i740q9729D7357i5257k1035B44640I0965K6884J08066o0318B5194
$$ 155726 -9740 -99469 47357 -95257 -116292 244640 90965 117849 225915 165597 25194
13101A60751K30340a19743b4536R655k4286A44489b10182c6379j3635a9528C13601
$$ 160751 391091 -119743 -24536 -14881 -39167 144489 -210182 -36379 -50014 -19528 313601
13089A652a6502l9156B47108c1261H8768M0933L64692G946a6639A03167a53088
$$ 1652 -16502 -55658 247108 -31261 88768 129701 494393 7946 -16639 103167 -153088
13077A70952j0693o6393a5186l24251A13294J05556J9774O4544N8724E8048b04628
$$ 170952 160259 93866 -15186 -339437 113294 218850 238624 303168 361892 58048 -204628
13065a84140j94743A9745K38212o8708n9428l3553C5167K17332E8339b25375f475
$$ -184140 -378883 19745 257957 189249 129821 96268 35167 252499 58339 -225375 -6475
13053A27514B0829J35105K40265A10520a9898A65271N43015C1231O8624O6115
$$ 127514 20829 155934 396199 110520 -19898 165271 708286 31231 99855 165970
13043A65970A3094e1411j52528B00775E9784j138B8379a84652G6543J05999L0477
$$ 165970 13094 -51411 -203939 200775 59784 58646 28379 -184652 76543 182542 213019
13032B13019G8753J73583A15561b1840G8169a07271H9858J52589r5108J34719
$$ 213019 78753 252336 115561 -21840 78169 -107271 89858 242447 147339 282058
13022B82058a14462B98450H6194D1612J18136G1249b2683C14331m7520F7069a13518
$$ 282058 -114462 298450 86194 41612 159748 71249 -22683 314331 266811 67069 -113518
13010b38501B1220J31326a24630E0388R5456e4594A83154J8028o5989f6893F0575
$$ -238501 21220 152546 -124630 50388 145844 -54594 183154 201182 135193 -66893 60575
12998B08723J5282N5211E7861f7108E6617h0247B36832p8079o2043M8370a7482
$$ 208723 224005 279216 57861 -67108 56617 -80247 236832 158753 96710 145080 -17482
12986H2989A346J25724a5537I5069J23883C5811j0614a33582C81578I0569L12108
$$ 82989 1346 127070 -15537 95069 218952 35811 25197 -133582 381578 90569 402677
12975D02677A21818a47870d5489E9110L28156A38109e25659a67881j67818N8755
$$ 402677 121818 -147870 -45489 59110 387266 138109 -525659 -167881 -335699 -276944
12965b76944B1331i6358B02209b02251d8685A47874j4103H3J90681O4552e8106
$$ -276944 21331 -96358 202209 -202251 -48685 147874 133771 83 190764 255316 -58106
12953I8175A1425L0048a57021A94029G6885a46328G0880c0472j28968l2830f6940
$$ 98175 11425 41473 -157021 194029 76885 -146328 70880 -30472 -159440 -192270 -66940
12941c6988h923B68806I1639b5377A44337f4553j0566A2513K82128I8843A8357
$$ -36988 -8923 268806 91639 -25377 144337 -64553 -75119 12513 294641 98843 18357
12929B08866f9211g257A51837J34083n9600c48568A25736g1141F8760a64390e2399
$$ 208866 -69211 -7257 151837 285920 226320 -348568 125736 -71141 68760 -164390 -52399
12917G3669K06464q9275a797A20163a23668c0828B26751H4760N8975B6822b88677
$$ 73669 280133 190858 -1797 120163 -123668 -30828 226751 84760 143735 26822 -288677
12905E2363j8427M1113a4250B72311H5012i6694E5684N0832a82881B71632j14816
$$ 52363 33936 75049 -14250 272311 85012 -96694 55684 106516 -182881 271632 156816
12894A56816l4496O1065E0425i0769A57253k9191F2492f6998a4290B75202d2681
$$ 156816 122320 183385 50425 -90769 157253 128062 62492 -66998 -14290 275202 -42681
12882a49824c6477a3212j6063l0616J1560A81620O9102f2097h838j87318C6083
$$ -149824 -36477 -13212 -29275 -59891 -48331 181620 250722 -62097 -8838 -196156 36083
12870d43486a23539c121j04476D18739A80834A2814M62851o4795c1672r5959G4604
$$ -443486 -123539 -3121 -107597 418739 180834 12814 475665 410870 -31672 -127631 74604
12858a42803A66611d08713A07931L3644D1816O1710Q0059L2563J82494A54759
$$ -142803 166611 -408713 107931 141575 41816 103526 183585 216148 398642 154759
12847F1682M3976M302a05007K5610B67130r4931K18220a34058j12203C33191b10493
$$ 61682 105658 109960 -105007 -79397 267130 172199 390419 -134058 -246261 333191 -210493
12835H4907J58722e5675C62271A2374J6319J82663n1597M8655a93621L8408A55786
$$ 84907 243629 -55675 362271 12374 28693 211356 159759 208414 -193621 -155213 155786
12823A14459D3322J75692b27587g2858j30313A28609a47497j5506B55474H7670
$$ 114459 43322 219014 -227587 -72858 -203171 128609 -147497 -163003 255474 87670
12812B95212g979h47A95530q6658k5182a06308k19363O7i6195n6101a6866B72372
$$ 295212 -7979 -847 195530 108872 83690 -106308 -325671 -325604 -96195 -152296 -16866 272372
12799a16277B38888b80757R7762n8304A73269O1834e0398o3153C39499A04931
$$ -116277 238888 -280757 -182995 -241299 173269 235103 -50398 -113551 339499 104931
12788g7450B2297O0792Q7615a25369C70005a15583I5535i4238k0728I9157d0911
$$ -77450 22297 83089 170704 -125369 370005 -115583 95535 -94238 -114966 99157 -40911
12776a8116E684K46701F0283b80483A36799J3900i6351j1855B22920g1119B10951
$$ -18116 5684 252385 60283 -280483 136799 150699 -96351 -108206 222920 -71119 210951
12764B63047a51320O3437k5971B94058a03109g311q5667A53630a30853d4905A45176
$$ 263047 -151320 -87883 -113854 294058 -103109 -7311 -92978 153630 -130853 -44905 145176
12752b04750I0361a22279E5371K61634i4757Q855L9113j0072B01836a68103j28918
$$ -204750 90361 -122279 55371 317005 -94757 -85902 -46789 -56861 201836 -168103 -297021
12741b97021a6175j22785c1013A27071J38948F9484K82899A08735a13686A24669
$$ -297021 -16175 -138960 -31013 127071 266019 69484 352383 108735 -113686 124669
12730I6798a39545C8076N5610a56287K2633q0287n0096j11343J41257P9925A14877
$$ 96798 -139545 38076 93686 -156287 -133654 -213941 -264037 -375380 -234123 -154198 114877
12718B03373b35661B48447a4643A81868a01829B72018h9364G3895M9411L2347
$$ 203373 -235661 248447 -14643 181868 -101829 272018 -89364 73895 123306 155653
12708A55653J18846j21480J32315A3329b22593B96040A05335D2509j3957J94310
$$ 155653 274499 153019 285334 13329 -222593 296040 105335 42509 28552 222862
12698B22862a38480q6776B66236a71976a8679A53913b37919B7103J24534a10555
$$ 222862 -138480 -225256 266236 -171976 -18679 153913 -237919 27103 151637 -110555
12687a66172C3773J24990g0908G1030i39j7444j11419J1430a4591C58898A79022
$$ -166172 33773 158763 -70908 71030 -939 -18383 -129802 -118372 -14591 358898 179022
12675B62045d2299q9597A53894J13556b6826q8839A2850K51218a38652q9420Q4428
$$ 262045 -42299 -131896 153894 267450 -26826 -115665 12850 264068 -138652 -228072 -143644
12664a43644A90853A7153K33559B4200P2740D2238M8658J87979o1319G115L64611
$$ -143644 190853 17153 250712 24200 96940 42238 90896 278875 217556 7115 371726
12653C71726H8704B1544b05851H906b9868A17934k205m4650a10432A38056m836
$$ 371726 88704 21544 -205851 8906 -29868 117934 115729 71079 -110432 138056 133220
12642A33220P7752o0055A3881K23715a44782e6471K168C54673j266D013K44181
$$ 133220 210972 150917 13881 237596 -144782 -56471 -54303 354673 353407 4013 248194
12631B48194g1417E23245j41851A22953L35908k15751H6716A2247L34508k0635
$$ 248194 -71417 523245 381394 122953 458861 243110 86716 12247 346755 326120
12621C26120b5601j6074B28709a77699j1920C35701b14374j5671a10460H5428
$$ 326120 -25601 -41675 228709 -177699 -189619 335701 -214374 -230045 -110460 85428
12610a2972C81931a47346K7868j54261I3688L7360b98460M3918A70111c67377
$$ -12972 381931 -147346 -119478 -273739 93688 131048 -298460 -254542 170111 -367377
12599g1588J8685A21783k6813A1637K48314H4135a09682B23678j8531c8561F2344
$$ -71588 -52903 121783 94970 11637 259951 84135 -109682 223678 205147 -38561 62344
12587A72648D3517b74739C5585N3941b8955j98153K0005F7744b86723J20812h1428
$$ 172648 43517 -274739 35585 89526 -28955 -227108 -207103 67744 -286723 -165911 -81428
12575A2585a68960B52300A7982g7121A87340o9717l822B7828a83019e1966j7009
$$ 12585 -168960 252300 17982 -77121 187340 117623 113801 27828 -183019 -51966 -68975
12564f8975H1001K95078G5562J37711c35093A39425k9906K4696p701J10304b69153
$$ -68975 81001 376079 75562 213273 -335093 139425 109519 134215 126514 236818 -269153
12552b4204A87196a72245D6077K13304d878o5554A75406d6772I0528c2550j38046
$$ -24204 187196 -172245 46077 259381 -4878 -70432 175406 -46772 90528 -32550 -170596
12541a70596K2113n8536L0871B14160c74084B14169D0536A6648a19402A5584a27567
$$ -170596 -148483 -207019 -176148 214160 -374084 214169 40536 16648 -119402 15584 -127567
12529A50958o5671P2862b54411i1290C59117q7559q9251B3472g1697A42856A6324
$$ 150958 85287 158149 -254411 -91290 359117 271558 182307 23472 -71697 142856 16324
12517e15986a22135k0987A43477c34811h2918j00095A11850c29598A72471C9302
$$ -515986 -122135 -143122 143477 -334811 -82918 -183013 111850 -329598 172471 39302
12506G6765L60198A9781J32561F4328k6974N8094J65957K683C7098J07775b70382
$$ 76765 436963 19781 152342 64328 37354 95448 261405 264088 37098 144873 -270382
12494a17597B57892b00918A27958b63984B93759Q0125j45717H5488M4707c711
$$ -117597 257892 -200918 127958 -263984 293759 373884 228167 85488 130195 -3711
12483a2194C55513i6270p2976B11455j01478m0518O0963d6003B59718e9216H7580
$$ -12194 355513 -96270 -169246 211455 109977 69459 130422 -46003 259718 -59216 87580
12471a50109I8872k3183k5484c12611Q3201D14446c8788j30385j2732B9494M4422
$$ -150109 98872 75689 50205 -312611 -229410 414446 -38788 -169173 -181905 29494 73916
12460G3916p57i6174L7340j84946n5155J19959j594B61119F5457R5029a57624
$$ 73916 73159 -96174 -58834 -243780 -298935 -178976 -180570 261119 65457 160486 -157624
12448B72466A7991h094A13271b85356D13017b26013D4282b18419A82290b44223
$$ 272466 17991 -8094 113271 -285356 413017 -226013 44282 -218419 182290 -244223
12437A2116f9362a4909j60304J1784m0301A40325C981K54593c14016O6880f4938
$$ 12116 -69362 -14909 -175213 -163429 -203730 140325 3981 258574 -314016 -247136 -64938
12425E9275h4493A63447f0112m4363k29929B44546a83370G8237f8845k02323B17441
$$ 59275 -84493 163447 -60112 -104475 -334404 244546 -183370 78237 -68845 -271168 217441
12413I5580L62122a31577D24779G38J69010b3251B53129a31011k54132h287l04651
$$ 95580 457702 -131577 424779 738 169748 -23251 253129 -131011 -385143 -8287 -312938
12402c12938n0251I7569b56296A46114E4933A7039L3331J31128a27320b1941k69965
$$ -312938 -363189 97569 -256296 146114 54933 17039 50370 181498 -127320 -21941 -291906
12391b91906k75297A99242c87006B2164h7467C29073r6140d19314h6412G4689
$$ -291906 -567203 199242 -387006 22164 -87467 329073 232933 -419314 -86412 74689
12380g599D7357J35086p0527a30633A29678i3897C9258N1716J4441n500J11617
$$ -7599 47357 182443 111916 -130633 129678 -93897 39258 90974 105415 99915 211532
12369B11532J13111h7552q9706B969a03159j48518J19219j76994a22400A45339
$$ 211532 324643 -87552 -177258 2969 -103159 -251677 -132458 -309452 -122400 145339
12358B63729J07673h7606o8491l9616C3166K28254k7626b00945b8170B98847c53798
$$ 263729 371402 -87606 -156097 -195713 33166 261420 233794 -200945 -28170 298847 -353798
12346a20766a0510l0807J9447G2626d8656B77311B6887P6710j7748N96f7913D6571
$$ -120766 -10510 -41317 -21870 72626 -48656 277311 26887 103597 85849 86445 -67913 46571
12333F2130k917b24042A06498J53655g7819C1832b00211H4162N3478L6707h2366
$$ 62130 59213 -224042 106498 260153 -77819 31832 -200211 84162 137640 174347 -82366
12321B73020b31508B34757I9442r699j831b3316j13829L4303K898j55942B09691
$$ 273020 -231508 234757 99442 89743 87912 -23316 -137145 -102842 -99944 -255886 209691
12309a57851j23337q4049C35891f4040j65746A40840a12570o4540A8891K4547
$$ -157851 -281188 -365237 335891 -64040 -229786 140840 -112570 -177110 18891 43438
12299D3438h8993H4618O2132L1906J38569a5781j7562A06455Q2502a00434B24484
$$ 43438 -88993 84618 146750 178656 317225 -15781 -33343 106455 188957 -100434 224484
12287B9953b99486I7809J63938a09254A36368b55460B94111m0594l7401j03880
$$ 29953 -299486 97809 261747 -109254 136368 -255460 294111 253517 216116 112236
12277A12236N2238c7639B23883j1984P8478e2238m2552G8002b4672A16189P1411
$$ 112236 164474 -37639 223883 211899 290377 -52238 -94790 78002 -24672 116189 187600
12266A87600J11367h7158B15322b20903C9015a06147l57763A80991p9936m2364
$$ 187600 298967 -87158 215322 -220903 39015 -106147 -463910 180991 101055 58691
12256E8691a62182B03606g2399C71218A22699m4238J02599d9945C20455p0462
$$ 58691 -162182 203606 -72399 371218 122699 78461 181060 -49945 320455 249993
12246B49993P3915a00133D25231a76676B29007r1106B132J96421G6720a39260
$$ 249993 323908 -100133 425231 -176676 229007 137901 2132 198553 76720 -139260
12235a11452b2741A54674J25230C8086K29995r4574J62758B9760J48249J16030
$$ -111452 -22741 154674 279904 38086 268081 173507 336265 29760 178009 294039
12225B94039a20820C89341q554p1411C9125K85705G3276B8866K41019J64367g0474
$$ 294039 -120820 389341 380787 309376 39125 324830 73276 28866 269885 434252 -70474
12213a84658C84993F3040N2685N3358q977a19657C6932L65582E8003k5832c5898
$$ -184658 384993 63040 115725 169083 160106 -119657 36932 402514 58003 32171 -35898
12201C47615j00524p1474a4670D07831E63J81785H075M3933a99790F6769K00836
$$ 347615 247091 175617 -14670 407831 563 182348 8075 52008 -199790 66769 267605
12190B67605l4868j01698J00653J55774g7057H1583a8278Q207A76655E2269b8665
$$ 267605 232737 131039 231692 387466 -77057 81583 -18278 -10071 176655 52269 -28665
12178b31759b7281D11494a51757a9456C34045I6012J40090b19978B03211G9710
$$ -231759 -27281 411494 -151757 -19456 334045 96012 236102 -219978 203211 79710
12167A15377c4379B75160i946k37417B07984k0182a98848j19417J5731A37638
$$ 115377 -34379 275160 -9946 -247363 207984 187802 -198848 -318265 -302534 137638
12156I5414M781K28499H2690J62883B3887a93980I772J53931A2236q50a29903
$$ 95414 100195 328694 82690 245573 23887 -193980 9772 163703 12236 11386 -129903
12144b62168K7025h5064A45380a41581J3338C36369J3874g4718H7094C8045K6666
$$ -262168 -235143 -85064 145380 -141581 -128243 336369 350243 -74718 87094 38045 64711
12133F4711L1617L2037K8214A448J47420a30176D31770A82157D1304M881a9130
$$ 64711 96328 128365 156579 1448 148868 -130176 431770 182157 41304 46185 -19130
12121A11110C8909i170B48568G915b81463e6772p2664c2170j27477d0390n9914
$$ 111110 38909 -9170 248568 7915 -281463 -56772 -129436 -32170 -159647 -40390 -100304
12110a00304b4467A03669P3968D6446R7954F6083J68353Q548p7306c35215C11124
$$ -100304 -24467 103669 177637 46446 144400 66083 234436 242984 165678 -335215 311124
12098e25806a18212A30980j7666k8745A144c07380I5995B4196a97823C51143b29327
$$ -525806 -118212 130980 113314 84569 1144 -307380 95995 24196 -197823 351143 -229327
12086A08262J63853f5744H1920c37411A57792K29347C3014K92949E3972b63374
$$ 108262 272115 -65744 81920 -337411 157792 387139 33014 325963 53972 -263374
12075B29005a8607C9520a66386r9603g8171B59779a46173d2095A403065K18215
$$ 229005 -18607 39520 -166386 -265989 -78171 259779 -146173 -42095 1403065 1621280
12065A621280C63912n3295F4883A5205a19318j62379D0092J29367e4242B51677
$$ 1621280 363912 310617 64883 15205 -119318 -281697 40092 169459 -54242 251677
12054a8845D04358A8439a06078p222J5855k5418q1655j8534A65560p1034a48383
$$ -18845 404358 18439 -106078 -113300 -97445 -122863 -204518 -223052 165560 94526 -148383
12042G0240K25100K0489i7199d2308m1782B23500p5189a28506E6489J2337d7021
$$ 70240 295340 315829 -97199 -42308 -84090 223500 148311 -128506 56489 68826 -47021
12030c1249H9708b98473H1305a06919A04272b29837j8103a1646k01292A76O4223
$$ -31249 89708 -298473 81305 -106919 104272 -229837 -247940 -11646 -212938 176 64399
12019F4399N7063P2517k2177p4858A9103J81419J4733J642q9495C4017a72960
$$ 64399 121462 193979 171802 96944 19103 200522 215255 216897 127402 34017 -172960
12007A16364m7592i1089A75558c5266p6087r0470k18824A91327b1866o9237j36974
$$ 116364 68772 -91089 175558 -35266 -111353 -201823 -420647 191327 -21866 -91103 -228077
11996b28077B16660d8210A2019c46938a48213A76996b37716N4377k45798a81535
$$ -228077 216660 -48210 12019 -346938 -148213 176996 -237716 -183339 -429137 -181535
11985B21492b34478d5471k90227i2441C65400a8483F9605a07319l5004a0284H9983
$$ 221492 -234478 -45471 -335698 -92441 365400 -18483 69605 -107319 -142323 -10284 89983
11973h9586k0768p8688I4810b06505e8378q3676q7647A45966a26180H8905j7107
$$ -89586 -110354 -189042 94810 -206505 -58378 -142054 -229701 145966 -126180 88905 71798
11962G1798h7121A55396a9276j67100H2545A4695h2891j72462A29015f8003J5592
$$ 71798 -87121 155396 -19276 -186376 82545 14695 -82891 -255353 129015 -68003 -52411
11951e2411g052l334G839h5871A9090L8998J80719E5651g8471B816b67478B39290
$$ -52411 -7052 -10386 7839 -85871 19090 58088 238807 55651 -78471 2816 -267478 239290
11938C30046B6184M6754a67549j642n093e5172j04720j74214i0727A46661e8731
$$ 330046 26184 72938 -167549 -169191 -174284 -55172 -159892 -334106 -90727 146661 -58731
11926a70607E3319J83435b71030a02800J2417m486M737F71016F6633a20683A93490
$$ -170607 53319 236754 -271030 -102800 -90383 -94869 -90132 671016 66633 -120683 193490
11914a7640k34591j08298a37574E5034a09164k8275C1534h3788F6676a42743j4551
$$ -17640 -252231 -360529 -137574 55034 -109164 -137439 31534 -83788 66676 -142743 -157294
11903a57294B9584N4373C6138b22935B62493E115a12025E6752c46153h9696b137
$$ -157294 29584 83957 36138 -222935 262493 5115 -112025 56752 -346153 -89696 -2137
11891I4056m337b7898D0965E967J62920b07020c3799B22731k5760D0854b03295
$$ 94056 89719 -27898 40965 5967 168887 -207020 -33799 222731 196971 40854 -203295
11879E7580a62122e7149G9991J5760c41001A38362a81420d0736j3089C12931a97006
$$ 57580 -162122 -57149 79991 95751 -341001 138362 -181420 -40736 -53825 312931 -197006
11867C81240b03761B20603m7347P5820E6564p294a05560m8663r5192J20501p7649
$$ 381240 -203761 220603 173256 249076 56564 49270 -105560 -154223 -249415 -128914 -206563
11856b06563d4706j9715A04412C4145L11338h2988j35618b6377j85283b6727a476
$$ -206563 -44706 -64421 104412 34145 345483 -82988 -218606 -26377 -211660 -26727 -1476
11844b24003l6754J7686A24308M1057e8574l23606J85997A0643K36568a02120
$$ -224003 -260757 -243071 124308 165365 -58574 -382180 -196183 10643 247211 -102120
11833b1894b949j1299p6755A74604D9247a06207C4049A1820a77422B3160P8531
$$ -21894 -2949 -14248 -91003 174604 49247 -106207 34049 11820 -177422 23160 101691
11822A01691b59683b4556C06458g1977D1429L1011J12834e33823B9278J59317
$$ 101691 -259683 -24556 306458 -71977 41429 72440 185274 -533823 29278 188595
11812A88595m0390a48935A445a77690L7435A01869f4887b8145m4811r3125B27802
$$ 188595 148205 -148935 1445 -177690 -140255 101869 -64887 -28145 -72956 -166081 227802
11800c58635a36474c9553q98B6720K4181R9051e3851r8942N8570E6759h0053j84151
$$ -358635 -136474 -39553 -40451 26720 50901 149952 -53851 -152793 -94223 56759 -80053 -264204
11788b64204H2863K00146j25745o3181b28538I8851M8991i7680A278c17212C38494
$$ -264204 82863 283009 157264 94083 -228538 98851 147842 -97680 1278 -317212 338494
11776A96136L465g5958A16911e9368l33181D677b43011A83218i9719A37906Q3545
$$ 196136 199601 -75958 116911 -59368 -392549 4677 -243011 183218 -99719 137906 221451
11765B21451a79159A41487n9015b08172K3044R2089A7860J50750b19362L391A64421
$$ 221451 -179159 141487 82472 -208172 -185128 -93039 17860 168610 -219362 -215971 164421
11753b81746J21621O2090j23065R7551B98509a16143G448J40771c0096p7389G4230
$$ -281746 -160125 -98035 -221100 -123549 298509 -116143 7448 148219 -30096 -107485 74230
11741a17220m9451j88567a40458a6415C61346F5342K8197L1597b2380r7043A1476
$$ -117220 -166671 -355238 -140458 -16415 361346 65342 93539 125136 -22380 -119423 11476
11729f4756l715A19480e1862A91987L90226a74093a0527B20526r1a03438A3383
$$ -64756 -68471 119480 -51862 191987 582213 -174093 -10527 220526 220435 -103438 13383
11717A43483a51080e9679A58078F9997J25746h8117A44564B005L78390A37537
$$ 143483 -151080 -59679 158078 69997 195743 -88117 144564 2005 380395 137537
11706A19540n6548O1494J49952a72360B30488A08502O9449n4835c26899J17032
$$ 119540 62992 124486 274438 -172360 230488 108502 177951 123116 -326899 -209867
11696b09867C140N1417b89420G9975a40039E6893b53640B14420e416o5794A48569
$$ -209867 3140 54557 -289420 79975 -140039 56893 -253640 214420 -5416 -71210 148569
11684C18741h4764o2700b9616j7162A72822L2839G0333l0180d534k01654d0509
$$ 318741 -84764 -147464 -29616 -46778 172822 205661 70333 40153 -4534 -206188 -40509
11672C20900e3257E5154a7045k9510p0695j68769i3239A36539K54828A50376K09774
$$ 320900 -53257 55154 -17045 -46555 -117250 -286019 -93239 136539 391367 150376 360150
11661C60150p1098g5072B20480c4498D2557d4708m3158j4154N505j61476C81951
$$ 360150 289052 -75072 220480 -34498 42557 -44708 -87866 -102020 -96515 -257991 381951
11649G0071b07204E8443a62298m3110A6618h6674m78064C30881A10149I653J69239
$$ 70071 -207204 58443 -162298 -205408 16618 -86674 -564738 330881 110149 9653 178892
11638A78892a14745D1690f0266C26451C6818F39K08932b21518O7670B37711H7380
$$ 178892 -114745 41690 -60266 326451 36818 639 209571 -221518 -153848 237711 87380
11626B95979A47856Q6920b48973a4471k4317I5882N8745n4413a44927p9838L7731
$$ 295979 147856 234776 -248973 -14471 -38788 95882 154627 100214 -144927 -224765 -187034
11615a87034Q5089H3668c10991a37350B37075C6080O8877a64825A26087N7554
$$ -187034 -101945 83668 -310991 -137350 237075 36080 104957 -164825 126087 183641
11605A83641A4288c2122k24252B6786K23754c4293j57425P0047h584j23141N7122
$$ 183641 14288 -32122 -256374 26786 250540 -34293 -191718 -121671 -8584 -131725 -74603
11594g4603D22929e6446A43595J4017h1589C0941g8730H2699L84826k12299L0674
$$ -74603 422929 -56446 143595 157612 -81589 30941 -78730 82699 467525 255226 285900
11583B85900a53502C25281m3578C3195b66367j2320A68629R899A484J68742B5498
$$ 285900 -153502 325281 281703 33195 -266367 -278687 168629 178528 1484 170226 25498
11571a9738A712b09619A49554a67750A72860b37717A17844n2698j5127a83296
$$ -19738 1712 -209619 149554 -167750 172860 -237717 117844 65146 50019 -183296
11560c8157D2074J15732f8894B87366G6146a76589C63253a8072o610k86373B25803
$$ -38157 42074 157806 -68894 287366 76146 -176589 363253 -18072 -24682 -311055 225803
11548A08333a12556A86314F9072J7452B5747P6711O4970J19478r0743A3475a17991
$$ 108333 -112556 186314 69072 86524 25747 102458 167428 286906 196163 13475 -117991
11536C52257j30327b7240A22208f5163I4263b22787A26052B5658c1214C38820
$$ 352257 221930 -27240 122208 -65163 94263 -222787 126052 25658 -31214 338820
11525A31984a1934B15246Q0985A17419L64279H6909J2093a13583k4029A10212
$$ 131984 -11934 215246 296231 117419 481698 86909 99002 -113583 -137612 110212
11514a03936e1303H7464j3561J47297J57706f4549A02653c4263G8631h8493I6358
$$ -103936 -51303 87464 73903 221200 378906 -64549 102653 -34263 78631 -88493 96358
11502G6105R1782m9340J72320F6677O9529f7425K6001j8116B70085A17423M7123
$$ 76105 167887 118547 290867 66677 136206 -67425 -41424 -59540 270085 117423 164546
11491A64546J4211a17033A17321O6731B8605J69659d2809j19126F9340f8311E4560
$$ 164546 178757 -117033 117321 184052 28605 198264 -42809 -161935 69340 -68311 54560
11479h2731A15710M6600L355L41539A14165J78815a60530A69468N3515a1623B68706
$$ -82731 115710 162310 165665 507204 114165 292980 -160530 169468 222983 -11623 268706
11467f8482A30723e2722j43062K2920A24507d428k10402j04498A47968b4164m1695
$$ -68482 130723 -52722 -195784 -172864 124507 -4428 -214830 -319328 147968 -24164 -65859
11456f5859F47684e1958j5331m2741b2064m9540A45937a62702C7885e6813J2478
$$ -65859 647684 -51958 -67289 -110030 -22064 -71604 145937 -162702 37885 -56813 -44335
11445d4335J1216I8695d7591I1582L4496d1643B41613e1963J6549B96703i7652
$$ -44335 -33119 98695 -47591 91582 126078 -41643 241613 -51963 -35414 296703 -97652
11433C6473c4556j85567I7585M0723a98070F4939J35352C676g1200q1983A94227
$$ 36473 -34556 -220123 97585 138308 -198070 64939 200291 3676 -71200 -153183 194227
11421f5525I4280b18778H3207g4148h82B27667n7162n540O2270c6824n0771C7040
$$ -65525 94280 -218778 83207 -74148 -882 227667 170505 164965 227235 -36824 -87595 37040
11408b93494E685P265J83421I3951q914c44693B87447d5869g960p4408c6560B95474
$$ -293494 5685 12950 196371 93951 85037 -344693 287447 -45869 -7960 -82368 -36560 295474
11395f7447I1828a64972H2014R5620a89421i2749A90244E1329b36717A7060c7091
$$ -67447 91828 -164972 82014 177634 -189421 -92749 190244 51329 -236717 17060 -37091
11383e8179j92603A00184m2759O9810b11702C19546p2559A01477e5877k14487
$$ -58179 -250782 100184 57425 127235 -211702 319546 246987 101477 -55877 -270364
11373b70364b8477m1884k80294D21407a39664A4267i2320b190B07753D8110O9419
$$ -270364 -28477 -70361 -350655 421407 -139664 14267 -92320 -2190 207753 48110 117529
11362A17529b79141M2989A18583J02194A5488g2472k38455B44711r1192c50262
$$ 117529 -279141 -236152 118583 220777 15488 -72472 -310927 244711 153519 -350262
11351A50156K2209a39549A38593d6423l4091j45035b0535j9905l8065r5767B23573
$$ 150156 172365 -139549 138593 -46423 -80514 -225549 -20535 -40440 -78505 -174272 223573
11339a1257j96080b7661k44035a08788B24108i692A01213d54721B78140a23814
$$ -11257 -207337 -27661 -271696 -108788 224108 -9692 101213 -454721 278140 -123814
11328d68951c1595j37087j23278A78613a61429A6989M4578J87630a06443e3028
$$ -468951 -31595 -168682 -291960 178613 -161429 16989 61567 249197 -106443 -53028
11317f2784B71735h3083j15395A91375c72180e1938k7916A90926c18200a38426
$$ -62784 271735 -83083 -198478 191375 -372180 -51938 -79854 190926 -318200 -138426
11306b81507a17154j3200a9519k10013B0845b115j98711A51803G493d870k39131
$$ -281507 -117154 -130354 -19519 -229532 20845 -2115 -200826 151803 7493 -4870 -244001
11295b44001A9187a14212j89049a36793k11427J65335E9691d71760E9047B6845
$$ -244001 19187 -114212 -303261 -136793 -348220 -182885 59691 -471760 59047 26845
11284a42966p6157B52821J8394A531a18514l86750A24198c81492O9867N9009P2484
$$ -142966 -219123 252821 271215 1531 -118514 -505264 124198 -381492 -311625 -252616 -180132
11273a80132C3194Q0701b95916C32704b98403a26217C63142G9103Q826a12427
$$ -180132 33194 113895 -295916 332704 -298403 -126217 363142 79103 87929 -112427
11262i1818A92509o4101g5598C1714b96439C3950c2388A58839a16600A84652J46706
$$ -91818 192509 128408 -75598 31714 -296439 33950 -32388 158839 -116600 184652 331358
11251C31358d16229A49175b01278d3606A28326N0392f6720m7842p719l00519I6351
$$ 331358 -416229 149175 -201278 -43606 128326 178718 -66720 -114562 -122281 -422800 96351
11239a18230c6735A4465a89585A08514A53J30600a89606d0093C4976i3615H988
$$ -118230 -36735 14465 -189585 108514 153 130753 -189606 -40093 34976 -93615 8988
11227h6738A93260d6852B35561b53951F7871K1130E434c16164J52786j01348f0678
$$ -86738 193260 -46852 235561 -253951 67871 89001 5434 -316164 -163378 -264726 -60678
11215D8447J73064a58953c7356j48616e281m2122r7835K0883I4715a25570B48691
$$ 48447 221511 -158953 -37356 -185972 -5281 -47403 -145238 -124355 94715 -125570 248691
11203a40977H7447a13279q7251H1521J24978g9478A36177d233C5717a06842A71740
$$ -140977 87447 -113279 -200530 81521 206499 -79478 136177 -4233 35717 -106842 171740
11191D4423j8621d16241G6265a88788G8197b46873B0833E960b55507b8300C62875
$$ 44423 25802 -416241 76265 -188788 78197 -246873 20833 5960 -255507 -28300 362875
11179c22822G7256a01627R016l970B85212m0921b40861f8288J650C6470b29119
$$ -322822 77256 -101627 -92611 -96581 285212 244291 -240861 -68288 -66638 36470 -229119
11167h7228B17458k0970c29733O9403i182A67541b61360e2725j63386A80757n1666
$$ -87228 217458 196488 -329733 -260330 -9182 167541 -261360 -52725 -216111 180757 129091
11156A29091k8278a30533j88084E4021a83936i708m7911j66849i3168a1243A45614
$$ 129091 100813 -130533 -318617 54021 -183936 -9708 -57619 -224468 -93168 -11243 145614
11144B02734a47182N6181A91312G823K42012I807L5903b008A32117I70J11857
$$ 202734 -147182 -91001 191312 7823 249835 9807 45710 -2008 132117 970 112827
11133A12827J4758J99759q8918A4667L22934a53309C6908J24165A4918J72608
$$ 112827 127585 327344 238426 14667 337601 -153309 36908 161073 14918 187526
11123A87526m7439a20779C00849I7644A266K17039h2639a6078B93669c51518a04754
$$ 187526 140087 -120779 300849 97644 1266 218305 -82639 -16078 293669 -351518 -104754
11111B8374O8876e3956r12j4628G7746R1040p2474a89130C17521F8327a13237
$$ 28374 97250 -53956 -54868 -69496 77746 168786 96312 -189130 317521 68327 -113237
11099C22065m6489b4427A96676r6586e5142A65443m324Q6655a51407C12760K0897
$$ 322065 275576 -24427 196676 100090 -55142 165443 161119 247774 -151407 312760 333657
11088C33657j58985J91373A02094D6794K38103r7586n565L15250E6832L51914
$$ 333657 174672 366045 102094 46794 284897 187311 181746 496996 56832 408746
11078D08746j31817a26168j7220A71789q115A4135J09517c5626j18970B61677
$$ 408746 276929 -126168 -143388 171789 163674 14135 123652 -35626 -154596 261677
11067C35361j29546l9934J97869A46904O9661M1903K56698m1564j66196Q7329
$$ 335361 205815 165881 363750 146904 216565 258468 515166 473602 307406 394735
11057C94735K7379P2138n748J30829R939p4847j28793j15401R7270L95592j3439
$$ 394735 422114 494252 488504 619333 629272 554425 425632 310231 407501 803093 789654
11046G89654k01667J04485j8200M350k03853M15712l00799R440j99564K48626
$$ 789654 587987 692472 674272 678622 474769 890481 589682 599122 399558 648184
11036F48184m4423M743p9448J10318o797n2979J08609N5737k65143M42136k63511
$$ 648184 603761 608504 529056 639374 632577 579598 688207 743944 478801 920937 657426
11025F57426j95027J86307k25389A29583i5222F39198j67523N8859j06760r8952
$$ 657426 462399 648706 423317 129583 -95222 639198 471675 530534 423774 324822
11015C24822A39687M36882K42664C02477J33888O1615L7435K10905B42065J99804
$$ 324822 139687 576569 819233 302477 436365 497980 535415 746320 242065 441869
11005D41869K08918p9148j14186j13161M08160l9993j0011j39237L07685D10349
$$ 441869 650787 571639 457453 344292 752452 712459 702448 563211 870896 410349
10994G10713j5985j66376J0479L11505l76093n1140L19673J13072K5958q9k81214
$$ 710713 694728 528352 538831 850336 474243 423103 742776 855848 881806 881717 600503
10983F00503P8938L4577p193P35659j31161k00466M76943M482L89657J80285K10878
$$ 600503 679441 714018 706825 1442484 1311323 1110857 1587800 1592282 1981939 2162224 2373102
10972B373102L25750l96124O9314j47971J07102l29764k17534n4770j51505K7598
$$ 2373102 2698852 2302728 2372042 2224071 2331173 2001409 1783875 1729105 1577600 1605198
10962A605198m50135j15345P68253k77827J39885p3352m5005O6317k20517k66394
$$ 1605198 1155063 1039718 1807971 1530144 1670029 1596677 1551672 1617989 1397472 1131078
10952A131078k28112j4702k39805j48777Q638o1849Q2288j68369J23221j70438
$$ 1131078 902966 888264 648459 499682 508320 446471 528759 360390 483611 313173
10942C13173J75J85596k45049H877e4549B51698G0255O7291R4223c90466A85873
$$ 313173 313348 498944 253895 8877 -54549 251698 70255 137546 231769 -390466 185873
10930i6879j2120j03713J1368F5766A9846M6528f1893D9380a32475I020i8555
$$ -96879 -108999 -212712 -201344 65766 19846 66374 -61893 49380 -132475 9020 -98555
10918A05546a91971K067B6041h791j81336A31541j1139a22252e9153D8465M62021
$$ 105546 -191971 -189904 26041 -8791 -190127 131541 120402 -122252 -59153 48465 510486
10907E10486A73041a03665O412j394j66997Q9199A25656L4203a00994c3579j7551
$$ 510486 173041 -103665 -97253 -98647 -265644 -176445 125656 159859 -100994 -33579 -51130
10896e1130j91889C2418a69384j7334A33959N4748a07251A81647a11726D0425
$$ -51130 -243019 32418 -169384 -186718 133959 188707 -107251 181647 -111726 40425
10885i0914j19586C21746A01333a18154j39743a11843k30686A0470b14423g1132
$$ -90914 -210500 321746 101333 -118154 -257897 -111843 -342529 10470 -214423 -71132
10874A61668i4934l5354N1189B98311d4314B61569n5676B5230d1964o051J4861
$$ 161668 -94934 -130288 -79099 298311 -44314 261569 205893 25230 -41964 -48015 -33154
10863c3154o6194C70a21225B02036l5760E8794B4962J60346a87944D4684P448
$$ -33154 -99348 370 -121225 202036 166276 58794 24962 185308 -187944 44684 52132
10852E2132P8729a00866C2332j3454h2155A7751a98614h8175A81150f6350A06065
$$ 52132 130861 -100866 32332 18878 -82155 17751 -198614 -88175 181150 -66350 106065
10840a04309J0552D6085f0388E035J75538N709q1017b27067H2516a07534d2787
$$ -104309 -93757 46085 -60388 5035 180573 186282 105265 -227067 82516 -107534 -42787
10828b7890A54314f5348l9620K7349A88135a49308d1558B46723c67881B12659
$$ -27890 154314 -65348 -104968 -77619 188135 -149308 -41558 246723 -367881 212659
10817a9758j36092n8552J06866F0560B8585d50259b7529j37851l4247m2446P0469
$$ -19758 -155850 -214402 -107536 60560 28585 -450259 -27529 -165380 -199627 -242073 -171604
10806a71604B72000B9605A84d7131k81358A05984g78A13359g4392j53876A3797
$$ -171604 272000 29605 184 -47131 -328489 105984 -778 113359 -74392 -228268 13797
10794b48496A5875N2786J24461F6742a25701K8528k38709h0325E682J5611b05047
$$ -248496 15875 68661 193122 66742 -125701 -97173 -335882 -80325 5682 21293 -205047
10782a20641M6121H0073b59555O7323K6468o8818A2838a48484e3313A8470L6030
$$ -120641 -74520 80073 -259555 -192232 -165764 -234582 12838 -148484 -53313 18470 54500
10771E4500J2870O7318a48674B16104a59208A23727e9810k45888J45159P7549
$$ 54500 67370 134688 -148674 216104 -159208 123727 -59810 -305698 -160539 -82990
10761h2990j45867B24948I9524c52532D0180a08833b5198k34068A02510e8345
$$ -82990 -228857 224948 99524 -352532 40180 -108833 -25198 -259266 102510 -58345
10750H6874J58169i3090n2048B44652a99957D9092c65657B07212c47559i8174
$$ 86874 245043 -93090 -145138 244652 -199957 49092 -365657 207212 -347559 -98174
10739h3980I6617k8486e885m33035I9044a71615A6508a5850C2070b87931A08687
$$ -83980 96617 68131 -5885 -438920 99044 -171615 16508 -15850 32070 -287931 108687
10727b3988k58208H0943B277b16283b4767A35852c24747f6276K2063j40405B07303
$$ -23988 -282196 80943 2277 -216283 -24767 135852 -324747 -66276 -44213 -184618 207303
10715B22767d34975b4228I9049a65663d5773F755N3822J03222i3087A95372o2563
$$ 222767 -434975 -24228 99049 -165663 -45773 6755 60577 163799 -93087 195372 132809
10704A32809a52114P0449A05168C1115M4318m130e6676C9822j1049b80466A19567
$$ 132809 -152114 -81665 105168 31115 75433 71303 -56676 39822 28773 -280466 119567
10692I1233c9979l29440A69862a95072b6567A75080R153p2221l0163L58b97579
$$ 91233 -39979 -369419 169862 -195072 -26567 175080 184233 112012 81849 82207 -297579
10680a13646a3149n467k03698A59421f64752a02252A81215c07290J19481O1949
$$ -113646 -13149 -18616 -222314 159421 -664752 -102252 181215 -307290 -187809 -125860
10670a25860D8723O134K99747h3723D0797a36209K6759k42287F7225C853h0576
$$ -125860 48723 54857 354604 -83723 40797 -136209 -109450 -351737 67225 3853 -80576
10658A57245e78030H1347c61003A28047c82295a30959A17828b7771A56108M0592
$$ 157245 -578030 81347 -361003 128047 -382295 -130959 117828 -27771 156108 196700
10648A96700b22810A57379F9004b36438B71718G1290J78611a79298O1994j10722
$$ 196700 -222810 157379 69004 -236438 271718 71290 249901 -179298 -117304 -228026
10638b28026A75138b28447O7660A60371M7410a4853r0792K8393j93327C8601a14928
$$ -228026 175138 -228447 -160787 160371 207781 -14853 -105645 -77252 -270579 38601 -114928
10626c66435a28672A00499C0049h5542J0756C5680b64479a14199d1767k7613N113
$$ -366435 -128672 100499 30049 -85542 -74786 35680 -264479 -114199 -41767 -69380 -64267
10615f4267A43213b45599m7364D6738g2286j15363A75058G2320O467A1176d7984
$$ -64267 143213 -245599 -292963 46738 -72286 -187649 175058 72320 78787 11176 -47984
10603c881I7358M6244E9488b39770M8486A85991a22181B05233r8075g9305k13303
$$ -3881 97358 143602 59488 -239770 -191284 185991 -122181 205233 107158 -79305 -292608
10592b92608G6673K94511c97633J71591B4604L80619a13464A31761c30215A68046
$$ -292608 76673 371184 -397633 -226042 24604 405223 -113464 131761 -330215 168046
10581b452m06063a35955e9789m40549a45142J7582A14866K94329h2122j12062
$$ -2452 -408515 -135955 -59789 -500338 -145142 -127560 114866 409195 -82122 -194184
10571a94184g5700F3652c10703a33309l22d2629l14795A66346d2847G7995C5839
$$ -194184 -75700 63652 -310703 -133309 -133631 -42629 -357424 166346 -42847 77995 35839
10559A93352C184a80972B85521l660I5944d8894m4290F3210b89775a18757l70166
$$ 193352 3184 -180972 285521 281861 95944 -48894 -93184 63210 -289775 -118757 -488923
10548d88923D30983F8601N8356P3578p0175f30k45627f5539I8088J02557f0827
$$ -488923 430983 68601 126957 200535 130360 -630 -246257 -65539 98088 200645 -60827
10536A4035b90799C15249b46105a19651p292A9866L3589f3838A05723g9825B05035
$$ 14035 -290799 315249 -246105 -119651 -126943 19866 53455 -63838 105723 -79825 205035
10524a7377F7632j3136K76574C1111b66442a32512q8445P3593A21635c5454A08634
$$ -17377 67632 54496 331070 31111 -266442 -132512 -220957 -147364 121635 -35454 108634
10512C4031J25051b13743A55965a63233B1263a24252K4474E8792b30741A31105
$$ 34031 159082 -213743 155965 -163233 21263 -124252 -99778 58792 -230741 131105
10501A5464c05633Q0029K0067O0550L2308A38469o4571g8294a272l24244l0918
$$ 15464 -305633 -225604 -205537 -144987 -112679 138469 73898 -78294 -1272 -325516 -356434
10490c56434a35353I5934Q6168R3488I5462A5262d343B6935K11565A14275L25555
$$ -356434 -135353 95934 182102 275590 95462 15262 -4343 26935 238500 114275 439830
10479D39830D1803J28407L9117i3675l423j7118B04074n0960f9823C7119a66548
$$ 439830 41803 170210 209327 -93675 -97098 -114216 204074 153114 -69823 37119 -166548
10467B3798h2222q8988c8722C86643i3590n9917j21726A0569J69846O696a05817
$$ 23798 -82222 -171210 -38722 386643 -93590 -153507 -275233 10569 180415 187111 -105817
10455d6154r6583E7865O703c12817Q2704B3653a49675O8895q9909A63279J27783
$$ -46154 -142737 57865 64568 -312817 -230113 23653 -149675 -80780 -170689 163279 291062
10444B91062b89873b6413m7317k95897a9319j02844B25328F6574e591A61150A7354
$$ 291062 -289873 -26413 -73730 -369627 -19319 -122163 225328 66574 -5591 161150 17354
10432E1159J08511E6866J01629n3521b05808A08858A8930M22681b11020B09232
$$ 51159 159670 56866 158495 104974 -205808 108858 18930 441611 -211020 209232
10421C3435N4557d29842f72B51724d38063C84668D6862L6531a38233O6820A57930
$$ 33435 87992 -429842 -672 251724 -438063 384668 46862 83393 -138233 -71413 157930
10409a90746B21057c45646J15541D085e5997o0100B05112E8943K1343a47797A22580
$$ -190746 221057 -345646 -230105 4085 -55997 -116097 205112 58943 80286 -147797 122580
10397B02829E8478Q0848g8743n9914L9597E9217a75985D4636J69610o6082k3991
$$ 202829 58478 139326 -78743 -138657 -99060 59217 -175985 44636 214246 148164 124173
10386A24173a83778j35883c687F8227K06909f5880B98214A08364f3753A33297
$$ 124173 -183778 -319661 -3687 68227 275136 -65880 298214 108364 -63753 133297
10375C09909R4914j15104q9910J83054A28392a1887A13512J05565K68644K9571
$$ 309909 404823 289719 199809 382863 128392 -11887 113512 219077 487721 517292
10365E17292k12532J1635F9076K51669j14445D3127K04295A09705m5790a05372
$$ 517292 304760 316395 69076 320745 206300 43127 247422 109705 63915 -105372
10354C68475A26484L16374j9574j9107j06271m62L777j49332J27228A04632J75007
$$ 368475 126484 442858 423284 404177 297906 297444 301221 151889 279117 104632 279639
10343B79639p3034n1937J62838A52713L50968B9448J10097K87281j66275H3706
$$ 279639 206605 154668 317506 152713 503681 29448 139545 426826 260551 83706
10332b85659A84229c3785B65676N3301I4144R0257f962j28154g033B57143B298
$$ -285659 184229 -33785 265676 318977 94144 184401 -6962 -135116 -7033 257143 2298
10320C13691m0276h04E11564g6514B71947G8593J80672b25518a6055B80255i6803
$$ 313691 273415 -804 511564 -76514 271947 78593 259265 -225518 -16055 280255 -96803
10308c17854j39176a69977B51449K3974j34752a24487o9650A20870f2671k00660
$$ -317854 -457030 -169977 251449 275423 140671 -124487 -194137 120870 -62671 -263331
10298b63331C20348I3317R4443g7937A25344k5554O909k337h862n90368A13605
$$ -263331 320348 93317 187760 -77937 125344 99790 106699 104362 -8862 -599230 113605
10286a06569J6466j55314Q9682j06466A76648d4021j81988R8858c9632m87757
$$ -106569 -90103 -245417 -155735 -262201 176648 -44021 -226009 -127151 -39632 -527389
10276e27389D47065h1153K9230k99881J47922A80355b95006J2395f1451k2681
$$ -527389 447065 -81153 -51923 -351804 -203882 180355 -295006 -282611 -61451 -84132
10266h4132r3514A66439L1618b16960e8547I8667c9205C56529O8752I3214K93822
$$ -84132 -177646 166439 198057 -216960 -58547 98667 -39205 356529 425281 93214 387036
10255C87036A80873J7674R2429l6320d7370A21932a10866b2963B25718d5760k39365
$$ 387036 180873 198547 290976 254656 -47370 121932 -110866 -22963 225718 -45760 -285125
10244b85125A27882m4261i2913j06412M4035i118B7043f5208L2023l38388R0381
$$ -285125 127882 83621 -92913 -199325 -155290 -9118 27043 -65208 -33185 -371573 -281192
10233b81192H4822a16521j6919M6417L8074B3767b65298h3055B94668a52813K7598
$$ -281192 84822 -116521 -133440 -87023 -48949 23767 -265298 -83055 294668 -152813 -125215
10222a25215K6128j7881K6515b174C13072f2988k07396A67101g7646B14894f5500
$$ -125215 -99087 -116968 -90453 -2174 313072 -62988 -270384 167101 -77646 214894 -65500
10210A39410F0167J18276a73348b6415n981C90149i355F7651i5814c8609k1006
$$ 139410 60167 178443 -173348 -26415 -32396 390149 -9355 67651 -95814 -38609 -59615
10199e9615B21935a71353D1441K74360l7136c113k45413G1726a15918i007B7997
$$ -59615 221935 -171353 41441 315801 278665 -3113 -248526 71726 -115918 -9007 27997
10187B28179D9082a12829k44951i6015F6106J84594a85316j07358J26383g555
$$ 228179 49082 -112829 -357780 -96015 66106 250700 -185316 -292674 -166291 -7555
10176B52968a34808D2898a70625g1885o5278r1008C8256P6962b00056c2552A21426
$$ 252968 -134808 42898 -170625 -71885 -137163 -228171 38256 115218 -200056 -32552 121426
10164H6944b64441i7494K8693A69877d9331A14911a06928c8953A09171d52556
$$ 86944 -264441 -97494 -68801 169877 -49331 114911 -106928 -38953 109171 -452556
10153a20161j87472Q3680f0015j46081Q7553D6181c50746a51357A52691F9542
$$ -120161 -307633 -223953 -60015 -206096 -118543 46181 -350746 -151357 152691 69542
10142a22062l3385j1805j37856I8510O0054g6540D224P5628B6338J61663r0967
$$ -122062 -155447 -167252 -305108 98510 158564 -76540 4224 79852 26338 188001 97034
10131I7034a78528j28011A79753b39693O055o8936N9297J07169q8008A70205O0229
$$ 97034 -178528 -306539 179753 -239693 -233638 -302574 -243277 -136108 -224116 170205 230434
10120B30434e2384C77834a55974B9814i6950j24032P2654d8173A61149a08213
$$ 230434 -52384 377834 -155974 29814 -96950 -220982 -148328 -48173 161149 -108213
10109C1264b4238k87212a21979G6554J45517c07187P5992a04368H8110d2157j97467
$$ 31264 -24238 -311450 -121979 76554 222071 -307187 -231195 -104368 88110 -42157 -239624
10098b39624H6076f8553F7083a53699N491A61510a6401k53602q052G232J2478
$$ -239624 86076 -68553 67083 -153699 -148208 161510 -16401 -270003 -278055 7232 19710
10087A9710a70725E7782d47899i3355D8760K110a32079i388j49284g4147D4608
$$ 19710 -170725 57782 -447899 -93355 48760 50870 -132079 -9388 -158672 -74147 44608
10075G0765b62036H7959a2452k8230j3730G2708P354L8558c73993F310J58653
$$ 70765 -262036 87959 -12452 -40682 -54412 72708 80062 118620 -373993 6310 164963
10064A64963e9375B31599i2927j60271i7951D5775a36994B0156d6549E498K80432
$$ 164963 -59375 231599 -92927 -253198 -97951 45775 -136994 20156 -46549 5498 285930
10053B85930a83751N4809l0049G9600e7283j72034J02114A00602d50905I0345
$$ 285930 -183751 -128942 -158991 79600 -57283 -229317 -127203 100602 -450905 90345
10042f1697A30966h6768B45023M2671c67962A50053g3043a0173j51836k5767G9037
$$ -61697 130966 -86768 245023 287694 -367962 150053 -73043 -10173 -162009 -187776 79037
10030i7129n5834E5434J59869p646d72709A908a05177A2318a62534B47597C2378
$$ -97129 -152963 55434 215303 207657 -472709 1908 -105177 12318 -162534 247597 32378
10018C3817f5419p531E231i6532l2222A88508M7978a52494f9112k39491O9577
$$ 33817 -65419 -72950 5231 -96532 -128754 188508 236486 -152494 -69112 -308603 -239026
10007b39026C15888g6358J9937j21324f5038n8906J8791j56687A0541O0972l1772
$$ -239026 315888 -76358 -56421 -177745 -65038 -123944 -105153 -261840 10541 71513 39741
9996C9741c01440D8822a27763c1548A21690n8341O9094c5367a6310k57006C7018
$$ 39741 -301440 48822 -127763 -31548 121690 63349 132443 -35367 -16310 -273316 37018
9984H5423h4435C8736d03657a6095l13896d0809j52379A02492N87a57966A28743
$$ 85423 -84435 38736 -403657 -16095 -329991 -40809 -193188 102492 103079 -157966 128743
9972C0021N9044B0327N4209Q3033G6760N8988d3364k73145a53784q6651e146k00203
$$ 30021 89065 20327 74536 157569 76760 135748 -43364 -316509 -153784 -240435 -5146 -205349
9960b05349l002A13113d60328B29645B793R6641e5366A27147b00324d2684C0085
$$ -205349 -208351 113113 -460328 229645 2793 99434 -55366 127147 -200324 -42684 30085
9948a77605C12701j32856a83551m6368e404C3307A4166a80571k8353A1718a15759
$$ -177605 312701 179845 -183551 -229919 -5404 33307 14166 -180571 -208924 11718 -115759
9936d34177J90267O8559J2800A57545i6995k85410B89268d52627R2045A37024
$$ -434177 -243910 -175351 -162551 157545 -96995 -382405 289268 -452627 -360582 137024
9925F279R5768c0510a1210m38320a20361j98515M2467B45878b50087B18862b52182
$$ 6279 102047 -30510 -11210 -449530 -120361 -318876 -276409 245878 -250087 218862 -252182
9913a25620B1074J62291b50545a06435K6225n4176j65381A92121F5076e8909m2345
$$ -125620 21074 183365 -250545 -106435 -80210 -134386 -299767 192121 65076 -58909 -101254
9902a01254A5335K32436d1976j62195C5663a37720m4022B10163a06842I6379b701
$$ -101254 15335 247771 -41976 -204171 35663 -137720 -181742 210163 -106842 96379 -2701
9890B40397e9061j1699G968J16576B96a61942M5153A8786a11534J0452k92673
$$ 240397 -59061 -70760 7968 124544 296 -161942 -116789 18786 -111534 -101082 -393755
9879c93755a80451k04117J16505J8816J23353J4700j68769a8892j72040p0228
$$ -393755 -180451 -384568 -268063 -249247 -125894 -111194 -279963 -18892 -190932 -261160
9869b61160E10243j70826a05871o9327A00367B0593d28746b1159k52977a9281
$$ -261160 510243 339417 -105871 -175198 100367 20593 -428746 -21159 -274136 -19281
9858A0261N7326a82288k50913I8500A9381Q9668c56911h9915C7718a09769A13883
$$ 10261 67587 -182288 -433201 98500 19381 109049 -356911 -89915 37718 -109769 113883
9846h4692I6158a40328G0965b2468q3033j41208a03450q2859k2768g0338j95994
$$ -84692 96158 -140328 70965 -22468 -105501 -246709 -103450 -186309 -209077 -70338 -266332
9835b66332A46561f4207k17115C8950b57795a3594k9993a8624H4502j874P2994
$$ -266332 146561 -64207 -281322 38950 -257795 -13594 -43587 -18624 84502 82628 155622
9824A55622J31395b97302H3803k2398a59396c3578l24848A45530a10706j30401
$$ 155622 287017 -297302 83803 61405 -159396 -33578 -358426 145530 -110706 -241107
9814b41107P2548b7510n7045r0126r4020A53651c9520m08177F5607c08420G022
$$ -241107 -168559 -27510 -84555 -174681 -268701 153651 -39520 -447697 65607 -308420 7022
9802b40418o3268B41751a25195j55335O6609r8982J48394l21584B2404a83286
$$ -240418 -303686 241751 -125195 -280530 -213921 -312903 -164509 -486093 22404 -183286
9791i7657c9402n8542i542A72991a95031E7474a59237j47223g1924l14137B6853
$$ -97657 -39402 -97944 -9542 172991 -195031 57474 -159237 -306460 -71924 -386061 26853
9779b19523I0771a6903B9518B603h2787a4386E1369d63411B05866a28307c1675
$$ -219523 90771 -16903 29518 2603 -82787 -14386 51369 -463411 205866 -128307 -31675
9767A01732l8495a1707p0860A38031l171a34343a370A81734d5473k3033C497b08668
$$ 101732 63237 -11707 -82567 138031 134860 -134343 -1370 181734 -45473 -68506 3497 -208668
9754A08789b12649C0470f9503l9375F8074d97793B09079E9907b45856P4109b5136
$$ 108789 -212649 30470 -69503 -108878 68074 -497793 209079 59907 -245856 -171747 -25136
9742A43653M6338c37702G0008a7950p3117k71760a07532K5150B712M2438O8387
$$ 143653 189991 -337702 70008 -17950 -91067 -362827 -107532 -82382 2712 45150 113537
9731A13537k1106k6477b0303B37982b52517o0317a13643I1693A887a03985l0076
$$ 113537 92431 65954 -20303 237982 -252517 -312834 -113643 91693 1887 -103985 -134061
9720a34061J8310q4409j8187l7466a6389D2485a12239H1084d33649a83017b5667
$$ -134061 -115751 -200160 -218347 -255813 -16389 42485 -112239 81084 -433649 -183017 -25667
9708i1504G1895i437k9659l460A6635J26780j5081P7580a37151A8863c19648R0069
$$ -91504 71895 -9437 -39096 -42556 16635 143415 128334 205914 -137151 18863 -319648 -229579
9696b29579A71542a35903j30064d3119I7867b59990a16173D62181b52074J03342
$$ -229579 171542 -135903 -265967 -43119 97867 -259990 -116173 462181 -252074 -148732
9686a48732J501f4064j901L2840A96620d9280k1349B1444b95229a22886r0439
$$ -148732 -147231 -64064 -65965 -33125 196620 -49280 -70629 21444 -295229 -122886 -213325
9675b13325m8393H5260K49218A2620J21568c54344A08277a76064C68019a38890
$$ -213325 -261718 85260 334478 12620 134188 -354344 108277 -176064 368019 -138890
9664a70549p2207J00853m19816a08415b536A78863f7051j25089E3371J2724M438
$$ -170549 -242756 -141903 -561719 -108415 -2536 178863 -67051 -192140 53371 66095 70533
9653G0533K09933a59596l13690c3436p7287A92815i7309A23833b77537g407C05914
$$ 70533 280466 -159596 -473286 -33436 -110723 192815 -97309 123833 -277537 -7407 305914
9641H142c73405a06356G5381a00512r2896G4676K06385a51947E7805N4134a88038
$$ 8142 -373405 -106356 75381 -100512 -193408 74676 281061 -151947 57805 111939 -188038
9629E565b27509e996j84369c7452A00625b0455A76993C6572a26204p6329A19164
$$ 5565 -227509 -5996 -190365 -37452 100625 -20455 176993 36572 -126204 -202533 119164
9617g5967j31253M6654g8651K0925C96236h496l1567m2406n0279B2146a12723
$$ -75967 -207220 -160566 -78651 -57726 396236 -8496 -40063 -82469 -132748 22146 -112723
9605c73826a44538J9578E7636a50245j41342E0124j8992h9987p614B23639a86891
$$ -373826 -144538 -124960 57636 -150245 -291587 50124 31132 -89987 -97601 223639 -186891
9593E722K8901c0667A98249G2653a39992e0248D0980b52482B1147f1944j91128
$$ 5722 34623 -30667 198249 72653 -139992 -50248 40980 -252482 21147 -61944 -253072
9582b53072B65241A7353C450a00746K2069i803o8833G9420C2213b69787C7675
$$ -253072 265241 17353 3450 -100746 -78677 -9803 -78636 79420 32213 -269787 37675
9570a10800l8550l2217c2837r5784j40000A36248c1694j55396N3312A84091c02078
$$ -110800 -149350 -181567 -32837 -128621 -268621 136248 -31694 -187090 -133778 184091 -302078
9558B2426b13871l3961A61737j3851b75222H1511e723A3467b07954J02603B7141
$$ 22426 -213871 -247832 161737 147886 -275222 81511 -5723 13467 -207954 -105351 27141
9546C0822N3941B7656b1188A67414p1226c35021A03776b06631C23376j51983a21121
$$ 30822 84763 27656 -21188 167414 96188 -335021 103776 -206631 323376 171393 -121121
9534A32167b87733j37652h1758H8516b65355j5432k18753A45645b521l1120j03115
$$ 132167 -287733 -425385 -81758 88516 -265355 -280787 -499540 145645 -2521 -33641 -136756
9523a36756N8538c4543j80674R0322d132l09645j80377b39756B58740o7650a24047
$$ -136756 -78218 -34543 -215217 -124895 -4132 -313777 -494154 -239756 258740 191090 -124047
9511H7725J224b85586k3617f4593H0042L3791a23208F2108a27805k2310C6962
$$ 87725 88949 -285586 -309203 -64593 80042 113833 -123208 62108 -127805 -150115 36962
9499d4120j75421R6475B37599a37533j11671A44493c56104a55508n8341A21674
$$ -44120 -219541 -123066 237599 -137533 -249204 144493 -356104 -155508 -213849 121674
9488d7770k0702F4981i9654o8511b9263A28168D2028J38703a96137C7655j124
$$ -47770 -68472 64981 -99654 -168165 -29263 128168 42028 180731 -196137 37655 36531
9477C6531c71194B03958b1960j031k15562e2372B38871d0154q1532L2706j09381
$$ 36531 -371194 203958 -21960 -22991 -238553 -52372 238871 -40154 -121686 -88980 -198361
9466a98361J6018R0789f654k44831N4615B86669E634c12068A50090n7283f3658
$$ -198361 -182343 -91554 -6654 -251485 -196870 286669 5634 -312068 150090 92807 -63658
9454B77502b46391k09325a58711I4820b14207G1311b19031d5152k97785C7970
$$ 277502 -246391 -455716 -158711 94820 -214207 71311 -219031 -45152 -342937 37970
9443c66369b9999j00532j565a8548j5116k05823F6777Q0648N688C6885K02567
$$ -366369 -29999 -130531 -132096 -18548 -33664 -239487 66777 147425 153113 36885 239452
9432B39452b74010A91795j9337b15669f2045E5309c39707a58898i50F1014j8836
$$ 239452 -274010 191795 172458 -215669 -62045 55309 -339707 -158898 -950 61014 42178
9421D2178a06210f462j02147A9269c7736j20044b7480B08002n6984k9971a57860
$$ 42178 -106210 -6462 -108609 19269 -37736 -157780 -27480 208002 151018 121047 -157860
9409A75497a5437j70814r62N8822O2739j68533g2618C2173P97a96976l8328g1973
$$ 175497 -15437 -186251 -187213 -128391 -65652 -234185 -72618 32173 32970 -196976 -235304 -71973
9396e9306E5833a56942j6430q9958G957g6172I1262b11334P5545A18245b16262
$$ -59306 55833 -156942 -173372 -263330 7957 -76172 91262 -211334 -135789 118245 -216262
9384F2667a28787A73345a98270l33209G1482g5961B356b53077B73163b61461f2980
$$ 62667 -128787 173345 -198270 -531479 71482 -75961 2356 -253077 273163 -261461 -62980
9372f8638o8620j50143a1919k59936G4395a15839I0833i1922l7047A09767A0608
$$ -68638 -137258 -287401 -11919 -271855 74395 -115839 90833 -91922 -128969 109767 10608
9360a5874l00249B8765b0528o4125q0376b9227j45510k61347a82015f7841D2727
$$ -15874 -316123 28765 -20528 -84653 -165029 -29227 -174737 -436084 -182015 -67841 42727
9348F8872b01176B3528c32021f0599A77750b32864d6369p0512A1476Q9132b39355
$$ 68872 -201176 23528 -332021 -60599 177750 -232864 -46369 -116881 11476 100608 -239355
9336i5222C23034a90638A23542b08550A93341J7651l931q7416a21550K3931A53801
$$ -95222 323034 -190638 123542 -208550 193341 210992 207061 119645 -121550 -97619 153801
9324G409b8833F3839b3438B33747c23852B37965J46653c5062n68941h2613D8304
$$ 7409 -28833 63839 -23438 233747 -323852 237965 384618 -35062 -604003 -82613 48304
9312b32159N4397e6406o6851j72365a46972e5997k13600d8539I7960a33941j49554
$$ -232159 -177762 -56406 -123257 -295622 -146972 -55997 -269597 -48539 97960 -133941 -283495
9301b83495P1753F4184a29585j15272n5727J49143k0264A39282A8424K47556a45693
$$ -283495 -211742 64184 -129585 -244857 -300584 -151441 -171705 139282 18424 265980 -145693
9289b34655J09496q4297i88C2324Q6945K25381b62196a28364N6809A10180a3039
$$ -234655 -125159 -209456 -988 32324 119269 344650 -262196 -128364 -71555 110180 -13039
9277e4176k04039J24147B442J68328a23005j08231J06748G5550b37375i9946C23446
$$ -54176 -258215 -134068 2442 170770 -123005 -231236 -124488 75550 -237375 -99946 323446
9265a32334A04201k9384C7179b83052F2526J26409a39081M7505j14649C4700K08082
$$ -132334 104201 74817 37179 -283052 62526 188935 -139081 -91576 -206225 34700 242782
9254B42782j4081c61217B65064a66015O4757j5344j01290h5424l9301N1664J1721
$$ 242782 228701 -361217 265064 -166015 -101258 -116602 -217892 -85424 -124725 -73061 -61340
9243f1340p9832h194E0273k1253A182N0098a2021e417k72178A03796f1356n7949
$$ -61340 -141172 -8194 50273 29020 1182 51280 -12021 -5417 -277595 103796 -61356 -119305
9231a19305A62002n7042a11875j74149a0259l76040J33457d8513k29012a06866
$$ -119305 162002 104960 -111875 -286024 -10259 -386299 -252842 -48513 -277525 -106866
9220a31325A70863b1150k96493E3951c23325A40379E4814k1066d17044c1564D88131
$$ -131325 170863 -21150 -317643 53951 -323325 140379 54814 33748 -417044 -31564 488131
9208I507a85584a4882l37643M7344g5101K8107l69758E12704h6635E0364b60522
$$ 9507 -185584 -14882 -352525 -305181 -75101 -46994 -416752 512704 -86635 50364 -260522
9196a70456J8045N1993j18470B66227A7065K7777J04501J4274b14192g1677k96281
$$ -170456 -152411 -100418 -218888 266227 17065 44842 149343 163617 -214192 -71677 -367958
9185c67958J1870J70496A42606b12341G961J66335J1063b17330J04278o4281r677
$$ -367958 -356088 -185592 142606 -212341 7961 174296 185359 -217330 -113052 -177333 -187010
9174a87010h7892o3506p2031a709k17423B5870M1469J83506a15876k33210B7259
$$ -187010 -87892 -151398 -223429 -1709 -219132 25870 67339 250845 -115876 -349086 27259
9162a20151j89590j4098A83835m0741p0328K02447A7829c6234j9681A85536M432
$$ -120151 -309741 -323839 183835 143094 72766 275213 17829 -36234 -55915 185536 189968
9151A89968F1836m141A2094a20819m0623p2475F4476d04942f392n9091J1773m15979
$$ 189968 61836 57695 12094 -120819 -161442 -233917 64476 -404942 -6392 -65483 -53710 -469689
9139d69689a44857r0704A38498h1058C4067c4186r2576j24488M9544c5020C8480
$$ -469689 -144857 -235561 138498 -81058 34067 -34186 -126762 -251250 -201706 -35020 38480
9127B94418c97122Q6300h0926A22996i1285J5448A07108D7443c3222B9777a85254
$$ 294418 -397122 -310822 -80926 122996 -91285 -75837 107108 47443 -33222 29777 -185254
9115b5984j86725m053B1705c22522H9796d3227o9147l08961J55675a29514m8066
$$ -25984 -212709 -216762 21705 -322522 89796 -43227 -112374 -421335 -265660 -129514 -177580
9104a77580O4607d0634L450j49476P6077j23165h6884A01881C5261K25502L3627
$$ -177580 -112973 -40634 -37184 -186660 -110583 -233748 -86884 101881 35261 260763 294390
9093B94390g5428j11175n8019Q7158G4260J05485g3699F1903a11748B19755c2710
$$ 294390 -75428 -186603 -244622 -157464 74260 179745 -73699 61903 -111748 219755 -32710
9081e3206j90131i3477B79764J07887A57816c07525g933C04627b89480a0935A81963
$$ -53206 -243337 -93477 279764 387651 157816 -307525 -7933 304627 -289480 -10935 181963
9069g1751n7910b3464m8470j28643e0316j7309a2579A42120b27498J10930l8505
$$ -71751 -129661 -23464 -71934 -200577 -50316 -67625 -12579 142120 -227498 -116568 -155073
9058a55073c7253o020A00767c9950j2705n9973A1901L3154L51017a29222N2684
$$ -155073 -37253 -43273 100767 -39950 -52655 -112628 11901 45055 396072 -129222 -76538
9047g6538B36908i7761h949k80011A6143J84378q0142b04534K6082b4841j0197
$$ -76538 236908 -97761 -8949 -288960 16143 200521 120379 -204534 -178452 -24841 -35038
9036c5038p5561A03146J386b80010J31460j2058D4555N4386c52244g2020C36884
$$ -35038 -110599 103146 104532 -280010 -148550 -160608 44555 98941 -352244 -72020 336884
9024A56339a54173j89232A51441J27114l8930i5679c1701l8344q0574c3731C4581
$$ 156339 -154173 -343405 151441 278555 239625 -95679 -31701 -70045 -150619 -33731 34581
9012e8797B52548d19039a86761g3221H5099a32035B5222e8718A48436l9618b83821
$$ -58797 252548 -419039 -186761 -73221 85099 -132035 25222 -58718 148436 108818 -283821
9000i7650j65544J06125G8810A9609J57844e8985j32549b92j70785o5364c4123
$$ -97650 -263194 -157069 78810 19609 177453 -58985 -191534 -292 -171077 -236441 -34123
8988c10482a6914A42744F0360L33225a42016E0549a50024D0971a69218D2193a04343
$$ -310482 -16914 142744 60360 393585 -142016 50549 -150024 40971 -169218 42193 -104343
8976a38776L6927p1137B8634d3048j3122j35263q2870A27504a45410l27930a08851
$$ -138776 -101849 -172986 28634 -43048 -56170 -191433 -274303 127504 -145410 -473340 -108851
8964D77902A57933m5560d1374k06687M7657d9254K2917D7008L4070b9421j45656
$$ 477902 157933 112373 -41374 -248061 -200404 -49254 -26337 47008 81078 -29421 -175077
8953a75077j44493g3634E8454J32571A6482c05622i4375o6106O1068n2428e586
$$ -175077 -319570 -73634 58454 191025 16482 -305622 -94375 -160481 -99413 -151841 -5586
8941a36493j41447g1413m783C9303b53686A16455J79822J1988b14238i5602B1688
$$ -136493 -277940 -71413 -76196 39303 -253686 116455 296277 308265 -214238 -95602 21688
8929A13452j7915e2090C34215j64766N57024O63075K415621J1058445K701464
$$ 113452 95537 -52090 334215 169449 726473 1389548 3805169 14863614 17565078
8920A7565078D540872A424431n10839k12511a9777k53370C41373b84382i2304
$$ 17565078 4540872 1424431 913592 701081 -19777 -273147 341373 -284382 -92304
8910B0477J15462L15162j92260Q4689j34616i2721B53912q8993A6637d5430J5666
$$ 20477 135939 451101 258841 343530 208914 -92721 253912 164919 16637 -45430 -29764
8899b9764j23549K8672A44191D7528i1048l9166A99124C0380J28192a502C9484
$$ -29764 -153313 -124641 144191 47528 -91048 -130214 199124 30380 158572 -1502 39484
8887C9333b10301i6466B96468j42762b77085I4597c27702R3244a13019k1254A47222
$$ 39333 -210301 -96466 296468 153706 -277085 94597 -327702 -234458 -113019 -134273 147222
8875A73935c28413D67949a64574A1085J80541i5636q8420f0445B8883J33990g1762
$$ 173935 -328413 467949 -164574 11085 191626 -95636 -184056 -60445 28883 162873 -71762
8863E8559a26106I3634L5857A9281c1090E9776d42923G2912B8271b00699B56089
$$ 58559 -126106 93634 129491 19281 -31090 59776 -442923 72912 28271 -200699 256089
8851a25671j62068c9282C1314L0183b09017e361l76850a28685b1685k8558D9312
$$ -125671 -287739 -39282 31314 61497 -209017 -5361 -382211 -128685 -21685 -50243 49312
$$ [...]
##END NTUPLES=NMR SPECTRUM
##END=
