
##TITLE=UV1252_M10_1340-1211_30_7409573_IvnXkjSUgS
##JCAMPDX= 6.0         $$ Bruker NMR JCAMP-DX V2.0
##DATA TYPE= NMR SPECTRUM
##DATA CLASS= NTUPLES
##ORIGIN= BRUKER
##OWNER= Administrator
$$ 1.72 TOPSPIN		Version 2.1
$$ 2013-01-24 20:43:20.816 -0500  Administrator@X
$$ Compression mode = diff/dup
##.OBSERVE FREQUENCY= 400.02188249412
##.OBSERVE NUCLEUS= ^1H
##.ACQUISITION MODE= SIMULTANEOUS (DQD)
##.ACQUISITION SCHEME= undefined
##.AVERAGES= 64
##.DIGITISER RES= 22
##SPECTROMETER/DATA SYSTEM= spect
##.PULSE SEQUENCE= noesygpps1d.comp
##.SOLVENT NAME= COFFEE_meoh
##.SHIFT REFERENCE= INTERNAL, COFFEE_meoh, 1, 14.96093
##AUDIT TRAIL= $$ (NUMBER, WHEN, WHO, WHERE, PROCESS, VERSION, WHAT)
$$ ##TITLE= Audit trail, TOPSPIN		Version 2.1
$$ ##JCAMPDX= 5.01
$$ ##ORIGIN= Bruker BioSpin GmbH
$$ ##OWNER= Administrator
$$ $$ E:\/data/COFFEE/nmr/UV1252_M10_1340-1211_30_7409573_IvnXkjSUgS/12/pdata/1/auditp.txt
$$ ##AUDIT TRAIL=  $$ (NUMBER, WHEN, WHO, WHERE, PROCESS, VERSION, WHAT)
(   1,<2013-01-24 20:43:15.004 -0500>,<Administrator>,<X>,<go>,<TOPSPIN 2.1>,
      <created by zg
	started at 2013-01-24 20:31:45.129 -0500,
	POWCHK enabled, PULCHK disabled,
       configuration hash MD5:
       86 BA 57 50 F2 9D 5C 9B 26 00 A9 28 5F 66 2E 89
       data hash MD5: 64K
       5D D4 F3 AA 9B 74 9F B9 D6 FC 26 3F 66 12 C6 1D>)
(   2,<2013-01-24 20:43:18.050 -0500>,<Administrator>,<X>,<proc1d>,<TOPSPIN 2.1>,
      <Start of raw data processing
       efp LB = 0.3 FT_mod = 6 PKNL = 1 PHC0 = 0 PHC1 = 0 SI = 128K 
       data hash MD5: 128K
       17 C7 E7 59 D3 26 09 36 03 80 11 00 B9 52 04 55>)
(   3,<2013-01-24 20:43:19.082 -0500>,<Administrator>,<X>,<proc1d>,<TOPSPIN 2.1>,
      <pk PHC0 = -80.79895 PHC1 = 0 
       data hash MD5: 128K
       0D FC 27 38 CC D6 1B 44 57 7C 91 45 F1 F4 88 36>)
(   4,<2013-01-24 20:43:19.754 -0500>,<Administrator>,<X>,<proc1d>,<TOPSPIN 2.1>,
      <abs ABSG = 1 
       data hash MD5: 128K
       90 EC 9E E6 8C DE 12 EB EB 2A DA A1 FE A9 18 46>)
(   5,<2013-01-24 20:43:19.972 -0500>,<Administrator>,<X>,<proc1d>,<TOPSPIN 2.1>,
      <abs ABSG = 2 
       data hash MD5: 128K
       5D FF 55 48 13 D5 32 63 30 3F D8 7D 18 CC 56 F4>)
(   6,<2013-01-24 20:43:20.129 -0500>,<Administrator>,<X>,<proc1d>,<TOPSPIN 2.1>,
      <abs ABSG = 3 
       data hash MD5: 128K
       91 85 46 48 06 CF 38 53 F4 DE 98 5E 6A A5 81 77>)
(   7,<2013-01-24 20:43:20.300 -0500>,<Administrator>,<X>,<proc1d>,<TOPSPIN 2.1>,
      <abs ABSG = 4 
       data hash MD5: 128K
       5A 5A 9F 89 A4 4E F1 A6 61 FE A6 82 44 41 E2 3F>)
(   8,<2013-01-24 20:43:20.488 -0500>,<Administrator>,<X>,<proc1d>,<TOPSPIN 2.1>,
      <abs ABSG = 5 
       data hash MD5: 128K
       51 4D 85 FC 6F 93 B6 BE F0 62 02 BB 76 36 4D 31>)
$$ ##END=
$$ 
$$ $$ hash MD5
$$ $$ CF 56 28 8F 49 B9 4B 23 01 CA 56 68 29 62 20 67
##$RELAX= 
##$RELAX= 
##$RELAX= 
##$RELAX= 
##$RELAX= 
##$RELAX= 
##$RELAX= 
##$RELAX= 
$$ Bruker specific parameters
$$ --------------------------
##$DU= <E:\>
##$EXPNO= 12
$$ [...]
##$TP07= 0
##$TPNAME0= <>
##$TPNAME1= <>
##$TPNAME2= <>
##$TPNAME3= <>
##$TPNAME4= <>
##$TPNAME5= <>
##$TPNAME6= <>
##$TPNAME7= <>
##$TPOAL= (0..7)
0.5 0.5 0.5 0.5 0.5 0.5 0.5 0.5
##$TPOFFS= (0..7)
0 0 0 0 0 0 0 0
##$TUNHIN= 0
##$TUNHOUT= 0
##$TUNXOUT= 0
##$USERA1= <user>
##$USERA2= <user>
##$USERA3= <user>
##$USERA4= <user>
##$USERA5= <user>
##$V9= 5
##$VALIST= <valist>
##$VCLIST= <CCCCCCCCCCCCCCC>
##$VD= 0
##$VDLIST= <DDDDDDDDDDDDDDD>
##$VPLIST= <PPPPPPPPPPPPPPP>
##$VTLIST= <TTTTTTTTTTTTTTT>
##$WBST= 1024
##$WBSW= 4
##$XGAIN= (0..3)
0 0 0 0
##$XL= 0
##$YL= 0
##$YMAX_a= 6075642
##$YMIN_a= -12522895
##$ZGOPTNS= <>
##$ZL1= 120
##$ZL2= 120
##$ZL3= 120
##$ZL4= 120
##$ABSF1= 14.96093
##$ABSF2= -5.597252
##$ABSG= 5
##$ABSL= 3
##$ALPHA= 0
##$AQORDER= 0
##$ASSFAC= 0
##$ASSFACI= 0
##$ASSFACX= 0
##$ASSWID= 0
##$AUNMP= <proc_prof1d_extract.lims>
##$AXLEFT= 0
##$AXNAME= <>
##$AXNUC= <1H>
##$AXRIGHT= 0
##$AXTYPE= 0
##$AXUNIT= <>
##$AZFE= 0.1
##$AZFW= 0.1
##$BCFW= 0
##$BC_mod= 0
##$BYTORDP= 0
##$COROFFS= 0
##$CY= 15
##$DATMOD= 1
##$DC= 0
##$DFILT= <>
##$DTYPP= 0
##$F1P= 0
##$F2P= 0
##$FCOR= 0.5
##$FTSIZE= 131072
##$FT_mod= 6
##$GAMMA= 0
##$GB= 0
##$INTBC= 1
##$INTSCL= 1
##$ISEN= 128
##$LB= 0.3
##$LEV0= 0
##$LPBIN= 0
##$MAXI= 10000
##$MC2= 0
##$MEAN= 0
##$ME_mod= 0
##$MI= 0
##$NCOEF= 0
##$NC_proc= -2
##$NLEV= 6
##$NOISF1= 0
##$NOISF2= 0
##$NSP= 0
##$NTH_PI= 0
##$NZP= 0
##$OFFSET= 14.96093
##$PC= 1
##$PHC0= -80.79895
##$PHC1= 0
##$PH_mod= 1
##$PKNL= yes
##$PPARMOD= 0
##$PPDIAG= 0
##$PPIPTYP= 0
##$PPMPNUM= 2147483647
##$PPRESOL= 1
##$PSCAL= 4
##$PSIGN= 0
##$PYNMP= <proc.py>
##$REVERSE= no
##$SF= 400.020009665654
##$SI= 131072
##$SIGF1= 0
##$SIGF2= 0
##$SINO= 400
##$SIOLD= 131072
##$SPECTYP= <>
##$SREGLST= <1H.CDCl3>
##$SSB= 0
##$STSI= 131072
##$STSR= 0
##$SW_p= 8223.68421052631
##$SYMM= 0
##$S_DEV= 0
##$TDeff= 65536
##$TDoff= 0
##$TI= <>
##$TILT= no
##$TM1= 0
##$TM2= 0
##$TOPLEV= 0
##$USERP1= <user>
##$USERP2= <user>
##$USERP3= <user>
##$USERP4= <user>
##$USERP5= <user>
##$WDW= 1
##$XDIM= 131072
##$YMAX_p= 414624058
##$YMIN_p= -11863
##$CURPLOT= <Network HP LaserJet P1505>
##$CURPRIN= <$Network HP LaserJet P1505>
##$DFORMAT= <normdp>
##$LAYOUT= <+/1D_H.xwp>
##$LFORMAT= <normlp>
##$PFORMAT= <normpl>
##$SURQMSG= 1
$$ End of Bruker specific parameters
$$ ---------------------------------
##NTUPLES= NMR SPECTRUM
##VAR_NAME=  FREQUENCY,     SPECTRUM/REAL,   SPECTRUM/IMAG
##SYMBOL=    X,             R,               I
##VAR_TYPE=  INDEPENDENT,   DEPENDENT,       DEPENDENT
##VAR_FORM=  AFFN,          ASDF,            ASDF
##VAR_DIM=   131072,        131072,          131072
##UNITS=     HZ,            ARBITRARY UNITS, ARBITRARY UNITS
##FACTOR=    0.0627417313425164, 1,          1
##FIRST=     8223.62146879497, 2784,         -57423
##LAST=      0,             4964,            -56961
##MIN=       0,             -11863,          0
##MAX=       8223.62146879497, 414624058,    0
$$ Real data points
##PAGE= N=1
##DATA TABLE= (X++(R..R)), XYDATA
$$ [...]
63913C130961k03040k03250k00454j94452j85731j75162j63130j49601j34974
$$ 3130961 2927921 2724671 2524217 2329765 2144034 1968872 1805742 1656141 1521167
63904A521167j20345j06744r4441q3163p2651o2815n3638m5210l7813l1785k7345
$$ 1521167 1400822 1294078 1199637 1116474 1043823 981008 927370 882160 844347 812562 785217
63893G85217k4510k2928k1787k0260j8221j6255j4808j3700j2685j1946j1566
$$ 785217 760707 737779 715992 695732 677511 661256 646448 632748 620063 608117 596551
63882E96551j0925r347p159n318m003k363J40K974N447P679J0090J2542J4763
$$ 596551 585626 576279 569120 563802 559799 557436 557576 560550 565997 573676 583766 596308 611071
63869F11071J7146K0265K3649K5933K6454K6038K5960K6597K7407K7792K7632
$$ 611071 628217 648482 672131 698064 724518 750556 776516 803113 830520 858312 885944
63858H85944K7193K6876K6856K6763K5873K3836K1034J8041J4955J1511P660L643
$$ 885944 913137 940013 966869 993632 1019505 1043341 1064375 1082416 1097371 1108882 1116542 1120185
63846A120185m15m627q993j3259j7234k1017k4744k8268l1280l3605l5248l6202
$$ 1120185 1119770 1115143 1106150 1092891 1075657 1054640 1029896 1001628 970348 936743 901495 865293
63834H65293l6417l6049l5519l5136l4692l3645l1815k9636k7641k5892k4164
$$ 865293 828876 792827 757308 722172 687480 653835 622020 592384 564743 538851 514687
63823E14687k2461k0984j9653j8136j6439j4995j4013j3119j1929j0600r484q541
$$ 514687 492226 471242 451589 433453 417014 402019 388006 374887 362958 352358 342874 334333
63811C34333p536o577n959n572m998m207l639l503l431l075k646k547k710k741
$$ 334333 326797 320220 314261 308689 303691 299484 295845 292342 288911 285836 283190 280643 277933 275192
63797B75192k542k454k722l149l389l400l387l371l081k385j691j583k034k301
$$ 275192 272650 270196 267474 264325 260936 257536 254149 250778 247697 245312 243621 242038 240004 237703
63783B37703j771p63j89n17j312j800j670j218r37j025j340j636j748j513p49
$$ 237703 235932 235169 234980 234463 233151 231351 229681 228463 227526 226501 225161 223525 221777 220264 219515
63768B19515L33R23L56q04j106k8J241J350N77J69L84L33l39q83q21p42j151j483
$$ 219515 219848 220771 221127 220323 219217 219189 220430 221780 222357 222526 222910 223243 222904 222021 221200 220458 219307 217824
63750B17824j046k22J10j46l91l69k76r4L97J029J426J643K002K362K282J873
$$ 217824 216778 216556 216666 216520 216129 215760 215484 215390 215787 216816 218242 219885 221887 224249 226531 228404
63734B28404J781K202K592K580K443K450K364K000J766K135K888L413L542L642
$$ 228404 230185 232387 234979 237559 240002 242452 244816 246816 248582 250717 253605 257018 260560 264202
63720B64202M007M464M652M398L833L237K782K372J801J016J06r40k144l163l415
$$ 264202 268209 272673 277325 281723 285556 288793 291575 293947 295748 296764 296870 295930 293786 290623 287208
63705B87208k748j776j200j049q98o45o34r07q64RJ264J854J418P94R77J849K500
$$ 287208 284460 282684 281484 280435 279537 278892 278258 277351 276487 276496 277760 279614 281032 281826 282803 284652 287152
63688B87152K594K797L623M540M684L972K940J815M99p20j212r04m25k02j3L46
$$ 287152 289746 292543 296166 300706 305390 309362 312302 314117 314616 313896 312684 311780 311355 311153 311140 311486
63672C11486N57L42L5K23J011J984K621K564J828R53N90O38K92q28k062k666k954
$$ 311486 312043 312385 312420 312643 313654 315638 318259 320823 322651 323604 324194 324832 325124 324296 322234 319568 316614
63655C16614l773n169o240o236n271l983l001k745l227l914m097l495k326q74
$$ 316614 312841 307672 301432 295196 289925 285942 282941 280196 276969 273055 268958 265463 263137 262263
63641B62263O11J738K163K071K067K503L171L708M022M204M346M520M736M870
$$ 262263 262874 264612 266775 268846 270913 273416 276587 280295 284317 288521 292867 297387 302123 306993
63627C06993M872M963N376N949O346O622P184Q157R206J0144J1293J2990J5077
$$ 306993 311865 316828 322204 328153 334499 341121 348305 356462 365668 375812 387105 400095 415172
63614D15172J7092J8759K0069K1145K2286K3966K6505K9665L2641L4485L4636
$$ 415172 432264 451023 471092 492237 514523 538489 564994 594659 627300 661785 696421
63603F96421L3284L1101K8368K4486J8779J1756N033j16l631n978p260p530p391
$$ 696421 729705 760806 789174 813660 832439 844195 849228 849112 845481 839503 832243 824713 817322
63590H17322p591q215q927r859j1665j4597j8084k1277k3678k5142k5684k5444
$$ 817322 809731 801516 792589 782730 771065 756468 738384 717107 693429 668287 642603 617159
63578F17159k4570k3047k0913j8608j6685j5009j2755r476n872l134j687r07Q5
$$ 617159 592589 569542 548629 530021 513336 498327 485572 476096 470224 467090 465403 464496 464581
63565D64581J619L370M721N304N429N913P213Q795R698R726R699J0420J1816J3366
$$ 464581 466200 469570 474291 479595 485024 490937 498150 506945 516643 526369 536068 546488 558304 571670
63551E71670J4978J7007J9610K2626K6076L0310L5485M1138M6198M9096M7952
$$ 571670 586648 603655 623265 645891 671967 702277 737762 778900 825098 874194 922146
63540I22146M1457L0166J6658L949o233j3514j7830j9047j7587j4618j1389q670
$$ 922146 963603 993769 1010427 1014376 1008143 994629 976799 957752 940165 925547 914158 905488
63528I05488o951o666p983j0725j4692j9671k4932k9231l1777l2944l3541l3627
$$ 905488 898537 891871 883888 873163 858471 838800 813868 784637 752860 719916 686375 652748
63516F52748l2609l0404k7836k5733k4110k2487k0631j8632j6488j4084j1638
$$ 652748 620139 589735 561899 536166 512056 489569 468938 450306 433818 419734 408096
63505D08096r744q808q517q115p218o155n445n102m702l999l172k430j740j133
$$ 408096 398352 389544 381027 372912 365694 359539 354094 348992 344290 340291 337119 334689 332949 331816
63491C31816q92j141j440j240o51l10m68n67l1R58J779K302K955L835M268L681
$$ 331816 330924 329783 328343 327103 326452 326142 325674 325107 325076 326034 327813 330115 333070 336905 341173 344854
63475C44854K632K368L260M198L878K309N80n30j136j598k031k561l356m134m222
$$ 344854 347486 349854 353114 357312 361190 363499 364079 363549 362413 360815 358784 356223 352867 348733 344511
63460C44511l457k513j943j511r68q14j488k236j791n5J751K651K790K798L071
$$ 344511 341054 338541 336598 335087 334119 333305 331817 329581 327790 327735 329486 332137 334927 337725 340796
63445C40796L937N654P850R592J0410J0771J1266J2027J3221J5366J8549K2058
$$ 340796 344733 350387 358237 367829 378239 389010 400276 412303 425524 440890 459439 481497
63433D81497K5466K9377L4066L7812L7847L3143K5382J7069R615L503o44k123
$$ 481497 506963 536340 570406 608218 646065 679208 704590 721659 731274 734777 734133 732010
63421G32010r30K159O290J1060J6392K2269K8445L4213L8511M0414L9559L6098
$$ 732010 731080 733239 739529 750589 766981 789250 817695 851908 890419 930833 970392 1006490
63409A006490L0473K3436J5966Q766J959m388r509j2231j2273j0834r606r500
$$ 1006490 1036963 1060399 1076365 1085131 1087090 1082702 1073193 1060962 1048689 1037855 1028249 1018749
63397A018749j0641j3186j7352k2616k7672l1629l4651l7009l8083l7177l4899
$$ 1018749 1008108 994922 977570 954954 927282 895653 861002 823993 785910 748733 713834
63386G13834l2729l1156k9238k6258k2844j9899j7293j4448j1577r403p866o107
$$ 713834 681105 649949 620711 594453 571609 551710 534417 519969 508392 498989 491123 485016
63374D85016l728j247Q13K577M321N941P202Q205R324J0942J3224J5842J8021
$$ 485016 481288 480041 480854 483431 487752 493693 500895 509100 518424 529366 542590 558432 576453
63361E76453J9308K0304K2134K5107K8501L1684L4690L7461L9333L9821L9194
$$ 576453 595761 616065 638199 663306 691807 723491 758181 795642 834975 874796 913990
63350I13990L7629L4347K8513K0680J2571N458m63n220q502j0201j0831j1004
$$ 913990 951619 985966 1014479 1035159 1047730 1053188 1052725 1047505 1039003 1028802 1017971 1006967
63338A006967j0920j0696j0872j2212j5160j9541k4593k9205l2527l4517l5630
$$ 1006967 996047 985351 974479 962267 947107 927566 902973 873768 841241 806724 771094
63327G71094l5898l4759l1961k8146k4139k0078j5642j0860o100j594K273M289
$$ 771094 735196 700437 668476 640330 616191 596113 580471 569611 563511 561917 564190 568479
63315E68479K911k120r135j5784k0643k3382k4049k2872k0524j7946j5655j3539
$$ 568479 571390 569270 560135 544351 523708 500326 476277 453405 432881 414935 399280 385741
63303C85741j1337r049o887n153m107l708l461k952k439k540l212l631l288k649
$$ 385741 374404 365355 358468 353315 349208 345500 342039 339087 336648 334108 330896 327265 323977 321328
63289C21328k406k542k623k614k764k912k613j879j206q17m56j0K17O3k13m39
$$ 321328 318922 316380 313757 311143 308379 305467 302854 300975 299769 298952 298496 298486 298703 298766 298553 298114
63273B98114p90j261j334o11N44J377J523J161N98O6k61l19n3P67K268L796M125
$$ 298114 297324 296063 294729 294118 294662 296039 297562 298723 299321 299387 299126 298807 298754 299521 301789 305585 309710
63256C09710K882J299R25J874L013L605L936M366M719M780M695M589M410M387
$$ 309710 312592 313891 314816 316690 319703 323308 327244 331610 336329 341109 345804 350393 354803 359190
63242C59190N035O335P535Q152Q603R431J0474J1331J2160J3321J4646J5814J7046
$$ 359190 364225 370560 378095 386247 394850 404281 414755 426086 438246 451567 466213 482027 499073
63229D99073J8666K0104K0354J9386J8209J7364J6334J4853J3853J4278J5624
$$ 499073 517739 537843 558197 577583 595792 613156 629490 644343 658196 672474 688098
63218F88098J6581J6818J7138J7875J8216J7397J5798J4243J2707J0451P117L078
$$ 688098 704679 721497 738635 756510 774726 792123 807921 822164 834871 845322 852439 855517
63206H55517j322o117j1119j5478j8298j9553j9978k0215k0347k0194j9659j8723
$$ 855517 854195 848078 836959 821481 803183 783630 763652 743437 723090 702896 683237 664514
63194F64514j7343j5484j3100j0079o508k946j10J934L901O368R037J1258J3006
$$ 664514 647171 631687 618587 608508 602000 599054 598944 600878 604779 611147 620184 631442 644448
63181F44448J4760J6536J7650J7704J7284J7315J7969J8606J8636J8057J7178
$$ 644448 659208 675744 693394 711098 728382 745697 763666 782272 800908 818965 836143
63170H36143J6215J5267J4454J3779J2964J1558R234N955J904k665p453j2168
$$ 836143 852358 867625 882079 895858 908822 920380 929614 935569 937473 934808 927355 915187
63158I15187j6625k0807k4728k8159l0615l1679l1352l0090k8511k7114k6054
$$ 915187 898562 877755 853027 824868 794253 762574 731222 701132 672621 645507 619453
63147F19453k4984k3221k0416j7088j4273j2451j1105r538p825o631o188n920
$$ 619453 594469 571248 550832 533744 519471 507020 495915 486377 478552 471921 465733 459813
63135D59813n157l872k594j762j448j417j296p84K6O12N53R1m9N80J753K946L855
$$ 459813 454656 450784 448190 446428 444980 443563 442267 441483 441509 442121 442674 442765 442716 443296 445049 447995 451850
63118D51850M419M632M565M435M424M499M551M608M685M567M075L461L117K891
$$ 451850 456269 460901 465466 469901 474325 478824 483375 487983 492668 497235 501310 504771 507888 510779
63104E10779K214J060K70M50J048J082N05J97O63J421J837J839J600J128N61L63
$$ 510779 512993 514053 514323 514773 515821 516903 517408 517605 518268 519689 521526 523365 524965 526093 526654 527017
63088E27017P01R82N52m00j046r41l54K28M35P5o23q56N4J736L052L411L281L396
$$ 527017 527718 528700 529252 528852 527806 526865 526511 526739 527174 527249 526626 525770 525824 527560 530612 534023 537304 540700
63070E40700L942M805N958P283Q365Q891R007R070R357J0189J1863J4106J6082
$$ 540700 544642 549447 555405 562688 571053 579944 588951 598021 607378 617567 629430 643536 659618
63057F59618J7371J8615K0737K3803K7169L0393L3360L5790L7396L8507L9849
$$ 659618 676989 695604 716341 740144 767313 797706 831066 866856 904252 942759 982608
63046I82608M1618M3295M4394M4846M4583M3458M1824M0554M0202M0544M1166
$$ 982608 1024226 1067521 1111915 1156761 1201344 1244802 1286626 1327180 1367382 1407926 1449092
63035A449092M1918M2525M2380M1209L9497L7726L5552L2215K7422K1183J3272
$$ 1449092 1491010 1533535 1575915 1617124 1656621 1694347 1729899 1762114 1789536 1810719 1823991
63024A823991L661o737j6515k5126l3015m0412m6752n1504n4823n6897n7312n5643
$$ 1823991 1827652 1820915 1804400 1779274 1746259 1705847 1659095 1607591 1552768 1495871 1438559 1382916
63012A382916n2253m7833m2510l6102k9058k2345j6379j0714m968O15N782J0812
$$ 1382916 1330663 1282830 1240320 1204218 1175160 1152815 1136436 1125722 1120754 1121369 1127151 1137963
63000A137963J5937K0695K4391K6950K8765K9999L0655L1099L1793L2494L2502
$$ 1137963 1153900 1174595 1198986 1225936 1254701 1284700 1315355 1346454 1378247 1410741 1443243
62989A443243L1803L1201L1011L0463K8927K6889K4880K2050J6989R729J810n765
$$ 1443243 1475046 1506247 1537258 1567721 1596648 1623537 1648417 1670467 1687456 1697185 1698995 1693230
62977A693230j3465k1785k9973l6945m2740m8164n3293n7190n9032n8911n7399
$$ 1693230 1679765 1657980 1628007 1591062 1548322 1500158 1446865 1389675 1330643 1271732 1214333
62966A214333n4883n1477m7301m2688l8238l4623l2069l0088k7956k5488k3138
$$ 1214333 1159450 1107973 1060672 1017984 979746 945123 913054 882966 855010 829522 806384
62955H06384k1335j9982j8678j7230j5883j5120j5228j5979j6706j6790j6109
$$ 806384 785049 765067 746389 729159 713276 698156 682928 666949 650243 633453 617344
62944F17344j5039j4096j3539j3166j2482j1249r870q948q458p748o506n344n033
$$ 617344 602305 588209 574670 561504 549022 537773 527903 518955 510497 502749 496243 490899 485866
62931D85866n474n789n290m042k638j778j833k459k739k093r61k48k23m06m08
$$ 485866 480392 474603 469313 465271 462633 460855 459022 456563 453824 451731 450770 450522 450299 449893 449485
62916D49485l87o23j052j372j385j182j113j463j987k059j562j229j708k578k951
$$ 449485 449098 448475 447423 446051 444666 443484 442371 440908 438921 436862 435300 434071 432363 429785 426834
62901D26834k704k371k069j453o49k14k3P15K058K986K908K480K305J847N57q21
$$ 426834 424130 421759 419690 418237 417588 417374 417351 418066 420124 423110 426018 428498 430803 432650 433207 432386
62885D32386j166o60l74n82o18k26P7O6O6O8l98j189j328l93O89Q31J53m95q27
$$ 432386 431220 430560 430186 429604 428986 428760 428837 428903 428969 429037 428639 427450 426122 425729 426418 427249 427402 426907 426080
62866D26080j193j627j618r65k55k60j088k082k494k143j503j185j363j727j819
$$ 426080 424887 423260 421642 420677 420422 420162 419074 416992 414498 412355 410852 409667 408304 406577 404758
62851D04758j367m41N39J084J171J301J746J958J268J5p05n04k10o01j363j740
$$ 404758 403391 402950 403489 404573 405744 407045 408791 410749 412017 412032 411327 410823 410613 410012 408649 406909
62835D06909j625j419j187p33k23k8l4K03O36P43M57L23N51O40K63n3K78R93J501
$$ 406909 405284 403865 402678 401945 401722 401694 401660 401863 402499 403242 403699 404022 404573 405213 405476 405423 405701 406694 408195
62816D08195J901K720L772M171L609K881K829L335L807M135M600N161N437N307
$$ 408195 410096 412816 416588 420759 424368 427249 430078 433413 437220 441355 445955 451116 456553 461860
62802D61860N061M988N241O033P431Q900R641R516R181R133R227R413J0302J2370
$$ 461860 466921 471909 477150 483183 490614 499514 509155 518671 527852 536985 546212 555625 565927 578297
62788E78297J5003J7119J8595K0297K2842K5998K9520L3738L8882M4354M9247
$$ 578297 593300 610419 629014 649311 672153 698151 727671 761409 800291 844645 893892
62777H93892N3339N7131O1072O5084O8737P1431P2445P1264O7952O3031N6858
$$ 893892 947231 1004362 1065434 1130518 1199255 1270686 1343131 1414395 1482347 1545378 1602236
62766A602236M9249L9806K8503J5938L076r224k0560l0875m0076m7868n4092n9058
$$ 1602236 1651485 1691291 1719794 1735732 1738808 1729584 1709024 1678149 1638073 1590205 1536113 1477055
62754A477055o3262o6701o8698o8563o6320o2758n8830n5106n1688m8401m4965
$$ 1477055 1413793 1347092 1278394 1209831 1143511 1080753 1021923 966817 915129 866728 821763
62743H21763m1112l6783l2325k8399k5512k3573k1979k0153j7968j5685j3620
$$ 821763 780651 743868 711543 683144 657632 634059 612080 591927 573959 558274 544654
62732E44654j1886j0353q764p005n267l946l254l029k861k307j095O51K265K938
$$ 544654 532768 522415 513651 506646 501379 497433 494179 491150 488289 485982 484887 485538 487803 490741
62718D90741K551J976K265L641N463P094Q461R756J1050J2377J3945J5976J8377
$$ 490741 493292 495268 497533 501174 506637 513731 522192 531948 542998 555375 569320 585296 603673
62705F03673K0814K3154K5656K8699L2309L6074L9523M2613M5765M9386N3487
$$ 603673 624487 647641 673297 701996 734305 770379 809902 852515 898280 947666 1001153
62694A001153N7792O2014O5762O8373O9279O8567O6747O3742N8571N0456L9972
$$ 1001153 1058945 1120959 1186721 1255094 1324373 1392940 1459687 1523429 1582000 1632456 1672428
62683A672428K8535J6856M558q580k1663l3404m3468n2404o0349o6517p0189p1683
$$ 1672428 1700963 1717819 1722377 1713797 1692134 1658730 1615262 1562858 1502509 1435992 1365803 1294120
62671A294120p1791p0588o7470o2461n6841n2105m8596m5570m2321l8773l5121
$$ 1294120 1222329 1151741 1084271 1021810 964969 912864 864268 818698 776377 737604 702483
62660G02483l1463k7977k4891k2100j9202j6263j4087j3264j3183j2619j1242
$$ 702483 671020 643043 618152 596052 576850 560587 546500 533236 520053 507434 496192
62649D96192r941r538r701r485q633p789p526p525o979n637m208l505l403k932
$$ 496192 486251 476713 467012 457527 448894 441105 433579 426054 419075 413438 409230 405725 402322 399390
62635C99390j551Q8R05O36q8p32j306j835k023j730j341j247j312j170p41j53
$$ 399390 397839 397927 398832 399468 399380 398648 397342 395507 393484 391754 390413 389166 387854 386684 385943 385790
62619C85790N72J326J661J247N03K43P19J415J922K510L634N118O238O537O339
$$ 385790 386362 387688 389349 390596 391099 391342 392061 393476 395398 397908 401542 406660 412898 419435 425774
62604D25774O339O786P317P678Q349J0041J2606J4997J6557J7872J9978K3065
$$ 425774 432113 438899 446216 453894 462243 472284 484890 499887 516444 534316 554294 577359
62592E77359K6444K9460L1865L3478L4188L4243L3989L3162L0976K7018K1700
$$ 577359 603803 633263 665128 698606 732794 767037 801026 834188 865164 892182 913882
62581I13882J5731R577L467k514q448j4288j9524k3521k6242k8196k9614l0291
$$ 913882 929613 939190 942657 940143 931695 917407 897883 874362 848120 819924 790310 760019
62569G60019l0253k9907k9336k8119k6196k4220k2670k1210j9395j7410j5566
$$ 760019 729766 699859 670523 642404 616208 591988 569318 548108 528713 511303 495737
62558D95737j3638j1361r148p557o452n323m252l798m062m521m686m441l795k876
$$ 495737 482099 470738 461590 454033 447581 442258 438006 434208 430146 425625 420939 416498 412703 409827
62544D09827k031j462q46J46J154J546J353J161J188J124Q07M09J0l76l88L26
$$ 409827 407796 406334 405488 405634 406788 408334 409687 410848 412036 413160 413967 414376 414386 414010 413622 413948
62528D13948J399K201K928M397O619Q548R553J0230J1322J2662J3819J5033J6847
$$ 413948 415347 417548 420476 424873 431492 440040 449593 459823 471145 483807 497626 512659 529506
62515E29506J9284K2032K4965K7982L0809L3446L6313L9322M1416M1684M0484
$$ 529506 548790 570822 595787 623769 654578 688024 724337 763659 805075 846759 887243
62504H87243L8644L6069L2120K6990K1570J5994R546K245m635j0101j4536j8593
$$ 887243 925887 961956 994076 1021066 1042636 1058630 1068176 1070421 1065786 1055685 1041149 1022556
62492A022556k1775k3082k2612k1490k0264j8221j4587r761m860m21L911Q511
$$ 1022556 1000781 977699 955087 933597 913333 895112 880525 870764 865904 865483 869394 877905
62480H77905J3068J6945J9927K2331K4373K5694K5599K3659K0039J5304J0015
$$ 877905 890973 907918 927845 950176 974549 1000243 1025842 1049501 1069540 1084844 1094859
62469A094859M540q73o128j1490j7592k4705l1900l7439m0382m1477m2025m2197
$$ 1094859 1099399 1098526 1092398 1080908 1063316 1038611 1006711 969272 928890 887413 845388 803191
62457H03191m1237l9059l6623l4522l2108k8667k4640k0996j7929j5037j2396
$$ 803191 761954 722895 686272 651750 619642 590975 566335 545339 527410 512373 499977
62446D99977j0480r109p433n164l039j707p97M60K103L467M131M385M730N150
$$ 499977 489497 480388 472955 467791 464752 463045 462248 462708 464811 468278 472409 476794 481524 486674
62432D86674N065L964K038l7j905l831n930p526p879p353p146p743q331q073p265
$$ 486674 491739 495703 497741 497704 495799 491968 486038 478512 470633 463280 456134 448391 440060 431987 424722
62417D24722o769o706o392n401m113l199k936l053l057k652k063j832k125k389
$$ 424722 417953 411247 404855 399454 395341 392142 389206 386153 383096 380444 378381 376549 374424 372035
62403C72035k018j183n88n01m57oO91J231J543J842K298K974L866M673M747L728
$$ 372035 370017 368834 368246 367745 367288 367282 367973 369204 370747 372589 374887 377861 381727 386400 391147 394875
62387C94875K195J246J349J915K222K412L189M591N602N289M177L944N610Q268
$$ 394875 397070 398316 399665 401580 403802 406214 409403 413994 419596 424885 429062 433006 438616 446884
62373D46884J0059J0244R845J0130J1098J1882J2136J2421J3248J4514J5958J7653
$$ 446884 456943 467187 477032 487162 498260 510142 522278 534699 547947 562461 578419 596072
62361E96072J9825K2502K5667K9367L3545L8032M2840M8063N3247N7332N9494
$$ 596072 615897 638399 664066 693433 726978 765010 807850 855913 909160 966492 1025986
62350A025986N9615N7719N3496M6912L8765L0058K1170J2301M183k487q142j3915
$$ 1025986 1085601 1143320 1196816 1243728 1282493 1312551 1333721 1346022 1350205 1347718 1339576 1325661
62338A325661k0234k6596l2635l8312m2999m5546m5688m4533m3126m1266l8309
$$ 1325661 1305427 1278831 1246196 1207884 1164885 1119339 1073651 1029118 985992 944726 906417
62327I06417l4345k9989k5678k1818j9027j7497j6551j5565j4948j5502j7136
$$ 906417 872072 842083 816405 794587 775560 758063 741512 725947 710999 695497 678361
62316F78361j8899k0011k0246j9637j8512j7541j7011j6231j4494j2316j0874
$$ 678361 659462 639451 619205 599568 581056 563515 546504 530273 515779 503463 492589
62305D92589j0256r279p217m836l303k771k542k104j598j408j642j920j647o36
$$ 492589 482333 473054 465837 461001 457698 454927 452385 450281 448683 447275 445633 443713 442066 441430
62291D41430N73J320J604J860K199K377K446K788L396L765L695L650M023M530
$$ 441430 442003 443323 444927 446787 448986 451363 453809 456597 459993 463758 467453 471103 475126 479656
62277D79656M648M319L969M019M552N256N685N746N914O632P729Q827J0115J2084
$$ 479656 484304 488623 492592 496611 501163 506419 512104 517850 523764 530396 538125 546952 557067 569151
62263E69151J4600J7025J9264K1834K4856K7902L1140L5556M1486M7796N3209
$$ 569151 583751 600776 620040 641874 666730 694632 725772 761328 802814 850610 903819
62252I03819N7647O1415O3802O3568O0420N5039M7865L8951K8968J9253J0588
$$ 903819 961466 1022881 1086683 1150251 1210671 1265710 1313575 1352526 1381494 1400747 1411335
62241A411335K575n454j3521k1324k8868l6374m3728n0376n5655n9070o0420n9765
$$ 1411335 1413910 1408456 1394935 1373611 1344743 1308369 1264641 1214265 1158610 1099540 1039120 979355
62229I79355n7351n3577m9033m4352l9848l5432l1088k7188k4086k1557j9053
$$ 979355 922004 868427 819394 775042 735194 699762 668674 641486 617400 595843 576790
62218E76790j6466j4232j2636j1346r782p858o142n285n252n252m632l681l212
$$ 576790 560324 546092 533456 522110 512328 504470 498328 493043 487791 482539 477907 474226 471014
62205D71014l324l203k338j289p80n47J77J416K495L158L919N203O790Q217R185
$$ 471014 467690 464487 462149 460860 460080 459533 459710 461126 463621 466779 470698 475901 482691 490908 500093
62190E00093R608R732J0220J1554J3300J4605J5421J6491J7948J8908J8812J8360
$$ 500093 509701 519433 529653 541207 554507 569112 584533 601024 618972 637880 656692 675052
62178F75052J8367J8324J7026J4322J1412R445Q581Q463Q991J0297J2344J4822
$$ 675052 693419 711743 728769 743091 754503 763948 772529 780992 789983 800280 812624 827446
62166H27446J7364J9824K2463K5778K9903L4218L7732L9743L9913L7910L3544
$$ 827446 844810 864634 887097 912875 942778 976996 1014728 1054471 1094384 1132294 1165838
62155A165838K7299K0235J3233O592M13n100r978j4680j9580k4458k8912l2953
$$ 1165838 1193137 1213372 1226605 1233197 1233610 1228510 1218532 1203852 1184272 1159814 1130902 1097949
62143A097949l6728l9705m0807l9561l6766l3666l0784k7829k4507k0959j7460
$$ 1097949 1061221 1021516 980709 941148 904382 870716 839932 812103 787596 766637 749177
62132G49177j4174j1320r190p769o633n474m500m046l924l556k651j378J30K017
$$ 749177 735003 723683 714493 706724 700091 694617 690117 686071 682147 678591 675940 674562 674692 676709
62118F76709M315O678Q747J0448J1671J1986J1054R077O444L212n12l774n212
$$ 676709 681024 687702 696449 706897 718568 730554 741608 750685 757129 760341 759829 756055 750843
62105G50843m492k801j595j360j994l604o144q658r836r476q551p750o675m802
$$ 750843 746351 743550 741955 740595 738601 734997 728853 720195 710359 700883 692332 684582 677907 673105
62091F73105k514n46R98K488L929N000N816O934Q501R904J0536J0591J0872J1989
$$ 673105 670591 670045 671043 673531 677460 682460 688276 695210 703711 713615 724151 734742 745614 757603
62077G57603J3871J6021J8043J9905K1664K3065K3709K3661K3579K3954K4569
$$ 757603 771474 787495 805538 825443 847107 870172 893881 917542 941121 965075 989644
62066I89644K4974K5199K5568K6093K6619K7400K8824L0524L1332L0320K7445
$$ 989644 1014618 1039817 1065385 1091478 1118097 1145497 1174321 1204845 1236177 1266497 1293942
62055A293942K3143J7823J1986O296J197l271p161j0562j3974j8210k3489k8999
$$ 1293942 1317085 1334908 1346894 1353190 1354387 1351116 1343955 1333393 1319419 1301209 1277720 1248721
62043A248721l3699l7273m0030m2208m3747m4461m4083m2380l9578l6419l3494
$$ 1248721 1215022 1177749 1137719 1095511 1051764 1007303 963220 920840 881262 844843 811349
62032H11349l0756k7940k5155k2661k0310j7776j5146j2855j1117r765q631p721
$$ 811349 780593 752653 727498 704837 684527 666751 651605 638750 627633 617868 609237 601516
62020F01516p048o610o500o755p160p449p609p773p877p736p295o658n956n342
$$ 601516 594468 587858 581358 574603 567443 559994 552385 544612 536735 528999 521704 515046 509090 503748
62006E03748m869m200k807p56J033J819J968K361L084L394K875K017J510J491
$$ 503748 498879 494679 491872 491116 492149 493968 495936 498297 501381 504775 507650 509667 511177 512668
61992E12668J578J269K45j357k922l941m595n408o401p090p279p359p672q040
$$ 512668 514246 515515 515760 514403 511481 507540 502945 497537 491136 484046 476767 469408 461736 453696
61978D53696q108p775p151o387n674n137m669m127l652l473l464l277k895k619
$$ 453696 445588 437813 430662 424275 418601 413464 408795 404668 401016 397543 394079 390802 387907 385288
61964C85288k512k306j851j226m40M55J066J087R95J563K580K911K155J348J528
$$ 385288 382776 380470 378619 377393 376953 377408 378474 379561 380556 382119 384699 387610 389765 391113 392641
61949C92641K380L024L512M589O327Q006R255J0517J2190J4000J5496J6715J7983
$$ 392641 395021 398045 401557 406146 412473 420479 429734 440251 452441 466441 481937 498652 516635
61936E16635J9301K0267K0514K0093J9367J8619J7856J6981J6028J5034J3725
$$ 516635 535936 556203 576717 596810 616177 634796 652652 669633 685661 700695 714420
61925G14420J1730R105O320L661R49j982m866p270r040j0195j0678j0457r620
$$ 714420 726150 735255 741575 745236 746185 744203 739337 732067 723027 712832 702154 691697 682077
61912F82077q152n780k372J661N636R063J1711J3460J4407J4894J5120J4812J3585
$$ 682077 673925 668145 665773 667434 673070 682133 693844 707304 721711 736605 751725 766537 780122
61899G80122J1470Q881O135L302L65k688n845q900j1365j2785j3191j3080j2994
$$ 780122 791592 800473 806608 809910 810275 807587 801742 792842 781477 768692 755501 742421 729427
61886G29427j3162j3364j3109j2142j0869j0020r838r899r823r735r875j0163
$$ 729427 716265 702901 689792 677650 666781 656761 646923 637024 627201 617466 607591 597428
61874E97428j0510j1016j1495j1272r975q236o971o216n305l975k638j557m29
$$ 597428 586918 575902 564407 553135 543160 534924 527953 521737 516432 512457 509819 508262 507833
61861E07833J044K708M239N565O861Q386J0305J2432J4292J5711J7180J9215K1578
$$ 507833 508877 511585 515824 521389 528250 536636 546941 559373 573665 589376 606556 625771 647349
61848F47349K3579K5008K6182K7169K7637K7472K6924K5987K4263K1601J8219
$$ 647349 670928 695936 722118 749287 776924 804396 831320 857307 881570 903171 921390
61837I21390J3978Q294J272n604j0529j2890j3435j3187j2587j1388q960m883
$$ 921390 935368 943662 944934 939330 928801 915911 902476 889289 876702 865314 856354 851471
61825H51471L94N556R441J1959J3752J5152J5782J5069J2813R297N080O00m222
$$ 851471 851865 857421 866862 878821 892573 907725 923507 938576 951389 960686 965766 966366 962144
61812I62144r791j6008k1799k5855k7760k8079k7448k6084k4234k2470k1137j9848
$$ 962144 952353 936345 914546 888691 860931 832852 805404 779320 755086 732616 711479 691631
61800F91631j7979j5597j3409j1787j0252q301o352n391n681o274o082n051l962
$$ 691631 673652 658055 644646 632859 622607 614306 607954 602563 596882 590608 584526 579475 575513
61787E75513l369l133k931k690k445k185k003k098k440k717k786k902l285l653
$$ 575513 572144 569011 566080 563390 560945 558760 556757 554659 552219 549502 546716 543814 540529 536876
61773E36876l529k852k016j389j040r20j017j275j494j441j080o03k78j58j4K95
$$ 536876 533347 530495 528479 527090 526050 525130 524113 522838 521344 519903 518823 518220 517942 517784 517770 518065
61757E18065M92J82m77p50k01P64J447J644J545J137K80p73j560k123k923l880
$$ 518065 518557 518739 518262 517512 517311 518075 519522 521166 522711 523848 524128 523355 521795 519672 516749 512869
61741E12869m132l163j723r92j178j490j391j186j270j459j337q73l20J44M26
$$ 512869 508737 505574 503851 502859 501681 500191 498800 497614 496344 494885 493548 492675 492355 492499 492925
61726D92925M48M10Q06J774K708K957K679K516K581K434K052K018K584L185L252
$$ 492925 493373 493783 494589 496363 499071 502028 504707 507223 509804 512238 514290 516308 518892 522077 525329
61711E25329K937K585K020R24m39j439j894k113k369k729l240l768l846l271k615
$$ 525329 528266 530851 532871 533795 533356 531917 530023 527910 525541 522812 519572 515804 511958 508687 506072
61696E06072k614l081l147k547j922j789j920k025k251k631k664k011j229j158
$$ 506072 503458 500377 497230 494683 492761 490972 489052 487027 484776 482145 479481 477470 476241 475083
61682D75083j843k511k506j886j195q88r61r75n85m5Q4k54n72o93j053j809k309
$$ 475083 473240 470729 468223 466337 465142 464254 463293 462318 461733 461688 461772 461518 460946 460253 459200 457391 455082
61665D55082k013j438j418j832j828j197o13n25n93m11j27n7j47j49K9L01N09
$$ 455082 453069 451631 450213 448381 446553 445356 444743 444218 443625 443214 443087 443030 442883 442734 442763 443064 443573
61648D43573M60J99J78P07J287J118L78K48J330K720L171K611J863J361R09M31
$$ 443573 444033 444232 444410 445117 446404 447522 447900 448148 449478 452198 455369 457980 459843 461204 462113 462544
61632D62544R4k97j229k573l433l245k535k275k754l466l818l580k826j832j044
$$ 462544 462638 462341 461112 458539 455106 451861 449326 447051 444297 440831 437013 433433 430607 428775 427731
61617D27731p82q78q15l07L54O17J99p14j740k633l387m076m701n199n523n669
$$ 427731 426949 426071 425256 424949 425303 425920 426119 425405 423665 421032 417645 413569 408868 403669 398146 392477
61601C92477n624n397n128m999m973m720l945k795j859j659k196k959l363l186
$$ 392477 386853 381456 376328 371329 366356 361636 357691 354896 353037 351378 349182 346223 342860 339674
61587C39674k643k103j738j425j014o02m57p13j242j864k526l164l508l195k219
$$ 339674 337031 334928 333190 331765 330751 330149 329692 328979 327737 325873 323347 320183 316675 313480 311261
61572C11261j116n97q97j512j655j026j34K13k87j145j585j237l24O37J229J381
$$ 311261 310145 309548 308651 307139 305484 304458 304324 304537 304250 303105 301520 300283 299959 300596 301825 303206
61556C03206J394J611J957J919J201K69j19J67N19M38R9r2p6qJ10K86K86k3k61
$$ 303206 304600 306211 308168 310087 311288 311557 311438 311605 312124 312562 312661 312569 312493 312485 312595 312881 313167 313144 312883
61537C12883M1P59J325J570J850K289K508K251J800J450J043M30n7r1Rl01r60
$$ 312883 312924 313683 315008 316578 318428 320717 323225 325476 327276 328726 329769 330199 330142 330051 330060 329759 328799
61520C28799j468j742k141k669k834k519k228k199j815n08J143J841J058l64j191
$$ 328799 327331 325589 323448 320779 317945 315426 313198 310999 309184 308676 309819 311660 312718 312354 311163
61505C11163j061o67q47j597k018j325J89J402J618J140N41r5q11j175p26J41
$$ 311163 310102 309435 308588 306991 304973 303648 303837 305239 306857 307997 308538 308443 307632 306457 305731 305872
61489C05872N10J42k82k02J61L82M96P55J131J401J480J370J045O32M14M86O30
$$ 305872 306382 306524 306242 306040 306201 306583 307079 307834 308965 310366 311846 313216 314261 314893 315307 315793 316423
61472C16423O93P51P45L86k91o82l91K15N90Q23J238J545J135J06p60j060j114
$$ 316423 317116 317867 318612 318998 318707 318025 317634 317849 318439 319262 320500 322045 323180 323286 322526 321466 320352
61455C20352j139q08M6Q58R74N31K65N98J252J684J663J410J314J464J559J400
$$ 320352 319213 318405 318451 319309 320283 320814 321079 321677 322929 324613 326276 327686 329000 330464 332023 333423
61439C33423J288J648K281K476J973J387J436K053K580K614K382K386K827L353
$$ 333423 334711 336359 338640 341116 343089 344476 345912 347965 350545 353159 355541 357927 360754 364107
61425C64107L339K587J661J240J195Q59K00R9J096K512L264L094K404J366Jj141
$$ 364107 367446 370033 371694 372934 374129 374988 375188 375287 376383 378895 382159 385253 387657 389023 389024 387883
61409C87883j248l49N95Q28M90J1n41j233j836k131k280k582k938k960k473j691
$$ 387883 386635 386286 386881 387709 388199 388210 387669 386436 384600 382469 380189 377607 374669 371709 369236 367545
61393C67545r19k76K66O61O47Jj030j693j414m23O21J462K285K916K791J900J162
$$ 367545 366626 366350 366616 367277 367924 367925 366895 365202 363788 363365 363986 365448 367733 370649 373440 375340 376502
61376C76502J305J895K042J736J690K081K262J852J332J245J420J403J215J195
$$ 376502 377807 379702 381744 383480 385170 387251 389513 391365 392697 393942 395362 396765 397980 399175
61362C99175J371J476J404J229R45O16O69J444K533L119L094L262M178N365O142
$$ 399175 400546 402022 403426 404655 405600 406216 406885 408329 410862 413981 417075 420337 424515 429880 436022
61347D36022O636P380Q211Q446Q006P543P304O640N147L580K949L149L217K799
$$ 436022 442658 450038 458249 466695 474701 482244 489548 496188 501335 504915 507864 511013 514230 517029
61333E17029K514K771K983K394J154N0n87j245k408l831m760m740l975k928j767
$$ 517029 519543 522314 525297 527691 528845 528895 528308 527063 524655 520824 516064 511324 507349 504421 502654
61318E02654m24R00J659J656J511J943K722K908K278J903K816M660O239P178Q230
$$ 502654 502230 503130 504789 506445 507956 509899 512621 515529 517807 519710 522526 527186 533425 540603 548833
61303E48833R951J1817J3022J3577J4042J4372J3654J1139P303L605J153l20k000
$$ 548833 558784 570601 583623 597200 611242 625614 639268 650407 657710 661315 662468 662148 660148
61290F60148m459o798p654o916n940n937o667p123p008o913p175p251o513n112
$$ 660148 655689 648891 641237 634321 628381 622444 615777 608654 601646 594733 587558 580307 573794 568682
61276E68682l706k573j416J8J419K235K307K035J927K125K467K811L082L139K940
$$ 568682 564976 562403 560987 561005 562424 564659 566966 569001 570928 573053 575520 578331 581413 584552 587492
61261E87492K817L177L820M088L934M317N948Q062R167Q835P980P352O617N192
$$ 587492 590309 593486 597306 601394 605328 609645 615593 623655 632822 641657 649637 656989 663606 668798
61247F68798L259J452%j352k832m355n618o274o238n934n789n577m774l661l243
$$ 668798 672057 673509 673509 672157 669325 664970 659352 653078 646840 640906 635117 629540 624766 621105 617862
61232F17862l679l754k538p97J59L79Q95J878K506K579K946M059N304O101O673
$$ 617862 614183 610429 607891 607094 607253 607632 608527 610405 612911 615490 618436 622495 627799 633900 640573
61217F40573P205P222O540N945O095O395N921M978M765N610O520O554N828M993
$$ 640573 647778 655000 661540 667485 673580 679975 685896 690874 695639 701249 707769 714323 720151 725144
61203G25144M368L947L762L850M081M366M786N434O324P631R705J2478J5008J6184
$$ 725144 729512 733459 737221 741071 745152 749518 754304 759738 766062 773693 783398 795876 810884 827068
61189H27068J5971J5539J5790J6101J5090J2536R815Q137P094N488L201J292L51
$$ 827068 843039 858578 874368 890469 905559 918095 927910 936047 943141 948629 951830 953122 953473
61176I53473l18j598l292m513m962n262o123p540q905r789j0446j1470j2933j4149
$$ 953473 953155 951557 948265 943752 938790 933528 927405 919865 910960 901171 890725 879255 866322 852173
61162H52173j4545j4459j4629j5134j5470j5495j5549j5516j4753j3241j1967
$$ 852173 837628 823169 808540 793406 777936 762441 746892 731376 716623 703382 691415
61151F91415j1583j1382j0274q146n635l074o06J141J493Q07J35k65j241l301
$$ 691415 679832 668450 658176 650030 644395 641321 640715 641856 643349 644156 644291 644026 642785 639484
61137F39484n644p053p239o807o191n200l559j584K5R82J827L296N361P235Q410
$$ 639484 633840 626787 619548 612741 606550 601350 597791 596207 596232 597214 599041 602337 607698 614933 623343
61122F23343R270J0465J2049J3729J5552J7827K0469K2967K4931K6310K7173K7682
$$ 623343 632613 643078 655127 668856 684408 702235 722704 745671 770602 796912 824085 851767
61110H51767K8166K8803K9214K8810K7519K5809K4087K2470K1021J9709J8137
$$ 851767 879933 908736 937950 966760 994279 1020088 1044175 1066645 1087666 1107375 1125512
61099A125512J5828J2850R674O392K563k017o877j1349j5138j8223k0636k2541
$$ 1125512 1141340 1154190 1163864 1170256 1172819 1170802 1163925 1152576 1137438 1119215 1098579 1076038
61087A076038k4225k5771k6938k7472k7400k6907k6185k5343k4275k2682k0595
$$ 1076038 1051813 1026042 999104 971632 944232 917325 891140 865797 841522 818840 798245
61076G98245j8725j7759j7291j6104j3739j1185r579q707p389n118k699j229q46
$$ 798245 779520 761761 744470 728366 714627 703442 693863 685156 677767 672649 669950 668721 667875
61063F67875p40j51R27K049K953L672M175M394M627N441O869Q180Q901R602J1080
$$ 667875 667135 666984 667911 669960 672913 676585 680760 685154 689781 695222 702091 710271 719172 728774 739854
61048G39854J3078J4553J5119J5475J6422J8139K0501K3373K6341K8786L0482
$$ 739854 752932 767485 782604 798079 814501 832640 853141 876514 902855 931641 962123
61037I62123L1743L2826L3734L4661L6035L7854L9567M0958M2538M4761M7353
$$ 962123 993866 1026692 1060426 1095087 1131122 1168976 1208543 1249501 1292039 1336800 1384153
61026A384153M9811N2062N4187N5910N6871N7272N7856N9435O2618O7740P4823
$$ 1384153 1433964 1486026 1540213 1596123 1652994 1710266 1768122 1827557 1890175 1957915 2032738
61015B032738Q3710R4231J05997J18181J30216J42872J58252J78729K06481K43921
$$ 2032738 2116448 2210679 2316676 2434857 2565073 2707945 2866197 3044926 3251407 3495328
61005C495328K93631L57372M36075N31448O47501P90599R68672J190008J460396
$$ 3495328 3788959 4146331 4582406 5113854 5761355 6551954 7520626 8710634 10171030
60996A0171030J777262K119748K435574K633791K603264K267695J651196Q98227
$$ 10171030 11948292 14068040 16503614 19137405 21740669 24008364 25659560 26557787
60988B6557787K15896k25794l61836k31814N7998L63982N25062M05166m0218p23729
$$ 26557787 26773683 26547889 26186053 25954239 26012237 26376219 26901281 27306447 27266229 26542500
60978B6542500j460109k059587k412556k511466k415072k199326j928513j648174
$$ 26542500 25082391 23022804 20610248 18098782 15683710 13484384 11555871 9907697
60970I907697j386243j155589r58645p93285o56304n43870m51774l76598l16108
$$ 9907697 8521454 7365865 6407220 5613935 4957631 4413761 3961987 3585389 3269281
60961C269281k68237k30517k00762j77393j58645j42249j26678j12215r9878q9514
$$ 3269281 3001044 2770527 2569765 2392372 2233727 2091478 1964800 1852585 1752707 1663193
60951A663193p9657o9313n9191n0921m5447m2518m1312m0987m0658l9484l7266
$$ 1663193 1583536 1514223 1455032 1404111 1358664 1316146 1274834 1233847 1193189 1153705 1116439
60940A116439l4694l2572l0859k8932k6691k4833k3822k3173k2155k0745j9457
$$ 1116439 1081745 1049173 1018314 989382 962691 937858 914036 890863 868708 847963 828506
60929H28506j8528j7787j7041j6175j5070j3803j2738j1959j0944r344p753p012
$$ 828506 809978 792191 775150 758975 743905 730102 717364 705405 694461 685117 677364 670352
60917F70352o969o707o008n710o427p569q040p404o120m953m389m351m254l555
$$ 670352 663383 656676 650668 644958 638531 630962 622922 615518 609398 604445 600056 595705 591451 587896
60903E87896k344j174m51k62o21j344j778j306k18N04L53k05n40m58J4Q08J516
$$ 587896 585552 584378 583927 583665 583044 581700 579922 578616 578398 578902 579255 579050 578510 578052 578066 578874 580390
60886E80390J574J042O18O37P20P05J193K492L746L867L034K481L037M426N894
$$ 580390 581964 583006 583624 584261 584981 585686 586879 589371 593117 596984 600018 602499 605536 609962 615856
60871F15856O924P438P739Q268R079R740J0002J0275J1066J2215J3188J3912J4802
$$ 615856 622780 630218 637957 646225 655304 665044 675046 685321 696387 708602 721790 735702 750504
60858G50504J6059J7390J8413J8912J8876J8600J8560J8806J8763J8113J7555
$$ 750504 766563 783953 802366 821278 840154 858754 877314 896120 914883 932996 950551
60847I50551J7964J8947J9100J7725J5422J2863R927O482L121L42k443o191j0731
$$ 950551 968515 987462 1006562 1024287 1039709 1052572 1062499 1068981 1072102 1072444 1070001 1063810 1053079
60834A053079j4815j7614j9486k1100k2525k3468k3916k4060k3891k3361k2798
$$ 1053079 1038264 1020650 1001164 980064 957539 934071 910155 886095 862204 838843 816045
60823H16045k2636k2718k2300k0928j8987j7166j5743j4644j3920j3617j3306
$$ 816045 793409 770691 748391 727463 708476 691310 675567 660923 647003 633386 620080
60812F20080j2312j0612r060q418q424q108o903n170l741l142l264l516l272k344
$$ 620080 607768 597156 588096 579678 571254 563146 556243 551073 547332 544190 540926 537410 534138 531794
60798E31794j088m9M54M47J67p4n7J35J70k04q88j618k252k733k896k581j958
$$ 531794 530706 530657 531111 531558 531725 531651 531594 531729 531899 531695 530807 529189 526937 524204 521308 518727 516769
60781E16769j531j691k305k838k868k465k099k226k968m063n016n324m859m085
$$ 516769 515238 513547 511242 508404 505536 503071 500972 498746 495778 491715 486699 481375 476516 472431
60767D72431l728l998m397m433m214m062l881l435l060l316m005m197l477k510
$$ 472431 468703 464705 460308 455875 451661 447599 443718 440283 437223 433907 429902 425705 422228 419718
60753D19718k110k245k378k221j824j282p59m36j33O21J855K868L117K793K245
$$ 419718 417608 415363 412985 410764 408940 407658 406899 406463 406330 406951 408806 411674 414791 417584 419829
60738D19829J400L38k91j56L3m39j054q76j65L3l85n32k29k92r44j358j192j287
$$ 419829 421229 421567 421276 421120 421153 420714 419660 418784 418619 418652 418267 417735 417506 417214 416270 414912 413720 412433
60720D12433k089k679k359k038k860m227m579l689k804k740l074l283l516l917
$$ 412433 410344 407665 405306 403268 400408 396181 391602 387913 385109 382369 379295 376012 372496 368579
60706C68579m147l926l440k904k302j795j801k415l122l286k637j236M41J505
$$ 368579 364432 360506 357066 354162 351860 350065 348264 345849 342727 339441 336804 335568 336009 337514
60692C37514J361N55K39O88J063Q24M64M52M30Q6O8J072K607L612L931M212M602
$$ 337514 338875 339430 339669 340357 341420 342244 342708 343160 343590 343676 343744 344816 347423 351035 354966 359178 363780
60675C63780M635M293M142M318M300L943L816M167M406M016L265K545J793J038
$$ 363780 368415 372708 376850 381168 385468 389411 393227 397394 401800 405816 409081 411626 413419 414457
60661D14457Q27J363J930J892J772K417L526M069L871L700L817L606K853K291
$$ 414457 415284 416647 418577 420469 422241 424658 428184 432253 436124 439824 443641 447247 450100 452391
60647D52391K396K522J885O73m37j336k252k978l113k957l337m538n992p029p423
$$ 452391 454787 457309 459194 459867 459430 458094 455842 452864 449751 446794 443457 438919 432927 425898 418475
60632D18475p121o062m490l068k309k117k047j826j515j303j299j375j130k62
$$ 418475 411354 405292 400802 397734 395425 393308 391261 389435 387920 386617 385318 383943 382813 382551
60618C82551R38J693J510P01K6q6K04M92N33L79K64L80O22P02N43M78P33R22L79
$$ 382551 383489 385182 386692 387393 387419 387333 387537 388029 388562 388941 389205 389585 390207 390909 391452 391930 392663 393585 393964
60599C93964r11k051k111j097J69R81J324J597K000K347K318J830J179P66O79
$$ 393964 393053 391002 388891 387794 387963 388944 390268 391865 393865 396212 398530 400360 401539 402305 402984
60584D02984O08L20j9j59k30m94p40m62L18R39J127J533K806M572N994P002Q222
$$ 402984 403592 403912 403893 403734 403504 403010 402270 401808 402126 403065 404192 405725 408531 413103 419097 426099 434321
60567D34321R808J1160J1957J2685J3796J4898J5255J4641J3263J1093P898L826
$$ 434321 444129 455289 467246 479931 493727 508625 523880 538521 551784 562877 570775 574601
60555E74601l95l950o449p933q626q654p967o582m776k875r36J101K945M225N238
$$ 574601 574206 570256 563807 555874 547248 538594 530627 524045 519269 516394 515458 516559 519504 523729 528967
60540E28967O854R370J2037J4122J5890J7868J9635K0140J9049J6964J4285J0777
$$ 528967 535821 545191 557228 571350 587240 605108 624743 644883 663932 680896 695181 705958
60528G05958O379J774k289n651q333j0009j0350r657q642p735o946o321o066o115
$$ 705958 712337 714111 711822 706171 697838 687829 677479 667822 659180 651445 644499 638178 632112 625997
60514F25997n870m598k188N64K541L250L154K969K918K925L320M816P612J1020
$$ 625997 620127 615529 613341 613905 616446 619696 622850 625819 628737 631662 634982 639798 647410 658430
60500F58430J4259J7377K1023K5529L0508L5325L9729M3951M8273N2412N5361
$$ 658430 672689 690066 711089 736618 767126 802451 842180 886131 934404 986816 1042177
60489A042177N5926N3525M8387M1061L2004K1554R960k685j6089k9178m0302m8465
$$ 1042177 1098103 1151628 1200015 1241076 1273080 1294634 1304594 1301909 1285820 1256642 1216340 1167875
60477A167875n3950n7446n8896n7808n4417m9804m4916m0101l5601l1732k8364
$$ 1167875 1113925 1056479 997583 939775 885358 835554 790638 750537 714936 683204 654840
60466F54840k4902k1190j7867j5410j3378j1186r238q438q761r043q343o912n681
$$ 654840 629938 608748 590881 575471 562093 550907 541669 533231 524470 515427 507084 500172 494491
60453D94491n191n313n538n346m593l771l605m090m322l550k188j335j504k193
$$ 494491 489300 483987 478449 473103 468510 464739 461134 457044 452722 449172 446984 445649 444145 441952
60439D41952k684k761k587k191j385j71J004J485J053K69r4M4M8m18p85l72N51
$$ 441952 439268 436507 433920 431729 430344 430173 431177 432662 433715 433984 433890 433934 433982 433564 432779 432407 432958
60422D32958J073Q66N19O05R49R81M89k20n61r4J030J987K026J354Q22P16M90
$$ 432958 434031 434897 435416 436021 436970 437951 438440 438220 437659 437565 438595 440582 442608 443962 444784 445500 445990
60405D45990j83p13m52K97P14O03M45N35O53O49Q06J386K130K400J857R43N39
$$ 445990 445807 445094 444642 444939 445653 446256 446701 447236 447889 448538 449344 450730 452860 455260 457117 458060 458599
60388D58599J017J690J657J072R42J610K187K006J694K047K574K275J470J515
$$ 458599 459616 461306 462963 464035 464977 466587 468774 470780 472474 474521 477095 479370 480840 482355
60374D82355K693L629L194J919J018P94P47N67L52K16L08R00J849K309J637M39
$$ 482355 485048 488677 491871 493790 494808 495602 496349 496916 497268 497484 497792 498692 500541 502850 504487 504926
60358E04926N8R95K349K991K805K567K914L749M599N322O215P536R077J0385J1162
$$ 504926 504984 505979 508328 511319 514124 516691 519605 523354 527953 533275 539490 547026 556103 566488 577650
60343E77650J1177J0019P497M307J640j15j755l965o217p513p785p809p978p911
$$ 577650 588827 598846 606343 610650 612290 612175 610420 606455 600238 592725 584940 577131 569153 561242
60329E61242p275o278n205m062k934k186j971j980j966k150k710l243l155k429
$$ 561242 553967 547689 542484 538422 535488 533302 531331 529351 527385 525235 522525 519282 516127 513698
60315E13698j590r58l70M06J338K283L251M367N746P412R240J1071J3033J5585
$$ 513698 512108 511150 510780 511186 512524 514807 518058 522425 528171 535583 544823 555894 568927 584512
60301E84512J8895K2251K4535K5238K4623K2737J8901J2575M360m299j2101j8207
$$ 584512 603407 625658 650193 675431 700054 722791 741692 754267 758627 754328 742227 724020
60289G24020k2013k3322k2731k1261j9484j7450j5268j3200j1136q713o206m605
$$ 724020 702007 678685 655954 634693 615209 597759 582491 569291 558155 549442 543236 538631
60277E38631m446n031n264m795m003l300k938l060l405l264k322j238r23j397
$$ 538631 534185 529154 523890 519095 515092 511792 508854 505794 502389 499125 496803 495565 494642 493245
60263D93245j980k282k419k404k079j573j235j022n95K7M60O31Q22J043R88P22
$$ 493245 491265 488983 486564 484160 482081 480508 479273 478251 477656 477683 478143 478774 479596 480639 481627 482349
60247D82349P37J133J419J373J398J734J955J663J159Q84O91J64o06j050p79P8
$$ 482349 483086 484219 485638 487011 488409 490143 492098 493761 494920 495804 496495 496659 496053 495003 494224 494302
60231D94302J035J512J295Q85J081J990K836K945K457J822J142M70K33P58J703
$$ 494302 495337 496849 498144 499029 500110 502100 504936 507881 510338 512160 513302 513772 514005 514763 516466
60216E16466K434K734K733K517K262K396L091L905M403M760N219N446N111M742
$$ 516466 518900 521634 524367 526884 529146 531542 534633 538538 542941 547701 552920 558366 563477 568219
60202E68219N054N695N612M698M003M171M506M058K924J948J571J446R86L0r32
$$ 568219 573273 578968 584580 589278 593281 597452 601958 606016 608940 610888 612459 613905 614891 614921 613989
60187F13989j136m81P4n29k100l413l784l780m167m880n392n533n433n049m305
$$ 613989 612853 612372 612446 611917 609817 606404 602620 598840 594673 589793 584401 578868 573435 568386 564081
60172E64081l411k618j911j232p71o56o52n60n68q63j168j162j052j224j492j270
$$ 564081 560670 558052 556141 554909 554138 553482 552830 552270 551702 550839 549671 548509 547457 546233 544741 543471
60156E43471m52M12Q44Q98Q59R32J218J653J930J869J852K446L563M500M908N163
$$ 543471 543019 543431 544275 545173 546032 546964 548182 549835 551765 553634 555486 557932 561495 565995 570903 576066
60140E76066N511N517M813L961L972N016O194O566O013N050M180L559L064K501
$$ 576066 581577 587094 591907 595868 599840 604856 611050 617616 623629 628679 632859 636418 639482 641983
60126F41983J783R76Q6r73k084k760k555j617n50K20O62Q07O56M79P57J584K440
$$ 641983 643766 644742 644828 643855 641771 639011 636456 634839 634289 634509 635171 635978 636634 637113 637870 639454 641894
60109F41894K811K776K721K719K486J757N11j043k455l234l349l336l648m053
$$ 641894 644705 647481 650202 652921 655407 657164 657675 656632 654177 650943 647594 644258 640610 636557
60095F36557m063l703l432l366l067k138o95Q35K051K745L050L424M125M703M475
$$ 636557 632494 628791 625359 621993 618926 616788 616093 616928 618979 621724 624774 628198 632323 637026 641501
60080F41501L521K729K656K845K466J265l78j985l201l820l957m114m747n798
$$ 641501 645022 647751 650407 653252 655718 656983 656605 654620 651419 647599 643642 639528 634781 628983
60066F28983o871p630p947p841p512p296p309p263o804n940n037m475m444m841
$$ 628983 622112 614482 606535 598694 591182 583886 576577 569314 562510 556570 551533 547058 542614 537773
60052E37773n254n218m611l682k654j551m09O04J422K126K656K862K914L192L650
$$ 537773 532519 527301 522690 519008 516354 514803 514394 514998 516420 518546 521202 524064 526978 530170 533820
60037E33820L792L531L440L781L933L324K388J858J521N74r95k293k823l085l737
$$ 533820 537612 541143 544583 548364 552297 555621 558009 559867 561388 561962 560967 558674 555851 552766 549029
60022E49029m788n841o637p053p059o894o982p423p804p637o825n639m463l564
$$ 549029 544241 538400 531763 524710 517651 510757 503775 496352 488548 480911 474086 468447 463984 460420
60008D60420k865j975o77O15J213R66L86N4O9J68N6l25o87n99n2M74P04R94J643
$$ 460420 457555 455580 454903 455518 456731 457697 458083 458137 458206 458374 458430 458105 457418 456819 456767 457241 457945 458939 460582
59989D60582K195K136J861K147K815K960K493K354K866L061K172Q97L37M33L47
$$ 460582 462777 464913 466774 468921 471736 474696 477189 479543 482409 485470 487642 488539 488876 489309 489656
59974D89656j13m40m79o01r21j113j043r24p93m23J50O33J074J851K871L373K984
$$ 489656 489543 489103 488624 488023 487102 485989 484946 484022 483229 482806 482956 483589 484663 486514 489385 492758 495742
59957D95742K390K451K944K859J797N29j9K10O90J165J708K152K026J240L81O8
$$ 495742 498132 500583 503527 506386 508183 508712 508693 508903 509593 510758 512466 514618 516644 517884 518265 518333
59941E18333K07J65m82j588k642l165k990k460k177k375k642k486j989j607j522
$$ 518333 518540 518705 518223 516635 513993 510828 507838 505378 503201 500826 498184 495698 493709 492102 490580
59926D90580j512j402j168p52j42L56M14K44M59J282K337L236L967M534M726M522
$$ 490580 489068 487666 486498 485746 485604 485960 486374 486618 487077 488359 490696 493932 497899 502433 507159 511681
59910E11681M337M586N247O038O799P406P576P025N801M265K797J536L67q75k078
$$ 511681 516018 520604 525851 531889 538688 546094 553670 560695 566496 570761 573558 575094 575461 574586 572508
59895E72508k801k746k128j419q56m69l00j74N03K077L880M748M335L291K288
$$ 572508 569707 566961 564833 563414 562558 562089 561789 561615 562118 564195 568075 572823 577158 580449 582737
59880E82737J581J508K405L769M498M330M227M800N298M765L330J581n26l088
$$ 582737 584318 585826 588231 592000 596498 600828 605055 609855 615153 619918 623248 624829 624303 621215
59866F21215n265o064n774n467n403m975m078l240k402r42Q27J485M99o75l75
$$ 621215 615950 609886 604112 598645 593242 588267 584189 580949 578547 577605 578432 579917 580416 579741 579366
59851E79366J153K434K984L776N601P996R988J1164J1577J1131R525O753L343
$$ 579366 580519 582953 585937 589713 595314 603310 613298 624462 636039 647170 656695 663448 666791
59838F66791J99j758k011q77N80J342J152L29j060l241n909p937q477q053p919
$$ 666791 666990 665232 663221 662344 662924 664266 665418 665747 664687 661446 655537 647600 639123 631070 623151
59823F23151q468q867q381p328o445n862n179m254l430l081l208l432l268k527
$$ 623151 614683 605816 597435 590107 583662 577800 572621 568367 564937 561856 558648 555216 551948 549421
59809E49421j556q54m84j45J97K73J55L90J115J622J132k78j946l329m176m374
$$ 549421 547865 547011 546527 546382 546579 546852 547007 547397 548512 550134 551266 550988 549042 545713 541537 537163
59793E37163m182m148m419m450l882l230l141l383l288k852k627k758k838k634
$$ 537163 532981 528833 524414 519964 516082 512852 509711 506328 503040 500188 497561 494803 491965 489331
59779D89331k324k023j725j541j493j182l77L20J47n90q23k17M37M55N5k18j57
$$ 489331 487007 484984 483259 481718 480225 479043 478666 478986 479133 478543 477720 477503 477940 478395 478450 478232 478075
59762D78075L22J283K367K925K787K396K070J715J421J569K115K502K607K958
$$ 478075 478397 479680 482047 484972 487759 490155 492225 493940 495361 496930 499045 501547 504154 507112
59748E07112L671M018L623L233L540L950L471K398K029K855L987M409M039L373
$$ 507112 510783 514801 518424 521657 525197 529147 532618 535016 537045 539900 543887 548296 552335 555708
59734E55708K701J978J116J53o76r74n27L63J074J193P72J16l98m45JN20N98J67
$$ 555708 558409 560387 561503 561656 560980 560006 559479 559842 560916 562109 562881 562997 562599 562154 562155 562675 563273 563440
59716E63440l43m61j00M34P27O32M56N94R74J090P03K64L47R19J480J742J799
$$ 563440 563097 562636 562536 562970 563697 564329 564785 565379 566353 567443 568146 568410 568757 569676 571156 572898 574697
59699E74697J713J323N49k99o58j27J188K595L239K763J594M62j94l66k31l0j8
$$ 574697 576410 577733 578282 577983 577325 577198 578386 580981 584220 586983 588577 589039 588845 588479 588248 588218 588200
59682E88200k49n06o42q53j323j716j487p60m89j424l196m697n268n167m888m466
$$ 588200 587951 587445 586803 585950 584627 582911 581424 580664 580175 578751 575555 570858 565590 560423 555535 551069
59666E51069l695k778k257k305k450k132j308l20M96R36R46Q33J152K001K710
$$ 551069 547374 544596 542339 540034 537584 535452 534144 533824 534320 535256 536202 537035 538187 540188 542898
59651E42898K688K355K599L400L725K920J560O09K36j22q99j988k996l595l729
$$ 542898 545586 547941 550540 553940 557665 560585 562145 562754 562990 562868 561969 559981 556985 553390 549661
59636E49661l629l506l179k387j390q36r27j191j261j276j272q59k1L52n58k251
$$ 549661 546032 542526 539347 536960 535570 534734 533807 532616 531355 530079 528807 527948 527927 528279 527721 525470
59620E25470l330l059k006j210j261k066l092l727l707l178k332j221j13M56L70
$$ 525470 522140 519081 517075 515865 514604 512538 509446 505719 502012 498834 496502 495281 495168 495624 495994
59605D95994K90Q08J618K098K324K755L199K984K064J111N06K9l20j23N39Q00
$$ 495994 496284 497092 498710 500808 503132 505887 509086 512070 514134 515245 515751 515780 515460 515337 515876 516676
59589E16676J22r45j568j625j456j191q96q89j266j461r72k87m26j561k750l099
$$ 516676 516798 515853 514285 512660 511204 510013 509117 508228 506962 505501 504529 504242 503816 502255 499505 496406
59573D96406k668k063j577j081n48k99o31j346j846j721j118l89L99J250J726
$$ 496406 493738 491675 490098 489017 488469 488170 487539 486193 484347 482626 481508 481119 481518 482768 484494
59558D84494J274J88m30NP77R42O33O62J181J580J578J570J808K045K223K749
$$ 484494 485768 485956 485526 485531 486308 487250 487883 488545 489726 491306 492884 494454 496262 498307 500530 503279
59542E03279L792M911N840P018Q883J1178J3560J6320J9543K1805K0665J4922
$$ 503279 507071 511982 517822 524840 533723 544901 558461 574781 594324 616129 636794 651716
59530F51716N973l119r627j2389j1940r770p179m489j514J431L516M440M777N018
$$ 651716 657689 654570 644943 632554 620614 610844 603665 599176 597662 599093 602609 607049 611826 616844
59516F16844M835L784K165N99r00k728m766o345p136p544q056q670r087r112q747
$$ 616844 621679 625463 627628 628227 627327 624599 619833 613488 606352 598808 590752 582082 572995 563883 555136
59501E55136q123p473o876o076m869l612k977l041l119k614j665p39%N69P55K98
$$ 555136 547013 539540 532664 526588 521719 518107 515130 512089 508970 506356 504691 503952 503952 504521 505276 505574
59485E05574n72j205j134m66L36R19J243J505J930K633L664N009O389P226P116
$$ 505574 505002 503797 502663 502197 502533 503452 504695 506200 508130 510763 514427 519436 525825 533051 540167
59470E40167O319N470M799L996K910J914J357J065P30M88O37J032J225J210J556
$$ 540167 546486 551956 556755 560751 563661 565575 566932 567997 568727 569215 569852 570884 572109 573319 574875
59455E74875K758M745P073R290J1014J1945J2060J1693J1234J0697R734Q107O072
$$ 574875 577633 582378 589451 598741 609755 621700 633760 645453 656687 667384 677118 685225 691297
59442F91297M113K290O7l015o555r523j1216j1751j1591j0953r841q413p057o182
$$ 691297 695410 697700 697767 694752 688197 678674 667458 655707 644116 633163 623322 614909 607852 601670
59428F01670n971o121n838m412j955P08K994N041P101Q969J0432J1856J3772J6139
$$ 601670 595699 589578 583740 579328 577373 578081 581075 586116 593217 602186 612618 624474 638246 654385
59414F54385J8552K0992K3830K7073L0003L1467L0044K4252J3687L58j1821j9554
$$ 654385 672937 693929 717759 744832 774835 806302 836346 860598 874285 874643 862822 843268
59402H43268k2186k1055j7546j2244n691R63O156Q343O255n22j0639k0980k8204
$$ 843268 821082 800027 782481 770237 764546 765509 771665 780008 786263 785741 775102 754122 725918
59389G25918l0692k9143k5477k1392j7660j4311j1200q505o696n870n291m040
$$ 725918 695226 666083 640606 619214 601554 587243 576043 567538 560842 554972 549681 545641
59377E45641k130n07K78P87J704K696L013K783K836L386L835L976M394N292N875
$$ 545641 543511 543004 543282 544069 545773 548469 551482 554265 557101 560487 564322 568298 572692 577984 583859
59362E83859N545M952N077N763O025N639N543O552Q354J0001J0989J1566J2205
$$ 583859 589404 594356 599433 605196 611221 616860 622403 628955 637309 647310 658299 669865 682070
59349F82070J2960J3487J3673J4119J5589J7904J9898K0635K0267J9322J7802
$$ 682070 695030 708517 722190 736309 751898 769802 789700 810335 830602 849924 867726
59338H67726J5540J2996J0855R014O677L498l8l455o853j0428j3822j6346j7591
$$ 867726 883266 896262 907117 916131 922808 926306 926268 922813 915960 905532 891710 875364 857773
59325H57773j7708j7267j6929j6999j7211j6979j5962j4320j2553j1113r971q581
$$ 857773 840065 822798 805869 788870 771659 754680 738718 724398 711845 700732 690761 682180
59313F82180o590m620l789m189m489l508j598Q7J129J857K359K628L376N539Q880
$$ 682180 675590 670970 667181 662992 658503 654995 653397 653484 654613 656470 658829 661457 664833 670372 679252
59298F79252J2187J4913J7578K0249K1622K0137J5304P646j656j0577j6735j9060
$$ 679252 691439 706352 723930 744179 765801 785938 801242 808888 807232 796655 779920 760860
59286G60860j8658j7404j6121j4607j2827j1107r484p630n526l580k091r55J43
$$ 760860 742202 724798 708677 694070 681243 670136 660652 653022 647496 643916 641825 640870 641013
59273F41013J525L407N664P840R595J0994J2142J2794J2659J1823J0572Q989P078
$$ 641013 642538 645945 651609 659449 669044 680038 692180 704974 717633 729456 740028 749017 756095
59260G56095N065L143J088j457m368p041r026j0453j1791j3258j4418j4413j2849
$$ 756095 761160 764303 765391 763934 759566 752525 743499 733046 721255 707997 693579 679166 666317
59247F66317j0465q534p530o756n427l613j847l90O90J164R98Q16J464L150N360
$$ 666317 655852 647318 639788 633032 627605 623992 622145 621755 622445 623609 624607 625423 626887 630037 635397
59232F35397P338Q407Q132O780N343M539L972K738O47j658l703n543p161q158
$$ 635397 642735 651142 659274 666054 671397 675936 679908 682646 683293 681635 677932 672389 665228 657070
59218F57070q291p853p312o829o313n630m729l728k922k445k013j221r7R02J408
$$ 657070 648779 640926 633614 626785 620472 614842 610113 606385 603463 601018 599005 597784 597687 598589 599997
59203E99997J384J070R25J380K272K726K141J096P09J189J761J922K021K347K499
$$ 599997 601381 602451 603376 604756 607028 609754 611895 612991 613700 614889 616650 618572 620593 622940 625439
59188F25439K098J507J344J657K044K240K124J537O07rK22R40J275R82P28J152
$$ 625439 627537 629044 630388 632045 634089 636329 638453 639990 640597 640588 640810 641750 643025 644007 644735 645887
59172F45887K051K729K887K897L284M098M927N552O336P776R639J0945J0955R889
$$ 645887 647938 650667 653554 656451 659735 663833 668760 674312 680648 688424 698063 709008 719963 729852
59158G29852Q547P415O416N246L602J256j637m357o180p115p779q475q809q322
$$ 729852 738399 745814 752230 757476 761078 762334 760697 756340 750160 743045 735266 726791 717982 709660
59144G09660p209o154n782o334p541q554q384o846m953l950m046m423m324l793
$$ 709660 702451 696297 690515 684181 676640 668086 659702 652856 647903 643953 639907 635484 631160 627367
59130F27367l294l089l142l263l215k867k358j883j287k60J137K494L739N199
$$ 627367 624073 620984 617842 614579 611364 608497 606139 604256 602969 602709 603846 606340 610079 615278
59116F15278O735P526P262O955P735R174R753Q901P627O962O723O222N423M752
$$ 615278 622013 629539 636801 643756 651491 660665 670418 679319 686946 693908 700631 706853 712276 717028
59102G17028M249L617K812K029J206J00j181k101k272j865j463j601k340l133
$$ 717028 721277 724894 727706 729735 730941 731041 729860 727759 725487 723622 722159 720558 718218 715085
59088G15085l291k697j927j549j564j733k062k654l339l915m568n576o679p213
$$ 715085 711794 709097 707170 705621 704057 702324 700262 697608 694269 690354 685786 680210 673531 666318
59074F66318o928o311n954n907n772n269m540l978l808l876l835l555l249l158
$$ 666318 659390 653079 647125 641218 635446 630177 625637 621659 617851 613975 610140 606585 603336 600178
59060F00178l311l563l699l425k592j575j023j068j130p98m52n71r15r02n80m72
$$ 600178 596867 593304 589605 586180 583588 582013 580990 579922 578792 577994 577542 576971 576056 575154 574574 574102
59044E74102o71p09l91p5o0k07l03k87q7K93M28j04r24j056k83M34K87j24M76
$$ 574102 573431 572722 572331 572256 572196 571989 571686 571399 571312 571605 572033 571929 571005 569949 569666 570100 570387 570263 570739
59025E70739K412M783O598P584P953P981P981Q278Q918R525R566Q731P156N397
$$ 570739 573151 577934 584532 592116 600069 608050 616031 624309 633227 642752 652318 661049 668205 673602
59011F73602M099L397K725J384n80k281k855k306j455j017q53j72J513L737N502
$$ 673602 677701 681098 683823 685207 684627 682346 679491 677185 675730 674713 673860 673688 675201 678938 684440
58996F84440O348O681O993P105O486N186L992L501L445L059K015O95l99j226k143
$$ 684440 690788 697469 704462 711567 718053 723239 727231 730732 734177 737236 739251 739946 739547 738321 736178
58981G36178l350m535n107m773l853k910k065q93Q51K629L639L895M348N745P768
$$ 736178 732828 728293 723186 718413 714560 711650 709585 708692 709543 712172 715811 719706 724054 729799 737567
58966G37567R629J1049J2246J3190J3595J3575J3650J3932J3845J2894J1226R172
$$ 737567 747196 758245 770491 783681 797276 810851 824501 838433 852278 865172 876398 885570
58954H85570O641L397l73m160p576j0431j2629j4260j5545j6466j6727j6320j5710
$$ 885570 892211 895608 895235 891075 883499 873068 860439 846179 830634 814168 797441 781121 765411
58941G65411j5113j4007j1939r475p764p291p577p900p798p075n884m737l855
$$ 765411 750298 736291 724352 714877 707113 699822 692245 684345 676547 669472 663588 658851 654996
58928F54996k753j071M35O11m16j265j148p54r66j601k005k108k170k055j474
$$ 654996 652243 651172 651607 652218 651802 650537 649389 648635 647669 646068 644063 641955 639785 637730 636256
58913F36256o26N9N67J159J767K124K286K583L135L915N116O956R145J1037J2291
$$ 636256 635630 635689 636256 637415 639182 641306 643592 646175 649310 653225 658341 665297 674442 685479 697770
58898F97770J3051J3495J3600J3375J2952J2423J1903J1785J2522J4073J5885
$$ 697770 710821 724316 737916 751291 764243 776666 788569 800354 812876 826949 842834
58887H42834J7574J9350K1572K4013K5836K6308K5405K3639K1307J8111J3728
$$ 842834 860408 879758 901330 925343 951179 977487 1002892 1026531 1047838 1065949 1079677
58876A079677Q651M009L25l095p179j1780j5835j8702k0683k2179k2918k2365
$$ 1079677 1088328 1092337 1092662 1089567 1082388 1070608 1054773 1036071 1015388 993209 970291 947926
58864I47926k0557j8136j5708j3530j1738j0572j0208j0510j1057j1441j1513
$$ 947926 927369 909233 893525 879995 868257 857685 847477 836967 825910 814469 802956
58853H02956j1378j1195j1044j0921j0755j0402r773r009q389p980p581p171p078
$$ 802956 791578 780383 769339 758418 747663 737261 727488 718479 710090 702110 694529 687358 680280
58840F80280p386p466o652n297m559m941n656n786n478n404n530n163m138l116
$$ 680280 672894 665428 658776 653479 648920 643979 638323 632537 627059 621655 616125 610962 606824 603708
58826F03708k596k364k138k124k390k297j195O22K292L489M477N250N443N159
$$ 603708 601112 598748 596610 594486 592096 589799 588604 589226 591518 595007 599484 604734 610177 615336
58812F15336N018N111M709L489K343K202K614K344J179J36j82m24j305k355k606
$$ 615336 620354 625465 630174 633663 636006 638208 640822 643166 644345 644481 644299 643875 642570 640215 637609
58797F37609k064j721k210l139l902m482n099n450m936l604k326j825j855j621
$$ 637609 635545 633824 631614 628475 624573 620091 614992 609542 604606 601002 598676 596851 594996 593375
58783E93375p90K63J144J899K737L567M060M017L596L208L167L265K827J474l05
$$ 593375 592585 592848 593992 595891 598628 602195 606255 610272 613868 617076 620243 623508 626335 627809 627504
58768F27504j706k695l972n659o756o372m962l785l437l476l386l217l216l306
$$ 627504 625798 623103 619131 613472 606716 600344 595382 591597 588160 584684 581298 578081 574865 571559
58754E71559l068k060k26J797L019L091K744K889L461L667L217K702K769L467
$$ 571559 568491 566431 566205 568002 571021 574112 576856 579745 583206 586873 590090 592792 595561 599028
58740E99028M518N738O971P930Q273P743O374M805M118M851O241O966O564N640
$$ 599028 603546 609284 616255 624185 632458 640201 646575 651380 655498 660349 666590 673556 680120 685760
58726F85760M864M383M229M493M861M672L803L014L051L810M607M988N005N051
$$ 685760 690624 695007 699236 703729 708590 713262 717065 720079 723130 726940 731547 736535 741540 746591
58712G46591N571O634P663P965P556O995O349M977K545l07k709m524o203q147
$$ 746591 752162 758796 766459 774424 781980 788975 795324 800301 802846 802539 799830 795306 789103 780956
58698G80956j0523j3318j6146j8231j9032j8698j7776j6695j5635j4520j3007
$$ 780956 770433 757115 740969 722738 703706 685008 667232 650537 634902 620382 607375
58687F07375j0892q685p275o842o594n872m952m443m444m665m889m843m102k675
$$ 607375 596483 587798 580523 573681 567087 561215 556263 551820 547376 542711 537822 532979 528877 526202
58673E26202j267n35l45j79J58O78J602L015M577N985P420Q977J0129J0336R779
$$ 526202 524935 524400 524055 523876 524034 524712 526314 529329 533906 539891 547311 556288 566417 576753 586532
58658E86532Q904P588N503K957O34j295l064m498n150n075m784m432l789k983
$$ 586532 595436 603024 608527 611484 612118 610823 607759 603261 598111 593036 588252 583820 580031 577048
58644E77048k520k524k604k526k439k351j988j300n31K41J069J653J571J078R92
$$ 577048 574528 572004 569400 566874 564435 562084 560096 558796 558265 558506 559575 561228 562799 563877 564869
58629E64869J482J739J109K1p02q52p69o30l31K00J013K269M001N829P223P961
$$ 564869 566351 568090 569199 569220 568518 567666 566897 566267 565936 566136 567149 569418 573419 579248 586471 594432
58613E94432Q184Q141Q044Q020P946P467O317M621K687P24j119k531l156k983
$$ 594432 602616 610757 618801 626821 634767 642234 648551 653172 655859 656583 655464 652933 649777 646794
58599F46794k483k251k486k901l138l192l265l322l058k401j741j381r31L01K376
$$ 646794 644311 642060 639574 636673 633535 630343 627078 623756 620698 618297 616556 615175 614244 614545 616921
58584F16921M514N949O759P670R085J0554J1278J1075J0565J0244R661P998N451
$$ 616921 621435 627384 634143 641813 650898 661452 672730 683805 694370 704614 714275 722273 727724
58571G27724L431L088M045N030N516O176P839J0456J3235J5520J7292J8909K0517
$$ 727724 731155 734243 738288 743318 748834 755010 762849 773305 786540 802060 819352 838261 858778
58558H58778K1876K2686K2843K2166K0201J6815J2737Q868N148Q98l591o796p768
$$ 858778 880654 903340 926183 948349 968550 985365 998102 1006970 1012118 1013016 1009425 1002629 994861
58545I94861p357p008o983o582n675n038n402o882r249j2137j4952j7133j8501
$$ 994861 987504 980496 973513 966931 961256 956218 950816 943934 934685 922548 907596 890463 871962
58532H71962j9060j8671j7336j5500j3614j1661r542p546n845m013j681O58K262
$$ 871962 852902 834231 816895 801395 787781 776120 766578 759032 753187 749174 747493 748151 750413
58519G50413L232M130M840M719L806K900K384J893J200N94K00k80r67j617k186
$$ 750413 753645 757775 762615 767334 771140 774040 776424 778317 779517 780111 780311 780031 779064 777447 775261
58504G75261k909l646l895l621l426l651l945l932l693l399l108l029l372l714
$$ 775261 772352 768706 764811 761190 757764 754113 750168 746236 742543 739144 736036 733007 729635 725921
58490G25921l262k031r97p35o13J71J431K467L187M097N481P128Q716J0001J0818
$$ 725921 722659 720628 719631 718896 718283 718454 719885 722352 725539 729636 735117 742245 750961 760962 771780
58475G71780J1279J1785J2500J2923J2285J0322P409M142J005j621l487m666n575
$$ 771780 783059 794844 807344 820267 832552 842874 850283 854425 855430 853809 850322 845656 840081
58462H40081o645p823q425p692n580k877m57J387K858M307O105Q396J0646J1862
$$ 840081 833436 825613 817188 809496 803916 801039 800582 801969 804827 809134 815239 823635 834281 846143
58448H46143J1582J0285Q470N949K557j084m168o593q471r322q710p245n906m666
$$ 846143 857725 868010 876480 882429 884986 883902 879734 873141 864670 855348 846638 839393 833487 828821
58434H28821k875p48P74J550K385L564M373M394M170M296M865O041Q136J0699
$$ 828821 825946 825198 825972 827522 829907 833471 837844 842238 846408 850704 855569 861610 869746 880445
58420H80445J2441J2580J1512R836P627M981K440L05j689l615m968n526n848o406
$$ 880445 892886 905466 916978 926814 934441 939422 941862 942167 940478 936863 931895 926369 920521 914115
58406I14115o873o770o313o096o335o809p079o618n102k865o57J135K599L709
$$ 914115 907242 900472 894159 888063 881728 874919 867840 861222 856120 853255 852598 853733 856332 860041
58392H60041M260M401M526M607M303L756L470L452L333L260L775M757N476N686
$$ 860041 864301 868702 873228 877835 882138 885894 889364 892816 896149 899409 903184 907941 913417 919103
58378I19103N616N057L662K221K118L310M273M305M332N002N569N445N331N887
$$ 919103 924719 929776 933438 935659 937777 941087 945360 949665 953997 958999 964568 970013 975344 981231
58364I81231O597O997P741R374J1113J2025J2447J3120J3775J3693J3000J2272
$$ 981231 987828 994825 1002566 1011940 1023053 1035078 1047525 1060645 1074420 1088113 1101113 1113385
58352A113385J1465J0126Q282O359M691L650L605M188M441M220M637O391Q596
$$ 1113385 1124850 1134976 1143258 1149617 1154308 1157958 1161563 1165751 1170192 1174412 1179049 1185440 1194036
58339A194036R899J0038R644R377R841J1446J3661J5274J5932J6461J7283J7715
$$ 1194036 1203935 1213973 1223617 1232994 1242835 1254281 1267942 1283216 1299148 1315609 1332892 1350607
58327A350607J7407J7037J6863J5948J3779J1273R263P359N302M023M120M713
$$ 1350607 1368014 1385051 1401914 1417862 1431641 1442914 1452177 1459536 1464838 1468861 1472981 1477694
58315A477694M968N461O711P794P906P937Q932J0194J0622J0807J2041J4158J6061
$$ 1477694 1482662 1488123 1494834 1502628 1510534 1518471 1527403 1537597 1548219 1559026 1571067 1585225 1601286
58302A601286J7539J8958J9996K0256K0400K1117K1788K1591K1052K1041K1154
$$ 1601286 1618825 1637783 1657779 1678035 1698435 1719552 1741340 1762931 1783983 1805024 1826178
58291A826178K0718K0438K1408K3295K5047K6515K7942K8780K8668K8578K9413
$$ 1826178 1846896 1867334 1888742 1912037 1937084 1963599 1991541 2020321 2048989 2077567 2106980
58280B106980L0498L1046L1903L4041L6504L7831L8442L9642M1313M2623M3956
$$ 2106980 2137478 2168524 2200427 2234468 2270972 2308803 2347245 2386887 2428200 2470823 2514779
58269B514779M6037M8146M9420N0915N4160N8570O2455O5628O8829P1613P3180
$$ 2514779 2560816 2608962 2658382 2709297 2763457 2822027 2884482 2950110 3018939 3090552 3163732
58258C163732P4369P6455P8860Q0296Q1078Q2005Q2278Q1126Q0213Q1641Q4753
$$ 3163732 3238101 3314556 3393416 3473712 3554790 3636795 3719073 3800199 3880412 3962053 4046806
58247D046806Q7805R1449R7349J04533J10624J15902J22691J31361J40291J49135
$$ 4046806 4134611 4226060 4323409 4427942 4538566 4654468 4777159 4908520 5048811 5197946
58237E197946J58802J68814J77978J87149J98066K10169K21770K33515K47461
$$ 5197946 5356748 5525562 5703540 5890689 6088755 6298924 6520694 6754209 7001670
58228G001670K63670K80968K99845L21205L43830L66694L91957M21803M54516
$$ 7001670 7265340 7546308 7846153 8167358 8511188 8877882 9269839 9691642 10146158
58219A0146158M88108N25187N69112O18000O68619P23677P88639Q63642R45855
$$ 10146158 10634266 11159453 11728565 12346565 13015184 13738861 14527500 15391142 16336997
58210A6336997J037827J145755J271300J413453J576911J770113J996910K259683
$$ 16336997 17374824 18520579 19791879 21205332 22782243 24552356 26549266 28808949
58202B8808949K568982K940279L384102L911703M549188N334173O302030P490830
$$ 28808949 31377931 34318210 37702312 41614015 46163203 51497376 57799406 65290236
58194F5290236Q957888J0776043J3018200J5761620J9088521K3032995K7501554
$$ 65290236 74248124 85024167 98042367 113803987 132892508 155925503 183427057
58187A83427057L2228531L6710024M0019699M0677154L7001851K8081297J4728061
$$ 183427057 215655588 252365612 292385311 333062465 370064316 398145613 412873674
58180D12873674m99989j4441870k4821977l1007277l3689083l4018421l2925194
$$ 412873674 412373685 397931815 373109838 342102561 308413478 274395057 241469863
58173B41469863l0932234k8311955k5288893k2114489j9023250j6173441j3641836
$$ 241469863 210537629 182225674 156936781 134822292 115799042 99625601 85983765
58166H5983765j1454907r608733q072459o799645n747295m881079m167506l573630
$$ 85983765 74528858 64920125 56847666 50048021 44300726 39419647 35252141 31678511
58158C1678511l075637k659107k310374k015071j764635j555863j382978j236766
$$ 31678511 28602874 25943767 23633393 21618322 19853687 18297824 16914846 15678080
58150A5678080j111688j006952r19667q43082p72573p07725o47839n90745n36719
$$ 15678080 14566392 13559440 12639773 11796691 11024118 10316393 9668554 9077809 8541090
58141H541090m88370m45595m05326l66856l32990l05263k82447k64238k51782
$$ 8541090 8052720 7607125 7201799 6834943 6501953 6196690 5914243 5650005 5398223
58132E398223k43633k35532k25343k14515k03900j92095j78892j66521j56179
$$ 5398223 5154590 4919058 4693715 4479200 4275300 4083205 3904313 3737792 3581613
58123C581613j46584j37023j28603j21549j14406j06966j01009r7080r3342q8557
$$ 3581613 3435029 3298006 3169403 3047854 2933448 2826482 2725473 2628393 2535051 2446494
58113B446494q3598p9200p4865p0692o7634o5180o1511n6719n3111n1467m9751
$$ 2446494 2362896 2283696 2208831 2138139 2070505 2005325 1943814 1887095 1833984 1782517 1732766
58102A732766m6557m3234m1287m0193l8957l7664l6236l3808l0607k8448k8159
$$ 1732766 1686209 1642975 1601688 1561495 1522538 1484874 1448638 1414830 1384223 1355775 1327616
58091A327616k8283k7451k6244k5621k5245k4520k3749k3163k2257k0972k0183
$$ 1327616 1299333 1271882 1245638 1220017 1194772 1170252 1146503 1123340 1101083 1080111 1059928
58080A059928k0203k0259k0013k0092k0511k0273j9247j8644j8827j8436j6775
$$ 1059928 1039725 1019466 999453 979361 958850 938577 919330 900686 881859 863423 846648
58069H46648j5250j5201j5801j5522j4349j3200j2149j0723r224q472q632r132
$$ 846648 831398 816197 800396 784874 770525 757325 745176 734453 725229 716757 708125 698993
58057F98993r499r679r881j0404j1203j1667j1417j1106j1397j1500j0092p548
$$ 698993 689494 679815 669934 659530 648327 636660 625243 614137 602740 591240 581148 573600
58045E73600n709n294n251m970n289o599p666p334o144n281n082n296n772o085
$$ 573600 567891 562597 557346 552376 547087 540488 532822 525488 519344 514063 508981 503685 497913 491828
58031D91828n608m699m757o302q080q778q696q836r273r339q708p559o207n087
$$ 491828 486220 481521 476764 470462 462382 453604 444908 436072 426799 417460 408752 401193 394986 389899
58017C89899m564m336l710k696k054k054k152k087k269k784l081l017l111l484
$$ 389899 385335 380999 377289 374593 372539 370485 368333 366246 363977 361193 358112 355095 351984 348500
58003C48500l583l290l088k785j457Q32K594K833K270K045K400L156M189M738
$$ 348500 344917 341627 338539 335754 334297 335129 337723 340556 342826 344871 347271 350427 354616 359354
57989C59354L598Q75j627k595k659k854k942k284j305r54j422k271l126l608l432
$$ 359354 362952 363827 362200 359605 356946 354092 351150 348866 347561 346607 345185 342914 339788 336180 332748
57974C32748l109l471m063l374j326M8n72j764j530j25P55N17j65q22j223o81
$$ 332748 329639 326168 322105 318731 317405 317453 316881 315117 313587 313462 314217 314734 314569 313747 312524 311843
57958C11843J109K970L385K386J147J96p63j755k508l176l838l748k190J42J810
$$ 311843 312952 315922 319307 321693 322840 323036 322273 320518 318010 314834 310996 307248 305058 305200 307010
57943C07010K426K776L427M259N178O258P266P833Q044Q223Q507R056J0128J1282
$$ 307010 309436 312212 315639 319898 325076 331334 338600 346433 354477 362700 371207 380263 390391 401673
57929D01673J1279R549P105N097L293R68j553l491m992o633q101q770r058r810
$$ 401673 412952 422501 429606 434703 437996 438964 437411 433920 428928 422295 414194 405424 396366 386556
57915C86556j0768j0974j0414r827r243q141o806o065n808n166m041l080k316
$$ 386556 375788 364814 354400 344573 335330 327189 320383 314318 308510 303344 299303 296223 293907
57902B93907j293m15n47j291j328o36o27j744k666k432j662r43L53K498M140L965
$$ 293907 292614 292199 291652 290361 289033 288397 287770 286026 283360 280928 279266 278323 278676 281174 285314 289279
57886B89279K656J921K245K765K894K854K837K610K003J086j21j614l166m439
$$ 289279 291935 293856 296101 298866 301760 304614 307451 310061 312064 313150 313029 311415 308249 303810
57872C03810n341n954o311o407o273n911n379m932m739m478l676k505j712j582
$$ 303810 298469 292515 286204 279797 273524 267613 262234 257302 252563 248085 244409 241904 240192 238610
57858B38610j464o78O27J749K257K218J923J682J693J994K559L334L961L786K600
$$ 238610 237146 236468 237095 238844 241101 243319 245242 246924 248617 250611 253170 256504 260465 264251 266851
57843B66851J227O95R55J061N83K4k77p36j658k543k722k230j565j056q07q63
$$ 266851 268078 268773 269728 270789 271372 271396 271119 270383 268725 266182 263460 261230 259665 258609 257802 256939
57827B56939j024q66k46N05J130J727K269K420K233K499L799N534O485O186N269
$$ 256939 255915 255049 254803 255308 256438 258165 260434 262854 265087 267586 271385 276919 283404 289590 294859
57812B94859M571M323M149L481J894o29l538n979p283p364o687n888n251m644
$$ 294859 299430 303753 307902 311383 313277 312648 309110 303131 295848 288484 281797 275909 270658 266014
57798B66014l949l422l295l303l021k596k576k970l061k429j594j320j625j928
$$ 266014 262065 258643 255348 252045 249024 246428 243852 240882 237821 235392 233798 232478 230853 228925
57784B28925j860j502r69k29O90J648K563L428M152M593M812N090N603O133O277
$$ 228925 227065 225563 224594 224365 225055 226703 229266 232694 236846 241439 246251 251341 256944 263077 269354
57769B69354N871N171M532M006L333K345J164k7j239k555l882m939n429n214m486
$$ 269354 275225 280396 284928 288934 292267 294612 295776 295749 294510 291955 288073 283134 277705 272491 268005
57754B68005l755l484l602l659l421l002k422j571o74k70l93m66l19o65j915l247
$$ 268005 264250 260766 257164 253505 250084 247082 244660 243089 242415 242145 241752 241286 240967 240302 238387 235140
57738B35140l653l365l285l393k902j838j275j765k546k671k111j349o09M8M30
$$ 235140 231487 228122 224837 221444 218542 216704 215429 213664 211118 208447 206336 204987 204378 204426 204856
57723B04856M80M74O05O95N24J61k65o87r04o73k28k09r03j868k512k668k467
$$ 204856 205336 205810 206415 207110 207634 207795 207530 206843 205939 205266 205038 204829 203926 202058 199546 196878 194411
57706A94411k116j993k476l381l929l560k539j522q61n20l32j26J31J77k78r85
$$ 194411 192295 190302 187826 184445 180516 176956 174417 172895 172034 171514 171182 171056 171187 171364 171086 170101
57690A70101j211n87L55P87M85n3k31P0N06Q13J208K177L784N556P215R108J1579
$$ 170101 168890 168303 168658 169445 169930 169877 169646 169716 170222 171035 172243 174420 178204 183760 190975 200083 211662
57673B11662J4484J7811K2271K8419L5642M2958N0410N8384O5457O8174O3348
$$ 211662 226146 243957 266228 294647 330289 373247 423657 482041 547498 615672 679020
57662F79020M9976K9154L636k2092m2935n5787o0801n9886n4863m7514l9997l3781
$$ 679020 728996 758150 761786 739694 696759 640972 580171 520285 465422 417908 377911 344130
57650C44130k8642k3659j8882j5172j2840j1325j0022q648p058n335l889k923
$$ 344130 315488 291829 272947 257775 244935 233610 223588 214940 207882 202547 198658 195735
57638A95735k055j029l09l52o17k29P24J313J090M65j52p51j285j551j636j803
$$ 195735 193680 192651 192342 191990 191373 191144 191868 193181 194271 194736 194584 193833 192548 190997 189361 187558
57622A87558j876j387m51R5l29j392k416l095l459l534l267k679j885j118o83
$$ 187558 185682 184295 183844 183939 183610 182218 179802 176707 173248 169714 166447 163768 161883 160765 160082
57607A60082o78q06o99l65o1J47L90N70M01j31o04o66m89n84j255k271l031l113
$$ 160082 159404 158598 157899 157534 157473 157620 158010 158580 158981 158850 158246 157580 157091 156507 155252 152981 149950 146837
57589A46837k652k097j636j191r33j268k039k267j234M67J519J322L81n95j351
$$ 146837 144185 142088 140452 139261 138328 137060 135021 132754 131520 131987 133506 134828 135209 134614 133263
57574A33263j875k144k275k470k598k169j009K22N03m74j878k487j945j051p24
$$ 133263 131388 129244 126969 124499 121901 119732 118723 118945 119448 118974 117096 114609 112664 111613 110889
57559A10889q60o61J28Q78J056Q82P55O64N33O26J017J204Q73N11O14O91L2r11
$$ 110889 110029 109368 109496 110374 111430 112312 113067 113731 114264 114890 115907 117111 117984 118495 119109 119800 119832 118921
57541A18921r08K43J326J396Q97P39R80J067P77L72K5k90m71k86K81Q70J048O02
$$ 118921 118013 118256 119582 120978 121875 122614 123594 124661 125438 125810 125835 125545 125074 124788 125069 125939 126987 127589
57523A27589k99j218j697j592j090m61J36O21R74J337J940K813L621L893L447
$$ 127589 127290 126072 124375 122783 121693 121232 121368 121989 122963 124300 126240 129053 132674 136567 140014
57508A40014K530J575Q91N58N47O87N93j10j283k165k113j393q71j041j679k355
$$ 140014 142544 144119 145010 145568 146115 146802 147395 147285 146002 143837 141724 140331 139460 138419 136740 134385
57492A34385k792k715k000j123q93j458k114k282k132j901j312k23P82J118J113
$$ 134385 131593 128878 126878 125755 124862 123404 121290 119008 116876 114975 113663 113440 114222 115340 116453
57477A16453J523K379K970K773J807L18j198j975j629q24n49q64r89o07k96m91
$$ 116453 117976 120355 123325 126098 127905 128223 127025 125050 123421 122597 122048 121184 120195 119588 119292 118801
57461A18801p79n67%K64p1o11p30k27N40J063J202J092P32M8o49q55p15r68j645
$$ 118801 118022 117455 117455 117719 117648 117037 116307 116080 116620 117683 118885 119977 120709 120757 120108 119253 118538 117570 115925
57442A15925j682m62R88J269N90L10Q91J408J133M45jn1K07O54Q66M25l20n24
$$ 115925 114243 113781 114769 116038 116628 116938 117829 119237 120370 120815 120814 120763 120970 121624 122490 122915 122595 122071
57424A22071m8L62K83J71M03O52O44P03J042J140M91n32j111q93n7J031J804J617
$$ 122071 122023 122385 122668 122839 123242 123894 124538 125241 126283 127423 127914 127382 126271 125378 125321 126352 128156 129773
57406A29773M76o41p96j84K12j07p09r19n72o3J40np2K48O67O97N20Q78K003L139
$$ 129773 130249 129608 128812 128628 128840 128733 128024 127105 126533 126470 126610 126605 126533 126781 127448 128145 128665 129543 131546 134685
57386A34685L449K945K243J782J603J597J599J415J042P17O00O26O67O13K95l01
$$ 134685 138134 141079 143322 145104 146707 148304 149903 151318 152360 153077 153677 154303 154970 155583 155878 155577
57370A55577p51o48l38n89j410j824j119K37J278J585J286O42K9j20J18J20l43
$$ 155577 154826 154178 153840 153251 151841 150017 148898 149135 150413 151998 153284 153926 153955 153835 153953 154073 153730
57353A53730n99JJ093J841K037K046J979J592Q79J55l38m35J34J320K360K403
$$ 153730 153131 153132 154225 156066 158103 160149 162128 163720 164599 164754 164416 163981 164115 165435 167795 170198
57337A70198J532O54L65M23M02L10M03P56J246J712K018K042J756J262Q04O67
$$ 170198 171730 172384 172749 173172 173574 173884 174287 175043 176289 178001 180019 182061 183817 185079 185883 186550
57321A86550R02J072O19l72j074q45O5R54J461J584J284O67K75O09J403J844J589
$$ 186550 187452 188524 189143 188771 187697 186852 186917 187871 189332 190916 192200 192867 193142 193751 195154 196998 198587
57304A98587J059P61Q03J121J716K440K942L112L280L706M098L976L435L180L705
$$ 198587 199646 200407 201210 202331 204047 206487 209429 212541 215821 219527 223625 227601 231036 234216 237921
57289B37921M657N240N149M834M846N223N706O223O834P376P584P532P545P685
$$ 237921 242578 247818 252967 257801 262647 267870 273576 279799 286633 294009 301593 309125 316670 324355
57275C24355P692P461P103O580N790N052M936N326N290M277K917K124J930J777
$$ 324355 332047 339508 346611 353191 358981 364033 368969 374295 379585 383862 386779 388903 390833 392610
57261C92610J619J951K817L444L139K161J481J822L008M253N030N550O268P098
$$ 392610 394229 396180 398997 402441 405580 407741 409222 411044 414052 418305 423335 428885 435153 442251
57247D42251P555P575P631P952Q189Q188Q431R239J0076J0168R543Q891Q668Q878
$$ 442251 449806 457381 465012 472964 481153 489341 497772 507011 517087 527255 536798 545689 554357 563235
57233E63235R489J0521J1743J2789J3479J3806J3736J3439J3392J3895J4608J5052
$$ 563235 572724 583245 594988 607777 621256 635062 648798 662237 675629 689524 704132 719184
57221G19184J5328J5865J6629J7128J7239J7421J8070J9013J9756J9984J9795
$$ 719184 734512 750377 767006 784134 801373 818794 836864 855877 875633 895617 915412
57210I15412J9671K0140K1262K2520K3383K3818K4026K4019K3794K3678K4028
$$ 915412 935083 955223 976485 999005 1022388 1046206 1070232 1094251 1118045 1141723 1165751
57199A165751K4708K5236K5409K5404K5417K5521K5779K6162K6495K6795K7419
$$ 1165751 1190459 1215695 1241104 1266508 1291925 1317446 1343225 1369387 1395882 1422677 1450096
57188A450096K8576K9869L0754L1255L1769L2349L2665L2561L2184L1608L0870
$$ 1450096 1478672 1508541 1539295 1570550 1602319 1634668 1667333 1699894 1732078 1763686 1794556
57177A794556L0288L0311L0941L1730L2365L2899L3394L3744L3903L4000L4093
$$ 1794556 1824844 1855155 1886096 1917826 1950191 1983090 2016484 2050228 2084131 2118131 2152224
57166B152224L4060L3710L2940L1868L0927L0603L0879L1236L1416L1735L2324
$$ 2152224 2186284 2219994 2252934 2284802 2315729 2346332 2377211 2408447 2439863 2471598 2503922
57155B503922L2565L1947L1102L1115L1963L2455L1835L0743L0302L0784L1471
$$ 2503922 2536487 2568434 2599536 2630651 2662614 2695069 2726904 2757647 2787949 2818733 2850204
57144B850204L1555L0920L0128K9698K9428K8611K7066K5512K4743K4829K5524
$$ 2850204 2881759 2912679 2942807 2972505 3001933 3030544 3057610 3083122 3107865 3132694 3158218
57133C158218K6869K8852L0951L2815L5001L8254M2207M5732M8417N0849N3523
$$ 3158218 3185087 3213939 3244890 3277705 3312706 3350960 3393167 3438899 3487316 3538165 3591688
57122C591688N6396N9559O3385O7841P2394P6938Q2022Q7992R4643J02039J10936
$$ 3591688 3648084 3707643 3771028 3838869 3911263 3988201 4070223 4158215 4252858 4354897 4465833
57111D465833J21951J34848J49085J64744J82738K04542K31823K65877L07199
$$ 4465833 4587784 4722632 4871717 5036461 5219199 5423741 5655564 5921441 6228640
57102F228640L56152M14312M84868N71694O78581Q09517R68988J161557J391169
$$ 6228640 6584792 6999104 7483972 8055666 8734247 9543764 10512752 11674309 13065478
57093A3065478J660508J970024K316792K693839L089942L489283L871695M214261
$$ 13065478 14725986 16696010 19012802 21706641 24796583 28285866 32157561 36371822
57085C6371822M493523M687394M777382M751074M601279M320027L894100L311381
$$ 36371822 40865345 45552739 50330121 55081195 59682474 64002501 67896601 71207982
57077G1207982K576219J719142P90375j56665j077375j937541k709737l370851
$$ 71207982 73784201 75503343 76293718 76137053 75059678 73122137 70412400 67041549
57069F7041549l901804m288651m524992m614680m572265m420265m184998l892885
$$ 67041549 63139745 58851094 54326102 49711422 45139157 40718892 36533894 32641009
57061C2641009l567698l228882k891309k566004k260803j980573j727539j501834
$$ 32641009 29073311 25844429 22953120 20387116 18126313 16145740 14418201 12916367
57053A2916367j302192j126801r74166q43161p32149o38411n58906m91282m33869
$$ 12916367 11614175 10487374 9513208 8670047 7937898 7299487 6740581 6249299 5815430
57044E815430l85019l43136l07101k76146k49344k25719k04710j86058j69334
$$ 5815430 5430411 5087275 4780174 4504028 4254684 4028965 3824255 3638197 3468863
57035C468863j53927j39462j25690j12119r8188q3817o9219n4055l7190j7410
$$ 3468863 3314936 3175474 3049784 2937665 2839477 2755660 2686441 2632386 2595196 2577786
57025B577786N869L2438O0554Q5153R6909Q5191M4934j7530q5661j41369j74415
$$ 2577786 2583655 2616093 2676647 2761800 2858709 2943900 2988834 2971304 2885643 2744274 2569859
57014B569859j85143j80116j66419j49128j31332j14600r9447q6236p5462o6972
$$ 2569859 2384716 2204600 2038181 1889053 1757721 1643121 1543674 1457438 1381976 1315004
57004A315004n9603n2226m4835l8114l2442k7887k4679k2846k1697k0373j8731
$$ 1315004 1255401 1203175 1158340 1120226 1087784 1059897 1035218 1012372 990675 970302 951571
56993I51571j7141j5657j4013j2191j0336q312n938l427r97J665M783P550Q549
$$ 951571 934430 918773 904760 892569 882233 873921 867983 864556 863559 865224 870007 877557 886106
56980H86106P104L513j803q410j5149k0355k3224k4349k4573k3940k2111j9231
$$ 886106 893210 896723 894920 886510 871361 851006 827782 803433 778860 754920 732809 713578
56968G13578j5918j2724r932p533n188k489M99L316N849Q637J2142J6112J9855
$$ 713578 697660 684936 675004 667471 662283 659794 660293 663609 669458 678095 690237 706349 726204
56955G26204K2649K3444K0652J3188J999r922j9451k5277k7983k8620k7664k5314
$$ 726204 748853 772297 792949 806137 808136 798214 778763 753486 725503 696883 669219 643905
56943F43905k2147j8901j5802j2531q929n249j654K064O094J0367J4893J9838
$$ 643905 621758 602857 587055 574524 565595 560346 558692 560756 566850 577217 592110 611948
56931F11948K4929K9180L1492L1086K7082J8519N728q680k1172k9676l4206l5513
$$ 611948 636877 666057 697549 728635 755717 774236 779964 771284 750112 720436 686230 650717
56919F50717l4203l1160k7719k4752k2100j9292j6469j4222j2828j1955j1015
$$ 650717 616514 585354 557635 532883 510783 491491 475022 460800 447972 436017 425002
56908D25002r579p740o148n484n731o116n847m767l296j990j138n73J71J370K789
$$ 425002 415423 407683 401535 396051 390320 384204 378357 373590 370294 368304 367166 366593 366764 368134 370923
56893C70923M146N702Q041J1219J4567J7524K0346K3701K7660L1208L2652L0567
$$ 370923 375069 380771 388812 400031 414598 432122 452468 476169 503829 535037 567689 598256
56881E98256K4647J5869N952l408j0946j5937j8249j8249j6451j3300r347n323
$$ 598256 622903 638772 644724 641316 630370 614433 596184 577935 561484 548184 538837 533514
56869E33514j746J508M971R040J3743J8926K4499L0643L7858M6403N5422O2806
$$ 533514 531768 533276 538247 547287 561030 579956 604455 635098 672956 719359 774781 837587
56857H37587O6010O2856N1834L2946Q955j4914l3834m6034n2339n3753n0536m3365
$$ 837587 903597 966453 1018287 1051233 1060188 1045274 1011440 965406 913067 859314 808778 765413
56845G65413l4071k4706j6343q875j454O863J6312K6280L6388M7452O0547P5313
$$ 765413 731342 706636 690293 681418 679964 686827 703139 729419 765807 813259 873806 949119
56833I49119Q9893J02086J09272J07350R1830O1581K1153k1218n7753q3661r7422
$$ 949119 1039012 1141098 1250370 1357720 1449550 1511131 1532284 1511066 1453313 1369652 1272230
56822A272230j00235r5099q5316p3410o1098m9485l8703k8000j6880n878M291
$$ 1272230 1171995 1076896 991580 918170 857072 807587 768884 740884 724004 718126 722417
56811G22417J3868K3781L4537M6003N7758O8695P6193P6550O6795M6395J7815
$$ 722417 736285 760066 794603 840606 898364 967059 1043252 1119802 1186597 1232992 1250807
56800A250807j3962m2894o4229p6314q0350p8515p2545o3765n3602m3558l4722
$$ 1250807 1236845 1193951 1129722 1053408 973058 894543 821998 758233 704631 661073 626351
56789F26351k7422k1180j5089q518j527N517J2615K0038K7500L3876L7826L8385
$$ 626351 598929 577749 562660 554142 552615 558132 570747 590785 618285 652161 689987 728372
56777G28372L4699K5839J1692n848k3151l6798m5289m8969m8886m6107m1725l6694
$$ 728372 763071 788910 800602 794754 771603 734805 689516 640547 591661 545554 503829 467135
56765D67135l1504k6391k1878j8539j6198j4040j1763j0000r164q633p671o596
$$ 467135 435631 409240 387362 368823 352625 338585 326822 316822 307658 299025 291354 284758
56753B84758o145o156n769m766l763l139k665k219k015k001j875j792k231k950
$$ 284758 278613 272457 266688 261922 258159 255020 252355 250136 248121 246120 244245 242453 240222 237272
56739B37272k985j991p82k00k15n38j175j819j638m28P31Q17K84K03O09P20M59
$$ 237272 234287 232296 231514 231314 231099 230561 229386 227567 225929 225501 226232 227049 227333 227536 228145 228865 229324
56722B29324N62J227J734J628J278J041O36j24p36o66j90j9l32o96p97p44o24
$$ 229324 229886 231113 232847 234475 235753 236794 237430 237306 236570 235904 235714 235695 235363 234667 233870 233126 232502
56705B32502k13O24J531J941J677J046L84j85m84j93O31J269J024J36m98m46r6
$$ 232502 232289 232913 234444 236385 238062 239108 239492 239307 238823 238630 239261 240530 241554 241690 241192 240746 240650
56688B40650J57M48R21J181P91n6p61j089j251j414j450j213p55k69J7l5l24n57
$$ 240650 240807 241255 242176 243357 244148 244092 243331 242242 240991 239577 238127 236914 236159 235890 235907 235872 235548 234991
56670B34991n51m07k69j03J35K77J48q1N3Q33J927K505J907M18q13q70j09K90
$$ 234991 234440 234033 233764 233661 233796 234073 234221 234140 234193 235026 236953 239458 241365 241783 240970 240100 239991 240281
56652B40281j89q02n49N84J651J845J227M75J03n3m83j219j660j392q70p58q63
$$ 240281 240092 239290 238741 239325 240976 242821 244048 244523 244626 244573 244090 242871 241211 239819 238949 238191 237328
56635B37328l92Q14K019K670K926K944K483J626J139J444J822J299Kj021j098
$$ 237328 236936 237750 239769 242439 245365 248309 250792 252418 253557 255001 256823 258122 258124 257103 256005
56620B56005m79K50P55R49Q80N72j25j337k620l017k103o95j09p82j943k525k136
$$ 256005 255526 255776 256531 257480 258360 258932 258807 257470 254850 251833 249730 249035 248926 248144 246201 243676 241540
56603B41540j320j001j517k126j854q45k87p38j298r32Q2P67R08R50Q69K38o56
$$ 241540 240220 239219 237702 235576 233722 232877 232590 231852 230554 229622 229704 230471 231379 232329 233198 233436 232780
56586B32780q66j33O94R29R35J346J969K071J402M74p9ON87J286J699J651J339
$$ 232780 231914 231781 232475 233404 234339 235685 237654 239725 241127 241601 241522 241528 242115 243401 245100 246751 248090
56569B48090J107J060R74O66M09Q86K456M599O293P089P556Q507R948J0950J0514
$$ 248090 249197 250257 251231 251897 252306 253192 255648 260247 266540 273629 281185 289692 299640 310590 321104
56554C21104Q466N634L169J640P58P7k89LO05N80m18j549j744q96J75O32K22p48
$$ 321104 329570 335204 338373 340013 340771 340848 340559 340562 341167 341747 341329 339780 338036 337140 337315 337947 338169 337421
56536C37421j695k238k568l116l803l995l389k536k144k288k579k770k825k701
$$ 337421 335726 333488 330920 327804 324001 320006 316617 314081 311937 309649 307070 304300 301475 298774
56522B98774k394k054j789j544j312j205j235j330j587k084k445k184j560j416
$$ 298774 296380 294326 292537 290993 289681 288476 287241 285911 284324 282240 279795 277611 276051 274635
56508B74635j984k551k558k247j961j589j111q99r66p82l29l95j180j596q34K66
$$ 274635 272651 270100 267542 265295 263334 261745 260634 259735 258769 257987 257658 257263 256083 254487 253653 253919
56492B53919M26k16n77l73j71j96k37l94q37j094o58l1j00p04q82l69J87L79L70
$$ 253919 254345 254129 253552 253179 253008 252812 252575 252181 251344 250250 249592 249561 249461 248757 247875 247506 247693 248072 248442
56473B48442K30o9j19M68J167J200Q22R20J467J688J578J886K468K179P48n79
$$ 248442 248672 248603 248484 248952 250119 251319 252141 253061 254528 256216 257794 259680 262148 264327 265075 264496
56457B64496q02m50m84r39j243j094m72N47J470J663J169P11N30J40n95j025p44
$$ 264496 263694 263244 262760 261821 260578 259484 259012 259559 261029 262692 263861 264572 265102 265242 264647 263622 262878
56440B62878j88K48P56J345J405P16L8N6M53O10N52N14L07j17j03Q73K166K645
$$ 262878 262690 262938 263694 265039 266444 267160 267198 267254 267707 268317 268869 269383 269690 269573 269470 270343 272509 275154
56422B75154K064J112L33k51n70l22M95J330J587J217O91M35L91J89k02l42l7
$$ 275154 277218 278330 278663 278412 277842 277520 278015 279345 280932 282149 282840 283275 283666 283855 283653 283311 283274
56405B83274J95j47o74o73k21N2J26N27J163J301Q61O69J107J519J365J021Q49
$$ 283274 283469 283322 282648 281975 281754 281806 281932 282459 283622 284923 285784 286453 287560 289079 290444 291465 292314
56388B92314M69l98j139j073m55O9L90O56O75L45K89J170K672L768L872L199K274
$$ 292314 292783 292385 291246 290173 289718 289787 290177 290833 291508 291853 292142 293312 295984 299752 303624 306823 309097
56371C09097J556J291J259Q49k22j437k085k052j698j290q97n96m01j43K81P02
$$ 309097 310653 311944 313203 314052 313830 312393 310308 308256 306558 305268 304371 303775 303374 303231 303512 304214
56355C04214Q94P90M47J25L04J197K182K354J729J233J349J484R54p6r79j358
$$ 304214 305108 305898 306345 306470 306774 307971 310153 312507 314236 315469 316818 318302 319256 319180 318201 316843
56339C16843j037PJ339K204K364K263K225K125K019K318K984L340L058K599K291
$$ 316843 315806 315813 317152 319356 321720 323983 326208 328333 330352 332670 335654 338994 342052 344651 346942
56324C46942J863J337J402K286L143L226K814K384J729P05o0j13r5o75j298j025
$$ 346942 348805 350142 351544 353830 356973 360199 363013 365397 367126 367831 367771 367658 367563 366888 365590 364565
56308C64565k9Q16J314J871K457K686K679K847L143L295L477L859L986L495K998
$$ 364565 364536 365352 366666 368537 370994 373680 376359 379206 382349 385644 389121 392980 396966 400461 403459
56293D03459L218L698L495K824K720L293L690L684L988M766N212M979M857N426
$$ 403459 406677 410375 413870 416694 419414 422707 426397 430081 434069 438835 444047 449026 453883 459309
56279D59309O072O009N593N852P146Q839J0022J0212R564Q803Q731R595J0984
$$ 459309 465381 471390 476983 482835 489981 498820 508842 519054 528618 537421 546152 555747 566731
56266E66731J2381J3613J4801J6097J7473J8680J9507K0299K1881K4611K7879
$$ 566731 579112 592725 607526 623623 641096 659776 679283 699582 721463 746074 773953
56255G73953L0992L4307L8776M4583N0901N7071O3353P0345P8159Q6435R4814
$$ 773953 804945 839252 878028 922611 973512 1030583 1093936 1164281 1242440 1328875 1423689
56244A423689J03047J10811J17562J22593J25328J25667J23886J20086J13887
$$ 1423689 1526736 1637547 1755109 1877702 2003030 2128697 2252583 2372669 2486556
56235B486556J04771R2538P7236N9058L8531J6620n610k7194m7058o4124p7991
$$ 2486556 2591327 2683865 2761101 2820159 2858690 2875310 2869700 2842506 2795448 2731324 2653333
56224B653333q9157r8159j04830j08736j10060j09579j07973j05466j01897r6957
$$ 2653333 2564176 2466017 2361187 2252451 2142391 2032812 1924839 1819373 1717476 1620519
56214A620519r0638q3680p7125p1250o5448n9422n3820m9249m5329m1357l7362
$$ 1620519 1529881 1446201 1369076 1297826 1232378 1172956 1119136 1069887 1024558 983201 945839
56203I45839l3855l0963k8427k6119k3973k1767j9478j7460j5797j4007j1888
$$ 945839 911984 881021 852594 826475 802502 780735 761257 743797 728000 713993 702105
56192G02105j0059q963q031o644n384n223n906o216n703n041m683m209l245k194
$$ 702105 692046 683083 675052 668408 663024 657801 651895 645679 639976 634935 630252 626043 622798 620604
56178F20604j581j255o13N57J768K253J709O19j56j63M81J510K710L659L955L802
$$ 620604 619023 617768 617155 617712 619480 621733 623442 624061 623905 623742 624223 625733 628443 632102 636057 639859
56162F39859L823M195M600N093O176P748Q925R252R260R411R493R541J0323J2169
$$ 639859 643682 647877 652477 657570 663746 671494 680419 689671 698931 708342 717835 727376 737699 749868
56148G49868J4250J5802J7194J9148K1705K4729K8552L3375L8840M4861N1948
$$ 749868 764118 779920 797114 816262 837967 862696 891248 924623 963463 1008324 1060272
56137A060272O0063O8263P6187Q4526R2983R9085J00416R6887Q9686P9338O6656
$$ 1060272 1120335 1188598 1264785 1349311 1442294 1541379 1641795 1738682 1828368 1907706 1974362
56126A974362N4419M5878M1690L9699L7327L2904K5501J5311M149n737j3276j8416
$$ 1974362 2028781 2074659 2116349 2156048 2193375 2226279 2251780 2267091 2271240 2265503 2252227 2233811
56114B233811k1333k3128k6328l3121m3439n5745o8655q0483q8510r0809q8197
$$ 2233811 2212478 2189350 2163022 2129901 2086462 2030717 1962062 1881579 1793069 1702260 1614063
56103A614063q2783p5402o6140n6247m7295l9178l1045k3608j8236j4478j0760
$$ 1614063 1531280 1455878 1389738 1333491 1286196 1247018 1215973 1192365 1174129 1159651 1148891
56092A148891p142m904l765k083K83J849K282K797L611L543K591K513M113O106
$$ 1148891 1141749 1136845 1133080 1130997 1131280 1133129 1135411 1138208 1141819 1145362 1147953 1150466 1154579 1160685
56078A160685P318Q101Q897R315R306R546J0076J0103R630R728J0821J2191J3400
$$ 1160685 1168003 1176104 1185001 1194316 1203622 1213168 1223244 1233347 1242977 1252705 1263526 1275717 1289117
56065A289117J4696J5841J6277J6515J7673J9511K0732K1180K1904K2953K3190
$$ 1289117 1303813 1319654 1335931 1352446 1370119 1389630 1410362 1431542 1453446 1476399 1499589
56054A499589K2415K1653K1168K0262J9221J9272K0306K0827K0555K0929K2554
$$ 1499589 1522004 1543657 1564825 1585087 1604308 1623580 1643886 1664713 1685268 1706197 1728751
56043A728751K4212K4939K5181K5410K5544K5974K7336K9111L0319L1595L4412
$$ 1728751 1752963 1777902 1803083 1828493 1854037 1880011 1907347 1936458 1966777 1998372 2032784
56032B032784L8243M0934M1978M3059M5172M7554M9671N1942N4285N6253N8507
$$ 2032784 2071027 2111961 2153939 2196998 2242170 2289724 2339395 2391337 2445622 2501875 2560382
56021B560382O1778O4741O5622O5481O6774O9162P0303P0526P2697P7151Q0893
$$ 2560382 2622160 2686901 2752523 2818004 2884778 2953940 3024243 3094769 3167466 3244617 3325510
56010C325510Q2530Q4114Q7230R1067R5252J00832J07391J12938J17646J24013
$$ 3325510 3408040 3492154 3579384 3670451 3765703 3866535 3973926 4086864 4204510 4328523
56000D328523J32467J40543J47266J54466J62931J71403J80046J90677K02768
$$ 4328523 4460990 4601533 4748799 4903265 5066196 5237599 5417645 5608322 5811090
55991E811090K13862K24605K38505K55896K73378K90233L09669L32596L56035
$$ 5811090 6024952 6249557 6488062 6743958 7017336 7307569 7617238 7949834 8305869
55982H305869L79315M05779M36710M69755N05084N46516N94722O46201P01000
$$ 8305869 8685184 9090963 9527673 9997428 10502512 11049028 11643750 12289951 12990951
55973A2990951P64086Q37151R16976J004376J106278J226355J362794J518279
$$ 12990951 13755037 14592188 15509164 16513540 17619818 18846173 20208967 21727246
55965B1727246J702417J921144K174722K470383K826029L258002L778531M410405
$$ 21727246 23429663 25350807 27525529 29995912 32821941 36079943 39858474 44268879
55957D4268879N190537O154718P335685Q783004J0568638J2769053J5461513J8732024
$$ 44268879 49459416 55614134 62949819 71732823 82301461 95070514 110532027 129264051
55949A29264051K2636029K7112477L1925286L6610912M0308129M1564172L8562926
$$ 129264051 151900080 179012557 210937843 247548755 287856884 329421056 367983982
55942C67983982L0051165J6450260J38651j5529864k7767364l5320276l8408106
$$ 367983982 398035147 414485407 414624058 399094194 371326830 336006554 297598448
55935B97598448l8063204l5502700l1784625k7680483k3669384k0006020j6803410
$$ 297598448 259535244 224032544 192247919 164567436 140898052 120892032 104088622
55928A04088622j4084058j1811105r923796q364136p078836o015275n129653m393013
$$ 104088622 90004564 78193459 68269663 59905527 52826691 46811416 41681763 37288750
55920C7288750l782016l271013k838694k473891k167832j907444j681868j488265
$$ 37288750 33506734 30235721 27397027 24923136 22755304 20847860 19165992 17677727
55912A7677727j325007j185107j061637r53723q61709p81682p09679o46323n92541
$$ 17677727 16352720 15167613 14105976 13152253 12290544 11508862 10799183 10152860 9560319
55903I560319n45131n00944m61089m26930l96008l65995l38654l15918k95702
$$ 9560319 9015188 8514244 8053155 7626225 7230217 6864222 6525568 6209650 5913948
55894E913948k75293k55573k38318k22557k06948j92670j80666j68890j55480
$$ 5913948 5638655 5383082 5144764 4922207 4715259 4522589 4341923 4173033 4017553
55885D017553j41902j30077j19062j07346r5882q6128p7720p0629o7046o8374
$$ 4017553 3875651 3745574 3626512 3519166 3423284 3337156 3259436 3188807 3121761 3053387
55875C053387p2582p7018q1482q6326r0002r1236r1295r1607r1036q7985q3203
$$ 3053387 2980805 2903787 2822305 2735979 2645977 2554741 2463446 2371839 2280803 2192818 2109615
55864B109615p8202p2801o6472o0274n5227n0593m5762m2043m0374l9167l6647
$$ 2109615 2031413 1958612 1892140 1831866 1776639 1726046 1680284 1638241 1597867 1558700 1522053
55853A522053l3588l1616l0406k8896k7748k8204k9694l0702l0981l1046l0604
$$ 1522053 1488465 1456849 1426443 1397547 1369799 1341595 1311901 1281199 1250218 1219172 1188568
55842A188568k9279k7829k6912k5779k3726k1697k0843k0638k0078j9485j9511
$$ 1188568 1159289 1131460 1104548 1078769 1055043 1033346 1012503 991865 971787 952302 932791
55831I32791j9391j7980j5626j3489j1905j0680j0074j0092r849q954q523r555
$$ 932791 913400 895420 879794 866305 854400 843720 833646 823554 813705 804751 796228 786673
55819G86673j1384j2914j4176j5357j5561j4128j2164j1206j1148j0865j0022
$$ 786673 775289 762375 748199 732842 717281 703153 690989 679783 668635 657770 647748
55808F47748q988p776o321n076m274l391k212j410j154l82J492L412M366M912
$$ 647748 638760 630984 624663 619587 615313 611922 609710 608300 607146 606764 608256 611668 616034 620946
55794F20946N737N951M374J499j229l222m542m945m455l999m202m454m353n003
$$ 620946 626683 632634 637008 638507 637278 634056 629514 624569 620114 616115 611913 607459 603106 598103
55780E98103p531j1292j4751j7150j8159j7150j4363j1556r862q043m524j46K854
$$ 598103 590572 579280 564529 547379 529220 512070 497707 486151 476289 468246 463722 463576 466430
55767D66430L747L369K082l04l094n004n768o023n947n424n003n254n589n149
$$ 466430 470177 473546 475628 475324 472230 467226 461458 455435 449488 444064 439061 433807 428218 423069
55753D23069m362m328n106o022p076q514r617r521q735q273p764o197m121l178
$$ 423069 418707 414379 409273 403251 396175 387661 378044 368523 359788 351515 343751 337554 333433 330255
55739C30255l521l631k778j912j844k184k475k889l323l060j931p73k96m30j056
$$ 330255 326734 323103 320325 318413 316569 314385 311910 309021 305698 302638 300707 299934 299638 299208 298152
55724B98152k386m232n712o181n860n278m645l906l032k097j330q96m28P21K345
$$ 298152 295766 291534 285822 279641 273781 268503 263858 259952 256920 254823 253493 252597 252169 252890 255235
55709B55235L179K513J339J036J590K099K343K628K569J446m67k222l651n247
$$ 255235 258414 260927 262266 263302 264892 266991 269334 271962 274531 275977 275510 273288 269637 264390
55695B64390o721p088o221n128m437l773k833k070j977k433k965l064k277p10
$$ 264390 257669 250581 244360 239232 234795 231022 228189 226119 224142 221709 218744 215680 213403 212693
55681B12693P31J367J787L026M841N921N639M572L279J764K27p97j375k248l575
$$ 212693 213424 214791 216578 219604 224445 230366 236005 240577 243856 245620 245847 245050 243675 241427 237852
55666B37852m477m251l265k297j610j079o60l82j45K20Q30J654K321K368J955
$$ 237852 233375 229124 225859 223562 221952 220873 220213 219831 219686 219906 220736 222390 224711 227079 229034
55651B29034J887K433K682J883P57N59J208J513R70J84m57j262k323l236l942
$$ 229034 230921 233354 236036 237919 238676 239235 240443 241956 242926 243110 242653 241391 239068 235832 231890
55636B31890m891o155p143p465p212o409n024l660l159l301k839j250L58O78k65
$$ 231890 226999 220844 213701 206236 199024 192615 187591 183931 180772 177471 174632 173382 173740 174418 174153
55621A74153j398j959j983j858j794j620j016n2N95L50n27j383k051k736l239
$$ 174153 172755 170796 168813 166955 165161 163541 162525 162473 163068 163418 162891 161508 159457 156721 153482
55606A53482l062k232j365q62o33n51n62m82k52k55p91j430j605j548j825k209
$$ 153482 150420 148188 146823 145961 145328 144777 144215 143733 143481 143226 142435 141005 139400 137852 136027 133818
55590A33818j968j134m39j38J17K36k64j084j221m83J34M7l6O46J710K323K352
$$ 133818 131850 130716 130277 130139 130256 130492 130228 129144 127923 127440 127574 127621 127585 128231 129941 132264 134616
55573A34616K122J653Q26j3k89J56R62J692K146K337K279J848R77P1k16J19K15
$$ 134616 136738 138391 139217 139204 138915 139071 140033 141725 143871 146208 148487 150335 151312 151383 151167 151286 151501
55556A51501m54j300j635j783k246k426j517k26p2j062j573p82K19J72p58j689
$$ 151501 151047 149747 148112 146329 144083 141657 140140 139914 139842 138780 137207 136425 136644 136816 136058 134369
55540A34369k175k073j253j11M74L06K68R92J889K020J339N40J41J43J52l74j545
$$ 134369 132194 130121 128868 128757 129231 129537 129805 130797 132686 134706 136045 136585 136726 136869 137021 136647 135102
55523A35102k631k785k202j833k017k238k222k197k064j443p17p52j321j101L32
$$ 135102 132471 129686 127484 125651 123634 121396 119174 116977 114913 113470 112753 112001 110680 109579 109911
55508A09911J809K393K498K541J929L89r66j148q32j231k242k913k980k764k211
$$ 109911 111720 114113 116611 119152 121081 121470 120504 119356 118524 117293 115051 112138 109158 106394 104183
55493A04183j260o12r26j660j788j301q77n39J80R68R96L14j06J43M57L84K85
$$ 104183 102923 102311 101385 99725 97937 96636 95759 95220 95400 96368 97364 97678 97572 97715 98172 98556 98841
55476I8841N18Q48J024J299J914K506K430J487J80p19q69o82q02j270j494j233
$$ 98841 99359 100207 101231 102530 104444 106950 109380 110867 111047 110328 109459 108777 107975 106705 105211 103978
55460A03978j009j301j786j867j554j265j080o89K4Q41J451J565J072L66J40N31
$$ 103978 102969 101668 99882 98015 96461 95196 94116 93427 93451 94292 95743 97308 98380 98746 98886 99417
55444I9417Q14L75m61r48q39l37L95J112J334Q76K39o9k22n70q54n59K60J124
$$ 99417 100231 100606 100145 99197 98358 98021 98416 99528 100862 101738 101977 101908 101686 101116 100262 99703 99963 101087
55426A01087J759K043J759J034N92Q61J195P63j19n12l65m73j013j207n52M98
$$ 101087 102846 104889 106648 107682 108274 109135 110330 111093 110974 110462 110097 109624 108611 107404 106852 107350
55410A07350J320J773J789J103j77j341j798j638j234p87n37q67j758k418k066
$$ 107350 108670 110443 112232 113335 113158 111817 110019 108381 107147 106360 105823 104956 103198 100780 98714
55395I8714q93P8K02j02k0N31P83J61q96j436j082l09K97N85O65O90Q50J127J078
$$ 98714 97821 97899 98101 97999 97979 98510 99293 99454 98558 97122 96040 95731 96028 96613 97278 97968 98818 99945 101023
55376A01023L63m91n92m1O6p31j565j623j230r15l42P38J439Q13m51q27j35L12
$$ 101023 101386 100895 100303 100262 100328 99597 98032 96409 95179 94264 93922 94660 96099 96912 96461 95634 95499 95811
55358I5811k47j074j240p43k5O99J157R46J62m12j89N02R22P02J7o11n70K94J224
$$ 95811 95564 94490 93250 92507 92482 93181 94338 95284 95446 95034 94845 95347 96269 96971 96988 96377 95807 96101 97325
55339I7325J210K40o20o05j64j40o03r46q24m09N3N09Q79R13M93q2k47K88J164
$$ 97325 98535 98775 98155 97550 97386 97246 96643 95697 94873 94464 94517 95026 95905 96818 97311 97229 96982 97270 98434
55320I8434J661J392O07j94p29r37q42o44o94j011j041k82R52J737J514N85k76
$$ 98434 100095 101487 102094 101900 101171 100234 99392 98748 98054 97043 96002 95720 96672 98409 99923 100508 100232
55303A00232n04j03M32N50J54l20m54l12k43m28p10p54l20M52J028J068Q81R14
$$ 100232 99728 99625 100057 100607 100761 100441 99987 99675 99432 99004 98294 97540 97220 97672 98700 99768 100649 101563
55285A01563Q72J51r11j124j14R92J092M59p3l33n17l37M79J352J469Q69J68l51
$$ 101563 102435 102586 101675 100551 100437 101429 102521 102980 102907 102574 102057 101720 102199 103551 105020 105889 106057 105706
55267A05706o80n78%M90N58P16J243J268J62r63o65M80O57l76j071p08k59l84
$$ 105706 105026 104448 104448 104938 105496 106212 107455 108723 108885 107922 107257 107737 108394 108018 106947 106239 105980 105596
55249A05596m42o9n2q16j498j406j064r77n90M89J384J208M69J70K97L01K72N46
$$ 105596 105154 105085 105033 104217 102719 101313 100249 99272 98682 99171 100555 101763 102232 102402 102699 103000 103272 103818
55231A03818P63M21j26k55k10n53r77p64j24N7k77l06J95M32q3o81m89L12P27
$$ 103818 104581 105002 104876 104621 104411 103858 102881 102117 101993 102050 101773 101467 101662 102094 102011 101330 100841 101153 101880
55212A01880K13o50p47L43J770K196J221k35j033r24m10pR4L2K75J110J950J716
$$ 101880 102093 101443 100696 101039 102809 105005 106226 105991 104958 104034 103624 103617 103711 103743 104018 105128 107078 108794
55194A08794L52q05p38j31k61j121j703j641j436j228n81M26R86P26J72j67m11
$$ 108794 109146 108341 107603 107472 107211 106090 104387 102746 101310 100082 99501 99927 100913 101639 101811 101644 101233
55177A01233o00k97O11J438J638J616J951K302J858O46l92o17l31j36j67k51l51
$$ 101233 100633 100336 100947 102385 104023 105639 107590 109892 111750 112396 112004 111387 111056 110920 110753 110502 110151
55160A10151n38o67m85L2O30J062J231J106O96J47k57l59k83l12o09j078j379
$$ 110151 109613 108946 108461 108493 109123 110185 111416 112522 113218 113365 113108 112749 112466 112154 111545 110467 109088
55143A09088j135l35M66O05N2n56p39o47n87m74j53J58K74N58J369K158J915N89
$$ 109088 107953 107618 108084 108689 108741 108185 107446 106799 106212 105738 105585 105743 106017 106575 107944 110102 112017 112606
55125A12606o73q92k94K46K73n1m05n42m16k65m04p34q01m25R0M36O14O33L75
$$ 112606 111933 111041 110747 110993 111266 111215 110810 110268 109852 109587 109183 108449 107648 107223 107313 107749 108363 108996 109371
55106A09371q4m13n13o45q87q98m44K96J046J670J940J603Q77L34J01k61q44j045
$$ 109371 109287 108874 108361 107716 106829 105931 105487 105783 106829 108499 110439 112042 112919 113253 113354 113093 112249 111204
55088A11204m70M41J071J256R59P6r34j097k56M61K45j26M34J528J859J103K0
$$ 111204 110734 111175 112246 113502 114461 114537 113603 112506 112250 112711 112956 112830 113264 114792 116651 117754 117774
55071A17774q35j370j263l01P30P61K2k86R8K69q3j01N94J088O98R7P2J87l29
$$ 117774 116939 115569 114306 114005 114735 115496 115518 115232 115330 115599 115516 115415 116009 117097 117795 117892 117964 118151 117822
55052A17822j136j348r76p54q31o97k36R1J40K96O63P76L32l00n86m21o8J52L
$$ 117822 116686 115338 114362 113608 112777 112080 111844 111935 112075 112371 113034 113810 114142 113842 113256 112835 112767 112919 112922
55033A12922n06r07o24K87R85Q07R4k49Q1M95M46J68K66P48R75N90N1J6M25N56
$$ 112922 112416 111509 110885 111172 112157 112964 113058 112809 112890 113385 113831 113999 114265 115013 115988 116578 116629 116645 117070 117626
55013A17626nq05r94k46R57J751J606O84l72r86j058q52o59n87n85m92r9O29J387
$$ 117626 117621 116816 115822 115576 116533 118284 119890 120574 120202 119216 118158 117306 116647 116060 115475 114983 114884 115513 116900
54994A16900J691J292M48k57l77K7M85O00M34K62Q2l68j085j608j537r87l13L17
$$ 116900 118591 119883 120331 120074 119697 119724 120209 120809 121243 121505 121587 121219 120134 118526 116989 116002 115689 116006
54976A16006Q86J278J406J428J544J613J298M98m99j287j502r62R9J009J182O60
$$ 116006 116892 118170 119576 121004 122548 124161 125459 125957 125458 124171 122669 121707 121806 122815 123997 124657
54960A24657J2k48J3O20J214J467J376J175Q96L11m66q34m99j5K4j12R4K96k64
$$ 124657 124669 124421 124434 125054 126268 127735 129111 130286 131182 131493 131027 130193 129694 129679 129703 129591 129685 129981 129717
54941A29717j340j760j143m77o22j101r66j81O05J115J528J764J488Q33N33J133
$$ 129717 128377 126617 125474 124997 124375 123274 122308 122127 122732 123847 125375 127139 128627 129460 129993 131126
54925A31126K313L143K934J937J244J799L428N061O019O643P447Q152Q048P023
$$ 131126 133439 136582 139516 141453 142697 144496 147924 152985 159004 165647 173094 181246 189294 196317
54911A96317N588M001J953p21l560n862p305p930p819p051n870m675l776l204
$$ 196317 201905 205906 207859 207138 203578 197716 190411 182481 174662 167611 161741 157066 153290 150086
54897A50086k803k439k108j849j652j497j414j370j153o06O1M58N65Q01J349J869
$$ 150086 147283 144844 142736 140887 139235 137738 136324 134954 133801 133195 133256 133714 134279 135080 136429 138298
54881A38298K064K224K760L443L712L628L897M824N857O437O687O850O487M969
$$ 138298 140362 142586 145346 148789 152501 156129 160026 164850 170707 177144 183831 190681 197168 202137
54867B02137K506j3k160m182n971o700n995m840m562n196n679n438m941m606m074
$$ 202137 204643 204630 202470 198288 192317 185617 179622 174782 170220 165024 159345 153907 148966 144360 140286
54852A40286l017j941j516j600j512j121r24j147j378j263j034j078j240r27J10
$$ 140286 137269 135328 133812 132212 130700 129579 128655 127508 126130 124867 123833 122755 121515 120588 120698
54837A20698J334J816J174K9n81k74L61N67K65o6q7Q1J27r7m30m96j55J37k21
$$ 120698 122032 123848 125022 125051 124470 124196 124557 125124 125389 125323 125236 125317 125444 125347 124917 124421 124266 124403 124182
54818A24182r85j099j29Q99P09n09j409j224l67O26J633K320K021P68l43m63r1
$$ 124182 123197 122098 121969 122868 123577 123068 121659 120435 120068 120694 122327 124647 126668 127436 127093 126630 126539
54801A26539k47r82j416r74N6J096J808K048J794J259P75M30M1n29j109j384j161
$$ 126539 126292 125310 123894 122920 122976 124072 125880 127928 129722 130981 131756 132186 132227 131698 130589 129205 128044
54784A28044n71k9O3k57n32l29L62J180J734J798J439J014Q69J037J365J898K812
$$ 128044 127473 127444 127507 127250 126718 126389 126751 127931 129665 131463 132902 133916 134785 135822 137187 139085 141897
54767A41897L889M592M819N158O076P164P646P379O849O339N530M039J983j51
$$ 141897 145786 150378 155197 160355 166431 173595 181241 188620 195469 201808 207338 211377 213360 213209
54753B13209k069l908n840p448p814o580m766l922m370m884m386l238k373j799
$$ 213209 211140 207232 201392 193944 186130 179550 174784 170862 166492 161608 157222 153984 151611 149812
54739A49812r23L8P5j061k254k358j469m29L78J113J738J865J430R37R25J435
$$ 149812 148889 148927 149002 147941 145687 143329 141860 141431 141809 142922 144660 146525 147955 148892 149817 151252
54723A51252K159K939L838M804N506N650N354N012M831M577L906K662R22j053
$$ 151252 153411 156350 160188 164992 170498 176148 181502 186514 191345 195922 199828 202490 203412 202359
54709B02359k765l664l768l861m672n916o544o034m948m071l416k503j367o96
$$ 202359 199594 195930 192162 188301 183629 177713 171169 165135 160187 156116 152700 150197 148830 148134
54695A48134r50j705k154k041j786j755j721j221k76N12O00Q3m50n49l13k04n32
$$ 148134 147184 145479 143325 141284 139498 137743 136022 134801 134525 135037 135637 135720 135270 134721 134408 134204 133672
54678A33672j117j444j146l22N66J089J045M61m27j210j479j087k81M59P29M71
$$ 133672 132555 131111 129965 129643 130209 131298 132343 132804 132377 131167 129688 128601 128320 128779 129508 129979
54662A29979O7M9M78P53L21n08q10k05O16O91j75j341k018j735n16J013J849J418
$$ 129979 130046 130095 130573 131326 131647 131139 130329 130124 130740 131431 131256 129915 127897 126162 125646 126659 128508 129926
54644A29926K25o13n61q0J42O4J00L89N78L61p0k88k15k21n92j085j168o54J07
$$ 129926 130151 129538 128977 128897 129039 129103 129203 129592 130170 130531 130461 130173 129958 129737 129145 128060 126892 126238 126345
54625A26345P00J122J667K314K510J688Q2j262j506r76p43j240j753j508p50k20
$$ 126345 127045 128167 129834 132148 134658 136346 136428 135166 133660 132684 131941 130701 128948 127440 126690 126470
54609A26470jL69Q54Q34K47r8L37J010J119O67J79j68m59m64J38J057J548J308
$$ 126470 126469 126838 127692 128526 128773 128675 129012 130022 131141 131808 131987 131819 131360 130896 131034 132091 133639 134947
54591A34947P23J94k83p90j148j104o18J66R96J546J601J288Q79M21k39j026j534
$$ 134947 135670 135864 135581 134791 133643 132539 131921 132087 133083 134629 136230 137518 138397 138818 138579 137553 136019
54574A36019j458r45m01q3J5m0k78p10j089r41q7R61J414J142P93Q68J016O46
$$ 136019 134561 133616 133215 133132 133147 133107 132829 132119 131030 130089 130002 130963 132377 133519 134312 135180 136196 136842
54556A36842j40o80o70m68m96p73j029r73l92O19J532J761J239L90l82q83r15
$$ 136842 136702 136022 135352 134884 134388 133615 132586 131613 131221 131840 133372 135133 136372 136762 136380 135497 134582
54539A34582l20O75J531J933K007J945J724J277P12K79K03N00P77M12o91j747
$$ 134582 134262 134937 136468 138401 140408 142353 144077 145354 146066 146345 146548 147048 147825 148237 147546 145799
54523A45799j896j262p33p51r29q83p77q15q14n83l07j84j37j22l10o51p53n08
$$ 145799 143903 142641 141908 141157 140228 139345 138568 137753 136939 136356 136049 135865 135728 135606 135296 134645 133892 133384
54505A33384l48m79m47K0K89k37r02n06R35K048J886R31J49j54j36J97P40R89
$$ 133384 133036 132557 132110 132130 132419 132182 131280 130774 131709 133757 135643 136574 136723 136569 136433 136630 137370 138359
54487A38359N80r4l50r8K82P31J518K420K624J713L18n37m74J14O85R05N81k93
$$ 138359 138939 138845 138495 138397 138679 139410 140928 143348 145972 147685 148003 147466 146992 147106 147791 148696 149277 148984
54469A48984j332j897j619p01L34J039J224R52M65N9n1K36Q63J429J247l0j743
$$ 148984 147652 145755 144136 143435 143769 144808 146032 146984 147449 147508 147457 147693 148556 149985 151232 151202 149459
54452A49459k641k155j025k93p5K34P50P97l6j112j408o61M89J285J395Q24k47
$$ 149459 146818 144663 143638 143345 143270 143504 144254 145051 145015 143903 142495 141834 142323 143608 145003 145827 145580
54435A45580j389k073k095j715j219n75K97J068J262R21O60Q88J282J283Q62M76
$$ 145580 144191 142118 140023 138308 137089 136514 136811 137879 139141 140062 140722 141610 142892 144175 145037 145513
54419A45513L84M05L46L60O49J064J153O25l05r69p89R7R12J114J008J170J465
$$ 145513 145897 146302 146648 147008 147657 148721 149874 150499 150194 149225 148436 148533 149445 150559 151567 152737 154202
54402A54202J252M63j36n0L16L81K32K56L82L27J88K49L90K87J01L39J018J515
$$ 154202 155454 155917 155781 155731 156047 156428 156660 156916 157298 157625 157813 158062 158452 158739 158840 159179 160197 161712
54384A61712J360P17J7n38r67j300j529j564j268o98k07n6n0J24M53P45J063J535
$$ 161712 163072 163789 163806 163268 162301 161001 159472 157908 156640 155942 155735 155679 155629 155753 156206 156951 158014 159549
54366A59549J899J758J202O31J25m19o26m4Q32Q80k1o08l3Q36O55m74j261j033
$$ 159549 161448 163206 164408 165039 165164 164745 164119 164075 164907 165787 165766 165158 165125 165961 166616 166142 164881 163848
54348A63848k84L66Q89J298J235O27J83O96J917K677K200J052N22J087J913J941
$$ 163848 163564 163930 164819 166117 167352 167979 168162 168858 170775 173452 175652 176704 177226 178313 180226 182167
54332A82167J164L45k28j051k295l162k830j648q49j211k380l371l349k098j84
$$ 182167 183331 183676 183448 182397 180102 176940 174110 172462 171613 170402 168022 164651 161302 159204 159020
54317A59020J302J569Q12r5n63p00q25r09o85j08M69N62J0q57j457j416q12m7
$$ 159020 160322 161891 162703 162608 162045 161345 160520 159611 158926 158818 159287 159849 159859 159002 157545 156129 155317 155270
54299A55270M10K39m60j095j048l48L65O16N43M48L14J21K10Q06J396J183K24
$$ 155270 155680 155919 155459 154364 153316 152968 153333 153949 154492 154940 155254 155375 155585 156391 157787 158970 159194
54282A59194m86k34O02J155J126Q40N31O2o39j284j534j333p91N4J023J528J000
$$ 159194 158708 158474 159076 160231 161357 162197 162728 162790 162151 160867 159333 158000 157209 157263 158286 159814 160814
54265A60814k43j021n18P94J760J893J616J390J198R54Q21Q57P85M15l9l40n54
$$ 160814 160571 159550 159032 159826 161586 163479 165095 166485 167683 168637 169458 170315 171100 171515 171476 171136 170582
54248A70582p81q43n84k05L5J65K23k2o59j183j035m69k86o89j000p02k05j49
$$ 170582 169801 168958 168374 168169 168204 168369 168592 168570 167911 166728 165693 165224 164938 164249 163249 162547 162342 162193
54230A62193m02k85K57L88m93j727k061j174l5L56N8k81m39n95o73m36p6k6j99
$$ 162193 161791 161506 161763 162151 161658 159931 157870 156696 156661 157017 157075 156794 156355 155760 155087 154651 154575 154549 154350
54211A54350j22J39J7n15p72n06l17n06m49K53Q78P26L42O02J172J090M21Q8J99
$$ 154350 154228 154367 154384 153869 153097 152591 152274 151768 151319 151572 152450 153176 153518 154120 155292 156382 156803 156891 157090
54192A57090p5q93j267o50J93M02J99K74O38Q25O72L09k32q37j092p67k48j9M8
$$ 157090 157015 156122 154855 154205 154398 154800 154999 155273 155911 156736 157408 157717 157485 156648 155556 154789 154541 154522 154570
54173A54570M04J008J307J002M13M1J0K2k39p29j080j046q86j023j413j562j208
$$ 154570 154974 155982 157289 158291 158704 158745 158755 158777 158538 157809 156729 155683 154797 153774 152361 150799 149591
54156A49591n83P2Q19J649K216K233J850J367Q67M02K03K97K38l32j044j228q49
$$ 149591 149008 149080 149899 151548 153764 155997 157847 159214 160081 160483 160686 160983 161221 160889 159845 158617 157768
54139A57768n27o39q14n26J57O37M74j30n38k73N28J302J586J339P64J18k50n0
$$ 157768 157241 156602 155788 155262 155419 156056 156530 156400 155862 155589 156117 157419 159005 160344 161108 161226 160976 160926
54121A60926N71J018R06N55M90O53N52J25q6K49P07P06K95n7k02m23p70p78p5
$$ 160926 161497 162515 163421 163976 164466 165119 165671 165796 165710 165959 166666 167372 167667 167610 167408 166985 166215 165437 165362
54102A65362R80J530J027k87j625k199j726o29L08O01M46K99K69J94J53M30R36
$$ 165362 166342 167872 168899 168612 166987 164788 163062 162433 162741 163342 163788 164087 164356 164550 164703 165133 166069
54085A66069J106O37M1N5P42J453J617J320J100J289J561J269L28l55J57J532
$$ 166069 167175 167812 167853 167908 168650 170103 171720 173040 174140 175429 176990 178259 178587 178232 178389 179921
54069A79921K384J986J087P33Q92Q95O32N62Q16J069J137J082Q55M65K86N57P93
$$ 179921 182305 184291 185378 186111 187003 187898 188530 189092 189908 190977 192114 193196 194051 194516 194802 195359 196152
54052A96152M42o9K06J334K458L115L646M203M448M544N404P452R849J1506J2181
$$ 196152 196594 196525 196731 198065 200523 203638 207284 211487 215935 220479 225883 233335 243184 254690 266871
54037B66871J2170J1578J0353Q455N698K112j258k895k622j964k110k482k099
$$ 266871 279041 290619 300972 309427 315125 317237 315979 313084 310462 308498 306388 303906 301807
54024C01807j287q81o03L54J689K270J752O80o88k293l261k571r30l63j523k788
$$ 301807 300520 299639 299036 299390 301079 303349 305101 305781 305093 302800 299539 296968 296038 295675 294152 291364
54008B91364k703k031k389l902n334n867n661n018m078l234k924k952k748k243
$$ 291364 288661 286630 284241 280339 275005 269138 263477 258459 254381 251147 248223 245271 242523 240280
53994B40280j932j956j854j405j098j417k060k325k056j739j728j760j419p19
$$ 240280 238348 236392 234538 233133 232035 230618 228558 226233 224177 222438 220710 218950 217531 216812
53980B16812q7J26j23p03j396j856j783j282q91j053j631k042j823j036j81K83
$$ 216812 216725 216851 216728 216025 214629 212773 210990 209708 208817 207764 206133 204091 202268 201232 201051 201334
53964B01334M13P13J395J879J434K66n21k55N97J254J625J991K221J915J144M80
$$ 201334 201747 202460 203855 205734 207168 207434 206913 206658 207255 208509 210134 212125 214346 216261 217405 217885
53948B17885L42P25J367J824J642Q99M21R20K144L357M334N266N867N510M275
$$ 217885 218227 218952 220319 222143 223785 224684 225105 226025 228169 231526 235860 241126 246993 252503 256778
53933B56778L122K844L360M172M870N102M699M089M090M956O082O814P111P240
$$ 256778 259900 262744 266104 270276 275146 280248 284947 289036 293126 298082 304164 310978 318089 325329
53919C25329P345P480P679P760P558P351P541P821P363O029M714M122L916L434
$$ 325329 332674 340154 347833 355593 363151 370502 378043 385864 393227 399256 403970 408092 412008 415442
53905D15442K607J655N65o10j420j643j741k097k297j819j023o51o64l59N13J502
$$ 415442 418049 419704 420269 419659 418239 416596 414855 412758 410461 408642 407619 406968 406304 405945 406458 407960
53889D07960K300L113M122N187O052O381N575L057j070o031j0873j4710j6813
$$ 407960 410260 413373 417495 422682 428734 435115 440690 443747 442677 436646 425773 411063 394250
53876C94250j7026j6063j4757j3163j0978q638p164o800o670o062n335n132n337
$$ 394250 377224 361161 346404 333241 322263 313625 306461 299661 292991 286929 281594 276462 271125
53863B71125n375n072m675m306l906l532l282k993k471j939j832k177k428k141
$$ 271125 265750 260678 256003 251697 247791 244259 240977 237984 235513 233574 231742 229565 227137 224996
53849B24996j542j242j462j734j501q62n15q84j581j912j693j268r77q84r56r98
$$ 224996 223454 222212 220750 219016 217515 216653 216138 215254 213673 211761 210068 208800 207823 206939 205983 204985
53833B04985n60N71J732J828O75n65o97J59R34J008P21N93O11M40K7l35m26l54
$$ 204985 204425 204996 206728 208556 209231 208666 207969 208128 209062 210070 210791 211384 211995 212435 212462 212127 211701 211347
53815B11347l39l21LP66J721K547L146L461L289K687K349K982M322N316N371M919
$$ 211347 211008 210687 210690 211456 213177 215724 218870 222331 225620 228307 230656 233638 237960 243276 248647 253566
53799B53566M593M488M504M725M993M711L702K821K891L484L537K930K457K336
$$ 253566 258159 262647 267151 271876 276869 281580 285282 288103 290994 294478 298015 300945 303402 305738
53785C05738J897R80N39J194K056J781K75j395k454k963l217l385l717m392n043
$$ 305738 307635 308615 309154 310348 312404 314185 314460 313065 310611 307648 304431 301046 297329 292937 287894
53770B87894n039m373l734l523l389k969k528k475k682k793k864l221l780m024
$$ 287894 282855 278482 274748 271225 267836 264867 262339 259864 257182 254389 251525 248304 244524 240500
53756B40500l636k784j825j054p39r89j503j708j367q17n23o16r19j239j449j431
$$ 240500 236864 234080 232255 231201 230462 229473 227970 226262 224895 224078 223555 222939 222020 220781 219332 217901
53740B17901j134n95J14Q55J320J217O93L37N48J038J212Q95M87M29P35J049J015
$$ 217901 216767 216172 216286 217141 218461 219678 220371 220708 221256 222294 223506 224401 224888 225317 226052 227101 228116
53723B28116N62j3k79l3N22J066J478J785J890J575Q40K4l82l6J055K445L373
$$ 228116 228678 228665 228386 228353 228875 229941 231419 233204 235094 236669 237509 237533 237151 237115 238170 240615 243988
53706B43988L316K573K081K465L313L603K806J441M90M61J128K041K974L791M159
$$ 243988 247304 249877 251958 254423 257736 261339 264145 265586 266076 266537 267665 269706 272680 276471 280630
53691B80630L776K819J890J409J296J283J273J193Q28Q0p42j226j379j499j625
$$ 280630 284406 287225 289115 290524 291820 293103 294376 295569 296397 296477 295735 294509 293130 291631 290006
53676B90006j493j064p20p88j123j309j125p02l67m12p90j107r95n95l87n34p29
$$ 290006 288513 287449 286729 285941 284818 283509 282384 281682 281315 280903 280113 279006 278011 277416 277029 276495 275766
53659B75766p27o88q09r57r37q17o78l44K73P52O11P1j28K90Q02R00P23O45N89
$$ 275766 275039 274351 273542 272585 271648 270831 270153 269809 270082 270834 271445 271516 271388 271678 272480 273380 274103 274748 275337
53640B75337K63j32M2R70J968K154J418M81J03L85Q83J175J219J232J390J625
$$ 275337 275600 275468 275510 276480 278448 280602 282020 282501 282604 282989 283872 285047 286266 287498 288888 290513
53624B90513J717J584J491J884K891M050M707M640M202L828L586L376L333L757
$$ 290513 292230 293814 295305 297189 300080 304130 308837 313477 317679 321507 325093 328469 331802 335559
53610C35559M551N053M654L591K801K862L304L276K703K343K585K796K217J207
$$ 335559 340110 345163 349817 353408 356209 359071 362375 365651 368354 370697 373282 376078 378295 379502
53596C79502R01J688K591K370R14o96j299o55M82J100P91m7q22j323j527j179
$$ 379502 380403 382091 384682 387052 387966 387270 385971 385316 385798 386898 387689 387642 386820 385497 383970 382791
53580C82791q2J244J893J654J168Q18J78j111k521l331l563l652l599l168k624
$$ 382791 382709 383953 385846 387500 388668 389486 389664 388553 386032 382701 379138 375486 371887 368719 366095
53565C66095k449k518k276j659j078o37j30K34Pn40n18K66R85J112J092J281J182
$$ 366095 363646 361128 358852 357193 356115 355478 355348 355582 355589 355049 354531 354797 355782 356894 357986 359267 360449
53548C60449N09J29R51K389L050K687K393K931L814M239M129L936M009M473N316
$$ 360449 360958 361087 362038 364427 367477 370164 372557 375488 379302 383541 387670 391606 395615 400088 405404
53533D05404O268O950P252P402P634Q055Q834J0065J1456J2494J3023J3276J3398
$$ 405404 411672 418622 425874 433276 440910 448965 457799 467864 479320 491814 504837 518113 531511
53520E31511J3376J3456J4008J4904J5528J5701J6029J7053J8571K0140K1708
$$ 531511 544887 558343 572351 587255 602783 618484 634513 651566 670137 690277 711985
53509G11985K3280K4441K4829K4781K4894K5161K5098K4609K4071K3680K3238
$$ 711985 735265 759706 784535 809316 834210 859371 884469 909078 933149 956829 980067
53498I80067K2636K1989K1243K0220J9169J8672J8758J8685J7981J7181J7094
$$ 980067 1002703 1024692 1045935 1066155 1085324 1103996 1122754 1141439 1159420 1176601 1193695
53487A193695J7678J8242J8444J8467J8311J7620J6403J5362J5161J5638J6003
$$ 1193695 1211373 1229615 1248059 1266526 1284837 1302457 1318860 1334222 1349383 1365021 1381024
53476A381024J5572J4105J1753R040O695M985L321R14k178n165p656j0042j2547
$$ 1381024 1396596 1410701 1422454 1431494 1438189 1443174 1446495 1447409 1445231 1440066 1432410 1422368 1409821
53463A409821j4561j5460j5628j5954j6549j6754j6343j5974j6244j7045j8077
$$ 1409821 1395260 1379800 1364172 1348218 1331669 1314915 1298572 1282598 1266354 1249309 1231232
53452A231232j9366k0779k1703k1761k1438k1385k1443k1031k0212j9594j9192
$$ 1231232 1211866 1191087 1169384 1147623 1126185 1104800 1083357 1062326 1042114 1022520 1003328
53441A003328j8209j6086j3158j0150p558n646m403l282j612L48J442J172O34
$$ 1003328 985119 969033 955875 945725 938167 932521 928118 924836 923224 923572 925014 926186 926820
53428I26820J248L026M802N937O914Q330J0089J1715J2913J3624J4115J5112J7303
$$ 926820 928068 931094 935896 941833 948747 957077 967166 978881 991794 1005418 1019533 1034645 1051948
53415A051948K0354K2987K4334K4888K5688K7065K8593K9947L1211L2473L3702
$$ 1051948 1072302 1095289 1119623 1144511 1170199 1197264 1225857 1255804 1287015 1319488 1353190
53404A353190L5051L6774L8780M0680M2387M4267M6514M8745N0477N1705N2722
$$ 1353190 1388241 1425015 1463795 1504475 1546862 1591129 1637643 1686388 1736865 1788570 1841292
53393A841292N3590N4174N4593N5184N5959N6379N5957N4841N3561N2234N0368
$$ 1841292 1894882 1949056 2003649 2058833 2114792 2171171 2227128 2281969 2335530 2387764 2438132
53382B438132M7574M4239M1140L8439L5464L1581K7011K2453J8222J4073R783
$$ 2438132 2485706 2529945 2571085 2609524 2644988 2676569 2703580 2726033 2744255 2758328 2768111
53371B768111N381Q19m130r433j4715j9898k5552l2192l9425m6125n1361n4855
$$ 2768111 2773492 2774311 2770181 2760748 2746033 2726135 2700583 2668391 2628966 2582841 2531480 2476625
53359B476625n6829n7770n8242n8413n7877n6308n4204n2440n1107m9453m7072
$$ 2476625 2419796 2362026 2303784 2245371 2187494 2131186 2076982 2024542 1973435 1923982 1876910
53348A876910m4607m2892m1997m1482m1097m0794m0402l9773l8961l7832l5933
$$ 1876910 1832303 1789411 1747414 1705932 1664835 1624041 1583639 1543866 1504905 1467073 1431140
53337A431140l3252l0647k8841k7322k5097k2269j9862j8152j6342j4112j2346
$$ 1431140 1397888 1367241 1338400 1311078 1285981 1263712 1243850 1225698 1209356 1195244 1182898
53326A182898j1731j1690j1501j1568j2509j3609j3442j1857j0156r204q468p227
$$ 1182898 1171167 1159477 1147976 1136408 1123899 1110290 1096848 1084991 1074835 1065631 1057163 1049936
53314A049936n666m328l128j628J99J997L569M822N557N813O208P415R344J1316
$$ 1049936 1044270 1039942 1036814 1035186 1035385 1037382 1040951 1045773 1051330 1057143 1063351 1070766 1080110 1091426
53300A091426J2945J4425J5979J7557J9175K1026K3037K4661K5551K6172K7278
$$ 1091426 1104371 1118796 1134775 1152332 1171507 1192533 1215570 1240231 1265782 1291954 1319232
53289A319232K8802K9693K9044K7113K4933K3093K1345J9405J7660J6561J5621
$$ 1319232 1348034 1377727 1406771 1433884 1458817 1481910 1503255 1522660 1540320 1556881 1572502
53278A572502J3620J0010N668J947p53l142n979r291j2555j5267j7212j8519j9601
$$ 1572502 1586122 1596132 1601800 1603747 1602994 1599852 1593873 1584582 1572027 1556760 1539548 1521029 1501428
53265A501428k0932k2647k4394k5651k6216k6384k6738k7647k8911k9915l0193
$$ 1501428 1480496 1457849 1433455 1407804 1381588 1355204 1328466 1300819 1271908 1241993 1211800
53254A211800k9833k9251k8733k8319k7957k7477k6591k5273k4147k4004k4794
$$ 1211800 1181967 1152716 1123983 1095664 1067707 1040230 1013639 988366 964219 940215 915421
53243I15421k5487k5134k3812k2258k0930j9815j8948j8560j8631j8612j7876
$$ 915421 889934 864800 840988 818730 797800 777985 759037 740477 721846 703234 685358
53232F85358j6282j4243j2287j0631r173p850o925o715p136p692q079q503r240
$$ 685358 669076 654833 642546 631915 622742 614892 607967 601252 594116 586424 578345 569842 560602
53219E60602j0141j0908j1589j2390j3111j3241j2658j1797j1024j0249r319q401
$$ 560602 550461 539553 527964 515574 502463 489222 476564 464767 453743 443494 434175 425774
53207D25774p702p149o607o182o020n992n877n743n794o033o261o398o446o246
$$ 425774 418072 410923 404316 398134 392114 386122 380245 374502 368708 362675 356414 350016 343570 337324
53193C37324n680n018m766m992n192m891m181l447k852k324j890j697j699j600
$$ 337324 331644 326626 321860 316868 311676 306785 302604 299157 296305 293981 292091 290394 288695 287095
53179B87095j252r57j155j813k311k167j684j618k089k306j651o57l40p75j007
$$ 287095 285843 284886 283731 281918 279607 277440 275756 274138 272049 269743 268092 267435 267095 266320 265313
53164B65313n30n3l81j130j282o90k23m14p78o55j61J30l2m74r94j431j591j468
$$ 265313 264783 264730 264349 263219 261937 261247 261024 260610 259832 259177 259016 259146 259114 258640 257646 256215 254624 253156
53146B53156j359j391j207n99k17q61k107k514j459k9M42J27K11J090J919J965
$$ 253156 251797 250406 249199 248600 248383 247522 245415 242901 241442 241413 241855 241982 242193 243283 245202 247167
53130B47167J543J311J266R15J23o56r00n01K38Q48J064R78Q38P02M95L43M66
$$ 247167 248710 250021 251287 252202 252325 251669 250769 250268 250506 251354 252418 253396 254234 254936 255431 255774 256240
53113B56240P25N80j83j068j520j613j732j833j579j110j103j818k596k609j852
$$ 256240 256965 257545 257362 256294 254774 253161 251429 249596 248017 246907 245804 243986 241390 238781 236929
53098B36929j068p91p67m31K56P01L94m01q89o46pM63O33P35Q97J004R37O46J07
$$ 236929 235861 235070 234303 233872 234128 234829 235223 234822 233933 233287 233280 233743 234376 235111 236008 237012 237949 238595 238702
53079B38702n23q15m73K22N93K64n64j426j924j794j047q9O16J026J336J403Q84
$$ 238702 238179 237364 236891 237113 237706 237970 237406 235980 234056 232262 231215 231126 231742 232768 234104 235507 236391
53062B36391Mm18o1L65J20m98o56k74o7l74o68m49k2j9m52p16m00K58P80R10N91
$$ 236391 236395 235977 235916 236281 236401 235903 235247 234973 234906 234532 233864 233415 233393 233374 232922 232206 231806 232064 232844 233754 234345
53041B34345k18j365k237k158j250n12p09j336j220j12R33R33J98k85k45l11q72
$$ 234345 234127 232762 230525 228367 227117 226605 225896 224560 223340 223228 224161 225094 225292 225007 224762 224451 223579
53024B23579j404j170j80Q26J183Q49K62j45j85R9N29P88O32J99k8J55K83j03
$$ 223579 222175 221005 220825 221651 222834 223683 223945 223800 223615 223714 224243 225031 225663 225862 225834 225989 226272 226169
53006B26169n69k14Q91J455O07q52j486j074n53l90n8Q01J589J620J075N93L52
$$ 226169 225600 225386 226277 227732 228339 227487 226001 224927 224374 223984 223926 224727 226316 227936 229011 229604 229956
52989B29956J14j76l18k69j40P3L83N36K30l78p48n59M6Q17J650K382K722K627
$$ 229956 230070 229894 229576 229307 229167 229240 229623 230159 230389 230011 229263 228704 228750 229567 231217 233599 236321 238948
52971B38948K496K672K875K516J601R07R97J447J401P41J85J90L18k9o91j097
$$ 238948 241444 244116 246991 249507 251108 252015 253012 254459 255860 256601 256786 256976 257294 257265 256574 255477
52955B55477j148j210j387j431j412j734k292k281j306j90j08j113k135k307j790
$$ 255477 254329 253119 251732 250301 248889 247155 244863 242582 241276 241086 240978 239865 237730 235423 233633
52940B33633j195p47k91J90M28K03l58q65r52n13K06P01N18l92j527k156j924
$$ 233633 232438 231691 231400 231590 232018 232221 231863 230998 230046 229533 229739 230440 230958 230566 229039 226883 224959
52923B24959j131l56Q6K27J68N7J94Q02J558J769J163J94o19j270j884k115j496
$$ 224959 223828 223472 223558 223785 223953 224010 224204 225006 226564 228333 229496 229690 229071 227801 225917 223802 222306
52906B22306k77O04N27j82p57p91m07J23O37J023J151R58N59J98L5L4J25L83Q57
$$ 222306 222029 222633 223160 222978 222221 221430 221023 221146 221783 222806 223957 224915 225474 225672 225707 225741 225866 226249 227106
52887B27106J257J140N18m4n6L43O61O14J47o77j448j424l53Q91J116K70m41k8
$$ 227106 228363 229503 230021 229977 229921 230264 230925 231539 231686 231009 229561 228137 227784 228675 229791 230061 229620 229592
52869B29592J271K499L022K816K256J904K142K719K959K623K146J801J190M6j018
$$ 229592 230863 233362 236384 239200 241456 243360 245502 248221 251180 253803 255949 257750 258940 258986 257968
52854B57968j233q62q99j706k667l213l484l717l639k986k161j858k088k164j604
$$ 257968 256735 255873 254974 253268 250601 247388 243904 240187 236548 233562 231401 229543 227455 225291 223687
52839B23687p77l58m58n83m25k85n13q36o87p5L74L64L30O25R01P42M12L36K27
$$ 223687 222910 222552 222094 221511 221086 220801 220288 219452 218765 218690 219064 219428 219758 220383 221284 222026 222438 222774 223001
52820B23001m29j271j362o43r9k66n47m07k82n92o78K80J820K777L008L414M232
$$ 223001 222572 221301 219939 219296 219197 218931 218384 217977 217695 217103 216425 216705 218525 221302 224310 227724 231956
52803B31956M427L173R89j066k583l621l969l437k594k308k593k557j714p33n57
$$ 231956 236383 239556 240545 239479 236896 233275 229306 225869 223275 220967 218374 215817 214103 213370 212813
52788B12813j164j674j478q37l03k7K13M98O86P16P46Q77R58Q23O06O28J001J436
$$ 212813 211649 209975 208497 207660 207357 207330 207543 208041 208727 209443 210189 211066 212024 212847 213453 214081 215082 216518
52770B16518J482R56J67l52l99l19m98q20q83o71n35n41l53L7J20k79n36k28L8
$$ 216518 218000 218956 219123 218771 218372 218053 217555 216735 215852 215181 214646 214105 213752 213789 213909 213630 213094 212866 212904
52751B12904m29j019m74J193K443K159R26M4L5N75J210J633J708J700K023K453
$$ 212904 212475 211456 210982 212175 214618 216777 217703 217747 217782 218357 219567 221200 222908 224608 226631 229084
52735B29084K205J205N39R61J657J399M44J43R22J790J934J596J190N07n53j331
$$ 229084 231289 232494 233033 233994 235651 237050 237494 237637 238559 240349 242283 243879 245069 245576 245023 243692
52719B43692j203n61l15p34j327j621j584j358j066q73r11j103j294j447j524
$$ 243692 242489 241928 241613 240879 239552 237931 236347 234989 233923 233050 232139 231036 229742 228295 226771
52704B26771j334p68j00K60K26L4j67m12o37o65n22m18k84L01J462K508K575J628
$$ 226771 225437 224669 224569 224829 225055 225089 224922 224510 223873 223208 222686 222268 221984 222285 223747 226255 228830 230458
52686B30458N18O7L72J033J579J545O53p43j707j658j029o26o17n97m51l86k65
$$ 230458 230976 231043 231415 232448 234027 235572 236225 235482 233775 232117 231088 230462 229845 229248 228797 228411 228146
52669B28146L29J193J511J024M42L63M49K48P2L82Q95J068J062J367J843K002
$$ 228146 228475 229668 231179 232203 232645 233008 233457 233705 233777 234159 235054 236122 237184 238551 240394 242396
52653B42396J949K174K589K692K616K913L322K778R61j146k595l460m046m040
$$ 242396 244345 246519 249108 251800 254416 257329 260651 263429 264390 263244 260649 257189 253143 249103
52639B49103l134j830r24n68l69p0L64Q85J175P57k43q76m47N90J323J529J554
$$ 249103 245969 244139 243215 242647 242278 242208 242572 243457 244632 245389 245146 244270 243823 244413 245736 247265 248819
52622B48819J422P90l39j481k140k024j061L09J084O09n70j281j073m81j31j59
$$ 248819 250241 251031 250692 249211 247071 245047 243986 244295 245379 245988 245418 244137 243064 242583 242452 242293
52606B42293m70q89j050o70j9L22K66K66N30P19N76L61M26P17R17Q62O20L48K13
$$ 242293 241823 240934 239884 239214 239195 239517 239783 240049 240579 241298 241874 242235 242661 243378 244295 245157 245777 246125 246338
52587B46338K36K06m0k97j56M52J180J686J823J505P74O6n3L82O54K68m00o06
$$ 246338 246574 246780 246740 246443 246287 246739 247919 249605 251428 252933 253707 253773 253720 254102 254756 255024 254624 254018
52569B54018k05K45K60m9l13n01r16j574j920j446m41K55L10K17M40O73M08k13
$$ 254018 253813 254058 254318 254269 253956 253455 252539 250965 249045 247599 247158 247413 247723 247940 248380 249053 249461 249248
52551B49248o14o42o63r08j163j152q34l48M6P5j77k01L02R18J058P54M19J25
$$ 249248 248634 247992 247329 246421 245258 244106 243272 242924 242970 243045 242868 242667 242969 243887 244945 245699 246118 246243
52533B46243k57m14R6R22J182P12K81L58M81J81k92n69p72j055j074n52J44N43
$$ 246243 245986 245572 245668 246590 247772 248484 248765 249123 249604 249785 249493 248924 248152 247097 246023 245471 245615 246158
52515B46158Q11J362K083K534K684K883L179L221K823K220J781J674J769J706
$$ 246158 246969 248331 250414 252948 255632 258515 261694 264915 267738 269958 271739 273413 275182 276888
52501B76888J171K70n66j207j973l027l976m389m337m011l225j825l27M99N79
$$ 276888 278059 278329 277763 276556 274583 271556 267580 263191 258854 254843 251618 249793 249466 249965 250544
52486B50544N14O79Q74R25J071J447J606R11o26k063k234q52J078K155J972J356
$$ 250544 251058 251737 252611 253536 254607 256054 257660 258571 257945 255882 253648 252796 253874 256029 258001 259357
52470B59357J147J180Q42K75L49J439K810L439L161K753K971L656L861K902J160
$$ 259357 260504 261684 262526 262801 263150 264589 267399 270838 273999 276752 279723 283379 287240 290142 291302
52455B91302l34j081j498k086k728l116l410l937m466m306l163j468M5Q59Q56
$$ 291302 290968 289887 288389 286303 283575 280459 277049 273112 268646 264340 261177 259709 259754 260613 261469
52440B61469L45j94n98j083j669j937j709j501j745j950j413m82j62n87q10k65
$$ 261469 261814 261620 261022 259939 258270 256333 254624 253123 251378 249428 248015 247533 247371 246784 245974 245709
52424B45709N21J048J651K612L234K654J212J90L07J100J713J757J390J044J192
$$ 245709 246230 247278 248929 251541 254775 257429 258641 258831 259138 260238 261951 263708 265098 266142 267334
52409B67334K043L281M345N082N934P412R412J1183J1870J1121R124O189K460
$$ 267334 269377 272658 277003 282085 288019 295431 304843 316026 327896 339017 348141 354330 356790
52396C56790j750n585q050q919q899q682q185p010n254l454j883m78N26N40n17
$$ 356790 355040 349455 341405 332486 323587 314905 306720 299710 294456 291002 289119 288641 289167 289707 289190
52381B89190j664j659l73J080J617J345J178J554J990J919J536J450J823K359
$$ 289190 287526 285867 285494 286574 288191 289536 290714 292268 294258 296177 297713 299163 300986 303345
52367C03345K996L957N047N475M782L546K635K021R17r04k512k792j695k32O18
$$ 303345 306341 310298 315345 320820 325602 329148 331783 333804 334721 333817 331305 328513 326818 326586 327204
52352C27204P32O61Q91J294J272M07r13j650j033N99K083K595K386K271K648L242
$$ 327204 327936 328597 329488 330782 332054 332461 331548 329898 328865 329464 331547 334142 336528 338799 341447 344689
52336C44689L711M090M580N188N794O357O893P427Q079R018J0102J0884J1225
$$ 344689 348400 352490 357070 362258 368052 374409 381302 388729 396808 405826 415928 426812 438037
52323D38037J1651J2726J4156J5063J5069J4688J4481J4406J4169J3830J3644
$$ 438037 449688 462414 476570 491633 506702 521390 535871 550277 564446 578276 591920
52312E91920J3579J3417J3177J3169J3542J4025J4186J3884J3429J3290J3548
$$ 591920 605499 618916 632093 645262 658804 672829 687015 700899 714328 727618 741166
52301G41166J3713J3268J2323J1407J0635R608Q264P210O695N863L738P47j663
$$ 741166 754879 768147 780470 791877 802512 812120 820384 827594 834289 840152 843890 844637 842974
52288H42974k861l603m586n384n406n096n270n721n508m514l689l511l153j750
$$ 842974 840113 836510 831924 826540 821134 816038 810768 805047 799539 795025 791336 787825 784672 782922
52274G82922K56J774K560L257M143M820N221O095P932J0031J1161J0957J0100
$$ 782922 783178 784952 787512 790769 794912 799732 804953 811048 818980 829011 840172 851129 861229
52261H61229R349Q891Q669Q801R404J0289J1085J1613J1946J2177J2238J1995
$$ 861229 870578 879469 888138 896939 906343 916632 927717 939330 951276 963453 975691 987686
52249I87686J1436J0676R729Q379O419M013J608o06k854n191o999p492o735n779
$$ 987686 999122 1009798 1019527 1027906 1034325 1038338 1039946 1039340 1036486 1031295 1024296 1016804 1010069 1004290
52235A004290n588o095o594o827p201p906q278p563o115n237n623o444o399n360
$$ 1004290 998702 992607 986013 979186 971985 964079 955801 948238 942123 936886 931263 924819 918420 913060
52221I13060m317l883l579k790j710q90l66K08Q68J371J774K464L620N040O366
$$ 913060 908743 904860 901281 898491 896781 895891 895525 895733 896601 897972 899746 902210 905830 910870 917236
52206I17236P144O853N431L720K869L179L919M319M217L754L062K487K550L299
$$ 917236 924380 931233 936664 940384 943253 946432 950351 954670 958887 962641 965703 968190 970740 974039
52192I74039M083M333M276M478M971N260N062M553L947L139J936L94j173k569
$$ 974039 978122 982455 986731 991209 996180 1001440 1006502 1011055 1015002 1018141 1020077 1020471 1019298 1016729
52178A016729l998n858q046r707j0008r093p926p148o588n933n281m716l905k688
$$ 1016729 1012731 1006873 998827 989120 979112 970019 962093 954945 948357 942424 937143 932427 928522 925834
52164I25834j570j038o48M51K191L449L425K562J878J787J951J928J620J140O50
$$ 925834 924264 923226 922578 923029 925220 928669 932094 934656 936534 938321 940272 942200 943820 944960 945610
52149I45610L56M63R99J673K008J692Q82J04k27r8K11M34L62k01j216k161k295
$$ 945610 945966 946429 947428 949101 951109 952801 953683 953787 953560 953462 953673 954107 954469 954268 953052 950891 948596
52132I48596j341K05J609K638L646N000O650Q429J0545J3358J6643J9482K1267
$$ 948596 947255 947460 949069 951707 955353 960353 967003 975432 985977 999335 1015978 1035460 1056727
52119A056727K2457K3819K5109K5307K4244K3161K3074K3326K2510K0431J8209
$$ 1056727 1079184 1103003 1128112 1153419 1177663 1200824 1223898 1247224 1269734 1290165 1308374
52108A308374J6535J4836J2424R690P584O457N940N622N347N003M569M338M609
$$ 1308374 1324909 1339745 1352169 1361859 1369443 1375900 1381840 1387462 1392809 1397812 1402381 1406719 1411328
52095A411328N086M931L631J510p58k933n331q255j1606j4897j7492j8830j8697
$$ 1411328 1416414 1421345 1424976 1426486 1425728 1422795 1417464 1409209 1397603 1382706 1365214 1346384 1327687
52082A327687j7443j5703j3802j1566q855o078l910k537j537m87O25J717K962
$$ 1327687 1310244 1294541 1280739 1269173 1260318 1254240 1250330 1247793 1246256 1245769 1246394 1248111 1251073
52069A251073M522O181P581Q701R813J0952J1758J1912J1468J0666R676Q660P925
$$ 1251073 1255595 1261776 1269357 1278058 1287871 1298823 1310581 1322493 1333961 1344627 1354303 1362963 1370888
$$ [...]
##END NTUPLES=NMR SPECTRUM
##END=
