
##TITLE=UV1253_M10_1340-1211_50_7409617_D8Safu9aF7
##JCAMPDX= 6.0         $$ Bruker NMR JCAMP-DX V2.0
##DATA TYPE= NMR SPECTRUM
##DATA CLASS= NTUPLES
##ORIGIN= BRUKER
##OWNER= Administrator
$$ 1.72 TOPSPIN		Version 2.1
$$ 2013-01-24 18:04:16.740 -0500  Administrator@X
$$ Compression mode = diff/dup
##.OBSERVE FREQUENCY= 400.02188249412
##.OBSERVE NUCLEUS= ^1H
##.ACQUISITION MODE= SIMULTANEOUS (DQD)
##.ACQUISITION SCHEME= undefined
##.AVERAGES= 8
##.DIGITISER RES= 22
##SPECTROMETER/DATA SYSTEM= spect
##.PULSE SEQUENCE= zg30
##.SOLVENT NAME= COFFEE_meoh
##.SHIFT REFERENCE= INTERNAL, COFFEE_meoh, 1, 14.98509
##AUDIT TRAIL= $$ (NUMBER, WHEN, WHO, WHERE, PROCESS, VERSION, WHAT)
$$ ##TITLE= Audit trail, TOPSPIN		Version 2.1
$$ ##JCAMPDX= 5.01
$$ ##ORIGIN= Bruker BioSpin GmbH
$$ ##OWNER= Administrator
$$ $$ E:\/data/COFFEE/nmr/UV1253_M10_1340-1211_50_7409617_D8Safu9aF7/10/pdata/1/auditp.txt
$$ ##AUDIT TRAIL=  $$ (NUMBER, WHEN, WHO, WHERE, PROCESS, VERSION, WHAT)
(   1,<2013-01-24 18:04:08.833 -0500>,<Administrator>,<X>,<go>,<TOPSPIN 2.1>,
      <created by zg
	started at 2013-01-24 18:03:01.927 -0500,
	POWCHK enabled, PULCHK disabled,
       configuration hash MD5:
       86 BA 57 50 F2 9D 5C 9B 26 00 A9 28 5F 66 2E 89
       data hash MD5: 64K
       35 3A AF CA B4 31 3A 5D FD 23 91 21 48 74 B1 49>)
(   2,<2013-01-24 18:04:11.943 -0500>,<Administrator>,<X>,<proc1d>,<TOPSPIN 2.1>,
      <Start of raw data processing
       efp LB = 0 FT_mod = 6 PKNL = 1 PHC0 = 0 PHC1 = 0 SI = 32K 
       data hash MD5: 32K
       29 BC 5A 4E 0B 84 BE C7 5E 6A 1C F2 6F 52 2B 5A>)
(   3,<2013-01-24 18:04:12.396 -0500>,<Administrator>,<X>,<proc1d>,<TOPSPIN 2.1>,
      <pk PHC0 = 102.3541 PHC1 = 0 
       data hash MD5: 32K
       73 91 89 63 29 11 77 90 7E 7A F7 83 9F 2D 27 9B>)
(   4,<2013-01-24 18:04:12.615 -0500>,<Administrator>,<X>,<proc1d>,<TOPSPIN 2.1>,
      <abs ABSG = 1 
       data hash MD5: 32K
       86 D1 06 D4 26 51 B0 A3 4E 0B A3 7E C1 1B 34 4C>)
(   5,<2013-01-24 18:04:12.755 -0500>,<Administrator>,<X>,<proc1d>,<TOPSPIN 2.1>,
      <abs ABSG = 2 
       data hash MD5: 32K
       0F 79 9A 2B 8E 11 A4 CD F0 9E 93 D2 78 71 F0 58>)
(   6,<2013-01-24 18:04:12.911 -0500>,<Administrator>,<X>,<proc1d>,<TOPSPIN 2.1>,
      <abs ABSG = 3 
       data hash MD5: 32K
       D2 0C B9 E3 09 E4 55 A4 5B F2 9B 07 4C EA 39 51>)
(   7,<2013-01-24 18:04:13.052 -0500>,<Administrator>,<X>,<proc1d>,<TOPSPIN 2.1>,
      <abs ABSG = 4 
       data hash MD5: 32K
       1E 08 4A 41 F6 EC 23 40 3A 4F AE A9 41 BA 72 F9>)
(   8,<2013-01-24 18:04:13.208 -0500>,<Administrator>,<X>,<proc1d>,<TOPSPIN 2.1>,
      <abs ABSG = 5 
       data hash MD5: 32K
       49 24 C1 36 5E FC D0 B0 CC 8F 90 D5 50 7B 68 95>)
$$ ##END=
$$ 
$$ $$ hash MD5
$$ $$ A6 E5 16 4D 1F B9 D3 2B AC 37 50 F9 4A 78 07 04
##$RELAX= 
##$RELAX= 
##$RELAX= 
##$RELAX= 
##$RELAX= 
##$RELAX= 
##$RELAX= 
$$ Bruker specific parameters
$$ --------------------------
##$DU= <E:\>
##$EXPNO= 10
$$ [...]
150 150 150 150 150 150 150 150
##$TP07= 0
##$TPNAME0= <>
##$TPNAME1= <>
##$TPNAME2= <>
##$TPNAME3= <>
##$TPNAME4= <>
##$TPNAME5= <>
##$TPNAME6= <>
##$TPNAME7= <>
##$TPOAL= (0..7)
0.5 0.5 0.5 0.5 0.5 0.5 0.5 0.5
##$TPOFFS= (0..7)
0 0 0 0 0 0 0 0
##$TUNHIN= 0
##$TUNHOUT= 0
##$TUNXOUT= 0
##$USERA1= <user>
##$USERA2= <user>
##$USERA3= <user>
##$USERA4= <user>
##$USERA5= <user>
##$V9= 5
##$VALIST= <valist>
##$VCLIST= <CCCCCCCCCCCCCCC>
##$VD= 0
##$VDLIST= <DDDDDDDDDDDDDDD>
##$VPLIST= <PPPPPPPPPPPPPPP>
##$VTLIST= <TTTTTTTTTTTTTTT>
##$WBST= 1024
##$WBSW= 4
##$XGAIN= (0..3)
0 0 0 0
##$XL= 0
##$YL= 0
##$YMAX_a= 680632
##$YMIN_a= -580921
##$ZGOPTNS= <>
##$ZL1= 120
##$ZL2= 120
##$ZL3= 120
##$ZL4= 120
##$ABSF1= 14.98509
##$ABSF2= -5.573092
##$ABSG= 5
##$ABSL= 3
##$ALPHA= 0
##$AQORDER= 0
##$ASSFAC= 0
##$ASSFACI= 0
##$ASSFACX= 0
##$ASSWID= 0
##$AUNMP= <proc_prof1d_extract_pilot.lims>
##$AXLEFT= 0
##$AXNAME= <>
##$AXNUC= <1H>
##$AXRIGHT= 0
##$AXTYPE= 0
##$AXUNIT= <>
##$AZFE= 0.1
##$AZFW= 0.1
##$BCFW= 0
##$BC_mod= 0
##$BYTORDP= 0
##$COROFFS= 0
##$CY= 15
##$DATMOD= 1
##$DC= 0
##$DFILT= <>
##$DTYPP= 0
##$F1P= 0
##$F2P= 0
##$FCOR= 0.5
##$FTSIZE= 32768
##$FT_mod= 6
##$GAMMA= 0
##$GB= 0
##$INTBC= 1
##$INTSCL= 1
##$ISEN= 128
##$LB= 0
##$LEV0= 0
##$LPBIN= 0
##$MAXI= 10000
##$MC2= 0
##$MEAN= 0
##$ME_mod= 0
##$MI= 0
##$NCOEF= 0
##$NC_proc= -8
##$NLEV= 6
##$NOISF1= 0
##$NOISF2= 0
##$NSP= 0
##$NTH_PI= 0
##$NZP= 0
##$OFFSET= 14.98509
##$PC= 1
##$PHC0= 102.3541
##$PHC1= 0
##$PH_mod= 1
##$PKNL= yes
##$PPARMOD= 0
##$PPDIAG= 0
##$PPIPTYP= 0
##$PPMPNUM= 2147483647
##$PPRESOL= 1
##$PSCAL= 4
##$PSIGN= 0
##$PYNMP= <proc.py>
##$REVERSE= no
##$SF= 400.02
##$SI= 32768
##$SIGF1= 0
##$SIGF2= 0
##$SINO= 400
##$SIOLD= 32768
##$SPECTYP= <>
##$SREGLST= <1H.CDCl3>
##$SSB= 0
##$STSI= 32768
##$STSR= 0
##$SW_p= 8223.68421052631
##$SYMM= 0
##$S_DEV= 0
##$TDeff= 65536
##$TDoff= 0
##$TI= <>
##$TILT= no
##$TM1= 0
##$TM2= 0
##$TOPLEV= 0
##$USERP1= <user>
##$USERP2= <user>
##$USERP3= <user>
##$USERP4= <user>
##$USERP5= <user>
##$WDW= 1
##$XDIM= 32768
##$YMAX_p= 473606487
##$YMIN_p= -729741
##$CURPLOT= <Network HP LaserJet P1505>
##$CURPRIN= <$Network HP LaserJet P1505>
##$DFORMAT= <normdp>
##$LAYOUT= <+/1D_H.xwp>
##$LFORMAT= <normlp>
##$PFORMAT= <normpl>
##$SURQMSG= 1
$$ End of Bruker specific parameters
$$ ---------------------------------
##NTUPLES= NMR SPECTRUM
##VAR_NAME=  FREQUENCY,     SPECTRUM/REAL,   SPECTRUM/IMAG
##SYMBOL=    X,             R,               I
##VAR_TYPE=  INDEPENDENT,   DEPENDENT,       DEPENDENT
##VAR_FORM=  AFFN,          ASDF,            ASDF
##VAR_DIM=   32768,         32768,           32768
##UNITS=     HZ,            ARBITRARY UNITS, ARBITRARY UNITS
##FACTOR=    0.250966925370066, 1,           1
##FIRST=     8223.43324360094, 31501,        -95612
##LAST=      0,             94622,           -183928
##MIN=       0,             -729741,         0
##MAX=       8223.43324360094, 473606487,    0
$$ Real data points
##PAGE= N=1
##DATA TABLE= (X++(R..R)), XYDATA
$$ [...]
23846 -132831 -231410 -209121 -119138 126182 -192870 -171987 258882 -218453 18672 56669 -144010
23834 29938 -164912 -169155 58873 8367 -219791 243730 83363 -182666 159767 -105183 -7474
23822 -252520 5235 -207211 44829 105163 -57761 125855 164269 135869 12666 350331 -28774
23810 -191540 288628 -44258 -121717 118944 39989 -42961 88849 42963 249227 35131 -27845
23798 -192979 -180135 138204 31910 201659 -184603 283122 -79809 -177609 224893 -354828
23787 7377 -43392 -205257 17057 -35083 39818 11038 -11049 405914 -327004 -151118 65630
23775 -587229 66209 -83496 -94913 -6584 -55601 -44159 -185242 208440 31126 -287050 209296
23763 24500 60039 -112543 -111603 114593 -128272 281041 589749 -97499 104223 149213 183975
23752 183975 154831 118628 15184 -277749 -214672 -11156 -7180 20645 143482 -302978 -181075
23741 -181075 17156 210081 -22049 -87171 59241 -238170 -6525 -471565 -24089 147834 -295230
23729 -60349 -203002 167818 27451 -33471 -249137 108088 140073 8394 -134263 42675 -19001
23717 -80078 -150816 -55636 -266342 -170662 -47058 -75389 67792 26428 -144003 -177296 234291
23705 -13708 -3603 25009 -345918 234322 -150111 -152374 28922 -130816 -28303 -464841 -87772
23693 26220 -34781 128801 270099 -195601 239433 151691 -141086 -177544 -114083 1237 -229904
23681 290473 261174 -23886 27341 -158330 -29830 -75890 119314 -42821 -159136 242031 9207
23669 331754 96928 12945 147976 100687 209761 -27213 106423 3725 29892 -75045 366555
23657 204770 165381 18994 355421 12168 -445853 -49179 168811 -67713 4467 -495795 -354025
23646 -354025 3954 28509 -124299 -50554 392251 -150523 -63613 -17478 75931 -91792 203014
23634 38059 91296 1680 -213694 -247544 173960 -183695 73446 20934 -109339 189627 202119
23623 202119 -112079 -112570 229264 -142736 58474 54760 -264727 -66345 68358 -387100 2515
23611 394333 97642 -186292 -135957 -230894 -262757 -27095 365094 -56157 26276 126934 -74735
23599 -115900 -108431 -40050 -351048 144109 4855 27573 -213021 -124062 -91448 -103275 4667
23587 -34690 146637 158107 387111 -184919 -113490 50398 -105603 -5750 -310010 116792 -11099
23575 147733 77769 -126921 -396917 257570 -29951 -297782 11027 -239731 58415 212887
23565 212887 351688 343682 -276473 -51204 78322 -53150 75836 242432 82321 111749 37335
23553 100 102048 136138 1012 57976 70590 -187098 403977 207113 -276676 -50549 98725
23541 -66674 -56573 128920 -30543 -133145 -173836 -215197 -215187 -61196 47320 -187893 96950 -65217
23528 -47198 39606 368446 -61065 45848 -317565 -16468 333487 -106867 -179145 -20244 -20215
23517 -20215 -152346 13875 -45805 -186048 216456 -35646 290372 -75895 -192204 207478
23506 76368 -295899 256277 -244640 -84698 64334 360701 -302503 267780 -138730 187825
23495 -38187 -331455 66277 17369 190733 112616 312658 -151147 14526 62729 147804 -144364
23483 -105662 108617 55465 40653 -181201 -191979 -338422 26566 -159491 -180164 -118653 -84476
23472 -84476 27160 92562 -24808 25646 -184884 22241 265809 -187911 -33379 161636 -13351
23460 -51532 10937 -198929 -243106 -167360 64488 -177152 -84022 41953 64569 247164 174249
23449 174249 -89649 -31558 -104734 139353 157333 -275418 -79666 -79192 -88057 304345 -335002
23437 150080 -94809 34534 24845 -94377 -173450 -187456 -91887 -206253 -63863 -160809 -197302
23426 -197302 -190805 -207053 -135009 -27143 -80109 -197770 96239 249579 12356 77610 173285
23415 173285 242425 -17992 -89405 -71931 52549 -31026 -360539 47465 26840 187395 -245801
23403 -203450 30626 28325 50932 -319256 52992 -15085 35043 72598 -227710 -471587 -28536
23391 -91273 -111153 153633 -235220 154613 -92169 -179948 77636 -293833 -8981 -215097 60049
23379 -146023 252859 -244514 -94767 140006 -250237 134557 -241722 70069 165983 76199
23368 -16060 -7711 141156 -14886 -106308 -40580 -128010 -82779 243734 125370 84390 24959
23356 69350 2660 -70813 -76791 145050 141618 143349 -152242 -259538 -16245 -67605 16307 151707
23344 151707 76859 21585 94969 190432 172964 -393838 -232811 -49604 2989 149174 -165250
23332 191813 -271932 -30789 153259 -60270 -257925 -30439 -243627 173406 -273039 -482021
23322 -482021 -337953 -120636 -11821 48883 -155699 143945 -190235 -21766 27292 128830
23312 128830 -294450 118478 27623 -43692 56234 124344 138688 -28430 -38894 -18499 173883
23300 135686 67008 -135299 46048 298813 193278 -119053 -87203 73036 -17490 -16356 115512
23288 257631 -471269 -37829 -108795 -144760 144774 -100932 -250603 -136549 -156017 -351020
23278 -351020 121628 155417 48176 357926 -35491 -99812 -130780 -340388 142701 -44731 115368
23266 -53902 -91189 47953 -45226 511 -57504 96053 -93592 153332 -89507 -67613 -335934 -278431
23254 -278431 48822 -466961 1089 -134021 226215 -405872 233212 -141404 -107760 215871
23243 -267448 -353593 129562 -263106 139442 149698 48010 -53717 -57579 -123303 -170495 153676
23231 -63839 -266736 -30556 27808 77986 -96536 173485 -226857 -93749 -190562 -218992 -263140
23220 -263140 351765 226386 142929 -224495 258236 49070 -96680 -56596 -164255 -183892
23210 -183892 41342 91478 -118777 -18326 99097 -228614 -185690 -306643 -238226 -159163 -242515
23199 -242515 -60515 -11311 113550 -227604 -114742 -155064 181364 126301 -99141 -38965 -70731
23188 -70731 -148532 -82692 307100 -19815 70051 -202240 152465 -234177 87124 -202963 28389
23176 -140053 -202384 74752 -15941 -22246 -59477 29440 4253 8654 55821 -164616 57604 339328
23164 339328 191759 -394899 -361445 -151307 29227 115275 -141473 52682 -371343 374600
23153 16711 -83146 -245606 -108866 111125 -78452 -301343 350158 502143 -38636 180868
23142 18145 212775 43059 -276073 -199990 131333 -122677 45285 5208 22579 -158019 -150479
23131 -150479 -151093 -78634 -287680 129691 264993 206201 40865 -171024 240546 -58052 85625
23119 82694 72628 70415 355182 136142 122361 2322 -284033 -170964 15600 365636 5820
23107 55186 -120142 46315 -95191 -198856 165819 -1682 37885 -66677 157584 -117080 -34543
23095 1614 -28119 -180623 -22122 48486 -46299 30359 -91495 181698 -79969 -176180 -106952
23084 -106952 134071 -274759 75109 36810 267950 -186329 -308781 6347 -128312 -162343
23074 -162343 -299465 51895 111869 -191331 -141611 115145 106546 -95102 -283577 -27081 -49356
23063 -49356 142779 -226808 106217 -68390 -61431 317399 1998 -165270 -79527 132537 -238830
23051 -110857 56346 -60254 147892 174767 73992 -49468 69630 164538 37316 21496 -96674
23039 -147406 -331664 6936 -217095 -222689 85377 206805 -120149 23267 -57590 401275 -14320
23027 -24853 -214372 2570 96635 147550 46338 85099 12103 54992 213922 -111502 -56971
23016 -56971 -230818 -182654 -106624 245664 15913 84091 150280 -78078 -6558 -401292 -6627
23004 -384519 -104650 159355 140042 356617 -209075 -88583 -267873 -10629 39543 141129
22994 141129 -179762 -252738 -348167 -280617 67397 -50989 -195134 8446 -261641 196088 -37386
22982 -68947 -13120 -207599 215128 192084 287044 -36975 -199753 66556 455169 -367275 -31932
22970 -71854 73631 -28713 -299572 -224673 -198036 -12469 504327 -30294 -33568 25274 -14390
22958 98238 5354 264919 67502 -73140 252859 -369461 -346427 6644 143710 37536 127991
22947 127991 -144815 -135786 -186993 269291 -224160 126974 -66424 37240 -96941 -25856 -24013
22936 -24013 -133418 9565 -15746 -6149 -103093 116463 -108616 -91024 -148526 28724 177790
22925 177790 -152993 12742 75828 -241514 -57880 329506 -202125 -352125 30671 71458
22915 71458 -116364 -408377 -264960 130520 7762 -46881 -103532 103918 255330 -1142 196363
22903 -27390 189583 -135409 266252 -22566 161023 267893 -8955 16441 54647 -219473 -24163
22891 151643 92581 -271603 -135915 425104 -265151 29450 -143132 143169 -61313 173714
22880 29072 -70173 -84314 -134665 -58215 -452738 31945 -94167 -39640 -411508 -313250 36691
22868 114413 -158273 -259214 -203473 33067 11075 -195568 14133 161539 96425 -465778
22857 224760 -95119 48350 262524 -143248 134039 -285230 202936 270832 -205659 -124453
22847 -124453 -34096 57288 -43038 -402631 -112677 60955 -17114 -32246 -10296 -264157 -158224
22836 -158224 57965 -262196 326957 -345797 186876 -58193 -104114 -8817 181631 -55652 -95341
22825 -95341 23892 164189 79285 -138607 -204632 -89456 -109967 -52706 -130798 42060 -106142
22813 -346222 -90068 -81529 131147 15592 -410726 -159782 -34177 -217664 22458 -64828 47792
22801 185976 146733 107053 -166535 -111873 -24233 -189399 -39151 190451 -40355 92518 -278610
22789 -153664 225225 81411 3381 -229224 187127 -201779 177589 158061 1484 -190590 59588
22777 -193452 349643 115845 -388470 149867 49731 -75899 -5740 42606 101707 6957 -11838
22765 230001 -230188 267680 -70695 -144824 -140961 71101 243718 4598 -20320 155614 -60823
22753 113868 -466982 -175930 -41338 -45459 -244395 -59962 -284692 -206358 -127672 -34808 -176150
22742 -176150 -379690 -60285 178047 37032 12430 78309 10364 273320 -416357 80603 101853
22731 101853 331637 143982 40261 51351 -95356 112477 -266220 144727 78768 -54660
22720 3334 -189209 159632 143162 -74759 414563 -94132 -335931 -82145 -331991 -397921 -1121
22708 172504 -37594 -81732 -255 -90926 110028 82024 -23223 -111599 -23290 -24372 -123597 -21676
22695 -73244 -460787 222832 -372484 59930 -164539 -79360 -113909 -105542 112215 106304 -168303
22683 60375 -308829 47102 60303 -40770 -92290 53901 147411 129332 86606 385750 -95456
22671 -58065 -199300 221013 -181916 -130053 -78799 -5156 -110598 219643 -248300 215715
22660 69572 -133623 80374 3346 -71767 -336082 -74024 -94410 -179242 200187 410679 -37933
22648 -139761 -212009 -195039 -215281 -86130 -63364 -497734 -39434 23294 -144221 -64140 -259868
22637 -259868 -124749 -137252 85336 117491 -168783 39455 104815 -124492 6769 -58102 1156
22625 207882 88316 122434 -128517 52796 200424 -212155 -91043 -131418 -55167 -9621 -279711
22614 -279711 -35421 164245 -270690 -38878 -477821 194680 34270 -76858 -292897 -208632
22604 -208632 9420 -280365 -248896 -468098 -66768 -134039 129027 -36742 -202185 161397 -73011
22592 205592 -38996 -137038 106910 31260 27678 335320 -70111 -220080 -59589 -153269 -306910
22581 -306910 121598 -146491 72840 -71128 367416 -185414 118180 -116055 79458 -322004
22570 -108088 -100664 62087 -2646 -6003 -70780 16261 -54257 -316365 76111 165318 -243660 235702
22557 -96642 -116828 47690 201788 34635 251657 -294065 247221 -293857 278808 12941
22546 -30601 -57997 -169700 155926 -151463 -288597 -198615 78378 -80199 -51893 -15567 73984
22534 -161901 -154393 -12326 -2819 -93539 41931 52682 -224051 162770 -127956 -276899 -98599
22522 171633 -180630 90072 244052 230669 12023 265684 15629 51093 -248253 182744
22511 106876 -20207 -394456 -87804 113338 45991 62309 -16491 -159878 -181048 66405 -129180
22499 -119997 12379 337792 -153693 208097 105927 48732 29592 -166503 -23143 116838
22488 -290994 -24245 -174075 -459 40454 94363 -16908 -358621 168390 -318135 -4728 -377164
22477 -377164 71667 -262505 -85989 -37440 -178741 -75645 104997 -68702 -133770 208848 -20624
22465 314728 321517 -38555 -111179 179213 12513 54123 121781 58394 304678 -30621 100103
22453 244333 -295987 -22948 319713 -55092 251108 -45749 329646 -202240 -76324 -150569
22443 -150569 45481 93581 -323732 -105788 -47406 -168293 -28330 63711 -29698 203649 126641
22432 126641 110546 -7358 -319930 96421 -303922 -16775 165095 -179368 134503 121381 59399
22420 -15990 -190276 39779 -244837 -173269 110614 41170 -188438 -285163 55687 34128 -211648
22408 187171 -12977 -123739 76178 62208 146942 -125392 256723 -42030 254033 281394 173146
22397 173146 -32692 -144194 -178635 88336 -33836 -205456 38221 -172030 -126948 269807 203780
22386 203780 -229697 -15976 147295 97955 -143422 -113486 14315 121035 207073 -14252 -3334
22374 19642 -129608 -89951 145260 -127686 -21622 175126 12573 188640 -143232 -300376
22364 -300376 236680 -208071 441752 28390 76380 -3050 -71824 107332 -122943 193968
22353 -220578 -135649 -133056 -139047 -15821 -64032 -228596 -43904 -204053 -186122 -388651 -173203
22341 -156310 -139865 -93655 -383456 -102054 132645 169224 87944 119969 -279229 -120681
22330 130036 93469 183375 124902 -546516 65467 31264 238429 224643 225058 40561 188373
22319 188373 4735 47569 -183730 -61404 -221100 217938 16526 -31188 -280503 43418 -20952
22307 -123787 -146196 68816 -93197 -10818 192425 -109520 84792 124582 -173487 -112201 18703
22295 -183466 -113518 -147232 -228728 -156058 123785 -85115 -63103 85803 -54912 -147372 208193
22283 131968 -173403 156281 -15217 -52193 91840 -93988 -38027 -234754 -113419 -162216 -339318
22272 -339318 73202 -86500 -379882 -23 -87269 -206497 -78555 227565 141946 -141020 -125690
22261 -125690 -236231 -19323 247710 -190053 -148146 151184 26113 -69535 -22571 196561
22250 -42243 67954 223885 61058 -360603 4779 123868 224705 -3833 -95412 -49526 106793
22238 -25468 -27926 -18534 430791 -128587 132162 229924 112269 -55671 -230473 108306 73633
22227 73633 161762 -394621 -300583 2805 6188 54551 -66008 -218650 -44766 4354 -225317 -29505
22214 57386 155135 109639 162751 -436065 -17541 -115141 -49959 -267325 -100989 -389837 -141138
22202 -177907 87729 -189104 -225416 39651 -79932 -123589 -120907 -183889 -340318 -153827 -252968
22191 -252968 -22526 -50411 54020 109247 -266288 -234567 -120973 -85503 153086 211853 -282565
22179 308542 71311 -91063 -271439 293249 -131935 -29488 9936 -93313 140479 -123938 49654
22167 34847 68204 145538 -143619 126631 -199335 -162031 265104 -200035 58679 -313379
22156 251334 -206316 92999 -18174 -124539 -306417 82152 276637 -261799 -18929 62611
22145 83452 -136957 -270034 -174863 -218735 84811 128701 51701 12931 -124186 151807 -133871
22133 -224938 119345 -156492 218519 -212346 -99964 6313 -117333 -6243 -115677 -322681
22123 -322681 -68822 -28830 -56046 -157723 -132169 -352472 167182 109473 -150831 -17700 76966
22111 149361 -293654 -3189 -194103 18744 -148940 22495 -120104 222188 45789 -38759 -153705
22100 -153705 -152566 63800 -334667 -297778 -190935 130425 155502 192064 -60090 175959 366191
22089 366191 -283737 412779 -109830 -121896 -55495 133423 256830 375618 -468139 169856
22078 335552 222359 -89414 -22422 -280144 -134640 -54834 -136284 82526 -86486 -167064 123050
22066 56299 -97005 154900 -52233 128089 -339638 250912 15019 96427 -38507 5173 -98582
22054 35993 -210652 -25379 -234748 33389 -143835 75479 -140610 -97752 329 110832 223361
22043 223361 136265 -164896 -15087 -576112 -221476 -37375 -341925 230469 55307 126958
22033 126958 -182444 -7261 212934 -92979 -13335 -8045 -235457 -27297 -225194 -96762 -189427
22022 -189427 -158580 -175169 28845 160141 -152875 -62288 -256047 -188166 88625 -39212 199644
22010 -429807 77107 -162989 34174 156185 -232307 -284770 21300 238164 171933 -136331
21999 71637 145922 -73361 -190540 79887 174141 -24550 85786 -178307 -116176 -217177 -70502
21987 209113 6500 -29370 -372656 41069 -316783 -129843 -148308 -92661 -35477 -104946 54914
21975 143537 453033 -128405 152642 132587 -441025 133409 217307 147763 -161263 2686
21964 -266793 302463 184703 104365 48672 -102851 121807 -202261 43893 282485 -20056
21953 71003 -307229 -235452 -356548 -321371 71951 -316792 -255203 -29155 -76865 86574 -270767
21941 -98165 3337 -104691 -317408 18862 219324 54337 180045 -258131 31255 145295 -185893
21929 218558 -211829 -168797 170608 -108846 106292 -3456 -129675 -42656 186227 -79472
21918 -241143 183538 -111953 -93577 -9925 -59984 -266658 -175298 489454 -351786 294308
21907 -125123 -220569 -3102 130253 -198945 -293012 -44170 -63050 4941 129581 -249120 77234
21895 180723 183005 -425364 51432 370097 -44809 -261479 -210732 -236624 174379 53501 -461718
21883 106806 -2877 -48672 -282582 -58295 -54628 72463 276990 -83214 10250 -172904 -73968
21871 -301228 -59557 66144 -84266 -269908 -152921 -274856 194867 102734 -135879 67813
21860 338472 167337 -163152 -245795 -213492 -252534 -286830 195348 179354 -14055 80195 90864
21849 90864 -48111 121227 73798 -274582 164082 -123262 -81008 16765 -56243 -112297 17542
21837 428328 14180 -29485 70826 91946 -71609 -155387 412429 167587 -65157 -329743 -383018
21826 -383018 -90155 -235403 -257921 426985 150777 -238437 132227 138126 -14611 69237 -225883
21814 3785 25678 55715 -374333 174133 250175 20500 -5775 9218 -364433 -116035 -87390
21803 -87390 108361 187068 86239 -76491 62167 -54499 -182037 88635 93801 -86064 -155767
21792 -155767 -216105 121982 126643 -61574 -93433 -238297 -170680 58912 -269434 -233092 -257773
21781 -257773 4139 114911 -184370 53466 -265507 45609 297646 -82615 58951 10683 -220344
21769 -160876 193320 -55984 -262048 67591 163051 228174 68830 150323 131404 -101017 30336
21757 166720 -336600 451254 83091 146793 121793 -54116 -131235 -114088 -62469 -307884 -430508
21746 -430508 -29426 -154665 167423 259792 -8074 125477 456873 -107768 -371602 -16452
21735 -58726 -71433 -276321 115204 -50208 268262 -87230 96805 262795 -214413 -170126 43905
21723 232304 181321 -87085 -224108 13981 204962 -244772 -108639 85217 -183919 214407
21712 -83632 -159077 42804 67056 -387708 -90892 118983 79593 153282 46043 -56269 -74769
21701 -74769 -38037 -118452 -214210 -349544 6472 76304 -160148 95567 -198574 -394605 -112879
21689 -142286 -82570 167530 -174752 -105584 -144648 259441 -48134 -357946 230475 -102254
21678 -370894 56013 -61363 -50205 55958 -85924 -45769 60002 -118554 186070 171413 15187
21666 37622 -114322 -118761 -228103 -25432 134775 -41088 11233 70389 -106109 -549724 89775
21654 -102410 292678 -177004 27807 -296102 -11154 -150443 1736 -21960 775 174723 24259
21642 216571 -271125 -54224 42278 -160421 -69872 131170 116212 19390 34170 85612 -103430
21630 -117890 112662 53458 -351969 -53790 -57375 236454 -137944 9752 -153930 -157134 -123416
21619 -123416 214025 29235 210782 13668 -35236 159182 -17087 -225493 105142 140281
21609 140281 -267463 -29134 -24453 -189145 -23861 -5307 -48797 -326413 11425 31820 117185
21598 117185 133213 195251 -314392 84679 -124722 -125802 -75078 -99433 -166886 -80290 -133002
21587 -133002 -545826 210884 86338 212516 -10303 -303444 45585 -159407 138840 -220306
21576 -236469 142930 124041 5488 40813 -233155 -247344 91454 -297701 19182 13675 231139
21565 231139 -196945 43322 -99056 256359 178680 -120748 286047 -482871 74656 -288046
21554 328008 -64416 -2661 -25863 -106364 197933 -140116 -13542 -79288 80028 73077 -160037
21542 57333 -171257 -238617 56845 89228 -191029 -314781 392427 94268 132055 -100251 102336
21530 -459617 150550 -45012 -28087 -162744 53077 323719 263052 53713 -265610 20536 7467
21518 -194426 -1800 266303 -36895 8581 -17368 21152 -188843 -131679 -33782 129210 -394868
21506 -19889 -6229 19026 -127933 -329277 -307737 -85107 -119599 -337163 189650 252284 -171074
21494 148496 86780 -139423 -62055 -175435 -89122 -593325 258110 -97787 104967 -299214
21483 -177592 209889 75640 133156 -377140 121407 41452 -573417 113015 -44255 355945
21472 70338 -173444 407950 -182628 -252749 -41695 -224717 -74877 -279557 -353674 213394
21461 -140047 -196306 -17841 -156819 85908 -31579 -44548 -248717 -262658 242066 49171 324630
21450 324630 -234105 -65909 81518 -72572 -106894 -153797 -95170 329637 -58603 -4590 466621
21438 369668 -30409 486639 297072 64253 339251 381475 139820 132441 256790 40177 20364
21427 20364 -249259 -252667 -79253 99593 57721 -494239 -210807 -101613 -390248 -143801 1164
21415 134926 -238853 41050 284040 -132773 -156111 -133671 -451679 30968 102834 -115423
21404 -298461 10779 -268538 -88595 302247 -167146 139815 122395 45689 28646 -261906
21393 88682 -183027 -132822 -46670 346218 88983 -138923 72854 -215008 106942 330448
21383 330448 -61101 -52870 -9099 -14737 -272129 30327 -54046 -104750 114743 -111526 243663
21371 113513 -149172 -207751 -175851 138050 -293395 -99801 173114 -63359 -242221 -155827
21361 -155827 -184254 52217 -203529 127586 20092 118569 -172320 14319 42700 -115527 6271
21349 -115386 222892 269981 95792 46989 -37582 -339227 383289 -123485 38807 107521 -87581
21337 -4113 334701 139009 68274 43498 17699 -25218 59260 18011 178866 -104512 -112170
21326 -112170 -74023 210723 -374807 21234 88100 -165375 -101410 -141786 189618 53021 327235
21315 327235 -110369 -135913 -33818 -168936 -82898 12587 194759 -87009 -207591 -247953 121538
21303 77755 130162 42444 -253924 -57517 126554 153788 -134634 -147582 69812 -306883 26083
21291 -221356 -122897 47081 -26217 178312 261599 -260481 75797 -14324 -39030 -360245 162852
21279 -322053 -288856 -179990 -10513 -152097 -538267 28631 100512 -25186 -271066 101373
21268 4867 -85236 -168715 5911 46654 333781 11067 -42909 -170645 191480 -137145 -160597
21257 -160597 -266050 -267946 349435 61689 -66880 203600 -125885 -71458 246810 -71259 -158827
21246 -158827 152351 48556 -224980 -192902 -120060 -148522 -105185 -331242 -186964 -112395 -177615
21235 -177615 -70945 -329189 95596 76861 202703 23886 87396 -200259 112762 -74221 140940
21223 -350346 283699 52375 276725 -81311 171311 -339931 -8618 -156804 -37836 -182255
21213 -182255 122062 -210493 -368892 -403758 -201457 -41364 -123539 -17862 -94753 79262 191885
21202 191885 52576 -63206 -91246 -69862 42962 -185081 -173645 77776 28276 66348 72407
21191 72407 -83571 -447715 -35091 -61780 -151277 -78554 39550 134840 99686 -31909 -11320
21179 256039 -20679 -288401 -374350 236521 -204477 -277453 85969 -29888 -142503 62929 501298
21168 501298 56144 -44326 82435 -269360 -175598 -79520 -242268 -233551 316726 -168822 -34730
21156 -120859 -188759 -125248 4214 -1178 -76607 6103 225354 75483 180524 -178106 -177644 -96875
21144 -96875 17351 -94428 223193 -267746 -35911 -252449 -40407 -206715 -105676 126693
21133 -148602 -20973 4803 239182 27018 -22325 151392 -188799 -259716 -264438 -340312 -23286
21121 -224245 67801 -53664 55532 -104000 -86157 -278824 77052 -183166 40895 38703 -3496
21109 95743 -35758 -131405 147259 -31657 357515 -28404 -140302 159635 -189624 83891 -32377
21097 -66797 18496 149306 -209234 156009 -94030 -285292 30478 -286544 -243935 -4951 -8160
21086 -8160 126858 221637 170328 -275780 -19142 -139024 -222819 138983 -143712 -307488 236229
21074 9882 44021 -97069 37318 -326030 -44819 86978 -213362 -230944 24747 -98167 259655
21062 -203099 -74017 -100533 -307900 99792 -236803 -78750 -107998 -144670 219715 159305 99058
21051 99058 -194223 -57125 -86137 -393594 196355 -5940 -179058 -135412 8102 -263195 -163
21039 -108258 -126039 -3564 255422 -197778 -197459 405186 202925 58672 -79176 -139877 68829
21027 -498882 232191 205891 -259625 -51476 -44496 -244971 -3348 27102 -462192 -267484 265821
21015 29760 -92907 -343653 267200 -251120 42853 31539 84097 111097 -431173 96321 174362
21004 174362 -3143 107656 -266161 -3067 -367835 233063 -190232 -113141 -124343 -12477 102803
20992 58863 -148522 8954 43332 -80349 -131197 -245243 -56703 100815 -115676 281933 171895
20981 171895 91648 171075 347142 250455 -45872 57878 23026 -210044 118263 -166878 -141705
20970 -141705 -38891 -24305 -119904 -24653 150655 -195970 -173044 -298177 -185350 15756 -320676
20958 -38706 136753 -529321 -233721 73107 -311892 -56272 146600 122654 298172 30990
20947 59963 -332865 145058 -45584 -132392 402630 -117376 98484 24704 -329928 -115193
20936 -100169 -75712 -57141 -287698 -130236 -149634 -159528 -27735 -124872 -255719 -156763 -21718
20924 -402907 -210201 -35927 -89800 104134 342402 174406 43290 -150336 -22399 -10049
20913 85743 -12427 -296229 -65825 -77616 -106081 -4834 387264 -34153 -101112 -29752 -250834
20902 -250834 -166928 -288315 -173049 -348473 -220406 96399 252629 -448620 -79179 -266325
20892 -266325 -116798 -167792 -235818 21821 6585 -387064 42181 174535 -70640 200418 -62385
20880 107931 -85427 -317583 -18320 -225890 243832 -19693 -305736 33466 176149 -263440
20869 -283715 -199441 -242640 -255105 -43861 305146 151132 39740 328806 33928 63519 257946
20858 257946 -56731 204213 127948 -157178 42723 86674 33977 85049 200519 -245494 69429
20846 98529 -382285 255449 -1738 -347954 102938 -174565 27271 35705 149016 111480 62675
20835 62675 -93935 31493 -265164 160230 -24906 -288622 46344 7755 -88653 51626 33238
20824 33238 97367 -430684 -274970 38078 -11027 210480 -276013 142417 -129757 -280745
20814 -280745 141039 195079 -372263 -1549 -253021 -14431 -351390 35240 -196854 -257232 -57141
20802 -308933 192373 -145164 -195238 230826 133731 6490 72910 -230369 -111209 -241290
20792 -241290 62005 -4269 -151112 166499 -292338 83301 24793 245563 15719 -268696 -154056
20781 -154056 -59271 70886 244930 -7899 -286977 348747 -135269 -29137 -117167 -3032 44760
20769 -322009 94528 -136064 -195133 -57627 144505 -272774 49637 -435083 -331980 67638
20758 -28122 -116809 -177549 22462 37656 104575 -125525 -159710 -77404 -202095 -2918 196410
20746 -112484 15798 -309811 -25519 351217 184593 -163471 -204829 69602 -180857 271129
20735 -193093 -173974 107091 -16727 -278373 47703 -21315 -106043 -85953 -368524 -1666 53823
20723 97641 29761 66999 -411204 198095 -266078 -393736 239576 -34860 -87366 -119034 -284405
20712 -284405 144789 93338 -81529 113016 -303299 -52081 -102369 315886 -380191 -83593
20701 -237773 -74092 -22331 -68206 -236942 -184755 22138 21093 -228586 -231191 155778 278917
20690 278917 -368712 -200240 25496 60166 343147 -116289 -178755 -195525 19515 112973 -138649
20678 121377 180512 -35694 -71490 97030 432551 204186 -72894 86411 -28580 -101789 60532
20666 -97364 -263540 -334 290688 69339 194325 68122 93061 -117723 -83679 12308 -39758
20654 73688 -41664 59097 -52247 120725 74528 146064 239203 -230418 6355 42576 102954
20643 102954 -76032 -44911 -128622 -567545 -162373 -229783 91441 89889 -162270 -96251 -400022
20632 -400022 -203189 210662 -13148 -253936 -408310 26943 -312839 -66516 286446 25563
20621 -162310 319134 -90918 -18493 329895 -30362 81449 -118865 -8787 -30211 -163045 226672
20609 -279397 158179 209078 93429 75060 -138974 294280 -217929 -61662 -157565 -235336 97837
20597 -141730 11718 -170191 179431 -319847 67402 -14016 53298 -168759 156404 -37377
20586 -143694 143183 -82877 -93056 -152971 -214829 -160620 -110064 18683 -108043 46235 292279
20575 292279 -177735 -46226 -103856 -20346 31032 -198227 31543 -161538 81864 30825 -1918
20563 -406735 134302 31229 -53438 310057 -187517 -143718 -209386 64885 20121 166511 63921
20551 -100043 -106049 -124121 -176568 278410 116178 -205155 176596 134271 -261166 -419574
20541 -419574 -280648 70720 49073 -202785 214459 -384521 -203820 -417155 -14770 222086
20530 39126 338191 -273098 38719 -77909 -23580 66722 -210574 -332917 27706 -47242 -243491
20519 -243491 162770 -5712 62988 -173012 -30761 -175104 -40181 6490 -192751 205738 -274211
20507 -1324 -43531 -205416 255760 -336901 -174993 -23090 -102118 24108 -161367 498213 -181075
20495 67322 89289 -24575 9704 -174780 -95372 -171732 -162674 -158508 -104325 -99544 73331 -469422
20482 390278 -111481 -237845 -8806 -266029 270573 -46842 117869 76300 185914 -91039
20471 -44329 -195977 -67929 -133219 -236913 23640 -31332 109400 -128129 108638 -437397
20460 17084 254656 275822 296624 -92993 542310 -113888 72397 282559 -30945 39411 212823
20449 212823 37623 -271703 33827 -293396 -221031 -19640 80570 39693 -10229 88372 51376
20438 51376 -53408 -28184 -243645 117437 -17823 -202643 3199 -92263 -289251 -162379 -265025
20427 -265025 240939 -31016 64028 -45720 -426882 62097 35232 18892 -148287 -128749 -315353
20416 -315353 -52435 -189059 -395805 -47385 -385464 29558 -79330 -45132 -75778 124489 -38843
20404 255914 182543 -466860 -193285 71243 -149215 28916 2077 -219598 6714 21805 -129188
20392 -36406 -11293 221419 -54583 -40580 -264928 16336 158297 -247589 -267002 -156844 246424
20380 -59959 -411319 -112987 -18365 -90496 -292458 48555 304123 -370118 244168 -80686
20369 -163875 198380 47124 70877 -31416 -234323 12123 56009 -29011 -139159 -238728 206426
20357 655 24955 -8346 -38657 -121719 -233971 -112869 -228907 -60366 89315 -279005 -156635
20346 -156635 -182557 -427791 -110448 -90152 183694 -51350 -33081 -155683 -218745 33267 50114
20335 50114 69091 -19635 -72456 -37743 282201 75603 -72757 -81532 96797 96127 104636 -177982
20322 -26279 4902 -5506 173444 197011 -9044 -171547 -95013 -305749 -88903 -282221 24391
20310 -92675 81179 -43299 -46117 -62098 -193009 104214 -242872 -29710 106761 -87020 33636
20298 -225124 -360976 252713 42863 -206274 135430 -92725 79479 205448 89362 -180833
20287 -96936 152363 -110613 -267213 -375639 -388724 -7196 -174542 -214358 -73739 -67187 512079
20275 -115813 -83216 -284744 -134170 103307 344335 -292565 -147394 -301525 111095 -198245
20264 -390025 95354 -74747 -36779 71744 66674 229394 -20870 -175220 85799 66479 -220175
20252 -174242 -456496 -285914 203834 -3032 205439 -77652 -61646 -66074 5957 159907 40615
20240 7902 93239 -179940 75359 182904 134691 -260905 108133 58412 -179189 -121634 -67557
20229 -67557 135372 140460 -122908 -32048 -58891 -341866 -393777 -251805 195051 144358 -108027
20217 81955 -73630 -314758 25369 -84397 -119069 -236000 100 -117717 -149504 -167353 -165914 -92912
20205 -92912 -297754 -337639 -38736 -214550 -287323 -21146 71281 56217 191168 47554 -168340
20193 100034 118768 119266 141866 -46131 -205515 283241 -190885 -109338 -12362 -167578 -302587
20182 -302587 -74433 -56891 -159727 91530 -415043 63018 28692 48938 -38207 -250305 119499
20170 76889 -346507 -97285 137263 23538 -59801 -49712 71748 -163810 36643 69823 -49909
20158 -155067 254342 -46723 -117533 -224474 -596 -140831 -56808 -45846 -88416 -111342 179808
20146 -1007 56775 -54637 14670 -15743 -283474 -247582 -287233 -343758 -88673 249928 -154336
20134 -189033 146712 -92362 -658775 114372 157169 51467 340900 7770 134393 -22465 -67806
20123 -67806 -275911 -300427 -120353 -86472 -8191 96646 -387566 205030 -471400 111258 18948
20111 -432502 226841 -145577 110189 -172592 -482964 237157 18269 -52111 -257920 -273332
20101 -273332 -45066 -53897 110516 -15458 -61415 103216 145326 297805 -155244 218791 -339333
20089 -328108 -114438 -192876 -59731 -32374 -273095 178213 79509 313092 389358 -370285
20078 -73728 32586 -160702 -110777 108659 -23214 -120914 -37293 87657 -206763 -163334 -138636
20067 -138636 182203 122218 -338081 -253128 45186 -31508 -297424 93579 6039 -58898 -6591
20055 -232511 20078 -15673 86236 -189595 -92091 30523 -414336 145732 129031 101197 128557
20044 128557 -50711 -23868 202806 222903 -213090 -16973 31744 -301855 9112 -186853 264216
20032 -151278 -244662 -78921 64994 -30659 -44763 -370508 198956 -171331 50731 -75461 -50746
20021 -50746 -259615 240616 218257 -55719 38506 10599 -9012 -217546 -77778 342033 -41250
20009 17867 158999 -42819 -72716 220058 -278220 -94176 59505 110313 -382648 -93333 72603
19997 -69217 -140418 -101118 -181577 -43571 -14504 56526 -400915 -7181 40239 215749 -86592
19985 -142768 111165 129076 -55308 5573 -126321 -29314 151152 -292545 -272559 -83576 -222275
19974 -222275 -292379 -183864 165223 154254 256444 -207149 -36046 219700 -29744 -228323
19964 -228323 -32766 -180719 -208161 -318159 -110622 -212929 116986 -371047 13507 -327332
19953 -24801 -41788 -39226 -98473 -207309 -299413 106513 21004 142169 -112210 -110268 -98489
19942 -98489 -147626 -277181 -323622 -149548 26416 -67429 144289 -359523 -37577 -247127 -11190
19930 213350 -319267 -252830 352620 11817 -109140 16725 117660 -11030 17164 110359 -77471
19918 -17787 -120176 -128303 -143406 38584 -265838 -273968 34121 -151390 -18735 -131783 -76027
19907 -76027 41275 -61638 45852 83052 -249536 189006 116561 -98980 -85721 -444222 -56336
19895 157992 -40374 -201225 29937 4581 -34431 155948 309597 -95323 -62324 17716 -49553
19883 -36494 -162136 -178917 -244175 -61915 177517 36988 -255641 329003 -207911 55382 260918
19872 260918 -277920 -100647 141008 -240927 -4823 -93777 -7673 -229735 -99750 -102646 -326501
19861 -326501 -455522 36479 -30802 96990 217661 3840 263313 -141090 77824 -61485 -71518
19850 -71518 -194737 84674 62901 177802 287246 124030 -33760 58021 -17475 -417569 -113750
19838 21392 78629 19971 293431 -286267 -123963 -17403 -125894 -117399 -127730 227386 43272
19826 -35824 -61670 -9102 343804 238311 -303985 -64036 102651 -21370 -68568 -161417 -155575
19815 -155575 -367176 -143256 -113735 -334114 -347560 -37817 357869 84579 165588 184016 -269661
19803 120479 197129 -445059 -124503 -17497 -202721 -93437 -268368 -98273 -118798 48602 -71644
19791 -312111 -181238 33118 -68446 18013 105809 -118266 194495 -245436 140863 -168900
19780 -157239 -357404 -229183 -223521 68394 -100022 148930 -398848 -355948 -201925 -101807
19770 -101807 -223413 76014 -159196 54182 187714 9424 -185881 40209 -215138 -51474 -105296
19759 -105296 -11662 -258522 46466 -24887 268478 -123402 -311777 -131348 -32643 181929
19748 -89295 -321152 -230381 -60616 -70057 -246045 -199295 -157473 73104 99925 -17378 111425
19736 -88135 46405 -235469 312677 132265 -126018 -15677 -226866 -148979 133210 -44295
19725 -137329 -42086 -245795 -43301 115944 -24878 -138123 -241798 -245310 -14304 -44490 -126241
19714 -126241 127382 -22702 -206670 -69227 277645 -161592 142279 -97764 -209642 -229889
19704 -229889 -38785 -50109 94935 -431604 43719 -66096 -18972 -65122 -248442 300035 -105905
19692 -285553 126341 140695 -183223 82195 -73998 -105166 160143 -150678 -27089 70062 -55975
19680 -88678 -335681 -131955 -197084 9890 10789 -13705 -7213 168069 -168192 67610 52425 -291212
19667 25151 -54852 174379 -138260 91886 -186340 -74278 -9362 -79319 -272034 -26659 -140576
19656 -140576 4251 111170 -41910 153306 5129 -128980 -138467 146199 64318 -103016 321768
19644 -35934 121494 -240 -316417 71933 -164952 300675 -236848 -180105 -259608 56308 119601
19633 119601 -19139 -122363 -40644 -296342 -114261 -19791 -265170 117493 -228842 -240698
19623 -240698 -42818 5567 -67874 115399 -153714 -233684 177724 -50847 178887 24275 -223099
19611 -170811 248693 106861 -388912 69301 57091 -109573 14003 -15201 -82093 -200381
19601 -200381 -78988 -322972 44067 -268532 -122692 -4616 -197391 -37659 220625 -73135 -55603
19590 -55603 -52378 -290086 -137631 102096 18618 -184853 -98828 -96163 -96471 2414 -383208 -4171
19577 159941 19626 -128117 -99029 53089 -54535 -269637 42815 278940 136366 -358191
19566 -418659 -186695 283055 121303 -44121 76710 113821 242276 -243953 48652 -196302
19555 -312382 -159667 -209405 15396 -28450 -12393 -222310 -21919 -210481 72521 -216554 -281159
19544 -281159 51353 -154896 -204723 43296 -109850 -79182 -170901 -94517 19597 -189877 276207
19532 55788 -287341 74703 -481822 121234 -128666 58763 137014 63801 232180 -123208
19521 129176 -208773 -388241 129594 -85025 -76455 -114718 182754 -146789 42747 103855 -314472
19509 58313 -207253 -268903 -98479 -187003 32929 -82917 240 -236502 38874 -583 -230399 263724
19496 134747 24213 -125289 309075 -173260 200655 -434739 1535 77402 -230620 -46073
19485 -276434 -177041 -143964 -207538 -144094 -247943 200934 43889 -155335 -36844 -193591 -32123
19473 -9188 241808 83748 -55966 108693 107870 100308 97718 120758 -213803 -101653 -7138 -302925
19461 -302925 -242147 192647 -58027 -102095 -176999 117366 38461 318801 -138898 -135216 7107
19449 -120002 9246 224256 -278070 -53247 -344358 -129552 -119572 -122278 -342430 115174 15226
19437 -388139 -23268 -308534 -300941 -85890 72972 222614 -60065 -546541 117892 -49470 12801
19425 -365105 -216109 -241563 26894 69183 -285958 67866 -322004 -51617 -28472 -92679 96749
19413 85828 195543 228331 255906 -197396 170784 33029 -59854 51910 171792 -24694 110493
19401 -67586 -224221 76853 -7650 -64543 216164 -71449 165883 -128176 180652 -168839 143318
19389 -49780 16101 3001 47935 -126376 10467 66222 -21977 -175752 -54622 -500271 -198414
19377 -37292 72740 -316622 -20461 -53568 -35975 48098 -279057 22942 -278578 -291744 -14348
19365 106220 -371271 -140780 -532799 -240606 -98823 128773 108422 202843 -145848 -348104
19355 -348104 37815 274871 -225820 276682 -275360 41238 -174870 156784 218833 -115244
19344 -72308 -362378 -64478 -115413 48265 -40344 -133139 29047 123625 -16753 -69179 -501156
19333 -501156 -222830 -39406 -66076 -341894 -240902 -178276 71328 -210483 222968 -40963
19322 -94701 70658 -168628 -277231 -6584 31538 -59718 -284534 -300138 -304481 -328424 -95651
19310 -4239 15792 -358187 -191859 76818 183397 107047 -298186 201505 12300 -188056 -158223
19299 -158223 -132632 31744 -302645 -39357 -44080 -79974 -41274 -112113 83519 250494 13879
19287 158418 214566 113018 14816 -58271 124227 -274035 -67478 221620 -318453 -87741
19276 -46729 63901 -4953 -186888 207049 -140521 -52056 -216172 135826 -201161 123420
19265 -333040 -200664 85598 -284259 177120 -48304 134801 17689 48850 -151678 -123303
19255 -123303 151582 -41898 56885 122440 272118 -32480 -116619 -35252 -33323 109846 269520
19244 269520 40515 -20894 20415 -3931 4259 -7136 26204 117364 218586 -109072 87288 443813
19232 443813 -260929 167244 -26664 -139012 258239 -409704 58778 177102 -71746 110373
19221 67236 -243574 198389 -94510 -342919 92577 -105885 -165340 -323542 -324427 -41777 51554
19209 29118 225408 385631 -15868 97107 297001 -126291 -144606 -420485 123505 47907
19198 170568 -98936 -176533 353098 -130070 -332402 -11565 -273353 236988 48742 -13193
19187 -299244 -93953 -327120 -3306 416223 -113887 -36835 -249261 -237847 -263745 46269 -187295
19175 437725 194080 53562 -92039 -35593 261381 -144318 -246646 -102631 -159290 -275142
19165 -275142 45725 -183014 36817 -65641 -218834 145298 -313585 98914 88197 195400
19155 195400 -369587 -205209 31376 -23787 15957 -427457 22510 -49280 48250 -230589 -22507
19143 58094 -249687 -58967 -71752 -103207 53123 -20269 135687 17804 157581 -212309 -267083
19132 -267083 76180 -104186 -42671 -17206 -290665 402747 -215347 75201 -147350 -242194
19122 -242194 -155218 -220414 -99032 108729 -39094 -234579 -52317 -317913 -184823 -121199 -85534
19111 -85534 161869 65620 -135651 -119368 16249 -13497 93891 119186 74384 -153269 -174086
19100 -174086 -298500 -330347 33574 181489 -20469 -77559 51445 -66888 285349 -60706 50275
19088 86535 184416 150633 -85717 -69175 195371 -1508 28080 -34514 -301105 151158 -93778
19076 -254448 -314330 37889 219201 -122522 -190805 469 36751 -149333 4219 -146675 11520
19064 -195032 -69985 -97286 -36262 -82871 76264 152985 -264185 285926 -330723 -101370 -57495
19053 -57495 77211 -234274 107700 242043 32342 -136549 19378 -17096 -52080 -134953 233963
19041 67027 -53840 88547 -127744 -143962 77381 28241 -175852 -74329 134122 -19405 -116902
19030 -116902 -109817 105091 -14345 -195889 -57155 66027 124041 92028 -249578 106857 174614
19019 174614 -147741 -104646 137053 -230234 -50720 9175 61636 -4625 -47403 36859 -189798
19007 73012 -173790 -37384 -200977 -215197 -17900 -200364 -68992 -83662 -55786 276832 252612
18996 252612 -230743 -120768 -93369 -90775 -87067 -205944 -111633 123645 -246706 188764 -512355
18984 -186596 -190097 -387750 -49043 -26419 -22445 30802 -234662 326734 207648 55851 -149434
18972 86832 229863 -349277 96222 156376 64191 161101 -35204 361538 109583 157494 -65427
18960 -140267 44992 47362 83369 -158976 -129302 -5833 -129199 -97884 91754 -262743 19661
18948 -42050 -165438 -95975 -69001 170920 -91227 255518 -201206 -404889 -206420 -76724
18937 116571 -257354 -308830 105500 -92307 120773 132006 -128099 -31244 -25513 -119573 212849
18925 338234 -134803 -61938 -141963 -80412 137449 -197815 -72770 -29579 -259074 -108248
18914 160908 -6161 -161003 96385 -101800 117602 -453727 -216766 -236141 -185731 -250671 20134
18902 -78234 -390435 178951 -137862 -81720 94686 -147620 380 -178372 -53102 266942 -3155
18890 -13289 20500 34990 66752 216905 -59147 29344 37621 -150993 -236640 73623 123148
18879 123148 328185 -38625 -76371 -14482 -544778 -29463 86709 45196 -240928 -141077 35688
18867 25635 -117698 -133119 -20472 -351283 331308 -135758 73478 -266446 -200199 -151757 7310
18855 -131627 90301 -302767 -51962 -237718 -233401 14020 -232009 -172028 243617 -280917 -233169
18844 -233169 83597 204613 148110 59635 17541 203884 268284 -242823 -236619 -213509 -52807
18832 2090 -226511 -202221 -373202 69417 -224952 -61260 -102860 293844 -9413 103451 -211192
18820 8212 8070 -201610 -150700 101385 -44320 -76146 12217 -82116 129800 363135 40282
18808 -13140 26880 60118 -203450 294189 270213 132971 -445605 -122270 -75109 -297543
18798 -297543 -102783 42256 -245187 -163615 50971 95847 -4261 -28971 -37881 -384703 -236618
18787 -236618 19770 37699 27616 -15517 78176 -40094 59247 101310 -218022 -228288 99787
18775 61195 -119290 -52050 -107823 -187509 -25902 -56517 207383 -460970 18452 -189466 -176240
18764 -176240 86186 95671 80173 -33691 -218256 -74501 7901 -274084 8507 -17147 152702
18752 104977 -311554 3449 -32987 -164776 -239357 133789 243009 16910 121770 -94126 -83082
18741 -83082 181923 132558 -2365 -46381 -371691 45073 99449 -456602 13540 243491 -87678
18729 -262836 22501 -271893 -35087 320818 216594 -280216 -7809 -326046 72169 360995
18719 360995 -42635 168328 231927 100420 45643 239398 -546907 15997 -94660 -246468
18709 -246468 -208092 -58427 -474014 -72260 -129584 -69060 245578 9182 -186303 -81489 -212358
18698 -212358 -209231 -100054 -223726 109817 -255047 -114674 -37488 57935 131571 -52201 -329464
18687 -329464 16668 87954 169360 132883 -24421 -45065 -183387 19807 35381 -222520 -241414
18676 -241414 253728 -169039 -79548 -128198 45686 66287 37703 -102378 -177409 4425 -138992
18664 -10816 300557 3834 -11551 44565 31321 -140069 362222 -83744 -124877 -86786 -246994
18653 -246994 205802 -324171 2328 39343 -3009 -222278 -204625 -78335 -481157 -432616 -132321
18641 122087 -110895 -102121 -23062 -295023 185249 -61954 -144929 -106269 194348 -120379 -76798
18630 -76798 107560 189951 -108910 -77448 -167598 25918 145791 -19124 -183078 -84067 388508
18618 23162 -23720 -178844 -277423 -199072 196956 -202735 -88409 -232393 -444346 -285765
18608 -285765 -366892 208715 -41118 -241399 -274403 -49242 -31167 -17848 -356129 164288 268912
18597 268912 -251203 -170519 -144180 2551 -261129 -252981 -187033 115952 -102829 -180362 49312
18585 82048 -265212 67143 294787 -180520 -107899 341987 -198475 -103482 -230209 389890
18574 303781 37709 -98375 -19840 -237483 302381 -152186 -78933 19553 -157153 -198165 48458
18562 -172788 316504 -421125 101222 -38910 -77159 -107953 -16923 87732 -254533 143356
18551 2056 66834 -399188 -191475 233658 -136724 -343756 -141089 -396092 -103678 -233172
18541 -233172 204277 288085 -399893 -68991 115420 162909 146264 462 -17189 -118440 158798
18529 14343 -3823 8997 -148416 -192904 -116226 -68516 -83865 -72422 -66330 7778 16008 28074
18517 28074 -151261 -242191 2859 -164172 -62139 -244849 -115609 -121633 10921 33448 362707
18506 362707 -57634 -19465 -261350 -317841 155826 -49257 -14744 -155100 158530 -156355
18495 -146440 103486 -27723 -53265 -2747 -119623 -317079 6991 -116750 -43507 30924 -100321
18483 -19996 -250167 -38437 -26168 105688 -355803 -236921 224562 336324 -86915 69348
18472 99545 279343 70859 -125276 81448 40765 -196081 -301470 -128348 133400 231337
18462 231337 -203130 -272772 -340915 -3655 -317573 -300029 -36668 25303 -252214 -232520 -51131
18450 124954 -58005 -57487 316110 4173 -287687 92178 122078 183117 -207776 -496286 -41251
18438 194462 -222560 -146564 110443 251385 -48175 18317 378964 1265 -174671 -436721
18428 -436721 -45228 -73774 -112250 -455881 37483 -207747 366007 -143395 -276312 282322
18417 186212 -145748 187707 -49296 -84360 45328 100506 -123019 185093 43786 9130 -197219
18405 79552 259212 223229 95011 -236107 9350 -5503 187603 -344095 -213292 -163253 72989
18393 -24280 -63064 -222830 32759 -205011 103723 -268609 235500 101293 -110967 4340
18382 208665 -179540 -192965 8276 67807 -37208 -115336 -135354 -19824 -86550 -11825 -65197
18371 -65197 -450437 -204703 -131392 -90688 88371 -39192 -249613 -138424 48605 110714 -99643
18359 -274840 91079 -450830 -98691 -92668 254804 33479 -6522 -189022 85393 64506 -89876
18347 -289587 -5918 -73991 135153 -21293 -308624 63450 164730 -197109 29422 -204028 293115
18335 -111325 128080 205342 -77284 13061 -106093 11296 -243686 -161316 -264642 -69482 -114534
18324 -114534 -177463 173921 -213249 -27111 12332 54738 -347058 -26821 502654 30427 42244
18313 42244 27983 -245329 -193407 -141874 73765 155494 63416 -148581 -40936 -88307 56746
18301 7651 -254729 -214598 205837 57036 85761 -31189 75256 -253925 -184894 68232 -144983
18289 -9458 275777 314549 293372 90006 438727 -241727 128824 -171330 -57396 167610 -115345
18277 375368 -259685 34918 74318 -87181 -211136 -19362 -52191 176749 -319716 -161160
18267 -161160 265106 16503 -145159 192337 59671 89088 -112381 224315 486163 -48015
18256 321396 -44796 -334871 -406437 -56035 -204721 -112047 -333995 -85873 -90722 -73537 84833
18244 25778 -84273 42547 -65033 -47584 92963 -69479 -336853 -217746 -140136 -212791 -59870
18232 140804 265903 97125 48496 -166305 65870 -32645 355256 -41420 39320 -281507 -355589
18221 -355589 140395 70838 -306425 -164298 -82773 227386 140485 -205062 -44109 -12320
18210 145230 -264124 -19189 -113174 -17217 -365263 -46036 184133 237200 -161637 54498 -17462
18198 251567 -75179 84780 -71819 -62115 77308 -185608 -180251 16475 -10470 154361 10791
18186 -242508 -137784 111052 -130575 26307 105305 -236928 -363972 209749 326461 -74817
18175 -51437 -45169 -18581 -179192 372010 57567 203116 -62748 -33132 -19644 -100957 71347
18163 3460 -159916 181021 444796 238592 -123759 -275567 142256 233657 223173 -183043
18152 373491 -234020 62275 -155667 42334 -359180 68811 116417 10137 -292131 -353043 -112460
18140 5672 -127160 -9874 159925 -68402 -57423 -203194 167528 -352585 42586 -46489 -241203
18129 -241203 134306 -250406 -149903 -149415 15431 -254546 -166060 -329735 -195650 11002 74152
18118 74152 -262884 113215 -58473 -227677 -148515 -101292 9506 -297403 -28384 -256487 78521
18106 -206668 -297833 -191538 11320 -16205 -60317 188320 15563 73429 341158 17220 -57139
18094 -40732 -39513 -52323 -156269 -69606 -189033 -84230 -118433 -23838 -9927 -40176 -118161 73662
18081 -4043 187215 -2405 -47924 111888 164921 -44778 -240812 -177719 -227711 -18251 -131910
18070 -131910 3727 60016 -490334 151972 41525 208245 233688 -71994 74337 -192322 7532
18058 146688 -31362 -218159 -267530 -112614 -84606 -125238 196406 -203892 291145 -302296
18047 -293490 7159 78497 191974 -292185 -43198 -57650 109137 75553 3035 -63746 562036
18035 590250 330922 19792 64965 83900 280454 4234 35336 100575 -222938 -181304 250973
18023 82546 151025 108680 -400281 -30943 -40332 -181676 304858 -140689 106978 7370 63253
18012 63253 12734 246723 253102 -67771 14300 -250699 294196 157835 -117769 196169 20877
18000 138974 -43344 -180144 -344596 310671 695 -232687 -91926 -191115 69660 -5027 -257787
17989 -257787 -116184 51485 282323 29004 201862 259489 171051 213715 49729 236818 297583
17978 297583 -191416 -9725 -78181 217695 134069 304880 -278607 -69620 -216275 -196917 112905
17966 2997 25883 152122 67267 -351637 -428501 -286423 161372 259812 -240538 105205 45089
17954 -373389 -60696 181119 -106504 -47221 -165673 260924 -134577 -187008 143029 200045
17944 200045 -235066 -1212 -203211 -210927 138000 241684 -259969 6681 -86558 -97046 91363
17932 -36448 272045 58796 323217 53245 -288239 -13615 4876 13350 -139284 247979 41173
17920 324289 -107707 30592 -210762 9362 -270751 1396 -68583 -30081 -29258 -350520 -112289
17908 -267920 318610 -262723 -4895 209197 187977 250694 -276854 -10459 -99447 32719 -272421
17896 -73800 -177503 -78377 -79347 -31508 -188429 -152225 -112838 193700 113574 520 219924 -89571
17883 -103032 39285 140735 175737 177278 193650 221622 -269345 -145541 185127 -147159 -147700
17872 -147700 95688 -165963 134142 104610 -10960 -7752 71633 118965 107357 -152602 90891
17860 426163 -93936 99737 302509 -47107 144119 -202411 89085 111590 -51804 181155 -8925
17848 194763 -26317 218259 5363 11343 -287733 50824 -33084 55956 38862 59605 -116476
17836 -296098 100703 -97690 100893 -419781 112918 -615152 168424 -129351 -543102 -54860
17825 54727 41762 -179282 1461 -83506 25096 -70100 32592 10904 -101154 15540 1856 488782
17813 488782 157233 -134190 -17403 -76334 398379 -405333 180920 63336 33289 -316104
17802 104651 81465 -328956 216278 -197296 89388 -77209 65130 -144641 -76574 -49012 -66007
17791 -66007 374709 301588 85927 142302 -168437 279169 133454 14590 -255613 6201 -46796
17779 176693 -78974 24135 296603 64683 -228624 -153598 -281508 61081 -33233 150839 24274
17767 -85171 119638 62843 -23243 -82724 223244 108373 -25099 -52236 -151178 27995 -1288
17755 44981 90814 317738 -271945 112897 -83718 -222847 -116755 -131518 125767 -33250
17744 77708 -39015 -228632 -118370 -91334 -279811 43095 -117952 75416 373881 27194 294979
17733 294979 20257 68266 -22082 -399231 89180 -8148 -67540 -259360 -294332 -78534 37270
17721 -7872 123278 -171081 -66680 249599 -48286 -96993 339426 31291 4423 -77761 58929
17709 122705 -109369 30065 -103534 80337 102423 156774 281534 -166942 -127511 -118257 60037
17697 -18956 223259 423093 200447 -133638 79889 -175897 -100393 -129675 156393 -8334 -250801
17686 -250801 -43425 176031 138126 -82269 147828 518208 -143387 -217430 -165212 -162815 200162
17674 -92789 -122590 255274 109090 -39890 -76949 -2350 -212340 -35637 404352 -278347 -226210
17663 -226210 322860 -4247 -1229 132231 -229438 99305 79837 194576 172132 61819 -275331
17651 -113936 2647 6581 -96765 14064 -229132 -11008 -300583 -14878 17501 3731 -3041 -366098
17639 -366098 -286485 -14169 335823 -159539 315955 -127116 84684 -78283 213935 249047
17629 249047 -36756 -62388 -87858 -28015 -102936 -238279 -77515 -48872 109127 56353 243407
17618 243407 -24092 19580 -60925 17518 -136901 47212 119500 -139842 249071 -276499 297599
17606 -124578 -118368 201510 -234849 199916 -140314 253799 127477 438361 21398 40081
17596 40081 -159837 133279 -100322 37291 36665 -218773 -42673 412038 90231 135168 196825
17585 196825 -53911 -25975 148659 53081 275768 -141911 156506 6948 288521 84298 31379
17573 34027 203897 84649 74311 -118788 -24605 -422597 35037 187933 22766 143037 -82663
17561 -250750 -11941 -88736 43203 -198771 210484 77531 23650 163630 401575 -91716 67801
17549 68697 -113549 138369 127915 77632 71391 424130 112757 148966 10995 5915 122159
17538 122159 179941 194742 23738 252438 -70553 20906 -73836 130040 292523 99911 315367
17527 315367 108863 69395 108469 117484 -118725 -108332 209759 262344 -19975 160817 -16018
17515 244284 129274 181874 156113 -240566 -128600 -64091 -446891 42496 -185248 354826
17504 59858 171454 -138197 -62975 234737 -49781 36627 199460 306027 121800 -191185
17493 379173 141731 -162453 -81992 185746 102647 203490 -49196 -132577 -54427 33817 234972
17482 234972 281019 -256638 -205978 163479 -61997 -107883 85630 114898 -2507 138678 353027
17471 353027 -117540 218534 96681 -166512 218888 27679 -49061 179121 184111 111673 126193
17460 126193 56896 220351 137354 104025 132834 195205 238024 84311 333925 176214 162449
17449 162449 238655 150398 -374054 36077 460244 395518 255063 529150 533912 15538 127459
17438 127459 303867 160973 148250 155073 160234 149575 54332 602277 -262654 232341 -10491
17426 268607 151937 575306 510355 255637 -17889 104425 366040 174411 270204 -32811
17415 276724 266956 363459 213065 -194876 373795 -64006 490453 195757 119105 222197
17405 222197 389525 280029 205984 -54662 308538 -43999 378720 118452 94374 134108
17395 134108 92751 278136 -65057 161707 330744 99436 69831 312543 151504 -47309
17384 8335 434448 336873 147380 191341 127462 475249 -66559 286511 58288 -110721 26352
17372 265494 -123171 15705 -46204 123031 108985 227464 -67116 125928 -104365 545274
17361 -93149 75033 170933 -41034 215715 211368 120587 -112518 106911 -115201 330297 225752
17350 225752 210785 343229 -31052 2723 -33319 -142391 -87074 38772 166621 122974 183660
17339 183660 292557 21112 -151860 203151 165667 370818 280043 426351 135590 -98389
17328 -11754 415313 82149 122741 280372 12569 240715 -74965 149012 -72125 41519 284690
17317 284690 22076 434031 210613 338258 -314483 133246 -8986 125517 -22944 269256
17306 46905 28066 204790 154490 300194 242796 383390 -6957 212477 1255 229374 4942
17294 284582 -26585 62143 42338 161047 20667 200702 287856 308593 -76962 -134025 -409487
17283 -409487 -200063 -21667 -328861 33546 560608 398975 190491 146380 -7587 330995
17272 -43663 232991 293671 254710 71142 269265 -38787 -38838 507693 223354 126758 32859
17260 171355 201849 516790 330631 -23254 117432 204974 -104876 207665 -64608 37770
17249 -145081 54530 -12886 259082 57827 93792 592780 224240 369501 396829 286321
17239 286321 92013 260839 273796 190718 -48032 256644 286729 74787 151430 77919 46443
17228 46443 347958 251671 488631 -40181 412163 -127813 245694 282345 -54106 677125
17217 185916 301735 157165 346922 80386 364842 70966 213645 236080 214449 400674
17207 400674 11961 384529 -43320 -73062 -70406 59117 298249 370801 242598 6463 132288
17196 132288 322806 401082 150998 425890 88275 210050 117188 325135 12393 270659
17186 270659 421802 260313 269375 399222 6265 283642 -11244 326470 200440 99964 354975
17175 354975 357069 267969 211370 336465 439870 61512 255435 224756 366324 92737 291565
17164 291565 554690 333430 602895 191222 178047 423767 494710 462873 7326 147064
17154 147064 593670 435215 18752 250399 97408 247436 502683 170715 497558 354179
17144 354179 377058 302189 271800 -52200 685195 438598 449403 302031 501180 569870 267192
17132 234205 -8408 319863 172394 422 240870 175755 232950 436232 471716 278393 478694
17121 478694 610632 124891 311281 535857 602536 423959 420966 481131 352476 476078
17111 476078 587210 427023 521316 289013 275064 165303 315893 237776 559957 512162
17101 512162 364250 599586 493850 421241 505510 784468 236302 169236 590863 314425
17091 314425 298798 542162 568338 460275 293509 304479 402517 282801 185748 544187
17081 544187 523692 714421 173899 511842 454422 334710 315343 335485 489650 682400
17071 682400 331302 354407 776080 43585 510149 -14591 219226 599468 604498 534505 869687
17060 869687 629262 596144 454730 279383 579417 597734 674579 608883 933778 363910
17049 636501 468352 541002 503725 605269 322492 384996 615969 630392 255467 387168
17039 387168 620534 321901 543054 533766 790244 621474 981948 357264 472064 666923
17029 666923 528064 756561 513341 351449 677163 521647 645667 643684 680022 820794
17019 820794 486495 613917 827942 330555 538955 753801 952936 495746 560005 753771
17009 753771 586462 739476 836648 811405 458974 588417 727353 626507 823144 1077873
16999 1077873 356936 838310 925510 877524 544165 841567 1099984 805080 863548 905956
16989 905956 969757 495424 783662 865246 801098 606294 882218 631100 897325 771119
16979 771119 797590 1119351 985529 914596 827915 592302 743489 944612 489624 854803
16969 854803 743060 792753 1023751 1077023 1071069 1001063 433212 889759 988570 1164407 792313
16958 792313 827649 1209770 743943 1227721 1061484 936268 1027155 1037934 1214448 1371649
16948 1371649 1127111 1296516 1138892 887910 1091075 1299633 961475 794615 1276975
16939 1276975 942050 1332432 1143078 1172174 1151383 1260834 1471356 1553364 1482435 1545469
16929 1545469 1261064 1380791 1390953 1718175 1481562 1510499 1146858 1794524 1232318 1368124
16919 1368124 1317210 1592773 1469576 1259720 1524724 1678172 1359434 1558253 1634293 1731561
16909 1731561 1348341 1154876 1719915 1893089 1922574 1670292 1836406 1602884 1678910 1588102
16899 1588102 1904317 1731156 1688554 1844390 1915677 1702277 1818885 2035647 1871939 2003761
16889 2003761 2185039 2153589 2278856 1961094 2349541 1856167 2244905 2101995 2323281 2109263
16879 2109263 2469355 2474615 2338892 2337588 2501798 2537772 2881061 2703065 2569003 2336227
16869 2336227 2633513 2670824 3081294 2526861 2569395 2527264 2986420 2646164 3307911 2797794
16859 2797794 3119874 3226915 2967608 2856821 2801015 3497150 3070521 3376524 3453486 3492498
16849 3492498 3948098 3592160 3593476 3686613 3917577 3855965 3907526 3802971 3870890 4191165
16839 4191165 3971980 4044396 4348765 4224005 4228823 4337114 4397538 4171560 4841867 4703675
16829 4703675 4510703 4975507 5120326 4657050 4848809 5056095 5003705 5193780 5339911 5221898
16819 5221898 5721102 5695670 5708251 5972877 5943840 5960454 6463784 6598397 6453115 6712651
16809 6712651 6337326 7034317 7334969 7442175 7463141 7655689 7923039 8162240 8279200 8115569
16799 8115569 8784853 8690322 8727376 8788298 9264078 9344686 9480870 10298680 10241579 10495329
16789 10495329 10845087 11212618 11561431 11627057 12016810 12476383 12750270 13247040 13631224
16780 13631224 13946267 14084430 14662643 15183181 15719704 16096585 16699808 17175944 17571156
16771 17571156 18299217 18967672 19660547 20016190 20852781 21940057 22625885 23446009 23951580
16762 23951580 25241150 26246886 27115929 28184067 29511134 30330599 32011265 33251248
16754 33251248 34533290 36118770 37942079 39400831 41349065 43382714 45655975 47463905
16746 47463905 49785976 52406296 55195638 57922742 61206930 64427050 67746695 71606694
16738 71606694 75358549 79738169 84603656 88842901 93703181 99104449 105241149 111048261
16730 111048261 116762838 123549350 130247564 137021628 143692854 150643041 156864793 163468021
16722 163468021 169349628 175068409 179836296 184057911 187133274 188974536 190251873 189840857
16714 189840857 188595572 186218847 182893339 178470868 173673773 167690267 161631426 155120572
16706 155120572 148211165 141404430 134239617 127527473 120843603 114231524 108186172 102140043
16698 102140043 96814694 91266945 86438724 81779203 77181885 72974857 69282399 65326202
16690 65326202 62146228 58824466 56192147 53212257 50580869 47926573 45683528 43463784
16682 43463784 41521410 39643930 37818673 36166625 34331560 33246819 31741553 30477926
16674 30477926 29248184 27957926 26829395 25683882 24773180 23528177 23142338 21922541
16666 21922541 21377790 20690440 19689440 19356889 18619646 17805329 17694576 16585870 16336756
16657 16336756 15534326 15242428 14847882 14218951 14117137 13222790 13201468 12831673 12518264
16648 12518264 12397689 11609030 11455579 11143470 10557711 10600168 10055051 10061157 9738441 9507000
16638 9507000 9257313 9233656 8429352 8428851 8485999 8330658 7871255 7949353 7586711 7736540
16628 7736540 7389901 6992539 7051117 6669360 6642663 6320681 6551149 6377117 6189411 6051510
16618 6051510 5799136 5538517 5507303 5686416 5432127 5396540 5354099 5086392 5128992 4888512
16608 4888512 4779487 4713461 4762560 4581372 4468713 4695467 4484137 4358953 4176562 3802043
16598 3802043 4378481 3908956 3876478 4310406 3570874 3524523 3815377 3795941 3447873 3296999
16588 3296999 3373510 3651727 3573284 3423366 3214724 3164167 2996758 3336088 2822833 3042367
16578 3042367 2682053 2913505 2409332 2699549 2773359 2759134 2866512 2758426 2553464 2449021
16568 2449021 2581311 2455334 2305349 2485852 2527347 2641995 2087948 2215044 2170886 2285791
16558 2285791 2060038 2168048 2026616 2049420 2171659 2133924 1749969 1951963 1933960 1912069
16548 1912069 1861032 1831983 2115255 1878293 2015081 1840244 1789716 1646514 1525027 1421032
16538 1421032 1773673 2082736 1688348 1852719 1524296 1805992 1651756 1643053 1772257 1122450
16528 1122450 1654132 1440531 1274788 1738128 1863909 1388835 1288808 1549309 1250730
16519 1250730 1586048 1541266 1477258 1422831 1110530 1405787 1636516 1201010 1187788 1359591
16509 1359591 1377774 1377689 1307278 999838 1380286 1247256 1097631 1392318 1240215 948391
16499 948391 1099846 1195768 1114570 844757 952443 1377046 1143774 1096402 918181 1015733
16489 1015733 1087342 1345559 725499 742034 928402 925946 1054338 1001372 1277976 1150566
16479 1150566 1088282 1208233 1305364 983392 1034527 930706 930658 911634 959050 1194322 898183
16468 898183 1154047 935399 1042441 834019 642264 936346 731436 753601 582315 506110
16458 506110 695594 807972 775949 863317 1038137 791170 980955 601482 774584 589088
16448 589088 639574 876845 811658 595373 371435 501819 764398 264499 763069 764417
16438 764417 500948 655636 621088 1023165 400489 579628 630437 939819 893000 406486
16427 415493 669295 993222 652688 986755 649189 702378 629677 644753 594810 1106204
16417 1106204 346823 387882 525072 535072 396299 651862 794183 402899 778194 453634
16407 453634 543206 679046 621600 561042 829346 359768 836034 677778 565509 518101
16397 518101 609356 729819 612023 487697 503896 332930 552113 606389 597548 605446 463245
16386 463245 359196 279793 184455 539919 212592 383872 651488 557341 480457 456211
16376 456211 376019 468131 400394 720522 723530 490883 684536 455105 435871 314045 700126
16365 700126 417455 280708 710331 472595 429375 166929 76736 91081 277051 387831
16355 387831 655044 245960 492799 542656 335290 429716 88527 348273 401340 245845
16345 245845 452406 338578 446768 497668 310135 158061 395338 342333 464779 147222
16334 321965 61779 391339 320478 269973 342309 -28281 565075 269348 339893 446128 513778
16323 513778 138420 555529 -153096 121250 87406 770377 456962 76850 267452 406225
16313 406225 144610 174890 237084 531077 -15081 55999 222570 121865 256218 480208
16303 480208 580168 222952 253233 692709 424539 295184 361979 451188 88813 384010
16293 384010 460199 210399 417281 310489 471059 582564 125091 142540 702346 365404
16283 365404 203443 430477 60930 291312 109907 235868 298808 296521 305170 172472 338136
16272 338136 29555 206950 203545 164178 373724 154409 352752 93276 333222 -140860
16261 100754 -124212 369869 288251 209924 416614 317120 240817 145886 463168 396256 -36864
16249 271482 99386 416574 329436 21590 -12619 310889 311697 90285 163201 319063 265035
16238 265035 149893 150733 100787 -178121 188991 -150321 515547 206264 76386 174776 293950
16227 293950 273517 129810 139896 -16588 32202 -56934 68366 163084 229492 273753 -62396
16215 249368 36033 414462 188749 67873 351567 146211 -163018 302743 119159 124270
16205 124270 -63892 -129440 154025 139802 189690 462682 -46917 199205 -9749 -46213 343364
16193 186587 279917 14 -53444 149499 78406 246481 184416 298048 124327 186069 139882
16182 139882 69190 56602 113679 949 178454 190774 116424 173828 406839 354316 -66418
16170 304504 194903 270742 190393 36762 83290 -43347 7882 40303 114292 39045 304480
16159 304480 299651 -150408 189554 223646 218999 285988 -145924 -199774 143818 320269 -119004
16147 263411 94408 264538 138782 -305441 97115 335755 232321 105675 177230 -94018
16136 53316 143638 260932 91281 18535 -60184 -15095 260507 76726 123905 -81030 282203
16124 -43247 109958 173066 138026 89398 -7863 160987 -28826 -167813 -172393 -229067 140803
16112 -126682 383712 85138 216030 -83937 -29274 7388 53657 104064 218659 472079 163125
16100 -134322 -13383 106577 58427 364550 183941 181748 -21156 -132079 -112296 177516 302281
16089 302281 22815 241629 -440250 -261253 83430 -49326 87124 -194973 -59697 272320
16078 -443912 9929 30903 28805 272228 -67788 -201805 190593 268936 69157 -14565 137132
16066 184940 35893 79425 116804 -167830 -130769 59231 5472 -275247 344161 -119630 16863
16054 18764 106877 -121241 -13232 117829 104342 -31965 -31525 10372 253582 64148 10778
16042 -29442 -79144 -162486 -134886 -177581 -178676 121298 109515 98923 -206634 117484 -69543
16030 -98303 112004 52236 56332 68297 -158020 -94540 217199 -2441 2543 19715 -55865 97774
16017 -166073 -37525 2990 184632 -22642 -318880 143065 33931 -174438 37052 -7015 -222559
16006 -222559 -254599 -52785 -296310 267082 186650 -67657 -46875 197279 57022 43641 58078
15995 58078 -67180 -92299 -61326 -56373 168669 30663 171121 -122052 -263746 -26101 94574
15983 18672 -53538 39523 143541 273914 330853 58754 -117358 -3281 -77835 -189812 -491830
15972 -491830 -85185 -54242 164446 -14906 -67611 11842 260670 203774 359038 -40523 -280931
15961 -280931 -221698 -270230 113055 79716 10288 106930 -20033 30797 150341 21360 51023
15950 51023 312332 -88907 57962 -332921 -34106 72633 48709 110622 -130721 -191295 -103608
15939 -103608 371663 -104630 365005 -116068 -88678 -102553 -41588 -118239 -84984 -280939
15929 -280939 -60259 -96310 -137700 -378645 389111 237924 97500 -240118 -322619 -5374 102237
15917 -296815 -60039 -158108 -82637 -106603 -251834 -132560 -260943 2535 -290595 -386074 247122
15905 -349055 -22863 -38103 -128627 -3191 299132 -171360 39020 -119796 -105333 280084 123383
15893 -18712 24389 146376 147713 169052 -311045 151755 -182189 171144 -276124 132171
15882 -107904 92083 201005 -355529 -205210 56500 -180654 101291 -20453 -89076 -192514
15872 -192514 -255850 -6235 215834 -212950 -186940 42748 -405525 -212728 -177815 175176 93944
15861 93944 54812 -121777 372223 -59220 159153 -118112 113685 89312 128745 167516 78542
15849 -249025 -47365 83633 -124529 177029 22502 -208284 -129094 117135 -71901 8899 132670
15838 132670 -210011 -185089 -137368 127199 -359158 -32250 -82910 -71541 77520 188075 244535
15827 244535 -27165 27639 148144 71618 -13578 95225 252074 57165 -313704 -70619 -292372
15816 -292372 -80442 -259888 218472 73099 74734 -286026 137570 -226507 -174306 -55778 163838
15804 22584 166831 -9000 125644 177823 -130733 -118749 -11580 58391 33117 -2725 24280
15792 -171963 89035 26768 -53354 146022 -34021 73961 -194609 -221524 187189 -281882 107371
15780 -425913 -110490 -169150 31546 225833 27970 -98793 -67809 -194683 60819 -25285 -69086
15769 -69086 24461 -111969 404064 -63116 8037 -92334 393296 134675 -21684 1638 70013
15758 70013 330336 118049 -97839 109510 182319 102986 -55052 -264159 -171019 -59766 -343614
15747 -343614 178412 210151 72228 376476 292434 -310009 -241219 73740 -54862 -11433 191623
15735 -141525 -300586 128892 26202 -13288 -124802 -87715 -66584 348193 -88625 97799 322860
15724 322860 -89738 163981 -129640 -40428 -136718 -162996 -100822 179946 185474 218098 -106883
15712 -217988 -180581 -12685 -121334 68001 -190559 -103194 -142785 -193939 -13894 -132667 -98880
15701 -98880 5190 -78790 183088 79634 -146286 -55847 -348769 125204 197311 -56122 148323
15689 -44907 -118305 -50460 32794 84314 121412 -40929 150837 -125190 159815 133030 -180667
15677 36123 -175993 226676 368525 -85032 -388594 -162349 99076 -142625 70134 156035
15667 156035 -138123 -168891 -27306 24217 -177134 48112 162248 -301723 28592 -192151
15656 -65290 195809 -157651 -97897 -44519 -165827 56934 -84720 -182980 157699 249241 9208
15644 322121 68676 34590 -19466 -107912 -96439 -27617 14028 59092 94951 -215240 44285
15632 -192535 -158227 13748 157828 -15169 326954 107731 135998 -192954 -174817 -242472 -9048
15620 -84665 -210546 -62061 -83367 79842 -45222 152502 17194 31506 -80688 282716 -18691
15608 -75570 -241427 -141632 -53287 -180488 -242503 212949 -328193 -208756 -107106 134109
15597 -747 -29741 196124 72615 -141648 -56627 -165668 65500 191757 65969 287597 101163
15585 6006 183302 349391 -121997 300242 -146407 94171 -177988 -112663 -438156 138800
15574 -226956 179333 -5852 -71552 -150702 323582 -95243 -37036 55256 272885 -294707 1276
15562 -46651 -62855 419559 -173281 127318 -170085 147326 5475 60884 -206539 -194395 -180071
15551 -180071 159821 -34014 -221230 -172213 144109 58703 291214 -172497 104505 145261
15541 145261 -211093 -52769 -140234 138978 90261 -58579 142838 60967 14215 -193997 119776
15529 68603 -121456 -190882 85454 260089 309141 241199 -143844 87136 -142900 109220 -166671
15517 84954 51829 -108222 46849 -165014 273878 243328 -59115 -413935 -175157 161492
15506 119338 -136215 -71623 -35153 -254582 33500 41065 8401 132558 79307 -165300 -93250
15495 -93250 145503 124351 88877 -107272 229302 335175 228308 -91721 32377 44367 -55317
15483 -72396 162246 -13173 41022 -64916 -101891 142478 277656 -190901 -40042 234232 216683
15472 216683 268554 284915 -319412 278491 253641 -162341 -124898 -38126 219558 -470487
15461 -279879 136797 7170 107732 100953 -245742 317464 73420 13446 -261518 94634 -4861
15449 122471 -222271 -60900 -127716 -117249 127013 -105730 -67302 -282349 -199759 158193
15438 -287554 136104 10197 186469 -112335 1143 -143750 76023 -96232 205684 -215017
15427 -142049 -107160 -438432 -164867 -129287 -437959 46791 120140 -142489 150087 -66744
15416 -4891 76873 -6094 87506 -293719 126987 4343 46421 -267502 184470 -12570 -174434
15405 -174434 52324 102788 -240057 30338 53888 54919 -122428 -70397 137019 78763 24282
15393 3351 -142090 104606 -174696 -266205 82712 87005 -218706 143640 -139331 -209050 69772
15381 -394056 154436 242688 155813 44766 536287 422820 115833 -361388 324458 -300955
15370 47603 -97102 85436 327446 215789 -7576 79465 12156 131284 133098 -227387 247552
15358 136172 33141 202590 -385074 345491 135330 -70156 -347464 83411 -68422 -286801
15348 -286801 98119 189324 -193599 112645 -76635 150371 42898 -97815 -29087 -23332 -98465
15337 -98465 85235 -214482 -139963 -127699 -146344 34623 274769 -396895 95860 -116782 82223
15325 -128143 -181494 -187128 68317 -113794 -104252 396286 -145335 -100798 -150760 154976 151644
15314 151644 238259 -317410 111150 -76266 -194974 180492 -223273 -104098 192971 247367
15304 247367 174388 97398 -69228 -11384 191495 -117367 407493 93198 35967 239180 -47126
15292 -131437 21356 120773 119155 144543 141913 -28530 -2639 61095 47965 216506 160752 194474
15280 194474 298283 -98683 96059 -163975 -112598 201725 -85125 151161 305419 43311
15269 -32705 -84708 -8655 -23685 -39536 -79582 -233102 -106444 259244 -64622 111251 210380
15258 210380 -186546 241023 418308 34276 -95837 -226799 161309 202845 290504 -49221
15247 424619 1865858 1530960 1364790 2176167 927786 489181 49247 32077 -44600 64949
15236 350761 -81098 -27126 -221866 -212777 -188362 34573 22056 211201 181133 -71372 86416
15224 87651 222738 -187015 -182257 -159817 7311 82673 61369 197526 436488 280233 343919
15213 343919 -276812 132916 111418 -25887 -176432 9984 247716 240067 -5008 -85481 -40126
15201 -397454 161649 246055 -256228 -205476 169591 409136 182397 114987 -266056 -195039
15191 -195039 -99154 -41624 -82066 -153865 155571 -106705 92669 243657 213312 19362 134456
15180 134456 100836 281052 10678 488184 168152 66682 237164 441707 106848 183979
15170 183979 60644 112868 21355 275740 -86988 374366 -17515 295022 352619 -110144 178906
15158 70270 333216 -17680 398252 356547 276639 -34835 64270 80287 -110345 20008 -170783
15146 282786 124101 -89381 -88957 57482 419097 224288 13259 79075 130941 66678 222363
15135 222363 184873 173640 -38772 -8810 6966 -173655 -199681 3580 -68695 -143634 273224 -228290
15122 24907 43829 87505 424879 105261 10693 315035 164220 201081 -157975 367452
15111 342828 42122 147700 165656 334392 204791 134944 273633 143247 25150 -68142
15100 -242692 -182428 247081 36433 -19604 243416 190058 433411 202753 -123225 116887
15089 169161 410799 252055 -17309 -70331 224950 182434 253666 196665 178241 353315 78777
15077 187425 -1449 207288 -322546 51231 483974 196050 33449 444071 267536 105935
15066 185077 305420 -62411 -142649 121530 -57104 98432 109372 80619 83104 228071 96698
15054 354587 -77265 176326 -167935 40793 260543 308202 204120 171586 150578 235824 338576
15043 338576 131377 -102400 -44413 141663 304531 336884 193659 331304 128764 305858
15033 305858 120396 31023 364158 -32380 58861 314733 -44536 176900 -8974 478093 -67787
15021 327538 342403 315169 224889 130575 171357 318098 380246 -133 -196661 428743 294017
15010 294017 48329 139643 -2668 307185 475247 -107611 81356 256089 268723 349999 -217469
14998 380021 477889 179514 27807 371250 213827 295651 87166 -23352 3839 178791 120064
14987 120064 173795 572970 419222 495393 163395 208666 169636 318813 115896 406771
14977 406771 40330 76512 502231 151544 199444 243948 -77817 384065 272145 437444
14967 437444 -17556 429794 181046 -52304 288924 249684 47025 159306 508552 191371
14956 197068 11260 41612 237868 -53971 233378 -37091 107279 -14912 565864 209948
14945 249199 141610 379496 93066 586775 -25264 400745 579039 104912 11544 287973
14935 287973 240820 362702 400725 199788 311116 394444 315610 335863 348976 470283 87666
14923 626074 544317 579853 240633 171270 255553 284663 13102 499548 62711 381437 154793
14911 143681 590074 474757 -152734 324172 247723 119694 331849 328967 296888 390565
14901 390565 522389 180044 284457 421589 204941 339739 240596 383366 392332 661648
14891 661648 434131 581955 702769 269752 524600 51495 437264 317559 484912 425259
14881 425259 110406 369898 550377 295246 496739 597052 607899 116852 441399 125958
14870 239691 668648 509258 217950 362245 131039 421185 736168 464224 375351 361295
14860 361295 165515 207324 461748 652954 183252 44406 599579 536061 527455 42847 360438
14849 360438 547433 336966 356455 312694 356943 475524 157584 482949 526909 459157
14839 459157 637836 489307 557969 760008 519413 602179 954319 818262 657495 559795
14829 559795 669969 310079 449186 1089012 375716 570483 852357 416387 237766 548096
14819 548096 667022 541026 629075 597264 598865 772623 399991 496028 487677 332489 646399
14808 646399 399132 261301 497268 517948 262797 529490 346144 473389 465073 555086
14798 555086 568046 574227 587243 446576 512333 598563 338276 273592 644485 640042 648932
14787 648932 425018 484088 578575 439628 165811 475418 478052 796693 621478 618968 476073
14776 476073 600919 744403 676580 630101 561892 622123 777353 229911 232885 622302 732195
14765 732195 831964 631771 743906 550250 504598 530153 483827 1127340 557326 670769
14755 670769 870862 723149 825924 728600 885739 435378 700558 959076 647219 663154
14745 663154 884762 692817 793415 700828 229017 624489 708881 879995 760376 685037
14735 685037 761376 770956 609751 484287 632841 867600 300118 967086 593858 839574
14725 839574 534688 673084 956488 888553 710954 876809 933976 1193700 883964 811221
14715 811221 916922 844285 841867 1056376 699684 776684 1107961 809035 995467 1011739
14705 1011739 1101660 993473 989032 1104257 710151 769022 928952 1059248 1125488 1112420
14695 1112420 1373972 832122 715631 956099 659100 858601 679690 903795 1090333
14686 1090333 817844 999243 903112 861683 962952 980934 1369630 1176935 1072317 947455
14676 947455 851355 1074452 1263619 857671 973244 873571 912312 1069406 994186 644065
14666 644065 1160969 906214 1441838 1136552 1039062 1357506 734062 1019339 1353931 1198935
14656 1198935 1308757 1212155 1085530 1122639 1200586 1453549 1214184 1501035 1328211 1276377
14646 1276377 1120814 1396793 1186471 1079210 1194886 1251688 1118023 1358235 1099305 1562622
14636 1562622 1475164 1547230 1182567 1412186 1209187 1267299 1431128 1421813 1345189 1617892
14626 1617892 1228252 1565334 1451112 1436681 994301 1390565 1318775 1572608 1618847 1557112
14616 1557112 1564696 1407483 1725208 1653606 1895775 1458120 1457529 1576341 1641233 1884405 1514374
14605 1514374 1790313 1740016 1718579 1816205 1711361 1647352 1525323 1888990 1888164 1900902 1857404
14594 1857404 1531711 2014973 2091444 1835313 1728565 1798529 1934604 1832416 1625804 1798926
14584 1798926 1699005 1775569 2138454 2402075 2039323 1887500 1944797 2117342 2080672 2078309
14574 2078309 2026130 2019147 2373801 2335618 2528277 1962111 2197582 2333232 2357017 2535690
14564 2535690 3065181 2434301 2450707 2637726 3062627 2476617 3119141 2991453 3115324 3392578
14554 3392578 3626588 4347779 4368056 5062205 5847683 7566176 11064272 20716947 39128089
14545 39128089 43355011 23644998 14072424 7595242 4066757 2875960 2436294 2120823
14537 2120823 2187071 2361526 2269083 2125104 2366856 2063236 2507287 2073591 2107636 2101581
14527 2101581 2043466 2568222 2082682 2733897 2673283 2530081 2551573 2539045 2694060 2617433
14517 2617433 2719132 2640334 2973527 3060131 2672008 2911581 2802920 2466668 2894005 2960006
14507 2960006 2816722 3226536 3100261 3031150 2929704 3171263 3078275 3145164 3417614 3132214
14497 3132214 3267426 3537147 3519766 3353821 3516612 3432446 3282600 3490947 3715579 3664239
14487 3664239 3599260 3573384 3766948 3589568 3629714 3819640 4498045 4151099 3890535 4147434
14477 4147434 4279980 4231983 4160516 4046833 4365654 4488353 4658570 4720441 4525862 4509726
14467 4509726 4711184 4695324 4751770 4683591 4852558 4609712 4813797 4881379 5274861 5117765
14457 5117765 5127599 5155813 5133909 5368830 5808160 5661481 5933812 5794241 5530653 5644631
14447 5644631 5667995 5975744 6154731 5774321 5628384 5993331 6110990 6176150 6131459 6174481
14437 6174481 6812156 6556393 6618359 6882665 6922121 7094109 7130886 7278960 7425265 7572496
14427 7572496 7326101 7733587 7661535 7697752 8296178 8068356 8329828 8361932 8392229 8758458
14417 8758458 8437366 8768886 9056810 9072883 9123723 9079826 9278113 9740998 9393692 10182889
14407 10182889 10100761 10117099 10359000 10385688 10582471 10948062 11215417 11205222 11159094 11248947
14397 11248947 11552406 11619232 12038205 12203898 12525577 12614960 12318059 12887163 13172289 13333103
14387 13333103 13699374 13996595 14312961 14176177 14671512 14760942 15077717 15264479 15470453
14378 15470453 16107711 16155577 16859731 16793788 17226243 17594557 18147213 18292785 18403848 18906040
14368 18906040 19410047 19624615 20017574 20502464 21087305 21453168 21604243 22324751 23078037
14359 23078037 23098919 23681681 24478268 24548444 25710329 26106755 26482912 27066750 28200162
14350 28200162 28446717 29261141 29843252 30344942 31506252 32189154 32832479 33783292 34499864
14341 34499864 36124494 36706456 37682561 38572403 39642491 40830333 42113177 43149282
14333 43149282 44426418 45819965 46984656 48612686 50030030 51478399 53444440 54699314
14325 54699314 56705725 58983347 60741323 62530182 65068988 66918621 69662341 72101911
14317 72101911 74347438 77454410 80359100 83599803 86593464 90209722 93510589 97495457
14309 97495457 101200194 105479708 110031026 114994235 119705133 125096442 130565286 136682208
14301 136682208 142808303 149357108 156278766 163990693 171881749 180141070 188348699 197934048
14293 197934048 207761872 218083413 229073422 240707812 252492895 265423711 278160048
14286 278160048 291983862 306053515 320614371 335547808 350545259 365713480 380735187
14279 380735187 395278025 409613532 423169532 435973013 446944367 457359902 465220422
14272 465220422 470520857 472384953 473606487 472133886 469219093 467206784 462533134 456312681
14264 456312681 447834052 437299915 425002343 411236299 396676343 381182163 365833782
14257 365833782 350184157 334469488 319052003 304417069 290921133 277232591 263843805
14250 263843805 250693074 238736035 226858741 215744584 205472779 195646945 186825830
14243 186825830 177831767 169848717 161755913 154299761 146980774 141104783 134759877 128969156
14235 128969156 123292729 118282101 113457189 108468195 104402303 100588739 96299000 92504607
14227 92504607 88959084 85367316 81968098 79343783 76178595 73766228 71159946 68911752
14219 68911752 66164671 63926886 61986645 60064191 57961891 55983362 55069953 53361727
14211 53361727 51263469 49962782 48351978 47037233 46499367 45010048 43670630 42278565
14203 42278565 40920855 39744955 39005652 38079842 37356745 35788366 34785969 33772126
14195 33772126 33019066 32680539 31758095 30648184 29930104 29302559 28422285 28050350 26997412
14186 26997412 26644448 25691183 25503156 24743119 24473070 23622915 23343876 22879988 22017696
14177 22017696 21808409 21514443 21080648 20551434 20080481 19621991 19227222 19052779 18520070
14168 18520070 18154203 17714116 17577516 17231582 16667188 16636895 16393088 16077270 15795960
14159 15795960 15497263 15060384 14939776 14371073 14395414 14188446 13680368 13698443 13344748 13099745
14149 13099745 12824067 12791032 13051820 12227042 12118241 12014920 11629905 11580795 11594075 11119687
14139 11119687 11173958 11140100 10960133 10724769 10305032 10251354 10053709 9931048 10004401 9816231
14129 9816231 9499722 9201378 9129566 9159916 9150463 8824573 8593235 8495142 8717521 8447795
14119 8447795 8564924 8528961 7875578 8078979 7732331 7863842 7855329 7753498 7243332 7540145
14109 7540145 7467438 7560614 7286294 7233689 7198651 7069561 6798008 6688657 6705948 6521202
14099 6521202 6322890 6447260 6457005 6251529 5933444 6240941 6243729 6220325 6116662 6096012
14089 6096012 5708602 6149588 5514345 5559710 5692834 5446986 5716569 5291456 5220194 5388741
14079 5388741 5289932 5152019 4851765 5261561 5095621 4884958 4766052 4852082 4690973 5158249
14069 5158249 4247064 4404432 4556383 4313283 4738472 4462696 4281589 4530687 4494433 4417252
14059 4417252 4210798 4737974 3929994 4221007 4351284 4328392 3878382 4247713 3848861 4030292
14049 4030292 3781639 3837350 3780713 4180734 3337117 3772064 3468446 3514195 3697143 3759816
14039 3759816 3333872 3618517 3332509 3279841 3420681 3359661 3503819 3137700 3101872 3011386
14029 3011386 2962264 3476309 3204104 3119787 3256617 3451727 2804016 2967342 2766980 2516230
14019 2516230 2776334 2616442 2839806 2812058 2869270 2587679 2682809 2297501 2366963 2504502
14009 2504502 2657688 2581868 2233078 2836689 2922654 2404304 2256504 2447913 2459863 2336105
13999 2336105 2325301 2395877 2156284 2249654 2227659 2153109 2268491 2271146 2678308 3167357 3954512
13988 3954512 6553525 13356647 32232383 45374071 29122320 15744299 9741648 6913397
13980 6913397 5767297 4527205 3975141 3972620 3534466 3273875 2719647 2998988 3111759
13971 3111759 2677819 2734073 2388350 2737493 2934385 2702702 2451924 2366928 2438359 2498957
13961 2498957 2299753 2365581 2511455 2055275 2249684 1893521 2229381 2240654 2048653 2115706
13951 2115706 1957111 1870357 2211130 2180660 1976840 1927544 1986495 1883606 1763758 1659627
13941 1659627 1793412 2045194 2142974 1915372 2273392 1956033 1866759 2045728 1706547 1788938
13931 1788938 1965471 1720995 1798418 1633268 1596569 1762847 1823976 1778670 1585129 1483151
13921 1483151 1861597 1799396 1587394 1805393 1650904 1467325 1813239 1616311 1650312 1573398
13911 1573398 1772666 1654978 1219326 1442051 1520325 1699465 1370519 1600082 1350169 1773765
13901 1773765 1097772 1625828 1767344 1546472 1610954 1534164 1455998 1576002 1390548 1436777
13891 1436777 1758775 1116970 1446753 1416277 1503658 1461611 1577738 1294765 1451911 1100337
13881 1100337 1272308 925254 1342007 1475005 1474775 1335913 1199758 1483280 1144018 1196980
13871 1196980 1629841 1198342 1112895 1269958 1119753 1170346 1062981 1407589 1230120 1522987
13861 1522987 1068374 1052711 1061450 1067671 1246791 1190800 1456056 1221828 1204212 844990 851829
13850 851829 1156592 843527 1436488 1448154 930173 1058408 1319453 1390107 1114657 1034583
13840 1034583 1180787 1165135 981869 1298405 959199 770883 1058295 985582 1174618 973616
13830 973616 1015480 939085 728682 815083 891264 805774 687738 696446 879036 1004241 1166280
13819 1166280 834904 824146 795443 977638 879482 905920 1095249 629960 898874 1151648
13809 1151648 883023 713436 1188801 679502 1024345 769296 727238 1148973 882127 998014
13799 998014 899414 887901 738905 975281 948831 985094 796034 1002909 667467 1145835
13789 1145835 1131363 1039510 665159 538447 936890 933740 809376 1067431 806830 716041
13779 716041 965950 594875 1186525 855099 719030 795765 814459 658954 740217 544273
13769 544273 984544 603324 1109591 796503 498645 699021 1028708 620897 741948 767568
13759 767568 726489 835786 712175 755078 859782 852349 731433 815565 599507 579102 768121
13748 768121 506675 682371 780692 704954 416313 431373 827425 514901 716669 545079
13738 545079 806143 758976 878010 737345 624411 752881 917682 794706 897995 641933
13728 641933 566443 486933 562902 615328 750768 594481 659925 549561 768758 711730 825156
13717 825156 460465 659240 603937 453686 218176 582062 351825 860445 378392 859355
13707 859355 764743 489778 580223 778351 231176 711932 983895 365623 633566 418705
13697 418705 400131 300395 581040 932843 309276 521336 505882 434780 412535 501508 569348
13686 569348 201703 503319 551943 403819 385735 807669 579418 524565 458742 214455
13675 739577 162274 494096 961706 679257 403505 512641 758612 427763 299193 538912
13665 538912 444322 597843 464348 504354 575755 204878 353461 442380 749162 391576
13655 391576 251928 456870 675986 561614 600085 834352 563935 353551 666325 648870
13645 648870 611963 579544 338068 273823 626535 435956 698756 656566 594187 682994 399254
13634 399254 442839 472755 402106 867528 242721 642934 259226 462424 176350 352621
13624 352621 387548 305224 562588 384292 631693 599282 639753 317921 381960 699468
13614 699468 227282 334551 700178 404445 322715 317145 323292 296089 299141 492349 401414
13603 401414 280932 337330 170143 494911 294474 521126 435014 243576 488795 218637
13592 221517 547269 366678 678264 231762 567347 262404 416263 170496 215561 332421
13582 332421 416578 626889 227960 398237 424703 510643 381782 664527 335486 728142
13572 728142 454174 356420 211382 72757 470821 -113186 360699 167298 257459 290125
13562 290125 128345 401877 464209 453574 423450 219790 490618 346412 238408 394607
13552 394607 545527 409418 83535 705672 76953 546052 366490 208537 15199 333680
13542 333680 458860 537665 267644 10758 8787 296682 610837 452387 513314 283738
13532 283738 385132 453476 174769 551373 182969 603414 339400 431743 314127 211253
13522 211253 503716 122155 241352 285918 428911 376687 368352 322637 233664 273315 440838
13511 440838 476779 489687 645713 178368 545782 307645 244612 28857 220967 352267
13501 352267 264714 85723 419942 297239 299649 450715 215837 303407 315479 289399 441081
13490 441081 396309 334530 -13638 261487 100832 373626 22682 804926 145042 346001
13480 346001 334615 199231 273834 365770 3566 267001 434345 334145 263330 285022 185353
13469 185353 258283 187684 438831 304620 330196 120902 255535 226815 276097 452153
13459 452153 301237 76980 364821 109937 412210 14696 -190742 -280173 164166 159729
13449 159729 190850 256010 307703 324623 154933 266684 226467 234831 -47347 494010 474675
13438 474675 299186 292473 364822 152452 354989 178095 266756 -175491 33632 315432
13428 315432 284366 335783 469540 -50782 557261 279148 328135 271468 -15621 194107 548810
13417 548810 85390 112775 227679 336008 328509 76105 431666 -241151 478166 -25000 270534
13405 123722 281988 -153232 -60431 84037 289459 502680 235455 175902 315720 607877
13395 607877 385527 420889 194179 602405 167142 338144 73097 110215 153664 -57025
13384 264138 442991 239380 305219 324615 196085 276525 115469 49400 323675 242338
13374 242338 518605 87668 -92302 -60229 68008 412071 305940 56071 369380 264291
13364 264291 306925 -45681 335565 403408 193297 100945 74127 242584 487170 264411
13354 264411 157423 -50679 547543 -139974 542425 76474 -174748 402866 124385 260686
13344 260686 81686 337761 462658 220380 230369 270770 464090 179149 126546 443555
13334 443555 289416 321259 393302 46659 165461 -59665 488336 350410 1408 276449 168596
13323 168596 114685 -189778 202939 -40834 515627 513085 -4856 127003 118093 432103 140595
13311 663594 -106145 205847 -78766 252869 -114454 289132 -165957 578947 -16970 209633
13300 -125700 39362 45436 380690 144804 203997 55463 -35409 373416 222619 311654 45675
13288 228033 203567 293473 190683 228591 -4324 117607 127285 84642 212120 292366 207841
13277 207841 263799 203405 299089 28701 13674 316273 113917 233075 192939 111707 -70770
13265 -215630 32586 97564 81260 -62679 164856 -108094 145872 109414 36417 67115 361817
13254 361817 263873 -189055 -48959 67480 210604 44136 279788 405110 151669 52799
13243 134711 188203 194933 147618 172408 -154906 94139 452324 172945 22466 61706 200156
13232 200156 -73540 -65157 52316 -124047 -8374 214237 319824 182849 223886 39662 -79371
13220 145267 153779 296541 225505 -182937 310873 244550 284911 -268803 78038 141490 -292053
13208 260723 -8989 228809 -33638 -306240 365129 -91541 103456 47802 379851 -289912
13197 163957 176292 21331 58569 270230 187957 214970 -234289 -155074 380504 575682 161333
13185 161938 475281 98819 66812 110536 85686 43906 169790 -25663 -8705 244176 172130
13174 172130 45949 199200 79446 -77859 153925 208456 -15744 -32497 113629 -97257 150034
13162 -300389 -85526 -12819 -138926 -27558 -149615 380652 206551 -130781 -23229 341286
13151 531473 411090 44993 -13888 403280 15091 109152 -80447 338544 -42203 -145837 -91196
13140 -91196 -216948 195821 -13545 -71104 1353 259494 -40533 392450 -48042 -284929 7725
13128 372709 163239 -82060 160295 -6016 114558 45282 -148230 234005 -83398 33601 173020
13117 173020 372790 184081 189942 325107 322451 -88477 -62818 183575 106771 76355 -21856
13105 52669 290458 344873 4026 47833 -254031 84260 286904 -139558 -109967 55355 -61297
13093 91189 17902 153288 -11320 147544 371001 214408 71489 -121039 87223 124768 9582
13081 208908 5212 275031 449127 35318 -114569 120512 -194081 8592 154625 179062 111830
13070 111830 332134 -227044 145547 35772 -10595 -66552 37506 239091 -175739 143990
13059 41281 213070 133129 516184 77606 7533 148021 -78856 21629 278686 302756 343275
13048 343275 100360 180747 199704 157087 208409 110161 59943 -214145 121586 -40338 -205843
13037 -205843 112254 144500 -15949 168777 256763 61576 14375 188906 136560 142795 94874
13026 94874 408677 75496 120164 127609 178455 51637 182941 -13154 263468 116881 -45967
13014 234707 67300 257746 420402 211004 162694 -56292 112529 71667 -48748 220803
13003 351500 156043 91432 -119879 133952 -300113 15300 -40418 -205833 102054 437307
12993 437307 323729 75826 -59933 -70112 -253658 121146 323659 84823 121900 246688
12983 246688 -132748 39939 108817 121771 184593 -38652 40715 196494 -263327 -109012 103007
12971 -75686 -85834 208839 69167 47274 -40171 94181 -43702 -38773 241138 -378485 207756
12959 44059 93121 -122540 122037 56190 378287 129924 -30937 -54812 172578 167751 5330
12947 322677 202147 -227402 244596 25406 262320 -336566 216003 41204 128272 -66177
12936 -89214 131954 -226541 -197474 66675 262225 313029 251338 -133247 -128056 207342 211467
12925 211467 -309129 49897 62839 144949 -141377 163016 154928 -222577 -33959 166066 -41151
12913 40645 -210367 -92907 336739 -18051 -332999 -201414 208752 37470 363983 24935
12902 -60579 177947 475080 -68521 39901 -113650 -17353 -222406 91992 20587 -280550 10809
12890 -73995 238054 62283 198075 187966 183062 -36191 132796 -105795 75812 7783 119796
12879 119796 202237 -3747 45627 54791 58293 -38369 -35578 129484 241516 4075 -96957 118183
12866 -164899 270692 330367 8021 -2655 -120581 -197240 -201173 38048 196045 33334 322600
12855 322600 24527 143435 76460 -171302 -306876 -7949 -314932 -108306 225081 -73887
12844 -80961 -44947 437829 156863 -41683 -421577 289941 54445 163577 2692 -446500 97205
12832 -289177 158661 239990 269904 154085 -227930 -487606 -186695 -43123 -80795 -23586
12821 17630 250032 193839 44113 119060 207022 -431490 156724 132439 -67149 52814 18154
12809 612676 -288074 -168603 -108222 76239 276651 53094 148569 60334 -1635 147911 164116
12798 164116 -19414 129947 35403 127294 -53515 -21797 -174952 -81824 546028 -68204 148620
12786 173265 117135 -66193 -57846 -300412 119086 136858 -201904 132309 95540 -206631 -186027
12775 -186027 95338 -39404 -380176 -200140 -123724 343391 -205977 114636 127306 -15450
12764 144449 173982 92954 54111 -43586 165 91855 -39867 -181498 -47348 -85599 21122 -165292
12751 14288 -81482 -49068 -107406 158214 461293 78325 235637 -169993 358922 -49060 49517
12739 32237 203967 -19900 -66168 150398 -243247 156595 -160939 284442 -324044 -245598
12729 -245598 93112 -20595 30162 61658 325896 369455 -222312 37228 93409 -81182 -120844
12718 -120844 58327 260217 231431 -342904 44345 218214 139586 241154 65498 -149588
12707 40508 193585 245281 56870 122424 52716 133684 -296405 -75473 124663 152195 224605
12696 224605 13829 -36355 142624 403266 -35844 -6015 246675 99366 190912 -126110 -29026
12684 -39001 -74973 32993 -110948 -64966 83916 -41784 -18014 83102 99680 265374 -64949
12672 357704 202488 81090 214526 97597 204850 78335 527447 81669 -122477 -73425
12662 -73425 65376 40496 388191 85791 13463 43349 158870 -55415 145841 115166 -51767
12650 124842 240995 209457 242844 52220 -94223 328883 -183370 -21187 326707 58458 -83869
12638 -86146 78433 -50966 -137726 170280 -112109 33623 345082 167499 153980 513567 368341
12627 368341 94690 333988 -13865 165778 267086 -29935 690037 47718 158910 -115690
12616 106302 -554 -215694 141094 181658 158370 -36566 121296 -22491 190746 67650 244899
12605 244899 -28384 35855 -169770 99989 358613 239775 385980 183113 -77212 297757
12594 431839 419548 -29809 -139484 14599 75747 123540 -255913 18604 51932 115598 36399
12582 250143 101382 -116150 -188720 155970 -139805 347478 -10824 -96249 65803 -38320
12571 153244 -104625 -5831 107890 59256 158787 46431 -16401 9680 -805 -146077 -130081 195798
12558 400014 219272 481405 -100714 207702 326084 -119570 -80196 -53903 158213 -22286
12547 34449 207334 -109329 166783 -86282 198242 -193740 -22225 14097 242205 -14939
12536 31478 146933 -291450 -318631 150512 -69706 192052 -183700 -158122 297309 30978
12525 -200988 -61119 251095 39710 -58434 -190049 -181535 -280981 76380 -99273 348147 -175186
12513 -79945 -229306 45077 278658 -54512 -39577 -41418 319298 -125805 -219549 -244368 -57453
12501 -136280 -64081 -239715 -5072 107407 -198322 -170477 -116506 -42818 -30530 79370 -21298
12489 83708 -188185 58471 213033 313824 -165271 150195 -101385 57724 -212956 125105
12478 -144444 53104 171577 -9169 550660 -242434 -252569 58785 118009 31070 -281193 -277048
12467 -277048 152665 146024 145935 133292 -233978 116540 22049 141105 -132778 -179750 60793
12455 350491 352225 32110 116921 69852 186791 224264 -65936 59213 -11419 10461 40371
12444 40371 299 -35429 198603 -25792 122795 172697 332442 -160148 133290 -61187 -266981
12433 -266981 -41123 -258636 91321 132080 286219 255200 -3872 27996 -48469 219890 30375
12421 -580380 -98055 125015 239329 100333 -174250 -11366 21692 244362 -95009 45096
12410 397570 -159789 -349348 66872 -65975 -174531 31746 -129416 -268455 -165699 4756
12399 270907 258963 306596 -225563 -7916 40416 18603 -71591 218745 131915 -44837 -58917
12388 -58917 -7833 173395 23487 336153 317502 113233 208959 -6208 -10629 -4977 -246656 -194271
12376 -194271 -415680 -135267 -333531 -117119 -8172 -338438 142775 -218136 72025 146698
12366 146698 386997 -206718 -355032 317586 -258050 -1078 101840 296663 193956 69850
12355 -103413 47704 170759 -89760 -9780 -51872 68952 -60666 130186 -70756 -126658 165568
12343 220908 -288645 -58579 -23888 -220192 -291833 157563 -297021 -95382 21029 -214705
12332 177041 -18859 -287106 160665 44028 143864 23389 41878 135952 -294169 231043 130255
12321 130255 260662 -317088 247801 -37018 -9294 62504 51519 -152661 155487 375251
12311 375251 223225 32859 -83462 -133884 -165932 97597 -132607 -33816 -159938 73145 135595
12300 135595 -6824 -123949 58012 24373 187713 -396325 -190526 -51073 103469 216447
12290 216447 113164 -51906 176389 -298123 51997 106191 -65119 184439 244170 231413 -34272
12278 509267 -98033 209382 509799 -348071 -58993 46795 -134393 89175 107829 -34042 -66937
12267 -66937 347277 194445 -45555 81556 221281 -467215 123141 234784 -36577 83113
12256 1117 247126 71604 124471 -78346 478109 -151590 103861 -33818 -85102 245689 -102413
12244 112782 174214 -23080 -129151 -214874 290128 62906 -9624 152369 -181493 -28512 -48986
12233 -48986 -142142 285939 257637 -176495 313414 131373 -22701 261458 158669 115664
12223 115664 198739 255914 433016 -93156 411535 21632 -14579 215628 395732 -42902 270568
12211 10474 -251312 51051 19654 172560 -62400 210419 149111 -4495 235429 49426 264019
12200 264019 547093 43892 232333 -15013 -123334 35269 -38049 -10689 209684 72927 192421
12189 192421 80812 257778 14902 149467 -104628 258635 -74018 200142 372170 351187
12179 351187 13482 77859 -3496 266597 329564 236279 419610 55049 238649 89911 138144
12168 138144 77082 3733 273023 260180 266910 178827 274345 175586 -1187 167349 -125874
12156 203222 -11609 -152884 -23358 312155 -185242 -109604 258292 201413 -79701 76146 -122882
12144 186346 563159 -121149 254335 58298 -60226 178885 -37439 -128501 -234963 284948
12133 141424 -65969 -50997 132154 440855 -87668 483885 -92284 -267067 -65691 -242017
12123 -242017 -117789 83370 -255730 29448 148268 -196803 225642 -3394 13679 -362764
12112 28682 -258567 287786 173543 36936 140616 -89339 383463 -366878 -234692 -103118
12101 -356313 311 -8265 -198004 65954 -89258 -156057 -298534 -127897 -24854 -244032 -63754
12089 63198 47387 -107852 233427 -345957 172665 -466304 150412 173166 -60379 293296
12078 -356579 -85498 -243881 -157180 -99048 -175189 139253 -24858 -392376 -89375 101237 38540
12066 246413 151526 124758 140645 288296 512120 1292385 1129125 463530 -38756 369713
12055 -299081 -107894 224407 -155325 469643 -4118 -127817 120877 137337 4030 337472
12045 337472 -67474 267930 -159639 -1026 -186068 235635 5798 -155043 -33363 -555946 -83896
12033 228371 -318643 21038 264138 -425918 -79294 -279426 -249545 -33682 287732 -60965
12022 -254110 -82326 107334 319875 -14020 -357504 -242963 60365 -65080 -44885 100575
12011 -262325 -100133 -53446 523574 45044 -16997 -399468 -159248 153078 37828 42116 216218
12000 216218 43265 -27918 -21717 -60857 -148175 -48019 -132451 -98999 -160608 -181519 -147972 25185
11987 -160482 -243116 414980 -13152 -182049 -253620 -52721 239438 -79943 19506 -41104 -70223
11976 -70223 131508 37396 439544 154853 146938 42819 106714 -198119 122907 -95026 -21138
11964 12075 32403 -36172 -182996 -154060 -308127 395597 163536 48552 160431 -161384
11953 -329798 245960 234591 -159158 -113808 131972 -470289 -41828 72772 155155 197126 86753
11941 275376 220795 54284 48188 -40690 -269667 -335947 111733 -21310 -175012 261708 -39762
11929 -39266 -95515 -331324 -156979 -76418 -25045 -163248 -32242 -179207 -89821 -78794 -83975
11918 -83975 37793 -78789 99869 90033 88255 -59534 95464 306602 -161176 -48435 -380737
11907 -380737 -165131 -14370 -265570 89827 -1505 -218364 -116324 -172233 221377 -52590 -199353
11896 -199353 183632 -188669 -130106 -223498 139954 108178 32119 123203 127370 252471 177544
11885 177544 -80074 58346 -364147 25589 124282 29961 -379749 49020 195686 132075 56135
11873 215171 169487 449 109063 174780 -249717 7570 -395245 166734 -219598 210665 -166676
11861 19588 -146536 113173 478272 -73441 -122256 10181 -13399 114310 -24645 202321 -185060
11849 172731 -244522 -362823 -129285 -36800 -21221 101153 229100 -170986 91517 -2838
11838 -258831 -80825 103458 -167137 -251030 -47853 -224006 38161 334365 -146478 -95677
11828 -95677 -108551 -24610 -137098 92043 131261 -58839 -38478 -61625 5974 -85207 81855 -174326
11815 -6387 15690 -41942 -247592 189599 -83587 -238968 -150050 -30225 -2264 7962 65905 -112700
11802 121849 -47538 -228538 -49277 -25564 383890 -195350 -116878 -164180 -48444 -90870 -50464
11791 -50464 244569 10290 -12312 127065 -145793 -225269 453 -45450 -308994 -41514 6063
11779 52117 164020 71192 -184566 50323 229990 -210220 -107942 -233130 -174180 -254525
11769 -254525 -29518 -73920 -63442 -181518 -89550 -379 56088 340727 52538 -13992 -212163
11758 -212163 -149589 -121723 271589 24823 -401776 55069 -112132 66280 -260335 -438659
11748 -438659 120219 80483 322408 -381636 335649 -100167 -271765 116549 -102133 106066
11737 -85992 -190440 -52160 -98791 414806 -94764 303699 -157594 -185606 -136690 23796 -150968
11725 -73029 -165281 317895 138844 32432 -156261 -216705 102529 144825 -209482 -17546 -92748
11714 -92748 465289 37405 -220611 110547 -85854 -129739 -173355 -221767 -180854 103405 -6480
11702 -96889 257434 186471 -118527 -83103 20387 -28778 116420 50534 -379236 105715 -216662
11690 114453 146264 217384 211250 271115 28190 117179 -92894 365560 -323510 349931 -203902
11678 -146064 14818 157074 -215917 -37845 -222463 19917 -134030 213168 -30948 -230467
11668 -230467 -71782 27726 9123 -157210 82279 17860 1273 -289045 -223466 -219282 -172674 170592
11655 33761 167403 -189294 377613 163975 113587 131317 -55832 -498744 -49140 148763
11644 -51727 3083 -171852 -16663 143205 -352388 204086 -168352 -187739 38637 -184482 207478
11632 -19981 -102780 207558 324443 -71681 18771 101386 146218 -41293 192623 -4467 158372
11620 39866 -91764 291320 -111202 64103 21377 346925 31752 4353 -128188 -21991 128547
11608 -416040 -123823 -9806 230020 8654 -24043 319992 72941 -263490 223159 355659 2695
11596 114844 -222574 -49571 3513 -93895 -87103 171180 216419 148957 13775 6224 115546
11585 115546 127462 28690 -71181 149391 -113831 -166449 219535 -16209 -50906 189646 1295
11573 92874 220242 349480 131449 -248957 -110403 -11355 81697 -235846 -369798 -232704
11563 -232704 158328 227047 -237398 -76626 -7156 195109 -76150 44225 -110280 -34001 -377906
11552 -377906 407138 91410 174537 133215 120058 126446 4669 90402 63479 -90917 125576
11540 -277950 -192387 -222142 96653 -2629 -18246 -117429 61026 -50871 335820 -88890 97148
11528 -160917 149353 -114030 108936 -172 103788 -73839 94070 287467 -225003 130859
11517 81676 312980 -95076 -82850 -33836 173160 -99921 -27924 387964 178348 -2652 188948
11505 -74433 40245 -79076 262352 12353 126485 -50326 142310 101649 95864 193071 -65874
11493 457963 -7673 319559 127081 104576 -452642 29801 344890 199955 122626 -54740 314188
11481 181643 -9187 326783 132178 191026 -335738 -48350 78194 330191 333818 -4362 -4673 413244
11468 123672 288569 -16133 -162668 81374 114601 -136674 221258 332776 238047 135184
11458 135184 -200100 178182 111024 -129397 -97054 430795 14413 -73326 91721 27958 155407
11447 155407 -26778 -40803 35181 87495 299008 150520 104672 -458000 -221929 -104430
11436 -188142 56202 -68098 81940 148643 -102576 300940 120262 238498 21377 285358
11426 285358 -104013 -54794 -188267 -271120 223829 190292 166393 24329 65855 246462 59448
11414 516615 214455 -81929 -48464 -68584 182886 -36773 46842 200964 131845 104318 -253460
11402 -132295 63019 177411 232351 -26695 -105743 -323687 -22252 141263 234193 -118711 152214
11390 -435878 -105048 333285 -19253 -64922 -9643 360425 -157070 2988 -53900 34287 138547
11379 138547 132935 130065 -48083 -106879 -35744 117543 39283 -1100 -186647 -58691 207793
11367 -382039 124508 -59295 -55035 3213 -89061 141735 75138 -36829 -321618 131553 -255350
11355 -93385 -166483 180686 -14404 -166248 155692 117552 158899 -517452 37812 3917 6084
11344 6084 -9378 -283500 -169975 -186603 -113522 -175881 359056 140726 -154155 -91459 -72910
11333 -72910 -460592 91765 -54643 -241412 -295184 45153 -63406 -25400 -79142 -64276 -286018
11322 -286018 113879 103473 221887 86287 -237098 103395 6549 260278 -125563 -285114
11312 -285114 -130810 -339446 253741 57241 -189113 77878 168698 51638 -49006 28979 -6065
11300 -35643 -73835 -391486 198721 -63391 -157644 -350468 -66325 -553 130915 -75342 138746
11288 -184142 154647 -71659 -86691 139191 315233 -163063 -279854 82457 33775 -228683
11277 -135689 -320762 -28826 -313170 -47105 -325614 -135124 -182450 -96492 -44068 7536 -101292
11265 -90326 -243170 -166931 -20290 247923 -237331 -374717 169938 -141818 28077 -122668
11254 -45155 11951 -15540 -90946 224828 -15216 -244632 -2589 28703 68415 -63894 94494
11242 5813 -112520 -72984 24351 -206795 131715 -277300 -66902 -170797 249073 -146736
11231 -3573 -108099 60866 100535 -430726 -67735 -220274 -348434 -62246 -166500 145231 161545
11220 161545 131596 227129 -247238 469134 189431 216291 -9314 -42766 -13322 -143211 190956
11208 71162 71678 397014 -54442 -307829 61711 157742 474596 -261306 167198 22445 48720
11197 48720 42092 -60858 113805 -133887 -159722 -145514 141162 65040 124459 141644 -61970
11185 78588 -366230 261752 3059 221011 268214 -178012 -301426 -104141 -206295 21361
11174 47910 -42543 149385 -70278 347028 -165895 -111775 18182 26572 346800 18885 -20214
11162 44291 -198164 195996 82297 -298166 88466 -139659 70292 64082 -148236 265378 -85635
11150 -133663 -38919 -81689 -35609 -234136 199515 302024 -131774 -40626 -66630 -231841
11140 -231841 -58099 94797 8888 -106196 -655 -146596 130048 -218489 -30290 38501 45149
11129 45149 52580 87280 -27169 26606 200213 159153 107563 125176 -245594 -187128 155378
11117 155037 177288 323577 24726 183067 45846 17084 -216453 -136480 -116145 226840 130364
11106 130364 30108 102499 -51428 223057 83967 170082 63646 218624 -85257 418675 190548
11094 9191 43703 199254 305052 11635 442435 174766 274146 26859 45231 -79683 -10317
11082 427411 533530 -73753 139244 51805 89030 404974 432397 273732 259332 407600
11072 407600 159314 228611 149611 209759 451296 -101419 319944 224451 90382 496333
11062 496333 445060 238413 666361 401526 519991 525836 237306 743329 532546 880394
11052 880394 451577 645708 595363 570533 509566 351492 535177 323165 491031 929182
11042 929182 522688 887562 590383 366054 651968 546357 416080 784754 653103 604140
11032 604140 951016 293022 439653 391946 798189 535031 154580 595296 654121 464936
11022 464936 181627 501708 516922 486102 348697 372675 175073 495410 697713 227335
11011 423878 269139 773579 530388 579651 397985 350935 581986 489998 768032 455548
11001 455548 797167 774146 763645 472969 687467 681843 519067 747786 615511 699687
10991 699687 619982 570712 646633 624353 603387 973022 741871 623958 955251 726647
10981 726647 1068227 690794 1242283 1237807 1139747 1703539 1714589 1853964 1933267 2281714
10971 2281714 2214292 2304808 2371807 2193572 1941396 1656622 1593171 1560058 1638099 1336387
10961 1336387 1242660 1419517 1433145 1177798 1300112 1350362 966819 1397787 1116227 1045372
10951 1045372 1051562 577540 864895 288163 287871 367785 253127 -41266 318227 -152691 32317
10939 81330 -135885 -172549 79616 -228728 137791 399815 58085 92206 242117 29010 209897
10928 209897 -126966 209668 412517 299933 345052 137686 21526 103566 -11119 144992
10917 91182 34127 -930 151359 -136758 11753 111829 -136464 44839 -6095 -305992 56922
10905 -225849 28753 -127986 169758 -247947 -422457 -63242 -211872 -146646 192583 87887
10894 153851 141222 -45498 3523 69095 -213671 236381 -85903 68131 -186829 -279074 -47646
10882 -15897 -158035 -53266 -202495 -16477 43144 -9124 -155681 -112728 296477 -180410 -155197
10871 -155197 -300099 23163 217920 294036 75576 -49614 309789 22299 -62144 -103937 -10328
10859 2981 105966 -343333 294582 448856 -203404 -158680 53641 -285666 -127121 182454
10848 -163567 119541 246158 56863 -305413 -222621 145059 132556 20888 -269422 -23552
10837 -49447 169188 84811 20286 166771 7367 266954 46584 -39450 273207 -280705 -225361
10826 -225361 -170736 -321691 70362 103143 -383305 102408 -249129 360090 -208480 -206579
10816 -206579 166421 -44125 -137997 48474 -404048 -25733 162189 -224055 -91693 -208728
10806 -208728 88434 173805 -81804 120358 67840 -234753 122692 -196764 -97224 -61776 75478
10794 -79259 -365372 111512 -133929 418170 304922 -91004 59839 -244411 64483 -104279
10783 -311597 -84118 227156 -20217 -147005 190807 38283 -124591 -215001 -257893 -15372 28841
10771 174156 -104746 174932 -146146 46033 403947 19694 -92058 -120420 -90007 -19067 -264546
10760 -264546 -60154 -81757 -100104 135707 -31749 17313 -311678 111448 277421 55448 -65327
10748 -129678 233405 13976 65929 -130940 -29125 -475776 -171306 66110 -215264 -192548
10738 -192548 -86699 59867 -24945 -64503 -63601 7265 129000 -259691 -20176 -428204 119975
10726 24787 -165517 -554081 -187222 8471 -118495 -202052 -200618 23167 -42248 232349 -271351
10714 -122928 -98380 -134149 35820 -118069 -62025 -28618 -71736 198788 19041 24385 36261
10703 36261 49279 -201588 63897 -160644 121671 3856 70680 -267377 311336 311426 -273849
10691 -161897 -58547 -208993 -40119 160831 -6843 -284172 -188315 5880 -70129 -365162 168115
10679 193969 143187 -152193 -123035 -77821 -354206 -48011 66284 -208695 63749 92012 -163768
10667 -54222 116711 -91671 104790 -43458 -150004 158354 26659 -257923 65730 -55649 -120518
10656 -120518 11403 -7331 -125766 326915 -438827 245500 -174045 -249834 -191244 -139462 51513
10644 -257311 -188710 -99673 -259685 159722 108744 67999 201329 191440 -332012 119981 23743
10632 -152786 -213014 182933 -140918 -411356 -46343 130985 -125065 -46403 91450 -41833
10621 -249727 -105153 -310294 109598 92525 -87938 -238010 180765 -113020 -360056 6132
10610 -236606 -66329 -250125 -162283 -196440 433894 -280528 -113033 -28979 -220466 51777
10599 417249 -49935 -33088 -290781 17823 -94090 92053 -237618 -170262 330583 -143660 -175896
10588 -175896 -199806 -321462 -115117 -36857 159066 18881 -50628 -40180 -39357 -284616 -70442
10576 242818 45750 19006 177511 -29692 -330920 220248 -180089 -465095 -76084 -254793
10566 -254793 -189228 273878 -18932 -138947 46321 20084 169256 227725 120936 -94813 -126338
10555 -126338 197021 5917 -5820 -231439 -138353 185042 -204991 44017 82501 -151860 -28321
10543 9854 -48856 34228 149417 -117719 -16863 1969 -20987 218608 467723 -152033 -163272
10532 -163272 110811 -127266 2974 -123884 51660 198781 -11068 -154544 -461578 -4837 -53073
10521 -53073 -95801 -180719 -53009 -305852 -226444 251170 32288 149685 -176816 59648 103339
10510 103339 -236637 -54113 -131954 188569 -61104 64694 -64883 -25360 468528 -101865 137803
10498 226897 -183161 -20855 -165721 -145784 -4138 124135 -67477 233207 74241 -370827 -119346
10486 -61838 -21909 -48090 -50164 305817 162855 223716 429679 218644 332022 197728 93237
10474 50345 42506 -29329 157443 -101190 313002 -116000 -301246 218798 -75291 129303
10463 -144041 5455 -178390 -3425 -206164 103214 140544 -53691 -57337 -716314 -47827 -406857
10452 -406857 50563 404228 -101476 96731 161352 -263324 -176076 1852 -295957 -87223 176693
10440 63106 -136300 9641 3785 -274988 13360 -323230 -96067 37987 111374 28033 -61076
10428 -384650 -131427 -67401 -192968 167767 -86966 147849 154712 268274 -253972 -44749
10417 23482 -23806 -186142 -235681 68541 256068 -430330 -223730 -3969 96306 -46493 563
10405 -383926 -48868 -46682 8423 40426 -145260 -91828 96071 -247341 106999 -112179 289095
10393 -229989 229232 111008 -50001 159511 135500 386511 128170 20041 -367101 -62802
10382 222409 -48515 -71257 -240828 225982 199854 502258 214663 188283 474738 -97390
10371 169375 286065 331588 421960 546738 587034 388898 298510 603532 262957 301443
10361 301443 116444 280187 19844 110001 120137 -145696 341142 145789 -24283 391550
10350 251256 194277 233027 239920 215008 45973 275021 631579 37691 5904 -29378 156389
10338 -72266 47473 -118200 152996 223041 170961 -56304 221052 -60288 20073 -156437 424187
10326 141933 -48587 -138454 208144 334709 30196 -24064 -73921 304383 -8935 317402 152223
10314 224055 -102852 273823 -58386 42132 -68510 -122556 84260 97674 -164412 447819 -257855
10302 -159024 199010 149454 -179173 69358 166502 230186 31452 215410 -258482 -107074
10291 427841 152128 119884 -157210 39213 -223039 -313504 257030 -275218 30495 -197709
10280 -131540 -440198 -106764 -233741 -180792 316585 -168365 563414 -181037 -84053 660
10269 69303 -32604 41759 -53894 23039 460761 -310857 108971 124018 71112 208358 293945
10258 293945 203284 471550 583772 68830 304910 27186 277214 -265233 -48157 -39454 91288
10246 -209612 -216365 -48439 -76543 72705 72471 -21844 -200603 -47233 -141110 57132 -14641 -144075
10234 -144075 -340231 38568 -530961 -227509 -1124 -75066 -33867 -417726 73205 67408 -107817
10222 -44177 -246855 346335 -72322 -47853 186355 179994 -195182 80241 -467512 11978 -161779
10210 10264 86104 372151 -214209 65081 340730 150294 64614 -42733 26602 63561 136932
10199 136932 -213905 109828 -177325 -60896 151964 -23310 -197590 453757 -42564 265620
10188 -224296 -392451 -290577 -123031 -12336 97115 208211 -62019 77267 -14909 -106302 -238853
10177 -238853 25685 -316060 -61362 159607 -212925 -92417 484375 -13674 -153075 -33288
10166 200674 -45176 -35838 546 -158813 -357681 209639 -71394 -227554 225320 -189733 190469
10154 -133941 -29514 -271004 -259091 -34049 -434483 -153576 197955 -171980 -20320 -126626
10144 -126626 51665 -241050 -83753 1061 -260436 -151003 -2151 49222 89320 -64445 -58259
10133 -58259 -101321 50347 -51652 289610 23773 -41194 -313802 -38906 82837 -122455 -441370
10122 -441370 160101 14902 -197449 -72551 47199 -226031 -407592 1001 -143669 43752 191949
10111 191949 13020 -313590 139751 181482 -71808 215356 11713 29905 197799 -221458
10100 -6584 -1718 -328240 -67558 -117560 4411 -177823 -303191 -156103 4541 70673 -154275
10088 -401867 -29976 204368 241787 213292 63433 152989 -147352 -90769 110858 -25352 19599
10076 -145949 -365992 -279894 26430 -62732 388767 -7855 -26765 -91170 -167831 -115617 -127691
10065 -127691 84340 -20215 -57821 -28868 -326763 -37764 -72134 -65238 -62747 -111510 -76935 -78434
10053 -78434 48886 -29627 -199250 -59993 -17161 -139740 -157840 -375980 74219 89633 -103467
10041 -67245 -421064 -152957 -81964 -45592 -26694 239495 -228761 67623 -42522 -82315 112481
10029 -55291 49108 86668 -155070 176753 -601691 -66192 -57875 -10799 -268977 -158045 51636
10017 153839 -151443 -20392 -77942 210117 -175578 -137003 -282496 -124268 -275820 -285144
10007 -285144 -8549 -152941 -13197 279261 -331975 109105 -325424 -3097 -8708 -151673 -41327
9995 -189500 -57307 -42178 -138381 92314 167039 298357 89214 -93763 109491 -235415 -218031
9984 -218031 -277506 143097 153767 -126801 -21661 65062 91502 -129637 35669 8875 146132
9973 146132 -324848 -40225 -431951 -274180 656252 -56541 -248073 -70142 -145948 -75490 255857
9961 -145814 -79186 187401 -205208 -317319 26658 -37482 -338236 -348521 104734 -45847 54573
9949 28673 141112 -117327 -47239 57754 93441 59159 -30853 15708 -90785 19195 -152845
9937 -252360 -70703 -39323 50302 -216576 -166703 -215834 -61191 -197099 -151801 38409 -89911
9925 3147 -10155 70402 -45772 -40740 -39418 -125719 -25737 340043 -235656 -152303 -83851 75393
9912 97381 -81611 77078 56107 149077 143927 100263 -165088 -425690 37253 -285465 75755
9900 -243334 156314 -299728 28037 74380 -132576 -210511 171304 -195104 -141940 -337968
9890 -337968 -168925 -240086 -249238 243906 -196732 92461 -428149 107633 270019 -169299
9879 8943 -27985 216193 -230324 -232221 -196463 130112 8640 5359 -136484 -67724 94993 -78604
9866 165939 -432757 -166900 -339359 -71628 -42487 -435601 -157234 -176248 -125630 -150168 -209686
9855 -209686 73975 -221850 -23587 -66134 -277966 -161267 72862 252416 132629 10554 205426
9844 205426 33758 -210688 168888 235441 -241287 -399081 5423 -220941 -163715 -12147 -123472
9833 -123472 -269375 -149373 -107711 -100955 -145637 52487 217065 -87291 -65236 223990 -26811
9821 44456 90204 27433 303905 260931 -258790 47453 85949 202523 -140011 -89235 -55133
9810 -55133 162696 -12824 -276081 3201 -203757 -305806 -119478 -171584 -59616 -75380 189011
9798 -94080 -466076 130266 -241218 -66015 -151110 153 146599 -83757 60878 -27353 -250177
9787 -250177 21272 -351782 -50706 226024 1951 135527 -208612 -242056 21791 166720 -11874
9775 -70275 32152 99265 120727 -259407 198085 79784 -85848 -35839 -113905 -211769 79068
9763 -112421 -286165 137618 -181397 -66329 -287767 14434 -215571 36504 -318199 -190758
9753 -190758 -36561 40132 -89566 107934 -78588 -153635 134866 -115485 29710 235759 -7452
9741 -10297 53702 108604 130045 -239058 -239968 168126 80127 138105 -64569 -424105 -119847
9729 -311264 32616 109958 -439109 4117 -245828 -220453 -29877 -16970 157719 70865 -99539
9717 -66538 -297339 -68053 142961 -234379 -223 -189000 5987 -109409 -13875 -66817 -239500
9706 -239500 -66679 -22156 -102722 113330 74103 -351309 -44100 23658 -230184 -40671 -64457
9695 -64457 -310995 -413558 -236257 56770 -187042 -194562 -52587 -199889 126828 -33559 -265793
9684 -265793 54408 -216887 59422 -179885 -137855 192951 -1283 125751 -6453 -54440 40644
9672 -266615 -402721 -199096 97476 -43492 -196214 73065 59769 -11491 -238531 -121126 -67491
9661 -67491 -114898 150162 -293807 197567 -79120 -24530 -12743 5584 -261829 166469 -170363
9649 -43991 -203001 -107796 -112037 -232492 -51102 -19735 -255150 -247098 162726 -199896 -50027
9637 159031 8905 58890 170227 -37497 -111362 -58126 11737 -44643 -358015 -163652 -93742
9626 -93742 -284018 214504 42980 95783 -49227 -130244 -170285 -328855 -4305 57068 166536
9615 166536 167589 -128996 -75329 -111725 70015 -29401 -208213 41854 -95859 -121460 -8110 -212112
9603 -212112 -98879 -14459 -46698 120153 -104495 249883 -274888 -47874 -123347 110109 -271642
9591 59558 -52147 -131308 -46360 155480 -202920 168782 273920 -76421 515773 -18574 -74597
9580 -74597 -59928 -133131 -189644 40172 -304571 -87411 -23092 10450 -57072 -128145 230282
9568 -109209 45514 209169 58646 -65054 -146955 -86311 -230330 -648731 -175106 -133738 -100371
9557 -100371 -213147 -204041 -199863 -229159 -171782 117556 -94386 -176363 194400 -203061 -94477
9545 2637 142307 -248864 55473 24564 -155883 157845 -7890 229583 -29492 -57870 75928
9533 172216 28268 7024 -95045 -240157 -101398 64356 168995 -174658 215581 150895 252696
9522 252696 -47444 -138664 -183825 141287 -128393 -77433 -101075 -19666 -213335 -36082 201443
9510 -275929 146640 -232581 -247481 243556 -144327 -51563 -13208 -71538 -34608 -146875 255157
9498 -90403 48924 -177476 33476 -241302 136697 154916 -160605 242562 -209383 -292044 -336441
9487 -336441 27452 -112909 66911 -357517 -108491 -56813 -268827 -72541 -255823 -337060 59957
9475 130125 19449 143518 -209479 -32542 -152576 -209736 196303 40950 109692 102844 -78544
9463 -356283 36123 -49174 -191536 109004 -47568 -146889 -340173 111007 14959 49753 103606
9452 103606 -120459 -113482 43587 -295313 -95292 132633 -1446 -183196 55902 64734 145170
9441 145170 204213 163206 -149463 4599 118369 -139257 233790 -159716 -305968 -274627 -289098
9430 -289098 -76157 -17154 169910 -281088 65079 21352 -349667 -223106 -234185 -166321 -351872
9419 -351872 -289705 -36626 -230191 -143119 -343911 -41713 -204261 -93378 157765 -94327 122158
9407 -137492 -63678 -82334 174873 308740 -357063 -122563 -107217 12339 -14830 300140 -63876
9395 116186 48988 61113 -249576 114106 162594 -171736 23861 -31483 -160100 -436151 -47300
9383 -8939 217157 -192336 76038 234728 -25713 -25096 -168590 84759 -224462 81477 -289011
9371 -45684 -320827 -156256 92304 -233565 -88712 -156276 -152227 -131176 -115130 533349 181462
9359 155548 315300 -18283 -294840 210533 -167441 -20760 67588 -351656 -218989 -107128
9348 107278 253166 -181825 -360001 -78820 -97335 -33404 -247962 -52317 -141262 405445 -343447
9336 -12789 -78085 -142212 -22436 -115311 49525 -172009 -147152 112580 -154389 533604 -324159
9324 -48299 -97898 -38435 594 107736 -72330 80009 16495 -71080 96450 332924 -191225 -406042
9312 -406042 -228266 117260 -13933 -451933 -231517 -365781 -237487 -371850 80317 -295440
9301 206236 -256836 -70914 236687 -204642 -265708 -127719 -288975 -28019 37945 139698
9291 139698 15059 161091 -98158 250737 35268 280821 73047 -166706 173261 -161625
9280 -158636 22319 -156776 -103026 -194167 -709565 44512 -15987 -271909 -76011 -130449 -274271
9269 -274271 76117 149857 -423399 144943 -42406 -138331 88359 -144782 -171156 -153244 -29903
9257 -131096 254561 74882 -70303 -192541 -43058 184906 -33252 -208332 -174810 -176426 255882
9245 -181565 59415 17610 -179192 46622 -38297 -353991 7251 58226 -35605 193607 -119340
9233 163091 -38228 90495 -140079 -218542 -90289 -205160 -249889 -234787 -59356 -140395 -246291
9222 -246291 118602 80503 -505908 -3702 149971 27945 -56370 94164 -132951 -154032 -270723
9211 -270723 -236787 76685 -143025 -253752 -191674 -76132 -196616 90382 -134549 -104814 -139634
9200 -139634 -34603 -138812 63664 31538 -6485 370056 -108912 68796 -398983 -35002 32877
9188 -32558 -40186 -107792 151255 -330674 204655 2754 -3822 -198367 -81638 -474620 -73128
9176 -84056 163974 -26600 -257860 -26829 -48589 -5944 -260870 153734 -318786 260474 89753
9164 -172800 -131845 67540 288273 -179769 -58314 -43969 -29680 -100457 241596 -6718 -165878
9153 -165878 52199 -50481 132713 208179 11580 31697 -172853 93318 201511 41622 64960
9142 64960 341902 16185 30108 37744 32031 -216543 -451505 -310809 81154 83065 -11271 211666
9129 -1188 -83032 163329 -39908 -327242 9458 -235024 -67332 352727 25474 -435279 -196183
9117 144408 -130414 -168162 62702 -221617 118279 -93443 30187 -258018 142773 -70188 -53173
9106 -53173 71122 -214743 -145759 -76716 69036 -9103 -223233 60966 -347517 -59321 -225931
9095 -225931 -135323 163802 -470790 -260195 -159670 -127242 -42856 -122941 -244315 -206181 178908
9083 -162845 -57319 -157700 116874 -20956 -10768 -148144 -60090 -81414 -97803 -161247 107913
9071 -324155 124933 142164 -13037 -357276 98559 5725 -300763 -136072 -120646 -72018 10653
9059 -181351 -122405 -118310 -165742 -166350 -321110 -99236 -83087 -123694 -144157 97700 -505080 218990
9046 180340 -354733 -253109 -130080 -178562 72311 -195288 187248 -87373 -13505 -32379 -50376
9035 -50376 440773 -52083 155872 65265 -96415 -104137 40269 -110132 -118525 167835 -49494
9023 -1269 -39271 39729 72751 -193692 -92521 -139339 -434404 166359 81175 42331 -27279
9011 14591 48430 -298858 -81388 92713 182612 -316476 -100329 -27292 106200 -17146 -163541
9000 -163541 -259268 -217089 4160 -222482 69219 74688 -29464 -253583 56856 342022 268015
8989 268015 -61505 -39891 -63954 -13114 285721 118588 -307107 -41145 90062 -286967 -2847
8977 -141272 -196947 -137371 156275 -61369 -70799 113020 -96476 -324841 78420 -42264 -256806
8966 -256806 518042 34843 222408 172117 -156846 -90570 -73094 -131576 -7203 -159242 -211065
8955 -211065 -18388 32879 69965 -350313 -51537 -293502 -218030 179654 213228 -80084 -255318
8944 -255318 -375176 -81287 80503 -64543 -46503 60883 -55635 136394 -257854 168189 361168
8933 361168 -131170 314249 -31600 368823 -47849 -104644 110826 547222 486197 684063
8923 684063 2319226 10191405 16254498 5849294 1780391 820462 657129 260053 200887
8914 200887 -37932 -39705 -288987 31526 59545 29393 260499 437779 362749 53623 116574
8903 116574 -160026 -2362 34608 -217430 42353 37244 -113368 -123759 13337 136462 13371
8891 -191029 -144615 140632 -197569 258687 -226357 -39583 -216012 208878 -125986 -142461
8881 -142461 -301957 -112617 116157 161609 25023 193463 78983 -506073 -39825 -517825
8871 -517825 -115104 -241212 112792 -4573 -73468 60544 -44499 364547 -96711 84498 307203
8860 307203 128563 178204 510493 -202607 94547 186684 -58236 -190095 -35498 -299 59774
8848 -154918 -166720 -96257 -215219 151263 9183 -416669 -36486 -101815 64744 3044 431712
8837 431712 -406353 100193 58366 13356 -450986 -11032 291385 -146907 -276697 -13166
8826 -39908 -36517 -192474 -183307 -214367 144119 136611 -268736 -120856 -183712 32673 -158421
8814 -91428 255884 157576 49548 -134956 -136402 -5513 -286530 136726 -130268 -165329 -225888
8803 -225888 -31579 -47963 41768 148527 30458 -133783 73942 149136 -309982 114428 96125
8792 96125 8464 -261896 57550 161651 -27904 10326 -138800 -167493 -121106 129096 306062
8781 306062 -83771 29200 -155158 211174 -205854 -217487 6933 24061 126327 -20206 60640
8769 -567800 -114638 -101284 265334 39261 -245135 -103193 108485 -87482 -225295 188605
8758 -145668 130456 -123000 -141668 -174091 48513 333287 214073 120804 129233 289723 -96681
8746 -170316 125832 -64495 -229206 -133790 25924 115713 -444879 -15830 98329 -196980 77226
8734 115975 46964 -209240 -160231 96522 -282828 -85205 -130395 -597669 104351 128274 -108567
8722 -206113 225654 -26093 -49443 -295716 34938 79732 238572 -253033 -386136 88030 38084
8710 -197560 -31906 53460 65292 -45195 20747 -221687 -150314 -127502 -254503 -140705 -239852
8699 -239852 -104719 -346698 159383 24942 70637 -221445 -495054 154143 87892 607885
8689 607885 264677 -175364 287909 -7129 237670 -154979 24717 -268474 -101811 -35095
8678 -151936 -83834 -54831 -259484 -54738 29783 379018 116630 -140360 -207150 -240031 -80718
8666 304799 -128773 123825 -356503 -174575 -343114 224835 -114851 107210 69467 -45075
8655 4188 -259978 -187404 -197771 -215978 -275657 220295 10624 1600 -257258 -299636 -173787
8644 -173787 -6197 58535 126116 -115768 -63835 -310579 -24555 221777 -181527 350926 228403
8633 228403 -94283 45092 -139192 -212234 8836 -164576 -60256 303252 -4559 295173 -271118
8621 -296640 154955 215974 45325 71532 28913 119674 -192838 54715 -33751 -300871 -296125
8610 -296125 113375 -1198 -85654 -193674 213604 -58410 11183 -65385 -280745 -144430 -83831
8599 -83831 -192527 109976 -172390 -184503 43575 -33258 -188607 13366 3008 -280213 -252242
8588 -252242 -50384 -89629 -117188 -326317 -66559 -297345 -82047 142570 151717 -118415 -103566
8577 -103566 121228 5256 106747 -95784 -133943 96336 -108508 -59522 75752 100916 -26431
8565 -25346 32460 -246731 -216729 -117181 -176377 -193798 -186561 -229748 154399 -138229 201053
8553 102687 -363987 87765 96796 -81926 43063 251698 -27701 128794 92150 -133467 -189471
8542 -189471 -236811 62317 -299128 -238924 -90956 12032 243853 -170449 15751 -96990 96939
8530 9611 -142565 350366 -31761 -81130 27401 18242 -222966 241767 137823 296383 -204789
8518 184574 39356 -211155 33529 -188651 -61428 28394 -25892 305598 -36227 -33490 -68307
8507 -68307 -151368 -120513 244169 -303380 70467 -244520 -56204 -85957 66573 -374829 413328
8495 110539 -234414 11587 175786 2173 -20403 108065 -177581 -77092 -89520 -303403 -140399
8483 -72482 228890 -161698 8857 -32668 -369195 15676 -365035 -143479 -26463 -151770 -49353
8471 -208324 -97452 -88557 -299558 -489137 -272363 -286468 -237994 -78805 -278071 -410925 -28347
8459 -343223 -304885 -51540 -175857 -95950 -188956 -156506 -102879 6872 -135835 154993 305326
8448 305326 267995 -147255 334553 307021 -252966 -261992 -112730 73530 -42361 -80353 -16564
8436 174872 -12549 -239066 -26196 -114608 -30001 -120878 -226776 -170882 -99893 726 -33175 -308902
8424 -308902 -5059 -95853 359257 26963 -141853 -23198 -47356 -124653 18503 -189886 -50007
8412 119269 -247622 -54046 -39504 -154960 5363 51666 -14038 232193 20034 101556 -7770
8400 -4520 207190 -166195 -198642 -169266 -208502 48111 -138198 216927 58833 -93174 104847
8388 -266029 142248 -231155 -199343 -188420 127469 -206516 -115309 -344409 -157557 151583
8377 -230382 -327075 -7764 -51373 -263326 -354196 -101809 -88636 3490 55853 150897 29996 -355070
8364 193615 215407 955 -206995 -2698 -189382 251750 -75837 194945 -89703 23595 -144565
8352 -93348 185685 -110360 343942 17981 158578 25726 62202 64632 -87438 63402 -181510
8340 -8187 -18712 -25353 257196 -220819 -43870 -35172 -16896 -37175 -202646 68738 -89237 60568
8327 -80891 267778 69567 2747 327179 43376 -5878 -257894 -68781 -66578 -131625 -218467 335136
8314 -410888 203736 -199266 29631 142295 101912 91903 173412 -227188 78078 49467 189090
8303 189090 25164 -359910 18267 -336072 -8616 -302212 -36821 -315901 -108747 -30732 244427
8291 -511057 -93735 -74708 73255 76966 265603 16522 107598 67060 -481998 -222678 100597
8279 -19096 -12498 -154130 53960 -195216 141079 -176336 -105978 -474481 -85020 -376021 170981
8267 -169232 61185 348181 -84271 149782 -7017 164833 88140 -90094 211644 178630 -28228
8255 -301559 -69199 -163099 -93717 11672 -153446 -333676 -145528 -110255 -306158 -249533 73506
8243 129752 347175 82904 -165868 -51054 65244 -267857 -110868 122092 -74084 110081
8232 -792 -320347 141444 24521 35639 258243 48705 297923 336484 -261621 -300134 -99295
8220 -234386 142751 265244 231695 19488 10758 342670 71551 -127826 -154200 28175 142984
8209 142984 66098 -212747 54654 -62967 -226852 -124917 -97151 90821 -154613 -305394 -298450
8198 -298450 -62550 -15138 88240 83927 -307568 143512 -28336 -138928 115288 -17623 134078
8186 -245562 -440161 -154658 -52132 139684 -149071 -61322 -62615 85968 -222693 -272794 -65527
8174 -155668 -92433 107477 -109752 -297436 -212356 -96655 -326754 179553 -274495 -171379
8164 -171379 148924 -210061 6641 37217 5408 -161891 -175298 -99045 -87722 -134422 -151687
8153 -151687 -52846 33163 -79753 -99390 185951 126319 13318 -204933 180011 -5275 -167803
8142 -167803 -409858 171642 -79043 -98793 -207797 -90137 -4965 -75228 170153 -391297 79000
8130 33424 -143109 -296511 -219364 -144419 -19159 -141801 -86507 191617 -34451 146721 141958
8119 141958 -53839 -123486 -263890 47476 -146522 220 248204 3522 -49697 49721 -24075 189301
8106 148671 68557 53898 -147099 26180 -272012 -55448 149767 46055 139052 178212 101454
8095 101454 68679 268816 -180291 46815 61367 -192891 78522 -190794 29130 94115 -154739
8083 -171858 -133521 132007 -112744 -379034 -194938 135752 241813 -257746 172970 -116130
8072 134079 -425494 -83 -32671 181034 120455 -22196 41808 232023 -221316 -367289 -155542
8060 -208194 26361 -459021 -53533 45192 345620 168323 206331 45583 104223 84227 3278
8048 102100 259413 57436 -187182 -224379 -162067 -286690 -74010 181361 -77682 235134 -75056
8036 162153 -260376 5173 144908 -165831 15708 -286305 -223627 -290423 75942 -20062 156561
8024 -290763 -8835 -165481 99974 67985 -327191 209540 -82344 234980 -37947 80504 51580
8013 51580 353681 24394 77822 30122 361710 -146897 155864 -390857 -162530 46605 -362871
8001 101754 165790 -54999 -226048 -195663 -144803 -269905 -195423 -17999 -69625 -265760 -65306
7989 50219 -269739 -104193 291842 -118905 -188070 -4767 -164617 253864 205240 20290 3779
7977 -104712 85375 13731 -150858 -22264 44959 142572 138391 -135358 91194 -121296 -277697
7966 -277697 91777 121975 -34357 -26323 -92121 53948 5407 10110 425887 -24184 -163179 165946
7953 -67270 247984 -172706 -5040 -12647 -101520 -323926 -300871 -174374 75020 -205656 8491
7941 179588 -307351 -109238 25545 -164804 32905 86104 146517 -127101 -241657 58988 112938
7930 112938 -42649 -431592 331569 -80495 -103753 14776 69211 -136132 -217315 -540807 -5089
7918 -113708 -120237 283092 -315465 220494 119684 -54145 77227 -105280 291112 -84289 121549
7906 135621 143221 -149423 -382638 129999 -137825 9882 -200378 -123998 -240122 -69814 54126
7894 -131988 -211786 -131918 -242774 -93837 -135161 -24418 -52148 -24844 -127876 -140245 -62540
7882 -50582 -44540 167941 -239968 138907 -65922 -28159 57907 -68160 -145829 -110667 78195
7870 -24242 64434 -339409 -96512 -6622 -54676 -172909 -139275 -226157 -326729 274620 -182970
7858 39148 -44867 52907 54551 136977 133418 159911 -268581 59509 57850 -262099 43819 -136964
7845 30997 -164028 311361 -183264 -183891 29833 -102500 -227785 -53844 195689 294835 119707
7833 45837 92920 -223972 105108 -104445 -178078 -381774 166313 -329 -274141 2438 -112125
7821 93897 58057 -30057 -333248 63517 -89299 112639 5949 -163946 244689 -157871 -231583
7810 -231583 -36252 -51394 147339 -424018 48815 78654 76954 -51055 -139796 106867 56591
7799 56591 -106513 306029 203140 45970 -266260 -205082 -331641 -57598 4039 200344 -111890
7787 61638 -27495 -166015 251562 303187 115225 -48231 227304 -108704 48290 89800 16405
7775 -39597 -61832 -28996 -189827 127439 81199 68859 -19252 36260 91698 -145307 205700
7763 -16094 101467 70514 201854 21087 33759 -16201 -411344 320144 -108198 -90396 168131
7751 495667 140150 55634 40244 -223792 131479 33648 -48967 220407 46458 145429 62566
7739 29819 -261190 104661 23362 103536 201267 -7691 54625 -121525 83075 223160 -327775
7727 367290 -612363 -156441 -57394 -90484 -408013 72514 -441903 -330874 41712 98969 94099
7716 94099 -266717 -83906 -180581 -190161 -131670 -88619 -321719 368328 -47605 229597 -57342
7704 224643 -34201 -215234 -48106 -45506 -3531 202092 -7934 59493 -202687 -42025 -66117 -9243
7691 -240605 -188479 79124 314883 192923 29775 155758 -181723 81041 -72857 -36227 47679
7679 -56904 80716 -326048 -143918 -75686 -60780 -106411 -4460 -153250 -48903 83980 -303666
7667 -134761 66444 8013 66917 -55199 28956 187008 -279526 -68263 -185550 241050 -195501
7655 -42872 35452 -13314 16024 -29400 -130273 -56046 -93882 81081 -128960 88566 -175908
7643 -238983 -79769 -7748 164672 -98108 -407267 -148369 554 41778 -38923 13127 6836 -12517
7630 260245 288098 29033 710089 -58493 -99727 87939 74130 -258194 -100355 104207 -200725
7618 -64773 162674 -1826 -231704 -119124 -39392 -110613 -126328 -240175 -246317 95804 -120320
7606 85042 339713 -164861 -307072 -144530 -286871 -173474 -257864 -290430 -231649 320383
7595 49204 -239299 -323330 77794 75730 60556 -226221 152643 -164968 19830 186646 -53053
7583 331687 -376608 -98695 -89557 12557 -139812 165508 1394 59624 -55798 329621 -10068
7571 394511 -193469 -165537 -32479 -295801 -358714 -246862 -403436 -243668 -57870 -199164
7561 -199164 161686 -238305 54428 324742 -131483 -106762 215230 -35738 -90355 -118269 6006
7549 70362 -96901 71293 -128795 -35693 194147 -231514 110238 -248200 288401 111622
7538 -25060 -43505 -261401 202271 422788 -103181 42505 15648 -154484 221766 43058 239387
7527 239387 -121637 -154592 263547 195356 256925 -287720 -81686 -192807 -64519 31558 -11411
7515 17671 -234217 -65380 -200402 -183675 -191583 -38664 -809 -348364 136721 -230479 -465297
7504 -465297 -93164 123363 -135173 227885 -64940 -122893 -70053 375787 222274 108679
7493 153794 -78925 -184484 88919 196046 116903 120305 104546 42793 -195790 -148172 -36884
7481 -18054 -95823 -31819 -314674 47470 240675 35913 -118316 -192511 -271287 -19361 -191317
7470 -191317 248812 70623 -106124 346738 143470 62362 -75855 -12657 78905 -158258 -65350
7458 -167803 -17644 119767 -162088 -236055 -22134 -145290 8451 -6647 -172189 117868 -8730
7446 -46445 213701 59935 17261 99633 -442518 -59751 28088 -227570 247081 146785 -249026
7434 -168432 -212327 -486282 -205935 -73643 -215327 -196981 48822 -181303 -84193 -75862 -153522
7423 -153522 -30940 -297355 47376 -10856 -162085 -303331 -178034 -124070 -14421 19058 -413263
7411 177051 -34681 -236130 -112090 -49158 -93884 325680 9562 -368725 -121501 -299364 335350
7399 -49181 -63635 19720 -136585 -520933 -116240 -116681 131412 96441 -268322 177855 -239867
7387 112811 -155084 181572 127180 250705 122975 -19155 -180614 -258024 -28050 -40291 166497
7375 -137720 177226 -73169 -117991 -447643 -94816 249478 208472 43504 7710 -70056 45712
7363 62958 31585 111562 65409 -305887 -25701 131170 -334519 87073 204049 48597 -170791
7351 -277935 121640 15225 -72358 143386 112638 51444 117305 -144711 -64481 -190430 -102746
7340 -102746 -40813 251897 -109198 -168801 -337967 -26381 -52419 -304267 108848 -50512 52546
7328 14241 243735 -109476 116606 -18973 -196568 -5572 -14773 -205946 130919 35656 48885
7317 48885 231561 -218444 -309958 -308323 -230295 340564 29686 -157344 -155467 31759 -395304
7305 137700 -372508 -130343 -47667 -16065 -167775 62529 42603 -365608 -92261 -162393 -25475
7293 22 -9040 -126119 -119998 210694 -46765 94206 -101312 121320 325801 33908 -109649 -168800
7281 -168800 99428 -251203 -54122 42202 227477 99717 -148834 39918 87397 -306508 -63882
7269 -23800 -254919 425285 119460 -179530 42094 -39633 21944 -75281 81075 -122805 -31571
7257 -25558 173822 47025 181632 -126827 247707 -8348 -276568 286045 -6142 -160767 -190815
7246 -190815 -220757 -128974 -186010 -124957 -147745 28713 -75795 -72363 144843 -44949 -21858 17994
7233 167819 -260422 137969 -65448 64968 -248328 42052 -222736 171593 -140638 -82328
7223 -82328 -482669 -348996 -225625 -22523 185186 162790 28506 -212474 -39636 54555 -348106
7211 -82198 112324 134971 -50201 193572 48162 -250928 -86258 227312 98143 221281 -123801
7199 -86441 25055 191 42985 -13385 -30059 56154 8587 150843 -109419 -212957 -62779 55544
7186 -121207 252671 41267 -31563 254237 161052 69821 100384 -120796 -34914 -169205 -401065
7175 -401065 2243 -80760 68728 -224383 276129 -120920 -92415 -30520 -127658 -61974 -50470
7164 -50470 111157 -61633 164523 -132488 68421 185449 327691 -104016 -384037 -35843
7153 -209008 -25618 -211244 -39335 183418 -429947 -50367 -173987 235858 -131414 73408
7142 45885 -148550 6027 192065 -142334 -108229 272888 133726 -148112 -310852 -426972
7132 -426972 214362 -42095 259011 -304195 54054 -74021 108770 -79620 -103272 193065 5255
7120 20395 -102445 -137666 42459 -194376 467526 -16722 147105 75786 -201793 -136279 -386551
7109 -386551 -330782 -82510 -729741 -200372 22514 -28352 -87572 -67399 123269 -205872 -370526
7098 -370526 330425 117822 -86223 237454 -152737 211769 -236865 173398 -155951 4082
7087 87705 -137047 -249026 -153011 319493 -254090 125133 -32744 -121986 193755 131176 68688
7076 68688 -266540 199424 181012 85139 -388442 34797 106572 185060 359867 132678 270129
7065 270129 192369 -15971 -96174 -243878 327322 -54872 210781 -221915 153458 -94328 -23355
7053 -199084 247102 62973 25215 146632 53683 238050 -18790 -265021 -108844 -79888 -231715
7042 -231715 -2836 52738 318391 190372 112980 -272271 -72160 46254 -201788 -334491 174232
7030 -26971 -114516 -146808 150291 143928 -158786 -84088 -184300 -218860 -85333 -88942 -41232 -136679
7018 -136679 143454 -38465 199748 -228057 -313539 -7171 182 -318658 -73796 -71593 13535 -51098
7005 -144703 -198937 -56959 281222 106409 208427 -35964 13391 164601 -65382 2623 -282779
6993 -141886 -210714 14335 -211691 -104242 -188220 293866 -41809 -264503 394709 89402 -94506
6981 -161828 219787 148593 -308867 -10090 29092 124583 63971 -74405 -94199 57288 -171571
6969 46302 351539 -147877 219456 123808 128539 413497 120592 200527 36407 255407 59977
6957 78536 62700 -211741 -148017 176560 183822 137523 -128113 50896 -288102 -568220 88691
6945 54573 -44835 -28751 -432878 182101 202373 -322855 12732 74230 41876 172672 -114933
6933 -266568 406484 -203596 -285517 471043 -345774 -188237 141062 376626 -342252 -110730
6922 -290969 -30708 201684 70039 -285102 -117937 12706 3858 109938 -199132 77459 239508
6911 239508 216053 -237150 22975 -278148 218906 -238652 -110002 -307627 244735 261583
6901 261583 100235 33373 -26240 -82218 269021 -149174 -70271 84195 -228127 -19003 -36745
6890 -36745 -184790 -131499 3911 -53087 -389260 -362583 -3721 -116001 -313668 277435 112875
6878 30414 164608 174360 262922 -351347 43171 247883 -77178 -111201 -235548 -37615 176064
6866 4494 69824 -243875 -274079 274589 74991 -205750 -303374 -69492 194985 -229462 90276
6854 -3888 -30599 211157 -102642 225755 -23693 -88085 -98156 408740 -41936 -197620 65587
6842 255071 80139 -11880 -25037 -256989 -18963 -146265 -504838 -191957 345470 166659
6831 138186 56394 82159 -92695 -23386 120235 -104657 119393 -132158 10579 -172950 -14496
6819 -10045 -19495 249215 -226276 22330 83364 -226265 -949 -142693 -211021 104374 -26695
6807 -223348 5690 -312819 71632 -20277 -249656 -224850 -257856 56280 -181399 -307715 -331668
6796 -331668 99750 121777 -81300 187668 -268607 129950 199358 35206 247063 129401 -20898
6784 433086 -300101 -142870 13504 28142 66722 5305 -311991 -134174 5960 -216496 133885
6772 14841 -123103 193627 -92985 -146736 303701 149409 5342 -32704 -83100 -125333 -318123
6761 -318123 -33976 -93278 151829 274202 74161 511858 -5197 -274058 -368244 -28845 37212
6749 249730 153241 -33263 -205498 -150781 19503 -58184 24673 -33226 -86538 -69779 265385
6737 -54833 27960 -263655 36371 82338 15444 206097 152021 200249 155250 -210632 -16428
6725 -58698 111817 352883 258801 -23687 6394 296066 218471 293656 -209453 72924 182574
6714 182574 275969 -74222 -44662 -54205 203729 -221859 39796 -113851 187636 221692 -258835
6702 -54302 -224096 92985 133676 61942 -231133 45850 -49929 -270241 12121 15328 165801
6691 165801 168146 60692 168062 142166 -105179 133756 130217 -379593 -95902 -88778 112619
6679 63630 99255 -146692 192840 -10737 146495 -47502 24290 23313 180956 314637 275342
6668 275342 -15755 12641 -10576 -189486 -267723 -250689 65357 -62811 -302027 -1969 187605
6656 1939 241349 4118 21245 -333609 -134379 238423 115184 -343279 356580 -53245 -100656
6645 -100656 -142384 35592 -14148 -551360 22631 -376473 -167556 -55961 -189439 -200940 -2601
6633 253234 1403 76247 -13826 15399 -457518 107784 -132669 -290325 -57047 175512 117298
6622 117298 260637 124790 -173222 208476 -50955 -23620 134038 -76518 439509 165754
6611 -212392 -199401 -258560 -45990 -70566 28863 -37333 189046 -132785 177744 10800 -131804
6599 -42393 -351587 98407 65167 6302 -209241 -23462 -97761 -125696 -103731 149363 22261
6587 2640 192507 -148104 -184386 -158188 -203457 175682 400139 75710 75615 162784 -227124 -99270
6574 44512 -168685 76789 -83000 -118357 63735 316848 -257828 245600 -72815 -147390 -48349
6562 39151 -185958 27359 322170 268032 71428 74658 262291 88003 -245357 281041 28640
6550 -207157 -106721 -243617 248570 98008 229777 -109125 60836 -66907 -170256 179405
6539 -181993 425760 -148359 60325 -25581 -56530 15817 -22330 148711 -13880 -192355 129892
6527 441695 -332961 92104 -1615 -357067 176944 -340259 222200 -121862 74173 -146063
6516 -292859 -274243 -15933 -226410 -188606 88126 -68434 29763 -356553 214369 -79917 -242459
6505 -242459 83444 -205391 -216049 346037 -67726 178500 -349631 80601 -488251 -241329
6494 203700 15599 56998 -53815 136743 -187166 -297112 -134893 -167185 -293979 -225658 -224442
6483 -224442 -170550 151438 191378 -287094 42187 -52404 -189021 -243807 19388 377584 -301636
6471 -5781 -197450 170851 -135369 5135 133980 17794 6852 103969 -156242 -79272 38494
6459 280404 -195558 -147493 -99404 -128877 222827 -174055 46142 148551 71764 21419 -178600
6447 85359 209714 30403 10056 2962 -177253 129021 -310724 -77614 -273994 -238559 -137972
6436 -137972 -236239 326414 65248 -150181 98860 -55947 -84266 234065 -184113 23313 71042
6425 71042 52565 -621618 74199 -46267 -139804 -21513 -4000 -72446 71518 25649 247378 44959
6412 138089 -128469 65822 -100099 -244142 -107487 -28683 -147993 66868 80068 271376
6402 271376 -110870 -41269 115540 -88238 -64361 -328194 -212252 -56533 290005 -196968
6391 -9215 -10744 -33274 297777 -76202 -9333 -79894 13703 65775 185618 -232299 -37351 -31749
6379 -31749 -162881 38136 67172 44105 180513 35499 267698 219049 208539 16299 -116314
6367 212708 -101718 -22447 -95779 198826 -229900 34722 119152 190268 -311341 -233869 -279580
6356 -279580 25568 50889 -257066 -41414 29216 89759 21753 45301 76198 26176 -112645
6344 -131624 -8208 -27359 200514 -230099 52511 23506 -130652 133120 11479 -319731 289311
6332 67381 249935 -135845 118159 661620 -121420 -307104 -217966 -137146 40549 222422
6322 222422 -68184 281845 255581 -1322 -41655 -187100 -93355 -58485 -40866 4314 -419360
6310 -183492 -221709 46056 153080 129038 48429 -91269 15414 -78185 309916 -132093 -377303
6299 -377303 163487 -137311 -65424 4026 -148275 83090 174373 219169 -65227 -418266 -37909
6287 -112585 -82355 -67946 241861 112453 -6677 241747 69348 -229591 -15253 -203482 370293
6275 284873 20080 12031 130162 -151175 -4162 -21918 12081 207762 152407 78428 187123
6264 187123 253150 -146052 -112392 119269 -115677 -62800 -37131 196533 110352 -105295 243828
6252 61253 36302 73230 68767 -123240 97990 -487539 -52133 116821 -187831 -52904 133061
6240 -133237 -52059 74004 -25934 33649 -142500 278635 -91300 -136592 111849 6902 -287484
6228 219493 -191271 98887 -2646 177203 -370240 -348607 183979 89341 -188089 103235 -156838
6216 151553 -6736 276595 -307902 -98501 -186748 -4771 265890 213147 149306 -68547 -228156
6205 -228156 87946 -105219 216246 -247554 -82106 -17413 -392 -292488 68751 -21 193236 -485616
6192 21869 91109 20765 122659 -121566 -106282 -215831 -161505 231711 177901 -64795 70855
6180 245048 109297 -157397 -137928 235310 26869 -192569 -148395 -41785 55661 -26456 -7631
6168 -351320 165998 -137160 -388673 -90433 40845 -146696 -152338 -108464 -128539 1069 -4050
6156 63062 229393 -46707 151811 -184650 101777 195829 -153280 254762 -68457 -67306 -193730
6145 -193730 206315 -229906 -88049 -246119 -72242 369202 -190393 -12864 -276205 -23904
6134 128271 -34172 475577 -222361 60145 -277492 -152109 104878 -73355 -373772 23346
6123 -214519 460032 333746 -105647 -216135 -238173 168890 305979 -176016 44602 -296636
6112 220053 160931 52219 40896 172825 -270793 11433 170830 -40823 24034 27079 6067
6100 91360 108367 305277 157301 -285078 -206128 274333 44140 124894 3726 -27559 82085
6088 -163595 243285 90181 -153870 -31152 312497 -62720 -99658 41061 228731 10229 -2522
6076 112409 49029 -61901 236200 -144378 75413 147188 95586 -139833 6232 -216000 99825
6064 264441 -199152 160465 -77242 -2936 -52800 361309 -264409 -333339 164305 75775 198796
6053 198796 -180458 -355794 73968 -75539 51383 200217 -79073 -87228 259602 78530 228899
6042 228899 -49524 -180211 198469 102388 -249941 -220628 81380 104637 -105509 -150477 86996
6030 222223 -192046 -100414 -135241 -176858 -265750 -174051 85819 24458 211346 6566 74587
6019 74587 191402 166856 -588553 -85003 59833 -69592 -105357 96293 -11542 -140846 -58964
6007 104548 327792 93797 -13786 8567 -232844 -207728 221475 173484 13144 -73532 -91745
5996 -91745 -235741 -47338 -49789 -6685 -59694 -59519 28216 29521 -87007 -14612 -195936 -307254
5984 -307254 -75218 -294103 -108282 -101064 127069 136679 -341996 208739 279090 10620 239583
5973 239583 -51497 -41694 217671 -82955 -85736 -37276 -508516 173465 95741 -198306 -16713
5961 270600 77577 -78354 55124 61691 129728 -26396 -173457 -37567 90819 67433 -106127
5949 -121767 -239671 367394 129021 -119828 391124 140877 6677 89120 33379 185529
5939 185529 16042 64325 176384 110059 -158504 11755 44217 -109517 177923 488359 -16076
5927 17579 116106 71791 38612 391789 -159936 -225015 15364 -110973 -13695 140393 98772
5916 98772 210000 -38040 1138 -62677 162577 212760 207431 -308936 222230 162527 365122
5905 365122 218165 -52818 104108 -3523 -208080 -98659 18144 -274192 74159 86735 -90246
5893 18843 -127077 131423 230095 -200552 161398 284075 -163170 -73495 -20227 91107 168077
5882 168077 33458 -50713 1645 -318855 -398462 -152545 -64281 177905 -46410 -175411 -211052
5871 -211052 -89819 291530 99267 10598 -145793 97904 -165742 2845 -257244 -106284 47682
5859 52924 -11031 154239 -126762 25569 182516 -211399 50929 -224499 -196613 46195 -164636
5847 250765 -193091 31737 149588 -219607 33782 -414169 -95872 95173 23153 103581 183924
5836 183924 50192 110822 -98869 -228529 228519 5015 -64953 180246 101241 602817 -173054
5824 48611 265668 -294797 276999 -216766 98765 -191262 -50659 479922 -118893 -155784
5814 -155784 -264641 -22144 -8736 -258691 149719 47025 301088 168739 106394 17020 43031
5803 43031 3706 339291 -263086 -131931 -191972 413647 113376 108914 -5343 227342 93965
5791 -68619 378593 54222 -330724 -58653 65792 -24414 -12382 485719 -53060 -138817 -14399
5779 92728 -54867 -109953 -24134 327672 -458 -86795 44598 -34435 -124762 -105955 -14717 53108
5766 32879 381819 117610 54050 160409 -74302 -354661 -150440 363323 -60437 -390046
5756 -390046 -105145 328142 -38755 -92645 -118178 -5478 -31876 -32145 207662 323126 -229743
5744 -218861 219406 -329925 -110885 45065 -165460 105696 -235299 158896 181059 -38963
5733 -15425 -81979 36510 129490 64924 -112845 113628 -146633 82146 -21946 -177998 11450
5721 -164122 82816 -93642 -127487 6314 88139 -215781 -69741 -62383 -211904 -121188 -101689 -268503
5709 -268503 -120393 -5425 211214 -248969 409548 -95820 146695 -13932 -158555 -133776 -109402
5698 -109402 -85122 318743 112828 -109685 -164832 -96984 -23859 -183746 -132906 -40683 62573
5686 -72563 -3842 -85536 356364 -115445 244937 171893 135804 -43798 176056 131466 -165810
5674 61869 172514 149490 -10028 -194152 270288 25761 -519256 64626 32528 248808 -85521
5662 -105669 60634 -59083 -66328 -66277 -131866 -11046 -125198 173002 16145 -167327 23602 -116789
5649 -120988 129167 -151816 291370 -82572 120546 -236133 79979 -179461 -81960 181218
5638 -14933 -124980 54705 79869 -6811 115304 56555 331010 154616 738 205980 60385
5626 78688 150205 248194 -74258 66280 154955 27475 -132849 -364306 86555 168806 -168999
5614 143140 -199979 118452 -161688 176689 131764 159147 22782 29391 -68762 -172291 -208210
5603 -208210 -11938 148589 111913 59795 32381 -15181 -157235 -95234 -40617 121402 -11674
5591 78489 282601 250305 132844 -68954 457826 31307 -62183 -196128 -258372 -16784 -111553
5580 -111553 -198989 261419 -59882 -76381 -37086 346825 264176 -204457 -157482 -265228 85537
5568 -22626 69683 -11485 -351911 -89603 124912 -169756 1529 199837 202920 129925 22802
5556 -98315 192647 -10681 -118196 -188691 249338 -5999 55718 -222562 174168 94076 -251270
5544 9800 -27880 -91524 -42253 -235127 84633 -78499 128500 393305 -295706 31894 46571
5533 46571 277243 -210532 21354 77386 288905 8001 -141332 21425 89810 -25058 -125833
5522 -125833 -163302 -2170 -199710 110091 -183259 204885 -17146 332356 -133570 -432853
5512 -432853 219829 -470755 -171501 -8744 -56461 71375 -206358 71689 368652 85710 -44974
5500 95502 -292435 -186403 119412 61227 114667 114513 16704 -208714 224439 -24914 26772
5488 -204679 35861 257093 -223304 -197816 148362 200703 13339 293556 61922 427465 136034
5476 67765 101897 72416 83139 54037 -99552 -327297 181757 80414 -25221 -258028 107445
5464 -55342 219916 -57690 -5833 -103250 82323 113369 -157133 -74453 54335 87170 112344 -21114
5451 -122164 -157842 173562 -127000 -527627 226384 -101472 234415 -98180 317658 37713
5440 131570 165992 -129544 97764 372578 -162347 -342988 -288348 -235322 89930 64519 -30998
5428 47296 -61280 20727 -41658 -109760 39647 -89860 -50858 -101185 -29230 117226 -36539 -16253
5415 -17036 -190651 -250466 15714 -192517 -48256 -90530 -250873 107138 -162397 -148122 -116496
5404 -116496 -68102 -73007 -104839 96242 95945 37212 -23755 -166762 37570 -179077 121536 63045
5392 63045 97997 110413 -141061 21420 56077 88874 114495 195597 41007 -99338 -363644
5381 -363644 210868 -218339 -46231 -383490 8575 -112609 41843 48460 -90435 217914 -80559
5369 -91178 -3317 162717 206964 -180936 -620917 49943 -198081 -313829 -130581 -154504 106332
5357 -110914 -206785 344177 155357 -115603 -292209 87594 -67631 -86049 212840 -56223 -352009
5346 -352009 93943 -117788 430654 12270 245394 99590 121171 203131 256245 142487 23595
5334 58548 39751 -52595 -201273 88822 281092 63644 -47844 4057 -230391 -166204 137918
5322 -274635 -25746 387062 -52970 -401121 105719 -72105 -225661 -96044 112054 -46910 120730
5310 146979 54593 -239984 24910 199827 -318866 9652 54893 -34327 205004 -4515 -102773
5299 -102773 -3483 242949 211578 -156305 -50809 223750 -1999 180401 -178092 -79268 9799
5287 -33719 -170231 -33826 -18410 -38559 312346 236175 -312181 174497 -57645 -314307 73327
5275 -21010 14198 197544 -5095 -21312 -83524 -84819 193213 267970 16204 260551 45534 -74069
5262 76658 -324307 -2145 67933 -69369 -19307 -24628 -322191 -207343 45977 174009 -260875
5250 200910 -168135 -245510 142264 184988 72295 18354 49922 163779 15904 -373167 322973
5238 50590 -88666 -318079 128590 147295 123201 -121295 -79559 64515 -153935 351387 259421
5227 259421 -21197 159753 -37501 41749 169404 239364 264078 -624 160167 226067 -265318
5215 -95661 -106307 -76737 -46986 127182 1605 41771 79056 103685 -72033 29144 437870 379825
5203 379825 188568 -4804 362627 50812 -240990 128768 -131759 149658 110658 32064 -86365
5191 121342 -114240 -288966 -24532 329130 24997 248484 240015 -188329 212933 -15179 -87811
5180 -87811 103173 -25284 -77539 -32081 -136051 156729 -187424 -141733 21830 131427 8675
5168 -159932 -48432 -66204 392980 47598 114732 -208529 -63813 26805 301898 -7901 376004
5156 180197 100352 294576 -93582 -187687 -129204 -111259 -41159 198960 -392825 -211344 -177914
5145 -177914 -310948 -32977 -34984 159301 90281 40502 -212145 -297888 217496 437991 -7142
5133 -235037 -63666 -49940 242644 349838 -130499 165459 -304895 -121198 -106592 -251157
5123 -251157 96794 -365444 -28872 20704 217986 -105648 -74042 92766 -1458 4903 40976
5112 40976 -20243 131151 -93576 -119701 102100 -70907 -99516 -404917 -53954 226346 47997
5100 -12321 88115 -217485 8307 -78412 42016 148057 -201433 -231366 71164 -249878 -61667
5088 -35898 68427 93950 24482 77776 -154091 -517770 -73581 -39872 91275 -34323 -5798 195810
5075 -274477 20491 -640795 -59284 -213727 -29224 -20953 30420 -244870 -48472 71758 -101501
5063 -19938 115361 347712 -4204 -106922 28334 -286638 65007 120360 112954 -334687 43132
5051 189652 30052 -244837 -122299 -124398 -273553 167472 60484 14520 -190900 256423 79621
5039 59092 296443 409622 -145332 -36572 -28017 136192 51788 46143 339152 -237433 23832
5027 -164304 55638 -115541 -30738 180542 -3349 -143713 352994 201934 268470 -47555 -78894
5016 -78894 63075 84117 -167650 -7446 148633 -161308 98478 -170682 101581 42822 -11555
5004 -57039 982 56412 -71976 -151882 -125779 -333865 132303 206946 -139332 -96163 115129
4992 -617795 -40524 325247 -276435 -77913 -67049 -258277 -198892 -75991 -48504 109189 293082
4981 293082 92580 67361 -127332 41919 -38233 250801 -75211 10362 -154436 -139610 117882
4969 75499 -33897 -301160 34486 -267982 -127065 -129256 -197217 82238 321157 -88007 -284959
4958 -284959 -388042 532847 201027 72544 -76046 -7270 -125778 -102681 -266852 -159344 -211872
4947 -211872 102403 315434 5962 -125349 -236541 61734 -15753 -224492 137890 234745 -26139
4935 213462 -114089 239331 -127484 -54417 240160 9594 4328 131342 -114642 -222360 -208320
4924 -208320 -66340 -378037 -152899 -125828 46584 150260 332319 -16767 -345498 158365
4913 111202 125546 88692 505299 163893 -65888 -72980 -138432 25550 133374 11632 184215
4902 184215 32920 152245 -256147 -83066 -235653 -318513 -58033 78016 -20030 87545 -73600
4890 88800 93042 430374 432004 -83434 303487 -138169 -217648 53315 -68005 -95489 244024
4878 71065 -46947 79975 490462 61572 -162173 -211226 111404 -120296 -36597 266749 40169
4866 151443 101874 -156573 27458 118476 111120 149482 -31163 117390 50242 69614 -119268
4854 118303 -10739 -153256 247659 108048 37393 -72493 152407 -98986 -219112 239983
4843 -276303 243387 -101402 79549 -145176 -32168 -32697 129296 177457 -134743 -142519 -141577 367124
4830 259918 27872 69356 -65867 150698 251572 50959 -321896 -18907 -74411 -49537 -82559
4819 -82559 210993 -389578 454 204021 44580 -392975 -60348 -105548 70802 289951 121653
4807 266004 -34462 171187 -14212 309917 -15861 190947 -72236 -18002 -79628 110736 -197183
4795 251997 -199075 256691 -416800 -468770 -244479 -145206 243463 124412 -95684 -65356
4785 -65356 148076 -167741 -74471 -13284 35620 -218848 96853 105527 40829 78785 -335360
4773 -54866 61071 54040 41029 143911 -293910 134859 114121 -147583 -156324 -43152 -64089
4762 -64089 -186022 -132835 367965 125308 -79336 264898 -5122 117140 36248 90264 301911
4751 301911 -24994 99636 -146929 157731 8703 -19800 -188388 -322975 146734 -81382 -574040
4740 -574040 54139 -56567 55996 -6696 345689 159167 -78030 -202033 91439 -38613 109488
4728 -127798 -307800 272706 -136123 -84425 83606 169364 -123949 -319788 19443 -133684
4717 -51368 -167449 260665 93015 33994 -29372 206781 134570 -181419 -225942 -82580 56610
4705 170261 82501 -230451 -134513 -230646 -88860 160337 22788 -11916 22254 295870 120772
4693 -90251 -25046 -87414 121074 92266 336882 -53563 -184916 101769 -166263 -4979 -269866
4682 -269866 -202465 90736 -143905 -31612 -73076 -158323 -103226 111257 -227296 67577 -88385
4670 248219 -382078 -40247 -209035 76502 -43912 -85091 -264212 70180 272074 -170747 -417176
4659 -417176 59141 87985 -115589 257671 -19585 -244716 159027 -98145 148011 9069 -146582
4647 236228 -110765 -183807 -255703 132787 -3015 -110095 -147860 -175295 -146084 148444 -285297
4635 -60584 -203013 205927 -322264 252256 4300 346745 -186416 -336599 90057 146188 -217748
4623 125627 169191 120875 37844 337078 -6932 -90510 400871 -77008 -372672 27977 -82045
4611 88324 136324 21482 144586 53370 -148236 8109 -243670 -151742 64032 10861 -189391
4599 -22423 46350 -37367 100263 -181938 514567 -225621 58813 231736 -97845 -96427 393005
4587 15502 43640 224307 -33728 28170 4103 25928 34063 -23076 -109999 -310033 67563 -139412
4574 -227447 68934 50590 39472 -53493 138115 445415 104266 141717 214974 -40641 -122721
4563 -122721 262343 -128355 -26933 -82728 -26735 35129 115235 270864 -289833 154259 112941
4552 112941 177524 87432 16403 83334 -11883 165009 -99632 -49195 33857 138684 72348
4541 72348 27130 206084 254502 -365229 -298758 -71294 23982 -136557 199813 33425 57201
4530 57201 -29374 289004 188018 -203382 -22572 -14177 88352 -247784 -90909 83866 298695
4519 298695 -89870 132713 182840 68061 -85958 -155824 -189484 43764 134679 17627 -296879
$$ [...]
##END NTUPLES=NMR SPECTRUM
##END=
