
##TITLE=UV1253_M10_1340-1211_50_7409617_D8Safu9aF7
##JCAMPDX= 6.0         $$ Bruker NMR JCAMP-DX V2.0
##DATA TYPE= NMR SPECTRUM
##DATA CLASS= NTUPLES
##ORIGIN= BRUKER
##OWNER= Administrator
$$ 1.72 TOPSPIN		Version 2.1
$$ 2013-01-24 18:17:20.056 -0500  Administrator@X
$$ Compression mode = diff/dup
##.OBSERVE FREQUENCY= 400.02188249412
##.OBSERVE NUCLEUS= ^1H
##.ACQUISITION MODE= SIMULTANEOUS (DQD)
##.ACQUISITION SCHEME= undefined
##.AVERAGES= 64
##.DIGITISER RES= 22
##SPECTROMETER/DATA SYSTEM= spect
##.PULSE SEQUENCE= noesygpps1d.comp
##.SOLVENT NAME= COFFEE_meoh
##.SHIFT REFERENCE= INTERNAL, COFFEE_meoh, 1, 14.961
##AUDIT TRAIL= $$ (NUMBER, WHEN, WHO, WHERE, PROCESS, VERSION, WHAT)
$$ ##TITLE= Audit trail, TOPSPIN		Version 2.1
$$ ##JCAMPDX= 5.01
$$ ##ORIGIN= Bruker BioSpin GmbH
$$ ##OWNER= Administrator
$$ $$ E:\/data/COFFEE/nmr/UV1253_M10_1340-1211_50_7409617_D8Safu9aF7/12/pdata/1/auditp.txt
$$ ##AUDIT TRAIL=  $$ (NUMBER, WHEN, WHO, WHERE, PROCESS, VERSION, WHAT)
(   1,<2013-01-24 18:17:14.181 -0500>,<Administrator>,<X>,<go>,<TOPSPIN 2.1>,
      <created by zg
	started at 2013-01-24 18:05:43.661 -0500,
	POWCHK enabled, PULCHK disabled,
       configuration hash MD5:
       86 BA 57 50 F2 9D 5C 9B 26 00 A9 28 5F 66 2E 89
       data hash MD5: 64K
       F8 AB 44 AB 99 44 B6 24 5E FD C8 32 9D C5 F4 7C>)
(   2,<2013-01-24 18:17:17.227 -0500>,<Administrator>,<X>,<proc1d>,<TOPSPIN 2.1>,
      <Start of raw data processing
       efp LB = 0.3 FT_mod = 6 PKNL = 1 PHC0 = 0 PHC1 = 0 SI = 128K 
       data hash MD5: 128K
       0C 6A 1A D9 1B D1 01 17 C2 24 9C 0E 39 FF F8 30>)
(   3,<2013-01-24 18:17:18.274 -0500>,<Administrator>,<X>,<proc1d>,<TOPSPIN 2.1>,
      <pk PHC0 = -75.49255 PHC1 = 0 
       data hash MD5: 128K
       7A 97 55 13 D1 44 DF 3F EE D9 DD B2 6F 8A 68 A5>)
(   4,<2013-01-24 18:17:18.962 -0500>,<Administrator>,<X>,<proc1d>,<TOPSPIN 2.1>,
      <abs ABSG = 1 
       data hash MD5: 128K
       EF 04 E4 EE 70 46 A7 6F BB 8F 61 53 54 41 E9 3A>)
(   5,<2013-01-24 18:17:19.149 -0500>,<Administrator>,<X>,<proc1d>,<TOPSPIN 2.1>,
      <abs ABSG = 2 
       data hash MD5: 128K
       B7 6E FA A9 79 E2 32 BB 4F FD 6E 53 CB 0D 56 E2>)
(   6,<2013-01-24 18:17:19.321 -0500>,<Administrator>,<X>,<proc1d>,<TOPSPIN 2.1>,
      <abs ABSG = 3 
       data hash MD5: 128K
       90 03 A6 53 CC EF AE 02 AD CB AD 90 36 C3 1E 28>)
(   7,<2013-01-24 18:17:19.509 -0500>,<Administrator>,<X>,<proc1d>,<TOPSPIN 2.1>,
      <abs ABSG = 4 
       data hash MD5: 128K
       D2 43 FB E1 24 20 03 BC 53 6A BE 06 EC 4F 48 90>)
(   8,<2013-01-24 18:17:19.696 -0500>,<Administrator>,<X>,<proc1d>,<TOPSPIN 2.1>,
      <abs ABSG = 5 
       data hash MD5: 128K
       FB A8 35 1A E8 42 49 8A 9C 40 34 10 AE 03 8F 1C>)
$$ ##END=
$$ 
$$ $$ hash MD5
$$ $$ A2 0A 9D 60 1C 90 F6 6A BE 3B 9B 88 14 9A 81 CF
##$RELAX= 
##$RELAX= 
##$RELAX= 
##$RELAX= 
##$RELAX= 
##$RELAX= 
##$RELAX= 
##$RELAX= 
$$ Bruker specific parameters
$$ --------------------------
##$DU= <E:\>
##$EXPNO= 12
$$ [...]
150 150 150 150 150 150 150 150
##$TP07= 0
##$TPNAME0= <>
##$TPNAME1= <>
##$TPNAME2= <>
##$TPNAME3= <>
##$TPNAME4= <>
##$TPNAME5= <>
##$TPNAME6= <>
##$TPNAME7= <>
##$TPOAL= (0..7)
0.5 0.5 0.5 0.5 0.5 0.5 0.5 0.5
##$TPOFFS= (0..7)
0 0 0 0 0 0 0 0
##$TUNHIN= 0
##$TUNHOUT= 0
##$TUNXOUT= 0
##$USERA1= <user>
##$USERA2= <user>
##$USERA3= <user>
##$USERA4= <user>
##$USERA5= <user>
##$V9= 5
##$VALIST= <valist>
##$VCLIST= <CCCCCCCCCCCCCCC>
##$VD= 0
##$VDLIST= <DDDDDDDDDDDDDDD>
##$VPLIST= <PPPPPPPPPPPPPPP>
##$VTLIST= <TTTTTTTTTTTTTTT>
##$WBST= 1024
##$WBSW= 4
##$XGAIN= (0..3)
0 0 0 0
##$XL= 0
##$YL= 0
##$YMAX_a= 6238853
##$YMIN_a= -12767625
##$ZGOPTNS= <>
##$ZL1= 120
##$ZL2= 120
##$ZL3= 120
##$ZL4= 120
##$ABSF1= 14.961
##$ABSF2= -5.597181
##$ABSG= 5
##$ABSL= 3
##$ALPHA= 0
##$AQORDER= 0
##$ASSFAC= 0
##$ASSFACI= 0
##$ASSFACX= 0
##$ASSWID= 0
##$AUNMP= <proc_prof1d_extract.lims>
##$AXLEFT= 0
##$AXNAME= <>
##$AXNUC= <1H>
##$AXRIGHT= 0
##$AXTYPE= 0
##$AXUNIT= <>
##$AZFE= 0.1
##$AZFW= 0.1
##$BCFW= 0
##$BC_mod= 0
##$BYTORDP= 0
##$COROFFS= 0
##$CY= 15
##$DATMOD= 1
##$DC= 0
##$DFILT= <>
##$DTYPP= 0
##$F1P= 0
##$F2P= 0
##$FCOR= 0.5
##$FTSIZE= 131072
##$FT_mod= 6
##$GAMMA= 0
##$GB= 0
##$INTBC= 1
##$INTSCL= 1
##$ISEN= 128
##$LB= 0.3
##$LEV0= 0
##$LPBIN= 0
##$MAXI= 10000
##$MC2= 0
##$MEAN= 0
##$ME_mod= 0
##$MI= 0
##$NCOEF= 0
##$NC_proc= -2
##$NLEV= 6
##$NOISF1= 0
##$NOISF2= 0
##$NSP= 0
##$NTH_PI= 0
##$NZP= 0
##$OFFSET= 14.961
##$PC= 1
##$PHC0= -75.49255
##$PHC1= 0
##$PH_mod= 1
##$PKNL= yes
##$PPARMOD= 0
##$PPDIAG= 0
##$PPIPTYP= 0
##$PPMPNUM= 2147483647
##$PPRESOL= 1
##$PSCAL= 4
##$PSIGN= 0
##$PYNMP= <proc.py>
##$REVERSE= no
##$SF= 400.020009638204
##$SI= 131072
##$SIGF1= 0
##$SIGF2= 0
##$SINO= 400
##$SIOLD= 131072
##$SPECTYP= <>
##$SREGLST= <1H.CDCl3>
##$SSB= 0
##$STSI= 131072
##$STSR= 0
##$SW_p= 8223.68421052631
##$SYMM= 0
##$S_DEV= 0
##$TDeff= 65536
##$TDoff= 0
##$TI= <>
##$TILT= no
##$TM1= 0
##$TM2= 0
##$TOPLEV= 0
##$USERP1= <user>
##$USERP2= <user>
##$USERP3= <user>
##$USERP4= <user>
##$USERP5= <user>
##$WDW= 1
##$XDIM= 131072
##$YMAX_p= 423628888
##$YMIN_p= -11650
##$CURPLOT= <Network HP LaserJet P1505>
##$CURPRIN= <$Network HP LaserJet P1505>
##$DFORMAT= <normdp>
##$LAYOUT= <+/1D_H.xwp>
##$LFORMAT= <normlp>
##$PFORMAT= <normpl>
##$SURQMSG= 1
$$ End of Bruker specific parameters
$$ ---------------------------------
##NTUPLES= NMR SPECTRUM
##VAR_NAME=  FREQUENCY,     SPECTRUM/REAL,   SPECTRUM/IMAG
##SYMBOL=    X,             R,               I
##VAR_TYPE=  INDEPENDENT,   DEPENDENT,       DEPENDENT
##VAR_FORM=  AFFN,          ASDF,            ASDF
##VAR_DIM=   131072,        131072,          131072
##UNITS=     HZ,            ARBITRARY UNITS, ARBITRARY UNITS
##FACTOR=    0.0627417313425164, 1,          1
##FIRST=     8223.62146879497, 1773,         -58685
##LAST=      0,             3002,            -58720
##MIN=       0,             -11650,          0
##MAX=       8223.62146879497, 423628888,    0
$$ Real data points
##PAGE= N=1
##DATA TABLE= (X++(R..R)), XYDATA
$$ [...]
$$ plain form
61659 522977 521808 520818 519705 518743 518596 519132 519261 518322 516842 515545 514481 513664 513666 514835 516548 517991 519216
61642 519216 520773 522748 524741 526450 527700 528277 528249 528111 528091 527713 526474 524535 522228 519388 515784 511848
61626 511848 508278 505191 502253 499394 496836 494683 493069 492352 492559 492874 492394 491245 490268 489778 489360 488759
61610 488759 488151 487418 485944 483388 480062 476242 471648 466047 459958 454308 449522 445277 441074 436738 432352
61595 432352 427996 423740 419834 416636 414230 412231 410190 408091 406205 404529 402707 400546 398241 396007
61581 396007 393880 391983 390536 389283 387390 384375 380912 378222 376796 376044 375127 373756 372226 370955 370062
61566 370062 369248 368090 366456 364546 362587 360704 359108 358007 357210 356248 355097 354344 354334 354568 354384 353907
61550 353907 353806 354344 355149 355811 356233 356474 356705 357270 358349 359530 360112 359888 359351 359039 358928 358580 357716 356610
$$ packed form
61659E22977j169r90j113r62j47N36J29r39j480j297j064q17KJ169J713J443J225
61642E19216J557J975J993J709J250N77k8j38k0l78j239j939k307k840l604l936
61626E11848l570l087k938k859k558k153j614p17K07L15m80j149r77m90m18o01
61610D88759o08p33j474k556l326l820m594n601o089n650m786m245m203m336m386
61595D32352m356m256l906l198k406j999k041k099j886j676j822k161k305k234
61581C96007k127j897j447j253j893l015l463k690j426p52r17j371j530j271q93
61566C70062q14j158j634j910j959j883j596j101p97r62j151p53j0K34j84m77
61550C53907j01N38Q05O62M22K41K31N65J079J181N82k24n37l12j11l48q64j106
$$ plain form
61532 356610 356060 356909 359368 362745 365905 368012 368878 368739 367924 366646 365012 363212 361622 360502 359563 358106
61516 358106 355763 352949 350433 348656 347600 347084 346978 347185 347595 348021 348241 348207 348097 347925 347240 345682 343737
61499 343737 342370 341829 341443 340768 340217 340176 340199 339730 339095 339034 339574 340042 340058 339862 339745 339765 340035 340750 341854 343096
61479 343096 344412 345883 347304 348191 348353 348162 348205 348847 350072 351515 352622 353070 353022 352792 352316 351191 349265
61462 349265 346933 344819 343305 342464 342371 343274 345261 347729 349468 349653 348652 347504 346771 346340 346182 346497
61446 346497 347066 347336 347417 348192 349895 351421 351782 351579 352221 354093 356453 358789 361323 364235 367309 370509
61430 370509 374195 378443 382593 385694 387233 387473 387383 388065 389901 392291 394453 396226 397802 399121 400107
61415 400107 401196 402910 405032 406804 407842 408301 408292 407772 406922 405991 404785 403009 401056 399737 399071 398028
$$ packed form
61532C56610n50Q49K459L377L160K107Q66j39q15j278j634j800j590j120r39j457
61516C58106k343k814k516j777j056n16j06K07M10M26K20l4j10j72o85j558j945
61499C43737j367n41l86o75n51m1K3m69o35o1N40M68J6j96j17K0K70P15J104J242
61479C43096J316J471J421Q87J62j91M3O42J225J443J107M48m8k30m76j125j926
61462C49265k332k114j514q41r3R03J987K468J739J85j001j148p33m31j58L15
61446C46497N69K70Q1P75J703J526L61k03O42J872K360K336K534K912L074L200
61430C70509L686M248M150L101J539K40r0O82J836K390K162J773J576J319R86
61415D00107J089J714K122J772J038M59rn20q50r31j206j776j953j319o66j043
$$ plain form
61399 398028 395704 392273 388601 385480 383342 382134 381190 379709 377608 375567 374106 373146 372656 373089 374675
61384 374675 376670 377932 378191 378312 379238 380938 382546 383370 383579 383828 384457 385347 386454 387959 389768 391359
61368 391359 392477 393556 395131 397183 399445 401906 404552 407088 409510 412477 416340 420200 422864 424540
61354 424540 426637 429966 434079 438487 443515 449682 457035 465516 475339 486543 498607 510774 522394
61341 522394 532839 541592 548634 554375 559107 562952 566258 569417 572154 573566 573069 570815 567232 562792
61327 562792 558262 554366 550985 547373 543349 539559 536339 533241 530047 527368 525718 524733 524013 524043 525428
61312 525428 527670 529551 530594 531537 533458 536919 541813 547685 554236 561777 570970 581999 594349 607579
61298 607579 621696 636300 649890 660684 667956 672022 673193 671409 666853 660300 652625 644237 635171
$$ packed form
61399C98028k324l431l672l121k138j208r44j481k101k041j461r60m90M33J586
61384C74675J995J262K59J21R26J700J608Q24K09K49O29Q90J107J505J809J591
61368C91359J118J079J575K052K262K461K646K536K422K967L863L860K664J676
61354D24540K097L329M113M408N028O167P353Q481R823J1204J2064J2167J1620
61341E22394J0445Q753P042N741M732L845L306L159K737J412m97k254l583m440
61327E62792m530l896l381l612m024l790l220l098l194k679j650r85p20L0J385
61312E25428K242J881J043R43J921L461M894N872O551P541R193J1029J2350J3230
61298F07579J4117J4604J3590J0794P272M066J171j784m556o553p675q388r066
$$ plain form
61285 635171 625609 616206 607861 601050 595451 590455 585974 582433 579973 578169 576657 575576 575195 575610 577085
61270 577085 580237 585412 592130 599457 606696 613487 619595 624971 629892 634799 640192 646653 654569 663629
61256 663629 673147 683076 694176 706799 720043 732588 743871 753822 761819 766721 768003 766364 763075
61243 763075 758975 754112 748142 740993 733130 725085 716919 708488 700163 692723 686447 680932 675983 672034
61229 672034 669332 667369 665639 664435 664339 665339 667040 669439 672917 677676 683628 690508 697642 703913 708588
61214 708588 712017 715105 718337 721723 725372 729458 733732 737620 740781 743226 745062 746510 748040 750065
61200 750065 752643 755829 760083 765922 773390 782322 792928 805650 820547 837189 855121 874094 893984
61187 893984 914679 935782 956242 974711 990559 1004066 1015268 1023343 1027913 1030359 1032835 1036109
$$ packed form
61285F35171r562r403q345o811n599m996m481l541k460j804j512j081l81M15J475
61270E77085L152N175O718P327P239O791O108N376M921M907N393O461P916R060
61256F63629R518R929J1100J2623J3244J2545J1283R951P997M902J282j639l289
61243G63075m100m863n970p149p863q045q166q431q325p440o276n515m949l949
61229F72034k702j963j730j204r6J000J701K399L478M759N952O880P134O271M675
61214G08588L429L088L232L386L649M086M274L888L161K445J836J448J530K025
61200G50065K578L186M254N839P468Q932J0606J2722J4897J6642J7932J8973J9890
61187H93984K0695K1103K0460J8469J5848J3507J1202Q075M570K446K476L274
$$ plain form
61175 1036109 1039211 1041047 1041414 1040389 1037686 1033015 1026475 1018216 1008130 996116 982378 967309 951282
61162 951282 934566 917202 898993 879874 860174 840331 820609 801511 784163 769647 757980
61151 757980 748262 739792 732627 727159 723659 722253 722837 724892 727659 730490 732816 734043 733867 732464 729939
61136 729939 725934 720332 714081 708533 704032 699887 695751 692329 690619 691068 693654 698218 704494 712272
61122 712272 721775 733517 747729 764230 782857 803606 826323 850754 876909 904905 934402 964669
61110 964669 995260 1026089 1056766 1086347 1113997 1139493 1162915 1184160 1202953 1219046 1232262
61099 1232262 1242581 1250245 1255484 1257998 1256887 1251155 1240292 1224571 1204992 1182717 1158305 1131696
61087 1131696 1103150 1073779 1044745 1016309 988133 960156 932631 905738 879893 856126 835301
$$ packed form
61175A036109L102J836L67j025k703m671o540q259j0086j2014j3738j5069j6027
61162I51282j6716j7364j8209j9119j9700j9843j9722j9098j7348j4516j1667
61151G57980r718q470p165n468l500j406N84K055K767K831K326J227j76j403k525
61136G29939m005n602o251n548m501m145m136l422j710M49K586M564O276P778
61122G12272R503J1742J4212J6501J8627K0749K2717K4431K6155K7996K9497L0267
61110I64669L0591L0829L0677K9581K7650K5496K3422K1245J8793J6093J3216
61099A232262J0319P664N239K514j111n732j0863j5721j9579k2275k4412k6609
61087A131696k8546k9371k9034k8436k8176k7977k7525k6893k5845k3767k0825
$$ plain form
61076 835301 817099 800508 785197 771641 760036 749977 741191 733775 727677 722722 719192 717556 717470
61063 717470 717831 717971 718140 718753 719948 722009 725441 730300 736068 742415 749531 757536 766217 775535 785928
61048 785928 797957 812091 828754 848005 869215 891628 915137 940027 966250 993641 1022460
61037 1022460 1052835 1084122 1115856 1148846 1183996 1220402 1256255 1291499 1327887 1366388 1406441
61026 1406441 1448096 1492887 1541719 1593505 1646762 1701052 1756042 1810735 1864849 1919946 1978445
61015 1978445 2042684 2115440 2199668 2296724 2406065 2527295 2660938 2807161 2966706 3144606
61005 3144606 3350702 3595339 3887831 4241248 4675200 5211223 5870151 6679316 7678954
60996 7678954 8916518 10441915 12319104 14628087 17407710 20548931 23738327 26544769
$$ packed form
61076H35301j8202j6591j5311j3556j1605j0059q786p416o098m955l530j636q6
61063G17470L61J40J69O13J195K061L432M859N768O347P116Q005Q681R318J0393
61048G85928J2029J4134J6663J9251K1210K2413K3509K4890K6223K7391K8819
61037A022460L0375L1287L1734L2990L5150L6406L5853L5244L6388L8501M0053
61026A406441M1655M4791M8832N1786N3257N4290N4990N4693N4114N5097N8499
61015A978445O4239P2756Q4228R7056J09341J21230J33643J46223J59545J77900
61005C144606K06096K44637K92492L53417M33952N36023O58928Q09165R99638
60996G678954J237564J525397J877189K308983K779623L141221L189396K806442
$$ plain form
60988 26544769 28612729 29814124 30254384 30175864 29872243 29648372 29760307 30298621 31095524
60979 31095524 31769951 31909837 31260613 29795585 27663665 25096041 22334680 19588880
60971 19588880 17009305 14681897 12641694 10891618 9413821 8177072 7146298 6289957
60963 6289957 5580253 4990874 4498322 4084083 3733115 3431530 3167919 2935509 2730559
60954 2730559 2549126 2386999 2241626 2111961 1996788 1894701 1805063 1727262 1659221 1597864
60944 1597864 1540642 1485674 1431270 1376747 1323144 1271733 1222242 1173764 1126757 1082594 1041536
60933 1041536 1002624 965455 930643 898552 868901 841701 817401 795897 776318 758049 741209
60922 741209 726082 712752 701203 691076 681490 671804 662387 653892 646087 638284 630682 624311 619732
$$ packed form
60988B6544769K067960J201395M40260p8520l03621k23871J11935N38314P96903
60979C1095524O74427J39886o49224j465028k131920k567624k761361k745800
60971A9588880k579575k327408k040203j750076j477797j236749j030774q56341
60963F289957p09704n89379m92552m14239l50968l01585k63611k32410k04950
60954B730559j81433j62127j45373j29665j15173j02087q9638p7801o8041o1357
60944A597864n7222n4968n4404n4523n3603n1411m9491m8478m7007m4163m1058
60933A041536l8912l7169l4812l2091k9651k7200k4300k1504j9579j8269j6840
60922G41209j5127j3330j1549j0127r586r686r417q495p805p803p602o371m579
$$ plain form
60909 619732 616735 615254 615565 617498 620286 623351 626505 629356 631284 632170 632467 632478 632151 631495 630513 628724
60893 628724 625456 620644 614798 608311 601445 594753 588612 582454 575399 567635 560217 553471 546647 539352
60879 539352 532275 526076 520467 514879 509260 503802 498567 493859 490316 488091 486447 484688 483105 482610
60865 482610 483737 486276 489528 492756 495841 499648 505229 512517 520375 528119 536244 545205 554215 561965
60851 561965 568184 573846 579944 586489 592652 597641 601546 605366 609966 614970 618988 620900 620521 618103
60837 618103 613955 608763 603532 598747 593997 588703 582730 576074 568647 560775 553355 546946 541149 535320
60823 535320 529430 523684 517816 511385 504561 498045 492412 487881 484416 481546 478396 474374 469725 465140
60809 465140 461164 458238 456769 456582 456700 456330 455772 455794 456428 457148 457923 459290 461397 463803 466329 469445
$$ packed form
60909F19732k997j481L11J933K788L065L154K851J928Q86K97J1l27o56r82j789
60893F28724l268m812n846o487o866o692o141o158p055p764p418o746o824p295
60879E39352p077o199n609n588n619n458n235m708l543k225j644j759j583m95
60865D82610J127K539L252L228L085L807N581P288P858P744Q125Q961R010P750
60851E61965O219N662O098O545O163M989L905L820M600N004M018J912l79k418
60837F18103m148n192n231m785m750n294n973o656p427p872p420o409n797n829
60823E35320n890n746n868o431o824o516n633m531l465k870l150m022m649m585
60809D65140l976k926j469j87J18l70n58K2O34P20P75J367K107K406K526L116
$$ plain form
60793 469445 473608 478752 484615 491056 497807 504322 510290 516094 522532 530113 538651 547493 556191 565060
60779 565060 574950 586277 598384 610120 620964 631345 641921 652789 663451 673494 683330 694168
60767 694168 706943 721283 735932 750273 764908 780540 796921 813397 829856 846526 863303
60756 863303 880043 897124 914853 932477 948624 962713 975227 986618 996677 1005002 1011341 1015314
60744 1015314 1016494 1014938 1011109 1005091 996389 984550 969492 951221 929991 906811 883094 859512
60732 859512 835825 812021 788879 767094 746555 726947 708464 691431 675794 661466 648695
60721 648695 637527 627346 617556 608398 600555 594256 589247 585376 582574 580378 578019 574934 570920 565972
60707 565972 560390 554837 549809 545120 540224 534895 529190 523008 516158 508835 501513 494363 487193 479930
$$ packed form
60793D69445M163N144N863O441O751O515N968N804O438P581Q538Q842Q698Q869
60779E65060R890J1327J2107J1736J0844J0381J0576J0868J0662J0043R836J0838
60767F94168J2775J4340J4649J4341J4635J5632J6381J6476J6459J6670J6777
60756H63303J6740J7081J7729J7624J6147J4089J2514J1391J0059Q325O339L973
60744A015314J180j556l829o018q702j1839j5058j8271k1230k3180k3717k3582
60732H59512k3687k3804k3142k1785k0539j9608j8483j7033j5637j4328j2771
60721F48695j1168j0181r790r158p843o299n009l871k802k196k359l085m014m948
60707E65972n582n553n028m689m896n329n705o182o850p323p322p150p170p263
$$ plain form
60693 479930 472781 465905 459338 453278 447991 443302 438577 433504 428670 425086 423187 422434 421907 421186 420610
60678 420610 420677 421328 422027 422543 423336 424934 427184 429417 431256 432899 434611 436231 437327 437717 437672 437574 437387
60661 437387 436673 435326 434117 434029 434969 435659 435145 433999 433610 434666 436919 440194 444802 450812 457544 464204
60645 464204 470621 477018 483300 488999 493923 498431 502806 506549 508697 508994 508425 508212 508462 508263 507091
60630 507091 505481 504105 502817 501076 498817 496299 493449 490051 486462 483451 481255 479350 477181 474619
60616 474619 471654 468252 464666 461416 458751 456551 454895 454162 454273 454343 453494 451780 449942 448568 447887 448064
60600 448064 449079 450268 450510 449185 446815 444615 443408 443039 442809 442399 442203 442717 443827 444985 445986 447164
60584 447164 448693 450088 450654 450235 449313 448580 448646 449898 452237 454994 457470 459661 462261 465952 470897 476971
$$ packed form
60693D79930p149o876o567o060n287m689m725n073m834l584j899p53n27p21n76
60678D20610O7O51O99N16P93J598K250K233J839J643J712J620J096L90m5r8j87
60661D37387p14j347j209q8R40O90n14j146l89J056K253L275M608O010O732O660
60645D64204O417O397O282N699M924M508M375L743K148K97n69k13K50j99j172
60630E07091j610j376j288j741k259k518k850l398l589l011k196j905k169k562
60616D74619k965l402l586l250k665k200j656p33J11P0q49j714j838j374o81J77
60600D48064J015J189K42j325k370k200j207l69k30m10j96N14J110J158J001J178
60584D47164J529J395N66m19r22p33O6J252K339K757K476K191K600L691M945O074
$$ plain form
60568 476971 484224 492939 503371 515585 529558 545252 562545 581105 600307 619217 636608 651089
60556 651089 661443 667030 667964 664831 658257 648784 637253 625127 614197 605734 599921 596242 594448
60543 594448 594974 598325 604280 612021 621141 632236 646419 664311 685553 709025 733293 756841 778075
60530 778075 795350 807313 813490 814428 811029 803827 793288 780697 768101 757032 747737 739881 733496
60517 733496 728712 725025 721576 718071 714889 712373 710592 709779 710343 712287 715162 718786 723599 730072 738151
60502 738151 747497 758078 770406 785540 804973 830131 861713 899659 943785 994134 1050570 1112344
60490 1112344 1178235 1246729 1315820 1382820 1444551 1497598 1538436 1563902 1572079 1562711 1536713 1495576
60478 1495576 1441418 1377198 1306418 1232575 1158937 1088351 1022806 963146 909455 861614 819395
$$ packed form
60568D76971P253Q715J0432J2214J3973J5694J7293J8560J9202J8910J7391J4481
60556F51089J0354N587R34l133o574r473j1531j2126j0930q463n813l679j794
60543E94448N26L351N955P741R120J1095J4183J7892K1242K3472K4268K3548K1234
60530G78075J7275J1963O177R38l399p202j0539j2591j2596j1069r295p856o385
60517G33496m784l687l449l505l182k516j781q13N64J944K875L624M813O473Q079
60502G38151R346J0581J2328J5134J9433K5158L1582L7946M4126N0349N6436O1774
60490A112344O5891O8494O9091O7000O1731N3047M0838K5466Q177r368k5998m1137
60478A495576n4158o4220p0780p3843p3638p0586o5545n9660n3691m7841m2219
$$ plain form
60467 819395 782300 749683 720998 695781 673539 653884 636617 621507 608120 596114 585499
60456 585499 576311 568143 560320 552554 545237 539029 534333 531040 528581 526171 523206 519590 515696 512046
60442 512046 508921 506140 503190 499732 495989 492546 489839 488065 487400 487847 488829 489448 489434 489424 490048 491124
60426 491124 492035 492480 492433 491722 490262 488529 487278 486752 486562 486333 486156 486422 487472 489371 491763 493994 495594
60409 495594 496574 497130 497309 497230 497309 497822 498439 498654 498555 498632 498913 498821 497994 496802 495925 495769 496367 497548 499080
60390 499080 500842 502818 504707 505828 505906 505754 506541 508405 510416 511966 513423 515205 516994 518419 519878
60375 519878 522042 524900 527860 530550 532994 535188 537071 538792 540534 542067 542944 543093 542911 542809 542990
60360 542990 543552 544373 544963 544965 544795 545310 546714 548359 549867 551842 554980 558930 562717 566117 569939 574911
$$ packed form
60467H19395l7095l2617k8685k5217k2242j9655j7267j5110j3387j2006j0615
60456E85499r188q168p823p766p317o208m696l293k459k410k965l616l894l650
60442E12046l125k781k950l458l743l443k707j774o65M47R82O19j4j0O24J076
60426D91124R11M45m7p11j460j733j251n26j90k29j77K66J050J899K392K231J600
60409D95594R80N56J79p9P9N13O17K15r9P7K81r2q27j192q77j56N98J181J532
60390D99080J762J976J889J121P8j52P87J864K011J550J457J782J789J425J459
60375E19878K164K858K960K690K444K194J883J721J742J533Q77J49j82j02J81
60360E42990N62Q21N90Kj70N15J404J645J508J975L138L950L787L400L822M972
$$ plain form
60344 574911 580926 587547 594586 601756 608240 613244 616767 619291 620793 620670 618654 615130 610382 604180
60330 604180 596565 588535 581363 575448 570368 565814 561944 558918 556702 555324 554765 554545 554026 553295 553136
60315 553136 553891 554920 555626 556456 558288 561161 564308 567413 571171 576482 583528 591984 601922 614332 630628
60300 630628 651486 675859 701243 725136 746263 764285 778616 788091 791819 789882 783049 772280
60288 772280 758773 744057 729444 715422 701868 688719 676077 663801 651493 639052 626933
60277 626933 615665 605338 595706 586639 578317 571090 565239 560702 556919 553096 548853 544512 540623 537312
60263 537312 534306 531451 528977 527284 526660 527059 527905 528245 527487 526056 524997 524854 525253 525660 526110 526927 528107
60246 528107 529432 530996 533139 535767 538057 539043 538470 537101 536139 536243 537019 537609 537760 538013 538743 539505 539782
$$ packed form
60344E74911O015O621P039P170O484N004L523K524J502j23k016l524m748o202
60330F04180p615q030p172n915n080m554l870l026k216j378n59k20n19p31j59
60315E53136P55J029P06Q30J832K873L147L105L758N311P046Q456R938J2410J6296
60300F30628K0858K4373K5384K3893K1127J8022J4331R475L728j937o833j0769
60288G72280j3507j4716j4613j4022j3554j3149j2642j2276j2308j2441j2119
60277F26933j1268j0327r632r067q322p227n851m537l783l823m243m341l889l311
60263E37312l006k855k474j693o24L99Q46L40p58j431j059j43L99M07M50Q17J180
60246E28107J325J564K143K628K290R86n73j369r62J04P76N90J51K53P30P62K77
$$ plain form
60229 539782 540023 541346 544233 548051 551914 555522 559009 562408 565527 568076 569759 570537 571010 572228 574826
60214 574826 578512 582541 586490 590398 594438 598769 603555 608800 614216 619499 624593 629505 634010 637892
60200 637892 641378 644929 648554 651677 653849 655288 656490 657479 657709 656746 654845 652777 651091 649595 647565
60185 647565 644426 640225 635503 630904 626953 623954 621783 619762 617022 613220 608848 604785 601571 599157
60171 599157 597250 595760 594868 594684 594931 595078 594816 594300 593799 593259 592425 591375 590630 590596 591077 591504 591514 591202
60153 591202 590952 591234 592466 594822 598159 602177 606622 611249 615805 620239 624812 629793 635119 640599 646231
60138 646231 651968 657311 661693 665312 669040 673341 677800 681998 686253 690948 695486 698549 699251 697637
60124 697637 694354 690473 687401 686095 686117 686072 685173 683916 683095 682838 682988 683853 685930 689174 693001 696878
$$ packed form
60229E39782K41J323K887L818L863L608L487L399L119K549J683P78M73J218K598
60214E74826L686M029L949L908M040M331M786N245N416N283N094M912M505L882
60200F37892L486L551L625L123K172J439J202R89K30r63j901k068j686j496k030
60185F47565l139m201m722m599l951k999k171k021k740l802m372m063l214k414
60171E99157j907j490q92j84K47J47k62n16n01n40q34j050p45l4M81M27J0l12
60153E91202k50K82J232K356L337M018M445M627M556M434M573M981N326N480N632
60138F46231N737N343M382L619L728M301M459M198M255M695M538L063P02j614
60124F97637l283l881l072j306K2m5q99j257q21k57J50Q65K077L244L827L877
$$ plain form
60108 696878 700470 703328 704966 705354 705011 704409 703442 701584 698511 694477 690097 685803 681651 677679 674239
60093 674239 671702 669953 668546 667375 666860 667409 669088 671850 675660 680206 684976 689869 695360 701675 708114
60078 708114 713603 717651 720421 722096 722588 721723 719273 714912 708461 700249 691065 681837 673386 666088 659540
60063 659540 652909 645972 639463 633953 628799 622853 616003 609238 603231 597528 591344 584608 577946 572039
60049 572039 567266 563785 561732 561271 562347 564327 566269 567924 570184 573989 578935 583541 586877 589357
60035 589357 591880 594774 597727 600270 602007 602723 602425 601100 598485 594477 589723 585185 580973 576159 569991
60020 569991 562823 555537 548541 541718 535062 528871 523451 518816 514604 510197 505270 500330 496416 494024
60006 494024 492627 491403 490128 489103 488602 488772 489866 492156 495626 499951 504707 509492 514012 518237 522339
$$ packed form
60108F96878L592K858J638L88l43o02r67j858l073m034m380m294m152l972l440
60093F74239k537j749j407j171n15N49J679K762L810M546M770M893N491O315O439
60078G08114N489M048K770J675M92q65k450m361o451q212r184r228q451p298o548
60063F59540o631o937o509n510n154n946o850o765o007n703o184o736o662n907
60049E72039m773l481k053m61J076J980J942J655K260L805M946M606L336K480
60035E89357K523K894K953K543J737P16k98j325k615m008m754m538m212m814o168
60020E69991p168p286o996o823o656o191n420m635m212m407m927m940l914k392
60006D94024j397j224j275j025n01J70J094K290L470M325M756M785M520M225M102
$$ plain form
59991 522339 526402 530333 534102 537822 541522 545103 548596 552155 555686 558846 561558 564108 566480 568036
59977 568036 568310 567816 567563 567900 568271 568077 567277 566060 564375 562115 559620 557651 556711 556518 556317 555750 555221
59960 555221 555317 556073 557026 557783 558189 558112 557461 556448 555444 554574 553737 552990 552558 552519 552897 553927 555670 557407
59942 557407 558103 557636 556906 556521 556041 554880 553269 551855 550818 549845 548573 546686 544132 541698 540813 542068
59926 542068 544300 545780 546023 545826 545882 546192 546701 547654 549097 550599 551708 552365 552814 553390 554385 555804 557226
59909 557226 558169 558634 559051 559828 561104 562757 564381 565479 566059 566846 568553 571130 574116 577465 581516 586285
59893 586285 591342 596362 601298 606024 610308 614223 618123 622143 626135 630155 634620 639737 645120 650126
59879 650126 654471 658416 662527 667237 672511 677952 683286 688435 692862 695190 694068 689379 682263 674015
$$ packed form
59991E22339M063L931L769L720L700L581L493L559L531L160K712K550K372J556
59977E68036K74m94k53L37L71j94q00j217j685k260k495j969r40j93k01n67n29
59960E55221R6P56R53P57M06p7o51j013j004q70q37p47m32l9L78J030J743J737
59942E57407O96m67p30l85m80j161j611j414j037r73j272j887k554k434q85J255
59926E42068K232J480K43j97N6L10N09R53J443J502J109O57M49N76R95J419J422
59909E57226R43M65M17P77J276J653J624J098N80P87J707K577K986L349M051M769
59893E86285N057N020M936M726M284L915L900M020L992M020M465N117N383N006
59879F50126M345L945M111M710N274N441N334N149M427K328j122m689p116q248
$$ plain form
59865 674015 665423 656963 648980 641510 634424 627975 622804 619185 616619 614362 612118 610033 608359 607362
59851 607362 607357 608530 610819 614129 618595 624548 632300 642035 653802 667463 682472 697625 711177 721568
59837 721568 728256 731796 733158 733352 733734 735887 740427 746060 750359 751524 749139 743522 735049 724215
59823 724215 711784 698585 685309 672449 660174 648257 636444 624870 613929 603867 594813 587032
59811 587032 580670 575346 570473 565933 562042 558909 556303 554100 552358 550970 549778 549018 549018 549379 549055 547437
59795 547437 544893 542115 539500 537279 535537 533789 531205 527697 524218 521559 519360 516877 514247 512330
59781 512330 511490 511180 510639 509498 507744 505562 503281 501112 498965 496788 495047 494460 495235 496829 498517
59766 498517 499946 501162 502396 504008 506345 509408 512712 515651 518041 520231 522736 525843 529491 533326
$$ packed form
59865F74015q592q460p983p470p086o449n171l619k566k257k244k085j674r97
59851F07362nJ173K289L310M466N953P752R735J1767J3661J5009J5153J3552J0391
59837G21568O688L540J362J94L82K153M540N633M299J165k385n617q473j0834
59823G24215j2431j3199j3276j2860j2275j1917j1813j1574j0941j0062r054p781
59811E87032o362n324m873m540l891l133k606k203j742j388j192p60%L61l24j618
59795E47437k544k778k615k221j742j748k584l508l479k659k199k483k630j917
59781E12330q40l10n41j141j754k182k281k169k147k177j741n87P75J594J688
59766D98517J429J216J234J612K337L063L304K939K390K190K505L107L648L835
$$ plain form
59752 533326 536804 539474 541433 543421 546171 549602 552943 555710 558251 561145 564407 567583 570287 572329
59738 572329 573505 573788 573666 573874 574765 576149 577637 578833 579332 579003 578309 577962 578212 578747 579249 579710 580226
59721 580226 580807 581433 581954 582014 581368 580278 579269 578586 578220 578303 578930 579658 579773 579168 578470 578220 578439 579121 580604
59702 580604 583138 586404 589648 592125 593512 594290 595614 598247 601600 604359 606023 607153 608132 608570 608200
59687 608200 607463 606728 605665 604047 602516 601939 602375 603327 604596 606207 607739 608374 607608 605512 602439 598772
59671 598772 594883 591010 587275 583898 581019 578249 574892 570925 567229 564508 562524 560854 559742 559576
59657 559576 560054 560721 561959 564579 568577 573104 577598 582178 586921 591489 595584 599099 601677 602764 602338
59642 602338 601045 599327 596862 593112 588125 582530 577040 572168 568225 565313 563327 561970 560760 559252
$$ packed form
59752E33326L478K670J959J988K750L431L341K767K541K894L262L176K704K042
59738E72329J176K83j22K08Q91J384J488J196M99l29o94l47K50N35N02M61N16
59721E80226N81O26N21O0o46j090j009o83l66Q3O27P28J15o05o98k50K19O82J483
59702E80604K534L266L244K477J387P78J324K633L353K759J664J130R79M38l70
59687F08200p37p35j063j618j531n77M36R52J269J611J532O35p66k096l073l667
59671E98772l889l873l735l377k879k770l357l967l696k721j984j670j112j66
59657E59576M78O67J238K620L998M527M494M580M743M568M095L515K578J087m26
59642F02338j293j718k465l750m987n595n490m872l943k912j986j357j210j508
$$ plain form
59628 559252 557523 556203 555636 555195 553966 552008 550310 549391 548675 547578 546539 546302 546595 546306 544903 543007
59612 543007 541391 540011 538412 536668 535375 534802 534619 534623 535255 537023 539650 542251 544278 545800 546829 546917
59596 546917 545752 543853 542217 541341 540895 540333 539562 538916 538624 538487 538132 537509 536996 536885 536870 536244 534632 532413
59578 532413 530361 528971 528084 527061 525401 523310 521498 520308 519337 518205 517322 517302 517842 517933 517192 516249 515690
59561 515690 515363 514992 514739 514773 514917 515165 515938 517297 518489 518906 519029 519751 521155 522678 524240 526419 529509
59544 529509 533051 536435 539580 543021 547643 554277 563345 575076 590199 609761 633423 658003 678493
59531 678493 690916 694294 690377 682191 672744 664177 657389 652376 648979 647343 647850 650775 655868 662122
59517 662122 668195 673250 677160 679773 680429 678508 674069 667579 659413 649994 639963 629718 619167 608454
$$ packed form
59628E59252j729j320n67m41j229j958j698r19p16j097j039k37K93k89j403j896
59612E43007j616j380j599j744j293n73j83MO32J768K627K601K027J522J029Q8
59596E46917j165j899j636q76m46n62p71o46k92j37l55o23n13j11j5o26j612k219
59578E32413k052j390q87j023j660k091j812j190r71j132q83k0N40R1p41r43n59
59561E15690l27l71k53L4J44K48P73J359J192M17J23P22J404J523J562K179L090
59544E29509L542L384L145L441M622O634R068J1731J5123J9562K3662K4580K0490
59531F78493J2423L378l917q186r447q567o788n013l397j636N07K925N093O254
59517F62122O073N055L910K613O56j921m439o490q166r419j0031j0245j0551j0713
$$ plain form
59503 608454 598446 589864 582352 575157 568291 562201 556691 551197 545944 541760 538695 535835 532654 529666
59489 529666 527557 526505 526537 527687 529439 530893 531884 533260 535621 538446 540940 543093 545356 547816 550297
59474 550297 552930 556047 559678 563538 567304 570653 573297 575226 576671 577728 578423 579311 581399 585005 589159
59459 589159 592666 595531 598866 603640 609981 617599 626377 636460 648011 660848 674208 686958 698253
59446 698253 707930 716212 723202 728701 732207 732920 730078 723651 714569 704045 692778 681011 669159
59433 669159 658052 648500 640734 634314 628531 623042 618180 614634 612875 613001 614979 618780 624325 631637
59419 631637 641105 653273 668270 685664 704873 725557 747808 772353 800311 831744 863879 891229
59407 891229 908283 912491 905055 889469 869547 848221 827464 809133 795777 790038 792479 799906
$$ packed form
59503F08454j0008q582p512p195o866o090n510n494n253m184l065k860l181k988
59489E29666k109j052L2J150J752J454R91J376K361K825K494K153K263K460K481
59474E50297K633L117L631L860L766L349K644J929J445J057O95Q88K088L606M154
59459E89159L507K865L335M774O341P618Q778J0083J1551J2837J3360J2750J1295
59446F98253R677Q282O990N499L506P13k842o427r082j0524j1267j1767j1852
59433F69159j1107r552p766o420n783n489m862l546j759J26J978L801N545P312
59419F31637R468J2168J4997J7394J9209K0684K2251K4545K7958L1433L2135K7350
59407H91229J7054M208p436j5586j9922k1326k0757j8331j3356n739K441P427
$$ plain form
59395 799906 806332 806160 796925 779536 756519 730300 702852 676141 652021 631470 614364 600282
59383 600282 589186 580951 574700 569323 564545 560885 558610 557414 557091 557744 559059 560134 560454 560598 561590
59368 561590 563939 567585 572321 577776 583298 588314 592709 596650 600259 603679 607196 611089 615617 621290
59354 621290 628778 638319 649521 662002 675885 691404 708375 726361 745118 764619 784911 806096
59342 806096 828070 850065 870948 890285 908635 926293 942120 954248 961768 965201 965460 962924
59330 962924 957582 949582 939411 927668 914727 900616 885280 869001 852340 835715 819359 803716
59318 803716 789387 776473 764480 753140 742850 733937 726075 718869 712445 706855 701487 695946 691192
59305 691192 688733 688702 689643 690380 691273 693413 697352 703093 710759 720806 733933 751150 773288 799579
$$ packed form
59395G99906O426j72r235j7389k3017k6219k7448k6711k4120k0551j7106j4082
59383F00282j1096q235o251n377m778l660k275j196l23O53J315J075L20J44R92
59368E61590K349L646M736N455N522N016M395L941L609L420L517L893M528N673
59354F21290P488R541J1202J2481J3883J5519J6971J7986J8757J9501K0292K1185
59342H06096K1974K1995K0883J9337J8350J7658J5827J2128P520L433K59k536
59330I62924n342q000j0171j1743j2941j4111j5336j6279j6661j6625j6356j5643
59318H03716j4329j2914j1993j1340j0290q913p862p206o424n590n368n541m754
59305F91192k459l1R41P37Q93K140L939N741P666J0047J3127J7217K2138K6291
$$ plain form
59291 799579 826668 849621 864371 869411 865605 854991 839899 822615 805150 788956 774835 763124
59279 763124 753928 747230 743023 741525 743069 747577 754246 762119 770949 781148 792763 804918 816604
59266 816604 827705 838761 849762 859610 866952 871273 872883 872015 868307 861360 851505 839635 826387
59253 826387 811886 796418 780776 765606 750833 736247 722444 710511 700892 693135 686786 681905
59241 681905 678652 676943 676706 677938 680390 683699 687988 693699 700549 707287 712889 717504 721737 725434
59227 725434 727690 727803 725755 721958 716889 710847 703802 695608 686467 676903 667228 657454 647894 639283
59213 639283 632030 625827 620307 615538 611552 607900 604196 600653 597707 595523 594215 593972 594505 594993 595137
59198 595137 595650 597097 598900 600321 601799 604315 607864 611643 615535 620326 626394 633112 639658 645679
$$ packed form
59291G99579K7089K2953J4750N040l806j0614j5092j7284j7465j6194j4121j1711
59279G63124r196o698m207j498J544M508O669P873Q830J0199J1615J2155J1686
59266H16604J1101J1056J1001R848P342M321J610q68l708o947r855j1870j3248
59253H26387j4501j5468j5642j5170j4773j4586j3803j1933r619p757o349m881
59241F81905l253j709k37J232K452L309M289N711O850O738N602M615M233L697
59227G25434K256J13k048l797n069o042p045q194r141r564r675r774r560q611
59213F39283p253o203n520m769l986l652l704l543k946k184j308k43N33M88J44
59198E95137N13J447J803J421J478K516L549L779L892M791O068O718O546O021
$$ plain form
59184 645679 651130 656182 661383 667214 673429 679367 684845 690137 695232 699934 704561 709715 715318 720802
59170 720802 726313 732797 740651 749196 757821 766821 776642 787039 797438 807518 816935 825049 831407
59157 831407 836074 839060 839833 837840 833167 826330 817754 807772 796810 785337 773903 763291 754108
59144 754108 746024 738009 729646 721651 714691 708387 702067 695975 690964 687253 684206 681266 678513 676323
59130 676323 674974 674581 675000 675797 676681 677947 680150 683359 687167 691500 696927 703894 711898 719866 727377
59115 727377 735223 744473 755070 765724 775314 784051 792852 801837 810048 816660 821848 826188 829791 832439
59101 832439 834199 835319 835623 834467 831381 826540 820616 814339 808133 802022 795948 790255 785638 782400
59087 782400 779872 776905 772895 768205 763602 759507 755708 751503 746072 738984 730599 721934 713940 706834
$$ packed form
59184F45679N451N052N201N831O215N938N478N292N095M702M627N154N603N484
59170G20802N511O484P854Q545Q625R000R821J0397J0399J0080R417Q114O358
59157H31407M667K986P73j993m673o837q576r982j0962j1473j1434j0612r183
59144G54108q084q015q363p995o960o304o320o092n011l711l047k940k753k190
59130F76323j349l93M19P97Q84J266K203L209L808M333N427O967Q004P968P511
59115G27377P846R250J0597J0654R590Q737Q801Q985Q211O612N188M340L603K648
59101H32439J760J120L04j156l086m841n924o277o206o111o074n693m617l238
59087G82400k528k967m010m690m603m095l799m205n431p088q385q665p994p106
$$ plain form
59073 706834 700100 693115 685690 678091 670745 664074 658465 654122 650865 648240 645880 643668 641585 639671
59059 639671 638115 637075 636292 635185 633501 631511 629413 626992 624285 622091 621211 621369 621491 620994 620215 619621
59043 619621 619188 618711 618190 617732 617410 617345 617586 617868 617851 617704 618107 619541 621880 624705 627629 630260 632343
59026 632343 634197 636678 640490 645728 652146 659526 667634 676166 684931 693869 702744 711046 718270 724050
59012 724050 728006 729810 729537 727684 724838 721563 718507 716156 714458 713229 712966 714577 718110 722462 726803
58997 726803 731711 738275 746525 755353 763760 771512 778677 785188 790982 796064 800158 802596 802796 800777
58983 800777 797068 792192 786361 779707 772699 766162 760841 757038 754759 754020 754772 756723 759600 763585 769180
58968 769180 776557 785335 795050 805575 817038 829584 843261 857875 872820 887230 900366 911750
$$ packed form
59073G06834o734o985p425p599p346o671n609m343l257k625k360k212k083j914
59059F39671j556j040p83j107j684j990k098k421k707k194q80J58J22m97p79n94
59043F19621m33m77n21m58l22o5K41K82j7j47M03J434K339K825K924K631K083
59026F32343J854K481L812N238O418P380Q108Q532Q765Q938Q875Q302P224N780
59012G24050L956J804k73j853k846l275l056k351j698j229k63J611L533M352M341
58997G26803M908O564Q250Q828Q407P752P165O511N794N082M094K438K00k019
58983H00777l709m876n831o654p008o537n321l803k279p39P52J951K877L985N595
58968G69180P377Q778R715J0525J1463J2546J3677J4614J4945J4410J3136J1384
$$ plain form
58956 911750 921039 927951 932216 933357 930712 924045 913954 901312 886529 869881 852263 834799 817752
58943 817752 800687 783857 768575 755809 745132 735499 726512 718457 711604 705996 701560 697985 694740
58930 694740 691551 688568 685813 682921 679737 676718 674386 672729 671480 670534 669717 668615 667135 665858 665368
58915 665368 665489 665583 665267 664467 663225 662027 661922 663660 666917 670932 675711 681976 690058 699465 709644
58900 709644 720645 732890 746554 761208 775899 789699 802456 814911 827911 841725 856391
58889 856391 872458 891004 913015 938892 968256 999809 1031616 1061939 1089794 1114623 1135797
58878 1135797 1152724 1165067 1172478 1174402 1170575 1161464 1147802 1130006 1108419 1083908 1057784 1031340
58866 1031340 1005771 982075 960584 940946 923028 907346 894030 881904 869452 856361 843287
$$ packed form
58956I11750R289O912M265J141k645o667j0091j2642j4783j6648j7618j7464j7047
58943H17752j7065j6830j5282j2766j0677r633q987q055o853n608m436l575l245
58930F94740l189k983k755k892l184l019k332j657j249r46q17j102j480j277m90
58915F65368J21R4l16q00j242j198j05J738L257M015M779O265Q082R407J0179
58900G09644J1001J2245J3664J4654J4691J3800J2757J2455J3000J3814J4666
58889H56391J6067J8546K2011K5877K9364L1553L1807L0323K7855K4829K1174
58878A135797J6927J2343P411J924l827r111j3662j7796k1587k4511k6124k6444
58866A031340k5569k3696k1491j9638j7918j5682j3316j2126j2452j3091j3074
$$ plain form
58855 843287 830438 817458 804573 792689 782143 772340 762899 754209 746440 738834 730620 722019 713770
58842 713770 706126 698919 692227 686295 680964 675663 670027 664165 658425 653162 648644 644804 641036 636494
58828 636494 630849 624735 619370 615668 613655 612700 612233 612123 612415 613021 613851 615010 616650 618791 621520 625077
58812 625077 629428 633972 638065 641724 645407 649231 652861 656071 658832 660783 661234 660041 658031 656162
58798 656162 654434 652047 648579 644590 640910 637563 633817 629347 625012 622070 620784 620354 620231 620866 622803
58783 622803 625653 628582 631508 635144 639983 645827 652261 658954 665309 670410 673640 675105 675209 673996
58769 673996 671070 666050 659003 650487 641231 631766 622426 613618 605849 599362 594028 589752 586702 584985
58755 584985 584426 584928 586661 589563 592968 596187 599160 602113 604942 607478 610102 613449 617624 622249 627235
$$ packed form
58855H43287j2849j2980j2885j1884j0546r803r441q690p769p606q214q601q249
58842G13770p644p207o692n932n331n301n636n862n740n263m518l840l768m542
58828F36494n645o114n365l702k013r55m67j10K92O06Q30J159J640K141K729L557
58812F25077M351M544M093L659L683L824L630L210K761J951M51j193k010j869
58798F56162j728k387l468l989l680l347l746m470m335k942j286m30j23O35J937
58783F22803K850K929K926L636M839N844O434O693O355N101L230J465J04j213
58769F73996k926n020p047q516r256r465r340q808p769o487n334m276l050j717
58755E84985n59N02J733K902L405L219K973K953K829K536K624L347M175M625M986
$$ plain form
58740 627235 632928 639519 646786 654383 661917 668891 675165 681358 688254 695775 703113 709824 716186 722477
58726 722477 728595 734492 740358 746125 751310 755616 759269 762610 765841 769356 773830 779645 786503 793821
58712 793821 801254 808723 816253 823805 830961 836708 839995 840650 839370 836692 832319 825604 816307 804651
58698 804651 790939 775317 757869 738911 719304 700297 682739 666598 651514 637639 625479
58687 625479 615208 606660 599743 594175 588932 582776 575455 567810 560767 554853 550520 547920 546204 544016
58673 544016 541016 538145 536201 535134 535116 537197 542097 549150 557221 566070 576028 586948 598284 609707
58659 609707 620701 629909 635913 638642 639225 638506 636414 632812 628152 623089 618028 613273 609110 605485
58645 605485 601898 597921 593666 589598 586098 583264 581019 579246 577888 576932 576321 575994 576086 576934 578732 581232
$$ packed form
58740F27235N693O591P267P597P534O974O274O193O896P521P338O711O362O291
58726G22477O118N897N866N767N185M306L653L341L231L515M474N815O858P318
58712G93821P433P469P530P552P156N747L287O55j280k678m373o715r297j1656
58698H04651j3712j5622j7448j8958j9607j9007j7558j6141j5084j3875j2160
58687F25479j0271q548o917n568n243o156p321p645p043n914m333k600j716k188
58673E44016l000k871j944j067j8K081M900P053Q071Q849R958J0920J1336J1423
58659F09707J0994R208O004K729N83p19k092l602m660n063n061m755m163l625
58645F05485l587l977m255m068l500k834k245j773j358r56o11l27R2Q48J798K500
$$ plain form
58629 581232 583970 586699 589448 592082 593967 594272 592765 590307 588386 588059 589477 592413 596807 602433 608594
58614 608594 614945 622461 632677 645686 659538 671972 682149 690325 696429 699776 700025 697820 694318
58601 694318 690284 685710 680264 674164 668448 663978 660216 655521 648998 641644 635373 631213 628883 627835
58587 627835 628135 630310 634741 641434 650223 660982 673470 687005 700526 713225 724948 735735 745142
58574 745142 752504 757808 761848 765460 769062 772963 777614 783374 790457 799312 810582 824457 840410
58561 840410 857838 876604 896741 917929 939477 960455 979614 995498 1007027 1013973 1016843 1016524
58549 1016524 1013991 1009967 1004626 997900 990110 982071 974542 967788 961560 955088 947210 937015 924432
58536 924432 909907 893782 876481 858995 842337 826637 811622 797859 786465 777496 769793 762686
$$ packed form
58629E81232K738K729K749K634J885L05j507k458j921l27J418K936M394N626O161
58614F08594O351P516J0216J3009J3852J2434J0177Q176O104L347K49k205l502
58601F94318m034m574n446o100n716m470l762m695o523p354o271m160k330j048
58587F27835L00K175M431O693Q789J0759J2488J3535J3521J2699J1723J0787R407
58574G45142P362N304M040L612L602L901M651N760P083Q855J1270J3875J5953
58561H40410J7428J8766K0137K1188K1548K0978J9159J5884J1529O946K870l19
58549A016524k533m024n341o726p790q039p529o754o228o472p878j0195j2583
58536I24432j4525j6125j7301j7486j6658j5700j5015j3763j1394q969p703p107
$$ plain form
58524 762686 756791 752718 750125 748665 748755 750622 753462 756425 759720 763910 768804 773893 779234 784944 790314
58509 790314 794411 797231 799447 801354 802883 804218 805485 806033 804963 802313 798999 795649 792136 788133
58495 788133 783489 778119 772089 765786 759621 753735 748417 744396 742104 740937 739895 738818 738415 739321 741768
58480 741768 746042 752519 761239 771864 784048 797408 811266 824779 837171 847531 854789 858421
58468 858421 858869 856787 852189 845006 836172 827384 819786 813459 808108 803704 800447 798618 798564 800561 804659
58453 804659 810745 818495 827108 835532 843216 850214 856202 859968 860459 857971 853808 849077 844183 839060
58439 839060 833418 827191 821144 816600 814193 813420 813742 815276 817914 820737 823183 825987 830064 835205 840910
58424 840910 847783 856783 867555 878722 889505 899926 909679 918031 924645 929400 931666 930925 928075
$$ packed form
58524G62686n895m073k593j460R0J867K840K963L295M190M894N089N341N710N370
58509G90314M097K820K216J907J529J335J267N48j070k650l314l350l513m003
58495G88133m644n370o030o303o165n886n318m021k292j167j042j077m03R06K447
58480G41768M274O477Q720J0625J2184J3360J3858J3513J2392J0360P258L632
58468H58421M48k082m598p183q834q788p598o327n351m404l257j829n4J997M098
58453H04659O086P750Q613Q424P684O998N988L766M91k488m163m731m894n123
58439H39060n642o227o047m544k407p73L22J534K638K823K446K804M077N141N705
58424H40910O873R000J0772J1167J0783J0421R753Q352O614M755K266p41k850
$$ plain form
58411 928075 924900 922155 919152 915156 910150 904243 897452 890267 883492 877332 871441 865931 861461 858250
58397 858250 855835 853986 853106 853605 855481 858507 862225 865830 868665 870780 872498 873809 874771 875954 877608
58382 877608 878966 879410 879853 881678 884611 887003 888118 888825 890103 892151 895049 898971 903533 908081 912928
58367 912928 919273 927689 937609 948404 959960 972068 984293 996724 1009981 1024283 1039211 1054416
58355 1054416 1069696 1084398 1097533 1108513 1117167 1123420 1127719 1131304 1135035 1138476 1141223 1144448 1149632
58342 1149632 1156372 1163098 1169582 1176963 1185648 1195136 1205853 1219101 1235002 1252343 1270653 1290519
58330 1290519 1311516 1331767 1350048 1366671 1381961 1395585 1407773 1419284 1429662 1437379 1442243 1445880
58318 1445880 1449312 1452013 1453993 1456794 1461500 1467550 1474387 1482536 1492147 1502208 1512229 1523079 1535259
$$ packed form
58411I28075l175k745l003l996n006n907o791p185o775o160n891n510m470l211
58397H58250k415j849q80M99J876L026L718L605K835K115J718J311R62J183J654
58382H77608J358M44M43J825K933K392J115P07J278K048K898L922M562M548M847
58367I12928O345Q416R920J0795J1556J2108J2225J2431J3257J4302J4928J5205
58355A054416J5280J4702J3135J0980Q654O253M299L585L731L441K747L225N184
58342A149632O740O726O484P381Q685R488J0717J3248J5901J7341J8310J9866
58330A290519K0997K0251J8281J6623J5290J3624J2188J1511J0378P717M864L637
58318A445880L432K701J980K801M706O050O837Q149R611J0061J0021J0850J2180
$$ plain form
58305 1535259 1548001 1560926 1574935 1590519 1606868 1623548 1641316 1660350 1679504 1698320 1717957
58294 1717957 1739005 1760260 1780895 1802056 1824908 1848832 1872953 1897842 1924246 1951728 1979987
58283 1979987 2010080 2042830 2077293 2112090 2147039 2182396 2217956 2253962 2291453 2330636 2370423
58272 2370423 2410454 2451853 2495159 2539550 2585151 2633856 2686570 2741868 2798881 2859247 2924528
58261 2924528 2993772 3065378 3139355 3215995 3294236 3373031 3452543 3532610 3612184 3691650 3773294
58250 3773294 3858059 3944435 4032102 4123699 4221164 4323485 4430189 4543825 4666449 4796803
58240 4796803 4933656 5078841 5234120 5398228 5570063 5751741 5945380 6150045 6365141
58231 6365141 6593546 6837944 7097387 7371133 7662561 7975557 8310500 8667744 9051380
$$ packed form
58305A535259J2742J2925J4009J5584J6349J6680J7768J9034J9154J8816J9637
58294A717957K1048K1255K0635K1161K2852K3924K4121K4889K6404K7482K8259
58283A979987L0093L2750L4463L4797L4949L5357L5560L6006L7491L9183L9787
58272B370423M0031M1399M3306M4391M5601M8705N2714N5298N7013O0366O5281
58261B924528O9244P1606P3977P6640P8241P8795P9512Q0067P9574P9466Q1644
58250C773294Q4765Q6376Q7667R1597R7465J02321J06704J13636J22624J30354
58240D796803J36853J45185J55279J64108J71835J81678J93639K04665K15096
58231F365141K28405K44398K59443K73746K91428L12996L34943L57244L83636
$$ plain form
58222 9051380 9465538 9910846 10388957 10906559 11470385 12082631 12746122 13469300 14260994
58213 14260994 15125521 16068933 17104924 18248708 19511340 20907356 22462207 24205483
58205 24205483 26164855 28375935 30891671 33775110 37094711 40939989 45434818 50728923
58197 50728923 56996201 64463141 73431380 84264694 97382425 113289315 132578378
58190 132578378 155865115 183733480 216692295 254854519 297116059 340294404 379228537
58183 379228537 408290764 423471341 423628888 410322526 386817966 357086299 325007518
58176 325007518 293636640 264663962 238419991 214441615 192155622 171248904 151685192
58169 151685192 133580515 117089807 102327461 89320861 78008444 68267936 59942459
$$ packed form
58222I051380M14158M45308M78111N17602N63826O12246O63491P23178P91694
58213A4260994Q64527R43412J035991J143784J262632J396016J554851J743276
58205B4205483J959372K211080K515736K883439L319601L845278M494829N294105
58197E0728923O267278P466940Q968239J0833314J3117731J5906890J9289063
58190A32578378K3286737K7868365L2958815L8162224M2261540M3178345L8934133
58183C79228537K9062227J5180577J57547j3306362k3504560k9731667l2078781
58176C25007518l1370878k8972678k6243971k3978376k2285993k0906718j9563712
58169A51685192j8104677j6490708j4762346j3006600j1312417r740508q325477
$$ plain form
58162 59942459 52855973 46829242 41696165 37311087 33548777 30304956 27496464 25056878
58154 25056878 22930625 21070171 19434623 17987996 16699412 15544704 14504948 13562457
58146 13562457 12700335 11906039 11172534 10495241 9870120 9294686 8767666 8286373 7846346
58137 7846346 7444096 7078061 6746187 6444189 6166433 5906939 5659773 5420572 5188271
58128 5188271 4964135 4749283 4544312 4350334 4168223 3997137 3835567 3683351 3540850
58119 3540850 3406844 3279345 3158044 3043871 2936670 2835471 2740536 2652729 2571093 2493411
58109 2493411 2419159 2349673 2285394 2225194 2168466 2115588 2065912 2017451 1969176 1921845 1876048
58098 1876048 1831134 1786634 1743186 1701442 1661295 1622620 1585673 1550449 1516719 1484802 1455272
$$ packed form
58162E9942459p086486o026731n133077m385078l762310l243821k808492k439586
58154B5056878k126253j860454j635548j446627j288584j154708j039756r42491
58146A3562457q62122p94296p33505o77293o25121n75434n27020m81293m40027
58137G846346m02250l66035l31874l01998k77756k59494k47166k39201k32301
58128E188271k24136k14852k04971j93978j82111j71086j61570j52216j42501
58119C540850j34006j27499j21301j14173j07201j01199r4935q7807q1636p7682
58109B493411p4252o9486o4279o0200n6728n2878m9676m8461m8275m7331m5797
58098A876048m4914m4500m3448m1744m0147l8675l6947l5224l3730l1917k9530
$$ plain form
58087 1455272 1427914 1402039 1377665 1355173 1333999 1312967 1291750 1270686 1249395 1227088 1204169
58076 1204169 1181935 1160637 1139319 1117679 1096598 1076640 1057465 1038967 1021566 1005050 988406
58065 988406 971257 954382 938544 923853 910464 898810 888822 879833 871400 863325 854936 845387 834704
58052 834704 823488 811620 798375 783867 769302 755766 743775 733846 726207 719910 713549 706965
58040 706965 701014 695648 689669 682632 675540 669156 662908 656045 648794 641695 634673 627291 619264 610391
58026 610391 600653 590615 581012 571839 562642 553710 546027 539864 534343 528662 522993 518018 514279 511943
58012 511943 510398 508187 504309 499580 495779 493596 492396 491735 491697 491856 491393 490536 490472 491472 492398 492413 491876
57995 491876 491123 489735 487636 485695 484554 483819 483022 482396 482147 481873 481262 480469 479385 477516 475058 473063
$$ packed form
58087A455272k7358k5875k4374k2492k1174k1032k1217k1064k1291k2307k2919
58076A204169k2234k1298k1318k1640k1081j9958j9175j8498j7401j6516j6644
58065I88406j7149j6875j5838j4691j3389j1654r988q989q433q075q389r549j0683
58052H34704j1216j1868j3245j4508j4565j3536j1991r929p639o297o361o584
58040G06965n951n366n979p037p092o384o248o863p251p099p022p382q027q873
58026F10391r738j0038r603r173r197q932p683o163n521n681n669m975l739k336
58012E11943j545k211l878m729l801k183j200o61l8J59m63q57o4J000R26J5n37
57995D91876p53j388k099j941j141p35p97o26k49k74o11p93j084j869k458j995
$$ plain form
57979 473063 471954 470842 468853 466223 463566 461070 458987 457911 457849 457916 457630 457646 458595 460131 461834 464093
57963 464093 467248 470606 473219 475025 476508 477845 479121 480759 482887 484756 485398 484458 481948 477847 472581
57948 472581 467231 462607 458550 454632 450924 447586 444424 441433 439157 437923 437315 437034 437637 439826 443574
57933 443574 448531 454617 461587 468662 475291 481699 488018 493505 497434 500198 502714 505081 506561 506614 505333
57918 505333 503111 500370 497320 493653 488870 483135 477195 471238 464653 457385 450590 445264 441029 436960
57904 436960 432830 428720 424166 418661 412452 406004 399223 392016 385019 378857 373115 366965 360417 354143
57890 354143 348509 343565 339516 336363 333487 330416 327620 325767 324674 323813 323318 323529 324011 324052 323763 323649
57874 323649 323445 322419 320599 318650 316737 314506 312119 310254 309115 308260 307371 306362 304886 302591 299777
$$ packed form
57979D73063j109j112j989k630k657k496k083j076o2O7k86J6R49J536J703K259
57963D64093L155L358K613J806J483J337J276J638K128J869O42r40k510m101n266
57948D72581n350m624m057l918l708l338l162k991k276j234o08k81O03K189L748
57933D43574M957O086O970P075O629O408O319N487L929K764K516K367J480N3j281
57918E05333k222k741l050l667m783n735n940n957o585p268o795n326m235m069
57904D36960m130m110m554n505o209o448o781p207o997o162n742o150o548o274
57890C54143n634m944m049l153k876l071k796j853j093q61m95K11M82M1k89j14
57874C23649k04j026j820j949j913k231k387j865j139q55q89j009j476k295k814
$$ plain form
57859 299777 297081 294715 292881 292561 294777 299125 304143 309134 314590 320830 327411 334128 341449 349480
57845 349480 357425 364558 371079 377477 383667 389162 393648 396992 399058 399860 399671 398800 397455 395831 394044
57830 394044 392006 389648 387180 384887 382867 381261 380384 380176 379874 378778 377041 375162 373166 371038 369519
57815 369519 369457 370557 371729 372561 373515 374687 375408 375167 373987 371687 367636 361588 354076 345835 337416 329441
57799 329441 322504 316670 311711 307837 305424 304043 302687 301129 300124 300009 300116 299981 300290 301954 304826
57784 304826 307894 310309 311820 312618 313147 313747 314352 314876 315828 317824 320426 322295 322892 323230 324498 326662
57768 326662 329011 331453 334446 337901 340862 342286 341803 339782 336921 333711 330157 325985 321052 315338
57754 315338 308813 301707 294763 288623 283055 277412 271876 267503 264861 263357 262171 261222 260878 261258 262190
$$ packed form
57859B99777k696k366j834l20K216M348N018M991N456O240O581O717P321Q031
57845C49480P945P133O521O398O190N495M486L344K066Q02j89q71j345j624j787
57830C94044k038k358k468k293k020j606q77k08l02j096j737j879j996k128j519
57815C69519o2J100J172Q32R54J172P21k41j180k300m051o048p512q241q419p975
57799C29441o937n834m959l874k413j381j356j558j005j15J07j35L09J664K872
57784C04826L068K415J511P98N29O00O05N24R52J996K602J869N97L38J268K164
57768C26662K349K442K993L455K961J424m83k021k861l210l554m172m933n714
57754C15338o525p106o944o140n568n643n536m373k642j504j186r49l44L80R32
$$ plain form
57739 262190 263391 264436 265037 265584 266821 268657 269922 269707 268430 267115 266100 265087 264077 263540 263671
57724 263671 264037 264082 263790 263721 264502 266258 268549 270828 272752 273999 274174 273320 272162 271300 270391 268743 266493
57707 266493 264439 262808 261039 258826 256531 254399 252230 250014 248138 246697 245361 244186 243709 243906 243868
57692 243868 242941 241497 240153 238999 238049 237612 237622 237327 236428 235903 236953 239569 242891 246579 251102 256983
57676 256983 264475 273867 285613 300379 319389 344394 376823 417268 466357 525724 597009 679105
57664 679105 765961 846842 909276 943527 946117 920067 872096 809657 739816 668971 601997 541504
57652 541504 488389 442920 405062 374303 349800 330542 315108 301849 289930 279811 272130 266406
57640 266406 261437 256663 252503 249551 247997 247672 248038 248235 247691 246735 246234 246631 247534 248087 247533 245686 243157
$$ packed form
57739B62190J201J045O01N47J237J836J265k15j277j315j015j013j010n37J31
57724B63671L66M5k92o9P81J756K291K279J924J247J75q54j158q62r09j648k250
57707B66493k054j631j769k213k295k132k169k216j876j441j336j175m77J97l8
57692B43868r27j444j344j154r50m37J0k95q99n25J050K616L322L688M523N881
57676B56983P492R392J1746J4766J9010K5005L2429M0445M9089N9367P1285Q2096
57664F79105Q6856Q0881O2434L4251K590k6050m7971o2439o9841p0845o6974o0493
57652E41504n3115m5469l7858l0759k4503j9258j5434j3259j1919j0119p681n724
57640B66406m969m774m160k952j554l25L66J97n44r56n01L97R03N53n54j847k529
$$ plain form
57623 243157 240878 239179 237651 236043 234703 233762 232574 230653 228674 227775 228115 228804 229117 229139 229345 230072
57607 230072 231267 232307 232342 231321 230407 230741 231997 232744 232073 230240 227924 225611 223678 222293 221000 218976
57591 218976 215964 212578 209540 206933 204326 201392 198267 195455 193384 191978 190768 189456 188120 186777
57577 186777 185122 182969 180538 178100 175723 173656 172378 171806 170979 169151 166798 164872 163436 161795 159744
57562 159744 157890 156788 156436 156606 157080 157545 157769 157946 158463 159409 160659 162243 164236 166496 168943 171812
57546 171812 175142 178325 180733 182458 183822 184547 184217 183295 182774 182964 183467 184234 185627 187392 188564 188670
57530 188670 188172 187404 185930 183413 180476 178158 176925 176560 176642 176803 176841 176887 177235 177836 178294 178453 178631 179162
57512 179162 180034 181129 182432 183853 185116 186000 186453 186473 186088 185442 184593 183300 181371 179152 177222 175630
$$ packed form
57623B43157k279j699j528j608j340r41j188j921j979q99L40O89L13K2K06P27
57607B30072J195J040L5j021r14L34J256P47o71j833k316k313j933j385j293k024
57591B18976l012l386l038k607k607k934l125k812k071j406j210j312j336j343
57577A86777j655k153k431k438k377k067j278n72q27j828k353j926j436j641k051
57562A59744j854j102l52J70M74M65K24J77N17R46J250J584J993K260K447K869
57546A71812L330L183K408J725J364P25l30r22n21J90N03P67J393J765J172J06
57530A88670m98p68j474k517k937k318j233l65Q2J61L8M6L48O01M58J59J78N31
57512A79162Q72J095J303J421J263Q84M53K0l85o46q49j293j929k219j930j592
$$ plain form
57496 175630 173869 171628 169155 166857 164913 163308 161868 160283 158488 156973 156291 156314 156395 156212 155926 155540
57480 155540 154710 153290 151582 149968 148710 148058 148033 148086 147563 146569 145801 145514 145263 144778 144391 144373 144546 144870
57462 144870 145732 147180 148404 148604 148045 147680 147897 148152 147915 147563 148077 149887 152266 153990 154548 154383 153965
57445 153965 153155 151729 150036 148651 147790 147564 148325 150006 151563 152054 152076 153114 155444 157744 158938 159396
57429 159396 159961 160750 161442 161955 162230 161942 161026 160063 159617 159554 159389 158862 157857 156235 154202 152446 151442
57412 151442 150965 150636 150575 151080 151989 152905 153847 155158 156809 158197 158679 158134 157029 156070 155725 155965 156483 157056
57394 157056 157501 157480 156727 155504 154466 154070 154391 155443 157206 159306 161176 162702 164334 166452 168936 171415
57378 171415 173608 175426 177068 178928 181027 182701 183346 183275 183159 182838 181567 179453 177706 177210 177635 178200
$$ packed form
57496A75630j761k241k473k298j944j605j440j585j795j515o82K3Q1j83k86l86
57480A55540q30j420j708j614j258o52k5N3n23r94p68k87k51m85l87j8J73L24
57462A44870Q62J448J224K00n59l65K17K55k37l52N14J810K379J724N58j65m18
57445A53965q10j426j693j385q61k26P61J681J557M91K2J038K330K300J194M58
57429A59396N65P89O92N13K75k88r16r63m46o3j65n27j005j622k033j756j004
57412A51442m77l29o1N05R09R16R42J311J651J388M82n45j105r59l45K40N18N73
57394A57056M45k1p53j223j038l96L21J052J763K100J870J526J632K118K484K479
57378A71415K193J818J642J860K099J674O45p1j16l21j271k114j747m96M25N65
$$ plain form
57362 178200 178509 178333 177448 176132 175141 174761 174559 174432 175128 177120 179632 181474 182410 183130 184247 185852 187697
57345 187697 189308 190213 190451 190596 191034 191566 191960 192403 193117 193979 194844 195766 196680 197415 198234 199672 201514 202714
57327 202714 202772 202498 202873 203841 204758 205340 205484 204914 203812 203219 203895 205203 205896 205629 204902 203975 202736 201408
57309 201408 200479 200069 200033 200512 201693 203206 204500 205642 207037 208540 209615 210263 211017 212006 212733 212889 212799
57292 212799 212985 213828 215682 218749 222564 225993 227990 228352 227907 228064 229855 233049 236353 238719 240187
57277 240187 241346 242539 244049 246409 249847 253803 257702 261785 266453 271210 275177 278453 281983 286075
57263 286075 290005 293177 295811 298252 300382 302068 303539 304931 305966 306482 306913 307859 309379 310995 312318
57248 312318 313498 315111 317591 320757 323911 326544 328772 331015 333443 335969 338534 341102 343499 345484
$$ packed form
57362A78200L09j76q85j316r91l80k02j27O96J992K512J842R36P20J117J605J845
57345A87697J611R05K38J45M38N32L94M43P14Q62Q65R22R14P35Q19J438J842J200
57327B02714N8k74L75R68R17N82J44n70j102n93O76J308O93k67p27r27j239j328
57309B01408r29m10l6M79J181J513J294J142J395J503J075O48P54R89P27J56r0
57292B12799J86Q43J854L067L815L429J997L62m45J57J791L194L304K366J468
57277B40187J159J193J510K360L438L956L899M083M668M757L967L276L530M092
57263B86075L930L172K634K441K130J686J471J392J035N16M31R46J520J616J323
57248C12318J180J613K480L166L154K633K228K243K428K526K565K568K397J985
$$ plain form
57234 345484 346901 347744 348331 349491 352125 356395 361779 368041 375458 383776 391734 398398 404453 411471 420342
57219 420342 431092 443738 458370 474540 491424 508539 525691 542452 558471 574200 590563
57208 590563 607844 625456 642681 659066 674319 688528 702451 716897 731874 746880 761841
57197 761841 777091 792655 808345 824489 841739 860010 878262 895390 910904 924967 938411
57186 938411 952454 967577 982832 997105 1010860 1025661 1042076 1059210 1076362 1093916 1112255
57175 1112255 1130966 1149747 1169125 1189554 1210514 1231178 1251429 1271598 1291676 1311408 1330912
57164 1330912 1350721 1371357 1393065 1415693 1438706 1461675 1484856 1508853 1533633 1558444 1582907
57153 1582907 1607590 1633222 1659870 1687225 1715189 1743817 1773106 1803190 1834404 1866840 1900165
$$ packed form
57234C45484J417Q43N87J160K634M270N384O262P417Q318P958O664O055P018Q871
57219D20342J0750J2646J4632J6170J6884J7115J7152J6761J6019J5729J6363
57208E90563J7281J7612J7225J6385J5253J4209J3923J4446J4977J5006J4961
57197G61841J5250J5564J5690J6144J7250J8271J8252J7128J5514J4063J3444
57186I38411J4043J5123J5255J4273J3755J4801J6415J7134J7152J7554J8339
57175A112255J8711J8781J9378K0429K0960K0664K0251K0169K0078J9732J9504
57164A330912J9809K0636K1708K2628K3013K2969K3181K3997K4780K4811K4463
57153A582907K4683K5632K6648K7355K7964K8628K9289L0084L1214L2436L3325
$$ plain form
57142 1900165 1934053 1968389 2002800 2036480 2068911 2100504 2132223 2164792 2198437 2233086 2268618
57131 2268618 2305235 2343806 2385596 2431433 2481267 2534605 2591093 2650639 2713200 2778490 2845686
57120 2845686 2913514 2981044 3048410 3116496 3186084 3257739 3332334 3411234 3496133 3589379 3694328
57109 3694328 3814628 3953024 4111312 4291290 4495301 4726371 4989098 5290671 5640371
57100 5640371 6048328 6525852 7087067 7749250 8531735 9455879 10546267 11830035 13333218
57091 13333218 15076882 17074746 19330628 21834940 24562409 27472064 30507457 33596905
57083 33596905 36656361 39594039 42311432 44701154 46652261 48069886 48897973 49125437
57075 49125437 48771380 47865709 46442662 44547926 42247381 39627954 36790159 33836845
$$ packed form
57142A900165L3888L4336L4411L3680L2431L1593L1719L2569L3645L4649L5532
57131B268618L6617L8571M1790M5837M9834N3338N6488N9546O2561O5290O7196
57120B845686O7828O7530O7366O8086O9588P1655P4595P8900Q4899R3246J04949
57109C694328J20300J38396J58288J79978K04011K31070K62727L01573L49700
57100E640371M07957M77524N61215O62183P82485R24144J090388J283768J503183
57091A3333218J743664J997864K255882K504312K727469K909655L035393L089448
57083C3596905L059456K937678K717393K389722J951107J417625Q28087K27464
57075D9125437l54057r05671j423047j894736k300545k619427k837795k953314
$$ plain form
57067 33836845 30862661 27947166 25152247 22522412 20086264 17858608 15843251 14035918
57059 14035918 12426642 11001607 9744874 8640048 7671478 6824614 6085571 5440812 4877681
57050 4877681 4385331 3954660 3577312 3245305 2951954 2692547 2463485 2261092 2081765
57041 2081765 1922879 1782719 1659524 1551019 1454752 1368468 1290435 1219895 1156986 1101811
57031 1101811 1053889 1012925 979472 954148 936875 927975 929535 944677 976400 1028913 1108851 1220416
57019 1220416 1355836 1491667 1597708 1651686 1647066 1590274 1493969 1372690 1240583 1109141
57009 1109141 985690 874006 775888 691834 621116 562366 514281 475397 443486 416000 391418
56998 391418 369847 352121 338487 328185 320017 313026 306664 300634 294879 289878 286659 286156 288515
$$ packed form
57067C3836845k974184k915495k794919k629835k436148k227656k015357j807333
57059A4035918j609276j425035j256733j104826r68570q46864p39043o44759n63131
57050D877681m92350m30671l77348l32007k93351k59407k29062k02393j79327
57041B081765j58886j40160j23195j08505r6267q6284p8033p0540o2909n5175
57031A101811m7922m0964l3453k5324j7273q900J560J5142L1723N2513P9938J11565
57019A220416J35420J35831J06041N3978m620n6792r6305j21279j32107j31442
57009A109141j23451j11684r8118q4054p0718n8750m8085l8884l1911k7486k4582
56998C91418k1571j7726j3634j0302q168o991o362o030n755n001l219n03K359
$$ plain form
56985 288515 293350 300611 310604 322767 334937 344430 349675 350365 346390 337579 324583 309129 292907
56972 292907 276731 261157 247271 236116 227615 220820 215247 211474 210312 211871 215717 221678 230241
56959 230241 242149 257712 276436 297070 317659 335537 347797 352499 349586 340376 326289 308549
56947 308549 288868 269449 251852 236445 223248 212671 205003 199882 196947 196501 198986 204383 212809
56934 212809 225163 242334 264126 289644 318030 347693 375157 396036 407356 408331 399322 381390
56922 381390 356897 329130 300712 273072 247484 225469 207636 193044 180364 169146 159677 152229
56910 152229 146741 142644 138762 134132 129091 124823 121659 118822 116086 114456 114502 115109 114830 113742 112973
56895 112973 113022 113668 115254 118971 125802 135862 148900 164985 184595 208111 234990 263098 289119
$$ packed form
56985B88515M835P261R993J2163J2170R493N245O90l975q811j2996j5454j6222
56972B92907j6176j5574j3886j1155q501o795n573l773j162J559L846N961Q563
56959B30241J1908J5563J8724K0634K0589J7878J2260M702k913r210j4087j7740
56947C08549j9681j9419j7597j5407j3197j0577p668n121k935m46K485N397Q426
56934B12809J2354J7171K1792K5518K8386K9663K7464K0879J1320R75r009j7932
56922C81390k4493k7767k8418k7640k5588k2015j7833j4592j2680j1218r469p448
56910A52229n488m097l882m630n041m268l164k837k736j630M6O07k79j088p69
56895A12973M9O46J586L717O831J0060J3038J6085J9610K3516K6879K8108K6021
$$ plain form
56882 289119 309974 323830 330103 329295 323124 313974 303580 292609 281765 272477 265857 261642 259075
56869 259075 258508 261358 268734 280765 297146 317759 342992 374072 412845 460377 515288 573462
56857 573462 629069 675852 708323 723107 719833 700885 670412 633374 594550 557444 523980 495361
56845 495361 472787 456992 447667 444142 446626 456391 474881 503033 541286 589934 649636 721527
56833 721527 805765 898722 991477 1071758 1128141 1153488 1146303 1110388 1053105 982711 906290 829439
56821 829439 756745 691607 635810 589915 554024 527858 510615 501588 500876 509015 526196 552526
56809 552526 588802 636043 693750 758630 824594 883478 926454 946512 941002 912219 865667 807758
56797 807758 744450 680761 620547 566396 519612 480325 447952 421920 402029 388202 380245 378057
$$ packed form
56882B89119K0855J3856O273q08o171r150j0394j0971j0844r288o620m215k567
56869B59075n67K850P376J2031J6381K0613K5233L1080L8773M7532N4911N8174
56857E73462N5607M6783L2471J4784l274j8948l0473l7038l8824l7106l3464k8619
56845D95361k2574j5795r325l525K484R765J8490K8152L8253M8648N9702P1891
56833G21527Q4238R2957R2755Q0281N6383K5347p185l5915n7283p0394p6421p6851
56821H29439p2694o5138n5797m5895l5891k6166j7243r027p12Q139J7181K6330
56809E52526L6276M7241N7707O4880O5964N8884M2976K0058n510k8783m6552n7909
56797H07758o3308o3689o0214n4151m6784l9287l2373k6032j9891j3827p957k188
$$ plain form
56785 378057 381710 391126 406103 426883 453953 486438 520769 551483 573448 583436 580323 564759
56773 564759 538737 505038 466784 427264 389441 355057 324368 297053 273054 252364 234567
56762 234567 219107 205667 193879 183129 173091 164021 156082 148909 142376 137147 133697 131262 128577
56749 128577 125356 122278 119865 118143 117124 116780 116642 116131 115195 114035 112499 110437 108362 106997 106352
56734 106352 105976 105927 106698 108316 110169 111600 112073 111106 108854 106566 105606 106114 107276 108610 110152 111703
56718 111703 112921 114038 115484 116906 117581 117736 118375 119709 120869 121304 121392 121357 120742 119418 118177 117722 117771
56701 117771 117716 117520 117414 117291 116970 116694 116888 117618 118591 119463 120042 120452 121204 122688 124576 126081 126842 127130
56683 127130 127221 127091 126751 126364 125909 125254 124577 124236 124134 123703 122595 120991 119220 117548 116280 115609 115378
$$ packed form
56785C78057L653R416J4977K0780K7070L2485L4331L0714K1965R988l113j5564
56773E64759k6022l3699l8254l9520l7823l4384l0689k7315k3999k0690j7797
56762B34567j5460j3440j1788j0750j0038r070p939p173o533n229l450k435k685
56749A28577l221l078k413j722j019l44j38n11r36j160j536k062k075j365o45
56734A06352l76m9P71J618J853J431M73r67k252k288r60N08J162J334J542J551
56718A11703J218J117J446J422O75J55O39J334J160M35Q8l5o15j324j241m55M9
56701A17771n5j96j06j23l21k76J94P30R73Q72N79M10P52J484J888J505P61K88
56683A27130R1j30l40l87m55o55o77l41j02m31j108j604j771j672j268o71k31
$$ plain form
56666 115378 115436 116040 117327 118653 119216 119211 119550 120472 121309 121721 122218 123164 124065 124280 123859 123335 123100 123263 123681
56647 123681 124007 124069 124288 125244 126889 128662 130392 132467 135106 138066 141134 144347 147666 150960 154325
56632 154325 157868 161244 163953 166048 167964 169830 171600 173557 175831 177624 177954 177093 176237 175753 174881
56617 174881 173264 171571 170278 168975 167404 166156 165761 165882 165949 165887 165757 165379 164725 164082 163469 162551 161352
56600 161352 160307 159309 157592 154937 152199 150162 148628 147129 145786 144932 144485 144208 144019 143701 142944 141980
56584 141980 141471 141405 140935 139775 138950 139517 141242 143100 144533 145618 146571 147638 149081 150787 152365 153865
56568 153865 155877 158644 161772 165082 168975 173564 178315 183067 188624 195773 204430 214236 225034 236059
56554 236059 245580 252367 257012 260945 264683 267798 270084 271740 272789 273172 273243 273398 273336 272281 269817 266194
$$ packed form
56666A15378N8O04J287J326N63nL39R22Q37M12M97R46R01K15m21n24k35J63M18
56647A23681L26O2K19R56J645J773J730K075K639K960L068L213L319L294L365
56632A54325L543L376K709K095J916J866J770J957K274J793L30q61q56m84q72
56617A74881j617j693j293j303j571j248l95J21O7o2j30l78o54o43o13r18j199
56600A61352j045r98j717k655k738k037j534j499j343q54m47k77j89l18p57r64
56584A41980n09o6m70j160q25N67J725J858J433J085R53J067J443J706J578J500
56568A53865K012K767L128L310L893M589M751M752N557P149Q657R806J0798J1025
56554B36059R521O787M645L933L738L115K286J656J049L83P1J55o2j055k464l623
$$ plain form
56538 266194 262103 258509 256125 254558 252413 248796 244290 239989 236115 232214 228091 223767 218961 213465
56524 213465 207751 202459 197513 192536 187906 184632 183181 183062 183514 184005 184074 183359 181985 180568 179697 179571
56508 179571 180107 181168 182673 184565 186593 188144 188655 188238 187598 187127 186489 185239 183478 181632 179925 178316
56492 178316 176725 175167 173899 173431 174054 175359 176658 177755 178780 179470 179423 179063 179413 180688 181960 182441
56476 182441 182253 181637 180378 178515 176824 175992 175949 176387 177314 178663 180063 181399 182992 184849 186499 187894
56460 187894 189662 192036 194349 196027 197279 198372 199121 199629 200530 201891 202833 202937 203089 204118 205443 205952
56444 205952 205470 204520 203391 202375 202183 203134 204488 205417 206074 206865 207385 207079 206382 206160 206424 206562 206426 206255
56426 206255 205898 205039 203944 203133 202565 201910 201353 201365 201883 202359 202457 202194 201708 201349 201648 202724 204055 205191
$$ packed form
56538B66194m091l594k384j567k145l617m506m301l874l901m123m324m806n496
56524B13465n714n292m946m977m630l274j451j19M52M91O9p15j374j417q71j26
56508A79571N36J061J505J892K028J551N11m17o40m71o38j250j761j846j707j609
56492A78316j591j558j268m68O23J305J299J097J025O90m7l60L50J275J272M81
56476A82441j88o16j259j863j691q32m3M38R27J349J400J336J593J857J650J395
56460A87894J768K374K313J678J252J093P49N08R01J361R42J04J52J029J325N09
56444B05952m82r50j129j016j92R51J354R29O57P91N20l06o97k22K64J38j36j71
56426B06255l57q59j095q11n68o55n57J2N18M76R8k63m86l59K99J076J331J136
$$ plain form
56408 205191 206158 206965 207443 207946 209250 211196 212437 212204 211331 210728 209954 208402 206879 206642 207562 208578 209437
56391 209437 210694 212346 213802 215033 216660 218995 221852 225121 228635 231736 233762 234844 235544 236027 236176
56376 236176 236057 235670 234823 233868 233850 235099 236444 236768 236607 237225 238817 240790 243110 246020 248866 250583
56360 250583 251137 251379 251651 251626 251293 251087 251126 251163 251104 250913 250322 249398 248914 249361 250129 250441 250525 250992 251713 252266
56340 252266 252866 253811 254697 255261 256355 258843 262093 264770 266688 268644 270903 273054 275015 277023 279007
56325 279007 281007 283768 287837 292514 296664 300014 302684 304250 304514 304416 304859 305338 305054 304573 304893 305620
56309 305620 305775 305759 306699 308353 309498 310092 311249 313290 315519 317806 320683 323983 326930 329493 332195
56294 332195 334840 336965 339238 342698 346858 350274 352853 355870 359795 363847 367677 371717 375892 379651
$$ packed form
56408B05191R67Q07M78N03J304J946J241k33q73o03p74j552j523k37R20J016Q59
56391B09437J257J652J456J231J627K335K857L269L514L101K026J082P00M83J49
56376B36176j19l87q47r55j8J249J345L24j61O18J592J973K320K910K846J717
56360B50583N54K42K72k5l33k06L9L7n9j91n91r24m84M47P68L12Q4M67P21N53
56340B52266O00R45Q86N64J094K488L250K677J918J956K259K151J961K008J984
56325B79007K000K761M069M677M150L350K670J566K64r8M43M79k84m81L20P27
56309C05620J55j6R40J654J145N94J157K041K229K287K877L300K947K563K702
56294C32195K645K125K273L460M160L416K579L017L925M052L830M040M175L759
$$ plain form
56280 379651 383321 387760 392655 396920 400734 405434 411336 417554 424113 432244 442183 452494 462157 471723
56266 471723 481871 492325 502826 513873 525959 539122 553496 569278 586181 604084 624124
56255 624124 647794 675090 704970 737510 774161 816002 863277 916422 975897 1041149 1111464
56244 1111464 1187619 1270893 1360605 1454563 1551728 1652251 1754893 1856649 1955071 2048677 2134792
56233 2134792 2209333 2269396 2314092 2342543 2353323 2346560 2324381 2288439 2238890 2176501 2103851
56222 2103851 2023717 1938125 1849581 1761150 1674455 1589374 1506380 1427258 1352862 1282308 1215267
56211 1215267 1153054 1096429 1044256 995443 950384 909407 871568 836139 803771 775107 749729
56200 749729 727392 708634 693188 679322 665777 652961 641347 630243 619143 608855 600305 593407
$$ packed form
56280C79651L670M439M895M265L814M700N902O218O559Q131R939J0311R663R566
56266D71723J0148J0454J0501J1047J2086J3163J4374J5782J6903J7903K0040
56255F24124K3670K7296K9880L2540L6651M1841M7275N3145N9475O5252P0315
56244A111464P6155Q3274Q9712R3958R7165J00523J02642J01756R8422R3606Q6115
56233B134792P4541O0063M4696K8451J0780o763k2179l5942m9549o2389p2650
56222B103851q0134q5592q8544q8431q6695q5081q2994p9122p4396p0554o7041
56211A215267o2213n6625n2173m8813m5059m0977l7839l5429l2368k8664k5378
56200G49729k2337j8758j5446j3866j3545j2816j1614j1104j1100j0288q550o898
$$ plain form
56188 593407 587803 583443 579869 576287 572785 570057 567716 564691 561511 560055 560521 560814 559635 557991 556919
56173 556919 556030 555316 556043 558539 561124 562567 563791 566052 569304 573402 578846 585112 590312 593860 597606
56158 597606 603032 609225 614944 620713 627415 634585 641639 649219 658035 667942 679187 692805 708645
56145 708645 724935 740979 758455 778866 801770 826761 855122 888092 925598 968197 1018343
56134 1018343 1078126 1147600 1226623 1316029 1415081 1519404 1623102 1721456 1810698 1887764 1952376
56123 1952376 2007705 2057307 2102740 2144839 2184434 2219920 2246561 2260698 2263232 2257559 2246131 2230668
56111 2230668 2213161 2194011 2170453 2138643 2095997 2040631 1971120 1888967 1799416 1707995 1617990
56100 1617990 1532362 1455197 1388894 1332178 1283157 1242287 1210289 1185385 1165020 1148470 1135778
$$ packed form
56188E93407n604m360l574l582l502k728k341l025l180j456M66K93j179j644j072
56173E56919q89p14P27K496K585J443J224K261L252M098N444O266N200L548L746
56158E97606N426O193N719N769O702P170P054P580Q816R907J1245J3618J5840
56145G08645J6290J6044J7476K0411K2904K4991K8361L2970L7506M2599N0146
56134A018343N9783O9474P9023Q9406R9052J04323J03698R8354Q9242P7066O4612
56123A952376N5329M9602M5433M2099L9595L5486K6641J4137K534n673j1428j5463
56111B230668j7507j9150k3558l1810m2646n5366o9511q2153q9551r1421r0005
56100A617990q5628p7165o6303n6716m9021m0870l1998k4904k0365j6550j2692
$$ plain form
56089 1135778 1126097 1119092 1115867 1116468 1118546 1120313 1122532 1125812 1128691 1130521 1133355 1138511 1144020 1148164
56075 1148164 1152707 1159777 1168197 1176024 1184234 1194722 1206898 1219363 1232836 1248374 1264800 1280867
56063 1280867 1297840 1317053 1337155 1356641 1376718 1398619 1420518 1440311 1459127 1478870 1498639
56052 1498639 1516847 1534568 1553496 1572851 1591518 1610833 1632040 1653516 1673884 1695262 1720001
56041 1720001 1746864 1773910 1802305 1833602 1866050 1897542 1929441 1963660 1998825 2033281 2068865
56030 2068865 2107571 2147593 2187022 2228277 2274336 2323722 2373928 2426569 2484120 2544703 2605314
56019 2605314 2667263 2733281 2802274 2872064 2944082 3019989 3097125 3172985 3250775 3334633 3422848
56008 3422848 3511902 3603602 3701660 3804845 3910387 4020732 4139856 4266367 4397380 4535664
$$ packed form
56089A135778r681p005l225O01K078J767K219L280K879J830K834N156N509M144
56075A148164M543P070Q420P827Q210J0488J2176J2465J3473J5538J6426J6067
56063A280867J6973J9213K0102J9486K0077K1901K1899J9793J8816J9743J9769
56052A498639J8208J7721J8928J9355J8667J9315K1207K1476K0368K1378K4739
56041A720001K6863K7046K8395L1297L2448L1492L1899L4219L5165L4456L5584
56030B068865L8706M0022L9429M1255M6059M9386N0206N2641N7551O0583O0611
56019B605314O1949O6018O8993O9790P2018P5907P7136P5860P7790Q3858Q8215
56008C422848Q9054R1700R8058J03185J05542J10345J19124J26511J31013J38284
$$ plain form
55998 4535664 4685421 4844587 5009141 5181396 5365961 5561294 5763842 5976834 6206066
55989 6206066 6450632 6707050 6978818 7272303 7587025 7920063 8276269 8663735 9083163
55980 9083163 9532547 10018123 10549282 11127115 11750153 12426761 13169085 13979973 14859962
55971 14859962 15822277 16886340 18062264 19358126 20797329 22412181 24227307 26269116
55963 26269116 28586329 31242674 34299326 37830338 41951005 46811191 52577426 59457859
55955 59457859 67740017 77777390 89960821 104747600 122695779 144409980 170466402
55948 170466402 201398612 237501640 278102406 320570309 360084189 390868011 408305616
55941 408305616 410500273 398419920 374979308 343912563 308910855 273063863 238587392
$$ packed form
55998D535664J49757J59166J64554J72255J84565J95333K02548K12992K29232
55989F206066K44566K56418K71768K93485L14722L33038L56206L87466M19428
55980I083163M49384M85576N31159N77833O23038O76608P42324Q10888Q79989
55971A4859962R62315J064063J175924J295862J439203J614852J815126K041809
55963B6269116K317213K656345L056652L531012M120667M860186N766235O880433
55955E9457859Q282158J0037373J2183431J4786779J7948179K1714201K6056422
55948A70466402L0932210L6103028M0600766M2467903L9513880L0783822J7437605
55941D08305616K194657j2080353k3440612l1066745l5001708l5846992l4476471
$$ plain form
55934 238587392 206840996 178517145 153827599 132641602 114627687 99388954 86531432
55927 86531432 75676382 66479225 58658277 51990612 46283734 41369933 37120544 33439685
55919 33439685 30240696 27442813 24985837 22828042 20928569 19245648 17749579 16421519
55911 16421519 15239229 14176821 13217413 12353069 11572425 10859772 10205638 9607123 9058107
55902 9058107 8549211 8076691 7641429 7239699 6864171 6513201 6189916 5892681 5615266
55893 5615266 5355802 5116890 4897120 4690764 4495898 4315144 4148440 3992356 3846410
55884 3846410 3713111 3591888 3479672 3377175 3288213 3213297 3150014 3098561 3059820 3028150
55874 3028150 2992831 2946983 2889618 2819975 2736750 2642984 2545184 2446783 2347739 2250251 2158770
$$ packed form
55934B38587392l1746396k8323851k4689546k1185997j8013915j5238733j2857522
55927H6531432j0855050r197157p820948o667665n706878m913801m249389l680859
55919C3439685l198989k797883k456976k157795j899473j682921j496069j328060
55911A6421519j182290j062408r59408q64344p80644p12653o54134n98515n49016
55902I058107n08896m72520m35262m01730l75528l50970l23285k97235k77415
55893E615266k59464k38912k19770k06356j94866j80754j66704j56084j45946
55884C846410j33299j21223j12216j02497q8962p4916o3283n1453l8741l1670
55874C028150l5319m5848n7365o9643q3225r3766r7800r8401r9044r7488r1481
$$ plain form
55863 2158770 2074101 1993302 1915923 1844813 1780389 1719742 1662186 1610311 1564597 1522096 1481388
55852 1481388 1444062 1410241 1377294 1344130 1312506 1282923 1253295 1222757 1193027 1165004 1137587
55841 1137587 1110737 1086222 1064419 1043525 1022589 1002366 982816 962814 942619 923721 906133
55830 906133 888776 872299 858359 846339 834080 821635 810856 801381 790613 777762 764537 751719
55818 751719 738444 724884 712267 700090 686671 672573 660122 649516 638797 627724 618172 610504
55806 610504 603178 596244 591668 589749 588728 588447 590854 596222 602282 607797 613673 619784 624056 625636
55792 625636 625797 624818 621111 614387 606623 598867 590113 580360 571837 565849 560967 555361 548452 539512 527451
55777 527451 513089 499070 486510 474164 461682 450939 443071 436903 431582 428244 427754 428971 430507
$$ packed form
55863B158770q4669q0799p7379p1110o4424o0647n7556n1875m5714m2501m0708
55852A481388l7326l3821l2947l3164l1624k9583k9628l0538k9730k8023k7417
55841A137587k6850k4515k1803k0894k0936k0223j9550k0002k0195j8898j7588
55830I06133j7357j6477j3940j2020j2259j2445j0779r475j0768j2851j3225j2818
55818G51719j3275j3560j2617j2177j3419j4098j2451j0606j0719j1073r552p668
55806F10504p326o934m576j919j021k81K407N368O060N515N876O111M272J580
55792F25636J61r79l707o724p764p756q754r753q523n988m882n606o909q940j2061
55777E27451j4362j4019j2560j2346j2482j0743p868o168n321l338m90J217J536
$$ plain form
55764 430507 432136 433525 433748 433017 432769 433146 432544 430460 428375 426882 424379 419831 414459 409380 403732
55749 403732 396504 388225 379512 369869 359278 349236 340867 333518 326318 319577 313680 308199 303024 298800
55735 298800 295419 291714 287453 283941 281863 280265 278432 276938 275954 274354 271461 268033 264605 260513
55721 260513 255426 250231 245573 241122 236959 233961 232135 230432 228830 228656 230071 231357 231610 232082 233832
55706 233832 236162 238532 241909 246791 251713 255114 256993 257492 255710 251370 245930 240580 234700 227743
55692 227743 220996 215871 211920 208085 204567 201952 199788 197632 196345 196813 198385 199963 201657 204110
55678 204110 207171 210451 214152 218141 221171 222207 221632 220188 217824 214538 211138 208085 204726 200743
55664 200743 197143 194711 192752 190531 188682 187939 187711 187351 187660 189686 192961 196351 199739 203491 207113
$$ packed form
55764D30507J629J389K23p31k48L77o02k084k085j493k503m548n372n079n648
55749D03732p228q279q713r643j0591j0042q369p349p200o741n897n481n175m224
55735B98800l381l705m261l512k078j598j833j494r84j600k893l428l428m092
55721B60513n087n195m658m451m163k998j826j703j602j74J415J286K53M72J750
55706B33832K330K370L377M882M922L401J879M99j782m340n440n350n880o957
55692B27743o747n125l951l835l518k615k164k156j287M68J572J578J694K453
55678B04110L061L280L701L989L030J036n75j444k364l286l400l053l359l983
55664B00743l600k432j959k221j849p43k28l60L09K026L275L390L388L752L622
$$ plain form
55649 207113 209811 211713 213351 214612 215245 215550 215516 214106 210608 205891 201254 196815 192043 187042 182202
55634 182202 177392 172500 168046 164351 160972 157782 155508 154328 153111 151154 149471 149128 149416 149029 148003
55619 148003 147107 146314 145281 144491 144452 144553 144043 143350 143115 142758 141394 139358 137451 135512 133201 131343 130849
55602 130849 130986 130361 129040 128134 127799 127306 126620 126271 125938 124852 123416 122860 123317 123676 123363 122880 122545 122027
55584 122027 121286 120838 120885 121135 121516 122180 122835 122913 122404 121797 121391 121363 122141 123816 125506 126211 126096 126103 126570 127093
55564 127093 127458 127889 128583 129673 131244 132688 132703 130798 128193 126276 124815 122796 120359 118531 117507
55549 117507 116558 115416 114403 113369 111762 109802 108416 108053 108450 109398 110714 111658 111561 110874 110534 110420 109619
55532 109619 108150 107164 107280 107923 108536 109367 110653 111898 112386 111899 110706 109403 108785 109317 110603 111762
$$ packed form
55649B07113K698J902J638J261O33L05l4j410l498m717m637m439m772n001m840
55634A82202m810m892m454l695l379l190k274j180j217j957j683l43K88l87j026
55619A48003q96p93j033p90l9J01n10o93k35l57j364k036j907j939k311j858m94
55602A30849J37o25j321r06l35m93o86l49l33j086j436n56M57L59l13m83l35n18
55584A22027p41m48M7K50L81O64O55P8n09o07m06k8P78J675J690P05j15PM67N23
55564A27093L65M31O94J090J571J444J5j905k605j917j461k019k437j828j024
55549A17507r49j142j013j034j607j960j386l63L97R48J316R44r7o87l40j14q01
55532A09619j469r86J16O43O13Q31J286J245M88m87j193j303o18N32J286J159
$$ plain form
55516 111762 112251 111942 110737 108705 106277 103774 101066 98290 96332 95746 95699 94971 93611 92605 92213 91805
55500 91805 91204 91042 91740 93040 94589 96143 97218 97406 97082 97039 97398 97547 97150 96508 95998 95733 95627 95315
55482 95315 94255 92421 90484 88804 86942 84908 84041 85530 88687 91882 94622 97332 99661 100645 100401
55467 100401 100083 100078 99677 98580 97318 96031 94246 92155 90787 90496 90490 90180 89860 89681 89136 88054 87050
55450 87050 86524 86105 85520 85152 85326 85850 86515 87208 87391 86515 85216 85002 86348 88157 89484 90619 91895
55433 91895 92653 92259 91222 90327 89360 87658 85472 83916 83783 84961 86724 88117 88439 87888 87568 88506 90805
55416 90805 93865 96944 99315 100401 100178 99161 97802 96216 94604 93427 92944 92936 93003 92817 92106 90949 90024
55399 90024 89951 90330 90123 89062 87929 87338 87066 86819 86827 87234 87681 87971 88493 89480 90381 90503 89893 89183 88880
$$ packed form
55516A11762M89l09j205k032k428k503k708k776j958n86m7p28j360j006l92m08
55500I1805o01j62O98J300J549J554J075J88l24m3L59J49l97o42n10k65j06l12
55482I5315j060j834j937j680j862k034q67J489L157L195K740K710K329R84k44
55467A00401l18nm01j097j262j287j785k091j368k91ol10l20j79n45j082j004
55450H7050n26m19n85l68J74N24O65O93J83q76j299k14J346J809J327J135J276
55433I1895P58l94j037q95r67j702k186j556j33J178J763J393L22n51l20R38K299
55416I0805L060L079K371J086k23j017j359j586j612j177m83qO7j86p11j157r25
55399I0024p3L79k07j061j133n91k72k47QM07M47K90N22R87R01J22o10p10l03
$$ plain form
55380 88880 89134 89856 90786 91692 92593 93469 93849 93329 92531 92718 94293 96388 98213 99939 101840 103433 104134
55363 104134 104159 104025 103627 102519 100848 99373 98601 98372 98206 97744 96852 95535 93813 91755 89728 88381
55347 88381 87971 87937 87674 87543 88389 90066 91308 91259 90350 89361 88377 87129 85727 84515 83620 83082 83068 83619
55329 83619 84503 85537 86718 87924 88928 89767 90559 90907 90257 88986 88346 88980 90187 91038 91451 91765 92009
55312 92009 92141 92384 92693 92485 91390 89790 88134 86360 84544 83417 83511 84317 85006 85480 85973 86167 85656
55295 85656 84957 85097 86279 87815 89253 90723 92088 92612 91819 90177 88671 87972 88127 88738 89308 89665 90138
55278 90138 91199 92919 94838 96292 96823 96504 95991 95978 96425 96562 95859 94611 93375 92216 90947 89817
55262 89817 89415 90014 91343 92879 94106 94668 94672 94691 95142 95760 96000 95817 95719 96111 96895 97664 98032 97824 97160
$$ packed form
55380H8880K54P22R30R06R01Q76L80n20p98J87J575K095J825J726J901J593P01
55363A04134K5j34l98j108j671j475p72k29j66m62q92j317j722k058k027j347
55347H8381m10l4k63j31Q46J677J242m9r09r89r84j248j402j212q95n38j4N51
55329H3619Q84J034J181J206J004Q39P92L48o50j271o40O34J207Q51M13L14K44
55312I2009J32K43L09k08j095j600j656j774j816j127R4Q06O89M74M93J94n11
55295H5656o99J40J182J536J438J470J365N24p93j642j506o99J55O11N70L57M73
55278I0138J061J720J919J454N31l19n13j3M47J37p03j248j236j159j269j130
55262H9817m02N99J329J536J227N62MJ9M51O18K40j83r8L92P84P69L68k08o64
$$ plain form
55243 97160 96350 95601 94900 94250 93763 93394 92796 91735 90553 89963 90438 91835 93485 94575 94688 94121 93560
55226 93560 93431 93696 94225 94993 95876 96665 97383 98172 98784 98680 97878 97223 97439 98253 98803 98575 97635 96312 95071
55207 95071 94402 94406 94600 94483 94081 93723 93521 93413 93444 93604 93617 93274 92911 93155 94247 95798 97203 98090 98517
55188 98517 98902 99661 100774 101811 102459 102733 102583 101658 99793 97437 95337 93930 93339 93707 95142 97327
55172 97327 99501 100919 101250 100607 99308 97718 96305 95711 96386 97957 99331 99860 100104 100953 102298 103320
55156 103320 103896 104753 106082 107012 106868 106197 105998 106534 107338 107945 108150 108047 108124 108808 109573 109117 106867 103756
55138 103756 101105 99378 98492 98538 99431 100437 100910 101066 101307 101266 100396 99137 98544 98942 99745 100432 100851 100724
55120 100724 99790 98532 97979 98585 99910 101441 103089 104731 105931 106412 106369 106118 105732 105158 104427 103679 103164
$$ packed form
55243I7160q10p49p01o50m87l69n98j061j182n90M75J397J650J090J13n67n61
55226I3560j29K65N29P68Q83P89P18P89O12j04q02o55K16Q14N50k28r40j323j241
55207I5071o69MJ94j17m02l58k02j08L1J60J3l43l63K44J092J551J405Q87M27
55188I8517L85P59J113J037O48K74j50r25j865k356k100j407n91L68J435K185
55172I7327K174J418L31o43j299j590j413n94O75J571J374N29K44Q49J345J022
55156A03320N76Q57J329R30j44o71j99N36Q04O07K05j03P7O84P65m56k250l111
55138A03756k651j727q86M6Q93J006M73J56K41m1q70j259n93L98Q03O87M19j27
55120A00724r34j258n53O06J325J531J648J642J200M81m3k51l86n74p31p48n15
$$ plain form
55103 103164 103156 103618 104130 104423 104782 105515 106280 106447 106053 105925 106813 108679 110803 112289 112643 112166 111638 111434
55085 111434 111257 110948 111004 111753 112560 112580 111931 111350 111018 110570 110010 109670 109363 108582 107579 107260 107798 108257 107926
55066 107926 107181 106663 106323 105768 104926 103897 102677 101490 100925 101220 101790 101932 101701 101662 102004 102356 102420 102388 102680
55047 102680 103454 104390 105013 105277 105718 106819 108325 109537 110168 110515 110820 111004 111104 111437 112129 112904 113554 114187
55029 114187 114804 114996 114427 113291 112035 110868 109771 108743 107791 106901 106210 105987 106224 106538 106667 106794 107138
55012 107138 107511 107616 107566 107694 107959 107928 107385 106661 106231 106213 106399 106643 107061 107868 109153 110855 112822 114677
54994 114677 115788 115724 114870 114305 114808 116174 117635 118687 119220 119241 118937 118813 119223 119789 119764 118930 117708 116444
54976 116444 115118 113861 113137 113131 113425 113606 113879 114724 116121 117424 117960 117664 117187 117398 118582 120116 121076
$$ packed form
55103A03164qM62N12K93L59P33P65J67l94j28Q88J866K124J486L54m77n28k04
55085A11434j77l09N6P49Q07K0o49n81l32m48n60l40l07p81j003l19N38M59l31
55066A07926p45n18l40n55q42j029j220j187n65K95N70J42k31l9L42L52O4l2K92
55047A02680P74R36O23K64M41J101J506J212O31L47L05J84J00L33O92P75O50O33
55029A14187O17J92n69j136j256j167j097j028r52q90o91k23K37L14J29J27L44
55012A07138L73J05n0J28K65l1n43p24m30j8J86K44M18Q07J285J702J967J855
54994A14677J111o4q54n65N03J366J461J052N33K1l04j24M10N66k5q34j222j264
54976A16444j326j257p24oK94J81K73Q45J397J303N36k96m77K11J184J534R60
$$ plain form
54959 121076 121110 120485 119479 118258 117353 117568 119068 120984 122344 123126 124018 125347 126682 127445 127590 127546 127688
54942 127688 127924 127791 126988 125826 125010 124958 125408 125787 125775 125469 125120 124948 125167 126039 127743 130124 132689 135042
54924 135042 137351 140205 143904 148192 152856 158258 164907 172671 180843 188845 196433 203183 208205 210523
54910 210523 209642 205863 200323 194513 189259 184131 178261 171675 165377 160114 155679 151570 147785 144635
54896 144635 142146 140069 138271 136852 135999 135823 136181 136583 136521 136028 135664 135878 136635 137718 139115 140969 143404
54879 143404 146500 150212 154345 158902 164449 171647 180335 189401 197648 204341 208907 210731 209653 206232
54865 206232 201192 194944 187904 180803 174256 168291 162648 157313 152403 147855 143607 139872 136918 134773
54851 134773 133398 132787 132548 131766 129823 127171 124753 122865 121159 119624 118786 118774 118842 118211 116995 115920
$$ packed form
54959A21076L4o25j006j221r05K15J500J916J360P82Q92J329J335P63J45m4J42
54942A27688K36j33q03j162q16n2M50L79j2l06l49j72K19Q72J704K381K565K353
54924A35042K309K854L699M288M664N402O649P764Q172Q002P588O750N022K318
54910B10523q81l779n540n810n254n128n870o586o298n263m435m109l785l150
54896A44635k489k077j798j419q53j76L58M02o2m93l64K14P57J083J397J854K435
54879A43404L096L712M133M557N547P198Q688R066Q247O693M566J824j078l421
54865B06232n040o248p040p101o547n965n643n335m910m548m248l735k954k145
54851A34773j375o11k39p82j943k652k418j888j706j535q38j2O8o31j216j075
$$ plain form
54835 115920 115418 115379 115631 116161 116805 117106 116744 115934 115173 114686 114436 114598 115562 117208 118535 118507 117189 115693
54817 115693 114969 115069 115565 116252 117156 118193 119108 119670 119822 119762 119942 120723 121882 122697 122675 122086 121673 121935 122774
54798 122774 123659 124026 123642 122704 121550 120357 119232 118447 118303 118875 120117 122052 124347 125917 125719 124124
54782 124124 122915 123506 125597 127851 129416 130397 131236 132238 133572 135312 137455 140047 143222 146973 151072
54767 151072 155300 159601 164035 168878 174789 182316 191011 199411 206118 210610 212917 213130 211538 208676
54753 208676 204791 199674 193337 186421 179560 172923 166793 161948 158737 156349 153829 151433 150116 149908
54739 149908 149749 148861 147480 146187 145295 144980 145295 145908 146418 147039 148367 150396 152462 154419 157157 161603
54723 161603 167609 174179 180433 186131 191546 197068 202669 207680 211341 213510 214438 213894 211174 206108 199502
$$ packed form
54835A15920n02l9K52N30O44L01l62q10p61m87k50J62R64J646J327k8j318j496
54817A15693p24J00M96O87R04J037R15N62J52o0J80P81J159Q15k2n89m13K62Q39
54798A22774Q85L67l84r38j154j193j125p85j44N72J242J935K295J570j98j595
54782A24124j209N91K091K254J565R81Q39J002J334J740K143K592L175L751M099
54767A51072M228M301M434M843N911P527Q695Q400O707M492K307K13j592k862
54753B08676l885n117o337o916o861o637o130m845l211k388k520k396j317k08
54739A49908j59q88j381j293q92l15L15O13N10O21J328K029K066J957K738M446
54723A61603O006O570O254N698N415N522N601N011L661K169R28n44k720n066o606
$$ plain form
54708 199502 192372 185276 178611 172911 168339 164358 160390 156479 152922 149597 146170 142706 139582 136956
54694 136956 134794 133230 132441 132189 131928 131462 131171 131540 132635 134013 134982 135058 134401 133705 133460 133433 133071 132204
54676 132204 131034 129671 128195 127141 127280 128668 130321 131177 131140 130878 130812 130705 130184 129304 128427 127764 127195
54659 127195 126491 125651 124957 124699 124783 124707 124036 122875 121791 121270 121395 122036 123104 124504 125974 127221 128172
54642 128172 128936 129511 129656 129152 128172 127365 127463 128617 130103 130912 130757 130250 129957 129637 128834 127891 127753 128738
54624 128738 130178 131361 132244 132974 133308 133011 132394 131940 131611 131067 130365 129928 129882 129896 129717 129497 129561 130119 131168
54605 131168 132399 133211 133178 132469 131599 130830 130158 129747 129911 130569 131164 131293 131114 130978 130889 130566 129896 129164 128860
54586 128860 129255 130079 130712 130863 130965 131641 132840 133767 133723 132793 131662 130933 130652 130330 129484 128237 127249 126893
$$ packed form
54708A99502p130p096o665n700m572l981l968l911l557l325l427l464l124k626
54694A36956k162j564p89k52k61m66k91L69J095J378R69P6o57o96k45k7l62q67
54676A32204j170j363j476j054J39J388J653Q56l7k62o6j07n21q80q77o63n69
54659A27195p04q40o94k58Q4p6o71j161j084n21J25O41J068J400J470J247R51
54642A28172P64N75J45n04r80q07R8J154J486Q09j55n07k93l20q03r43j38R85
54624A28738J440J183Q83P30L34k97o17m54l29n44p02m37m6J4j79k20O4N58J049
54605A31168J231Q12l3p09q70p69o72m11J64O58N95J29j79j36q9l23o70p32l04
54586A28860L95Q24O33J51J02O76J199R27m4r30j131p29k81l22q46j247r88l56
$$ plain form
54568 126893 126810 126603 126627 127429 128625 129098 128468 127624 127550 128206 128959 129505 129842 129744 128929 127619 126451 125797 125526
54549 125526 125396 125392 125659 126306 127322 128609 130112 131924 134051 136075 137365 137811 138113 139120 140990 143171
54533 143171 144952 145835 145618 144473 142933 141573 140667 140189 140006 139957 139887 139779 139743 139812 139881 139889 139861 139775 139651 139771
54513 139771 140426 141333 141796 141590 141198 140929 140409 139355 138256 137687 137437 137043 136765 137130 137701 137289 135531 133413
54495 133413 132058 131705 132161 133437 135424 137512 139054 139941 140370 140399 140094 139790 139764 139891 139981 140200 140754 141370
54477 141370 141534 141142 140505 139835 139138 138601 138627 139370 140505 141591 142470 143213 143903 144588 145306 145980 146342 146066
54459 146066 145059 143678 142632 142520 143367 144656 145840 146663 146952 146407 144925 143028 141638 141330 141991 143145
54443 143145 144398 145473 146109 146150 145712 145161 144885 145027 145343 145365 144773 143618 142146 140546 139024 137991 137841
$$ packed form
54568A26893q3k07K4Q02J196M73o30q44p4O56P53N46L37r8q15j310j168o54k71
54549A25526j30mK67O47J016J287J503J812K127K024J290M46L02J007J870K181
54533A43171J781Q83k17j145j540j360r06m78j83m9p0j08l6O9O9Qk8q6j24J20
54513A39771O55R07M63k06l92k69n20j054j099n69k50l94k78L65N71m12j758k118
54495A33413j355l53M56J276J987K088J542Q87M29K9l05l04k6J27R0K19N54O16
54477A41370J64l92o37o70o97n37K6P43J135J086Q79P43O90O85P18O74L62k76
54459A46066j007j381j046j12Q47J289J184Q23K89n45j482j897j390l08O61J154
54443A43145J253J075O36M1m38n51k76J42L16K2n92j155j472j600j522j033j50
$$ plain form
54426 137841 138491 139380 140078 140709 141639 142856 143854 144138 143761 143374 143727 145035 146816 148390 149472 150170 150524
54409 150524 150410 149972 149761 150154 150871 151350 151445 151409 151355 151183 151031 151307 152069 152801 153117 153394 154301 155874 157520
54390 157520 158930 160510 162712 165236 167244 168206 168285 167974 167608 167269 166908 166429 165788 165098 164524 163950 162903
54373 162903 161000 158464 156049 154420 153683 153460 153315 153084 152924 153109 153733 154601 155434 156142 156796 157413 157968
54356 157968 158581 159448 160464 161096 160879 159983 159107 158871 159377 160314 161299 162045 162351 162025 160874 158822 156100
54339 156100 153283 151060 149930 150002 150896 151829 152053 151431 150545 150149 150583 151738 153339 155064 156600 157902
54323 157902 159363 161434 164086 166812 169142 170971 172485 173973 175581 176937 177180 175805 173429 171285
54309 171285 169894 168773 167492 166355 165666 164914 163377 161250 159571 159037 159331 159606 159205 157942 156157 154618
$$ packed form
54426A37841O50Q89O98O31R30J217R98K84l77l87L53J308J781J574J082O98L54
54409A50524j14m38k11L93P17M79R5l6n4j72j52K76P62P32L16K77R07J573J646
54390A57520J410J580K202K524K008R62P9l11l66l39l61m79o41o90n74n74j047
54373A62903j903k536k415j629p37k23j45k31j60J85O24Q68Q33P08O54O17N55
54356A57968O13Q67J016O32k17q96q76k36N06R37R85P46L06l26j151k052k722
54339A56100k817k223j130P2Q94R33K24o22q86l96M34J155J601J725J536J302
54323A57902J461K071K652K726K330J829J514J488J608J356K43j375k376k144
54309A71285j391j121j281j137o89p52j537k127j679n34K94K75m01j263j785j539
$$ plain form
54293 154618 153994 154216 154558 154456 154062 153902 154202 154697 154926 154595 153767 152806 152045 151454 150761 150000 149759 150733 152962
54274 152962 155598 157479 158026 157663 157314 157472 157834 157893 157681 157668 158022 158327 158150 157589 157067 156783 156627 156578 156921
54255 156921 158021 159971 162479 164979 166774 167257 166280 164386 162576 161631 161598 161893 161840 161110 159851 158629
54239 158629 158129 158639 159758 160811 161530 162019 162099 161248 159452 157619 156651 156340 155729 154383 152715 151203 149978
54222 149978 149300 149697 151174 152774 153461 153258 153016 153207 153391 152924 151797 150609 149888 149616 149356 148791 148139
54205 148139 148010 148801 150222 151476 151878 151320 150228 149202 148680 148798 149437 150349 151285 152120 152938 153913 155032
54188 155032 155995 156513 156586 156382 155965 155377 154868 154724 154878 155016 155099 155399 155902 156131 155877 155715 156380 157830 159337
54169 159337 160358 160859 160932 160609 160089 159631 159060 157885 156106 154420 153320 152441 151336 150476 150755 152090 153279
$$ packed form
54293A54618o24K22L42j02l94j60L00M95K29l31q28r61p61n91o93p61k41R74K229
54274A52962K636J881N47l63l49J58L62N9k12j3L54L05j77n61n22k84j56m9L43
54255A56921J100J950K508K500J795M83r77j894j810r45l3K95n3p30j259j222
54239A58629n00N10J119J053P19M89Q0q51j796j833r68l11o11j346j668j512j225
54222A49978o78L97J477J600O87k03k42J91J84m67j127j188p21k72k60n65o52
54205A48139j29P91J421J254M02n58j092j026n22J18O39R12R36Q35Q18R75J119
54188A55032R63N18P3k04m17n88n09j44J54J38Q3L00N03K29k54j62O65J450J507
54169A59337J021N01P3l23n20m58n71j175j779j686j100q79j105q60K79J335J189
$$ plain form
54152 153279 153428 152867 152394 152203 152124 152407 153525 155232 156545 156797 156311 155773 155340 154624 153351 151793 150640
54135 150640 150525 151549 153149 154591 155607 156383 156935 156938 156353 155836 156171 157502 159369 161293 162958 164111
54119 164111 164749 165314 166243 167340 167962 167860 167498 167503 168109 169145 170215 170815 170630 169900 169265 169157 169473 169779
54101 169779 169543 168232 165720 162747 160599 159995 160529 161310 161858 162157 162206 161904 161308 160721 160527 160966 161917 162871
54083 162871 163346 163437 163684 164320 164970 165218 165130 164985 164914 165108 165967 167613 169481 170903 171895 172941 174101 174876
54065 174876 174924 174490 174056 173905 174047 174254 174146 173595 173016 172962 173436 173973 174302 174517 174659 174751 175328 177236 180543
54046 180543 184164 187056 189310 191587 193968 196147 198498 201987 206803 211894 216313 220444 225321 231113
54032 231113 236995 242395 247680 253404 259438 265250 270709 276136 281592 286534 290357 293069 295306 297704
$$ packed form
54152A53279J49n61m73j91p9K83J118J707J313K52m86n38m33p16j273j558j153
54135A50640j15J024J600J442J016P76N52Ln85n17L35J331J867J924J665J153
54119A64111O38N65R29J097O22j02l62NO06J036J070O00j85p30o35j08L16L06
54101A69779k36j311k512k973k148o04N34P81N48K99M9l02n96n87j94M39R51R54
54083A62871M75R1K47O36O50K48q8j45p1J94Q59J646J868J422R92J046J160P75
54065A74876M8m34m34j51J42K07j08n51n79n4M74N37L29K15J42R2N77J908L307
54046A80543L621K892K254K277K381K179K351L489M816N091M419M131M877N792
54032B31113N882N400N285N724O034N812N459N427N456M942L823K712K237K398
$$ plain form
54018 297704 300358 302872 304875 306369 307538 308340 308519 308071 307365 306607 305454 303495 301046 299102 298488 299371
54002 299371 301606 305200 310294 316853 324420 331878 337457 339426 337148 331320 323164 313650 303545 293588
53988 293588 284148 274994 265929 257452 250292 244442 239186 234113 229623 226221 223719 221405 218806 216012
53974 216012 213339 210862 208378 205816 203589 202318 202067 202070 201460 200203 199059 198727 199282 200416 201872 203510
53958 203510 205143 206430 206983 206717 206206 206394 207609 209045 209634 209333 209093 209595 210631 211840 213428 215778
53942 215778 218749 221801 224588 227083 229311 231336 233420 235936 239118 242991 247352 251705 255475 258579
53928 258579 261538 264815 268262 271557 274902 278864 283614 288821 294231 299868 305620 311146 316421 321948
53914 321948 328180 335005 342129 349698 358153 367563 377446 387196 396371 404532 411163 415955 418998 420561
$$ packed form
54018B97704K654K514K003J494J169Q02J79m48p06p58j153j959k449j944o14Q83
54002B99371K235L594N094O559P567P458N579J969k278n828q156r514j0105r957
53988B93588r440r154r065q477p160n850n256n073m490l402k502k314k599k794
53974B16012k673k477k484k562k227j271k51Lo10j257j144l32N55J134J456J638
53958B03510J633J287N53k66n11J88J215J436N89l01k40N02J036J209J588K350
53942B15778K971L052K787K495K228K025K084K516L182L873M361M353L770L104
53928B58579K959L277L447L295L345L962M750N207N410N637N752N526N275N527
53914C21948O232O825P124P569Q455R410R883R750R175Q161O631M792L043J563
$$ plain form
53900 420561 420876 420266 419265 418203 416708 413986 409781 404801 399987 395583 391188 386568 381939 377381 372377
53885 372377 366225 358817 350807 343113 336300 330381 325047 320099 315659 311860 308391 304641 300391 296094
53871 296094 292240 288749 285305 282075 279586 277879 276261 274088 271426 268711 266030 263083 259691 256004
53857 256004 252230 248433 244710 241366 238745 236947 235839 235302 235376 236104 237320 238667 239870 240972 242291
53842 242291 244227 247099 251111 256324 262783 270809 281120 294266 309616 324900 337116 344150 345650
53829 345650 342487 335664 325992 314557 302937 292559 283998 277234 272473 270212 270306 271398 271783 270753
53815 270753 268835 266777 264720 262416 259822 257203 254845 252878 251290 249959 248796 247970 247851 248638 250174
53800 250174 252304 255154 258826 263028 267386 272015 277330 283227 288865 293472 297047 300047 302683 304923
$$ packed form
53900D20561L15o10j001j062j495k722m205m980m814m404m395m620m629m558n004
53885C72377o152p408q010p694o813n919n334m948m440l799l469l750m250m297
53871B96094l854l491l444l230k489j707j618k173k662k715k681k947l392l687
53857B56004l774l797l723l344k621j798j108n37P4P28J216J347J203J102J319
53842B42291J936K872M012N213O459Q026J0311J3146J5350J5284J2216P034J500
53829C45650l163o823r672j1435j1620j0378q561o764m761k261R4J092L85j030
53815B70753j918k058k057k304k594k619k358j967j588j331j163q26j19P87J536
53800B50174K130K850L672M202M358M629N315N897N638M607L575L000K636K240
$$ plain form
53786 304923 306993 309327 311847 313682 314056 313371 313011 313829 315009 314744 312078 307787 303356 299434 295604
53771 295604 291432 287124 283066 279204 275229 271065 266817 262360 257400 251989 246740 242389 239224 236920
53757 236920 234806 232337 229539 227032 225495 225044 225206 225421 225440 225293 225154 225308 225954 226824 227131 226233 224305
53740 224305 222176 220476 219227 218264 217777 218067 218937 219715 220037 220265 220921 221892 222509 222332 221573 220780 220400 220670
53722 220670 221626 223022 224466 225728 226766 227470 227714 227786 228361 229774 231595 233231 234642 236126 237720 239303
53706 239303 241062 243265 245626 247498 248771 250043 251761 253741 255724 257883 260439 263196 265871 268562
53692 268562 271481 274404 276835 278585 279833 280656 280916 280622 280144 279954 280288 281056 281867 282189 281712 280670 279691
53675 279691 279236 279205 279100 278517 277463 276218 274975 273670 272242 270934 270156 270060 270395 270805 271097 271169 270904 270236
$$ packed form
53786C04923K070K334K520J835L74o85l60Q18J180k65k666m291m431l922l830
53771B95604m172m308m058l862l975m164m248m457m960n411n249m351l165k304
53757B36920k114k469k798k507j537m51J62K15J9j47j39J54O46Q70L07q98j928
53740B24305k129j700j249r63m87K90Q70P78L22K28O56R71O17j77p59p93l80K70
53722B20670R56J396J444J262J038P04K44P2N75J413J821J636J411J484J594J583
53706B39303J759K203K361J872J273J272J718J980J983K159K556K757K675K691
53692B68562K919K923K431J750J248Q23K60k94m78j90L34P68Q11L22m77j042r79
53675B79691m55l1j05n83j054j245j243j305j428j308p78r6L35M10K92P2k65o68
$$ plain form
53657 270236 269206 267854 266200 264376 262699 261548 261255 261956 263295 264395 264519 263860 263332 263532 264262 265139
53641 265139 266092 267055 267736 268151 268937 270581 272583 273994 274622 275167 276235 277718 279185 280400 281379 282279
53625 282279 283359 284852 286833 289343 292404 295713 298586 300693 302604 305112 308161 311085 313824 317136
53611 317136 321435 326119 330380 334087 337478 340539 343227 345901 348882 351767 353840 355114 356444 358487
53597 358487 360991 363273 364988 366109 366520 366115 365263 364689 364658 364576 363742 362328 361208 360834 360688 359963 358366
53580 358366 356083 353382 350638 348417 347043 346199 345300 344159 342947 341706 340322 338827 337327 335774 334249
53565 334249 333327 333588 334854 336470 338248 340443 342799 344495 345305 346044 347437 349166 350522 351479 352546
53550 352546 353960 355557 357188 358812 360424 362325 365162 369266 374179 379198 384057 388626 392316 394486
$$ packed form
53657B70236j030j352j654j824j677j151k93P01J339J100J24o59n28K00P30Q77
53641B65139R53R63O81M15P86J644K002J411O28N45J068J483J467J215R79R00
53625B82279J080J493J981K510L061L309K873K107J911K508L049K924K739L312
53611C17136M299M684M261L707L391L061K688K674K981K885K073J274J330K043
53597C58487K504K282J715J121M11m05q52n74l1q2q34j414j120l74j46p25j597
53580C58366k283k701k744k221j374q44q99j141j212j241j384j495j500j553j525
53565C34249r22K61J266J616J778K195K356J696Q10P39J393J729J356R57J067
53550C52546J414J597J631J624J612J901K837M104M913N019M859M569L690K170
$$ plain form
53536 394486 395384 396074 397432 399666 402730 406604 411118 416033 421516 428166 436353 445794 455904 466331
53522 466331 477047 488140 499667 511610 523897 536511 549534 563046 577160 592289 609127
53511 609127 628079 648856 670952 694299 719027 744744 770596 796115 821519 846964 871878
53500 871878 895374 917189 937998 958819 980096 1001278 1021326 1039704 1056788 1073266 1089498
53489 1089498 1105746 1122639 1140770 1159890 1179047 1197599 1215625 1233342 1250762 1268036 1285509
53478 1285509 1303093 1320084 1335957 1350836 1364808 1377215 1387226 1394766 1400269 1403673 1404390 1402276
53466 1402276 1398060 1392486 1385400 1375934 1363448 1348160 1331048 1313316 1295869 1279060 1262725 1246307
53454 1246307 1229016 1210226 1190063 1169491 1149504 1130150 1110569 1090037 1068809 1047869 1028066
$$ packed form
53536C94486Q98O90J358K234L064L874M514M915N483O650Q187R441J0110J0427
53522D66331J0716J1093J1527J1943J2287J2614J3023J3512J4114J5129J6838
53511F09127J8952K0777K2096K3347K4728K5717K5852K5519K5404K5445K4914
53500H71878K3496K1815K0809K0821K1277K1182K0048J8378J7084J6478J6232
53489A089498J6248J6893J8131J9120J9157J8552J8026J7717J7420J7274J7473
53478A285509J7584J6991J5873J4879J3972J2407J0011P540N503L404P17k114
53466A402276m216n574p086r466j2486j5288j7112j7732j7447j6809j6335j6418
53454A246307j7291j8790k0163k0572j9987j9354j9581k0532k1228k0940j9803
$$ plain form
53443 1028066 1009597 992193 975617 959985 945667 932923 921759 912158 904323 898429 894180 890873
53431 890873 888075 886021 885185 885661 887244 889999 894364 900616 908497 917542 927537 938513 950496 963561
53417 963561 977937 993771 1010833 1028839 1048040 1069116 1092354 1117307 1143454 1170813 1199628
53406 1199628 1229795 1261039 1293440 1327320 1362764 1399701 1438382 1479212 1522100 1566572 1612630
53395 1612630 1660915 1711714 1764361 1818011 1872558 1928223 1984584 2040636 2095735 2149935 2203412
53384 2203412 2256053 2307673 2358063 2406662 2452551 2495068 2534177 2570066 2602583 2631202 2655283
53373 2655283 2674276 2688014 2697050 2702358 2704316 2702096 2694376 2680470 2660491 2634562 2602400 2563807
53361 2563807 2519240 2469809 2416931 2362069 2306402 2250446 2194122 2137394 2080785 2025178 1971308
$$ packed form
53443A028066j8469j7404j6576j5632j4318j2744j1164r601p835n894m249l307
53431H90873k798k054q36M76J583K755M365O252P881R045R995J0976J1983J3065
53417I63561J4376J5834J7062J8006J9201K1076K3238K4953K6147K7359K8815
53406A199628L0167L1244L2401L3880L5444L6937L8681M0830M2888M4472M6058
53395A612630M8285N0799N2647N3650N4547N5665N6361N6052N5099N4200N3477
53384B203412N2641N1620N0390M8599M5889M2517L9109L5889L2517K8619K4081
53373B655283J8993J3738R036N308J958k220p720j3906j9979k5929l2162l8593
53361B563807m4567m9431n2878n4862n5667n5956n6324n6728n6609n5607n3870
$$ plain form
53350 1971308 1919591 1870231 1823171 1778012 1734295 1691802 1650379 1609500 1568432 1526957 1485642
53339 1485642 1445275 1406318 1369084 1334020 1301416 1271020 1242410 1215672 1191276 1169317 1149365
53328 1149365 1131209 1115204 1101544 1089535 1078023 1066371 1054636 1042984 1031463 1020359 1010285
53317 1010285 1001680 994501 988494 983481 979249 975538 972452 970617 970603 972304 975183 979022 984078 990561
53303 990561 998310 1007094 1016964 1028224 1041216 1056166 1073081 1091686 1111657 1132928 1155629 1179782
53291 1179782 1205331 1232438 1261369 1291800 1322555 1352312 1380486 1407216 1432653 1456553 1478421
53280 1478421 1497778 1514247 1527639 1538027 1545606 1550432 1552368 1551270 1547140 1540200 1530909 1519794 1507057
53267 1507057 1492420 1475502 1456303 1435153 1412318 1387938 1362329 1336049 1309617 1283311 1257197
$$ packed form
53350A971308n1717m9360m7060m5159m3717m2493m1423m0879m1068m1475m1315
53339A485642m0367l8957l7234l5064l2604l0396k8610k6738k4396k1959j9952
53328A149365j8156j6005j3660j2009j1512j1652j1735j1652j1521j1104j0074
53317A010285q605p179o007n013m232l711l086j835j4J701K879L839N056O483
53303I90561P749Q784R870J1260J2992J4950J6915J8605J9971K1271K2701K4153
53291A179782K5549K7107K8931L0431L0755K9757K8174K6730K5437K3900K1868
53280A478421J9357J6469J3392J0388P579M826J936j098m130o940r291j1115j2737
53267A507057j4637j6918j9199k1150k2835k4380k5609k6280k6432k6306k6114
$$ plain form
53256 1257197 1231075 1204360 1176359 1146905 1116652 1086605 1057450 1029379 1002341 976245 950879
53245 950879 925770 900327 874263 847925 822041 797112 773181 750185 728199 707141 686638
53234 686638 666586 647600 630463 615271 601567 589115 577975 567983 558939 551257 545507 541043
53222 541043 536009 529243 521445 513786 506082 497213 486863 475843 464839 453888 443171 433338 424614
53209 424614 416312 407750 399263 391793 385669 380276 374868 369406 364443 360290 356447 351987 346526 340610
53195 340610 335028 329985 325273 320972 317437 314527 311382 307279 302471 297942 294461 292013 289997 287824
53181 287824 285367 282883 280539 278157 275586 273206 271686 271182 271085 270686 269953 269490 269831 270847 271789 271924
53165 271924 271218 270334 269842 269540 268758 267157 264991 262776 261107 260610 261444 262747 263167 262218 260704 259553
$$ packed form
53256A257197k6122k6715k8001k9454l0253l0047k9155k8071k7038k6096k5366
53245I50879k5109k5443k6064k6338k5884k4929k3931k2996k1986k1058k0503
53234F86638k0052j8986j7137j5192j3704j2452j1140r992r044p682n750m464
53222E41043n034o766p798p659p704q869j0350j1020j1004j0951j0717r833q724
53209D24614q302q562q487p470o124n393n408n462m963m153l843m460n461n916
53195C40610n582n043m712m301l535k910l145m103m808m529l481k448k016k173
53181B87824k457k484k344k382k571k380j520n04r7l99p33m63L41J016R42J35
53165B71924p06q84m92l02p82j601k166k215j669m97Q34J303M20r49j514j151
$$ plain form
53149 259553 258714 257649 256448 255825 256063 256522 256353 255366 254036 252857 251910 251063 250387 250179 250457 250696 250403
53132 250403 249836 249700 250047 249987 248796 246905 245401 244822 244878 245162 245587 246073 246294 246014 245487 245349 246092 247646
53114 247646 249443 250859 251608 251657 250939 249473 247763 246612 246312 246351 246174 245833 245533 244933 243491 241353 239345
53097 239345 238091 237579 237488 237470 237150 236440 235879 236123 236972 237458 237056 236262 235700 235187 234102 232315 230405 229128
53079 229128 228915 229557 230208 230079 229428 229392 230472 231633 231396 229449 226660 223945 221785 220495 220089 219941 219424
53062 219424 218924 219445 221087 222742 223511 223667 223879 224234 224545 224986 225825 226955 228220 229744 231433 232579
53046 232579 232662 232176 232054 232548 233288 234054 234690 234518 232867 230163 227659 225952 224681 223745 223749 224792 225767 225587
53028 225587 224412 222996 221438 219460 217480 216416 216436 216724 216645 216552 217159 218514 219849 220293 219622 218403 217442
$$ packed form
53149B59553q39j065j201o23K38M59j69r87j330j179r47q47o76k08K78K39k93
53132B50403n67j36L47o0j191j891j504n79N6K84M25M86K21k80n27j38P43J554
53114B47646J797J416P49M9p18j466j710j151l00L9j77l41l00o00j442k138k008
53097B39345j254n12r1j8l20p10n61K44Q49M86m02p94n62n13j085j787j910j277
53079B29128k13O42O51j29o51l6J080J161k37j947k789k715k160j290m06j48n17
53062B19424n00N21J642J655P69J56K12L55L11M41Q39J130J265J524J689J146
53046B32579Q3m86j22M94P40P66O36j72j651k704k504j707j271r36MJ043R75j80
53028B25587j175j416j558j978j980j064K0K88p9r3O07J355J335M44o71j219r61
$$ plain form
53011 217442 217065 216997 216924 216860 216920 217106 217525 218414 219646 220618 221028 221370 222205 223344 224285 225085 226032 226725 226330
52992 226330 224788 223039 221930 221526 221530 221691 221706 221398 221144 221516 222331 222776 222669 222824 223810 225119 226040 226661
52974 226661 227406 228210 228839 229491 230406 231323 232086 233304 235526 238067 239663 240211 240833 242142 243447 243978 243992
52957 243992 244098 244174 243612 242271 240626 239164 238095 237405 236815 235777 233978 231810 230051 229073 228562 228000
52941 228000 227158 226111 224940 223536 221670 219280 216760 214786 213754 213416 213201 212795 212295 211933 211855 212107
52925 212107 212600 213099 213458 213861 214605 215571 216160 215944 215185 214595 214703 215617 217116 218609 219138 218031 215788
52908 215788 213967 213787 215023 216487 217409 217959 218552 219228 219811 220256 220563 220654 220646 220979 221905 222986 223504 223286
52890 223286 222778 222283 221629 220718 219925 219589 219407 218822 217863 217087 216705 216340 215790 215468 215704 216080 216050 215859 216201
$$ packed form
53011B17442l77o8p3o4O0J86M19Q89J232R72M10L42Q35J139R41Q00R47O93l95
52992B26330j542j749j109m04MJ61J5l08k54L72Q15M45j07J55R86J309R21O21
52974B26661P45Q04O29O52R15R17P63J218K222K541J596N48O22J309J305N31J4
52957B43992J06P6n62j341j645j462j069o90n90j038j799k168j759r78n11n62
52941B28000q42j047j171j404j866k390k520j974j032l38k15m06n00l62p8K52
52925B12107M93M99L59M03P44R66N89k16p59n90J08R14J499J493N29j107k243
52908B15788j821j80J236J464R22N50N93O76N83M45L07R1qL33R26J081N18k18
52890B23286n08m95o54r11p93l36j82n85r59p76l82l65n50l22K36L76l0j91L42
$$ plain form
52871 216201 217121 218033 218839 220154 222127 223894 224775 225344 226583 228467 230230 231696 233511 236167 239614
52856 239614 243658 247868 251149 252438 251996 251084 250138 248324 245317 242223 239929 237576 233900 229361 225600
52841 225600 223146 221016 218517 216082 214126 212280 210279 208595 207554 206641 205359 204169 203820 204242 204829
52826 204829 205522 206780 208618 210399 211641 212390 212677 212196 210839 209190 208133 208078 208740 209572 210313 211232 212905
52809 212905 215611 218949 222177 224911 227194 228893 229436 228455 226367 223910 221303 218310 215046 212164 210098
52794 210098 208523 206851 204939 203023 201236 199610 198373 197783 197685 197529 196937 195972 194943 194247 194359 195516
52778 195516 197264 198704 199418 199850 200550 201415 202038 202496 203294 204621 206115 207415 208579 209834 211222 212661
52762 212661 214120 215478 216302 216051 214664 212865 211734 211831 212734 213489 213486 212871 212235 212138 212865 214296 215831 216698
$$ packed form
52871B16201R20R12Q06J315J973J767Q81N69J239J884J763J466J815K656L447
52856B39614M044M210L281J289m42r12r46j814l007l094k294k353l676m539l761
52841B25600k454k130k499k435j956j846k001j684j041r13j282j190l49M22N87
52826B04829O93J258J838J781J242P49K87m81j357j649j057n5O62Q32P41R19J673
52809B12905K706L338L228K734K283J699N43r81k088k457k607k993l264k882k066
52794B10098j575j672j912j916j787j626j237n90r8j56n92r65j029o96J12J157
52778A95516J748J440P14M32P00Q65O23M58P98J327J494J300J164J255J388J439
52762B12661J459J358Q24k51j387j799j131R7R03P55lo15o36r7P27J431J535Q67
$$ plain form
52744 216698 216565 215790 214959 214388 214178 214499 215480 216948 218552 220103 221542 222678 223250 223314 223340 223846 225039
52727 225039 226843 229039 231252 232843 233025 231309 228005 224246 221260 219532 218695 218177 217660 216947 215876
52712 215876 214590 213559 213006 212609 212095 211757 211876 211916 210975 209073 207344 206751 207028 207162 206630 205878 205705 206372
52694 206372 207311 207738 207612 207749 208768 210148 210805 210534 210286 210944 212390 214072 215894 218063 220347 222063
52678 222063 222773 222660 222230 221915 221953 222318 222684 222664 222194 221627 221376 221531 221883 222257 222762 223639 224887 226113 226872
52659 226872 227104 227171 227453 228037 228812 229805 231355 233914 237582 241822 245744 248780 250902 252110 251970 250000
52643 250000 246440 242306 238627 235828 233839 232491 231691 231388 231432 231419 230849 229713 228807 229070 230561 232491
52627 232491 234256 235946 237751 239424 240701 241738 242625 242759 241406 238803 236153 234348 233143 231819 230295
$$ packed form
52744B16698j33p75q31n71k10L21R81J468J604J551J439J136N72O4K6N06J193
52727B25039J804K196K213J591J82j716l304l759k986j728q37n18n17p13j071
52712B15876j286j031n53l97n14l38J19M0r41j902j729n93K77J34n32p52j73O67
52694B06372R39M27j26J37J019J380O57k71k48O58J446J682J822K169K284J716
52678B22063P10j13m30l15L8L65L66k0m70n67k51J55L52L74N05Q77J248J226P59
52659B26872K32O7K82N84P75R93J550K559L668M240L922L036K122J208j40j970
52643B50000l560m134l679k799j989j348q00l03M4j3n70j136r06K63J491J930
52627B32491J765J690J805J673J277J037Q87J34j353k603k650j805j205j324j524
$$ plain form
52612 230295 229233 229169 229893 230728 231185 231209 230922 230345 229455 228395 227495 227085 227323 228150 229311 230422 231148 231416
52594 231416 231502 231888 232965 234718 236684 238341 239589 240707 241828 242745 243383 244164 245531 247270 248693 249408
52578 249408 249565 249393 248987 248569 248519 248935 249489 249877 250094 250097 249626 248677 247849 247783 248331 248641 248032 246545 244733
52559 244733 243199 242360 242355 242953 243588 243611 242595 240539 237885 235345 233627 233220 234218 236175 238182 239389 239591
52542 239591 239219 238746 238280 237794 237478 237596 238111 238702 239154 239588 240277 241301 242395 243078 242993 242238 241402 241220
52524 241220 242054 243607 245153 246126 246523 246694 246825 246841 246776 246895 247303 247745 248088 248734 250176 252321 254688 257144
52506 257144 259972 263203 266297 268565 269549 268978 266833 263601 260116 256985 254418 252614 251823 251850 251906 251243
52490 251243 249755 247918 246465 246140 247180 248830 249830 249742 249405 249807 250973 252350 253776 255445 257224
$$ packed form
52612B30295j062o4P24Q35M57K4k87n77q90j060r00m10K38Q27J161J111P26K68
52594B31416Q6L86J077J753J966J657J248J118J121R17O38P81J367J739J423P15
52578B49408J57j72m06m18n0M16N54L88K17Lm71r49q28o6N48L10o09j487j812
52559B44733j534q39nN98O35K3j016k056k654k540j718m07R98J957K007J207K02
52542B39591l72m73m66m86l16J18N15N91M52M34O89J024J094O83q5p55q36j82
52524B41220Q34J553J546R73L97J71J31J6o5J19M08M42L43O46J442K145K367K456
52506B57144K828L231L094K268R84n71k145l232l485l131k567j804p91K7N6o63
52490B51243j488j837j453l25J040J650J000q8l37M02J166J377J426J669J779
$$ plain form
52475 257224 258716 259899 261140 262516 263644 264265 264595 264948 265353 265693 265961 266195 266358 266533 267101 268511 270770
52458 270770 273239 275040 275698 275331 274223 272444 270012 267184 264256 261206 257922 254729 252272 250826 250135
52443 250135 249904 250001 250114 249803 249097 248536 248314 247853 246526 244417 242127 240266 239387 239758 240777 241189 240455
52426 240455 239452 239310 240092 241239 242680 244628 246630 247848 248198 248337 248556 248532 248193 247991 248169 248575 249456
52409 249456 251671 255741 261230 267364 273825 280717 288287 296934 306886 317453 326954 333721 336934 336447
52395 336447 332492 326010 318652 311741 305400 299156 293149 288189 284767 282644 281452 281089 281206 280854 279221
52380 279221 276713 274817 274677 276032 277752 279187 280605 282430 284622 286989 289655 292791 296172 299396
52366 299396 302366 305174 307660 309499 310629 311253 311524 311597 311826 312423 313024 313090 312744 312680 313214 313947 314494 314987
$$ packed form
52475B57224J492J183J241J376J128O21L30L53M05L40K68K34J63J75N68J410K259
52458B70770K469J801O58l67j108j779k432k828k928l050l284l193k457j446o91
52443B50135k31R7J13l11p06n61k22m61j327k109k290j861q79L71J019M12p34
52426B40455j003j42P82J147J441J948K002J218L50J39K19k4l39k02J78M06Q81
52409B49456K215M070N489O134O461O892P570Q647R952J0567R501O767L213m87
52395C36447l955o482p358o911o341o244o007m960l422k123j192l63J17l52j633
52380B79221k508j896j40J355J720J435J418J825K192K367K666L136L381L224
52366B99396K970K808K486J839J130O24K71P3K29N97O01O6l46o4N34P33N47M93
$$ plain form
52348 314987 315634 316199 316280 315847 315280 315067 315595 316977 318939 321048 323078 325049 327005 329073 331649 335078
52332 335078 339155 343396 347849 353163 359752 367354 375572 384402 393995 404303 415210 426681 438560
52319 438560 450443 461882 472481 481914 490301 498514 507522 517341 527232 536988 547229 558209 569223
52306 569223 579748 590394 602025 614533 627251 640081 653426 667257 680993 694102 706146
52295 706146 716509 724858 731790 738227 744143 748573 750962 751814 751852 751179 749583 747211 744554 741985 739578
52280 739578 737235 734841 732423 730151 728127 726208 724271 722493 721161 720366 720196 721073 723473 727342 732196
52265 732196 737781 744262 751753 760056 768832 777643 785816 792831 799107 806109 815332 827176 840790 854839
52251 854839 868453 881635 894718 907378 918470 927192 934013 939837 944537 947186 947793 947787 948365 949149
$$ packed form
52348C14987O47N65Q1m33n67k13N28J382J962K109K030J971J956K068K576L429
52332C35078M077M241M453N314O589P602Q218Q830R593J0308J0907J1471J1879
52319D38560J1883J1439J0599R433Q387Q213R008R819R891R756J0241J0980J1014
52306E69223J0525J0646J1631J2508J2718J2830J3345J3831J3736J3109J2044
52295G06146J0363Q349O932O437N916M430K389Q52L8o73j596k372k657k569k407
52280G39578k343k394k418k272k024j919j937j778j332p95j70Q77K400L869M854
52265G32196N585O481P491Q303Q776Q811Q173P015O276P002R223J1844J3614J4049
52251H54839J3614J3182J3083J2660J1092Q722O821N824M700K649O07oN78P84
$$ plain form
52237 949149 949091 948069 946859 945944 945171 944398 943699 942899 941517 939342 936652 933783 930840 927914 925146 922452
52221 922452 919535 916371 913416 911097 909337 907833 906648 906217 906738 907814 908849 909750 911085 913507 917134
52206 917134 921611 926550 931601 936204 939829 942738 946003 950291 954938 958824 961946 965435 969984 975095
52192 975095 980148 985479 991745 998663 1005079 1010179 1014093 1017353 1020182 1022347 1023325 1022601 1020063 1016144 1011351
52177 1011351 1005783 999384 992523 985810 979380 972815 965880 958940 952535 946938 942256 938568 935742 933467
52163 933467 931656 930557 930383 931117 932759 935249 938005 940042 940871 940880 940579 939976 939076 938397 938365 938640 938674 938681 939415
52144 939415 941160 943472 945740 947449 948146 947849 947321 947304 947534 947072 945481 943078 940307 937656 936019 936218
52128 936218 938130 941202 945796 952972 962765 973843 985324 997875 1012369 1028402 1044957 1061753
$$ packed form
52237I49149n8j022j210r15p73p73o99q00j382k175k690k869k943k926k768k694
52221I22452k917l164k955k319j760j504j185m31N21J076J035R01J335K422L627
52206I17134M477M939N051M603L625K909L265M288M647L886L122L489M549N111
52192I75095N053N331O266O918O416N100L914L260K829K165R78p24k538l919m793
52177A011351n568o399o861o713o430o565o935o940o405n597m682l688k826k275
52163I33467j811j099j74P34J642K490K756K037Q29Rl01o03r00o79l2K75L4PP34
52144I39415J745K312K268J709O97k97n28j7K30m62j591k403k771k651j637J99
52128I36218J912L072M594P176R793J1078J1481J2551J4494J6033J6555J6796
$$ plain form
52116 1061753 1079054 1096639 1113832 1130255 1145883 1160676 1174716 1188302 1201312 1212932 1222727
52105 1222727 1231607 1240984 1251270 1261937 1272707 1283808 1295202 1306419 1317221 1327759 1338033 1347719
52093 1347719 1356471 1363757 1368497 1369526 1366489 1359876 1350352 1338633 1325818 1313007 1300533 1288185 1276260
52080 1276260 1265730 1257313 1250997 1246460 1243277 1240645 1237691 1234361 1231406 1229320 1227871 1226910 1226956 1228626
52066 1228626 1231951 1236506 1241786 1247287 1252720 1258377 1264769 1271720 1278375 1284320 1290108 1296406 1303227 1310296
52052 1310296 1317503 1324537 1330643 1335268 1338522 1340568 1341076 1339715 1336652 1332020 1325445 1316796 1307006 1297386
52038 1297386 1288395 1279764 1271601 1264561 1258907 1254044 1249103 1243625 1237704 1231826 1226462 1221435 1215884 1209281
52024 1209281 1202248 1195827 1190116 1184290 1177856 1171202 1164801 1158601 1152471 1146712 1141773 1137775 1134521 1131723
$$ packed form
52116A061753J7301J7585J7193J6423J5628J4793J4040J3586J3010J1620R795
52105A222727Q880R377J0286J0667J0770J1101J1394J1217J0802J0538J0274R686
52093A347719Q752P286M740J029l037o613r524j1719j2815j2811j2474j2348j1925
52080A276260j0530q417o316m537l183k632k954l330k955k086j449r61M6J670
52066A228626L325M555N280N501N433N657O392O951O655N945N788O298O821P069
52052A310296P207P034O106M625L254K046N08j361l063m632o575q649r790r620
52038A297386q991q631q163p040n654m863m941n478n921n878n364n027n551o603
52024A209281p033o421n711n826o434o654o401o200o130n759m939l998l254k798
$$ plain form
52010 1131723 1129086 1126381 1123516 1120279 1116015 1109889 1101448 1090515 1076589 1058946 1037657 1014056 989875
51997 989875 966100 942870 920115 898012 877044 857887 841023 826181 812342 798570 784727
51986 784727 771233 758312 745754 733261 720685 707915 694782 681137 666974 652403 637589
51975 637589 622700 607981 593953 581388 570845 562217 555022 549190 545303 544009 545448 549329 555116
51962 555116 561973 568963 575811 583134 591409 599812 606531 610254 610983 609411 606028 600943 594272 586450
51948 586450 578348 571075 565478 561753 559750 559571 561536 565612 571475 579270 589756 603265 618856 634924
51934 634924 650402 664916 678112 689487 698820 706084 710751 711758 708457 701175 690482 676357 658599
51921 658599 637981 616461 596088 577848 561544 546534 532511 519686 508402 498662 490142 482655
$$ packed form
52010A131723k637k705k865l237m264o126q441j0933j3926j7643k1289k3601k4181
51997I89875k3775k3230k2755k2103k0968j9157j6864j4842j3839j3772j3843
51986G84727j3494j2921j2558j2493j2576j2770j3133j3645j4163j4571j4814
51975F37589j4889j4719j4028j2565j0543q628p195n832l887j294J439L881N787
51962E55116O857O990O848P323Q275Q403O719L723P29j572l383n085o671p822
51948E86450q102p273n597l725k003j79J965M076N863P795J0486J3509J5591J6068
51934F34924J5478J4514J3196J1375R333P264M667J007l301p282j0693j4125j7758
51921F58599k0618k1520k0373j8240j6304j5010j4023j2825j1284r740q520p487
$$ plain form
51909 482655 476390 471577 468131 465862 464928 465825 468965 474411 481876 490727 500067 509176 517899 526278 533728
51894 533728 538852 540235 537267 530247 520040 507863 495074 482796 471715 462330 455216 450851 449269
51881 449269 450095 452905 457533 464163 473264 485305 500375 518109 538048 559915 583510 608566 634846
51868 634846 662123 689650 715724 737991 754195 762652 762427 753573 737269 715440 690231 663904
51856 663904 638826 616824 598393 582855 569449 557953 548299 540077 532682 525543 518040 509637 500480
51843 500480 491489 483411 475976 468446 460767 453671 447697 442738 438675 435854 434562 434392 434652 435326 437112
51828 437112 440363 444278 447399 448825 448788 448126 447442 446817 446019 444747 442798 440315 437889 436166 435371 435502
51812 435502 436966 440478 446001 452144 457068 459868 460754 460148 458194 455168 451625 447831 443439 438202 432832
$$ packed form
51909D82655o265m813l446k269r34Q97L140N446P465Q851R340R109Q723Q379P450
51894E33728N124J383k968p020j0207j2177j2789j2278j1081r385p114m365j582
51881D49269Q26K810M628O630R101J2041J5070J7734J9939K1867K3595K5056K6280
51868F34846K7277K7527K6074K2267J6204Q457k25q854j6304k1829k5209k6327
51856F63904k5078k2002j8431j5538j3406j1496r654q222p395p139p503q403r157
51843E00480q991q078p435p530p679p096n974m959m063k821j292j70K60O74J786
51828D37112L251L915L121J426l7o62o84o25p98j272j949k483k426j723p95J31
51812D35502J464L512N523O143M924K800Q86o06j954l026l543l794m392n237n370
$$ plain form
51797 432832 428744 426891 427022 428055 428945 429172 428647 427447 425746 423863 422109 420479 418698 416756 415178
51782 415178 414468 414354 413987 412853 411102 408964 406360 403399 400809 399412 399376 400383 402338 405460 409787
51767 409787 415139 421607 429591 439053 449095 458543 466766 473624 478775 481491 481257 478265 473104 466153
51753 466153 457607 448069 438686 430406 423308 416990 411463 407258 404623 403089 401986 401103 400676 401071 402703
51738 402703 405992 411103 417877 426132 435719 446139 456531 466302 475315 483128 488689 491475 492497 493409
51724 493409 494919 496941 499950 504810 510918 515718 516806 513949 508557 501966 494994 488550 483535 480115
51710 480115 477735 475904 474463 473111 471293 468870 466624 465882 467632 471881 477588 483132 486992 488255
51696 488255 486789 483326 479342 476425 475393 476114 478105 480898 483753 485603 485680 483859 480067 473855 465116
$$ packed form
51797D32832m088j853J31J033Q90K27n25j200j701j883j754j630j781j942j578
51782D15178p10j14l67j134j751k138k604k961k590j397l6J007J955L122M327
51767D09787N352O468P984R462J0042R448Q223O858N151K716k34k992n161o951
51753D66153q546r538r383q280p098o318n527m205k635j534j103q83m27L95J632
51738D02703L289N111O774Q255R587J0420J0392R771R013P813N561K786J022R12
51724D93409J510K022L009M860O108M800J088k857n392o591o972o444n015l420
51710D80115k380j831j441j352j818k423k246p42J750M249N707N544L860J263
51696D88255j466l463l984k917j032P21J991K793K855J850P7j821l792o212q739
$$ plain form
51681 465116 454940 445139 437024 431015 427194 425604 426076 428270 431899 436509 441143 444811 447360 449518
51667 449518 452104 455636 460651 467782 477260 488542 500410 511097 518505 521027 518462 511932 502896
51654 502896 492635 482460 473675 467067 462905 461525 463357 468127 474603 481306 486933 489923 488550 482183
51640 482183 472035 460048 447340 434246 421389 409869 400415 392954 386964 381827 376982 372334 368531
51627 368531 366286 365417 365032 364683 364757 365584 366724 367463 367595 367359 366937 366419 366018 365905 365853 365378 364308 362991
51609 362991 361916 361269 360888 360535 360102 359623 359153 358731 358525 358983 360716 364093 369018 375207 382675 391857
51593 391857 403214 416740 431764 446995 460676 470915 476355 476874 473699 468706 463463 458783 454982
51580 454982 452343 451295 452304 455780 462156 471941 485503 502610 522169 542572 562601 582208 602408
$$ packed form
51681D65116j0176r801q115o009l821j590M72K194L629M610M634L668K549K158
51667D49518K586L532N015P131R478J1282J1868J0687P408K522k565o530r036
51654E02896j0261j0175q785o608m162j380J832M770O476O703N627K990j373o367
51640D82183j0148j1987j2708j3094j2857j1520r454p461n990n137m845m648l803
51627C68531k245q69l85l49P4Q27J140P39J32k36m22n18m01j13n2m75j070j317
51609C62991j075o47l81l53m33m79m70m22k06M58J733L377M925O189P468R182
51593C91857J1357J3526J5024J5231J3681J0239N440N19l175m993n243m680l801
51580D54982k639j048J009L476O376R785J3562J7107J9559K0403K0029J9607K0200
$$ plain form
51567 602408 624253 647726 671496 693802 713737 731944 750349 771351 797100 828998 867444
51556 867444 911955 961558 1014856 1069382 1121140 1165529 1199233 1221200 1231762 1231162 1219193 1195928
51544 1195928 1162326 1120196 1071820 1019459 964866 909274 853972 800665 750975 705813 665620
51533 665620 630938 602118 578435 558213 540125 524010 510226 498628 488574 479641 471875 465340
51521 465340 459748 454632 449821 445608 442391 440118 438202 436111 433829 431561 429181 426401 423388 420737
51507 420737 418715 416917 414765 412050 408891 405595 402655 400473 398806 396862 394220 391400 389245 388000
51493 388000 387253 386543 385756 385161 385290 386557 388701 390837 392268 393033 393424 393370 392678 391550 390314 388799 386534
51476 386534 383528 380382 377666 375597 374280 373747 373643 373400 372910 372582 372589 372564 372433 372981 375038 378317 381736
$$ packed form
51567F02408K1845K3473K3770K2306J9935J8207J8405K1002K5749L1898L8446
51556H67444M4511M9603N3298N4526N1758M4389L3704K1967J0562o00j1969k3265
51544A195928l3602m2130m8376n2361n4593n5592n5302n3307m9690m5162m0193
51533F65620l4682k8820k3683k0222j8088j6115j3784j1598j0054q933p766o535
51521D65340n592n116m811m213l217k273j916k091k282k268k380k780l013k651
51507D20737k022j798k152k715l159l296k940k182j667j944k642k820k155j245
51493C88000p47p10p87n95J29J267K144K136J431P65L91n4o92j128j236j515k265
51476C86534l006l146k716k069j317n33j04k43m90l28Pk5j31N48K057L279L419
$$ plain form
51459 381736 384754 387676 390494 392179 391703 389328 386332 383626 381211 378926 377039 375987 376045 377502 380712
51444 380712 385739 392435 401169 412878 427728 444086 459464 472311 482339 489546 493966 496472 498717
51431 498717 501646 504482 505540 503675 498734 491141 481588 470906 459866 449182 439637 431776 425313
51418 425313 419352 413505 408356 404613 402274 401003 400809 401834 403823 406330 409180 412258 415068 417033
51404 417033 418087 418537 418589 418434 418571 419504 421194 423337 426065 429879 434829 440263 445482 450383 455450 461369
51388 461369 468559 476806 485504 494660 505565 520094 539416 563770 593326 628724 670668 719496
51376 719496 775279 837889 906691 980199 1055998 1130709 1200173 1260259 1307998 1342003 1361880
51365 1361880 1367420 1358408 1335065 1298640 1251538 1196687 1136513 1072597 1006339 939626 874600 813053
$$ packed form
51459C81736L018K922K818J685m76k375k996k706k415k285j887j052N8J457L210
51444C80712N027O696Q734J1709J4850J6358J5378J2847J0028P207M420K506K245
51431D98717K929K836J058j865m941p593r553j0682j1040j0684r545p861o463
51418D25313n961n847n149l743k339j271j94J025J989K507K850L078K810J965
51404D17033J054M50N2j55J37R33J690K143K728L814M950N434N219M901N067N919
51388D61369P190Q247Q698R156J0905J4529J9322K4354K9556L5398M1944M8828
51376G19496N5783O2610O8802P3508P5799P4711O9464O0086M7739L4005J9877
51365A361880N540r012k3343l6425m7102n4851o0174o3916o6258o6713o5026o1547
$$ plain form
51353 813053 756341 705579 661295 623019 589691 560612 535638 514555 496593 480646 465711
51342 465711 451249 437465 425185 415093 407070 400426 394597 389308 384353 379722 375818 373062 371334
51329 371334 370201 369550 369502 369835 370030 369817 369175 367932 366030 364113 363131 363243 363747 364149 364632 365378 366175 366952
51311 366952 367992 369336 370615 371785 373308 375146 376264 375767 374112 372595 371899 371633 371038 369633 367394
51296 367394 364761 362345 360285 358024 355002 351373 347748 344512 341769 339748 338800 338995 339964 341181 342330
51281 342330 343560 345432 348411 352345 356726 361427 366648 372055 376698 380238 383630 387898 392618 396374
51267 396374 398518 399755 400998 402399 403626 404487 404911 404685 403597 401739 399406 396767 393747 390220 386262
51252 386262 382185 378347 374964 372177 370132 368752 367458 365519 362831 360056 357840 356176 354739 353542
$$ packed form
51353H13053n6712n0762m4284l8276l3328k9079k4974k1083j7962j5947j4935
51342D65711j4462j3784j2280j0092q023o644n829n289m955m631l904k756j728
51329C71334j133o51m8L33J95k13o42j243j902j917r82J12N04M02M83P46P97P77
51311C66952J040J344J279J170J523J838J118m97j655j517o96k66n95j405k239
51296C67394k633k416k060k261l022l629l625l236k743k021r48J95R69J217J149
51281C42330J230J872K979L934M381M701N221N407M643L540L392M268M720L756
51267C96374K144J237J243J401J227Q61M24k26j088j858k333k639l020l527l958
51252C86262m077l838l383k787k045j380j294j939k688k775k216j664j437j197
$$ plain form
51238 353542 352885 352820 352996 352997 352627 351948 351218 350747 350664 350893 351371 352120 353109 354288 355797 357768 359780 360984
51220 360984 361048 360578 360296 360173 359823 359407 359568 360611 362233 364039 365905 367862 369953 372253 374807 377574
51204 377574 380547 383725 386834 389382 391267 393038 395168 397385 399143 400426 401502 402150 401861 400701 399296
51189 399296 397906 396223 394206 392492 391701 391814 392482 393473 394627 395862 397499 400089 403533 406836 409149
51174 409149 410731 412324 413883 414523 413721 412035 410446 409330 408268 406617 404108 400993 397789 394854 392142
51159 392142 389428 386762 384589 383283 382589 381675 379827 377112 374320 372279 371273 371035 371123 371212 371171 371028 370901
51142 370901 370898 371044 371283 371467 371376 370887 370195 369742 369811 370257 370718 371077 371621 372736 374406 376010 376755 376521 376173
51123 376173 376714 378181 379781 381206 383250 386754 391354 395831 399537 402883 406473 410307 414020 417445
$$ packed form
51238C53542o57o5J76Jl70o79p30m71q3K29M78P49R89J179J509J971K012J204
51220C60984O4m70k82j23l50m16J61J043J622J806J866J957K091K300K554K767
51204C77574K973L178L109K548J885J771K130K217J758J283J076O48k89j160j405
51189C99296j390j683k017j714p91J13O68R91J154J235J637K590L444L303K313
51174D09149J582J593J559O40q02j686j589j116j062j651k509l115l204k935k712
51159C92142k714k666k173j306o94r14j848k715k792k041j006k38Q8Q9m1j43j27
51142C70901lJ46K39J84r1m89o92m53O9M46M61L59N44J115J670J604P45k34l48
51123C76173N41J467J600J425K044L504M600M477L706L346L590L834L713L425
$$ plain form
51109 417445 420596 423345 425432 426762 427453 427554 426881 425230 422781 420184 418115 416763 415863 415216 414962 415272
51093 415272 415988 416735 417177 417011 415949 413999 411706 409862 409002 409207 410214 411546 412762 413849 415165 416759
51077 416759 418040 418552 418931 420556 424131 428941 433459 436393 437237 436390 434977 434210 434635 436051 438133 440859
51061 440859 444355 448821 454802 463077 473847 486111 498087 508195 515593 520206 522728 524617 527635
51048 527635 533019 540923 550591 561052 571739 582592 593601 604293 613761 621251 626671 630533 633544
51035 633544 636295 639159 642098 644409 644697 641426 633788 622162 607701 591472 574145 556452 539595
51022 539595 524848 512841 503463 496459 491830 489579 489293 490182 491573 493270 495463 498395 502254 507395
51008 507395 514299 522918 532114 540310 546953 552981 559555 566710 573667 580079 586262 592340 597930 602906
$$ packed form
51109D17445L151K749K087J330O91J01o73j651k449k597k069j352r00o47k54L10
51093D15272P16P47M42j66j062j950k293j844q60K05J007J332J216J087J316J594
51077D16759J281N12L79J625L575M810M518K934Q44q47j413p67M25J416K082K726
51061D40859L496M466N981Q275J0770J2264J1976J0108P398M613K522J889L018
51048E27635N384P904R668J0461J0687J0853J1009J0692R468P490N420L862L011
51035F33544K751K864K939K311K88l271p638j1626j4461j6229j7327j7693j6857
51022E39595j4747j2007r378p004m629k251k86Q89J391J697K193K932L859N141
51008E07395O904Q619R196Q196O643O028O574P155O957O412O183O078N590M976
$$ plain form
50994 602906 607847 613337 619261 625286 631717 639403 648814 659614 671230 683600 697232 712680 730061
50981 730061 749020 769032 789664 810477 830650 848815 863459 873676 879641 882376 883097 882831 882566
50968 882566 883519 886933 893607 903888 918166 937059 960877 989097 1020675 1054809 1091210 1129729
50956 1129729 1169978 1211257 1252539 1292461 1329609 1363104 1392978 1419971 1444922 1468254 1489878
50945 1489878 1509606 1527735 1545259 1563570 1583942 1607077 1632690 1659267 1684461 1706011 1722449
50934 1722449 1733154 1738234 1738529 1735275 1729230 1720168 1707430 1690730 1670144 1645630 1617057 1584550
50922 1584550 1548359 1508476 1464887 1418187 1369478 1319651 1269261 1219220 1171001 1125791 1083750
50911 1083750 1044448 1007882 974666 945228 919100 895168 872649 851688 832875 816248 801069
$$ packed form
50994F02906M941N490N924O025O431P686R411J0800J1616J2370J3632J5448J7381
50981G30061J8959K0012K0632K0813K0173J8165J4644J0217N965K735P21k66k65
50968H82566R53L414O674J0281J4278J8893K3818K8220L1578L4134L6401L8519
50956A129729M0249M1279M1282L9922L7148L3495K9874K6993K4951K3332K1624
50945A489878J9728J8129J7524J8311K0372K3135K5613K6577K5194K1550J6438
50934A722449J0705N080K95l254o045r062j2738j6700k0586k4514k8573l2507
50922A584550l6191l9883m3589m6700m8709m9827n0390n0041m8219m5210m2041
50911A083750l9302l6566l3216k9438k6128k3932k2519k0961j8813j6627j5179
$$ plain form
50900 801069 786704 773346 761551 751337 742227 734031 727023 721302 716470 712076 708046 704483 701314
50887 701314 698350 695525 693041 691419 691289 692810 695266 697603 699477 701495 704390 708302 712956 718140
50873 718140 723800 729950 736710 744240 752429 760896 769495 778654 789040 800994 814463 829292 845409
50860 845409 862834 881768 902745 926505 953550 983804 1016871 1052829 1092700 1137799 1188574
50849 1188574 1244426 1304874 1370512 1442371 1520653 1604574 1693306 1786421 1883255 1982330 2081689
50838 2081689 2179636 2274904 2366141 2451277 2527666 2593265 2647805 2692368 2727654 2753317 2769546
50827 2769546 2778629 2784102 2788641 2793702 2800864 2812267 2829395 2852304 2880300 2912557 2947708 2983482
50815 2983482 3017075 3045351 3064602 3071127 3062670 3038904 3000160 2946357 2877529 2794728 2699743 2594460
$$ packed form
50900H01069j4365j3358j1795j0214r110q196p008n721m832m394m030l563l169
50887G01314k964k825k484j622j30J521K456K337J874K018K895L912M654N184
50873G18140N660O150O760P530Q189Q467Q599R159J0386J1954J3469J4829J6117
50860H45409J7425J8934K0977K3760K7045L0254L3067L5958L9871M5099N0775
50849A188574N5852O0448O5638P1859P8282Q3921Q8732R3115R6834R9075R9359
50838B081689R7947R5268R1237Q5136P6389O5599N4540M4563L5286K5663J6229
50827B769546R083N473M539N061P162J1403J7128K2909K7996L2257L5151L5774
50815B983482L3593K8276J9251O525q457k3766l8744n3803o8828q2801r4985j05283
$$ plain form
50803 2594460 2481099 2362785 2243255 2126011 2013812 1908491 1810912 1721470 1640887 1570153
50793 1570153 1509497 1458022 1414637 1378758 1349768 1326556 1308183 1294398 1284868 1278452 1273931 1270882
50781 1270882 1269116 1267750 1265692 1262711 1259124 1254697 1248734 1241163 1232640 1223487 1213223 1201281 1187614
50768 1187614 1172530 1156395 1139501 1121712 1102306 1080703 1057412 1033798 1010895 988873 967568
50757 967568 947017 927436 909231 893172 880106 870280 863189 858180 855019 853879 854976 858248 863314
50744 863314 869958 878716 890548 905714 923457 943164 965301 990641 1019167 1050516 1085049 1123446
50732 1123446 1165487 1210222 1257260 1306789 1358300 1410495 1462829 1516124 1570971 1626294 1680139
50721 1680139 1731326 1779697 1825097 1866682 1902983 1932232 1952900 1964368 1967018 1961584 1948918 1930789
$$ packed form
50803B594460j13361j18314j19530j17244j12199j05321r7579q9442q0583p0734
50793A570153o0656n1475m3385l5879k8990k3212j8373j3785r530o416m521l049
50781A270882j766j366k058k981l587m427n963p571q523r153j0264j1942j3667
50768A187614j5084j6135j6894j7789j9406k1603k3291k3614k2903k2022k1305
50757I67568k0551j9581j8205j6059j3066r826p091n009l161j140J097L272N066
50744H63314O644Q758J1832J5166J7743J9707K2137K5340K8526L1349L4533L8397
50732A123446M2041M4735M7038M9529N1511N2195N2334N3295N4847N5323N3845
50721A680139N1187M8371M5400M1585L6301K9249K0668J1468K650n434j2666j8129
$$ plain form
50709 1930789 1910423 1891452 1876187 1865180 1858452 1856671 1860939 1871603 1887634 1907296 1929169 1952113
50697 1952113 1974185 1992219 2003009 2004749 1996909 1979064 1950646 1911899 1864342 1810131 1751512 1691037
50685 1691037 1631544 1575317 1523492 1476472 1434543 1397818 1366090 1339281 1317918 1302820 1294503
50674 1294503 1293083 1298493 1310473 1328483 1351900 1380082 1411969 1445832 1479775 1512520 1543536 1572434
50662 1572434 1598489 1620860 1639267 1654405 1667535 1679578 1690788 1701376 1712036 1723293 1734632
50651 1734632 1745008 1754336 1763794 1774554 1786914 1800962 1817357 1836874 1859736 1886032 1916440 1951853
50639 1951853 1992414 2037326 2085378 2135217 2185333 2234375 2281507 2326143 2367597 2405431 2439923
50628 2439923 2471682 2501054 2528555 2555493 2582769 2608294 2626184 2629418 2613618 2578713 2528057
$$ packed form
50709A930789k0366j8971j5265j1007o728j781M268J0664J6031J9662K1873K2944
50697A952113K2072J8034J0790J740p840j7845k8418l8747m7557n4211n8619o0475
50685A691037n9493n6227n1825m7020m1929l6725l1728k6809k1363j5098q317
50674A294503j420N410J1980J8010K3417K8182L1887L3863L3943L2745L1016K8898
50662A572434K6055K2371J8407J5138J3130J2043J1210J0588J0660J1257J1339
50651A734632J0376R328R458J0760J2360J4048J6395J9517K2862K6296L0408L5413
50639A951853M0561M4912M8052M9839N0116M9042M7132M4636M1454L7834L4492
50628B439923L1759K9372K7501K6938K7276K5525J7890L234j5800l4905n0656
$$ plain form
50617 2528057 2466942 2401620 2338270 2281662 2234371 2197183 2170115 2152962 2145130 2145357 2151792 2162289
50605 2162289 2174463 2185483 2192053 2190889 2179531 2156867 2123046 2078976 2025965 1965686 1900109 1831159
50593 1831159 1760368 1689033 1618677 1551038 1487399 1428136 1373202 1322934 1278038 1238717 1204153
50582 1204153 1173127 1145099 1120576 1100463 1085129 1074171 1066961 1063277 1063231 1066646 1072753 1080497 1088963
50569 1088963 1097478 1105666 1113586 1121463 1129049 1135573 1140771 1145617 1151568 1159278 1168637 1179919 1194127
50556 1194127 1212137 1234200 1260463 1291237 1326348 1364754 1405271 1447257 1490066 1532234 1571867
50545 1571867 1607748 1639613 1667592 1692140 1714726 1737937 1764274 1794819 1829310 1867461 1909946
50534 1909946 1958026 2012484 2073366 2140742 2215350 2298207 2389806 2490029 2598567 2714964 2838277
$$ packed form
50617B528057o1115o5322o3350n6608m7291l7188k7068j7153p832K27O435J0497
50605B162289J2174J1020O570j164j1358k2664l3821m4070n3011o0279o5577o8950
50593A831159p0791p1335p0356o7639o3639n9263n4934n0268m4896l9321l4564
50582A204153l1026k8028k4523k0113j5334j0958p210l684m6L415O107P744Q466
50569A088963Q515Q188P920P877P586O524N198M846N951P710R359J1282J4208
50556A194127J8010K2063K6263L0774L5111L8406M0517M1986M2809M2168L9633
50545A571867L5881L1865K7979K4548K2586K3211K6337L0545L4491L8151M2485
50534A909946M8080N4458O0882O7376P4608Q2857R1599J00223J08538J16397J23313
$$ plain form
50523 2838277 2967169 3100348 3236426 3373262 3507885 3637262 3758661 3869187 3965634 4045235
50513 4045235 4106178 4147006 4166085 4162352 4136248 4089200 4022402 3936947 3835269 3721673 3601058
50502 3601058 3477554 3354772 3236836 3128435 3033729 2955499 2895374 2854465 2833450 2832166 2849394
50491 2849394 2883111 2930608 2988003 3049712 3108741 3157850 3190684 3202254 3189134 3149765 3084699
50480 3084699 2996511 2889487 2769132 2641271 2510858 2381362 2255191 2134474 2021135 1916247
50470 1916247 1819650 1730423 1647778 1571521 1501741 1438231 1380461 1328142 1281544 1240936 1205811
50459 1205811 1175035 1147804 1124131 1104355 1088554 1076611 1068435 1063753 1061854 1061815 1062909 1064655 1066766
50446 1066766 1069402 1073334 1079411 1087717 1097388 1107331 1117115 1127207 1138301 1150298 1161909 1171506 1178515
$$ packed form
50523B838277J28892J33179J36078J36836J34623J29377J21399J10526R6447P9601
50513D045235O0943M0828J9079l733k6104m7048o6798q5455j01678j13596j20615
50502C601058j23504j22782j17936j08401r4706p8230o0125m0909k1015j284J7228
50491B849394L3717M7497N7395O1709N9029M9109L2834J1570j3120l9369o5066
50480C084699q8188j07024j20355j27861j30413j29496j26171j20717j13339j04888
50470A916247r6597q9227q2645p6257o9780o3510n7770n2319m6598m0608l5125
50459A205811l0776k7231k3673j9776j5801j1943q176m682j899l9J094J746K111
50446A066766K636L932O077Q306R671R943R784J0092J1094J1997J1611R597P009
$$ plain form
50433 1178515 1183798 1188671 1193809 1199166 1204618 1210356 1216942 1225282 1236268 1250032 1265680 1282168 1299429
50420 1299429 1318390 1339995 1364667 1392717 1424737 1461281 1502324 1547374 1596120 1648910 1706582
50409 1706582 1769784 1838315 1911044 1986507 2063523 2141143 2218034 2292134 2361139 2423351 2478004
50398 2478004 2524676 2562406 2589419 2603684 2603626 2588389 2557869 2512838 2454899 2386008 2308154 2223801
50386 2223801 2136455 2050131 1968009 1891898 1823068 1763121 1713741 1675927 1649787 1634876 1630525
50375 1630525 1636000 1650489 1672612 1699735 1728068 1753767 1773823 1785925 1788010 1778524 1756948 1723763
50363 1723763 1680126 1627964 1570073 1509484 1448476 1388304 1329751 1273654 1220964 1172539 1128802
50352 1128802 1089428 1053491 1020187 989397 961417 936365 913996 893917 875769 859363 844824
$$ packed form
50433A178515N283M873N138N357N452N738O586Q340J0986J3764J5648J6488J7261
50420A299429J8961K1605K4672K8050L2020L6544M1043M5050M8746N2790N7672
50409A706582O3202O8531P2729P5463P7016P7620P6891P4100O9005O2212N4653
50398B478004M6672L7730K7013J4265n8j5237l0520m5031n7939o8891p7854q4353
50386B223801q7346q6324q2122p6111o8830n9947m9380l7814k6140j4911m351
50375A630525N475J4489K2123K7123K8333K5699K0056J2102K085r486k1576l3185
50363A723763m3637n2162n7891o0589o1008o0172n8553n6097n2690m8425m3737
50352A128802l9374l5937l3304l0790k7980k5052k2369k0079j8148j6406j4539
$$ plain form
50341 844824 832409 822046 813309 805981 800244 796008 792509 788981 785434 782334 779819 777677 775828 774307
50327 774307 772996 771915 771625 772806 775546 779444 784191 789582 795173 800585 806011 811856 817987 823984
50313 823984 829959 836434 843429 850453 857408 864757 872677 880858 889373 898971 910090 922234 934791
50300 934791 947965 962464 978599 996111 1014452 1032762 1049647 1063307 1071977 1074517 1071079 1063224
50288 1063224 1052897 1041245 1028845 1016902 1007277 1001305 999716 1004099 1016868 1038192 1063439 1085065
50276 1085065 1097388 1099110 1091949 1078341 1060733 1041719 1023623 1007973 995580 986774 981205 977786
50264 977786 975290 972919 970202 966620 961856 956390 951494 948348 947129 946997 946934 946491 945763 944863 943746 942508
50248 942508 941487 940858 940351 939570 938383 936822 934802 932301 929692 927496 925767 924071 922161 920406 919382
$$ packed form
50341H44824j2415j0363q737p328n737m236l499l528l547l100k515k142j849j521
50327G74307j311j081k90J181K740L898M747N391N591N412N426N845O131N997
50313H23984N975O475O995P024O955P349P920Q181Q515R598J1119J2144J2557
50300I34791J3174J4499J6135J7512J8341J8310J6885J3660Q670K540l438p855
50288A063224j0327j1652j2400j1943r625n972j589M383J2769K1324K5247K1626
50276A085065J2323J722p161j3608j7608j9014j8096j5650j2393q806n569l419
50264I77786k496k371k717l582m764n466m896l146j219j32o3m43p28r00j117j238
50248I42508j021o29n07p81j187j561k020k501k609k196j729j696j910j755j024
$$ plain form
50233 919382 919272 919837 920811 922030 923160 923593 922822 920920 918532 916336 914606 913239 912011 910631 908776
50218 908776 906427 904182 902877 902802 903531 904739 906986 911481 919125 929890 942947 957155 971496 985349
50204 985349 998544 1011211 1023545 1035573 1047028 1057580 1067442 1077657 1089319 1102292 1114974 1125482
50192 1125482 1132782 1136410 1135486 1128571 1114584 1093675 1067334 1037961 1008126 979745 953670 930145
50180 930145 909546 892427 878989 868982 862259 858897 858347 858653 857047 851511 841710 828573 813307
50167 813307 796946 780492 764977 751198 739509 729938 722339 716340 711341 706906 703151 700562 699396
50154 699396 699412 700223 701726 704093 707510 711974 717127 722157 725933 727499 726488 723222 718518 713302 708056
50139 708056 702530 696251 689425 683136 678515 675984 675449 676848 680048 684408 688933 692886 695982 698032
$$ packed form
50233I19382j10N65R74J219J130M33p71j902k388k196j730j367j228j380j855
50218I08776k349k245j305p5P29J208K247M495P644J0765J3057J4208J4341J3853
50204I85349J3195J2667J2334J2028J1455J0552R862J0215J1662J2973J2682J0508
50192A125482P300L628r24o915j3987k0909k6341k9373k9835k8381k6075k3525
50180I30145k0599j7119j3438j0007o723l362n50L06j606n536r801j3137j5266
50167H13307j6361j6454j5515j3779j1689r571p599n999m999m435l755k589j166
50154F99396J6Q11J503K367L417M464N153N030L776J566j011l266m704n216n246
50139G08056n526o279o826o289m621k531n35J399L200M360M525L953L096K050
$$ plain form
50125 698032 698844 698583 697880 697378 697306 697623 698423 700035 702816 706878 711931 717364 722666 727859 733439 739874
50109 739874 747259 755451 764242 773302 782176 790695 799373 809179 820766 833930 847887 862101 876996
50096 876996 893880 914123 938235 965777 996161 1029305 1065283 1103467 1142426 1180882 1218488
50085 1218488 1255459 1291778 1327271 1362421 1398477 1436303 1475311 1513744 1549733 1581643 1607670
50074 1607670 1625857 1634907 1634703 1625866 1609097 1585193 1555342 1520927 1483123 1443046 1402121 1361753
50062 1361753 1322475 1283915 1245951 1209660 1176684 1147771 1122291 1099219 1078186 1059360 1042536
50051 1042536 1026737 1010827 994421 978135 963005 949668 937981 927375 917644 909392 903730 901437
50039 901437 902399 905706 910223 915189 920531 926698 934041 942316 950935 959737 969176 979555 990274 1000217
$$ packed form
50125F98032Q12k61p03n02p2L17Q00J612K781M062N053N433N302N193N580O435
50109G39874P385Q192Q791R060Q874Q519Q678R806J1587J3164J3957J4214J4895
50096H76996J6884K0243K4112K7542L0384L3144L5978L8184L8959L8456L7606
50085A218488L6971L6319L5493L5150L6056L7826L9008L8433L5989L1910K6027
50074A607670J8187R050k04q837j6769k3904k9851l4415l7804m0077m0925m0368
50062A361753l9278l8560l7964l6291l2976k8913k5480k3072k1033j8826j6824
50051A042536j5799j5910j6406j6286j5130j3337j1687j0606r731q252n662k293
50039I01437R62L307M517M966N342O167P343Q275Q619Q802R439J0379J0719R943
$$ plain form
50025 1000217 1008758 1016002 1022005 1026175 1027784 1026871 1024291 1020826 1016419 1010367 1002173 992053 980529 967748
50011 967748 953480 937878 921936 906894 893252 880569 868164 855805 843822 832958 824198 818477
49999 818477 816308 817732 822614 830810 841897 854850 868100 880032 889647 897021 903074 908658 913803
49986 913803 917945 920632 921627 920501 916782 910736 903495 896092 888841 882087 877169 875906 879104 886048
49972 886048 895605 907502 922322 940418 961018 982350 1002621 1020917 1037238 1051938 1065497 1078872
49960 1078872 1093532 1110648 1130303 1151641 1173436 1194075 1211382 1223340 1229313 1230152 1226929 1219978
49948 1219978 1209347 1195550 1179321 1160925 1140290 1117883 1094974 1072906 1052194 1032294 1012003
49937 1012003 990207 966628 941945 916947 891548 864994 837137 809103 782459 758002 735694
$$ packed form
50025A000217Q541P244O003M170J609r13k580l465m407o052q194j0120j1524j2781
50011I67748j4268j5602j5942j5042j3642j2683j2405j2359j1983j0864q760n721
49999H18477k169J424M882Q196J1087J2953J3250J1932R615P374O053N584N145
49986I13803M142K687R95j126l719o046p241p403p251o754m918j263L198O944
49972H86048R557J1897J4820J8096K0600K1332K0271J8296J6321J4700J3559J3375
49960A078872J4660J7116J9655K1338K1795K0639J7307J1958N973Q39l223o951
49948A219978j0631j3797j6229j8396k0635k2407k2909k2068k0712j9900k0291
49937A012003k1796k3579k4683k4998k5399k6554k7857k8034k6644k4457k2308
$$ plain form
49926 735694 715450 697435 681676 667913 656041 646281 638672 632736 627974 624541 623045 623664 625642
49913 625642 627740 629155 630033 631173 633243 636359 640457 645852 653125 662463 673552 686178 700493 716429
49899 716429 733248 750111 766773 783334 799428 814133 826527 836015 842223 845012 844562 841110 834641
49886 834641 825105 812821 798334 782063 764482 746389 728469 710712 692864 675301 658832 643777
49874 643777 630044 618039 608475 601025 594227 587253 580895 576174 572834 570115 568333 568586 571140 575113
49860 575113 579763 585223 591963 600296 610559 623072 637655 653690 670830 689109 708048 726072
49848 726072 741230 752436 759971 765128 769394 773548 777028 778252 775751 769126 758987 746205 731347
49835 731347 714824 697473 680825 666544 655382 646781 639626 633310 628001 624127 621922 621385 622345
$$ packed form
49926G35694k0244j8015j5759j3763j1872r760p609n936m762l433j496O19J978
49913F25642K098J415Q78J140K070L116M098N395P273R338J1089J2626J4315J5936
49899G16429J6819J6863J6662J6561J6094J4705J2394R488O208K789m50l452o469
49886H34641r536j2284j4487j6271j7581j8093j7920j7757j7848j7563j6469j5055
49874F43777j3733j2005r564p450o798o974o358m721l340k719j782K53K554L973
49860E75113M650N460O740Q333J0263J2513J4583J6035J7140J8279J8939J8024
49848G26072J5158J1206P535N157M266M154L480J224k501o625j0139j2782j4858
49835G31347j6523j7351j6648j4281j1162q601p155o316n309l874k205n37R60
$$ [...]
##END NTUPLES=NMR SPECTRUM
##END=
