
##TITLE=UV1255_M10_1340-1211_90_7409353_Q3wg8abeNl
##JCAMPDX= 6.0         $$ Bruker NMR JCAMP-DX V2.0
##DATA TYPE= NMR SPECTRUM
##DATA CLASS= NTUPLES
##ORIGIN= BRUKER
##OWNER= Administrator
$$ 1.72 TOPSPIN		Version 2.1
$$ 2013-01-24 21:42:34.552 -0500  Administrator@X
$$ Compression mode = diff/dup
##.OBSERVE FREQUENCY= 400.02188249412
##.OBSERVE NUCLEUS= ^1H
##.ACQUISITION MODE= SIMULTANEOUS (DQD)
##.ACQUISITION SCHEME= undefined
##.AVERAGES= 8
##.DIGITISER RES= 22
##SPECTROMETER/DATA SYSTEM= spect
##.PULSE SEQUENCE= zg30
##.SOLVENT NAME= COFFEE_meoh
##.SHIFT REFERENCE= INTERNAL, COFFEE_meoh, 1, 14.98509
##AUDIT TRAIL= $$ (NUMBER, WHEN, WHO, WHERE, PROCESS, VERSION, WHAT)
$$ ##TITLE= Audit trail, TOPSPIN		Version 2.1
$$ ##JCAMPDX= 5.01
$$ ##ORIGIN= Bruker BioSpin GmbH
$$ ##OWNER= Administrator
$$ $$ E:\/data/COFFEE/nmr/UV1255_M10_1340-1211_90_7409353_Q3wg8abeNl/10/pdata/1/auditp.txt
$$ ##AUDIT TRAIL=  $$ (NUMBER, WHEN, WHO, WHERE, PROCESS, VERSION, WHAT)
(   1,<2013-01-24 21:42:26.427 -0500>,<Administrator>,<X>,<go>,<TOPSPIN 2.1>,
      <created by zg
	started at 2013-01-24 21:41:19.537 -0500,
	POWCHK enabled, PULCHK disabled,
       configuration hash MD5:
       86 BA 57 50 F2 9D 5C 9B 26 00 A9 28 5F 66 2E 89
       data hash MD5: 64K
       FC 6F B0 39 BF 49 86 8B 99 18 C6 F7 DB B9 94 54>)
(   2,<2013-01-24 21:42:29.474 -0500>,<Administrator>,<X>,<proc1d>,<TOPSPIN 2.1>,
      <Start of raw data processing
       efp LB = 0 FT_mod = 6 PKNL = 1 PHC0 = 0 PHC1 = 0 SI = 32K 
       data hash MD5: 32K
       70 15 4B C9 FE 69 51 87 65 A5 B9 7A 3E 7F 95 71>)
(   3,<2013-01-24 21:42:29.943 -0500>,<Administrator>,<X>,<proc1d>,<TOPSPIN 2.1>,
      <pk PHC0 = 94.70764 PHC1 = 0 
       data hash MD5: 32K
       11 B4 94 22 F3 97 8A E0 71 1C 9E 0F 7D 91 87 2F>)
(   4,<2013-01-24 21:42:30.162 -0500>,<Administrator>,<X>,<proc1d>,<TOPSPIN 2.1>,
      <abs ABSG = 1 
       data hash MD5: 32K
       AA 7C EA A5 EB A9 2C 0F 96 91 C3 F0 37 99 BE 7E>)
(   5,<2013-01-24 21:42:30.318 -0500>,<Administrator>,<X>,<proc1d>,<TOPSPIN 2.1>,
      <abs ABSG = 2 
       data hash MD5: 32K
       D1 6E 3B EF A1 8A A4 00 AA C1 6D C0 30 A6 90 94>)
(   6,<2013-01-24 21:42:30.458 -0500>,<Administrator>,<X>,<proc1d>,<TOPSPIN 2.1>,
      <abs ABSG = 3 
       data hash MD5: 32K
       7E 99 F0 FB 20 C1 F2 7D 77 9F F6 81 ED 90 79 5F>)
(   7,<2013-01-24 21:42:30.599 -0500>,<Administrator>,<X>,<proc1d>,<TOPSPIN 2.1>,
      <abs ABSG = 4 
       data hash MD5: 32K
       74 B4 5E FA D8 42 66 BA E5 0E A8 5A F7 69 58 B8>)
(   8,<2013-01-24 21:42:30.755 -0500>,<Administrator>,<X>,<proc1d>,<TOPSPIN 2.1>,
      <abs ABSG = 5 
       data hash MD5: 32K
       F7 10 43 4A 8D 15 A2 20 8C FA FA E1 CE 3A ED 37>)
$$ ##END=
$$ 
$$ $$ hash MD5
$$ $$ FB ED C2 C5 A7 7A 6E 16 4C 76 44 1E 1D A9 2B 5A
##$RELAX= 
##$RELAX= 
##$RELAX= 
##$RELAX= 
##$RELAX= 
##$RELAX= 
##$RELAX= 
$$ Bruker specific parameters
$$ --------------------------
##$DU= <E:\>
##$EXPNO= 10
$$ [...]
150 150 150 150 150 150 150 150
##$TP07= 0
##$TPNAME0= <>
##$TPNAME1= <>
##$TPNAME2= <>
##$TPNAME3= <>
##$TPNAME4= <>
##$TPNAME5= <>
##$TPNAME6= <>
##$TPNAME7= <>
##$TPOAL= (0..7)
0.5 0.5 0.5 0.5 0.5 0.5 0.5 0.5
##$TPOFFS= (0..7)
0 0 0 0 0 0 0 0
##$TUNHIN= 0
##$TUNHOUT= 0
##$TUNXOUT= 0
##$USERA1= <user>
##$USERA2= <user>
##$USERA3= <user>
##$USERA4= <user>
##$USERA5= <user>
##$V9= 5
##$VALIST= <valist>
##$VCLIST= <CCCCCCCCCCCCCCC>
##$VD= 0
##$VDLIST= <DDDDDDDDDDDDDDD>
##$VPLIST= <PPPPPPPPPPPPPPP>
##$VTLIST= <TTTTTTTTTTTTTTT>
##$WBST= 1024
##$WBSW= 4
##$XGAIN= (0..3)
0 0 0 0
##$XL= 0
##$YL= 0
##$YMAX_a= 579729
##$YMIN_a= -492682
##$ZGOPTNS= <>
##$ZL1= 120
##$ZL2= 120
##$ZL3= 120
##$ZL4= 120
##$ABSF1= 14.98509
##$ABSF2= -5.573092
##$ABSG= 5
##$ABSL= 3
##$ALPHA= 0
##$AQORDER= 0
##$ASSFAC= 0
##$ASSFACI= 0
##$ASSFACX= 0
##$ASSWID= 0
##$AUNMP= <proc_prof1d_extract_pilot.lims>
##$AXLEFT= 0
##$AXNAME= <>
##$AXNUC= <1H>
##$AXRIGHT= 0
##$AXTYPE= 0
##$AXUNIT= <>
##$AZFE= 0.1
##$AZFW= 0.1
##$BCFW= 0
##$BC_mod= 0
##$BYTORDP= 0
##$COROFFS= 0
##$CY= 15
##$DATMOD= 1
##$DC= 0
##$DFILT= <>
##$DTYPP= 0
##$F1P= 0
##$F2P= 0
##$FCOR= 0.5
##$FTSIZE= 32768
##$FT_mod= 6
##$GAMMA= 0
##$GB= 0
##$INTBC= 1
##$INTSCL= 1
##$ISEN= 128
##$LB= 0
##$LEV0= 0
##$LPBIN= 0
##$MAXI= 10000
##$MC2= 0
##$MEAN= 0
##$ME_mod= 0
##$MI= 0
##$NCOEF= 0
##$NC_proc= -8
##$NLEV= 6
##$NOISF1= 0
##$NOISF2= 0
##$NSP= 0
##$NTH_PI= 0
##$NZP= 0
##$OFFSET= 14.98509
##$PC= 1
##$PHC0= 94.70764
##$PHC1= 0
##$PH_mod= 1
##$PKNL= yes
##$PPARMOD= 0
##$PPDIAG= 0
##$PPIPTYP= 0
##$PPMPNUM= 2147483647
##$PPRESOL= 1
##$PSCAL= 4
##$PSIGN= 0
##$PYNMP= <proc.py>
##$REVERSE= no
##$SF= 400.02
##$SI= 32768
##$SIGF1= 0
##$SIGF2= 0
##$SINO= 400
##$SIOLD= 32768
##$SPECTYP= <>
##$SREGLST= <1H.CDCl3>
##$SSB= 0
##$STSI= 32768
##$STSR= 0
##$SW_p= 8223.68421052631
##$SYMM= 0
##$S_DEV= 0
##$TDeff= 65536
##$TDoff= 0
##$TI= <>
##$TILT= no
##$TM1= 0
##$TM2= 0
##$TOPLEV= 0
##$USERP1= <user>
##$USERP2= <user>
##$USERP3= <user>
##$USERP4= <user>
##$USERP5= <user>
##$WDW= 1
##$XDIM= 32768
##$YMAX_p= 434046572
##$YMIN_p= -727840
##$CURPLOT= <Network HP LaserJet P1505>
##$CURPRIN= <$Network HP LaserJet P1505>
##$DFORMAT= <normdp>
##$LAYOUT= <+/1D_H.xwp>
##$LFORMAT= <normlp>
##$PFORMAT= <normpl>
##$SURQMSG= 1
$$ End of Bruker specific parameters
$$ ---------------------------------
##NTUPLES= NMR SPECTRUM
##VAR_NAME=  FREQUENCY,     SPECTRUM/REAL,   SPECTRUM/IMAG
##SYMBOL=    X,             R,               I
##VAR_TYPE=  INDEPENDENT,   DEPENDENT,       DEPENDENT
##VAR_FORM=  AFFN,          ASDF,            ASDF
##VAR_DIM=   32768,         32768,           32768
##UNITS=     HZ,            ARBITRARY UNITS, ARBITRARY UNITS
##FACTOR=    0.250966925370066, 1,           1
##FIRST=     8223.43324360094, -11003,       -136201
##LAST=      0,             -64335,          -21373
##MIN=       0,             -727840,         0
##MAX=       8223.43324360094, 434046572,    0
$$ Real data points
##PAGE= N=1
##DATA TABLE= (X++(R..R)), XYDATA
$$ [...]
19543A19580d43197a93984m0413a05795A44526L8730i4526M4575i961B08521c26716
$$ 119580 -443197 -193984 -234397 -105795 144526 183256 -94526 -49951 -9961 208521 -326716
19531c0759l38062C02422b23311j1989A3161K52547J53850a07689l15174J48400
$$ -30759 -368821 302422 -223311 -235300 13161 265708 419558 -107689 -422863 -274463
19521b74463A36117a58233L6199E07K22761a76054C1285N18294a15411r4771A12072
$$ -274463 136117 -158233 -122034 507 223268 -176054 31285 549579 -115411 -210182 112072
19509A45172C2938M9871i7644D16312g1286A04135D4412J67226c99479f0250A15887
$$ 145172 32938 82809 -97644 416312 -71286 104135 44412 211638 -399479 -60250 115887
19497a96580B71215a67105L4119j31294b3524k97072B36690O1546A8497b91560
$$ -196580 271215 -167105 -132986 -264280 -23524 -320596 236690 298236 18497 -291560
19486e4513n8919G6874J79409c69129B88103F3742c263l18734A9693a50654B8977
$$ -54513 -113432 76874 256283 -369129 288103 63742 -3263 -321997 19693 -150654 28977
19474A72410k8374b65053a04388L5982A82958e8970m14921C41963b29636C17247
$$ 172410 144036 -265053 -104388 -68406 182958 -58970 -473891 341963 -229636 317247
19463e2592J52a9305m09105G673d80858E6364J48550i2070C119P6147P3186a78431
$$ -52592 -52440 -19305 -428410 7673 -480858 56364 204914 -92070 3119 79266 152452 -178431
19450d2043p5826r2605A08481D0102h2085A58747c12683C88054c63545d5905j69403
$$ -42043 -117869 -210474 108481 40102 -82085 158747 -312683 388054 -363545 -45905 -215308
19439b15308A12652K48547b61374i3360n0m64496a47046A07818m154A5818a39456
$$ -215308 112652 361199 -261374 -93360 -93410 -557906 -147046 107818 103664 15818 -139456
19427A14353P9853o0332i120A9076b05511D6578b8394l00878A76012m2001F5203
$$ 114353 194206 133874 -9120 19076 -205511 46578 -28394 -329272 176012 134011 65203
19415c83296e5354m0614E9376c94907a8348C28087a56041B968J98171n7701b81174
$$ -383296 -55354 -95968 59376 -394907 -18348 328087 -156041 2968 201139 143438 -281174
19403a00770j11219p3789N7506R0463A54597b1496A79443c64287a80675a6879
$$ -100770 -211989 -285778 -228272 -137809 154597 -21496 179443 -364287 -180675 -16879
19392b49256d9493A33342E8186a42802d3764q4859P943A83750b71734J01945f6709
$$ -249256 -49493 133342 58186 -142802 -43764 -128623 -120680 183750 -271734 -169789 -66709
19380A06603a94157e9094A45517J33231C368c301B16833m7426c29717A01429J10206
$$ 106603 -194157 -59094 145517 278748 3368 -3301 216833 169407 -329717 101429 211635
19369B11635a59843f9371J1845j79029D0405i8603C39567F1566c5968q6656j21054
$$ 211635 -159843 -69371 -57526 -236555 40405 -98603 339567 61566 -35968 -122624 -243678
19358b43678k2338F0101a4194j26244C94142a15427A38824b65639e5980m5756
$$ -243678 -266016 60101 -14194 -140438 394142 -115427 138824 -265639 -55980 -101736
19348a01736A11458b98169C43517d9572A06676a38435B27632j7935c73545A93224
$$ -101736 111458 -298169 343517 -49572 106676 -138435 227632 209697 -373545 193224
19337a6177A29274K08806a57125b1501A8061a4080m10602K03766d9421n1782j61380
$$ -16177 129274 338080 -157125 -21501 18061 -14080 -424682 -220916 -49421 -101203 -262583
19326b62583C3102J74693f8722l71300f7816o9330l27757a3056j2592k40167E3029
$$ -262583 33102 207795 -68722 -440022 -67816 -137146 -464903 -13056 -25648 -265815 53029
19314a41623L8229J1843A92651a37040O8211m0030F7110J42787I3258O72d37381
$$ -141623 -103394 -91551 192651 -137040 -68829 -108859 67110 209897 93258 93930 -437381
19302d2978A47067a11610k8417l4930j85366C09327m0508j19946a6753k33907
$$ -42978 147067 -111610 -140027 -174957 -360323 309327 268819 148873 -16753 -250660
19292b50660h8115E0325g21C20460b45295N4813j3708e7097j70724i1080o4883
$$ -250660 -88115 50325 -721 320460 -245295 -190482 -204190 -57097 -227821 -91080 -155963
19281a55963a6320k21580H1325d2561D1043J39766b6457k14805Q0683b9041G9562
$$ -155963 -16320 -237900 81325 -42561 41043 180809 -26457 -241262 -160579 -29041 79562
19269A89442p8490J58721r5152b6228r939k93643H1066b43677F6494K0003f5334
$$ 189442 110952 269673 174521 -26228 -36167 -329810 81066 -243677 66494 86497 -65334
19257b30945k9969F7306P7097A8756d0525a7455f162p7359G154K03288p5547c39338
$$ -230945 -260914 67306 144403 18756 -40525 -17455 -6162 -83521 7154 210442 134895 -339338
19244c15545c7517A54705d0304p1717A91178b59993l6878i2892n606C14821L5417
$$ -315545 -37517 154705 -40304 -112021 191178 -259993 -296871 -92892 -98498 314821 350238
19233C50238b23681J4554C90724C2883a34627j53477i2606M6071j08641q1582
$$ 350238 -223681 -209127 390724 32883 -134627 -288104 -92606 -46535 -155176 -236758
19223b36758C8305f0876j25335l4713B44264l9583a1393l47713A28158b8912B774
$$ -236758 38305 -60876 -186211 -220924 244264 204681 -11393 -359106 128158 -28912 2774
19211a5510A10074D9091B4224a76467j3219B49442J30169D8430L10584g5344G0244
$$ -15510 110074 49091 24224 -176467 -189686 249442 379611 48430 359014 -75344 70244
19199D1659J09488d7722k97173f7836j08596k73959B32322G5511a07655J2582
$$ 41659 151147 -47722 -344895 -67836 -176432 -450391 232322 75511 -107655 -95073
19189i5073j02119j05148j29495a07476n8062m1796j9949D6835b00560c4847A67085
$$ -95073 -197192 -302340 -431835 -107476 -165538 -207334 -227283 46835 -200560 -34847 167085
19177a10409l48352B06021b58145b6849j56339A0308c00640G6511J94347j33369
$$ -110409 -458761 206021 -258145 -26849 -183188 10308 -300640 76511 270858 137489
19167A37489c07615O3172g5415I331d95954H0062e746j65450j22067c5665j79770
$$ 137489 -307615 -244443 -75415 9331 -495954 80062 -5746 -171196 -293263 -35665 -215435
19156b15435k1900A40679m7095a64126P457O3141M4833F9109c17665a15387B9543
$$ -215435 -237335 140679 93584 -164126 -156669 -93528 -48695 69109 -317665 -115387 29543
19144b2890A78651l9304a98760c6711p4061j7408A06626f8280H8597l5540a92104
$$ -22890 178651 139347 -198760 -36711 -110772 -128180 106626 -68280 88597 53057 -192104
19132b0058A16219J26849A16273e2928C21737C4112a15752k05220a31350A87148
$$ -20058 116219 243068 116273 -52928 321737 34112 -115752 -320972 -131350 187148
19121a05035q0083h0468D3075J51081a57707b8393c012A14356J72023A37464L834
$$ -105035 -185118 -80468 43075 194156 -157707 -28393 -3012 114356 286379 137464 141298
19110A41298f1536k73588G6256d71495J32728g1883i519n622k39342A09824a15068
$$ 141298 -61536 -335124 76256 -471495 -338767 -71883 -9519 -15141 -254483 109824 -115068
19098i4717m00726c4561c804n3814p1156j39228A95134F8260M0720e10882c42
$$ -94717 -495443 -34561 -3804 -57618 -128774 -268002 195134 68260 108980 -510882 -342
19086H663c4722o2142G2876N4930g6332m7018H1533i630p0070j41000A36134B5429
$$ 8663 -34722 -96864 72876 127806 -76332 -123350 81533 -9630 -79700 -220700 136134 25429
19073i1692k61130a32933j17415B71718c35467E3467a56724n7169Q0553C7326
$$ -91692 -352822 -132933 -250348 271718 -335467 53467 -156724 -213893 -133340 37326
19062B9824a97088n8802g6842A44570l9009J00685F6607b50348j1217B47677o5412
$$ 29824 -197088 -255890 -76842 144570 105561 206246 66607 -250348 -261565 247677 182265
19051A82265J2208b33707J08409D8305c2798p7804m5871N4348A53818g2774H0129
$$ 182265 194473 -233707 -125298 48305 -32798 -110602 -156473 -102125 153818 -72774 80129
19039b40743l2584B15862b33137j34319B9425J38850a39820k4953h1843D5759
$$ -240743 -273327 215862 -233137 -367456 29425 168275 -139820 -164773 -81843 45759
19028i2729H2447a84606j55895Q1591a17896m2878A49573b63749I0303e3272A57564
$$ -92729 82447 -184606 -340501 -258910 -117896 -160774 149573 -263749 90303 -53272 157564
19016d5580m5842D5678b3900p1980A09419B8751a80696G7276b17422B39818g058
$$ -45580 -91422 45678 -23900 -95880 109419 28751 -180696 77276 -217422 239818 -7058
19004a26687A36919J6959a45430A8056a86671G3520j9314O2670o727e0436A46395
$$ -126687 136919 153878 -145430 18056 -186671 73520 54206 116876 110149 -50436 146395
18992A93081B9815c3289A05130a74369G9431i6633E5802L2692j0139b95713h938
$$ 193081 29815 -33289 105130 -174369 79431 -96633 55802 88494 78355 -295713 -8938
18980f5848q0524B56513a13334l7424P3875k53680A05460D9151b38554e9490l67351
$$ -65848 -146372 256513 -113334 -150758 -76883 -330563 105460 49151 -238554 -59490 -426841
18969d26841d2429l43982a40342N9994p0346r2124A80188G6357a63343l15072
$$ -426841 -42429 -386411 -140342 -80348 -150694 -242818 180188 76357 -163343 -478415
18959d78415b36421c2461j19757e111A31866L1242d47521B11246a87644A6016
$$ -478415 -236421 -32461 -152218 -5111 131866 163108 -447521 211246 -187644 16016
18948i1038k1556n9628B8544e7576b3576A6899N7908O3283J87580A1788J13400
$$ -91038 -112594 -172222 28544 -57576 -23576 16899 74807 138090 325670 11788 125188
18937A25188l8446J54374b4103r5513C989J35989b29440g5952a9511D0091a51499
$$ 125188 86742 241116 -24103 -119616 3989 139978 -229440 -75952 -19511 40091 -151499
18925C28365b18677p9099F3060a48652k36260J26886B14317b53188f2288j22299
$$ 328365 -218677 -297776 63060 -148652 -384912 -258026 214317 -253188 -62288 -184587
18915a84587c7968C9154b16068A1796P4016i4709a8504N780B06120b40119P0031
$$ -184587 -37968 39154 -216068 11796 85812 -94709 -18504 -12724 206120 -240119 -170088
18904a70088L9470j19176A12627E823O1165g1894J0416j54546R0102f2405A68766
$$ -170088 -130618 -249794 112627 5823 66988 -71894 -61478 -216024 -125922 -62405 168766
18892b7019j87443Q3687A58225i7759a742j14778G4551a49887b0472j83612A40772
$$ -27019 -214462 -130775 158225 -97759 -1742 -116520 74551 -149887 -20472 -204084 140772
18880B91598A30381f6800j16793n7835Q8839P408A49737a72894A90401Q3358A401
$$ 291598 130381 -66800 -183593 -241428 -152589 -145181 149737 -172894 190401 273759 1401
18868h1044k3896D8433N3912a36976M6219D12270A20090b9845j6412F4747M5007
$$ -81044 -104940 48433 102345 -136976 -90757 412270 120090 -29845 -46257 64747 109754
18857A09754A3322a120m1084j249C31480b22587c5721j76162f1817j4889k51255
$$ 109754 13322 -1120 -42204 -43453 331480 -222587 -35721 -211883 -61817 -76706 -327961
18846c27961M7418c4035k83136b7079m0373A99506a20293j14020l6689b6099B60017
$$ -327961 -280543 -34035 -317171 -27079 -67452 199506 -120293 -234313 -271002 -26099 260017
18834c63314b8384j76065j30573G3068a52871f3460B60055b22131a03142C83388
$$ -363314 -28384 -204449 -335022 73068 -152871 -63460 260055 -222131 -103142 383388
18823B08855a1663j73781Q4077F5995d0834q6781J7639D7733b94088E3893a01861
$$ 208855 -11663 -185444 -101367 65995 -40834 -127615 -109976 47733 -294088 53893 -101861
18811b34439A92710c15501A16345b3589k86785B43932a58004j88808i9680A48526
$$ -234439 192710 -315501 116345 -23589 -310374 243932 -158004 -346812 -99680 148526
18800b1525j24556J2228J5026G843Q1906b25235f1967o0763m6544a3440l649B66174
$$ -21525 -146081 -133853 -118827 7843 89749 -225235 -61967 -122730 -169274 -13440 -17089 266174
18787b12567Q1412j0215c1910j0516G0031b06481R6788b7421j49059B7302d4812
$$ -212567 -131155 -141370 -31910 -42426 70031 -206481 -109693 -27421 -176480 27302 -44812
18775A15671a04709a3667A20704a05038k52418e9665q7150l4923A56214c1445
$$ 115671 -104709 -13667 120704 -105038 -357456 -59665 -146815 -181738 156214 -31445
18764A96876a13232M950A87364a65304D030J6904J02939a26159j93968A54724
$$ 196876 -113232 -108282 187364 -165304 4030 20934 123873 -126159 -320127 154724
18753b09562e4399F2076b67111A15834L1487a87136E3414J13103B8428P9882J33837
$$ -209562 -54399 62076 -267111 115834 147321 -187136 53414 166517 28428 108310 242147
18742B42147c65623D509K06373H505c34479r4585a08720D8400a64338N1282P639
$$ 242147 -365623 4509 210882 8505 -334479 -429064 -108720 48400 -164338 -113056 -105417
18731a05417j04238m1617A83812b0950p7377B38689c53763r5964K04385j49351
$$ -105417 -209655 -251272 183812 -20950 -98327 238689 -353763 -449727 -245342 -394693
18721c94693J34314b0026B6177d1842k24089k32368a20190j8902A71749f1762
$$ -394693 -260379 -20026 26177 -41842 -265931 -498299 -120190 -139092 171749 -61762
18710B13367I8036O5907J03283h4290p4677A04202b04329j99853a93230o0842
$$ 213367 98036 163943 267226 -84290 -158967 104202 -204329 -404182 -193230 -254072
18700b54072B92959A823e2454p7438b7008j51240B53157j04375a64938d5978D5591
$$ -254072 292959 1823 -52454 -129892 -27008 -178248 253157 148782 -164938 -45978 45591
18688c49593D86426B36853B8632a19854M8499C49R916a65053I5524a36l3877l63432
$$ -349593 486426 236853 28632 -119854 -71355 349 10265 -165053 95524 -136 -34013 -397445
18676c97445d8662B11491D1800f5044A3923a98059J385N8665j09200d4485l547
$$ -397445 -48662 211491 41800 -65044 13923 -198059 -196674 -138009 -247209 -44485 -48032
18665d8032j61616a8481p3233e36A48322i1050A66617b4432F5584B3112f7643
$$ -48032 -209648 -18481 -91714 -536 148322 -91050 166617 -24432 65584 23112 -67643
18653a67011C7837a02896d476k75747h6122j68997c8965B28427A3534K15788a05966
$$ -167011 37837 -102896 -4476 -280223 -86122 -255119 -38965 228427 13534 229322 -105966
18641b5843A69932J25958a78334A99063a64842a0871F9444K08337A17773J8237
$$ -25843 169932 295890 -178334 199063 -164842 -10871 69444 277781 117773 136010
18631A36010F1112g9658B93340g6661A72856a64144C2213J23479b23411B66202
$$ 136010 61112 -79658 293340 -76661 172856 -164144 32213 155692 -223411 266202
18620E4950c2628e545G4835b1726q0717l32791A90406a33642a559j34490b0414
$$ 54950 -32628 -5545 74835 -21726 -102443 -435234 190406 -133642 -1559 -136049 -20414
18608a03067n0567j61686C157c3576j56189f0175j41167P4888O230k4482l4033
$$ -103067 -153634 -315320 3157 -33576 -189765 -60175 -201342 -126454 -120224 -144706 -178739
18597a78739Q1262B41813j02082a42673j8458J44e3700p8538M5284n6219C02431
$$ -178739 -97477 241813 139731 -142673 -161131 -160987 -53700 -132238 -86954 -143173 302431
18585a13168I7134a0537a876l33976B29355C5431a84426n9107J13412i146r2830
$$ -113168 97134 -10537 -1876 -335852 229355 35431 -184426 -243533 -130121 -9146 -101976
18574a01976B75205a31409b0609k43489B6360a20306m5346E9766h7336k00067
$$ -101976 275205 -131409 -20609 -264098 26360 -120306 -165652 59766 -87336 -287403
18564b87403B09304P0943a19276I3715a90960R4551d344J329q169j9353j68287
$$ -287403 209304 280247 -119276 93715 -190960 -96409 -4344 -3015 -11184 -30537 -198824
18553a98824j8740I4004i0522j18887L2355n0825d6241o2771B28190a10895D0143
$$ -198824 -217564 94004 -90522 -209409 -177054 -227879 -46241 -109012 228190 -110895 40143
18541G3207a98991j77038B3068J49514b27398a08064K6171A01512i8850D622a4772
$$ 73207 -198991 -376029 23068 172582 -227398 -108064 -81893 101512 -98850 4622 -14772
18529f9391A42042b33158P8050f7969j24790a4678E7039a1062q6650c3507r7777
$$ -69391 142042 -233158 -155108 -67969 -192759 -14678 57039 -11062 -97712 -33507 -131284
18518a31284k1882b3893j31092k6948G0352b38436j95532B4500h498j40493L4455
$$ -131284 -153166 -23893 -154985 -181933 70352 -238436 -433968 24500 -8498 -148991 -114536
18507a14536k2668e2386B59087r0217i9713F4952b5466k29555B7326d8590k96049
$$ -114536 -137204 -52386 259087 168870 -99713 64952 -25466 -255021 27326 -48590 -344639
18496c44639B28075f4555l7772J5382C48759j53909f2999k58353B55427r9692
$$ -344639 228075 -64555 -102327 -86945 348759 194850 -62999 -321352 255427 155735
18486A55735g4712q7736A45339C9890a68458l7778n7260L3565a6198q9174r4172
$$ 155735 -74712 -162448 145339 39890 -168458 -206236 -263496 -229931 -16198 -105372 -199544
18475a99544b0375k71511B34434d43169a0317A60457B3487a6999j09600J9467
$$ -199544 -20375 -291886 234434 -443169 -10317 160457 23487 -16999 -126599 -107132
18465a07132E1796J27283h6427k12439j17574a00153G5701E910a69667k47434
$$ -107132 51796 179079 -86427 -298866 -416440 -100153 75701 5910 -169667 -417101
18455d17101a33270E8964a3264l45199N7487B61074e9365p4332j09772J17401
$$ -417101 -133270 58964 -13264 -358463 -300976 261074 -59365 -133697 -243469 -126068
18445a26068A09826b0524A21771o0604b86672f9935l6710n1504d9779B07409j577
$$ -126068 109826 -20524 121771 61167 -286672 -69935 -106645 -158149 -49779 207409 205832
18434B05832p7470a87744D18138A79500d8608q1112k40142D3005c68868Q0192
$$ 205832 128362 -187744 418138 179500 -48608 -129720 -369862 43005 -368868 -288676
18424b88676a04917E9654d2087p5102a8953B31883I0614J3347a03096A29908a1746
$$ -288676 -104917 59654 -42087 -117189 -18953 231883 90614 103961 -103096 129908 -11746
18412D6992c40167B11815b514m60118e8202k8256E7942L33227f5930C4899h7362
$$ 46992 -340167 211815 -2514 -462632 -58202 -86458 57942 391169 -65930 34899 -87362
18400A24929a8746b563j36786M9231K0229j8350G8057l4569a65378j6002f1602
$$ 124929 -18746 -2563 -139349 -90118 -69889 -88239 78057 43488 -165378 -181380 -61602
18388A59319n0425b8229A19233J69223b25182a08362d1100A08491l4970J56401
$$ 159319 108894 -28229 119233 288456 -225182 -108362 -41100 108491 73521 229922
18378B29922d0697m2303B15323q8540B8971b67578B33846a01830k72129A58805
$$ 229922 -40697 -83000 215323 126783 28971 -267578 233846 -101830 -373959 158805
18367C5719l894L8568g585k69443C8438Q664a82929b3995C11760A51392a82545
$$ 35719 31825 70393 -7585 -277028 38438 47102 -182929 -23995 311760 151392 -182545
18355I4469p710J62163q3747G0922a09330n2804j74571B55456J2572j17908a40956
$$ 94469 86759 248922 165175 70922 -109330 -162134 -336705 255456 268028 150120 -140956
18343A17492b50916a21666A89178b08074B16155a24120B1351b88322c2931k64830
$$ 117492 -250916 -121666 189178 -208074 216155 -124120 21351 -288322 -32931 -297761
18333b97761A19196O8998G8637c38341B1418J11559K9323b858E0519a73274A25947
$$ -297761 119196 188194 78637 -338341 21418 132977 162300 -2858 50519 -173274 125947
18321b47299A23677b6999m45315C13241a35215K4452k4130m0349C61554b18349
$$ -247299 123677 -26999 -472314 313241 -135215 -110763 -134893 -175242 361554 -218349
18310c29539a28478l1128b6438j64745M2295A47984b12202C71684I2812J17611
$$ -329539 -128478 -159606 -26438 -191183 -148888 147984 -212202 371684 92812 210423
18300B10423J2646N469a11968A23846r679k6313c3008r2004j89843A55974b36580
$$ 210423 223069 228538 -111968 123846 114167 87854 -33008 -125012 -314855 155974 -236580
18288B5551a57877A1795c78906f1752j98347k4084b8794j60571b4000A16564n6459
$$ 25551 -157877 11795 -378906 -61752 -260099 -284183 -28794 -189365 -24000 116564 60105
18277F0105d2571k85565A28171c9786o1796A96613g5828j6942m2500q7847J3971
$$ 60105 -42571 -328136 128171 -39786 -101582 196613 -75828 -92770 -135270 -223117 -209146
18266b09146J1633j1101C4164A1741L5845h2482A50531a55j52688B2371c33347
$$ -209146 -197513 -208614 34164 11741 47586 -82482 150531 -155 -152843 22371 -333347
18254b22867J1426D3723b29652N9137E26a56068A62173a27194L0145q9339o0019
$$ -222867 -211441 43723 -229652 -170515 526 -156068 162173 -127194 -97049 -186388 -246407
18243b46407J04596D5976R9189d1138k21179j25580a33994r0780B5501J88253
$$ -246407 -141811 45976 145165 -41138 -262317 -387897 -133994 -224774 25501 213754
18233B13754f2794A53135L196a86194P8183o6152H450c2886a2442C5501a61177
$$ 213754 -62794 153135 156331 -186194 -108011 -174163 8450 -32886 -12442 35501 -161177
18221i0970b3177E7849a3513k76366B08394a7181E4325b20961C72458H3761M9865
$$ -90970 -23177 57849 -13513 -289879 208394 -17181 54325 -220961 372458 83761 133626
18210A33626a28127H691a45994J9835b7695k4867D9854A3550a03731B35864b4076
$$ 133626 -128127 8691 -145994 -126159 -27695 -52562 49854 13550 -103731 235864 -24076
18198b48800B51276I6308i2609A230e0008c298A87816b8917A10810K71108I8027
$$ -248800 251276 96308 -92609 1230 -50008 -3298 187816 -28917 110810 381918 98027
18186c73272g5786o6925K8366e6509p7906F6239g2407C67901a78261f4116K5718
$$ -373272 -75786 -142711 -114345 -56509 -134415 66239 -72407 367901 -178261 -64116 -38398
18175c8398B38889c50690A13809B2062e1929D4517b42667A9121i3621L0183j29803
$$ -38398 238889 -350690 113809 22062 -51929 44517 -242667 19121 -93621 -63438 -193241
18164a93241M9369C6180a32852r784o9436b2110n50328f1816A59778i4053F5993
$$ -193241 -143872 36180 -132852 -142636 -212072 -22110 -572438 -61816 159778 -94053 65993
18152B59053e4151B65935c10832A89372D3586K39340F9385c65437B70845B9523
$$ 259053 -54151 265935 -310832 189372 43586 282926 69385 -365437 270845 29523
18141c0913j1847A3006L43227b92625a40423k4969d3470j58416c333C85752F6249
$$ -30913 -42760 13006 356233 -292625 -140423 -165392 -43470 -201886 -3333 385752 66249
18129e870n1236j37498D5457b06168L5736A29377c7312A41879b31815B20956o8384
$$ -5870 -57106 -194604 45457 -206168 -170432 129377 -37312 141879 -231815 220956 152572
18118A52572A7748a29933Q788j636B8433a3489k3486k36548E7966a64229A58780
$$ 152572 17748 -129933 -121145 -122781 28433 -13489 -36975 -273523 57966 -164229 158780
18106C66121E8021Q5584i0396L1567l3582n21J8034R576m4445d317j62650N9238
$$ 366121 58021 143605 -90396 -58829 -92411 -92932 -74898 -65322 -109767 -4317 -166967 -107729
18094a07729n2197L9402a7014m8613A11403b65709B01773h1404b2080A50367K37076
$$ -107729 -159926 -120524 -17014 -65627 111403 -265709 201773 -81404 -22080 150367 387443
18083C87443D8193q075e6009C69072a42093G2524a32720M0550d1055A49800a72815
$$ 387443 48193 40118 -56009 369072 -142093 72524 -132720 -92170 -41055 149800 -172815
18071G7646I051R4749N4678b70857a18620A24475g6369k078k789c6950A12498
$$ 77646 9051 103800 158478 -270857 -118620 124475 -76369 -78447 -81236 -36950 112498
18059a61105G5563A8798a28456q429B63149b321j31630A67112b03858P9683G262
$$ -161105 75563 18798 -128456 -136885 263149 -2321 -133951 167112 -203858 -124175 7262
18047d14676I9305D866a20072j0461O1105K1289J3840l94741a1263k08715f9740
$$ -414676 99305 4866 -120072 -130533 -69428 -48139 -34299 -429040 -11263 -219978 -69740
18035b36603J14323F0977a63798K8804a7038j63101L0239B57553k494c6279k2948
$$ -236603 -122280 60977 -163798 -134994 -17038 -180139 -149900 257553 255059 -36279 -59227
18024e9227C736f3604B37339c25960f0362A36429A4441J98054d40171g5762G799
$$ -59227 3736 -63604 237339 -325960 -60362 136429 14441 212495 -440171 -75762 7799
18012e10574b5371m39279a81392A6938d6098E0841g6205K7326k46966c501A80063
$$ -510574 -25371 -464650 -181392 16938 -46098 50841 -76205 -48879 -295845 -3501 180063
18000h4477k3361C34259g6664k29058Q903f9382K6761j12082I1564N9126a58996
$$ -84477 -107838 334259 -76664 -305722 -296819 -69382 -42621 -154703 91564 150690 -158996
17988G7769C7354A4181b1578A3121K21911a45787M6008F7812F528e8674j87494
$$ 77769 37354 14181 -21578 13121 235032 -145787 -99779 67812 6528 -58674 -246168
17977b46168D5483a49905A47980b36212g272A45588a45227e6976k94376C59010
$$ -246168 45483 -149905 147980 -236212 -7272 145588 -145227 -56976 -351352 359010
17966g4328q7378J5238l25677b3454A18532a6192r4033C03364l1093J4992A26755
$$ -74328 -161706 -146468 -472145 -23454 118532 -16192 -110225 303364 272271 287263 126755
17954b13342a01912B60930F2846g4887A94977a42563B64119f532j81915A18522
$$ -213342 -101912 260930 62846 -74887 194977 -142563 264119 -6532 -188447 118522
17943a97550A28393b01953A13781O8594d5317L679k06955g8323B59319b89637
$$ -197550 128393 -201953 113781 182375 -45317 -41638 -248593 -78323 259319 -289637
17932A54043G1651k4474b83079C07045A01374K31057h6981j15796A13819a67655
$$ 154043 71651 47177 -283079 307045 101374 332431 -86981 -202777 113819 -167655
17921B64610D671e3154m0681M1836n2201k29653B59704j06758c9413F2254M62350
$$ 264610 4671 -53154 -93835 -51999 -104200 -333853 259704 152946 -39413 62254 524604
17910E24604a90813g0367k24207a00539d9163D7609a15258d1861C375i4836F0065
$$ 524604 -190813 -70367 -294574 -100539 -49163 47609 -115258 -41861 3375 -94836 60065
17898c72575G0410b34960i8321F6532J30270p0676m2970J61b9197j57245B22023
$$ -372575 70410 -234960 -98321 66532 196802 126126 83156 83317 -29197 -186442 222023
17886e7172A56283a87540c0055q5849F8804d70745A75248c4665B30743b9448C7501
$$ -57172 156283 -187540 -30055 -115904 68804 -470745 175248 -34665 230743 -29448 37501
17874c8484m4607A82933a26466C39456A56450g174l12015a33861A54931A4230
$$ -38484 -83091 182933 -126466 339456 156450 -7174 -319189 -133861 154931 14230
17863b30499a6867E1234M3529B0586R9822a02813B2348b05205j20269A89306h804
$$ -230499 -16867 51234 94763 20586 120408 -102813 22348 -205205 -325474 189306 -8804
17851b63878e9737K4893I488N6063a77024f1429m9478A20416B9632e7818l30808
$$ -263878 -59737 -34844 9488 65551 -177024 -61429 -110907 120416 29632 -57818 -388626
17840c88626a54890K3524A15812a01053B8725e6493B00233B9456J33597n4315
$$ -388626 -154890 -131366 115812 -101053 28725 -56493 200233 29456 163053 108738
17830A08738b07815B15411i9694c4377A51149e0293f350j4399D05997C8868R6998
$$ 108738 -207815 215411 -99694 -34377 151149 -50293 -6350 -20749 405997 38868 135866
17819A35866R3996a1888G6518E382J33083A6582a39994A10505c473B46415A18313
$$ 135866 229862 -11888 76518 5382 138465 16582 -139994 110505 -3473 246415 118313
17807a59267j8150A59729d3235A37730M6339n1540a48430A88318A678b7025n5392
$$ -159267 -177417 159729 -43235 137730 184069 132529 -148430 188318 1678 -27025 -82417
17796h2417a2006B19837j09349h9638a7134g767B08865c73513A20677R3833j9494
$$ -82417 -12006 219837 110488 -89638 -17134 -7767 208865 -373513 120677 214510 195016
17785A95016C5950b34120D2291d9944A82123J34212G4608L30591E4330e2739j55210
$$ 195016 35950 -234120 42291 -49944 182123 316335 74608 405199 54330 -52739 -207949
17774b07949K0940C0512d9926I1087l8594b48347a12956B6972b27489m11760b29908
$$ -207949 -187009 30512 -49926 91087 52493 -248347 -112956 26972 -227489 -639249 -229908
17762G8835b6801I4462P3332b23095A54258a7385j86960e9284E0462J51183c00107
$$ 78835 -26801 94462 167794 -223095 154258 -17385 -204345 -59284 50462 201645 -300107
17750b39978b4702k44999D21044a3780j77816l63652E5235F438K27717o2802b7565
$$ -239978 -24702 -269701 421044 -13780 -191596 -555248 55235 6438 234155 171353 -27565
17738D70774a99523C40184b92603g2397B06517g2523j20310C8129g4778D3504
$$ 470774 -199523 340184 -292603 -72397 206517 -72523 -192833 38129 -74778 43504
17727a68779B77412A13016l0182a35957d7923A03827c21889g7017q692M476k40144
$$ -168779 277412 113016 82834 -135957 -47923 103827 -321889 -77017 -85709 -81233 -321377
17716c21377O9606A22210A9013K0195a53741m3250b4891j48575N959g2464A76857
$$ -321377 -251771 122210 19013 39208 -153741 -196991 -24891 -173466 -167507 -72464 176857
17704c76664A62889J2488c93618C62918b41897A73113b9466j19633B37054J20083
$$ -376664 162889 175377 -393618 362918 -241897 173113 -29466 -149099 237054 357137
17694C57137A01201k8379K0241g4275B58720a15537l0360A56592a96983f5982
$$ 357137 101201 72822 93063 -74275 258720 -115537 -145897 156592 -196983 -65982
17683a453j32854F3275N3202j3000d11773K01568A00710f3259j66003B64875a09323
$$ -1453 -134307 63275 116477 103477 -411773 -210205 100710 -63259 -229262 264875 -109323
17671c29664A16826a00862e084A25795b10796N5838A25725a04452N0831l6089
$$ -329664 116826 -100862 -5084 125795 -210796 -154958 125725 -104452 -53621 -89710
17661h9710B71090o5816R7538K9195a32266j50258A60871m4727D656c91301J82478
$$ -89710 271090 205274 302812 332007 -132266 -282524 160871 116144 4656 -391301 -208823
17650b08823i84A59712a15485C4662A5878a18397L36A6630O7617J7288a26947
$$ -208823 -984 159712 -115485 34662 15878 -118397 -118061 16630 84247 101535 -126947
17638b54359b3972P479k5718B1383a28079G044K69597C7290g5842A4010a03577
$$ -254359 -23972 -16493 -42211 21383 -128079 7044 276641 37290 -75842 14010 -103577
17626B48280a95662A37339a621A46011e625k1531p3055n7661A35249C9472J32958
$$ 248280 -195662 137339 -1621 146011 -5625 -27156 -100211 -157872 135249 39472 172430
17615A72430b46537A89584O98q8600o453a29323k6109B07409A7957J18935J1964
$$ 172430 -246537 189584 190282 101682 95229 -129323 -155432 207409 17957 136892 148856
17604A48856b59232a20878A26071a70465P5302A34624i144A15099M3003E3720
$$ 148856 -259232 -120878 126071 -170465 -95163 134624 -9144 115099 158102 53720
17593b60968C12216b6902A71991b6498k84424a29226D8664i3968m3619J8448H4527
$$ -260968 312216 -26902 171991 -26498 -310922 -129226 48664 -93968 -137587 -119139 84527
17581B46757o2474f2930F8008l734Q1094a76924c2238G6748Q4525b9962D3527
$$ 246757 184283 -62930 68008 64274 145368 -176924 -32238 76748 161273 -29962 43527
17569B77822A07066a84292I2265C2484J8176A0357h620j8336A20708N2512K15155
$$ 277822 107066 -184292 92265 32484 50660 10357 -8620 -26956 120708 173220 388375
17558C88375j25214H2434k2862K8236m0709j1590A956K17004L8919g7122C4043
$$ 388375 263161 82434 59572 87808 47099 35509 1956 218960 257879 -77122 34043
17546H2701d1015k13269D6766a45705j55058D09096I2001K3654h928A13023J22690
$$ 82701 -41015 -254284 46766 -145705 -300763 409096 92001 115655 -8928 113023 235713
17535B35713i2924D12785j57223b82457a07519F0688a19011A26398J57553a86324
$$ 235713 -92924 412785 255562 -282457 -107519 60688 -119011 126398 283951 -186324
17524h6947l6275B17546L0397H3247O9339a40605G8642J27151B8590a29273A53696
$$ -86947 -123222 217546 247943 83247 152586 -140605 78642 205793 28590 -129273 153696
17512c6639m6971m1278c2512j0557H4912a51025A35126l8406P3550a17342A68202
$$ -36639 -83610 -124888 -32512 -43069 84912 -151025 135126 96720 170270 -117342 168202
17500f7530j63517A4411g5465B3982a2433D35054B07244h9293B39734g4930J2866
$$ -67530 -231047 14411 -75465 23982 -12433 435054 207244 -89293 239734 -74930 -62064
17489f2064B23544H5189K50869n8413L685o8975g2133A27672B9984L56894a46469
$$ -62064 223544 85189 336058 277645 281330 212355 -72133 127672 29984 386878 -146469
17477a46271F8562a15853l6718A33548L39932A16421P5352b936A79931A6235Q7052
$$ -146271 68562 -115853 -152571 133548 473480 116421 191773 -2936 179931 16235 103287
17466A03287Q492B4820d9401B7074J63309i3872b2475C3819L7353K73080A67487
$$ 103287 111779 24820 -49401 27074 190383 -93872 -22475 33819 71172 344252 167487
17454B19414M11492I2973A8860L57676J20153m6271k16677I6257P9473J23068
$$ 219414 630906 92973 18860 376536 496689 450418 233741 96257 175730 298798
17444B98798A47857b15536A2990Q9556E629K97191H6713L67383H5185J52481a2679
$$ 298798 147857 -215536 12990 102546 5629 302820 86713 454096 85185 237666 -12679
17432C5154e9174B97347H4875d7028G993J81933j4968J36605A06101j1191d046
$$ 35154 -59174 297347 84875 -47028 7993 189926 174958 311563 106101 94910 -4046
17420H6009L05596j74661B7471J19357P513P26R1294E4624L9182h32B83229D4283
$$ 86009 391605 216944 27471 146828 154341 155067 246361 54624 93806 -832 283229 44283
17407F5511L1145e4094C23214j20534J90293d1435A82697J14728E9717R9461E9942
$$ 65511 96656 -54094 323214 202680 392973 -41435 182697 297425 59717 159178 59942
17395B16620q0903b1968n5500B98686j16361O6827c81813A63762m5900K68203
$$ 216620 135717 -21968 -77468 298686 182325 249152 -381813 163762 117862 386065
17385C86065B4167M2416b31090A08625m0199N4989h8629D6893K49795b34172a2224
$$ 386065 24167 66583 -231090 108625 68426 123415 -88629 46893 296688 -234172 -12224
17373H9989b05313a2961C58781A31054c5980C23494p796g718B47946p0228k541
$$ 89989 -205313 -12961 358781 131054 -35980 323494 315698 -7718 247946 177718 175177
17362A75177J05125a20123A44210e149j0133k86811H5637k7606j9396b2714k1524
$$ 175177 280302 -120123 144210 -5149 -15282 -302093 85637 58031 38635 -22714 -44238
17351d4238A7269K45950a31001B32849F3894b79270A23657J39626o5233g163k08782
$$ -44238 17269 263219 -131001 232849 63894 -279270 123657 263283 198050 -7163 -215945
17340b15945J07754A89869P2474A09074J41880J813J13927n106a32872A17657
$$ -215945 -108191 189869 262343 109074 250954 252767 366694 361588 -132872 117657
17329d1069C57010O5563H217J06086C0082a3949A04266J88717f1098A23136j6227
$$ -41069 357010 422573 8217 114303 30082 -13949 104266 292983 -61098 123136 106909
17318A06909N7397C0022P7946A3249L76856A76876n3297e4657I0680D0614a57852
$$ 106909 164306 30022 107968 13249 390105 176876 123579 -54657 90680 40614 -157852
17306E8992a34588A9813N6266J74955I7523l4881K16627O7597C9502J63480I1599
$$ 58992 -134588 19813 76079 251034 97523 62642 279269 346866 39502 202982 91599
17294B23668q8616p259J17806H4585k9300R4805c0141k12980f8488k5280C34261
$$ 223668 135052 127793 245599 84585 55285 150090 -30141 -243121 -68488 -93768 334261
17282A06893J05573a94938A79935D0813J4021J25358b48906i3575D9703L02604
$$ 106893 212466 -194938 179935 40813 54834 180192 -248906 -93575 49703 352307
17272C52307j3197G7774J31845D7577J77457J61150j58678b51613A25081J28129
$$ 352307 339110 77774 209619 47577 225034 386184 227506 -251613 125081 253210
17262B53210r5435i2272g003P58A42157K87539A73428J35077A49552n0705a434
$$ 253210 157775 -92272 -7003 -6245 142157 429696 173428 308505 149552 98847 -1434
17250B24489C5326D30L33857A16768K81195j76065O6755a47213A8333J77581J99815
$$ 224489 35326 430 334287 116768 397963 221898 288653 -147213 18333 195914 395729
17239C95729l2547a23025F95806A03794b355B93767m0295H9649J49313a8590D24719
$$ 395729 363182 -123025 695806 103794 -2355 293767 253472 89649 238962 -18590 424719
17227A70814G0507D360K944J29397J05227n6943J17997K8411A57174C3467K31952
$$ 170814 70507 4360 7304 136701 241928 184985 302982 331393 157174 33467 265419
17216B65419K71731B8574J23105k8428J09988F8434K29511K45833A41669n6323
$$ 265419 537150 28574 151679 123251 233239 68434 297945 543778 141669 85346
17206H5346l1301N3832j7827h0677E07290C0523L6872L48698E2035K06263r4086
$$ 85346 54045 107877 90050 -80677 507290 30523 67395 416093 52035 258298 164212
17195A64212n8989L27792A34823a24870D53551d722A12437i9138B92475l3250
$$ 164212 105223 433015 134823 -124870 453551 -4722 112437 -99138 292475 259225
17185B59225K00018k22275j255O8557J60456j4238E8860J73702A7922e579j75189
$$ 259225 459243 236968 235713 304270 464726 450488 58860 232562 17922 -5579 -180768
17174a80768A16046L9723o6141K47358K08281A27520o0139I14a5541C3662K84222
$$ -180768 116046 155769 89628 336986 545267 127520 67381 914 -15541 33662 317884
17163C17884R9434K1315j49816r4857p1416K4018J93356a22534C51350c1367A46878
$$ 317884 417318 438633 288817 193960 122544 146562 339918 -122534 351350 -31367 146878
17151A36304J90328J57569H0844D196M87771I5956K58096l080j4724J49728B39835
$$ 136304 326632 484201 80844 4196 491967 95956 354052 350972 336248 485976 239835
17139C91523P5560k02720E0232K75567I8177m7433L43993b0436E20241B48481
$$ 391523 467083 264363 50232 325799 98177 50744 394737 -20436 520241 248481
17128C97496a20619A56269n5603P2608J04905J35636J457P2033q1083j58924i2169
$$ 397496 -120619 156269 100666 173274 278179 413815 415272 487305 406222 247298 -92169
17116D25727j97908K49560O4087j32445R5943B40058a446D08630Q1334A64469
$$ 425727 227819 477379 541466 409021 504964 240058 -1446 408630 489964 164469
17105E32973r9052f3054b7356D49398j81269J13193j4383L7297j777A50653K21789
$$ 532973 433921 -63054 -27356 449398 268129 381322 366939 404236 402459 150653 372442
17094C72442A70321f021A57348G1536O36940A53801J50868k1132L04535k18146
$$ 372442 170321 -6021 157348 71536 708476 153801 304669 283537 588072 369926
17084C69926J22856j91401L98703B32847L27990j64134O2464K64060l16475p3897
$$ 369926 492782 301381 700084 232847 560837 396703 459167 723227 406752 332855
17074C32855K10450j52669F5268J42426B0710N59793j22542A14941J38024n7636
$$ 332855 543305 390636 65268 207694 20710 580503 457961 114941 252965 195329
17064A95329G8872Q7405K17286m1732Q0189J12823j04324p6026A56854R2220L02692
$$ 195329 78872 166277 383563 341831 422020 534843 430519 354493 156854 249074 551766
17053E51766R02j73065r0602L89593C26634K3471A55656m6658M08201B1435K50236
$$ 551766 552668 379603 289001 678594 326634 350105 155656 108998 517199 21435 271671
17042B71671j9933N54529l36193M2977M70k29996L71619j30741n0126J59050j90846
$$ 271671 251738 806267 470074 513051 513521 283525 655144 524403 474277 633327 442481
17031D42481L25995C35018J92431p6053j41600L30875A67708K49872L47410l39724
$$ 442481 768476 335018 527449 451396 309796 640671 167708 417580 764990 425266
17021D25266J52485J37937a06225D51798L3012B21746L67303l9380l4660j52937
$$ 425266 577751 715688 -106225 451798 484810 221746 589049 549669 515009 362072
17011C62072K63979B01815K54807m5797Q4708R8375R7606j84219N48076n18333
$$ 362072 626051 201815 456622 410825 495533 593908 691514 507295 1055371 537038
17001E37038p1423r4251M87603D08823O14133l88779p9360K9156j86355P0407
$$ 537038 465615 371364 858967 408823 1022956 634177 554817 583973 397618 468025
16991D68025L5324K10813R9694J11917D51903L07949j5579J4196K6648p9428L41445
$$ 468025 503349 714162 813856 925773 451903 759852 744273 758469 785117 705689 1047134
16980A047134m91588L32705k87387K00603l86707k2005M60779k32555J69705P1073
$$ 1047134 555546 888251 600864 801467 414760 392755 853534 620979 790684 861757
16970H61757J7372k23017P1725q7499J88500p9361J34171r5224K1154j00140N8290
$$ 861757 879129 656112 727837 640338 828838 749477 883648 788424 809578 709438 767728
16959G67728J90275K11780E58009N32449j98738J08843j59693J77018j10324j03280
$$ 767728 958003 1169783 558009 1090458 891720 1000563 840870 1017888 907564 804284
16949H04284K42027k17804L86941l85660K10950l925j55543j56194K2315K4904
$$ 804284 1046311 828507 1215448 829788 1040738 1036813 881270 725076 747391 772295
16939G72295J98813n163N6420k86952N18841m64697K12679N4154l33P6145k99251
$$ 772295 971108 965945 1022365 735413 1254254 789557 1002236 1056390 1056057 1132202 832951
16928H32951K64378J01234O4759N5902j63523p794j98134K66113L9081k50923
$$ 832951 1097329 1198563 1263322 1319224 1155701 1147907 949773 1215886 1254967 1004044
16918A004044M0242j79437M50892j79722J09102J62515j90347P717Q6302R2830
$$ 1004044 1044286 864849 1315741 1136019 1245121 1407636 1217289 1225006 1311308 1404138
16908A404138k02925M03852m93758K11321L47168l97935r0489J30766P1117L13571
$$ 1404138 1201213 1605065 1111307 1322628 1669796 1271861 1181372 1312138 1383255 1696826
16898A696826q660j99383k87765J23228L57035L44068p31237K84743J25848o2786
$$ 1696826 1688166 1488783 1201018 1324246 1681281 2025349 1294112 1578855 1704703 1641917
16888A641917j51719P8976L12040m38152K25901J27022J30992k0058N5840p9968
$$ 1641917 1490198 1569174 1881214 1443062 1668963 1795985 1926977 1906919 1962759 1882791
16878A882791K560k90585N40401j0973l07724J79435P019K52728l21054J07676
$$ 1882791 1885351 1594766 2135167 2124194 1816470 1995905 2002924 2255652 1934598 2042274
16868B042274k62807N63128l2074j05930Q9255J16652n82462M47558K9433M1562
$$ 2042274 1779467 2342595 2310521 2204591 2293846 2410498 1828036 2275594 2305027 2346589
16858B346589L5940k7222j1495J02798R3399k76532M46872k4544J94788J69146
$$ 2346589 2382529 2355307 2343812 2446610 2540009 2263477 2710349 2685805 2880593 3049739
16848C049739o6784L37054m80659K22700K56551j88866M7105n6225J55859j61265
$$ 3049739 2982955 3320009 2839350 3062050 3318601 3129735 3176840 3120615 3276474 3115209
16838C115209J80259P1490m9676j78363O38783L2978l26405L91678j13269P7362
$$ 3115209 3295468 3366958 3317282 3138919 3777702 3810680 3484275 3875953 3762684 3840046
16828C840046J06211J55608L14964k23837K13497J08550J05430R0632P5261l25020
$$ 3840046 3946257 4101865 4416829 4192992 4406489 4515039 4620469 4711101 4786362 4461342
16818D461342K85087K21865O5800J57559k40872O81202l92221j03835P87960m26279
$$ 4461342 4746429 4968294 5034094 5191653 4950781 5631983 5239762 5135927 5923887 5497608
16808E497608N95303R1975K31902M97004o60133N34132r5333M91070l3993J12104
$$ 5497608 6092911 6184886 6416788 6913792 6253659 6787791 6692458 7183528 7149535 7261639
16798G261639J19684K61987J64002K60870L85929L61228j87348L79644L99370
$$ 7261639 7381323 7643310 7807312 8068182 8454111 8815339 8627991 9007635 9407005
16789I407005K43409L89817L9177J48346L54827L54982K60612K93174K95270N50039
$$ 9407005 9650414 10040231 10079408 10227754 10582581 10937563 11198175 11491349 11786619 12336658
16779A2336658r1672J042936L78030J1328R59187J32705J87832O67536Q66491
$$ 12336658 12244986 13287922 13665952 13677280 14636467 14769172 14957004 15624540 16491031
16770A6491031P40515M87061P00526P78052M22002J170312O30108R20729J022707
$$ 16491031 17231546 17718607 18419133 19197185 19619187 20789499 21419607 22340336 23363043
16761B3363043O47215J064346R23557J604081J041602J139513J640868J085625
$$ 23363043 24010258 25074604 25998161 27602242 28643844 29783357 31424225 32509850
16753C2509850J718313J569903J828330K088947K021212J674199K555048K458304
$$ 32509850 34228163 35798066 37626396 39715343 41736555 43410754 45965802 48424106
16745D8424106K774186K284694L227449L597111K981616L969246M126447M301900
$$ 48424106 51198292 53482986 56710435 60307546 63289162 67258408 71384855 75686755
16737G5686755M587985M992260N036313N654040N623925N974223O455990O550345
$$ 75686755 80274740 85267000 90303313 95957353 101581278 107555501 114011491 120561836
16729A20561836O393793O596544O553441O369847O273228N553465M740198M324456
$$ 120561836 126955629 133552173 140105614 146475461 152748689 158302154 163042352 167366808
16721A67366808L075905K145721J296832j62228j430752k650938l171328m343842
$$ 167366808 170442713 172588434 173885266 173723038 172292286 169641348 166470020 162126178
16713A62126178n035837n717414o216116o431678o464696o840946o632720o205840
$$ 162126178 157090341 151372927 145156811 138725133 132260437 125419491 118786771 112580931
16705A12580931o481216n919181n712534n798571m884482n100092m181433m650032
$$ 112580931 106099715 100180534 94468000 88669429 83784947 78684855 74503422 69853390
16697F9853390l837746l813770l388196l391863l263055k581614k555074k062431
$$ 69853390 66015644 62201874 58813678 55421815 52158760 49577146 47022072 44959641
16689D4959641k410548k385880j745629j926566j784532j600770j593377j290051
$$ 44959641 42549093 40163213 38417584 36491018 34706486 33105716 31512339 30222288
16681C0222288j495704j209494j044623j492867o57265j070385q63287j047658
$$ 30222288 28726584 27517090 26472467 24979600 24322335 23251950 22388663 21341005
16673B1341005n50726j142549o09549n79999p44590p69574l01566o32789p64249
$$ 21341005 20790279 19647730 19038181 18458182 17713592 16944018 16642452 16009663 15245414
16664A5245414m68515l49099m78047n67863n29208l3301p28220l33653q3450n09815
$$ 15245414 14776899 14427800 13949753 13381890 12852682 12819381 12091161 11757508 11674058 11164243
16654A1164243j16976o56662j72139l40109p5462m49149M2054o01846m21562L13693
$$ 11164243 11047267 10390605 10218466 9878357 9802895 9353746 9395800 8793954 8372392 8686085
16644H686085l17301k13686l25454l34239q2094k02828j19578j05597j3193k56804
$$ 8686085 8368784 8155098 7829644 7495405 7413311 7210483 7090905 6985308 6972115 6715311
16634F715311k92051O587m44430m49671L78183J03929l82323k30949n3450L3443
$$ 6715311 6423260 6429847 5985417 5535746 5913929 6017858 5635535 5404586 5351136 5384579
16624E384579k24198k96412K58732k75224k26481l29533K72676k90294k54302
$$ 5384579 5160381 4863969 5122701 4847477 4620996 4291463 4564139 4273845 4019543
16615D019543K21327n7878k00526J995K44359J14545m93749R8064k28681l81734
$$ 4019543 4240870 4182992 3982466 3984461 4228820 4343365 3849616 3947680 3718999 3337265
16605C337265L24689k76237M48153l88589k03138Q9053J51488k83947K0129k34773
$$ 3337265 3661954 3385717 3833870 3445281 3242143 3331196 3482684 3198737 3218866 2984093
16595B984093j3676k0670k55065L32313m23011J73541n1715k8392l8088j99967
$$ 2984093 2970417 2949747 2694682 3026995 2603984 2777525 2725810 2697418 2659330 2459363
16585B459363J37758l29393L47517n5632k95918K63605j06833j14899L32817j62214
$$ 2459363 2597121 2267728 2615245 2559613 2263695 2527300 2420467 2305568 2638385 2476171
16575B476171l82986l4800l7420K69946p1034J47130m03307K62402k42655O3545
$$ 2476171 2093185 2058385 2020965 2290911 2219877 2367007 1963700 2226102 1983447 2046992
16565B046992j53388O5859l96634O18228m76096P4308L27495m54326J52526k61545
$$ 2046992 1893604 1959463 1562829 2181057 1704961 1779269 2106764 1652438 1804964 1543419
16555A543419K73299m736k70613J34367j09403J88559p951j19013L9251j08687
$$ 1543419 1816718 1811982 1541369 1675736 1566333 1754892 1746941 1627928 1667179 1558492
16545A558492L9229k16082L13719k07626k5807L25420o35870N24821k40984j58071
$$ 1558492 1597721 1381639 1695358 1487732 1461925 1787345 1151475 1676296 1435312 1277241
16535A277241k01203J16784M11246k64280L85061l61167K01332j70167l31788
$$ 1277241 1076038 1192822 1604068 1339788 1724849 1363682 1565014 1394847 1063059
16526A063059K75045p7330K923k87930L4730O6723K70948k53268J71481k19595
$$ 1063059 1338104 1260774 1263697 975767 1010497 1077220 1348168 1094900 1266381 1046786
16516A046786K29421j85952J87687q3591k84880M0174J64193j72317j39632L42071
$$ 1046786 1276207 1090255 1277942 1194351 909471 949645 1113838 941521 801889 1143960
16506A143960j39321k67701M9273k19846K58184K99413R2346m47558J18210l02797
$$ 1143960 1004639 736938 786211 566365 824549 1123962 1216308 768750 886960 584163
16496E84163K19487O55248l99699J2648k84465K3797J14473l18590K79131k88176
$$ 584163 803650 1458898 1059199 1071847 787382 811179 925652 607062 886193 598017
16486E98017K02104R8185j41125K48409M9415k33931m2103q8510J05115P0091
$$ 598017 800121 898306 757181 1005590 1055005 821074 778971 690461 795576 865667
16476H65667K8396j91703J7460J33397M38527E68693J1396p6476K56705l31957
$$ 865667 894063 702360 719820 853217 1291744 568693 580089 503613 760318 428361
16466D28361N70460l18311O4129K8894j99579K09372K715k04204J71845M17k38495
$$ 428361 998821 680510 744639 773533 573954 783326 786041 581837 753682 754099 515604
16455E15604O5474L45105l86865J795J18248J62055l48591l4635j84182K11950
$$ 515604 581078 926183 539318 541113 659361 821416 472825 438190 254008 465958
16445D65958K80039q8081J00314N0558j54062R4095k06595q6131L72774p055j62324
$$ 465958 745997 657916 758230 808788 654726 748821 542226 456095 828869 821814 659490
16434F59490j12235K26522O8838j32210l37591K17413j07323J19483j55450J91432
$$ 659490 547255 773777 842615 710405 372814 590227 482904 602387 446937 638369
16424F38369r5992j19629Q7457L17243C89747L91194j17233k30310J79011J67334
$$ 638369 542377 422748 510205 827448 389747 780941 663708 433398 612409 779743
16414G79743k65069j54351R8731k21494L14003j4993J24301J46191q6594k88570
$$ 779743 514674 360323 459054 237560 551563 536570 660871 807062 720468 431898
16404D31898Q0151J6790j34062J18349j49516O1746J77942l3453q5354Q7289j01408
$$ 431898 512049 528839 394777 513126 363610 425356 603298 569845 484491 571780 470372
16393D70372K18132C05828K15303k1196k18570N45307B16197N80610k62135j31103
$$ 470372 688504 305828 521131 499935 281365 826672 216197 796807 534672 403569
16383D03569J0438p4637L02859l09665o9656K87429A79673L07782J29038C05740
$$ 403569 414007 339370 642229 332564 262908 550337 179673 487455 616493 305740
16372C66165j80317J28497m2119J32256n6413j9857k0175L76884C21020K45553
$$ 366165 185848 314345 272226 404482 348069 328212 308037 684921 321020 566573
16362E66573j6029B68537K86593J33609A56996J50150K4801M74442A25123J66257
$$ 566573 550544 268537 555130 688739 156996 307146 331947 806389 125123 291380
16352B91380L15470B23598M82242l09321j61352K96593r6361Q0491K12434k79423
$$ 291380 606850 223598 705840 396519 235167 531760 435399 515890 728324 448901
16342D48901J9666j20900O0793i4857E29079k09243K54250B0794N46627L4798
$$ 448901 468567 347667 408460 -94857 529079 319836 574086 20794 567421 602219
16332F02219Q0742B68156L7482J16238K00048j33411j71516j4338m490J73494
$$ 602219 682961 268156 305638 421876 621924 488513 316997 302659 298169 471663
16322D71663B22531M07360j17054E6604L82806B5287R8557k2119L07698J77033
$$ 471663 222531 629891 512837 56604 439410 25287 123844 101725 409423 586456
16312E86456j59806J15598p5839r2663A16537L67065J24670A59001K05015o8817
$$ 586456 426650 542248 466409 373746 116537 483602 608272 159001 364016 295199
16302B95199k3357H5919L08786A57284L09989g0185E85803A61775k0689M9958
$$ 295199 271842 85919 394705 157284 467273 -70185 585803 161775 141086 191044
16292A91044N6735K55274I2621J01950K14954j87304m5928K32427j12893N3382
$$ 191044 247779 503053 92621 194571 409525 222221 176293 408720 295827 349209
16282C49209A21446J98659n4072K08096F7265J46005A4375L99742A19994K83588
$$ 349209 121446 320105 266033 474129 67265 213270 14375 414117 119994 403582
16272D03582j28430j27400J19055J75209O9206c343A52361M69639B59283F1207
$$ 403582 275152 147752 266807 442016 511222 -3343 152361 622000 259283 61207
16261D41429J65730R463I4045L69163C178J66443j0181j9423J23164n511J29837
$$ 441429 607159 616622 94045 463208 3178 169621 159440 140017 263181 257670 387507
16250C87507l2763E1426J07696J09135i2277A21991Q5758q3735K08253A24298
$$ 387507 354744 51426 159122 268257 -92277 121991 207749 124014 332267 124298
16239H4182M98594M6171i918G85755i476B13121K4875q2515M3517F1318K39908
$$ 84182 582776 628947 -9918 785755 -9476 213121 237996 155481 198998 61318 301226
16228C01226p0482K9120o3739f8067A73503o3350N2064M962K886L19910k33481
$$ 301226 230744 259864 196125 -68067 173503 110153 162217 167179 170065 489975 256494
16217B56494b20427B02220R9234j42109A9152J11616O9019a56200A32097Q3096
$$ 256494 -220427 202220 301454 159345 19152 130768 199787 -156200 132097 215193
16207B15193g7525C25488g2664D187N2237a20359B01316c06567B16834G0494e0931
$$ 215193 -77525 325488 -72664 4187 56424 -120359 201316 -306567 216834 70494 -50931
16195I3972J52228b68703A08408L62853g7328D75146A5436J03528J70242A27787
$$ 93972 246200 -268703 108408 471261 -77328 475146 15436 118964 289206 127787
16184d0326C78061j11078M1485a86616i42B72862O8039n9966B78J96914K67311
$$ -40326 378061 266983 308468 -186616 -942 272862 340901 280935 278 197192 464503
16173D64503A42793K11579o6343P9749A60612C6656c9944C91645G286J26744L32857
$$ 464503 142793 354372 288029 367778 160612 36656 -39944 391645 7286 134030 466887
16162D66887B28211k2235o5275J5404P1571I7997i3082A27779c7530m9754o3872
$$ 466887 228211 205976 140701 156105 227676 97997 -93082 127779 -37530 -87284 -151156
16151a51156B53131j11126K38673e5119C13072d1267o5243A13718K10250p0108
$$ -151156 253131 142005 380678 -55119 313072 -41267 -106510 113718 323968 253860
16141B53860a00873B76240b4340G8706J82433F4432J51222d5416j19886B76579
$$ 253860 -100873 276240 -24340 78706 261139 64432 215654 -45416 -165302 276579
16130A24207k5080L2721E1597M09287D9735K1709J14687C4421L03430A49319D1812
$$ 124207 99127 131848 51597 460884 49735 71444 186131 34421 337851 149319 41812
16118g5407C14973c15693c9769k9433K5279j23825B49539j0671a38944H5440d2343
$$ -75407 314973 -315693 -39769 -69202 -43923 -167748 249539 238868 -138944 85440 -42343
16106G2482d6383A18970C2784J96100a57077o9914B5005J58708m7525M73062b33507
$$ 72482 -46383 118970 32784 228884 -157077 -226991 25005 183713 136188 609250 -233507
16094a12196A055K91486e8648J6725C2023A1672a9230p6880B21905r2089a29067
$$ -112196 1055 292541 -58648 -41923 32023 11672 -19230 -96110 221905 129816 -129067
16082H4363f2784b3041l3691i476j4988A31421g237l21062A24768a64657A7239
$$ 84363 -62784 -23041 -56732 -9476 -24464 131421 -7237 -328299 124768 -164657 17239
16070C82143j25998M9134A04630a78191D60076D3738a89553h8637n893B91738
$$ 382143 256145 305279 104630 -178191 460076 43738 -189553 -88637 -94530 291738
16059b87161A36037M8626n2318d1291A1115g0841A63363b2939A18587a18589J7138
$$ -287161 136037 184663 132345 -41291 11115 -70841 163363 -22939 118587 -118589 -101451
16048a01451E6449K92056a21123A6515N46311a28732B23693a853j972r8597G7623
$$ -101451 56449 348505 -121123 16515 562826 -128732 223693 -1853 -3825 -102422 77623
16036I9594k6633d0717j62874h8700a3993o7656E4973A1653f1282K5957l7064
$$ 99594 72961 -40717 -203591 -88700 -13993 -81649 54973 11653 -61282 -35325 -72389
16025g2389A38631O5015a84602d8564p617b881j59923M7264B4769M5031a51328
$$ -72389 138631 203646 -184602 -48564 -56181 -2881 -162804 -115540 24769 69800 -151328
16013i9670B22831C6724J13791D4800N4323B4110J57941b2355A47232a5744p1719
$$ -99670 222831 36724 150515 44800 99123 24110 182051 -22355 147232 -15744 -87463
16002h7463j34684b3789G9561K26672c1263A42279J2506c4379D426J76091E7808
$$ -87463 -222147 -23789 79561 306233 -31263 142279 154785 -34379 4426 180517 57808
15990D3390a15778B12463f063A04065J20453a6610B52926b01878H2372d4397B41770
$$ 43390 -115778 212463 -6063 104065 224518 -16610 252926 -201878 82372 -44397 241770
15978C33476F0840R5108K87583E8831K20289a5013j65788A65004J28490a96486
$$ 333476 60840 155948 443531 58831 279120 -15013 -180801 165004 293494 -196486
15967B33163f567k57019B478a88609B0172J04526a84865A00820c48868J22599
$$ 233163 -6567 -263586 2478 -188609 20172 124698 -184865 100820 -348868 -226269
15957b26269f1307j08674b8648m12990D4899i2809A30129n5385b95267A36667
$$ -226269 -61307 -169981 -28648 -441638 44899 -92809 130129 74744 -295267 136667
15946A10173k3616a07158j84482G9437i9413p490E6745n274a31884N9596q733
$$ 110173 86557 -107158 -291640 79437 -99413 -106903 56745 51471 -131884 -72288 -81021
15935h1021n4588B7520J91776o1801a71650b2579r1063A50430r617b70648a25665
$$ -81021 -135609 27520 219296 157495 -171650 -22579 -113642 150430 140813 -270648 -125665
15923F5706b31759B30759a06443l39078D816c68770h0389J4475p7636F1279a52119
$$ 65706 -231759 230759 -106443 -445521 4816 -368770 -80389 -65914 -143550 61279 -152119
15911g6162j53805N9741j5835q7513g4682B2659h9036A96591B1184e4140L994
$$ -76162 -229967 -170226 -186061 -273574 -74682 22659 -89036 196591 21184 -54140 -50146
15900e0146A9877c24587J08344n4369A12718b03951b5015A09077J0859Q9J01092
$$ -50146 19877 -324587 -216243 -270612 112718 -203951 -25015 109077 119936 120025 221117
15889B21117J23975A69091b49542g5190A32822j9348b21709a335j44839j50662
$$ 221117 345092 169091 -249542 -75190 132822 113474 -221709 -1335 -146174 -296836
15879b96836e0521C5135g1693F4639i2555b3665l4590j18345H518i4921a4619
$$ -296836 -50521 35135 -71693 64639 -92555 -23665 -58255 -176600 8518 -94921 -14619
15867a00081o1444L2853C4689M1981e0234A70013J74754b99644M701H0596A6005
$$ -100081 -161525 -128672 34689 76670 -50234 170013 344767 -299644 -294943 80596 16005
15855c02434I7246a05625j13588F8593b41186J15411A25313a37301b948q7512
$$ -302434 97246 -105625 -219213 68593 -241186 -125775 125313 -137301 -2948 -90460
15845i0460m8812F2149r869P7579B3310c5782n2875C518h0190E5557d057j46728
$$ -90460 -139272 62149 52280 129859 23310 -35782 -88657 3518 -80190 55557 -4057 -150785
15833a50785j53042C81421b7513A06889K40301d5942A98657G1829c39414R1915
$$ -150785 -303827 381421 -27513 106889 347190 -45942 198657 71829 -339414 -247499
15823b47499C835J41085b44015a19822A38652d1120j71768E8982r848L17911a79276
$$ -247499 3835 144920 -244015 -119822 138652 -41120 -212888 58982 49134 367045 -179276
15811A07394h0234A09925P7303a0997D1024f6319F5877R5105d8536j61391I3219
$$ 107394 -80234 109925 187228 -10997 41024 -66319 65877 160982 -48536 -209927 93219
15799A70866a38027K070B05081c61150J77309A26979h7970c8721I7967e3843B70489
$$ 170866 -138027 -135957 205081 -361150 -183841 126979 -87970 -38721 97967 -53843 270489
15787C8450a53925A72032a2373j11028m4571l8843h1714B00955G4693A189a38568
$$ 38450 -153925 172032 -12373 -123401 -167972 -206815 -81714 200955 74693 1189 -138568
15775g3580J7097B2591h7733D3599M3796a49556r1109B5801b60459m8054E1789
$$ -73580 -56483 22591 -87733 43599 87395 -149556 -240665 25801 -260459 -308513 51789
15763b464D86217b11626F3927e0228l11288A10529i3985A83357b00474i7583D1871
$$ -2464 486217 -211626 63927 -50228 -361516 110529 -93985 183357 -200474 -97583 41871
15751F6158a12067F4997O1126Q7314A6659b09180A05570a61700J1065e0945A16047
$$ 66158 -112067 64997 126123 213437 16659 -209180 105570 -161700 -150635 -50945 116047
15739B01574a0259r0081H7671J5972c70979a80872C335i2917K6042j81919g4395
$$ 201574 -10259 -100340 87671 103643 -370979 -180872 3335 -92917 -66875 -248794 -74395
15727b24085l4895a11876r4865c6060j96151A55187b43029d2401A54975a6392
$$ -224085 -258980 -111876 -206741 -36060 -232211 155187 -243029 -42401 154975 -16392
15716A51920d1557j32082B9623d6867A04581b05072A33694D8792b70320j7733
$$ 151920 -41557 -173639 29623 -46867 104581 -205072 133694 48792 -270320 -288053
15706b88053q7070A09635c7127B7481b5865k84832G8396k2155k814b92614F6998
$$ -288053 -375123 109635 -37127 27481 -25865 -310697 78396 56241 53427 -292614 66998
15694I7793l8453L71277E5682K7122b93216b5219G950K51535a03009A09061b69100
$$ 97793 59340 430617 55682 82804 -293216 -25219 7950 259485 -103009 109061 -269100
15682e1964k45875a1236B41530A03676j7756J01638G501a76402A27821K22984
$$ -51964 -297839 -11236 241530 103676 85920 187558 7501 -176402 127821 350805
15672C50805a2836l5954j21321C23714b75826C3350c44258A19371b08801P4859
$$ 350805 -12836 -48790 -170111 323714 -275826 33350 -344258 119371 -208801 -133942
15662a33942l1464A07071d0198H3303a01j3948k07754I2333J55207d4018n2099
$$ -133942 -165406 107071 -40198 83303 -101 -14049 -221803 92333 247540 -44018 -96117
15651i6117d2930B04698b917q2219l2725K6326I8020g6117f553B0045O3826a35557
$$ -96117 -42930 204698 -2917 -85136 -117861 -91535 98020 -76117 -6553 20045 83871 -135557
15638b55626c5550C6809a62059P6147B8280K49572i5773k90291f4153B77585E2275
$$ -255626 -35550 36809 -162059 -85912 28280 277852 -95773 -386064 -64153 277585 52275
15626C3223f1314O622C54966a30473r8569A42916K1500A6892b18489I1925B0620
$$ 33223 -61314 -54692 354966 -130473 -229042 142916 164416 16892 -218489 91925 20620
15614I0107a58336j9269Q163F71K16753L6403j11895B0244d710k38342F3174a53551
$$ 90107 -158336 -177605 -169442 671 217424 253827 141932 20244 -4710 -243052 63174 -153551
15601D4313b41622H756J19619f4726J2397m0346B59658d6455A65922a60004k9985
$$ 44313 -241622 8756 128375 -64726 -52329 -92675 259658 -46455 165922 -160004 -189989
15590a89989A74482m6641c53367j92301a75451A33473a69717Q4435C09000b81333
$$ -189989 174482 127841 -353367 -545668 -175451 133473 -169717 -85282 309000 -281333
15579b5717H3694O1494n1988c32804A46794M8865B9607b57412F0562a02507B69102
$$ -25717 83694 145188 93200 -332804 146794 195659 29607 -257412 60562 -102507 269102
15567d04341J54248C2052J4336h4252G9939b30388c1987k8825j68233d2278F7500
$$ -404341 -250093 32052 46388 -84252 79939 -230388 -31987 -60812 -229045 -42278 67500
15555B14507h6395o5001L1255A78261N62g1345B08417d3894o5925k45171A13478
$$ 214507 -86395 -151396 -120141 178261 178823 -71345 208417 -43894 -109819 -354990 113478
15543A1762b89226A40784b29629R0930G0484b46027d541j66128k667B8186K7596
$$ 11762 -289226 140784 -229629 -138699 70484 -246027 -4541 -170669 -173336 28186 55782
15532E5782N1755n414k5987g7492o4301K3730G3614O6525o3997J7313a05072a2063
$$ 55782 107537 102123 76136 -77492 -141793 -118063 73614 140139 76142 93455 -105072 -12063
15519a1301c661r1401G2970i660C7012a61747D4562h2352B67791d6493k9438j28680
$$ -11301 -3661 -95062 72970 -9660 37012 -161747 44562 -82352 267791 -46493 -75931 -204611
15507b04611k8187A11582O2074F328J53754R6625J73019A31328f516k4098B10340
$$ -204611 -232798 111582 173656 6328 160082 256707 429726 131328 -6516 -30614 210340
15495a41078B63230a23682K9026B01370D7313a35861A15881a19994A02428f2666
$$ -141078 263230 -123682 -94656 201370 47313 -135861 115881 -119994 102428 -62666
15484E0756g3199j0947j9499a3732l6949A37375h9691H6000i9046A74194b58042
$$ 50756 -73199 -84146 -103645 -13732 -50681 137375 -89691 86000 -99046 174194 -258042
15472C6780K7367K6807Q7535E2653J7937b4195H3800g7005l9287K602j80554Q2473
$$ 36780 64147 90954 178489 52653 70590 -24195 83800 -77005 -116292 -113690 -294244 -211771
15460b11771a509k1017A5857i8237B14605a49399m2621A65582d845F972K42548
$$ -211771 -1509 -22526 15857 -98237 214605 -149399 -192020 165582 -4845 6972 249520
15449B49520o4378i4970A14349K00774J96244A66504b40572a5275j03669I2585
$$ 249520 185142 -94970 114349 315123 511367 166504 -240572 -15275 -118944 92585
15438B81789D051a44098J1891H5065B5147J57641H9046b144j70075f3432A49347
$$ 281789 4051 -144098 -132207 85065 25147 182788 89046 -2144 -172219 -63432 149347
15426A81085R7045c8510k25746G7090f2626L1028B7459N1359c7308A11011r997
$$ 181085 278130 -38510 -264256 77090 -62626 -31598 27459 78818 -37308 111011 101014
15415A01014c15099C49912E1935B0331K77323a14839B88093E2844a01326A81934
$$ 101014 -315099 349912 51935 20331 297654 -114839 288093 52844 -101326 181934
15404E9901b05983C3418b72863D9216J20484c5901j34615D0641a0380G9316B9380
$$ 59901 -205983 33418 -272863 49216 169700 -35901 -170516 40641 -10380 79316 29380
15392F7957K20950b5853J0659j12404A00215j3614b52926C2729i3980c3209A32300
$$ 67957 288907 -25853 -15194 -127598 100215 86601 -252926 32729 -93980 -33209 132300
15380B3514a70841o5763e5767E9380O05R6904J76840d08467J41331b1091m444
$$ 23514 -170841 -236604 -55767 59380 59985 156889 333729 -408467 -267136 -21091 -25535
15369b5535I7996i9067B74040a99402E6145a89533h7446A6419L11424I9479R6460
$$ -25535 97996 -99067 274040 -199402 56145 -189533 -87446 16419 327843 99479 195939
15358A95939e2817k47733A56315n5783C5512M9693O4482A9493a9971j16592f180
$$ 195939 -52817 -300550 156315 100532 35512 85205 149687 19493 -19971 -136563 -6180
15346A68378C5922J99833a19022C2951b66441A35042e4550F1830J13713o2571
$$ 168378 35922 235755 -119022 32951 -266441 135042 -54550 61830 175543 112972
15336A12972K5510b63677B06734L2620e2947B9372c707o7736K6766o0293B1246
$$ 112972 138482 -263677 206734 239354 -52947 29372 -3707 -71443 -44677 -104970 21246
15324C48236a7540n4497E6401b5213j61528B25056F3751c5045k77298i4858o72
$$ 348236 -17540 -72037 56401 -25213 -186741 225056 63751 -35045 -312343 -94858 -95530
15313i5530F1517a19672B2519o586Q2702O1648A6518a63368C95197P1287F3022
$$ -95530 61517 -119672 22519 15933 98635 160283 16518 -163368 395197 466484 63022
15301A19236h0411B54191g3676j65690j0609B01624o5487Q8008c52489B26468
$$ 119236 -80411 254191 -73676 -239366 -249975 201624 136137 224145 -352489 226468
15290H0246j0881c49804A32326M2213J01823b01636D443O3856M5239O9677C3182
$$ 80246 69365 -349804 132326 174539 276362 -201636 4443 68299 113538 183215 33182
15278D1300J4816L7535G076d37704G8896P5411J5055k7081B9891f0099o7432p7487
$$ 41300 56116 93651 7076 -437704 78896 154307 169362 142281 29891 -60099 -127531 -205018
15266b05018D5974J05315I254Q2625g553k79002i6664K3598q797j07291B60162
$$ -205018 45974 151289 9254 91879 -7553 -286555 -96664 -73066 -81863 -189154 260162
15254h4661j83289i4688M3427B21663F3234P3618L63346J43546J309844K72822
$$ -84661 -267950 -94688 -51261 221663 63234 136852 500198 643744 1953588 2226410
15244B226410q64615J372783F02275a11489A77410P2161b9404J4329k6961C28852
$$ 2226410 1361795 2734578 602275 -111489 177410 249571 -29404 -15075 -42036 328852
15233D26518F4387p727b53247d5671B71196a81108l5308M5616C62237A35347B3400
$$ 426518 64387 56660 -253247 -45671 271196 -181108 -216416 -170800 362237 135347 23400
15221a64284G9165a00679D56275A99477M85211A77214C8690J31860o2774f9518
$$ -164284 79165 -100679 456275 199477 684688 177214 38690 170550 107776 -69518
15210H2851K6278k8575a53201o0153O9260B8245a25734q4310B89289A3447d2533
$$ 82851 109129 80554 -153201 -213354 -144094 28245 -125734 -210044 289289 13447 -42533
15198I8284K69534j53594o1746p3588K1045D6693K58965L8914B136R7839K27389
$$ 98284 367818 214224 152478 78890 99935 46693 305658 344572 2136 99975 327364
15187C27364i128G2371K03978a48742A61143P2090Q3101c1597q7003B7066K66098
$$ 327364 -9128 72371 276349 -148742 161143 233233 316334 -31597 -118600 27066 293164
15176B93164j32375c1094n6857A54500m258g1031B6735J55653H3591f65A72376
$$ 293164 160789 -31094 -87951 154500 150242 -71031 26735 182388 83591 -665 172376
15164A92894J41552b14758G0231K55947A40651J7973g3590A99267I4859J4590
$$ 192894 334446 -214758 70231 326178 140651 158624 -73590 199267 94859 109449
15154A09449c162j06360A81978N4586j3658g5095A30108K3833l6082J25759A4859
$$ 109449 -3162 -109522 181978 236564 222906 -75095 130108 153941 117859 243618 14859
15142C20297J14870n2629I6226c25734E0068J78097b8742j5151B17105b4843F9892
$$ 320297 435167 382538 96226 -325734 50068 228165 -28742 -43893 217105 -24843 69892
15130c0427B27355q2018J81160F028J14535g4962n4391C46665A40352J20669m7949
$$ -30427 227355 145337 326497 6028 120563 -74962 -129353 346665 140352 261021 213072
15119B13072a06555A8737P8089n471J79818B8900n622a28874c5045A78647h9814
$$ 213072 -106555 18737 96826 91355 271173 28900 23278 -128874 -35045 178647 -89814
15107H217K7548J27907K00551j47294o4642L2387D1340a66766C1256L4885k3417
$$ 8217 35765 163672 364223 216929 152287 184674 41340 -166766 31256 66141 42724
15096D2724M5811i437o072B24154J87300a9727A30933C7470c5090F5927d8113
$$ 42724 88535 -9437 -15509 224154 411454 -19727 130933 37470 -35090 65927 -48113
15084i4805k6347N9778n4433C29324H1629a70339A20004f5958a2516k18497C29655
$$ -94805 -121152 -61374 -115807 329324 81629 -170339 120004 -65958 -12516 -231013 329655
15072A34044K58302A00671M6569K26623j11706j27963J17874C363J0978J47627
$$ 134044 392346 100671 147240 373863 262157 134194 252068 3363 14341 161968
15062A61968o3887R5114b40519B12140h4895C2768e2163j37477D84121j64168
$$ 161968 98081 193195 -240519 212140 -84895 32768 -52163 -189640 484121 319953
15052C19953A59714a43262E13964A1658J03914l8187J27275b4853A90878N7855
$$ 319953 159714 -143262 513964 11658 115572 77385 204660 -24853 190878 248733
15042B48733j11663O2993B4478J3032a82931A30589K92081j88493l2664g7271
$$ 248733 137070 200063 24478 37510 -182931 130589 422670 234177 201513 -77271
15031C2809L25838J42293A27882m5103J06204o3296K10607E2704L06417H2424
$$ 32809 358647 500940 127882 82779 188983 125687 336294 52704 359121 82424
15020H5802K60736a03139A40824J34252P639H6145C3290J72184K9813M7262J7205
$$ 85802 346538 -103139 140824 275076 282715 86145 33290 205474 235287 282549 299754
15009B99754F9112K18838B592J67373J36868J12096A95598A6200f9280c3928G0153
$$ 299754 69112 287950 2592 169965 306833 418929 195598 16200 -69280 -33928 70153
14997h1308B26906G6904K19020A15865J49327r7112b54A84954H0467N17043A45384
$$ -81308 226906 76904 295924 115865 265192 168080 -254 184954 80467 597510 145384
14985B39829J1208O0500A30125K19393A10297M5618K00824f4890C78550q9209
$$ 239829 251037 311537 130125 349518 110297 155915 356739 -64890 378550 289341
14975B89341r9650K14365j63615J79488A95887b21189B56831B8469K66153o0010
$$ 289341 189691 404056 240441 419929 195887 -221189 256831 28469 294622 234612
14965B34612r3628L66254A99488q2358M46119o199B53794O0811D7030e398C02998
$$ 234612 140984 507238 199488 117130 563249 557050 253794 314605 47030 -5398 302998
14953B11955P3735A20125n1438b450p362A65786G6192J21008O0672b5217C63699
$$ 211955 285690 120125 68687 -2450 -9812 165786 76192 197200 257872 -25217 363699
14941C66787f5527D00510j17682j40423M02143k33909A34532L6105J45393j44614
$$ 366787 -65527 400510 282828 142405 544548 310639 134532 170637 316030 171416
14931A71416M15723A09801L23960i9702B97773A11690K16178J38746A88716R1271
$$ 171416 587139 109801 433761 -99702 297773 111690 327868 466614 188716 279987
14921B79987q3988r3383K76899q5999d1826k2849G0575K62117A08911J86597n1675
$$ 279987 195999 102616 379515 293516 -41826 -64675 70575 332692 108911 295508 243833
14910B43833K66588B46771a7794B04001P1820n5074K63186k09814r1240K56657
$$ 243833 510421 246771 -17794 204001 275821 220747 483933 274119 182879 439536
14900D39536A30902L7870R8759Q5203f1067C21944A06533K2709L88921k39215
$$ 439536 130902 168772 267531 352734 -61067 321944 106533 129242 518163 278948
14890B78948A04339J04481M7926O5576M4783J90790A93817E8074M36451A54809
$$ 278948 104339 208820 256746 322322 367105 557895 193817 58074 494525 154809
14879A67080L76424A64548J21338J46520j81030N4938P6759j09281J8015A05187
$$ 167080 543504 164548 285886 432406 251376 306314 383073 273792 291807 105187
14868a89972I8371L6138m5452K3034M16539J36970l17170I8158L1562M46020A87995
$$ -189972 98371 134509 89057 112091 528630 665600 348430 98158 129720 575740 187995
14856A05582K59169j16404J33095n2773O8688j69724K65391J38944k54584o7518
$$ 105582 364751 248347 381442 328669 397357 227633 493024 631968 377384 309866
14846C09866m6782N75915k46726j51200n7888J628n308q9037M85168C62519K9114
$$ 309866 263084 838999 592273 441073 383185 384813 379505 290468 775636 362519 391633
14835C91633K51091B60064N26304M6937G6052N22560j71263J37276l3769k18266
$$ 391633 642724 260064 786368 833305 76052 598612 427349 564625 530856 312590
14825C12590L04699L2368j01921A25797M89263P260j57489B30976L20261B18281
$$ 312590 617289 649657 547736 125797 615060 622320 464831 230976 551237 218281
14814D71804J01669B74014P8632p8343J70989L8922j4555K02729j74610K64436
$$ 471804 573473 274014 352646 274303 445292 484214 469659 672388 497778 762214
14804G62214B86491M306q2592K29253K9237j69926K26179P5062q6077R027l4743
$$ 762214 286491 290797 208205 437458 466695 296769 522948 598010 511933 520960 486217
14793D86217R6054r2898k32873N82365C96114J8265o3991K17980k58965K07357
$$ 486217 582271 489373 256500 838865 396114 414379 350388 568368 309403 516760
14783E16760O013B46463K75450B28851R3783K82732k08356o848J35652j54630
$$ 516760 522773 246463 521913 228851 322634 605366 397010 390162 525814 371184
14773C71184K25707B77641L56544K5183A74420L91038M2666J36406k16682J38436
$$ 371184 596891 277641 634185 659368 174420 565458 608124 744530 527848 666284
14763F66284A26362M28405B21261K98163q3577J8191J46934P7952B31659M73326
$$ 666284 126362 554767 221261 519424 435847 454038 600972 678924 231659 704985
14753G04985q3040k44128K49510k19271N10766j59295j70509K6016j70462K0904
$$ 704985 621945 377817 627327 408056 918822 759527 589018 615034 444572 465476
14743D65476J47716J41485J79749k67564A36416M68028j05951K99342p502J13562
$$ 465476 613192 754677 934426 666862 136416 604444 498493 797835 790333 903895
14733I03895l15046J45070k30351J69828j9211j94288L15380k29839K9854L1112
$$ 903895 588849 733919 503568 673396 654185 459897 775277 545438 575292 606404
14723F06404J56814r1629K37615n4391j0134q1236J42381j23853j82036M6494
$$ 606404 763218 671589 909204 854813 844679 763443 905824 781971 599935 646429
14713F46429K99202l03650K4943j13647O1640J06641Q2184L5716k16783K70113
$$ 646429 945631 641981 666924 553277 614917 721558 803742 839458 622675 892788
14703H92788j30168l12895M95073o8826j65976J9202J42084m04195L86347K9905
$$ 892788 762620 449725 944798 875972 709996 729198 871282 467087 853434 883339
14693H83339l86566M07366k31445K97981m3814j79739j85445J84848L01878l04783
$$ 883339 496773 904139 672694 970675 926861 747122 561677 746525 1048403 743620
14683G43620K43097m3432m66115M23284j60659L9533K34743l3486l53416L87807
$$ 743620 986717 943285 477170 900454 739795 779328 1014071 980585 627169 1014976
14673A014976k77471L243N1874K25589l85866K70621n6283J34036M0445n3479
$$ 1014976 737505 740748 792622 1018211 632345 902966 846683 980719 1021164 967685
14663I67685j35926K19952k67456m0208K73013j20047P8455r6467J79251J29927
$$ 967685 831759 1051711 784255 744047 1017060 897013 975468 879001 1058252 1188179
14653A188179n03549P32164D93111L90789J01185k4657l36340L40451p4502K85758
$$ 1188179 684630 1416794 493111 883900 985085 960428 624088 964539 890037 1175795
14643A175795m04219K45559j40276j12704M93058N7966l09780J8548L86397k3579
$$ 1175795 771576 1017135 876859 764155 1257213 1315179 1005399 1023947 1410344 1386765
14633A386765k57574j38660J48382k9900L0401P5624P215l7334K5110l56445N5517
$$ 1386765 1129191 990531 1138913 1109013 1139414 1215038 1222253 1184919 1210029 853584 909101
14622I09101K03587L46070J4656k46048j24238L2130L82850q5455k37341j71300
$$ 909101 1112688 1458758 1473414 1227366 1103128 1135258 1518108 1432653 1195312 1024012
14612A024012J53591j90193K24211K14072l08480K77266k38147J38451K00385
$$ 1024012 1177603 987410 1211621 1425693 1117213 1394479 1156332 1294783 1495168
14603A495168l1855n7287m79479J01055K83639O0113M1872l1325j08186O9459
$$ 1495168 1463313 1406026 926547 1027602 1311241 1371354 1413226 1381901 1273715 1343174
14593A343174k0365j70851N2572L89759m7098k1498N28108l60879k37381P5201
$$ 1343174 1322809 1151958 1204530 1594289 1547191 1525693 2053801 1692922 1455541 1530742
14583A530742k2828J18847r2641L94717j12231Q5796L6912n3029n5775k85451
$$ 1530742 1507914 1626761 1534120 1928837 1816606 1902402 1939314 1886285 1830510 1545059
14573A545059N28190J72496k15205j95129J28315j40910L86861m74094K49783
$$ 1545059 2073249 2245745 2030540 1835411 1963726 1822816 2209677 1735583 1985366
14564A985366J83342p5722N29477m33139J26087J13136J93894k27931N19954k02771
$$ 1985366 2168708 2092986 2622463 2189324 2315411 2428547 2622441 2394510 2914464 2711693
14554B711693N45632J04079L37484M47989J414716J461605L849172P197035J6531127
$$ 2711693 3257325 3361404 3698888 4146877 5561593 7023198 10872370 18069405 34600532
14545C4600532N754330A8162984G942768j311827J96618C011745r64275k51155
$$ 34600532 40354862 18162984 7942768 6630941 6827559 3011745 2047470 1796315
14537A796315Q769J68187k68451J49422K10089N4143j71986L578j36626K46887
$$ 1796315 1805084 1973271 1704820 1854242 2064331 2118474 1946488 1950066 1813440 2060327
14527B060327K5076o9446J34920J46972m7340l25275J66403J53814k56615K40077
$$ 2060327 2085403 2015957 2150877 2297849 2250509 1925234 2091637 2245451 1988836 2228913
14517B228913J69090k14497K40718l05547K03352N9619j02598j37821N76158j30223
$$ 2228913 2398003 2183506 2424224 2118677 2322029 2381648 2279050 2141229 2717387 2587164
14507B587164r6394J16384J35164m30287L76954j72170L55453j00771J3540k7958
$$ 2587164 2490770 2607154 2742318 2312031 2688985 2516815 2872268 2771497 2785037 2757079
14497B757079J26897m6796k60315K43170J25485j46149l1499m913K53462J52812
$$ 2757079 2883976 2837180 2576865 2820035 2945520 2799371 2767872 2762959 3016421 3169233
14487C169233k73754J27397M76241m89350r702L64429j46535j11120K34855Q2964
$$ 3169233 2895479 3022876 3499117 3009767 3000065 3364494 3217959 3106839 3341694 3424658
14477C424658Q9443j30555N8425K81168j96180K87881l32261M43232p0320K13572
$$ 3424658 3514101 3383546 3441971 3723139 3526959 3814840 3482579 3925811 3855491 4069063
14467D069063j01854k0785K47023J59080o03837M09335K72940j79793j58904j11159
$$ 4069063 3967209 3946424 4193447 4352527 3748690 4158025 4430965 4251172 4092268 3981109
14457C981109N05500K8849K96029l12623N0479M3077J0784n2972L41409N5316
$$ 3981109 4486609 4515458 4811487 4498864 4549343 4592420 4603204 4550232 4891641 4946957
14447D946957J4037j63289J08515k39737N06702m11618N40146J3069o5670J33581
$$ 4946957 4960994 4797705 4906220 4666483 5173185 4761567 5301713 5314782 5249112 5382693
14437E382693J92356L6895l80621N40084K3871n4832J88402m23545O78444J02469
$$ 5382693 5575049 5611944 5231323 5771407 5795278 5740446 5928848 5505303 6183747 6286216
14427F286216J39281J75574j75006l83637P69237k47493J43062K2159j1870L72295
$$ 6286216 6425497 6601071 6426065 6042428 6811665 6564172 6707234 6729393 6717523 7089818
14417G089818J66825K10658o6763K16815K40078k94653M22424j66956j6043K22056
$$ 7089818 7256643 7467301 7400538 7617353 7857431 7562778 7985202 7818246 7802203 8024259
14407H024259J05621M01120M3300L0424K4307J63294j4205P61021k08766M80262
$$ 8024259 8129880 8531000 8574300 8604724 8629031 8792325 8778120 9539141 9330375 9810637
14397I810637k63337J52882N00172J27881K8345j21650Q96124n22497K95952J79931
$$ 9810637 9547300 9700182 10200354 10328235 10356580 10234930 11131054 10608557 10904509 11084440
14387A1084440K17135M42447J24634N29897q893N0290M47683J73338J78637K28165
$$ 11084440 11301575 11744022 11868656 12398553 12389660 12439950 12887633 13060971 13239608 13467773
14377A3467773J85503L06614M11891J32172L91901K93118L82847J69220K54878
$$ 13467773 13653276 13959890 14371781 14503953 14895854 15188972 15571819 15741039 15995917
14368A5995917O60429K38790J66073O02598q4078O53490K63284Q33212k27K56668
$$ 15995917 16656346 16895136 17061209 17663807 17579729 18233219 18496503 19329715 19329488 19586156
14358A9586156P01417P41270K77454Q36195K30367L28595Q28985O31067M77457
$$ 19586156 20287573 21028843 21306297 22142492 22372859 22701454 23530439 24161506 24638963
14349B4638963K56669R87464N23233M93852R01833P05724N70542P54696P55222
$$ 24638963 24895632 25883096 26406329 26900181 27802014 28507738 29078280 29832976 30588198
14340C0588198J002415J166141P75586Q83513J009041J145306R40773R22038J516080
$$ 30588198 31590613 32756754 33532340 34415853 35424894 36570200 37510973 38433011 39949091
14331C9949091J265475J331201J432572J242593J464325J222922J608900K008267
$$ 39949091 41214566 42545767 43978339 45220932 46685257 47908179 49517079 51525346
14323E1525346J768050J701598K156272K201795J741018K403575K351912K586332
$$ 51525346 53293396 54994994 57151266 59353061 61094079 63497654 65849566 68435898
14315F8435898K695376L067652K651044L066280L460785L759430L569372L749423
$$ 68435898 71131274 74198926 76849970 79916250 83377035 87136465 90705837 94455260
14307I4455260M392668M579944M417196M961019N643325N470684O257619O183116
$$ 94455260 98847928 103427872 107845068 112806087 118449412 123920096 130177715 136360831
14299A36360831P004423O678204P819184Q296460Q647254R298910R399312J0446157
$$ 136360831 143365254 150043458 157862642 166159102 174806356 184105266 193504578 203950735
14291B03950735J0920236J1146189J2271686J2317545J3246478J3403813J4494829
$$ 203950735 214870971 226017160 238288846 250606391 263852869 277256682 291751511
14284B91751511J4336055J4755633J5013618J4790465J4430282J4043225J3143744
$$ 291751511 306087566 320843199 335856817 350647282 365077564 379120789 392264533
14277C92264533J2156007J0480819Q799044O562633L269205N14331n94395j990148
$$ 392264533 404420540 414901359 423700403 430263036 433532241 434046572 433452177 431462029
14269D31462029k507911k928004o571982r153678j1021972j2434795j3530475
$$ 431462029 428954118 426026114 419454132 410300454 399278482 386843687 373313212
14262C73313212j3679669j4845538j5150404j4942729j4829804j4626438j4126605
$$ 373313212 359633543 344788005 329637601 314694872 299865068 285238630 271112025
14255B71112025j3620519j3516183j2174218j0559440j1199945j0916408j0195888
$$ 271112025 257491506 243975323 231801105 221241665 210041720 199125312 188929424
14248A88929424r822681q805679q758632p841252p244317o957173o946057o118646
$$ 188929424 179106743 170301064 161542432 153701180 146456863 139499690 132553633 126434987
14240A26434987n997238n424454n168117m474285m754130m625297l828337l836868
$$ 126434987 120437749 115013295 109845178 105370893 100616763 95991466 92163129 88326261
14232H8326261l788275k674793l543284l113173l039990l019328k183132k769813
$$ 88326261 84537986 81863193 78319909 75206736 72166746 69147418 66964286 64194473
14224F4194473k334292k210646k064916k143965j307145k145099j542992j981976
$$ 64194473 61860181 59649535 57584619 55440654 54133509 51988410 50445418 48463442
14216D8463442j209377j832723j061420j110335k044263r61998j374213j158112
$$ 48463442 47254065 45421342 44359922 43249587 41205324 40243326 38869113 37711001
14208C7711001o57593m79664j078545j646714p51273j160074o33536q19019o68245
$$ 37711001 37053408 36573744 35495199 33848485 33097212 31937138 31303602 30484583 29816338
14199B9816338q46829o33745r60489p91379o25159l43225k81434r46651p70581
$$ 29816338 28969509 28335764 27375275 26583896 25958737 25615512 25334078 24387427 23616846
14190B3616846n72722q9617r36364m73130k51288p80390j84074n61071m75595
$$ 23616846 23044124 22954507 22018143 21545013 21293725 20513335 20329261 19768190 19292595
14181A9292595k49614r20712j49010l98906m42698k51099l78587l89036r4262
$$ 19292595 19042981 18122269 17973259 17574353 17131655 16880556 16501969 16112933 16018671
14172A6018671l68782k64361l25319n95741j55170m02914K49910m59961j91380
$$ 16018671 15649889 15385528 15060209 14464468 14309298 13906384 14156294 13696333 13504953
14163A3504953k36801k07710o52536j1999l26857M2868l49003k08937q363k14550
$$ 13504953 13268152 13060442 12407906 12395907 12069050 12111918 11762915 11553978 11545615 11331065
14153A1331065m91836j04723k05021K15264J18163o56147j03580n67260J89164
$$ 11331065 10839229 10734506 10529485 10744749 10862912 10206765 10103185 9535925 9725089
14144I725089j71486j29382j47885p9199o5202o10453J48787J18597l22405j58053
$$ 9725089 9553603 9424221 9276336 9197137 9131935 8521482 8670269 8788866 8466461 8308408
14134H308408M9257O1943k28273m20373K71700m84159Q0120O8519k19741j09536
$$ 8308408 8357665 8419608 8191335 7770962 8042662 7558503 7638623 7707142 7487401 7377865
14124G377865j86829p9230K3796k51322o2533n6306j18239K6625j37685j06883
$$ 7377865 7191036 7111806 7135602 6884280 6821747 6765441 6647202 6673827 6536142 6429259
14114F429259J25623m7896k84008j90644J92667k36874Q5085k53187m47360N84521
$$ 6429259 6554882 6506986 6222978 6032334 6225001 5988127 6073212 5820025 5372665 5957186
14104E957186m84588L79450l55323k8423j44628l18073J69990j04403N1979p8349
$$ 5957186 5472598 5852048 5496725 5468302 5323674 5005601 5175591 5071188 5123167 5044818
14094E044818l01244M65861l76044k00651K19636l7008n62075N02854j09555m13730
$$ 5044818 4743574 5209435 4833391 4632740 4852376 4815368 4253293 4756147 4646592 4232862
14084D232862j42932L79477k73038j18814L34698l14253O6144j35429r9792J28350
$$ 4232862 4089930 4469407 4196369 4077555 4412253 4098000 4164144 4028715 3928923 4057273
14074D057273j65982L18817l87192n9949J24270n67892L10890J69690k62985K77473
$$ 4057273 3891291 4210108 3822916 3762967 3887237 3319345 3630235 3799925 3536940 3814413
14064C814413l06142L09750j53452J1062k37666K46733j36330j05700j4778k03181
$$ 3814413 3508271 3818021 3664569 3675631 3437965 3684698 3548368 3442668 3427890 3224709
14054C224709j19722N0927K03815k03171J06670j50914k19865R5019j27688J51364
$$ 3224709 3104987 3155914 3359729 3156558 3263228 3112314 2892449 2987468 2859780 3011144
14044C011144k52514j59958J86113K45186m97475L18821k38518O9207J52922j79688
$$ 3011144 2758630 2598672 2784785 3029971 2532496 2851317 2612799 2682006 2834928 2655240
14034B655240r1032J66358k63249m354J88925m16518P78807m87920r0545J16552
$$ 2655240 2564208 2730566 2467317 2462963 2651888 2235370 3014177 2526257 2435712 2552264
14024B552264N0757j58437J208n1967J30571k41964J30654l25783K41214j92648
$$ 2552264 2603021 2444584 2445792 2393825 2524396 2282432 2413086 2087303 2328517 2135869
14014B135869J55021l30278M26629q5280m19982K46740l62862P178K27446j62938
$$ 2135869 2290890 1960612 2387241 2301961 1881979 2128719 1765857 1773035 2000481 1837543
14004A837543K63463o5889j31684K62413k50567Q9943j72214j86813K13765J31837
$$ 1837543 2101006 2035117 1903433 2165846 1915279 2005222 1833008 1646195 1859960 1991797
13994A991797k36678J18903L1505M42555N07627P15127K187486O703069J5603895
$$ 1991797 1755119 1874022 1905527 2348082 2855709 3570836 5758322 12461391 28065286
13985B8065286J3512961j8072918A1319442m464843j622810j193564m53127l20344
$$ 28065286 41578247 23505329 11319442 6854599 5231789 4038225 3585098 3264754
13977C264754j41634l28323p04281M78086m15012Q1040K71053n04618Q9889M898
$$ 3264754 3123120 2794797 2090516 2568602 2153590 2234630 2505683 2001065 2090954 2095852
13967B095852M33776m70610j3962K43833k61575j27220o2984j34282J55234J58350
$$ 2095852 2529628 2059018 2045056 2288889 2027314 1900094 1837110 1702828 1858062 2016412
13957B016412m27224K0597L77821N2348l73872J72915k09745K48446j76729P1334
$$ 2016412 1589188 1609785 1987606 2039954 1666082 1838997 1629252 1877698 1700969 1772303
13947A772303j44610q7833N5550P6165j18986J43619l04689M26795k81399N57673
$$ 1772303 1627693 1539860 1595410 1671575 1552589 1696208 1391519 1818314 1536915 2094588
13937B094588p27994J83559k13924N5465J89684k01094M679R6604j19012j32562
$$ 2094588 1366594 1550153 1336229 1391694 1581378 1380284 1384963 1481567 1362555 1229993
13927A229993K69304q4762j17004R1339j56127J19011K9154o7172K39378l73526
$$ 1229993 1499297 1414535 1297531 1388870 1232743 1351754 1380908 1313736 1553114 1179588
13917A179588M1068J27733L1468J39699k74665k63917K79166o4332n4019Q6968
$$ 1179588 1220656 1348389 1379857 1519556 1244891 980974 1260140 1195808 1141789 1228757
13907A228757l6009J57958m59204M15727j05152P5516J21925l46675j45799J22540
$$ 1228757 1192748 1350706 891502 1307229 1202077 1277593 1399518 1052843 907044 1029584
13897A029584l03227J70939J81371o2895K89675J8936j87087j02857j11253l9157
$$ 1029584 726357 897296 1078667 1015772 1305447 1324383 1137296 1034439 923186 884029
13887H84029L18231L1512l94928N08351j80319j87596J59001j23634J15375m4632
$$ 884029 1202260 1233772 838844 1347195 1166876 979280 1138281 1014647 1130022 1085390
13877A085390L1665j19337l02284N45970k45674J96303j99167j52509j01854J25637
$$ 1085390 1117055 997718 695434 1241404 995730 1192033 992866 840357 738503 864140
13867H64140M76287l47859l2188m78L5718J22951K1577N7288m51754L05668j55919
$$ 864140 1340427 992568 960380 959902 995620 1118571 1140148 1197436 745682 1051350 895431
13856H95431j63926K88800k33265L5819M24826j83600l65470K85813K5111q0633
$$ 895431 731505 1020305 787040 822859 1247685 1064085 698615 984428 1009539 928906
13846I28906l83847L50918J08373k11184L54979k75278K08974Q521m57993M5142
$$ 928906 545059 895977 1004350 793166 1148145 872867 1081841 1090362 632369 677511
13836F77511j68670K22737j12864K03556M1559j4364J03242k14762L78383l49024
$$ 677511 508841 731578 618714 822270 863829 849465 952707 737945 1116328 767304
13826G67304K96725k45417K72470L077l91698J81904K10307l55263M4908l27996
$$ 767304 1064029 818612 1091082 1094159 702461 884365 1094672 739409 784317 456321
13816D56321N73633E01330L57922J23048l79558J84896q8261L42239k64839k34044
$$ 456321 1029954 501330 859252 982300 602742 787638 699377 1041616 776777 542733
13806E42733P3396K26965l34802J38422K05491j47332L5286j71960L18912D25751
$$ 542733 616129 843094 508292 646714 852205 704873 740159 568199 887111 425751
13795E97500L9413k45545L04210l18774L63625J23878r7212j48055J80180Q734
$$ 597500 636913 391368 695578 376804 740429 864307 767095 619040 799220 807954
13785H07954m4460N5550B87346K47170K2716r5883j8881Q8254o6286M52049j10142
$$ 807954 763494 819044 287346 534516 557232 461349 442468 530722 464436 916485 806343
13774H06343l60961O2723J98457j66725L43776J1533k71314j95462J55123K65884
$$ 806343 445382 508105 706562 539837 883613 895146 623832 428370 583493 849377
13764H49377o3122l19247M73549l26987j89532q3437L35178j26737q0747K47635
$$ 849377 786255 467008 940557 613570 424038 340601 675779 549042 468295 715930
13754G15930j29310K69716r7871Q9348m22330R0676K39150o2162o7009L1937B88659
$$ 715930 586620 856336 758465 847813 425483 516159 755309 693147 626138 658075 288659
13742F62743k05830R4663J13016j73943j58687J25601P0688j13866J78416q5176
$$ 662743 456913 551576 664592 490649 331962 457563 528251 414385 592801 507625
13732E07625J84757q1798j73313k1882J91349j16572K54991j40016j15915k40643
$$ 507625 692382 610584 437271 415389 606738 490166 745157 605141 489226 248583
13722B48583J41307J91908R4947l29617J56586J03934B98344n6961M22653B19940
$$ 248583 389890 581798 676745 347128 503714 607648 298344 241383 664036 219940
13711F50998j94335n7413L64768k09749k13151M00343k94478L263J07818R2511
$$ 650998 456663 399250 764018 554269 341118 741461 446983 450246 558064 650575
13701F50575j06446o680B52520M01081k76994L7268j85100n9227N98886B48294
$$ 650575 544129 537449 252520 653601 376607 413875 228775 169548 768434 248294
13690C61951j6134P048D3059N67091K64636m02946l2140M15983C87006Q3803j15832
$$ 361951 345817 352865 43059 610150 874786 471840 439700 855683 387006 470809 354977
13679C54977K2044J29185K8535K48712A68311K22693P4410K97642A91454O5392
$$ 354977 377021 506206 534741 783453 168311 391004 465414 763056 191454 256846
13669B56846M00475j06736n3184k7336K40964l24229L53847A00568M4862L80849
$$ 256846 657321 550585 497401 470065 711029 386800 740647 100568 145430 526279
13659E26279k49858j6299L2882J59720k23164A07095J11297K4505K01026A74422
$$ 526279 276421 260122 293004 452724 229560 107095 218392 242897 443923 174422
13648D37272B14885Q9894N1224J85665j36639o100A45218K5212J12284k1156J99371
$$ 437272 214885 304779 356003 541668 405029 398929 145218 170430 282714 261558 460929
13637D60929A55948J16754J73638P7381r2646o784B01410K30517J1920K914J89691
$$ 460929 155948 272702 446340 523721 431075 424291 201410 431927 443847 446761 636452
13626F36452c708E98640P8363j32681j13310A3529K28354J53454f7629C16024
$$ 636452 -3708 598640 677003 544322 431012 13529 241883 395337 -67629 316024
13615D60936Q1253A32271J38759P9653K26412A31366J84098p1407J77812j09955
$$ 460936 542189 132271 271030 350683 577095 131366 315464 244057 421869 311914
13605C11914j31313M0077R7869J98939B22909L90535L11862A71527J34662q5591
$$ 311914 180601 220678 318547 517486 222909 613444 925306 171527 306189 220598
13595B20598o3834J41217l4765L37993k98402A07578J17775L93355B33346J27201
$$ 220598 156764 297981 263216 601209 302807 107578 225353 618708 233346 360547
13585C60547r3624J03617L0668m05A80616M0625i5797B40825K31739j79545C2955
$$ 360547 266923 370540 401208 400803 180616 221241 -95797 240825 472564 293019 32955
13573D83256a60050A29858j3963K16383j51218M85086l5802j08602j65177N7096
$$ 483256 -160050 129858 115895 332278 181060 666146 630344 521742 356565 413661
13563D13661j91142E233L54572j58363q2051N34256B78548k9227K17010r6457
$$ 413661 222519 5233 359805 201442 119391 653647 278548 249321 466331 369874
13553C69874j43461K7211j12718K35576A7803e4975B74994B6749L52124j03203
$$ 369874 226413 253624 140906 376482 17803 -54975 274994 26749 378873 275670
13543B75670h465H3739P8782L01703b9007A12554M14317A92042A8755L1286J69697
$$ 275670 -8465 83739 162521 464224 -29007 112554 526871 192042 18755 50041 219738
13532B19738L8333J23412P7424l0468A45818J75500F8881L40359L8949j6421k07927
$$ 219738 258071 381483 458907 428439 145818 321318 68881 409240 448189 431768 223841
13521B23841j01422n3937K34494J03971A80582M7834q3912K5905J21560Q361L9345
$$ 223841 122419 68482 302976 406947 180582 228416 144504 170409 291969 300330 339675
13510C39675b9964C49331A11231L09942j18193j40082p5482L42258j1499o5162
$$ 339675 -29964 349331 111231 421173 302980 162898 87416 429674 418175 353013
13500C53013J60314A84716L02327j14506q1490l9200O3053J1359J18042j19088
$$ 353013 513327 184716 487043 372537 291047 251847 314900 326259 444301 325213
13490C25213o5681D6819J617J48758N0804M4842K40695j0846k11886L4828F4168
$$ 325213 259532 46819 48436 197194 247998 292840 533535 522689 310803 345631 64168
13478B55699A00225K72542J94102k57987A13284J30631J41101E7403A4479K31994
$$ 255699 100225 372767 566869 308882 113284 243915 385016 57403 14479 246473
13468B46473j4160N7620K59615e2414B45685H4599g8523i562D62158F728K62346
$$ 246473 232313 289933 549548 -52414 245685 84599 -78523 -9562 462158 6728 269074
13457B69074L9395m7779G6665M2147I688L74984G3239L88931E2417J84726o7128
$$ 269074 308469 260690 76665 118812 9688 384672 73239 462170 52417 237143 170015
13446A70015M23232B12350d931C90914j15477A24397E8138M37949B06584K54484
$$ 170015 593247 212350 -4931 390914 275437 124397 58138 496087 206584 461068
13436D61068q4823a43707A80394N11288B10471B0968K20728i0033j19741C31687
$$ 461068 376245 -143707 180394 691682 210471 20968 241696 -90033 -209774 331687
13425B26186a1981B96520b10195N6368G1632J11584J2562J09934M6821j75579
$$ 226186 -11981 296520 -210195 -153827 71632 183216 195778 305712 352533 176954
13415A76954H4848a39289C46859F0134k4061L01334o8104R6238j8809A51507J51744
$$ 176954 84848 -139289 346859 60134 36073 337407 269303 365541 346732 151507 303251
13404C03251a4533C81659p8166e6204B64376A24212K32239j14935r151q0211C7859
$$ 303251 -14533 381659 303493 -56204 264376 124212 356451 241516 232365 152154 37859
13392d6832F0376A9244M3381J27035F4919R6565k6771F4464a01301B59933a18320
$$ -46832 60376 19244 62625 189660 64919 161484 134713 64464 -101301 259933 -118320
13380A30369P6925L5107M6888q0902b2953C58831r5563J69849j74936K03233j35185
$$ 130369 207294 242401 289289 208387 -22953 358831 263268 433117 258181 461414 326229
13369C26229l8183P9644j14806P88N2740a20325C0695h4451B2886K77776F4003
$$ 326229 288046 367690 252884 253672 306412 -120325 30695 -84451 22886 300662 64003
13357A00280K71318j4199J61337D3895L05228a13564b0091l8682D58815B03134
$$ 100280 371598 357399 518736 43895 349123 -113564 -20091 -58773 458815 203134
13346B79883K84492k47540L09048A44781Q6732H2095a4531j9972D23532H3847
$$ 279883 564375 316835 625883 144781 231513 82095 -14531 -34503 423532 83847
13335f511B55137N974p1919J33079k7662L10026A80972d1213A55855M5315O2896
$$ -6511 255137 261111 189192 322271 294609 604635 180972 -41213 155855 201170 264066
13324B64066M3821D4222N4649J85199A9345Q4048K60732j41887F1285L95358J4024
$$ 264066 307887 44222 98871 284070 19345 103393 364125 222238 61285 456643 470667
13313D70667f4670I910M4372f6191C95954C7878A1103Q0949h2704H6548P9811
$$ 470667 -64670 9910 54282 -66191 395954 37878 11103 92052 -82704 86548 166359
13302A66359a27487A00622A7028K87362A7364f2902B06225C6606J17784a66607
$$ 166359 -127487 100622 17028 304390 17364 -62902 206225 36606 154390 -166607
13291C1572N7924j1658B5606N8536J34463a61419A16575K64898j68139c1442A43787
$$ 31572 89496 77838 25606 84142 218605 -161419 116575 381473 213334 -31442 143787
13279b46013B07351E1490O2869L26466C0771a77281M7832A24141K11836A44579
$$ -246013 207351 51490 114359 440825 30771 -177281 -129449 124141 335977 144579
13268C14841a27857I4768J82088I1818a72256l0248C03178A38346J20300N4461
$$ 314841 -127857 94768 276856 91818 -172256 -202504 303178 138346 258646 313107
13258C13107b99077g9461C46966H6781O08538A14676R8969C0333j3807K0433K84607
$$ 313107 -299077 -79461 346966 86781 695319 114676 213645 30333 16526 36959 321566
13247C21566p0910q0248F6522K25509I4974i0515B34439g054B50438H6841J11743
$$ 321566 250656 170408 66522 292031 94974 -90515 234439 -7054 250438 86841 198584
13236A98584p0625b47616B00720o8724d1407A16499B6259M4060K24573K3145E1451
$$ 198584 127959 -247616 200720 131996 -41407 116499 26259 70319 294892 318037 51451
13224B22031C5351A0552K86363J02667j16544a33380A31622c090p4402A73139
$$ 222031 35351 10552 296915 399582 283038 -133380 131622 -3090 -77492 173139
13213C4578O3191A6350L76687R7540H5909j3011k1087J71451B2745R0347J42533
$$ 34578 97769 16350 393037 490577 85909 72898 51811 223262 22745 113092 255625
13202B55625H4990N9678e1815D9583b05835G2610J82264a53767K6785j01238I1962
$$ 255625 84990 144668 -51815 49583 -205835 72610 254874 -153767 -126982 -228220 91962
13190A86578j9645J36508C8977K38800f4315C8028K66645A2927J07220j5123e2565
$$ 186578 166933 303441 38977 277777 -64315 38028 304673 12927 120147 105024 -52565
13178A75456a34160j3373c4254q22B27536g1014I9807J95696A29655Q9133r9219
$$ 175456 -134160 -147533 -34254 -35076 227536 -71014 99807 295503 129655 218788 119569
13167A19569d7238A13746c8317B00498f5159k1450o247A10452K86144a99394J172
$$ 119569 -47238 113746 -38317 200498 -65159 -86609 -92856 110452 396596 -199394 -198222
13156a98222B98641I835J68060F405J67283J15157F9346J58037b62257A19659
$$ -198222 298641 9835 177895 6405 173688 288845 69346 227383 -262257 119659
13145A48999J47939a9131G7289K83048d0959D41455b47638C00898a23114j35808
$$ 148999 296938 -19131 77289 360337 -40959 441455 -247638 300898 -123114 -258922
13135b58922B3849K83671c99717J47404C4926J48811m0901J95530A24428m4477
$$ -258922 23849 307520 -399717 -252313 34926 183737 142836 338366 124428 79951
13125G9951c1518j01527q7415J25B39336a18880c226k90727A05869C0813a43172
$$ 79951 -31518 -133045 -220460 -220335 239336 -118880 -3226 -293953 105869 30813 -143172
13113B39254l2245A8280d2704k51554H0255C743i2225A67198a10144A62578B2622
$$ 239254 207009 18280 -42704 -294258 80255 3743 -92225 167198 -110144 162578 22622
13101I6805C2219b2718E347R6825e6132A32583O2389h338B10090l0587a66436
$$ 96805 32219 -22718 5347 102172 -56132 132583 194972 -8338 210090 179503 -166436
13089d44043F7212K09554A17593l4175m040a1989j1504k8052r3975P0295A28864
$$ -444043 67212 276766 117593 83418 79378 -11989 -23493 -51545 -145520 -75225 128864
13077A31002j5598K39344g9065D48842A34758K3964b40317g6248A36919n0816
$$ 131002 115404 354748 -79065 448842 134758 158722 -240317 -76248 136919 86103
13067H6103J78982b09111F5020k2806e0655C122L00157p7416B1165J51308o5005
$$ 86103 265085 -209111 65020 42214 -50655 3122 303279 225863 21165 172473 107468
13056A07468J50603A6468K80663l6655e9462b2239B03527n8823a2724A19246M4889
$$ 107468 258071 16468 297131 260476 -59462 -22239 203527 144704 -12724 119246 164135
13045A64135K0955a26819A6147a16519c661C02654i2332B24392H3705A8g3654
$$ 164135 185090 -126819 16147 -116519 -3661 302654 -92332 224392 83705 18 -73654
13033i464B50058p1149a97108g4430k48881b9870I671g2677p6165A05595J21997
$$ -9464 250058 178909 -197108 -74430 -323311 -29870 9671 -72677 -148842 105595 227592
13022B27592D7986N1409J95688k0993J6666A09708P108l814l0731B90b99258B00885
$$ 227592 47986 99395 295083 274090 290756 109708 116816 113002 82271 290 -299258 200885
13009E7252J32229b09357B20157H4260f6441A8761L51165j25573a84916k34040
$$ 57252 189481 -209357 220157 84260 -66441 18761 369926 244353 -184916 -418956
12999d18956C65253a28073B30531J02071f4316C4053a23642e3945f143k28167
$$ -418956 365253 -128073 230531 332602 -64316 34053 -123642 -53945 -6143 -234310
12989b34310A88172G606M03069b55892G5579J98964E4318J2077b45315A16141
$$ -234310 188172 7606 410675 -255892 75579 274543 54318 66395 -245315 116141
12978h8075H1355J15438C5a7351B55085d1255D5635f8414F7215J06566F4450J50779
$$ -88075 81355 196793 35 -17351 255085 -41255 45635 -68414 67215 173781 64450 215229
12966B15229r6123K8107p0929K6410I630K47329J62002b14263I478a31759K0212
$$ 215229 119106 147213 76284 102694 9630 256959 418961 -214263 9478 -131759 -111547
12955a11547A88404Q5084j23337M0090R483p9614K39343b90833a02456k31790
$$ -111547 188404 273488 150151 190241 199724 120110 359453 -290833 -102456 -334246
12945c34246B76973C1458A4765a24070A06309a70714F2308i6754F4553a41587
$$ -334246 276973 31458 14765 -124070 106309 -170714 62308 -96754 64553 -141587
12934A45429k1559d1499o6359A74965E068a03788C56263B9103b08165A76482J46503
$$ 145429 123870 -41499 -107858 174965 5068 -103788 356263 29103 -208165 176482 322985
12923C22985B9629J35871n8596l8622D214N91J15247a5930j30335A37929b1745
$$ 322985 29629 165500 106904 68282 4214 4805 120052 -15930 -146265 137929 -21745
12911A99676L9681b4044k5650C4437a83217e0686A11844e1564L583K3075r3646
$$ 199676 239357 -24044 -49694 34437 -183217 -50686 111844 -51564 -47981 -24906 -118552
12900a18552d1663A7040e2427A2363L51469i328C0078J65360g4570J5877F3034
$$ -118552 -41663 17040 -52427 12363 363832 -9328 30078 195438 -74570 -58693 63034
12888F85K7222N15607a59636A46144K87361A28278n2773b55974O9420D0330c574
$$ 685 27907 543514 -159636 146144 433505 128278 75505 -255974 -186554 40330 -3574
12876B24724m6683b28742a10951G4021b88377A48644m5468J56460A18455b71201
$$ 224724 178041 -228742 -110951 74021 -288377 148644 103176 259636 118455 -271201
12865b39k45091B84052i8689l20214D4858a86610B46089D0192J60057N389r9739
$$ -239 -245330 284052 -98689 -418903 44858 -186610 246089 40192 200249 205638 105899
12854A05899h2314k2246c1204B9112J91745n0385D5493a79073c6784A19455Q5835
$$ 105899 -82314 -104560 -31204 29112 220857 170472 45493 -179073 -36784 119455 205290
12843B05290b6065C5221j4761J05703k2236l9598J62791c45365c0042o4910A15019
$$ 205290 -26065 35221 20460 126163 103927 64329 227120 -345365 -30042 -94952 115019
12831g3239D2404J22360j2116b9619B6976P5018D827J44483h4948A75849C6408
$$ -73239 42404 164764 152648 -29619 26976 101994 4827 149310 -84948 175849 36408
12819f7682n5357A26044a00750n5850f8748B30592C1199K88816A09846E1333L03540
$$ -67682 -123039 126044 -100750 -156600 -68748 230592 31199 320015 109846 51333 354873
12808C54873B1525b70031A02522d08108a80210g798j7119p3665j54759f032A51715
$$ 354873 21525 -270031 102522 -408108 -180210 -7798 -24917 -98582 -253341 -6032 151715
12796C00346K6610I4809a29487F4238a57478H8131g2729q1559N0627c3571Q644
$$ 300346 326956 94809 -129487 64238 -157478 88131 -72729 -154288 -103661 -33571 -24927
12785b4927A57807K5043B2578h5160j0231j56788B951M9222d7887j00970J3526
$$ -24927 157807 182850 22578 -85160 -95391 -252179 2951 52173 -47887 -148857 -135331
12774a35331I4077a77432B8705h7291o4800H4665c47963J20258A78894D2044g3883
$$ -135331 94077 -177432 28705 -87291 -152091 84665 -347963 -227705 178894 42044 -73883
12762h9587A73391J14501h2535L4722r8968N1767B70911B0254d50868c8848k3349
$$ -89587 173391 287892 -82535 -47813 -146781 -95014 270911 20254 -450868 -38848 -62197
12751f2197A69046p5847d5821A26862a91250Q4878A57460k3270a52512g5311I6904
$$ -62197 169046 93199 -45821 126862 -191250 -106372 157460 134190 -152512 -75311 96904
12739a3922l01341d0180j08804f4383j43435B77032o6923q6844M07309B3145N9661
$$ -13922 -315263 -40180 -148984 -64383 -207818 277032 210109 123265 530574 23145 82806
12728H2806l1735M23816H5046b33485h13A36033O8622o0903K5780O0147i5530
$$ 82806 51071 474887 85046 -233485 -813 136033 204655 143752 169532 229679 -95530
12716B17932A07700a58665C46966b37137l00529e1156p3644B83088o7540A03736
$$ 217932 107700 -158665 346966 -237137 -537666 -51156 -124800 283088 215548 103736
12705A99965D1571C174K47036G4682L28332E9987a98792E1329M18153g8147l9011
$$ 199965 41571 3174 250210 74682 403014 59987 -198792 51329 469482 -78147 -117158
12694a17158A28009j4865A8737c815l74087A40703E0514R5350a80365h3982B81128
$$ -117158 128009 113144 18737 -3815 -377902 140703 50514 145864 -180365 -83982 281128
12682a05962j91900d9503A13971l9831l3574M138a29994j5723k0315A09931r132
$$ -105962 -297862 -49503 113971 74140 40566 44704 -129994 -145717 -166032 109931 100799
12671A00799C3810J57628b3081H9374N4540n4752M81731q9513D3852f1288A81936
$$ 100799 33810 191438 -23081 89374 143914 89162 570893 481380 43852 -61288 181936
12659a26229J7879j8895C67039a04045B01578c1374A361J95334l4181G3513a77899
$$ -126229 -108350 -127245 367039 -104045 201578 -31374 1361 196695 162514 73513 -177899
12647F57K154a34848E4648a65249B09751D0257P5725J25368a78562o820C8072
$$ 657 2811 -134848 54648 -165249 209751 40257 115982 241350 -178562 -185382 38072
12635D6866b6136A8124H836a05761A21586K29262Q3168q7555H1260M9281k5236
$$ 46866 -26136 18124 8836 -105761 121586 350848 434016 346461 81260 130541 105305
12624A05305J81177I2971c236B86038A05966o237B4394K0784e8974I0452i1714
$$ 105305 286482 92971 -3236 286038 105966 99729 24394 45178 -58974 90452 -91714
12612B92973l8836r9276o0923O3006J80996e5700F0642c458k3507A69333c0606
$$ 292973 254137 154861 93938 156944 337940 -55700 60642 -3458 -26965 169333 -30606
12600A66485G3281J01112J42906A17282n7129A6922L2872J20506k4824R7893k5616
$$ 166485 73281 174393 317299 117282 60153 16922 49794 170300 145476 243369 217753
12589B17753P8814G549a76353l66750A54834C1251i5860C24027K35881A38855
$$ 217753 296567 7549 -176353 -543103 154834 31251 -95860 324027 559908 138855
12578B41120a34860r013g1086B32932b07442B57941h6515B68733C0356H599K86488
$$ 241120 -134860 -143873 -71086 232932 -207442 257941 -86515 268733 30356 8599 295087
12567B95087a22542B4964b54625L341A35926A3978b7343C02753b97552A92566
$$ 295087 -122542 24964 -254625 -251284 135926 13978 -27343 302753 -297552 192566
12556H351N7051a9123q1273c4196j4774B60329f1157K3424k9034B86840o4614
$$ 8351 65402 -19123 -100396 -34196 -48970 260329 -61157 -37733 -66767 286840 222226
12545B22226p6401e5788k6674b6775F4438J39912a80603O7063A03283D6098j607
$$ 222226 145825 -55788 -82462 -26775 64438 204350 -180603 -113540 103283 46098 44491
12534D4491M1480l5648j8921J58647a0545k44631B51826f6538l719B3048L00245
$$ 44491 85971 50323 31402 190049 -10545 -255176 251826 -66538 -70257 23048 323293
12523C23293I6008J36211M1239L6017C9286a13192d4649H4886J41526J80379j52169
$$ 323293 96008 232219 273458 309475 39286 -113192 -44649 84886 226412 406791 254622
12512B54622a37601H2816B6812J78759L7430E7218a64977A61145F2635f1069J198
$$ 254622 -137601 82816 26812 205571 243001 57218 -164977 161145 62635 -61069 -59871
12501e9871a8307A34223o1441d14369B4656a3949E4460L3197h5829m4140j58449
$$ -59871 -18307 134223 72782 -414369 24656 -13949 54460 87657 -85829 -129969 -288418
12490b88418A82072P9165C7903J07195c78889B31902b28980g1695D0614c45082
$$ -288418 182072 261237 37903 145098 -378889 231902 -228980 -71695 40614 -345082
12479a99145i6011k79554J67955B68582a10533A22862d0703B74676H6949C9458
$$ -199145 -96011 -375565 -207610 268582 -110533 122862 -40703 274676 86949 39458
12468e5169A13215m1681e9224i234B198a56979C250a92725N6058J3466k155J7138
$$ -55169 113215 71534 -59224 -9234 2198 -156979 3250 -192725 -136667 -123201 -125356 -108218
12456a08218K3255A93925a27290B93870a1924C34401a47274j53270A69403l3986
$$ -108218 -84963 193925 -127290 293870 -11924 334401 -147274 -300544 169403 135417
12446A35417a84466F3348a37294p5506R3162F434f7422H7334b05909d5692l7807
$$ 135417 -184466 63348 -137294 -212800 -119638 6434 -67422 87334 -205909 -45692 -83499
12435h3499k00821d1521k15647Q3559j34684G6369O1598o2576b3224j50460H2088
$$ -83499 -284320 -41521 -257168 -173609 -308293 76369 137967 75391 -23224 -173684 82088
12423b66550A37999A2335R9696B6064J45380P7775g759C74476b99871A28897c8418
$$ -266550 137999 12335 112031 26064 171444 249219 -7759 374476 -299871 128897 -38418
12411b82108H4438e5397C8795J57637c7409B34596N7368a62018A29121b2457A18864
$$ -282108 84438 -55397 38795 196432 -37409 234596 291964 -162018 129121 -22457 118864
12399B87938e4106A34887b43832J18570B73452r5060p5914P7949a70770B75707
$$ 287938 -54106 134887 -243832 -125262 273452 178392 102478 180427 -170770 275707
12388B2771J33852a99291j7003i3833p4171L3769B5446J74912K6779e3978A53946
$$ 22771 156623 -199291 -216294 -93833 -168004 -134235 25446 200358 227137 -53978 153946
12376g2659p4630a9153r2036m14922c597B50137C6580a32817Q878j8530c8934
$$ -72659 -147289 -19153 -111189 -526111 -3597 250137 36580 -132817 -123939 -142469 -38934
12364A52233e6680l4683J0595E05024c9497A56114a4383j48327E49898a51037
$$ 152233 -56680 -91363 -80768 505024 -39497 156114 -14383 -162710 549898 -151037
12353a62392P5889o3768B29502b8846o0017j83939B5268a65790d5365q0860A81967
$$ -162392 -86503 -150271 229502 -28846 -88863 -272802 25268 -165790 -45365 -126225 181967
12341C96077b46879A13599A7772a64126N9093F3799J16526a04966d0168E7590
$$ 396077 -246879 113599 17772 -164126 -105033 63799 180325 -104966 -40168 57590
12330c7581B56463b0362A113J29547d30288h8192j91996D29519e2042B17619a54903
$$ -37581 256463 -20362 1113 130660 -430288 -88192 -280188 429519 -52042 217619 -154903
12318A07947a33132B18501g3752A39544h4998k8944G6742J51618G1359f2184k56939
$$ 107947 -133132 218501 -73752 139544 -84998 -113942 76742 228360 71359 -62184 -319123
12307c19123d1436A07457b95663E42108b07766F8600O7106F0914C188a73473b6535
$$ -319123 -41436 107457 -295663 542108 -207766 68600 135706 60914 3188 -173473 -26535
12295A68062L0093q1691a6329B5503L1609A7772K20137B4645Q2221l5640b4512
$$ 168062 198155 116464 -16329 25503 57112 17772 237909 24645 106866 71226 -24512
12283g6481B23689b0348k36549J11977C15583A03661L44991a28409q0129k5795
$$ -76481 223689 -20348 -256897 -144920 315583 103661 448652 -128409 -208538 -234333
12273b34333B91722a20359I7949f5680m6375n9873M3735H2060A2266c0735B23320
$$ -234333 291722 -120359 97949 -65680 -112055 -171928 -128193 82060 12266 -30735 223320
12261h2052l4897F8458P3959a21001B75949F5380J17729J85122j66674A6273c7656
$$ -82052 -116949 68458 142417 -121001 275949 65380 183109 368231 201557 16273 -37656
12249c612G8205J75610I9137b0543j0003B09687I411J45410k5485b5806M356A63211
$$ -3612 78205 253815 99137 -20543 -30546 209687 9411 154821 129336 -25806 -21450 163211
12236b2841E8809c6360a1085E10159k28541b32512B82955E4166d5595D51981j18714
$$ -22841 58809 -36360 -11085 510159 281618 -232512 282955 54166 -45595 451981 333267
12225C33267b8646C58105j43747J33354A14308K6530a50613d0079A75052J7380
$$ 333267 -28646 358105 214358 347712 114308 140838 -150613 -40079 175052 192432
12215A92432G6970K09339G7606K05856j12750c64618A31374J23467i5857C22242
$$ 192432 76970 286309 77606 283462 170712 -364618 131374 254841 -95857 322242
12204B30111a04731B22423b43949E33972A0189g6202K4628j15668D12705g6759
$$ 230111 -104731 222423 -243949 533972 10189 -76202 -51574 -167242 412705 -76759
12193i9721j65715C67242G0606K93796E6116N2778b7191j63714A21693L02093
$$ -99721 -265436 367242 70606 364402 56116 108894 -27191 -190905 121693 423786
12183D23786b62378d8047A08843B4887b1199b722A4623i116G2670j1668a12212
$$ 423786 -262378 -48047 108843 24887 -21199 -2722 14623 -9116 72670 61002 -112212
12171C95953H2662K82607A11889K5872d01130e6444j69482C00349E2112J78343
$$ 395953 82662 365269 111889 137761 -401130 -56444 -225926 300349 52112 230455
12161B30455f8015A31041J97416A16498r139a05121j54848d8680A37273j224j4526
$$ 230455 -68015 131041 328457 116498 107359 -105121 -259969 -48680 137273 136049 121523
12150A21523a02970A93228d4313C91174a99494P3141B15454b21772H0614Q9700
$$ 121523 -102970 193228 -44313 391174 -199494 -126353 215454 -221772 80614 170314
12140A70314D2564J87316F4235A35h5329H5570B7328a55490A21504k3869a19531
$$ 170314 42564 229880 64235 135 -85329 85570 27328 -155490 121504 97635 -119531
12128a75530J5584A54459K70254A37286h6590c8903A88744H5632G950b96488a00383
$$ -175530 -159946 154459 424713 137286 -86590 -38903 188744 85632 7950 -296488 -100383
12116a7445C67083b97698h7439k4650I0619b05266h1114C8883J38045a58944e9031
$$ -17445 367083 -297698 -87439 -112089 90619 -205266 -81114 38883 176928 -158944 -59031
12104B15054b13386e0029k6999L4368j61008b7357B49794a29804A62544P7769
$$ 215054 -213386 -50029 -77028 -42660 -203668 -27357 249794 -129804 162544 240313
12094B40313b31528h5915F0992c5191j69028k7326A22801c20302B06370E0807
$$ 240313 -231528 -85915 60992 -35191 -204219 -231545 122801 -320302 206370 50807
12083a33583B60557a40820o6701H8850C2241f5207m74979a35920K8428M2454j05495
$$ -133583 260557 -140820 -207521 88850 32241 -65207 -540186 -135920 -107492 -65038 -170533
12072a70533H5708K2332Q6895B9923a75474C14365g4154N199A47884b64891O7379
$$ -170533 85708 108040 194935 29923 -175474 314365 -74154 -68955 147884 -264891 -197512
12061a97512A76725d515l8213B84481A27234a72351Q1559A95016a19125o0876
$$ -197512 176725 -4515 -42728 284481 127234 -172351 -90792 195016 -119125 -180001
12051a80001g2322I8758J81293b33988c0904D54143J60997O98097C88089j56019
$$ -180001 -72322 98758 280051 -233988 -30904 454143 615140 1313237 388089 232070
12041B32070q1518D7368j4332c9779g060r3781B69870E3921a40712l21668a32207
$$ 232070 150552 47368 33036 -39779 -7060 -100841 269870 53921 -140712 -462380 -132207
12029G3213J3470g7043E8977A3016a04234B85005L6186a01345A04014b04684B28408
$$ 73213 86683 -77043 58977 13016 -104234 285005 321191 -101345 104014 -204684 228408
12017C5518f9473A41622h069o2067H3094c3307m5603K7683B0521b07158C0702
$$ 35518 -69473 141622 -8069 -70136 83094 -33307 -78910 -51227 20521 -207158 30702
12005F0596J36482c26161P5951G3236b57737R7659j415g6768G2129c13231H5633
$$ 60596 197078 -326161 -250210 73236 -257737 -160078 -161493 -76768 72129 -313231 85633
11993B16539E9671f4283k88696B7408c24446B33156A06590M9807h5117K1406r3583
$$ 216539 59671 -64283 -352979 27408 -324446 233156 106590 156397 -85117 -63711 -157294
11982a57294A06660c34273A16484b92871A63966a9617G9415a45828G4774K44420
$$ -157294 106660 -334273 116484 -292871 163966 -19617 79415 -145828 74774 319194
11972C19194c456q613A56071d1281q6443D3374a1663j30940k72188i1794l49500
$$ 319194 -3456 -12069 156071 -41281 -127724 43374 -11663 -142603 -414791 -91794 -441294
11961d41294a37919K1323A92296g2992A88558A7222a67001k38651A67751C8665
$$ -441294 -137919 -116596 192296 -72992 188558 17222 -167001 -405652 167751 38665
11950c86414J91411B53123d10990a14215I6824K80626b41055A66546l8979a5605
$$ -386414 -195003 253123 -410990 -114215 96824 377450 -241055 166546 127567 -15605
11939c5555E6949J5169b08416l0753B3587f99k24848A75500b7108j18626B31899
$$ -35555 56949 72118 -208416 -239169 23587 -699 -225547 175500 -27108 -145734 231899
11927d4395A54975c44587A44758b46547E2359O3522a4935j53207B4613J06924
$$ -44395 154975 -344587 144758 -246547 52359 115881 -14935 -168142 24613 131537
11917A31537M3064b00674G1941f601B80839r8504E3208i462E4862d9636F3352
$$ 131537 174601 -200674 71941 -6601 280839 182335 53208 -9462 54862 -49636 63352
11905a00398M1290B13981q9529L3688J40767d6068k05651R6392B8319a90443A50662
$$ -100398 -59108 213981 124452 158140 298907 -46068 -251719 -155327 28319 -190443 150662
11893A06501c69967a79621P0522e1319A82275b24973f9087r5699B82339a5153
$$ 106501 -369967 -179621 -109099 -51319 182275 -224973 -69087 -164786 282339 -15153
11882a86541p0109D967a64146c3771k11607c0211A63364J3804c13202e0834m48
$$ -186541 -256650 4967 -164146 -33771 -245378 -30211 163364 177168 -313202 -50834 -51282
11871e1282B56086a96438j59002M8407d6235l1944F7509a2183B83359A10068l5058
$$ -51282 256086 -196438 -355440 -307033 -46235 -78179 67509 -12183 283359 110068 75010
11860G5010J64010A3028a08542j6809F1869a70336a9913k63948f9548B03141n9994
$$ 75010 239020 13028 -108542 -125351 61869 -170336 -19913 -283861 -69548 203141 143147
11849A43147f0689A37010B056J08283j9052b1778E1183J98759a1176k4519G3169
$$ 143147 -60689 137010 2056 110339 91287 -21778 51183 249942 -11176 -35695 73169
11837a07436D5652c6143r407B5528c48330f0803C34247b11948j228q3570c4905
$$ -107436 45652 -36143 -45550 25528 -348330 -60803 334247 -211948 -213176 -296746 -34905
11825b06020j9381M4898j72261B12472f5634j67952f8380A93442b75450Q3591
$$ -206020 -225401 -180503 -352764 212472 -65634 -233586 -68380 193442 -275450 -191859
11815a91859R5191A44708d00165a26003J4337F1447K4038i5947q44A66787c38390
$$ -191859 -96668 144708 -400165 -126003 -111666 61447 85485 -95947 -96791 166787 -338390
11803i9829A67859C6623J11571b65624J10650k2669d6391B6019K13770B6058r664
$$ -99829 167859 36623 148194 -265624 -154974 -177643 -46391 26019 239789 26058 16394
11792A6394L3667a00556A6975i4520B19513a56206j57627d8395B8422c39225n6128
$$ 16394 50061 -100556 16975 -94520 219513 -156206 -313833 -48395 28422 -339225 -395353
11781c95353J49239A4868e95486d102B57002D5396J56814F4753a06438B82004
$$ -395353 -246114 14868 -595486 -4102 257002 45396 202210 64753 -106438 282004
11770A03513a82042D1497h1332c6934E4574a06671J2940J6887q299C52858C0800
$$ 103513 -182042 41497 -81332 -36934 54574 -106671 -93731 -76844 -85143 352858 30800
11758a10903m8406M8053r9628d1842A15614O4462J41893f9541j05165q5669h1545
$$ -110903 -159309 -111256 -210884 -41842 115614 180076 321969 -69541 -174706 -260375 -81545
11746g7562D1023i5772I2601e1163j26363k3868O1989B09629g9770B38869F1878
$$ -77562 41023 -95772 92601 -51163 -177526 -201394 -139405 209629 -79770 238869 61878
11734a8619H4033g4857j53509a0520p9049B0975e2486a4679j43631n2154A20273
$$ -18619 84033 -74857 -228366 -10520 -89569 20975 -52486 -14679 -158310 -210464 120273
11722B42030Q8011i1296C6021J35022b1755c680m1406B00679q0949a24241A38640
$$ 242030 330041 -91296 36021 171043 -21755 -3680 -45086 200679 119730 -124241 138640
11710A63472a58334f3683A81488a18468D6311b22588A51807R7674o8748F8230
$$ 163472 -158334 -63683 181488 -118468 46311 -222588 151807 249481 180733 68230
11699A45034k3605a10472j39148J03388A9105c33863J38814A80459l2483a63628
$$ 145034 121429 -110472 -249620 -146232 19105 -333863 -195049 180459 147976 -163628
11688A33172c7207j4662A34945i6644a8552A07099j3323L150R3153a05037A19885
$$ 133172 -37207 -51869 134945 -96644 -18552 107099 93776 96926 190079 -105037 119885
11676A9699a28672d3516j91839h4451A60375e0728D0024J60589F9795b40211C8243
$$ 19699 -128672 -43516 -235355 -84451 160375 -50728 40024 200613 69795 -240211 38243
11664a33209C9704M4709b76295L6941B08343l3664f5319C76818A658L62358F8806
$$ -133209 39704 84413 -276295 -239354 208343 174679 -65319 376818 1658 364016 68806
11652C72115a06572F2958J86721d6027o4229j58423I4308C7877J45586a93061
$$ 372115 -106572 62958 249679 -46027 -110256 -268679 94308 37877 183463 -193061
11641A77684c06538a14425q6761O7631c0681A34204b43313f2319A14917M7034
$$ 177684 -306538 -114425 -201186 -133555 -30681 134204 -243313 -62319 114917 161951
11631A61951o0940a57594P5136I8258B8743b80907a22212k4010C23071H4395J85327
$$ 161951 101011 -157594 -82458 98258 28743 -280907 -122212 -146222 323071 84395 269722
11620B69722i6325A66853i5285A0825b04226A52430b5653A9294D968M26555h4523
$$ 269722 -96325 166853 -95285 10825 -204226 152430 -25653 19294 4968 431523 -84523
11608g1893A13546E0737a06500E0359b2244A73340a52321K7185D15321b92538
$$ -71893 113546 50737 -106500 50359 -22244 173340 -152321 -125136 415321 -292538
11597A04713i7155L2854A12885a62193j28017A885a0999I7311k585c5176J124
$$ 104713 -97155 -64301 112885 -162193 -290210 1885 -10999 97311 94726 -35176 -34052
11586c4052h007I983a39644I8270f240k34180B98805a4032l7240j85968i8690
$$ -34052 -8007 9983 -139644 98270 -6240 -240420 298805 -14032 -51272 -237240 -98690
11574g2122A23463f8927B5809b72381D2475b52191A80013H6465J3479h6869E3662
$$ -72122 123463 -68927 25809 -272381 42475 -252191 180013 86465 99944 -86869 53662
11562b10724B1445b83795G5792J85896r5186B2180K70041j35330C25O7750b8720
$$ -210724 21445 -283795 75792 261688 166502 22180 292221 156891 325 68075 -28720
11550A94233H5257B3562a28026A85621H5875a16060q8591O9999r978F6390J96510
$$ 194233 85257 23562 -128026 185621 85875 -116060 -204651 -134652 -144630 66390 262900
11539B62900a1868B41515c830F771O5550a13042p9940B66025b73597Q9805K7942
$$ 262900 -11868 241515 -3830 6771 72321 -113042 -192982 266025 -273597 -183792 -155850
11528a55850D1748b4901B77547m6271b30432C03683a4081j26230c9036a03I4982
$$ -155850 41748 -24901 277547 231276 -230432 303683 -14081 -140311 -39036 -103 94982
11516c31767j0771h0734b5197j31520D7965M0524A1243K8683P1636Q1272h0580
$$ -331767 -342538 -80734 -25197 -156717 47965 88489 11243 39926 111562 192834 -80580
11504A0167e236m7641B08813g2292A25423k72C9864c36271a36015H6986b90776
$$ 10167 -5236 -52877 208813 -72292 125423 125151 39864 -336271 -136015 86986 -290776
11492B33872k8059j2235D3261J33196d9097C26315r3692P5103A17061f578A54092
$$ 233872 205813 193578 43261 176457 -49097 326315 232623 307726 117061 -6578 154092
11480h0660A3857O2057h5867g164k37861I2784O263J79402j25184A1643J08262
$$ -80660 13857 75914 -85867 -7164 -245025 92784 99047 278449 153265 11643 119905
11469A19905K70195a0544j11931d0108A61731J84068h8633E9282p338a58692C25826
$$ 119905 390100 -10544 -122475 -40108 161731 345799 -88633 59282 51944 -158692 325826
11457C14747n7857f4742B38596A07518j7392K71353C1670g6406E1469b23833M4903
$$ 314747 256890 -64742 238596 107518 90126 361479 31670 -76406 51469 -223833 -178930
11446a78930Q8141H542L66071H280Q6115d6321j51960o1469k30251a56114A81332
$$ -178930 -90789 8542 374613 8280 94395 -46321 -198281 -259750 -490001 -156114 181332
11434A71332r049M7588g9907A51022b29591A07502c7166A44893k8117a61682D0798
$$ 171332 162283 209871 -79907 151022 -229591 107502 -37166 144893 116776 -161682 40798
11422g3335m7733E0337d8993o7650M0125K7570e364o8355E729a45198A05095a76690
$$ -73335 -121068 50337 -48993 -116643 -76518 -48948 -5364 -73719 5729 -145198 105095 -176690
11409a2307A25353F482b28042A43588b47502D387O0359P962c16420D7852A8980
$$ -12307 125353 6482 -228042 143588 -247502 4387 64746 72708 -316420 47852 18980
11397E267a42389e9776C93072e3984p2149B377J00344C230J26109L3630e7889
$$ 5267 -142389 -59776 393072 -53984 -126133 2377 102721 3230 129339 162969 -57889
11385A52487p0140a53441D04139f3815H4274J33341b54825m6480A26697g9694
$$ 152487 82347 -153441 404139 -63815 84274 217615 -254825 -301305 126697 -79694
11374e06900A48369n5078b0114D532d6654A19835n1100a55526A17563E8736a69095
$$ -506900 148369 93291 -20114 4532 -46654 119835 68735 -155526 117563 58736 -169095
11362A99623m0332a94256L5321B4592J57800c37075a36882A04047a33331j01697
$$ 199623 159291 -194256 -158935 24592 182392 -337075 -136882 104047 -133331 -235028
11352b35028d8962j17726P9474c6657D4971i1622A41647b66907R9845Q044L8696
$$ -235028 -48962 -166688 -87214 -36657 44971 -91622 141647 -266907 -167062 -159018 -120322
11341a20322k4730O0812j20538R5308G7157g3056B52413K3559b39619B78385B6748
$$ -120322 -145052 -84240 -204778 -109470 77157 -73056 252413 275972 -239619 278385 26748
11329a0888j19266p335D3402a16912L3835a424F0771a93664A97680a72152C15977
$$ -10888 -130154 -137489 43402 -116912 -83077 -1424 60771 -193664 197680 -172152 315977
11317a46959A6509b49393p3850A10783i8457A865J53200o9809a77725H8081d4806
$$ -146959 16509 -249393 -323243 110783 -98457 1865 155065 85256 -177725 88081 -44806
11305A54677a41353k71037a28950k34353a81517j1725G7799O747L3110d26215
$$ 154677 -141353 -412390 -128950 -363303 -181517 -193242 77799 84546 117656 -426215
11294A9594J2835c0171C5166K41324A23099C7197j6882b26881I0890c7463m6722
$$ 19594 32429 -30171 35166 276490 123099 37197 20315 -226881 90890 -37463 -84185
11283h4185H1560L27759A46805D9861i9788A54339D8208B2460b063l01085a27146
$$ -84185 81560 409319 146805 49861 -99788 154339 48208 22460 -2063 -303148 -127146
11271i9005d1740n3035A4892J25253E2295J3449i4085j03012F4630K14228A19343
$$ -99005 -41740 -94775 14892 140145 52295 65744 -94085 -197097 64630 278858 119343
11259A00465m0727a94938H7870J45164D6115Q7102C2449b87601O9343A54954E3822
$$ 100465 59738 -194938 87870 233034 46115 133217 32449 -287601 -218258 154954 53822
11247A77342l4151K01986G2714R7773a43392D31120a47182k43918a26683B47638
$$ 177342 143191 345177 72714 170487 -143392 431120 -147182 -391100 -126683 247638
11236E5182l618c8044j55111c9769j03366A14961c9560j5376j51279j4988A50831
$$ 55182 51564 -38044 -193155 -39769 -143135 114961 -39560 -54936 -206215 -221203 150831
11224c26294J22476a7560F8556b54238M5635j18321a32045G6095e3181p39G9696
$$ -326294 -203818 -17560 68556 -254238 -208603 -326924 -132045 76095 -53181 -53920 79696
11212f0460H2844J56827K06098g5907k882A28904b664A98139D2419a03010o6563
$$ -60460 82844 239671 445769 -75907 -78789 128904 -2664 198139 42419 -103010 -169573
11201a69573C72528b43096O6764C7239e5793A75780c64774C1241c6314b685j97443
$$ -169573 372528 -243096 -176332 37239 -55793 175780 -364774 31241 -36314 -2685 -200128
11190b00128j28849a47240e4527o9169l5215C3788c32297b2242B09833a86750
$$ -200128 -328977 -147240 -54527 -123696 -158911 33788 -332297 -22242 209833 -186750
11179E015J8160b96334f7997k86062a09434H4879c78962K9532a48302M153b3338
$$ 5015 23175 -296334 -67997 -354059 -109434 84879 -378962 -349430 -148302 -144149 -23338
11167f3390k5829D6371O4414a79350D9070P1535J73992A1227O5845e8815m48877
$$ -63390 -89219 46371 110785 -179350 49070 120605 294597 11227 77072 -58815 -507692
11156e07692a05576C3935R3699O018a97887A59763e0075G90a77792a7497j22982
$$ -507692 -105576 33935 127634 133652 -197887 159763 -50075 790 -177792 -17497 -140479
11145a40479j01970F7699N7892b31173K2940g6282k6959j84000a1312j46991J1232
$$ -140479 -242449 67699 125591 -231173 -208233 -76282 -103241 -287241 -11312 -158303 -147071
11134a47071c0868A38722M5142j2453h6800j36288B06647D3305i6104j05148A29490
$$ -147071 -30868 138722 183864 171411 -86800 -223088 206647 43305 -96104 -201252 129490
11122a09119D6178i7297C5689K84451j6520H6829b1599B0682M61417b25341K8376
$$ -109119 46178 -97297 35689 320140 303620 86829 -21599 20682 482099 -225341 -196965
11111a96965C57223A76691B4942J16624a09859A44852d8371m39m5705A23006a91837
$$ -196965 357223 176691 24942 141566 -109859 144852 -48371 -48810 -94515 123006 -191837
11099B64108f6848A00779a52858B02559d1363A90472J19250j49447m2763P8058
$$ 264108 -66848 100779 -152858 202559 -41363 190472 309722 160275 117512 195570
11089A95570a4716B9841K66885J23029A76784L43488j61848p4208A07957j3241
$$ 195570 -14716 29841 296726 419755 176784 520272 358424 284216 107957 94716
11079I4716O9910a29206F8612P3969N8922K36247k13482J3343O4421K21487G7233
$$ 94716 164626 -129206 68612 142581 201503 437750 224268 237611 302032 523519 77233
11067C26565J84717B43824J55736d4420B88918J13655Q4951m3483A32703L09274
$$ 326565 511282 243824 399560 -44420 288918 402573 487524 444041 132703 441977
11057D41977B3366N68713A33657M57532O2239B30949K32570A75933J82546R0646
$$ 441977 23366 592079 133657 591189 653428 230949 463519 175933 358479 449125
11047D49125r5133K54921j45911P1800A13982K38670q3791P2809K90442j69316
$$ 449125 353992 608913 463002 534802 113982 352652 268861 341670 632112 462796
11037D62796J76177k77316J68804L14667j85838k45202R7682j16763K14175j71864
$$ 462796 638973 361657 530461 845128 659290 414088 511770 395007 609182 437318
11027D37318J32994j0990K49321j92540k36955N3084P9158q8984j30655n4000
$$ 437318 570312 559322 808643 616103 379148 432232 511390 422406 291751 237751
11017B37751l0666Q9160K11448j39979l9975O4558J13571J56722B0955M65725
$$ 237751 207085 296245 507693 367714 327739 392297 505868 662590 20955 486680
11007D86680L0467B16089K03396A64123L09855A40257J46758I6664L69145b9290
$$ 486680 517147 216089 419485 164123 473978 140257 287015 96664 465809 -29290
10996D53954K7796G2879O82711k4988k51956J63790B99714M83859k06391O398
$$ 453954 481750 72879 755590 730602 478646 642436 299714 783573 577182 583580
10986E83580j12344j32771J61617K69466j77789o6994J45306J78887J30172k00326
$$ 583580 471236 338465 500082 769548 591759 524765 670071 848958 979130 778804
10976G78804N06284m6095J49734k47388P40568n2958J40551j31534r5364j83358
$$ 778804 1285088 1238993 1388727 1141339 1881907 1828949 1969500 1837966 1742602 1559244
10966A559244k19646L3413k83972j05933M4979k15642K91600l76225L37453J04197
$$ 1559244 1339598 1373011 1089039 983106 1028085 812443 1104043 727818 1065271 1169468
10956A169468L39419k58745l88222l54262A84141M79463j94046M255A94666J42722
$$ 1169468 1508887 1250142 861920 507658 184141 663604 469558 473813 194666 337388
10946C37388j12272j06228J31712M1643k4064j04037J5435J61868f6578j23275
$$ 337388 225116 118888 250600 292243 268179 164142 179577 341445 -66578 -189853
10936a89853g0512K1199a8561A1075P1817L10315F6287K74459h0252A16161b53872
$$ -189853 -70512 -49313 -18561 11075 82892 393207 66287 340746 -80252 116161 -253872
10924h026k56963a5773E0284e7683B12798e3793m9763B55377D7658L004K02324
$$ -8026 -264989 -15773 50284 -57683 212798 -53793 -103556 255377 47658 50662 252986
10913B52986f2863j18621M5057A42343J92825a52715E3721a44057A43024a71521
$$ 252986 -62863 -181484 -136427 142343 335168 -152715 53721 -144057 143024 -171521
10902b23913R4434N1770p1565e0569j2858B29030q6306b49602d8715I2513a34985
$$ -223913 -129479 -77709 -149274 -50569 -63427 229030 142724 -249602 -48715 92513 -134985
10890H7500h5807l478j42095R7120C85116d6755F7490B1518b75990G3041b1882
$$ 87500 -85807 -89285 -231380 -134260 385116 -46755 67490 21518 -275990 73041 -21882
10878B92737c83646A35938J96016c13648A69591b0761C20632C880Q2876L16841
$$ 292737 -383646 135938 331954 -313648 169591 -20761 320632 3880 86756 403597
10868D03597b25514P6676B3413J1443a87292G5898c4753j4749A52699L10299a01146
$$ 403597 -225514 -148838 23413 34856 -187292 75898 -34753 -49502 152699 462998 -101146
10856b07575A13068a0237p8967A68144a58216A22352f420o4037c0342j02041F3641
$$ -207575 113068 -10237 -89204 168144 -158216 122352 -6420 -70457 -30342 -132383 63641
10844b73497c936D7776a29460l4183J0200C04470b53338g8836A74713a43758C3051
$$ -273497 -3936 47776 -129460 -163643 -153443 304470 -253338 -78836 174713 -143758 33051
10832A24818h8155k05550B9760a95412N4968F5309o023a26665A94243e9805A53482
$$ 124818 -88155 -293705 29760 -195412 -140444 65309 59286 -126665 194243 -59805 153482
10820E9317G143e9747J9228m078A11765J7899a11179A45596J63924a37527B11332
$$ 59317 7143 -59747 -40519 -44597 111765 129664 -111179 145596 309520 -137527 211332
10808a11963r7430g7947A31420c76063E9076a62833A32872K82613b80781c5346
$$ -111963 -209393 -77947 131420 -376063 59076 -162833 132872 415485 -280781 -35346
10797i1720D03J75449h7566L4917D4530J32315a20154k1423I7528K30524A54422
$$ -91720 403 175852 -87566 -52649 44530 176845 -120154 -141577 97528 328052 154422
10785A17497b67998H0652a19880b6577k00678C186K3869K56660r9921E8758a84723
$$ 117497 -267998 80652 -119880 -26577 -227255 3186 27055 283715 183794 58758 -184723
10773A98888i6729j37283c6165B11002d23808J79962A15264b26593h5476E1290
$$ 198888 -96729 -234012 -36165 211002 -423808 -243846 115264 -226593 -85476 51290
10762a32862A93740J4509e5259E2878h028j06767E4136K84811H7144G535c09596
$$ -132862 193740 208249 -55259 52878 -8028 -114795 54136 338947 87144 7535 -309596
10750A72031m6276e4874B24975a70016m2059A87732D5949b28520A72632B7791
$$ 172031 125755 -54874 224975 -170016 -212075 187732 45949 -228520 172632 27791
10739e9674j53023f5045j16353d2445n1128p4094a2740l29176F2838K39635c44653
$$ -59674 -212697 -65045 -181398 -42445 -93573 -167667 -12740 -341916 62838 302473 -344653
10727c0697E01349a09632B4653N180b24343A7467d7085k05002R8339G2212c16815
$$ -30697 501349 -109632 24653 29833 -224343 17467 -47085 -252087 -153748 72212 -316815
10715f9542k44223A42266E567a38620p4177d2810k06388A16961N5953a94893B67323
$$ -69542 -313765 142266 5567 -138620 -212797 -42810 -249198 116961 172914 -194893 267323
10703a74697L5662k61434e0972k43653E2081b26340R7770A7130h9936D8652e0336
$$ -174697 -139035 -400469 -50972 -294625 52081 -226340 -128570 17130 -89936 48652 -50336
10691c83090B19850A03258O6873J61925a24179B7808a02954K3179A57192c70450
$$ -383090 219850 103258 170131 332056 -124179 27808 -102954 -79775 157192 -370450
10680a51904A50345a34911a7605k01791N7481A30641P156J30616a0210M276k07872
$$ -151904 150345 -134911 -17605 -219396 -161915 130641 137797 268413 -10210 -5934 -213806
10669b13806f57A25078e3802A32496O146i1806m11901a41236N2887b9485C656
$$ -213806 -657 125078 -53802 132496 138642 -91806 -503707 -141236 -88349 -29485 3656
10657c40501j63564a64378B5495a05845M2854k89913e9642A93719c48492R4887
$$ -340501 -504065 -164378 25495 -105845 -62991 -352904 -59642 193719 -348492 -253605
10647b53605I3003a84964F6567J09541J48346C2811a64506A3254c86439E9451
$$ -253605 93003 -184964 66567 176108 324454 32811 -164506 13254 -386439 59451
10636A07313a39283d5051k7926a3909j14451B04482a7901F8395O5859M2864D2653
$$ 107313 -139283 -45051 -72977 -13909 -128360 204482 -17901 68395 134254 177118 42653
10624A0342a34969L9454C7619j7815c22567a57168H5201Q4407b18432b6703l282
$$ 10342 -134969 -95515 37619 19804 -322567 -157168 85201 169608 -218432 -26703 -29985
10613b9985A35580a68853N937j29656a7718A54775d564I2622G258b91787C19029
$$ -29985 135580 -168853 -162916 -292572 -17718 154775 -4564 92622 7258 -291787 319029
10601A35455a10173d6797I8492b13166h584p2076J4309A0344N9674b06396B00826
$$ 135455 -110173 -46797 98492 -213166 -8584 -80660 -66351 10344 70018 -206396 200826
10589g1095B39086a45295A99870G267K15397E2396a76922Q3364m8087c6922m24962
$$ -71095 239086 -145295 199870 7267 222664 52396 -176922 -93558 -141645 -36922 -461884
10578d61884e6755A2397a22142A48489l5475a98681C676a57721A43303b63206
$$ -461884 -56755 12397 -122142 148489 113014 -198681 3676 -157721 143303 -263206
10567b43836L0994C9139M7489a02097r0871b6299j49033q438l584J3662Q4514
$$ -243836 -212842 39139 86628 -102097 -192968 -26299 -175332 -183770 -187354 -173692 -89178
10556h9178p5279K5183c6068A39301m1680b6595j89956K861f0765a5734j68742
$$ -89178 -164457 -139274 -36068 139301 97621 -26595 -216551 -213690 -60765 -15734 -184476
10545a84476h4583A01651L8411b29158F016J24450K81208g0020k45063C28861
$$ -184476 -84583 101651 140062 -229158 6016 130466 411674 -70020 -315083 328861
10534A86320e6365k7355B62169b20104a09408b0232j77027D0969A8026f208G7032
$$ 186320 -56365 -83720 262169 -220104 -109408 -20232 -197259 40969 18026 -6208 77032
10522g9301A2597a0429k41722A19594D8965K14344G0850J9820a13719F8788g3958
$$ -79301 12597 -10429 -252151 119594 48965 263309 70850 90670 -113719 68788 -73958
10510b67636D013a3872B80734a17488A09372B4252a30486r1605B00847N3515b42277
$$ -267636 4013 -13872 280734 -117488 109372 24252 -130486 -222091 200847 254362 -242277
10498a9694j73797H9135C8231h9816d2773k97014A86364P42h0416a9705m5347
$$ -19694 -193491 89135 38231 -89816 -42773 -339787 186364 187106 -80416 -19705 -65052
10487f5052j3440l0237H8462e0457G9999a57851K4355B28781b81799I4189j3137
$$ -65052 -78492 -108729 88462 -50457 79999 -157851 -133496 228781 -281799 94189 81052
10476H1052g7079I33J00738a00193o7435N0435A63918b2765B13091l4953a95273
$$ 81052 -77079 933 101671 -100193 -167628 -117193 163918 -22765 213091 178138 -195273
10464C5199J34150k3728b1064l4879j07122D0443a80030F4700b4454j90732O4791
$$ 35199 169349 145621 -21064 -55943 -163065 40443 -180030 64700 -24454 -215186 -150395
10453a50395a4166l4210p3824j89034c1348A48501D9077M1311O3222l758l0944
$$ -150395 -14166 -48376 -122200 -311234 -31348 148501 49077 90388 153610 149852 118908
10442A18908c8671B40409b30363B09897G6988B2246N0176K2793h0886E8705b5278
$$ 118908 -38671 240409 -230363 209897 76988 22246 72422 95215 -80886 58705 -25278
10430F168M0379a29533B56734b14279A65561b99671e2066A8072J59110o1702a17774
$$ 6168 46547 -129533 256734 -214279 165561 -299671 -52066 18072 177182 115480 -117774
10418B19103A05056A7612J74943n163B9841a84194G2015a7880E9491d7905r1768
$$ 219103 105056 17612 192555 187392 29841 -184194 72015 -17880 59491 -47905 -139673
10407a39673L1086E3853c78469n871a08343b0757B12806a87476e0420B58988a70664
$$ -139673 -108587 53853 -378469 -384340 -108343 -20757 212806 -187476 -50420 258988 -170664
10395I6109B6966b08887B32053R489a73102C01867p9423j1662B0620d6090B33159
$$ 96109 26966 -208887 232053 241542 -173102 301867 222444 210782 20620 -46090 233159
10383a79846A65264g4057j98803A34025k75J13044e8615A03530M05938A16540
$$ -179846 165264 -74057 -272860 134025 133750 246794 -58615 103530 509468 116540
10372D7711Q5673J37265G5018K30056a80829E63217j46518j809G6373P2918K27405
$$ 47711 133384 270649 75018 305074 -180829 563217 416699 414890 76373 149291 376696
10361C76696I9201C2629K61592o3754M4422A25880R0791H4174J68754m4851L26837
$$ 376696 99201 32629 294221 230467 274889 125880 216671 84174 252928 208077 534914
10350E34914B67245j15201L03987D9690L27817G5538Q6521n8503R6456i5703B14291
$$ 534914 267245 152044 456031 49690 377507 75538 162059 103556 200012 -95703 214291
10338A49284F8814a5232G5162L84776d1480j2581B64039q9769g3822E5483K93956
$$ 149284 68814 -15232 75162 459938 -41480 -54061 264039 174270 -73822 55483 349439
10327C49439d5305A51417l1713n0447J63680n42o9914K7899C6403a97564A02406
$$ 349439 -45305 151417 119704 69257 232937 232395 162481 190380 36403 -197564 102406
10315a65597E5308L10845I7409O9726K94574F0578M0988a50251A3273e7177j52834
$$ -165597 55308 366153 97409 167135 461709 60578 101566 -150251 13273 -57177 -210011
10304b10011A47769c12498g0417k00932A35529i1163J9763C42306q4694e9362
$$ -210011 147769 -312498 -70417 -271349 135529 -91163 -71400 342306 257612 -59362
10293h2866h68k89652A63131O6576a05754A90803q4867I138b47361O4487j94782
$$ -82866 -868 -290520 163131 229707 -105754 190803 105936 9138 -247361 -182874 -377656
10282c77656J87380L4027A7147M1489b13166j28751A44118K14447a32193L966
$$ -377656 -190276 -156249 17147 58636 -213166 -341917 144118 358565 -132193 -128227
10272a28227I6908J45684p8050b22230B47716a89244k05596B91456B5970d43504
$$ -128227 96908 242592 164542 -222230 247716 -189244 -394840 291456 25970 -443504
10261A532a5070n2151D7924a86236B23274q1604J21766f3957A06247R2355C8558
$$ 1532 -15070 -67221 47924 -186236 223274 141670 263436 -63957 106247 198602 38558
10249C21838B5650c2056j92640p7755A43229g6336A36984Q762a52389B02424a00594
$$ 321838 25650 -32056 -224696 -302451 143229 -76336 136984 145746 -152389 202424 -100594
10237d0334l8871r7562A08166g821j43756o2067D4803a11940j88212G2458i7095
$$ -40334 -79205 -176767 108166 -7821 -151577 -213644 44803 -111940 -300152 72458 -97095
10225D2776a47719A05052L85927a94631I9565J12617J55065c52556i9674j9489
$$ 42776 -147719 105052 490979 -194631 99565 212182 367247 -352556 -99674 -119163
10215a19163j8593D23814b09944D3777K4693a64493a1426m04160c52D2202M8501
$$ -119163 -137756 423814 -209944 43777 68470 -164493 -11426 -415586 -352 42202 90703
10204I0703b92145m6981i428A21149b62126B71430a57494I7813k0175b79902R0002
$$ 90703 -292145 -339126 -9428 121149 -262126 271430 -157494 97813 77638 -279902 -189900
10193a89900P1371d5331m6402j3867o2993E5838e8513C4696J12346a88708C9706
$$ -189900 -118529 -45331 -91733 -105600 -168593 55838 -58513 34696 147042 -188708 39706
10181b78522D4937L8720e9666B30048C5300J86541H4312c4675F2427g4880j25489
$$ -278522 44937 83657 -59666 230048 35300 221841 84312 -34675 62427 -74880 -200369
10170b00369H381a75870h2358K5956k50201A30066J68587b90909R350a16347a5467
$$ -200369 8381 -175870 -82358 -56402 -306603 130066 298653 -290909 -281559 -116347 -15467
10158A40768a04219a890j69647P1792a9507A19237a37246p3329P2680e4895A8482
$$ 140768 -104219 -1890 -171537 -99745 -19507 119237 -137246 -210575 -137895 -54895 18482
10146A8961g6640F1064b2965A03815b61204a29641n3329H7781k9240a28477F1061
$$ 18961 -76640 61064 -22965 103815 -261204 -129641 -182970 87781 58541 -128477 61061
10134D3360J64229i2364A3928a39155j02535J18652c3005A25869a18667n4561
$$ 43360 207589 -92364 13928 -139155 -241690 -123038 -33005 125869 -118667 -173228
10124a73228e4621K5939A04282a45169c4643r9840k21278J74869j49229E0017
$$ -173228 -54621 -28682 104282 -145169 -34643 -134483 -355761 -180892 -330121 50017
10113f2866o3559A29890a04298H2647J27807E9115J463a5007k7833j75584P6821
$$ -62866 -126425 129890 -104298 82647 210454 59115 60578 -15007 -42840 -218424 -141603
10102a41603C1694K92J02889a75938E3082c73306f0847E4589b17713I8240C5499
$$ -141603 31694 31986 134875 -175938 53082 -373306 -60847 54589 -217713 98240 35499
10090C387a64845I2939F256a79750d6998j78735A97608a08630k27077B45166J0127
$$ 3387 -164845 92939 6256 -179750 -46998 -225733 197608 -108630 -335707 245166 255293
10079B55293A8558b62978J10161P3047A46561C898b86385k59415f4078q6251B84377
$$ 255293 18558 -262978 -152817 -79770 146561 3898 -286385 -545800 -64078 -150329 284377
10067c923n8167B19332p1212K54735C2747J81041a88481M5877j44473A20498f4194
$$ -3923 -62090 219332 148120 402855 32747 213788 -188481 -142604 -287077 120498 -64194
10055a380m10328a80994f6450m39760a03274C8411A2976K15592a17871E7991b04181
$$ -1380 -411708 -180994 -66450 -506210 -103274 38411 12976 228568 -117871 57991 -204181
10043a12440L8332l00396a64263I857M4081b04195l9823b1313C8409j5190a13297
$$ -112440 -74108 -374504 -164263 9857 53938 -204195 -244018 -21313 38409 23219 -113297
10031A24828J73076A35247g0570k43202M1581H666L434a84994n7450L4489k09940
$$ 124828 297904 135247 -70570 -313772 -272191 8666 12100 -184994 -242444 -207955 -417895
10020d17895d3642j3229r4111j10120p3011A09635c1854D0612A3555a77908l44125
$$ -417895 -43642 -56871 -150982 -261102 -334113 109635 -31854 40612 13555 -177908 -522033
10009e22033A40909a35100p5643A70710H5331a76994C14514f2888j89573C2499
$$ -522033 140909 -135100 -210743 170710 85331 -176994 314514 -62888 -252461 32499
9998A02050D439e1439j88335J14514H1612O1751a16330A12134a28520j1265I2826
$$ 102050 4439 -51439 -239774 -125260 81612 143363 -116330 112134 -128520 -139785 92826
9986F0230d06843n7874A41726h2269Q514A15472h5433j13577N5836F9767R957
$$ 60230 -406843 -464717 141726 -82269 -73755 115472 -85433 -199010 -143174 69767 79724
9975G9724b26671A61928b70069j26105J23508F7319L028a85758J3924B18712h2726
$$ 79724 -226671 161928 -270069 -396174 -272666 67319 70347 -185758 -171834 218712 -82726
9963i9515D7674L25329b79393a16376a6913f984C7044N3194a74084B0037r760
$$ -99515 47674 373003 -279393 -116376 -16913 -6984 37044 90238 -174084 20037 10277
9952A0277b20514k0304n1388A46514a98982A23532o0594e5514m76438i3505m4067
$$ 10277 -220514 -240818 -292206 146514 -198982 123532 62938 -55514 -531952 -93505 -137572
9941a37572A81213c80367A87760c40836J49521h0766m6110A97593a52105p8246
$$ -137572 181213 -380367 187760 -340836 -191315 -80766 -126876 197593 -152105 -230351
9931b30351I284K41689a8483p906l06112J32715H1189a9811r6310A58665a74608
$$ -230351 9284 250973 -18483 -26389 -332501 -199786 81189 -19811 -116121 158665 -174608
9919e9009B7117J4182j9534g1355b3925A75870E7154L6138f2115l9384j18686
$$ -59009 27117 41299 21765 -71355 -23925 175870 57154 93292 -62115 -101499 -220185
9908b20185j00815I5859l7911L78987g4133j29957P0154m4224j74246e189k06818
$$ -220185 -321000 95859 57948 436935 -74133 -204090 -133936 -178160 -352406 -5189 -212007
9897b12007H4085J08347b35321k21337B36357b29861A51156C5768K57162h3785
$$ -212007 84085 192432 -235321 -456658 236357 -229861 151156 35768 292930 -83785
9886e7763k55635A44350a76350A81384a32890j94044a57898f662k7014l32279
$$ -57763 -313398 144350 -176350 181384 -132890 -326934 -157898 -6662 -33676 -365955
9876c65955e3250k01916A25153D4786K764K12118q9513k2372n6645J29689a11589
$$ -365955 -53250 -255166 125153 44786 47550 259668 170155 147783 91138 220827 -111589
9864E7492L51358i6659k31838J54636A2277i6941l92343b1979j32329B0077b08767
$$ 57492 408850 -96659 -328497 -173861 12277 -96941 -489284 -21979 -154308 20077 -208767
9852B18028m4973a10761d7346l54707a47715n4562q7156a10948F9966a80296n2138
$$ 218028 173055 -110761 -47346 -402053 -147715 -202277 -289433 -110948 69966 -180296 -232434
9841b32434E5606c30470B48911f7427j55192A49224e10387b5076G1016k9059d3941
$$ -232434 55606 -330470 248911 -67427 -222619 149224 -510387 -25076 71016 41957 -43941
9829f8247J6250j10335A3963h2178B49034G5071c34332a24724j10754a807j04814
$$ -68247 -51997 -162332 13963 -82178 249034 75071 -334332 -124724 -235478 -1807 -106621
9818a06621b2588k8688A35565J57578B820e7484A99329J15544A41084b90567h4229
$$ -106621 -22588 -51276 135565 293143 2820 -57484 199329 314873 141084 -290567 -84229
9806c8590o5146l3731N7999j09820i1065m6051B01404D5994j2651d27548a03575
$$ -38590 -103736 -137467 -79468 -189288 -91065 -137116 201404 45994 33343 -427548 -103575
9794b24429a4486l6659n7712C36514F1180a42469a6787A84824D435c53381J10177
$$ -224429 -14486 -51145 -108857 336514 61180 -142469 -16787 184824 4435 -353381 -243204
9783b43204J1565A74199b44311Q5573D0522a92462b5843j47860q3548J14024p3915
$$ -243204 -231639 174199 -244311 -158738 40522 -192462 -25843 -173703 -257251 -143227 -217142
9772b17142j70748a38849p9488I5788e50217D7806c9133A88798f5948K9087k5400
$$ -217142 -387890 -138849 -218337 95788 -550217 47806 -39133 188798 -65948 -36861 -62261
9761f2261j44315A0378e5168m5290q8984A03994l9274b21509a8964r4894k7628
$$ -62261 -206576 10378 -55168 -100458 -189442 103994 64720 -221509 -18964 -113858 -141486
9750a41486B17638A1173g1790F4656B3652d6015B23251g1004J4604l38317A49228
$$ -141486 217638 11173 -71790 64656 23652 -46015 223251 -71004 -56400 -394717 149228
9738a87321I2796b40723D3884A3364h2701A23877B1973a13920a0408k7511r5584
$$ -187321 92796 -240723 43884 13364 -82701 123877 21973 -113920 -10408 -37919 -133503
9727a33503k32621B24885b49363g8860a8893l02125J34388j74709D4894K16002
$$ -133503 -366124 224885 -249363 -78860 -18893 -321018 -186630 -361339 44894 260896
9717B60896d1480m1630c0273A10283a81267r7091B00507e6344h096C3994a34526
$$ 260896 -41480 -83110 -30273 110283 -181267 -278358 200507 -56344 -8096 33994 -134526
9705G2051d3102E311a47206A4377L0732A0881a30555k59001g9212m3964d482j38281
$$ 72051 -43102 5311 -147206 14377 45109 10881 -130555 -389556 -79212 -123176 -4482 -142763
9693a42763a8328k24343C2379P8005g1314A21784b02665N4973l06585E3506b89667
$$ -142763 -18328 -242671 32379 110384 -71314 121784 -202665 -147692 -454277 53506 -289667
9681B32088a58815B27311b1807l6733k05212g463K939C80984c24397b4679n704
$$ 232088 -158815 227311 -21807 -58540 -263752 -7463 -4524 380984 -324397 -24679 -30383
9670c0383L006j11867L3189j62951l025A6128c81269J63190k0897B63147e3462
$$ -30383 -27377 -139244 -106055 -269006 -272031 16128 -381269 -218079 -238976 263147 -53462
9658a42734l00430a59662b8580D5058a42396A18414i2975E3029b58690e62A49085
$$ -142734 -443164 -159662 -28580 45058 -142396 118414 -92975 53029 -258690 -562 149085
9646a75164J7882B05778e17529A66515b90183A07419R3084F103g3555B4043a48367
$$ -175164 -157282 205778 -517529 166515 -290183 107419 200503 6103 -73555 24043 -148367
9634b40528g2198k06888J0554e3682j39732C49672a4037j12215B7764a75940c3302
$$ -240528 -72198 -279086 -268532 -53682 -193414 349672 -14037 -126252 27764 -175940 -33302
9622B7193e6798j18018j0035h9287r1564H0080b23535M5186E2684a05796p5980
$$ 27193 -56798 -174816 -184851 -89287 -180851 80080 -223535 -178349 52684 -105796 -181776
9611a81776C99360A5598a19311K9700k65878C10596b78611A96735e3952n9791
$$ -181776 399360 15598 -119311 -89611 -355489 310596 -278611 196735 -53952 -113743
9601a13743j01339m5911B0768a76936b0804q0759o7007K1084l6902e482j61343
$$ -113743 -215082 -260993 20768 -176936 -20804 -101563 -168570 -147486 -184388 -5482 -166825
9590a66825a9528A16203g9982j27506j23263B73558b6290m5776j60941f4320p7704
$$ -166825 -19528 116203 -79982 -207488 -330751 273558 -26290 -72066 -233007 -64320 -142024
9579a42024p8172A56449a38914A90732o9126B5596a20677k8708O1446B77195g391
$$ -142024 -220196 156449 -138914 190732 121606 25596 -120677 -149385 -87939 277195 -7391
9567b86382b2137j36818B72435b21610i773k78940a37294f5426B11845a13146
$$ -286382 -22137 -158955 272435 -221610 -9773 -288713 -137294 -65426 211845 -113146
9556c28484e49j9922l78452C2387c6894m0643C0050c79192C5788a52558E4386
$$ -328484 -549 -20471 -398923 32387 -36894 -77537 30050 -379192 35788 -152558 54386
9544b53586a19172e8734J1517n714p1946I5760K04037J159j42916g1629A27121
$$ -253586 -119172 -58734 -47217 -52931 -124877 95760 299797 300956 158040 -71629 127121
9532F540a45340k38278a67412r902A52021b21095G9604c2206j94426j5069A47345
$$ 6540 -145340 -383618 -167412 -177314 152021 -221095 79604 -32206 -226632 -241701 147345
9520h1484G8717b71207r450i0111A00041c6954H9591a9999j44874B27210b04658
$$ -81484 78717 -271207 -280657 -90111 100041 -36954 89591 -19999 -164873 227210 -204658
9508c7146G6326a59847B95550a2591A368a725B57604b54785l7533b9810q2432
$$ -37146 76326 -159847 295550 -12591 1368 -1725 257604 -254785 -292318 -29810 -112242
9497a12242j19671C28082j22525A2102a94455A66010a77564m9289B7492c7148
$$ -112242 -231913 328082 205557 12102 -194455 166010 -177564 -226853 27492 -37148
9486h1271A042i4933A84434A4120e86347b4415k09935C87284a57563A07157k5754
$$ -81271 1042 -94933 184434 14120 -586347 -24415 -234350 387284 -157563 107157 81403
9475H1403a9599k14138J09709A88037a88215I5398b45546A89704c8000j85363
$$ 81403 -19599 -233737 -124028 188037 -188215 95398 -245546 189704 -38000 -223363
9465b23363o782g8413c4136k9000n9276D860M12026b6448q6219C00523d2513C02556
$$ -223363 -230145 -78413 -34136 -63136 -122412 4860 416886 -26448 -112667 300523 -42513 302556
9452h2468c5995A4390g9660A07375B06J60658b99163A26826b33930G1052b71022
$$ -82468 -35995 14390 -79660 107375 206 160864 -299163 126826 -233930 71052 -271022
9440A17431a72855A66077D0390J04964a5072j96180j55444C89h4412A66454b80471
$$ 117431 -172855 166077 40390 145354 -15072 -211252 -366696 389 -84412 166454 -280471
9428d08665C4274J32882A3070a0354E8617b52235Q2001B8687b23973N0417d7882
$$ -408665 34274 167156 13070 -10354 58617 -252235 -170234 28687 -223973 -173556 -47882
9416I6444P6329a0957G5223h0898k4695A27325M4337a074m7935k8646j344L6726
$$ 96444 172773 -10957 75223 -80898 -105593 127325 171662 -1074 -49009 -77655 -78999 -42273
9404d2273C2209J43055a65063E2463a29563A31411F0591a08903A11735J24252
$$ -42273 32209 175264 -165063 52463 -129563 131411 60591 -108903 111735 235987
9394B35987e8363l33608K8149a64449l19874J26639a55083k0019K1992j8149j78275
$$ 235987 -58363 -391971 -363822 -164449 -484323 -357684 -155083 -175102 -153110 -171259 -349534
9383c49534D3917b38837R6364q2959P0865A20839a63610k1114c3601G469a74431
$$ -349534 43917 -238837 -142473 -225432 -154567 120839 -163610 -184724 -33601 7469 -174431
9371D0642O1935c20068a47506E1358a10502A35312R1339c2881l22828I8491P2965
$$ 40642 102577 -320068 -147506 51358 -110502 135312 226651 -32881 -355709 98491 171456
9360A71456m2370f4553A49705q414C9200a37286c4654l26486A39558a53545r3061
$$ 171456 129086 -64553 149705 141291 39200 -137286 -34654 -361140 139558 -153545 -246606
9349b46606a7574n0940m6307B05177b78062b9254C743a4455A45820c80013J9701
$$ -246606 -17574 -68514 -114821 205177 -278062 -29254 3743 -14455 145820 -380013 -360312
9338c60312D3589K18817d01716B17399K2604b40205e0280k6704A81332i0065j75736
$$ -360312 43589 262406 -401716 217399 240003 -240205 -50280 -76984 181332 -90065 -265801
9327b65801D292K25952b7664E2102A9171O2400a01805G5542J7824a5685p7725
$$ -265801 4292 230244 -27664 52102 19171 81571 -101805 75542 93366 -15685 -93410
9316i3410j97290E6410b30653E9913a04430r6188C16159c70129D5281K96364d69561
$$ -93410 -290700 56410 -230653 59913 -104430 -200618 316159 -370129 45281 341645 -469561
9304a46723C08932a51463J4860l4748B3831K19928a46044L0923b6683k37798J01449
$$ -146723 308932 -151463 -136603 -171351 23831 243759 -146044 -115121 -26683 -264481 -163032
9293a63032o7354r1997R3007j16563K8347c6183n4664J1931B83191e0626m3501
$$ -163032 -230386 -322383 -229376 -345939 -317592 -36183 -90847 -78916 283191 -50626 -94127
9282i4127j81746B25414d1491N107D2937g8312C6310J21432b42573A19261O2041
$$ -94127 -275873 225414 -41491 -36384 42937 -78312 36310 157742 -242573 119261 181302
9271A81302c55481a19301j98862J53415A80809c55144a53626N5213F1010M6238
$$ 181302 -355481 -119301 -318163 -164748 180809 -355144 -153626 -98413 61010 107248
9261A07248b16957O5053j57563a19987l53572b04496G8410K23783b09614e2369
$$ 107248 -216957 -151904 -309467 -119987 -473559 -204496 78410 302193 -209614 -52369
9250G5893e3221B3036a93673d6014A43336O766a54663d1547j67873b8230A07898
$$ 75893 -53221 23036 -193673 -46014 143336 150102 -154663 -41547 -209420 -28230 107898
9238a60194J7465k32047C0614Q8825B6996a21509L4045k4855j783E967K05582
$$ -160194 -142729 -374776 30614 119439 26996 -121509 -87464 -112319 -114102 5967 211549
9227B11549m2452f5196j59735L5944Q4446k3117m4143a5524d390C11279a31598
$$ 211549 169097 -65196 -224931 -188987 -104541 -127658 -171801 -15524 -4390 311279 -131598
9215c4286A89362b20090f757k29463k48116c0794A09376D4837K63792c38680f0421
$$ -34286 189362 -220090 -6757 -236220 -484336 -30794 109376 44837 308629 -338680 -60421
9203b03422j0582B9366K17997h6957M525k29195b751B5084a22021p3175J0981
$$ -203422 -214004 29366 247363 -86957 -82432 -311627 -2751 25084 -122021 -195196 -184215
9192a84215k0482I6061b07364A42146f6772j43301j99132B3318L07766r0270N6882
$$ -184215 -204697 96061 -207364 142146 -66772 -210073 -409205 23318 331084 240814 297696
9181B97696B8159a41979G141a89164K557C77313H2512a70279B78431H0282a67762
$$ 297696 28159 -141979 7141 -189164 -186607 377313 82512 -170279 278431 80282 -167762
9169A9496a48605G7533a59087O7644j55151l0199I2601L5506a06706B15379a4899
$$ 19496 -148605 77533 -159087 -91443 -246594 -276793 92601 128107 -106706 215379 -14899
9157a82896g2032h462j30396C84291D7461a64859A4685K3850c30985a42183b4189
$$ -182896 -72032 -8462 -138858 384291 47461 -164859 14685 38535 -330985 -142183 -24189
9145c89198J76357D3347L860c8920l3984I943g3761I0032L29004b26929e8703
$$ -389198 -212841 43347 47207 -38920 -72904 9943 -73761 90032 419036 -226929 -58703
9133a72884J1534A8803J53871a11641B67618E3893a29729E805J53641a07503p2461
$$ -172884 -161350 18803 172674 -111641 267618 53893 -129729 5805 159446 -107503 -179964
9122a79964b1233C12106a34406j4485b428r9257d8313a2715q3498b769r3614B53880
$$ -179964 -21233 312106 -134406 -148891 -2428 -101685 -48313 -12715 -96213 -2769 -96383 253880
9109b05777F2867i8189k27431B55323b22667q6276A80752a52009F1143j6267a52477
$$ -205777 62867 -98189 -325620 255323 -222667 -308943 180752 -152009 61143 44876 -152477
9097c816l0959k73741i0919A94739I4395A9830d0843B29201F7022Q2602a55013
$$ -3816 -34775 -308516 -90919 194739 94395 19830 -40843 229201 67022 149624 -155013
9085C25879C2794b27265A72178C2577b7168k5430G2521a89544E2497a85719m1336
$$ 325879 32794 -227265 172178 32577 -27168 -52598 72521 -189544 52497 -185719 -227055
9074b27055d7413F789M5531c48973a74209e5406A69184a13945k60290a3159A23837
$$ -227055 -47413 6789 52320 -348973 -174209 -55406 169184 -113945 -374235 -13159 123837
9062c76959G7174i7815K342A83819P4801c37169f2211q6049e4025A72137c41585
$$ -376959 77174 -97815 -95473 183819 258620 -337169 -62211 -148260 -54025 172137 -341585
9050c15844G8334a81142b9219A34531b5768l27915J43670j47331c06j42369A4799
$$ -315844 78334 -181142 -29219 134531 -25768 -353683 -210013 -357344 -306 -142675 14799
9038a78579j3666d5741m9718I5891c9k73014h6480B53998e03805b37554M2885
$$ -178579 -192245 -45741 -95459 95891 -39 -273053 -86480 253998 -503805 -237554 -194669
9027a94669L0089g0361n1976m8840q5637O4703B65894a81461G8673K82430a19962
$$ -194669 -164580 -70361 -122337 -171177 -256814 -192111 265894 -181461 78673 361103 -119962
9015C9894d06310J27589a38212C89994I8738j0354b72487d167j16133k05769E8297
$$ 39894 -406310 -278721 -138212 389994 98738 88384 -272487 -4167 -120300 -326069 58297
9003c9361A2729a65490a5257G7514N0808a93791L1259J6819O2544o8931J9793
$$ -39361 12729 -165490 -15257 77514 128322 -193791 -162532 -145713 -83169 -152100 -132307
8992a32307b4302k42918d0405A7511c5984j22549j0925B8968a54012D02089A953
$$ -132307 -24302 -267220 -40405 17511 -35984 -158533 -169458 28968 -154012 402089 1953
8980b50076O0129b2520E6049b65651J9548A03693e3680j09565J2349A6437g4554
$$ -250076 -189947 -22520 56049 -265651 -246103 103693 -53680 -163245 -150896 16437 -74554
8968a7598I8781b87686a38043b9491l1874j29864f2480l50644B24324m7524J06008
$$ -17598 98781 -287686 -138043 -29491 -61365 -191229 -62480 -413124 224324 176800 282808
8957B82808a70840A9488c0907j87994D4231Q3999D7766d0753B46375j06380b71420
$$ 282808 -170840 19488 -30907 -218901 44231 128230 47766 -40753 246375 139995 -271420
8945b77645B610b64595i2340A19181b76588R3718J3334l9895d0071D90688H9743
$$ -277645 2610 -264595 -92340 119181 -276588 -182870 -169536 -209431 -40071 490688 89743
8933C68877j12099b49700B0202K02600K0544G6686M73666B71091J38082M11474
$$ 368877 256778 -249700 20202 222802 243346 76686 550352 271091 409173 820647
8923H20647J224946N749857J2495715C888805A004522l33626C24200j56881o2898
$$ 820647 2045593 7795450 20291165 3888805 1004522 670896 324200 167319 104421
8914A04421a71919H4387I16J51260J6983a62877B81487a0655A74874b24326A6271
$$ 104421 -171919 84387 916 152176 169159 -162877 281487 -10655 174874 -224326 16271
8902a97051R0927j0332l3324g0548C6579a04808j94453h7907A4381J02038a1584
$$ -197051 -106124 -116456 -149780 -70548 36579 -104808 -299261 -87907 14381 116419 -11584
8890b4806r6550m8587M3838A71075A5908c81754A03069i268j98745F0668b2627
$$ -24806 -121356 -169943 -126105 171075 15908 -381754 103069 -9268 -208013 60668 -22627
8878f7366D62485e620l51904A45221J12981A3443K24349b62219B51950A11939
$$ -67366 462485 -5620 -357524 145221 258202 13443 237792 -262219 251950 111939
8867a89430B52964A17629l1899d24902J26827A8546M3845f9072C83663H2194b16005
$$ -189430 252964 117629 85730 -424902 -298075 18546 62391 -69072 383663 82194 -216005
$$ [...]
##END NTUPLES=NMR SPECTRUM
##END=
