
##TITLE=UV1255_M10_1340-1211_90_7409353_Q3wg8abeNl
##JCAMPDX= 6.0         $$ Bruker NMR JCAMP-DX V2.0
##DATA TYPE= NMR SPECTRUM
##DATA CLASS= NTUPLES
##ORIGIN= BRUKER
##OWNER= Administrator
$$ 1.72 TOPSPIN		Version 2.1
$$ 2013-01-24 21:55:37.568 -0500  Administrator@X
$$ Compression mode = diff/dup
##.OBSERVE FREQUENCY= 400.02188249412
##.OBSERVE NUCLEUS= ^1H
##.ACQUISITION MODE= SIMULTANEOUS (DQD)
##.ACQUISITION SCHEME= undefined
##.AVERAGES= 64
##.DIGITISER RES= 22
##SPECTROMETER/DATA SYSTEM= spect
##.PULSE SEQUENCE= noesygpps1d.comp
##.SOLVENT NAME= COFFEE_meoh
##.SHIFT REFERENCE= INTERNAL, COFFEE_meoh, 1, 14.96116
##AUDIT TRAIL= $$ (NUMBER, WHEN, WHO, WHERE, PROCESS, VERSION, WHAT)
$$ ##TITLE= Audit trail, TOPSPIN		Version 2.1
$$ ##JCAMPDX= 5.01
$$ ##ORIGIN= Bruker BioSpin GmbH
$$ ##OWNER= Administrator
$$ $$ E:\/data/COFFEE/nmr/UV1255_M10_1340-1211_90_7409353_Q3wg8abeNl/12/pdata/1/auditp.txt
$$ ##AUDIT TRAIL=  $$ (NUMBER, WHEN, WHO, WHERE, PROCESS, VERSION, WHAT)
(   1,<2013-01-24 21:55:31.646 -0500>,<Administrator>,<X>,<go>,<TOPSPIN 2.1>,
      <created by zg
	started at 2013-01-24 21:44:01.615 -0500,
	POWCHK enabled, PULCHK disabled,
       configuration hash MD5:
       86 BA 57 50 F2 9D 5C 9B 26 00 A9 28 5F 66 2E 89
       data hash MD5: 64K
       44 F2 5D 35 75 8E 2B 0F F4 A1 10 EE 9A 61 97 B4>)
(   2,<2013-01-24 21:55:34.771 -0500>,<Administrator>,<X>,<proc1d>,<TOPSPIN 2.1>,
      <Start of raw data processing
       efp LB = 0.3 FT_mod = 6 PKNL = 1 PHC0 = 0 PHC1 = 0 SI = 128K 
       data hash MD5: 128K
       3F B1 07 10 27 84 79 2A 66 0E 99 D5 E7 BE FE 5E>)
(   3,<2013-01-24 21:55:35.787 -0500>,<Administrator>,<X>,<proc1d>,<TOPSPIN 2.1>,
      <pk PHC0 = -82.98523 PHC1 = 0 
       data hash MD5: 128K
       13 40 3A 73 7F 08 3F 02 6A 60 33 42 60 ED 7F 55>)
(   4,<2013-01-24 21:55:36.521 -0500>,<Administrator>,<X>,<proc1d>,<TOPSPIN 2.1>,
      <abs ABSG = 1 
       data hash MD5: 128K
       FF BF E8 10 E1 8D B8 87 94 A9 77 EB CC 47 26 20>)
(   5,<2013-01-24 21:55:36.693 -0500>,<Administrator>,<X>,<proc1d>,<TOPSPIN 2.1>,
      <abs ABSG = 2 
       data hash MD5: 128K
       E7 41 52 59 2D 18 A0 29 70 1B BA 33 2E 95 81 02>)
(   6,<2013-01-24 21:55:36.880 -0500>,<Administrator>,<X>,<proc1d>,<TOPSPIN 2.1>,
      <abs ABSG = 3 
       data hash MD5: 128K
       63 88 94 D4 6A 01 D9 BE F1 BD E2 C8 45 4A 76 2D>)
(   7,<2013-01-24 21:55:37.052 -0500>,<Administrator>,<X>,<proc1d>,<TOPSPIN 2.1>,
      <abs ABSG = 4 
       data hash MD5: 128K
       EF DE 19 7A E4 63 19 83 97 9B 37 6B CD 76 36 5E>)
(   8,<2013-01-24 21:55:37.240 -0500>,<Administrator>,<X>,<proc1d>,<TOPSPIN 2.1>,
      <abs ABSG = 5 
       data hash MD5: 128K
       A1 1B 28 25 C9 44 0F 16 51 39 F5 1F 70 28 81 BD>)
$$ ##END=
$$ 
$$ $$ hash MD5
$$ $$ 36 36 98 E8 BE 7B B8 69 ED BB 7E 0D D1 17 EE A1
##$RELAX= 
##$RELAX= 
##$RELAX= 
##$RELAX= 
##$RELAX= 
##$RELAX= 
##$RELAX= 
##$RELAX= 
$$ Bruker specific parameters
$$ --------------------------
##$DU= <E:\>
##$EXPNO= 12
$$ [...]
##$TP07= 0
##$TPNAME0= <>
##$TPNAME1= <>
##$TPNAME2= <>
##$TPNAME3= <>
##$TPNAME4= <>
##$TPNAME5= <>
##$TPNAME6= <>
##$TPNAME7= <>
##$TPOAL= (0..7)
0.5 0.5 0.5 0.5 0.5 0.5 0.5 0.5
##$TPOFFS= (0..7)
0 0 0 0 0 0 0 0
##$TUNHIN= 0
##$TUNHOUT= 0
##$TUNXOUT= 0
##$USERA1= <user>
##$USERA2= <user>
##$USERA3= <user>
##$USERA4= <user>
##$USERA5= <user>
##$V9= 5
##$VALIST= <valist>
##$VCLIST= <CCCCCCCCCCCCCCC>
##$VD= 0
##$VDLIST= <DDDDDDDDDDDDDDD>
##$VPLIST= <PPPPPPPPPPPPPPP>
##$VTLIST= <TTTTTTTTTTTTTTT>
##$WBST= 1024
##$WBSW= 4
##$XGAIN= (0..3)
0 0 0 0
##$XL= 0
##$YL= 0
##$YMAX_a= 5542239
##$YMIN_a= -11027335
##$ZGOPTNS= <>
##$ZL1= 120
##$ZL2= 120
##$ZL3= 120
##$ZL4= 120
##$ABSF1= 14.96116
##$ABSF2= -5.597022
##$ABSG= 5
##$ABSL= 3
##$ALPHA= 0
##$AQORDER= 0
##$ASSFAC= 0
##$ASSFACI= 0
##$ASSFACX= 0
##$ASSWID= 0
##$AUNMP= <proc_prof1d_extract.lims>
##$AXLEFT= 0
##$AXNAME= <>
##$AXNUC= <1H>
##$AXRIGHT= 0
##$AXTYPE= 0
##$AXUNIT= <>
##$AZFE= 0.1
##$AZFW= 0.1
##$BCFW= 0
##$BC_mod= 0
##$BYTORDP= 0
##$COROFFS= 0
##$CY= 15
##$DATMOD= 1
##$DC= 0
##$DFILT= <>
##$DTYPP= 0
##$F1P= 0
##$F2P= 0
##$FCOR= 0.5
##$FTSIZE= 131072
##$FT_mod= 6
##$GAMMA= 0
##$GB= 0
##$INTBC= 1
##$INTSCL= 1
##$ISEN= 128
##$LB= 0.3
##$LEV0= 0
##$LPBIN= 0
##$MAXI= 10000
##$MC2= 0
##$MEAN= 0
##$ME_mod= 0
##$MI= 0
##$NCOEF= 0
##$NC_proc= -2
##$NLEV= 6
##$NOISF1= 0
##$NOISF2= 0
##$NSP= 0
##$NTH_PI= 0
##$NZP= 0
##$OFFSET= 14.96116
##$PC= 1
##$PHC0= -82.98523
##$PHC1= 0
##$PH_mod= 1
##$PKNL= yes
##$PPARMOD= 0
##$PPDIAG= 0
##$PPIPTYP= 0
##$PPMPNUM= 2147483647
##$PPRESOL= 1
##$PSCAL= 4
##$PSIGN= 0
##$PYNMP= <proc.py>
##$REVERSE= no
##$SF= 400.020009573012
##$SI= 131072
##$SIGF1= 0
##$SIGF2= 0
##$SINO= 400
##$SIOLD= 131072
##$SPECTYP= <>
##$SREGLST= <1H.CDCl3>
##$SSB= 0
##$STSI= 131072
##$STSR= 0
##$SW_p= 8223.68421052631
##$SYMM= 0
##$S_DEV= 0
##$TDeff= 65536
##$TDoff= 0
##$TI= <>
##$TILT= no
##$TM1= 0
##$TM2= 0
##$TOPLEV= 0
##$USERP1= <user>
##$USERP2= <user>
##$USERP3= <user>
##$USERP4= <user>
##$USERP5= <user>
##$WDW= 1
##$XDIM= 131072
##$YMAX_p= 400578451
##$YMIN_p= -15416
##$CURPLOT= <Network HP LaserJet P1505>
##$CURPRIN= <$Network HP LaserJet P1505>
##$DFORMAT= <normdp>
##$LAYOUT= <+/1D_H.xwp>
##$LFORMAT= <normlp>
##$PFORMAT= <normpl>
##$SURQMSG= 1
$$ End of Bruker specific parameters
$$ ---------------------------------
##NTUPLES= NMR SPECTRUM
##VAR_NAME=  FREQUENCY,     SPECTRUM/REAL,   SPECTRUM/IMAG
##SYMBOL=    X,             R,               I
##VAR_TYPE=  INDEPENDENT,   DEPENDENT,       DEPENDENT
##VAR_FORM=  AFFN,          ASDF,            ASDF
##VAR_DIM=   131072,        131072,          131072
##UNITS=     HZ,            ARBITRARY UNITS, ARBITRARY UNITS
##FACTOR=    0.0627417313425164, 1,          1
##FIRST=     8223.62146879497, 1518,         -50220
##LAST=      0,             1854,            -50018
##MIN=       0,             -15416,          0
##MAX=       8223.62146879497, 400578451,    0
$$ Real data points
##PAGE= N=1
##DATA TABLE= (X++(R..R)), XYDATA
$$ [...]
63924B817554J49849J32382J10967Q7094O1607L5176Q909j6181m0140o3822q7519
$$ 2817554 2967403 3099785 3210752 3297846 3359453 3394629 3403538 3387357 3347217 3283395 3195876
63913C195876j10223j30302j46468j58009j64743j67213j66687j64393j60632
$$ 3195876 3085653 2955351 2808883 2650874 2486131 2318918 2152231 1987838 1827206
63904A827206j54830j46480j35803j23615j10854r8322q6578p5798o5799n6408
$$ 1827206 1672376 1525896 1390093 1266478 1155624 1057302 970724 894926 829127 772719
63894G72719m7766m0214l3959k8993k5255k2644k0855j9372j7696j5608j3273
$$ 772719 724953 684739 650780 621787 596532 573888 553033 533661 515965 500357 487084
63883D87084j1197r904r480r411r081q361p499o610n550m313l135k102j008K57
$$ 487084 475887 465983 456503 447092 438011 429650 422151 415541 409991 405678 402543 400441 399433 399690
63869C99690J492K527L512M595N607O368P087Q180R759J1669J3855J6390J9094
$$ 399690 401182 403709 407221 411816 417423 423791 430878 439058 448817 460486 474341 490731 509825
63856E09825K1537K3565K5522K7812L0379L2882L5226L7655M0236M2606M4383
$$ 509825 531362 554927 580449 608261 638640 671522 706748 744403 784639 827245 871628
63845H71628M5574M6272M6184M4995M3076M1154L9179L6150L1512K6008K0601
$$ 871628 917202 963474 1009658 1054653 1097729 1138883 1178062 1214212 1245724 1271732 1292333
63834A292333J5176R105K699l083q151j3527j9864k6552l2523l7208m0518m2670
$$ 1292333 1307509 1316614 1319313 1316230 1308079 1294552 1274688 1248136 1215613 1178405 1137887 1095217
63822A095217m4270m5874m7198m7407m6392m4934m3421m1413l8895l6831l5714
$$ 1095217 1050947 1005073 957875 910468 864076 819142 775721 734308 695413 658582 622868
63811F22868l4499l2002k8640k5690k3382k0921j8123j5775j4276j3027j1504
$$ 622868 588369 556367 527727 502037 478655 457734 439611 423836 409560 396533 385029
63800C85029j0057r206q712p908o684n724n747o558p011o049l859j704m86O7N48
$$ 385029 374972 365766 357054 349146 342462 336738 330991 324433 317422 311373 307514 305810 305324 305391 305939
63785C05939P96K52r84k232l217m279n518o424o580o262o013n900n479m498l315
$$ 305939 306735 306987 306003 303771 300554 296275 290757 284333 277753 271491 265478 259578 254099 249601 246286
63770B46286k580k451k356j693o64n8k68r12j432j644j627j524j560j819j918
$$ 246286 243706 241255 238899 237206 236542 236484 236216 235304 233872 232228 230601 229077 227517 225698 223780
63755B23780j495j039j438k493k824j692j08N96M04J09r8n12r41r40o90o62o03
$$ 223780 222285 221246 219808 217315 214491 212799 212691 213287 213691 213800 213702 213190 212249 211309 210619 209957 209354
63738B09354J42J464K547L031L301L551L497L051K536K044J270K82j74N39K183
$$ 209354 209496 210960 213507 216538 219839 223390 226887 229938 232474 234518 235788 236070 235896 236435 238618
63723B38618L826M650M521M031L904M261M611M617M455M222L622K588J648J102
$$ 238618 242444 247094 251615 255646 259550 263811 268422 273039 277494 281716 285338 287926 289574 290676
63709B90676M98m91j323j523j705k654l918m385l907l262k773k052j044j68N33
$$ 290676 291174 290683 289360 287837 286132 283478 279560 275175 271268 268006 265233 263181 262137 261969 262502
63694B62502J351K068K186J943K102K653K866K653K743L310L492K687J398M08
$$ 262502 263853 265921 268107 270050 272152 274805 277671 280324 283067 286377 289869 292556 293954 294362
63680B94362q7k99n01j013j791k078j277j00K75KK83J244J718J403J566K891M176
$$ 294362 294275 293976 293475 292462 290671 288593 287316 287216 287491 287493 287776 289020 290738 292141 293707 296598 300774
63663C00774M166L340K759K280J255O2n06p17j444k646l563m103m778n379n003
$$ 300774 304940 308280 311039 313319 314574 314636 314130 313413 311969 309323 305760 301657 296879 291500 286497
63648B86497l549k192j983k672l181k749j423J73J362J926K206K543K814K767
$$ 286497 282948 280756 278773 276101 272920 270171 268748 268921 270283 272209 274415 276958 279772 282539
63634B82539K542K470K535K443K192K174K722L735M768N391N549N646O091O774
$$ 282539 285081 287551 290086 292529 294721 296895 299617 303352 308120 313511 319060 324706 330797 337571
63620C37571P313P817Q828J0353J1548J1806J1749J2540J4511J6912J8863K0164
$$ 337571 344884 352701 361529 371882 383430 395236 406985 419525 434036 450948 469811 489975
63608D89975K1253K2699K4710K6903K8607K9473K9607K8984K7111K3532J8539
$$ 489975 511228 533927 558637 585540 614147 643620 673227 702211 729322 752854 771393
63597G71393J3103Q193M248J199j154k721l166k576j914k396m374p237j0397j3886
$$ 771393 784496 792689 796937 798136 796982 794261 791095 788519 786605 784209 779835 772598 762201 748315
63583G48315j7819k1766k4922k6668k6850k5803k4153k2285k0042j7268j4462
$$ 748315 730496 708730 683808 657140 630290 604487 580334 558049 538007 520739 506277
63572E06277j2277j0501q217n133k046J91J531K344K877L332L932M531M735M588
$$ 506277 494000 483499 475282 470149 468103 468294 469825 472169 475046 478378 482310 486841 491576 496164
63558D96164M632N072N584O096P075Q682J0401J1925J3648J5827J8069K0262K3255
$$ 496164 500796 505868 511452 517548 524623 533305 543706 555631 569279 585106 603175 623437 646692
63545F46692K7737L3003L7653M1184M3828M4901M2261L3970K0483N097p785j5389
$$ 646692 674429 707432 745085 786269 830097 874998 917259 951229 971712 976809 969024 953635
63533I53635j7969j7695j6269j4009j0908p720n573n140o558r670j3970j8733
$$ 953635 935666 917971 901702 887693 876785 869065 863492 858352 851794 842124 828154 809421
63521H09421k3462k7871l1359l3203l3492l3118l2511l1096k8427k5050k1773
$$ 809421 785959 758088 726729 693526 660034 626916 594405 563309 534882 509832 488059
63510D88059j8772j6029j3925j2695j1862j0839r669q651p750o888o197n528m404
$$ 488059 469287 453258 439333 426638 414776 403937 394268 385617 377867 370979 364782 359254 354850
63497C54850l068k716l856n137m877l238j818j458j525j276q93r62j573k139j891
$$ 354850 351782 349066 345210 340073 335196 331958 330140 328682 327157 325881 324988 324026 322453 320314 318423
63482C18423n80J127K254K626K895L328L405K967K817L573M689N302N256M553
$$ 318423 317843 318970 321224 323850 326745 330073 333478 336445 339262 342835 347524 352826 358082 362635
63468C62635K799J83j873k281j883k237l384m094l906l524l425l362l193l019
$$ 362635 365434 365617 363744 361463 359580 357343 353959 349865 345959 342435 339010 335648 332455 329436
63454C29436k596j662p65o19q33l01J142K620L637M467N205N606N894O622P652
$$ 329436 326840 325178 324413 323794 322961 322660 323802 326422 330059 334526 339731 345337 351231 357853 365505
63439C65505Q406R164J0918J3824J7013K0068K3490K7544L1861L6358M0926M3784
$$ 365505 373911 383075 393993 407817 424830 444898 468388 495932 527793 564151 605077 648861
63427F48861M1709L3195K0575Q184r64o211q151p656n512k065K711Q429J4122
$$ 648861 690570 723765 744340 752524 751560 745349 737198 729542 724030 721965 724676 733105 747227
63414G47227J9184K3956K8702L2542L3990L2324K8002K2044J5442Q932L010j841
$$ 747227 766411 790367 819069 851611 885601 917925 945927 967971 983413 992345 995355 993514
63402I93514n010o271o349o360o672o984p609r758j4099j9794k5389l0118l3868
$$ 993514 988504 982233 975884 969524 962852 955868 948259 938501 924402 904608 879219 849101 815233
63389H15233l6476l7650l7210l5123l1705k7999k5237k3582k1984j9659j6979
$$ 815233 778757 741107 703897 668774 637069 609070 583833 560251 538267 518608 501629
63378E01629j4556j2204r564o977m947l175r99J520L733N398O783P972Q842R649
$$ 501629 487073 474869 465305 458328 453381 450206 449207 450727 454460 459858 466641 474613 483455 493104
63364D93104J0936J2742J4523J5991J7508J9477K1728K3771K5397K6783K8227
$$ 493104 504040 516782 531305 547296 564804 584281 606009 629780 655177 681960 710187
63353G10187K9919L1923L4030L5506L5163L2093K6619K0217J4190Q617L050k099
$$ 710187 740106 772029 806059 841565 876728 908821 935440 955657 969847 978464 981514 979415
63341I79415n617o987p031o828o728o899q010j0695j4661j9083k3552k7997l1916
$$ 979415 973798 966811 959780 952952 946224 939325 931315 920620 905959 886876 863324 835327 803411
63328H03411l4422l5133l4408l2658k9991k6602k2883j8926j4427r431m602l53
$$ 803411 768989 733856 699448 666790 636799 610197 587314 568388 553961 544530 539928 539575
63316E39575L679P364Q606M527n186j6804k5379k8746k8216k5948k2925j9498
$$ 539575 543254 550618 559224 563751 558565 541761 516382 487636 459420 433472 410547 391049
63304C91049j6364j4071j2259j0269q140o374n109m147l479l173l039k921l025
$$ 391049 374685 360614 348355 338086 329946 323572 318463 314316 310837 307664 304625 301704 298679
63291B98679l376l419k799k103k076k476k551k242j949j475l89P58Q56jn09j54
$$ 298679 295303 291884 289085 286982 284906 282430 279879 277637 275688 274213 273824 274582 275438 275437 274928 274774
63275B74774N9o56j594j611o10O78J572J538L03j435k166j313p9J85j67J03J024
$$ 274774 274833 274177 272583 270972 270362 271040 272612 274150 274453 273018 270852 269539 269460 269645 269478 269581 270605
63258B70605J376P09J04N84J610J853J004J26K42J132J814J819J482J148P65M58
$$ 270605 271981 272690 272794 273378 274988 276841 277845 277971 278213 279345 281159 282978 284460 285608 286373 286831
63242B86831P60J746K534K338J539J015Q48O48P28J702L152L946L988M310N247
$$ 286831 287591 289337 291871 294209 295748 296763 297611 298259 298987 300689 303841 307787 311775 316085 321332
63227C21332N841N500M874M532M029L153K844L770M981N147M439M007M150M205
$$ 321332 327173 332673 337547 342079 346108 349261 352105 355875 360856 366003 370442 374449 378599 382804
63213C82804L898L638L594L532L505L879M559M900M461L400K184J250P33K46p61
$$ 382804 386702 390340 393934 397466 400971 404850 409409 414309 418770 422170 424354 425604 426337 426583 425822
63198D25822k053k537j695n21k90p81n80J067L510N711P223Q237R233J0673J2549
$$ 425822 423769 421232 419537 419016 418726 417945 417365 418432 421942 427653 434876 443113 452346 463019 475568
63183D75568J4309J5548J6607J8036J9783K1296K2218K2461K1963K0926K0013
$$ 475568 489877 505425 522032 540068 559851 581147 603365 625826 647789 668715 688728
63172F88728J9694J9595J9012J7842J6486J5219J4187J3570J3006J1347P907L595
$$ 688728 708422 728017 747029 764871 781357 796576 810763 824333 837339 848686 856593 860188
63160H60188j76l363p103j1787j6602k0901k4757k7972k9757k9958k9569k9397
$$ 860188 860012 856649 849546 837759 821157 800256 775499 747527 717770 687812 658243 628846
63148F28846k9025k7675k5377k2653j9792j7011j4804j3398j2269j0802r085p489
$$ 628846 599821 572146 546769 524116 504324 487313 472509 459111 446842 436040 426955 419466
63136D19466n954m316k975k457k475k208j482r73j120j483j373n86O48K030L102
$$ 419466 413512 409196 406221 403764 401289 399081 397599 396626 395506 394023 392650 392064 392712 394742 397844
63121C97844L372K988K935L985N513O054N118L890L795M879O043O478O232N566
$$ 397844 401216 404204 407139 411124 416637 422691 427809 431699 435494 440373 446416 452894 459126 464692
63107D64692M539L360K482K070J832J609J637J944J986J396P19Q25J752K720L227
$$ 464692 469231 472591 475073 477143 478975 480584 482221 484165 486151 487547 488266 489091 490843 493563 496790
63092D96790L540M013M417M239L357K199J358J154J490J903J807Q09j028l116
$$ 496790 500330 504343 508760 512999 516356 518555 519913 521067 522557 524460 526267 527076 526048 522932
63078E22932m674n287n192m915m724m590m537m642m721m397l569k483j337k16
$$ 522932 518258 512971 507779 502864 498140 493550 489013 484371 479650 475253 471684 469201 467864 467648
63064D67648N32M13m25r90l64J356L273M532M836M500M313N001O493P975Q884
$$ 467648 468180 468593 468168 467178 466814 468170 471443 475975 480811 485311 489624 494625 501118 509093 517977
63049E17977R442J0096J0885J1682J2544J3407J3863J3722J3412J3396J3573J3676
$$ 517977 527419 537515 548400 560082 572626 586033 599896 613618 627030 640426 653999 667675
63037F67675J3838J4167J4198J3394J1973J0698J0033R926J0090J0020R122P434
$$ 667675 681513 695680 709878 723272 735245 745943 755976 765902 775992 786012 795134 802568
63025H02568N850M962M079K155o92l420n576p561r470j0719j1006j0723j0211
$$ 802568 808418 813380 817459 819614 818922 815502 809926 802365 792895 782176 771170 760447 750236
63012G50236r292p847o113m179j788J110M253P646J1563J5739J9299K1935K4459
$$ 750236 740944 733097 726984 722805 721017 722127 726380 734026 745589 761328 780627 802562 827021
62999H27021K7575L0746L2920L3997L4828L5957L7066L7642L7602L7180L6597
$$ 827021 854596 885342 918262 952259 987087 1023044 1060110 1097752 1135354 1172534 1209131
62988A209131L6018L5461L4630L3106L0889K8482K6198K3576J9860J4929R397
$$ 1209131 1245149 1280610 1315240 1348346 1379235 1407717 1433915 1457491 1477351 1492280 1501677
62977A501677L647k730j0247j8627k7030l4862m1796m7219n0496n1889n2445n2700
$$ 1501677 1505324 1502594 1492347 1473720 1446690 1411828 1370032 1322813 1272317 1220428 1167983 1115283
62965A115283n2156n0368m7766m4921m1708l7884l3893l0357k7166k3927k0975
$$ 1115283 1063127 1012759 964993 920072 878364 840480 806587 776230 749064 725137 704162
62954G04162j9112j8514j8614j8892j9075j8745j7588j6019j4850j4270j3798
$$ 704162 685050 666536 647922 629030 609955 591210 573622 557603 542753 528483 514685
62943E14685j3140j2455j1760j0782r483q180p152o599o795p616q120p463o124
$$ 514685 501545 489090 477330 466548 457065 448885 441733 435134 428339 420723 412603 405140 399016
62930C99016n329n305n135m433l940m089m123l292k050j263r75p04m48n31q21
$$ 399016 393687 388382 383247 378814 374874 370785 366662 363370 361320 360057 359082 358378 357930 357399 356578
62915C56578q90p42p08q11p37m27j43qJ45M30P40R12Q62O14L30K51M54P93J189
$$ 356578 355688 354946 354238 353427 352690 352263 352120 352112 352257 352687 353427 354339 355201 355815 356145 356396 356850 357643 358832
62896C58832J738K474L205L738M039M113L987L823L811L807L472K801K170J719
$$ 358832 360570 363044 366249 369987 374026 378139 382126 385949 389760 393567 397039 399840 402010 403729
62882D03729J150L51k80m70n97j162k012k597k798l010l456l833l772l345l001
$$ 403729 404879 405230 404950 404480 403883 402721 400709 398112 395314 392304 388848 385015 381243 377898 374897
62867C74897l053l347l466l297l229l559l891l506k454j735k098l025l292k419
$$ 374897 371844 368497 365031 361734 358505 354946 351055 347549 345095 343360 341262 338237 334945 332526
62853C32526j162n67q74j465j669j427j077p71l57J49M11K88J24K19L39J71m1
$$ 332526 331364 330797 329923 328458 326789 325362 324285 323514 323157 323306 323717 324005 324129 324348 324687 324858 324817
62836C24817O9J97k47j043j249n63K46N06M94O94Q99O68K18J52N45R03R42Q77
$$ 324817 324886 325083 324836 323793 322544 321981 322227 322733 323227 323921 324820 325488 325706 325858 326403 327306 328248 329125
62818C29125R81J195J282J059N88J97K46P29J207J282R34L76j44k76K96J367K189
$$ 329125 330106 331301 332583 333642 334230 334427 334673 335402 336609 337891 338825 339201 339057 338781 339077 340444 342633
62801C42633K276J987J999K447K978L403L737L751L064J817P78N03P47R45J049
$$ 342633 344909 346896 348895 351342 354320 357723 361460 365211 368275 370092 370870 371373 372120 373065 374114
62786C74114J495K483L648M572N379O559Q322J0291J1855J2648J2722J2517J2643
$$ 374114 375609 378092 381740 386312 391691 398250 406572 416863 428718 441366 454088 466605 479248
62773D79248J3388J4340J4727J4237J3266J2265J1218R998Q801P807O748N172
$$ 479248 492636 506976 521703 535940 549206 561471 572689 582687 591488 599295 606043 611215
62761F11215K992M19k328m870o653p655q768j0823j3379j5164j5542j4918j3865
$$ 611215 614207 614626 612298 607428 600775 593120 584352 573529 560150 544986 529444 514526 500661
62748E00661j2682j1766j1481j1505j1075j0066r066q286p256n938n120n196n348
$$ 500661 487979 476213 464732 453227 442152 432086 423020 414734 407478 401540 396420 391224 385876
62735C85876m624l283k301k050k079j894j325l86P16J580K000K127K018J481P27
$$ 385876 381252 377969 375668 373618 371539 369645 368320 367934 368650 370230 372230 374357 376375 377856 378583
62720C78583O23J674L152L953M004M169M957O105P354Q857J0712J2641J4374J5909
$$ 378583 379206 380880 384032 387985 391989 396158 401115 407220 414574 423431 434143 446784 461158 477067
62706D77067J7254J8378J9529K1175K3394K5713K7845L0223L3401L7183M0820
$$ 477067 494321 512699 532228 553403 576797 602510 630355 660578 693979 731162 771982
62695G71982M4056M7475N1576N5958N9769O2736O5086O6575O6337O3947N9926
$$ 771982 816038 863513 915089 971047 1030816 1093552 1158638 1225213 1291550 1355497 1415423
62684A415423N4712M7736L8295K6909J4919K900r517k2217l4021m3862n1791n8305
$$ 1415423 1470135 1517871 1556166 1583075 1597994 1600894 1591377 1569160 1535139 1491277 1439486 1381181
62672A381181o3371o6579o7844o7437o5664o2811n9142n4757m9805m4977m1179
$$ 1381181 1317810 1251231 1183387 1115950 1050286 987475 928333 873576 823771 778794 737615
62661G37615l8447l5770l2419k8900k6112k4056k1952j9329j6422j3716j1579
$$ 737615 699168 663398 630979 602079 575967 551911 529959 510630 494208 480492 468913
62650D68913j0183r425r017q831q894q915q344p160o112n742n670n254m515l857
$$ 468913 458730 449305 440288 431457 422563 413648 405304 398144 392032 386290 380620 375366 370851 366994
62636C66994l318k694k057j539r46j50L71O7q48j687k180k550k800k687k322k106
$$ 366994 363676 360982 358925 357386 356440 356290 356661 356728 355880 354193 352013 349463 346663 343976 341654 339548
62620C39548k086j927j524j139q13k56N56J148J047K83p34j508j655j176n52k92
$$ 339548 337462 335535 334011 332872 332059 331803 332359 333507 334554 334837 334103 332595 330940 329764 329212 328920
62604C28920l32j93K98P74Q68O50N13P95J556K507L219L562L832M311M877N286
$$ 328920 328588 328395 328693 329467 330335 330985 331498 332293 333849 336356 339575 343137 346969 351280 356157 361443
62588C61443N613O094O742P377P842P882P137N652M158L235K456R14j409l504
$$ 361443 367056 373150 379892 387269 395111 402993 410130 415782 419940 423175 425631 426545 425136 421632
62574D21632m557m787m925n390o159o913p186o772o146o035o376o183m873l228
$$ 421632 417075 412288 407363 401973 395814 388901 381715 374943 368797 362762 356386 350203 345330 342102
62560C42102k575l218m165m310l461k170r68k8O38R39P70K45k51l27K9M21M50
$$ 342102 339527 336309 332144 327834 324373 322203 321235 321207 321845 322784 323554 323799 323548 323221 323250 323671 324121
62543C24121J74R5N75J407K075K420K780L413L996L958L182K149J494J541K174
$$ 324121 324295 324390 324965 326372 328447 330867 333647 337060 341056 345014 348196 350345 351839 353380 355554
62528C55554K901L187K982K877L516M934O652Q223R361R922J0240J1184J3256
$$ 355554 358455 361642 364624 367501 371017 375951 382603 390826 400187 410109 420349 431533 444789
62515D44789J5764J7677J9086K1017K3800K6696K9264L1967L4944L7330L8503
$$ 444789 460553 478230 497316 518333 542133 568829 598093 630060 665004 702334 740837
62504G40837L9060L9577L9190L6583L1900K6531K1229J5474Q731J368n818j2140
$$ 740837 779897 819474 858664 895247 927147 953678 974907 990381 999112 1000480 994662 982522
62492I82522j6946j9763k0837k0986k0652j9559j7427j4502j1123p328l289L10
$$ 982522 965576 945813 924976 903990 883338 863779 846352 831850 820727 813399 810110 810420
62480H10420K834M565O416Q643J0205R732P031L290j93l151o104r472j3313j7601
$$ 810420 813254 817819 824235 832878 843083 852815 859846 863136 862943 859792 853688 844216 830903 813302
62466H13302k2088k6037k8661k9966l0602l0918l0681k9792k8607k7342k5752
$$ 813302 791214 765177 736516 706550 675948 645030 614349 584557 555950 528608 502856
62455E02856k3634k1108j8273j5161j2234j0159q876p588n958m553l728l021k175
$$ 502856 479222 458114 439841 424680 412446 402287 393411 385823 379865 375312 371584 368563 366388
62442C66388j776k124k269j172P50K138K352J769R15J35j50K39P91Q14K29o36
$$ 366388 364612 362488 360219 359047 359797 361935 364287 366056 366971 367106 366956 367195 367986 368800 369029 368393
62426C68393j617k589l170l200l093l154l083k773k874l679m203l413j865r40
$$ 368393 366776 364187 361017 357817 354724 351570 348487 345714 342840 339161 334958 331545 329680 328740
62412C28740r29j021q72q49q64l93L33L94l54r47o87Q5P58J107J049O67N77J415
$$ 328740 327811 326790 325918 325069 324205 323812 324145 324539 324185 323238 322551 322636 323394 324501 325550 326217 326794 328209
62394C28209K784L592L516L262L343L563L810M330M964N132M820M689M951N053
$$ 328209 330993 334585 338101 341363 344706 348269 352079 356409 361373 366505 371325 376014 380965 386018
62380C86018M785M736N220N720N862O122P014Q282R363R954R801Q732P366P011
$$ 386018 390803 395539 400759 406479 412341 418463 425477 433759 443122 453076 462877 471609 478975 485986
62366D85986Q230J0148J1726J3061J4807J7000J9206K1421K4077K7474L1622L6406
$$ 485986 494216 504364 516090 529151 543958 560958 580164 601585 625662 653136 684758 721164
62354G21164M1425M5990M9664N2563N4748N5620N4355N0697M5063L8069L0281
$$ 721164 762589 808579 858243 910806 965554 1021174 1075529 1126226 1171289 1209358 1239639
62343A239639K2194J4213O664r5n906j1162j6609k2649k9001l4955l9679m2500
$$ 1239639 1261833 1276046 1282710 1282615 1276709 1265547 1248938 1226289 1197288 1162333 1122654 1080154
62331A080154m3390m3132m2453m1165l8779l5740l3102l0984k8397k4959k1794
$$ 1080154 1036764 993632 951179 910014 871235 835495 802393 771409 743012 718053 696259
62320F96259k0164j9980k0232k0268j9980j9252j7997j6518j5252j4235j3203
$$ 696259 676095 656115 635883 615615 595635 576383 558386 541868 526616 512381 499178
62309D99178j2080j1050j0177r269q005o238m229k600j818j748j872j776j210
$$ 499178 487098 476048 465871 456602 448597 442359 438130 435530 433712 431964 430092 428316 427106
62296D27106m6J406K317K238J788J819K184K096J536J309J812K588L208L616L639
$$ 427106 427060 428466 430783 433021 434809 436628 438812 440908 442444 443753 445565 448153 451361 454977 458616
62281D58616L032K173J747J666J224M68K91R30J548J614J672K235K976L538M241
$$ 458616 461648 463821 465568 467234 468458 468926 469217 470147 471695 473309 474981 477216 480192 483730 487971
62266D87971N373O679Q068R968J2393J4633J6424J8645K2118K6505L1021L5478
$$ 487971 493344 500023 508091 518059 530452 545085 561509 580154 602272 628777 659798 695276
62254F95276M0008M4458M8651N2507N5467N6595N5711N3478M9841M3635L4609
$$ 695276 735284 779742 828393 880900 936367 992962 1048673 1102151 1151992 1195627 1230236
62243A230236K4623J5727P972L38p232j4160k0890k8536l6944m4479m9809n2898
$$ 1230236 1254859 1270586 1278558 1278896 1271664 1257504 1236614 1208078 1171134 1126655 1076846 1023948
62231A023948n4332n4528n3698n1797m8508m3842l8589l3633k9104k4773k0841
$$ 1023948 969616 915088 861390 809593 761085 717243 678654 645021 615917 591144 570303
62220E70303j7697j5294j3436j2236j1581j0683r033p380o849p337p684p177o085
$$ 570303 552606 537312 523876 511640 500059 489376 480343 472963 466114 458777 451093 443916 437831
62207D37831m960m148l819l711l141j925q77o52o45O8J200J776J802K130K955
$$ 437831 432871 428723 424904 421193 418052 416127 415250 414598 413953 414021 415221 416997 418799 420929 423884
62192D23884L682M262N306O755P728Q004Q502R754J0903J0849R717Q685Q690R691
$$ 423884 427566 431828 437134 443889 451617 459621 468123 477877 488780 499629 509346 518031 526721 536412
62178E36412J0806J0993R877Q043O294M840L667L325M502O915R537J1949J4672
$$ 536412 547218 558211 568088 576131 582425 587265 590932 594257 598759 605674 615211 627160 641832
62165F41832J8045K1703K5419K9608L4399L8795M1323M1321L9315L6301L2817
$$ 641832 659877 681580 706999 736607 771006 809801 851124 892445 931760 968061 1000878
62154A000878K8530K2795J5762Q755L121j157n219r965j5480k1520k7721l3276
$$ 1000878 1029408 1052203 1067965 1076720 1079841 1078684 1073465 1063500 1048020 1026500 998779 965503
62142I65503l7251l9498m0629m0957m0077l7671l4099k9973k5725k1841j8814
$$ 965503 928252 888754 848125 807168 767091 729420 695321 665348 639623 617782 598968
62131E98968j6543j4313j1745r326p637o533n566m726m270m018l431k317j055
$$ 598968 582425 568112 556367 547041 539404 532871 527305 522579 518309 514291 510860 508543 507488
62118E07488nR38K132L726N583P548R630J1817J3844J5355J6345J7194J8044J8286
$$ 507488 507483 508421 510553 514279 519862 527410 537040 548857 562701 578056 594401 611595 629639 647925
62104F47925J6866J3244Q049K909n08j520o05J418M079O832Q327P071L033j992
$$ 647925 664791 678035 686084 688993 688485 686965 686360 687778 691857 698689 707016 714087 717120 715128
62090G15128n835p340o288k971J695O298R990J3050J6055J8981K1493K3531K5023
$$ 715128 709293 701953 695665 692694 694389 700687 710677 723727 739782 758763 780256 803787 828810
62077H28810K5718K5867K6429K7813K9023K8897K7666K6380K5288K3830K1902
$$ 828810 854528 880395 906824 934637 963660 992557 1020223 1046603 1071891 1095721 1117623
62066A117623K0051J8580J7388J6591J6461J6820J7335J8164J9470K0489K0103
$$ 1117623 1137674 1156254 1173642 1190233 1206694 1223514 1240849 1259013 1278483 1298972 1319075
62055A319075J8207J5564J2471Q693M693J618l13k293n374r408j3925j9107k5143
$$ 1319075 1337282 1352846 1365317 1374010 1378703 1380321 1380008 1377715 1372341 1362933 1349008 1329901 1304758
62042A304758l1313l6498m0245m2815m4413m4958m4445m3220m1750m0208l8256
$$ 1304758 1273445 1236947 1196702 1153887 1109474 1064516 1020071 976851 935101 894893 856637
62031H56637l5478l2106k8980k6476k3941k0684j7118j4201j2118j0307q596p388
$$ 856637 821159 789053 760073 733597 709656 688972 671854 657653 645535 635228 626632 619244
62019F19244o856o813p363q702j0255j0906j0347r329q470p563o346n090m109
$$ 619244 612388 605575 598212 589510 579255 568349 558002 548673 540203 532640 526294 521204 517095
62006E17095l377k933k893k780j582J005L979O052O834O715O118N297M470L689
$$ 517095 513718 510785 507892 505112 503530 504535 508514 514566 521400 528115 534233 539530 544000 547689
61992E47689K795J692N19n09j208j468j599k412m336o558p668p267o253n551n259
$$ 547689 550484 552176 552695 552186 550978 549510 547911 545499 541163 534605 526937 519670 513417 507866 502607
61977E02607n219n546o200o590o079m657k886j474q98j111j542j751j970k579
$$ 502607 497388 491842 485642 479052 472973 468316 465430 463956 463058 461947 460405 458654 456684 454105
61963D54105l266l315k594j638q41j97K01J47k07m97p18r40p26M06J974K980L238
$$ 454105 450839 447524 444930 443292 442451 442254 442455 442602 442395 441898 441180 440240 439514 439920 441894 444874 448112
61946D48112L417L870M453N440P338R670J1228J1880J2809J4584J6192J6729J6842
$$ 448112 451529 455399 459852 465292 472630 482300 493528 505408 518217 532801 548993 565722 582564
61933E82564J7523J8514J8862J8413J7746J7042J5902J4090J1841R512P362N440
$$ 582564 600087 618601 637463 655876 673622 690664 706566 720656 732497 742009 749371 754811
61921G54811L458J012j962n125q087j0355j1240j0577r380q787q349o513k877
$$ 754811 758269 759281 757319 752194 744107 733752 722512 711935 702555 693768 685419 678906 676029
61908F76029J202M569P557J0790J3891J6103J7176J7018J5390J2631R705O875
$$ 676029 677231 681800 689357 700147 714038 730141 747317 764335 779725 792356 802061 808936
61896H08936L353j047n073p765r878j2411j4783j5777j5574j5368j5489j5285
$$ 808936 812289 811242 806169 798404 788526 776115 761332 745555 729981 714613 699124 683839
61884F83839j4535j3612j2458j0696q769p762p976q582q859q889q892q708q200
$$ 683839 669304 655692 643234 632538 623769 616007 608031 599449 590590 581701 572809 564101 555901
61871E55901p539o854o045n137m409m038l845l501k782j670l17J145K780M639
$$ 555901 548362 541508 535463 530326 525917 521879 518034 514533 511751 510081 509764 510909 513689 518328
61857E18328O484Q075R740J1956J4393J6188J7419J9311K2484K5897K8224K9430
$$ 518328 524812 532887 542627 554583 568976 585164 602583 621894 644378 670275 698499 727929
61845G27929L0250L0818L0792L0196K9184K7397K4415K0513J6057J0701M132k716
$$ 727929 758179 788997 819789 849985 879169 906566 930981 951494 967551 978252 982384 979668
61833I79668q271j1943j4275j5620j5695j4389j2068q941m907r4M991R875J4071
$$ 979668 971397 959454 945179 929559 913864 899475 887407 878466 873559 873465 878456 888331 902402
61820I02402J6829J7665J7077J5875J3846R885L663l737j1014j7777k4029k9257
$$ 902402 919231 936896 953973 969848 983694 993579 997242 993505 982491 964714 940685 911428
61808I11428l2663l4056l3983l3071l1493k9161k6176k2985k0045j7455j5011
$$ 911428 878765 844709 810726 777655 746162 717001 690825 667840 647795 630340 615329
61797F15329j2556j0103p707n561m068l403l035k262j307j147k045k971k913k107
$$ 615329 602773 592670 584963 579402 575334 571931 568896 566634 565327 564180 562135 559164 556251 554144
61783E54144j419j141j009r79j267j847k450k933l269l424l499l627l583k937
$$ 554144 552725 551584 550575 549596 548329 546482 544032 541099 537830 534406 530907 527280 523697 520760
61769E20760j934j454j773j975j190K08J256J698J970K342K768L179L346K895
$$ 520760 518826 517372 515599 513624 512434 512642 513898 515596 517566 519908 522676 525855 529201 532096
61755E32096K005J621K361L659M590M961M993M523L386K136J538J635J942K201
$$ 532096 534101 535722 538083 541742 546332 551293 556286 560809 564195 566331 567869 569504 571446 573647
61741E73647K316K033J382R06Q97Q77N05K29L77L51l55j124j218r70q94m81P62
$$ 573647 575963 577996 579378 580284 581181 582058 582563 582792 583169 583520 583165 582041 580823 579853 578959 578478 579240
61724E79240J837J488L00r2M39O62M41J043K722L913L513K395J843J807J543R63
$$ 579240 581077 582565 582865 582773 583212 583874 584315 585358 588080 591993 595506 597901 599744 601551 603094 604057
61708F04057M61L3o46j694k950m040m421l928l242l084l104k479j484j264j962
$$ 604057 604518 604551 603905 602211 599261 595221 590800 586872 583630 580546 577442 574963 573479 572215 570253
61693E70253k419k064j800k362l031k796j876j204j073j108j111j127j089r50
$$ 570253 567834 565770 563970 561608 558577 555781 553905 552701 551628 550520 549409 548282 547193 546243
61679E46243q62q18n01J51N93L65k33n01j47N07Q78N96n1j90O46J662J661P03
$$ 546243 545381 544563 544062 544213 544806 545171 544938 544437 544290 544797 545675 546271 546220 546030 546676 548338 549999 550702
61661E50702J27P57J967K812L256L701M056L978L563L247L264L614M255M989N467
$$ 550702 550829 551586 553553 556365 559621 563322 567378 571356 574919 578166 581430 585044 589299 594288 599755
61646E99755N608N660N669N331M567L851L594L575L242K337R94m62j605k118k156
$$ 599755 605363 611023 616692 622023 626590 630441 634035 637610 640852 643189 644183 643721 642116 639998 637842
61631F37842k301l005m202n402o008n739n004m588m649m374l187j893j779k886
$$ 637842 635541 632536 628334 622932 616924 611185 606181 601593 596944 592570 589383 587490 585711 582825
61617E82825m035m396m086l321k184j311j557k671l338l033k770l470m638n326
$$ 582825 578790 574394 570308 566987 564803 563492 561935 559264 555926 552893 550123 546653 542015 536689
61603E36689n501n617n551m961m147l707l560l145k429k007k236k810l206l177
$$ 536689 531188 525571 520020 515059 510912 507205 503645 500500 498071 496064 493828 491018 487812 484635
61589D84635k795k326k095k256k657k959k899k540k326k637l095k773j495m67
$$ 484635 481840 479514 477419 475163 472506 469547 466648 464108 461782 459145 456050 453277 451782 451315
61575D51315q71k230l048k866k558k655k594j969j359j338j564j496j293j362
$$ 451315 450444 448214 445166 442300 439742 437087 434493 432524 431165 429827 428263 426767 425474 424112
61561D24112j585j618j448j183p42k55k13p63j307j294r95j032j468j835j761
$$ 424112 422527 420909 419461 418278 417536 417281 417068 416305 414998 413704 412709 411677 410209 408374 406613
61546D06613j241n69j96m04r11j178j122j025q01l4J097J796J797J733J999K100
$$ 406613 405372 404803 404607 404203 403292 402114 400992 399967 399166 399132 400229 402025 403822 405555 407554 409654
61530D09654J575Q52N38N84O86R08J242J116J56j080j752j833j848j966j942j767
$$ 409654 411229 412081 412619 413203 413889 414797 416039 417155 417311 416231 414479 412646 410798 408832 406890 405123
61514D05123j687j731j670j379q91l03J06l6o50j077q56k81P0N2j10k97n12p66
$$ 405123 403436 401705 400035 398656 397765 397462 397568 397532 396882 395805 394949 394668 394738 394790 394680 394383 393871 393105
61496C93105j149j719k134j811p25L89Q61P29M04J53J20K78J63o93j875k270j469
$$ 393105 391956 390237 388103 386292 385567 385956 386817 387546 387950 388103 388223 388501 388664 387971 386096 383826 382357
61479C82357l16K72K83J10j28k17L42J445K028J376J65n35p55j192j804j868j239
$$ 382357 382041 382313 382596 382706 382578 382361 382703 384148 386176 387552 387717 387182 386427 385235 383431 381563 380324
61462C80324n78k97o9M23Q55O72j13p53m63O72J596J447O34K69N98Q01M25R2L43
$$ 380324 379746 379449 379380 379803 380658 381330 381217 380464 380001 380673 382269 383716 384350 384619 385217 386018 386443 386535 386878
61443C86878O77L57m10q25n51J06P38J056R86Q80J269K082K579K332J736J330
$$ 386878 387555 387912 387502 386677 386126 386232 386970 388026 389012 389892 391161 393243 395822 398154 399890 401220
61427D01220J296J764K742L459K827J059k54k23K79M00Q36K392M180M658L819
$$ 401220 402516 404280 407022 410481 413308 414367 414113 413890 414169 414569 415405 417797 421977 426635 430454
61412D30454K808J977P88o90j710k183k725l331l251k378j621j605j906j887j524
$$ 430454 433262 435239 436027 435337 433627 431444 428719 425388 422137 419759 418138 416533 414627 412740 411216
61397D11216j128r11j037j521j921j656p45J79O23O14L88J39J8Lj39m12m41o6
$$ 411216 410088 409177 408140 406619 404698 403042 402297 402476 403099 403713 404101 404240 404258 404261 404122 403710 403269 403203
61379D03203J97j57q19j084p70j82N20J286J802J831J677J753J864J554R29N19
$$ 403203 403400 403243 402424 401340 400570 400388 400908 402194 403996 405827 407504 409257 411121 412675 413604 414123
61363D14123N42Q10J216J695J993J926J660J305O26l03o85J07J655L118M327N510
$$ 414123 414665 415475 416691 418386 420379 422305 423965 425270 425896 425593 424908 425015 426670 429788 434115 439625
61347D39625O460O825O905P245P783Q263R097J0737J2425J2702J1225R098P330
$$ 439625 446085 452910 459815 467060 474843 483106 492203 502940 515365 528067 539292 548390 555720
61334E55720N805L995J840l62k342l868m816n345n746o045o022n566m790l993
$$ 555720 561525 565520 567360 566998 564656 560788 555972 550627 544881 538836 532814 527248 522458 518465
61320E18465l534l412k991j749m24l92j607k260j168N81J371J280J435K066K670
$$ 518465 514931 511519 508528 506779 506355 505963 504356 502096 500928 501509 502880 504160 505595 507661 510331
61305E10331L336M425N414N570N465O304P993R249R463R188Q865Q470Q187Q122
$$ 510331 513667 518092 523506 529076 534541 540845 548838 558087 567550 576738 585603 594073 602260 610382
61291F10382P377M878J101k307m630o441p957q637q517q365q166o977m802l134
$$ 610382 617759 622637 623738 621431 616801 610360 602403 593766 585249 576884 568718 561741 556939 553805
61277E53805k942l393l280k618k082j741j117M2J591L140M169M553M910N783O680
$$ 553805 550863 547470 544190 541572 539490 537749 536632 536674 538265 541405 545574 550127 555037 560820 567500
61262E67500O821O578O941P744P888P394P634R110J0590J1083J1195J1714J2217
$$ 567500 574321 580899 587840 595584 603472 610866 618500 627610 638200 649283 660478 672192 684409
61249F84409J1993J1283J0506R128O390K534j541n318q605j1013j2211j2398j1936
$$ 684409 696402 707685 718191 727319 733709 736243 734702 729384 720779 709766 697555 685157 673221
61236F73221j0897r363p752o432n371m487l895l540l014k035p53N39J620K284
$$ 673221 662324 652961 645209 638777 633406 628919 625024 621484 618470 616435 615682 616221 617841 620125
61222F20125K576K984L923N090N932O472P013P362P158O601N919M630K524Q29
$$ 620125 622701 625685 629608 634698 640630 647102 654115 661477 668635 675236 681155 685785 688309 689138
61208F89138Q69J919K140J441J429K496L195K947L122M464N565N182M377M835
$$ 689138 690007 691926 694066 695507 696936 699432 702627 705574 708696 713160 718725 723907 728284 733119
61194G33119O493Q286J0118J2496J5107J7130J8487J9626K0628K1438K2330K3245
$$ 733119 739612 747898 758016 770512 785619 802749 821236 840862 861490 882928 905258 928503
61182I28503K3323K1876J9253J6053J2352Q391N203L498K628J522L1j438k920
$$ 928503 951826 973702 992955 1009008 1021360 1029751 1034954 1038452 1041080 1042602 1042633 1041195 1038275
61169A038275m685o586q376j0245j2382j4500j6319j7905j9219k0023k0511k1160
$$ 1038275 1033590 1027004 1018628 1008383 996001 981501 965182 947277 928058 908035 887524 866364
61157H66364k1707k1297k0010j8957j8511j7674j5821j3648j1770r787p497n558
$$ 866364 844657 823360 803350 784393 765882 748208 732387 718739 706969 697182 689685 684127
61145F84127m162k525o03M46N29J526M441P352P949O602N098L677J499j035k640
$$ 684127 679965 677440 676837 677283 677812 679338 683779 691131 699080 705682 710780 714457 715956 714921 712281
61130G12281l155l199k442k03K711M733N875P594J0487J3730J6639J9270K1546
$$ 712281 709126 705927 703485 703282 705993 710726 716601 724195 734682 748412 765051 784321 805867
61117H05867K3208K4525K5917K7153K7897K8605K9739L0743L1003L1043L1407
$$ 805867 829075 853600 879517 906670 934567 963172 992911 1023654 1054657 1085700 1117107
61106A117107L1156K9120K5961K3237K0936J7830J3864J0357P889N668K980j46
$$ 1117107 1148263 1177383 1203344 1226581 1247517 1265347 1279211 1289568 1297457 1303125 1306105 1305959
61094A305959l613p211j0241j2536j5456k0290k6038l0372l2507l3512l4166l4285
$$ 1305959 1302346 1295135 1284894 1272358 1256902 1236612 1210574 1180202 1147695 1114183 1080017 1045732
61082A045732l3961l3618l2798l0645k7623k5239k3928k2663k0591j7835j4721
$$ 1045732 1011771 978153 945355 914710 887087 861848 837920 815257 794666 776831 762110
61071G62110j1591r157p790o771n410m295l992l491j679M81J296J099J510K623
$$ 762110 750519 741362 733572 726801 721391 717096 713104 709613 707934 708415 709711 710810 712320 714943
61057G14943L346L898N418P470Q544Q816R763J1315J2057J2215J3504J5939J7775
$$ 714943 718289 722187 727605 735075 743619 752435 762198 773513 785570 797785 811289 827228 845003
61044H45003J8757K0534K3469K6065K7895L0108L2574L3692L3602L4269L5750
$$ 845003 863760 884294 907763 933828 961723 991831 1024405 1058097 1091699 1125968 1161718
61033A161718L5797L4028L2920L3508L3815L2854L2508L3692L4376L3540L3512
$$ 1161718 1197515 1231543 1264463 1297971 1331786 1364640 1397148 1430840 1465216 1498756 1532268
61022A532268L6083L9561M2089M4641M8254N1416N2818N3617N4746N5283N5940
$$ 1532268 1568351 1607912 1650001 1694642 1742896 1794312 1847130 1900747 1955493 2010776 2066716
61011B066716O0362P0029Q1767R3524J08292J28389J50219J69689J89093K13771
$$ 2066716 2127078 2197107 2278874 2372398 2480690 2609079 2759298 2928987 3118080 3331851
61001C331851K45920K86991L41738M13541N00351O02646P30884Q97033J104792
$$ 3331851 3577771 3864762 4206500 4620041 5120392 5723038 6453922 7350955 8455747
60992H455747J357787J666604K027010K397235K725842L002127L232438L336418
$$ 8455747 9813534 11480138 13507148 15904383 18630225 21632352 24864790 28201208
60984B8201208L114197K403890J303202J86288n53211p77833o19818k72849J47439
$$ 28201208 31315405 33719295 35022497 35208785 34655574 33877741 33257923 32985074 33132513
60975C3132513N27666O45717K58852o61938j833271k837578l401150l507528l298378
$$ 33132513 33660179 34305896 34564748 33902810 32069539 29231961 25830811 22323283 19024905
60966A9024905k926312k496077k076144j707785j400966j145271r31633p57892
$$ 19024905 16098593 13602516 11526372 9818587 8417621 7272350 6340717 5582825
60958E582825o19208n06073m12720l39140k84149k42887k11451j88179j70040
$$ 5582825 4963617 4457544 4044824 3705684 3421535 3178648 2967197 2779018 2608978
60949B608978j52921j36060j21682j09876r8042q5674p5230o7611o0886n4596
$$ 2608978 2456057 2319997 2198315 2088439 1990397 1904723 1829493 1761882 1700996 1646400
60939A646400n1297n2408n5751n8644o0543o1294n9709n5627n1065m7652m4719
$$ 1646400 1595103 1542695 1486944 1428300 1367757 1306463 1246754 1191127 1140062 1092410 1047691
60928A047691m1237l7743l5007l2545k9809k7342k5549k3651k1114j8737j7224
$$ 1047691 1006454 968711 933704 901159 871350 844008 818459 794808 773694 754957 737733
60917G37733j5939j4197j2649j2132j2200j1888j1135j0390r552q308o898n694
$$ 737733 721794 707597 694948 682816 670616 658728 647593 637203 627651 619343 612445 606751
60905F06751m535l198k084j758k259l228m225m703m304l501l179l396l430l209
$$ 606751 602216 599018 596934 595176 592917 589689 585464 580761 576457 572956 569777 566381 562951 559742
60891E59742l604m844n755n272l794k418j584j160j095j283j410j449j728k155
$$ 559742 556138 551294 545539 540267 536473 534055 532471 531311 530216 528933 527523 526074 524346 522191
60877E22191k095j386o82l42K8N70P40M66N62J240J361K45r40q27Jl6j075j843
$$ 522191 520096 518710 518028 517686 517714 518284 519024 519490 520052 521292 522653 522898 521958 521131 521132 521096 520021 518178
60859E18178j802j716k097k422k204j710j268p24LM64K26n78j473k146k563k718
$$ 518178 516376 514660 512563 510141 507937 506227 504959 504235 504238 504702 504928 504350 502877 500731 498168 495450
60843D95450k458j504R3J586J994J150j38j195k169l238l810l258j972r37m74
$$ 495450 492992 491488 491581 493167 495161 496311 496173 494978 492809 489571 485761 482503 480531 479594 479120
60828D79120r8N41J325K198L322M611N594N890N587N135M987N157N047M085K598
$$ 479120 479022 479563 480888 483086 486408 491019 496613 502503 508090 513225 518212 523369 528416 532501 535099
60813E35099J586J338J104M54J60Q84J811J664N89j59k10n25j783l389m425m678
$$ 535099 536685 538023 539127 539581 539741 540625 542436 544100 544689 544530 544320 543795 542012 538623 534198 529520
60797E29520m507m345m654n709p120p999p878p109o263n561n068m932n195n556
$$ 529520 525013 520668 516014 510305 503185 495186 487308 480199 473936 468375 463307 458375 453180 447624
60783D47624n540m847l649k706k825l849m563m055k843k085k072k235k227k076
$$ 447624 442084 437237 433588 430882 428057 424208 419645 415590 412747 410662 408590 406355 404128 402052
60769D02052j486j37J392K061J955K275L433M328M099L522L734M415M401L704
$$ 402052 400566 400429 401821 403882 405837 408112 411545 415873 419972 423494 427228 431643 436044 439748
60755D39748L679N111P075Q061P695O945O880P634Q457Q574P823O686N832N573
$$ 439748 443427 448538 455613 463674 471369 478314 485194 492828 501285 509859 517682 524368 530200 535773
60741E35773N604N170L820K006O74J29k81j192k345l069l231l223l301l512l972
$$ 535773 541377 546547 550367 552373 553047 553176 552895 551703 549358 546289 543058 539835 536534 533022 529050
60726E29050m649n083m933m604m746n301n726n964o415p029p239o836o167n437
$$ 529050 524401 519318 514385 509781 505035 499734 494008 488044 481629 474600 467361 460525 454358 448921
60712D48921m568l793l637m045m321m063l561l107k595j973j415q35M2R84J390
$$ 448921 444353 440560 436923 432878 428557 424494 420933 417826 415231 413258 411843 411008 411050 412034 413424
60697D13424J241J202J551J900K152K793L829M492M547M929O321P909Q389P632
$$ 413424 414665 415867 417418 419318 421470 424263 428092 432584 437131 442060 448381 456290 464679 472311
60683D72311O551N767N205M609L793K623J341N65M46K31q21k418l692m336m693
$$ 472311 478862 484629 489834 494443 498236 500859 502200 502765 503211 503442 502621 500203 496511 492175 487482
60668D87482n047n378n578n412m603l348k398k176k209j955j683j863k208k039
$$ 487482 482435 477057 471479 466067 461464 458116 455718 453542 451333 449378 447695 445832 443624 441585
60654D41585j402r52r26q97m85K99J379K631L667M088L953L550K910K010J256
$$ 441585 440183 439231 438305 437408 436923 437222 438601 441232 444899 448987 452940 456490 459400 461410 462666
60639D62666J104J269J012J96m75m19J49O83J030J429K114L142M450N864P082
$$ 462666 463770 465039 466051 466247 465772 465353 465502 466185 467215 468644 470758 473900 478350 484214 491296
60624D91296P755P746P317P011P174P615P933Q072Q294Q718R182R516R643R533
$$ 491296 499051 506797 514114 521125 528299 535914 543847 551919 560213 568931 578113 587629 597272 606805
60610F06805R473J0094J1471J2512J2104J0833J0413J1302J2083J1551J0167Q883
$$ 606805 616278 626372 637843 650355 662459 673292 683705 695007 707090 718641 728808 737691
60598G37691P708O370N293M902M741M382M517O002Q322J0128J0905J1143J1218
$$ 737691 745399 751769 757062 761964 766705 771087 775604 781606 789928 800056 810961 822104 833322
60585H33322J1180J1234J1420J1079R612P559N942M738L071O59j901m162o097
$$ 833322 844502 855736 867156 878235 887847 895406 901348 906086 909157 909816 907915 903753 897656
60572H97656p440p819p608p654q088q170p357n750l564r73J604L909O367R332
$$ 897656 890216 882397 874789 867135 859047 850877 843520 837770 834206 833233 834837 838746 845113 854445
60558H54445J2009J3077J2242J0068O487Q99o089j2441j6692j9162k0653k1045
$$ 854445 866454 879531 891773 901841 908328 909227 903138 890697 874005 854843 834190 813145
60546H13145j9823j7122j3527r442n184j151K577O374J0367J4151J7464K0577
$$ 813145 793322 776200 762673 753231 748047 746896 749473 755847 766214 780365 797829 818406
60534H18406K3638K6063K6906K5480K1485J5128P356n06p629j3847j8842k1778
$$ 818406 842044 868107 895013 920493 941978 957106 964462 963956 956327 942480 923638 901860
60522I01860k1977j9629j5683j1438q083o092m920l826k813k242j840r35M40J647
$$ 901860 879883 860254 844571 833133 825050 818958 814038 810212 807399 805157 803317 802382 802822 804469
60508H04469K649M037N825P268Q097Q859R765J0414J1008J2716J6189K0806K5962
$$ 804469 807118 811155 816980 824248 832345 841204 850969 861383 872391 885107 901296 922102 948064
60495I48064L2122L9802M8515N7487O6563P5419Q2768Q7355Q9159Q8547Q4776
$$ 948064 980186 1019988 1068503 1125990 1192553 1267972 1350740 1438095 1527254 1615801 1700577
60484A700577P6458O3189M5654K4453J6k6222n1547p3229q9613j00027j04466
$$ 1700577 1777035 1840224 1885878 1910331 1910347 1884125 1832578 1759349 1669736 1569709 1465243
60473A465243j03634r8784r1193q1876p1810o2041n3355m5931l9470l3630k8413
$$ 1465243 1361609 1262825 1171632 1089756 1017946 955905 902550 856619 817149 783519 755106
60462G55106k4172k1149j9130j7656j6462j5371j4042j2288j0516r272q315o886
$$ 755106 730934 709785 690655 672999 656537 641166 627124 614836 604320 595048 586733 579847
60450E79847m984l614l441l885l959l461k940k894l369l945l914k896j505q02
$$ 579847 574863 571249 567808 563923 559964 556503 553563 550669 547300 543355 539441 536545 535040 534238
60436E34238r84j217j005q26j048j103m26M95Q90R06J224J764J656M18j456l033
$$ 534238 533254 532037 531032 530206 529158 528055 527629 528124 529014 529920 531144 532908 534564 534982 533526 530493
60420E30493l632l069j733l71M33N72K70m1K16J213K132J877O26j65L54J375J802
$$ 530493 526861 523792 522059 521688 522121 522693 522963 522922 523138 524351 526483 528360 528986 528821 529175 530550 532352
60403E32352J736J789J778J136J13n03o13q26j337j686j546j141q72r77j429j766
$$ 532352 534088 535877 537655 538791 538904 538401 537788 536962 535625 533939 532393 531252 530380 529403 527974 526208
60387E26208j345k42N75M38j49l89l24k90J22J400K865L289K628K017J995J936
$$ 526208 524863 524621 525196 525634 525485 525096 524772 524482 524604 526004 528869 532158 534786 536803 538798 540734
60371E40734J316M80k24r85j771j959j294n20l91o28n15m3J98P1J38P94J557J456
$$ 540734 542050 542530 542306 541321 539550 537591 536297 535777 535386 534758 534243 534200 534398 534469 534607 535401 536958 538414
60353E38414J36j504j961o68J229K045J415N59O33J411J902J737J397J318J379
$$ 538414 538550 537046 535085 534417 535646 537691 539106 539665 540298 541709 543611 545348 546745 548063 549442
60338E49442J331J225J248J359J389J330J265J112P16K29J4P7p7o77j181r75l97
$$ 549442 550773 551998 553246 554605 555994 557324 558589 559701 560417 560646 560660 560737 560660 559983 558802 557827 557430
60321E57430m21j302k167k147j406o89k61K85J312K640L745M337M700N422O680
$$ 557430 557009 555707 553540 551393 549987 549298 549037 549322 550634 553274 557019 561356 566056 571478 578158
60306E78158P907Q515Q734R430J1095J3526J6445J9905K3863K7670L0143K9950
$$ 578158 586065 594580 603314 612744 623839 637365 653810 673715 697578 725248 755391 785341
60294G85341K6201J9260J0774K303n957j4367k2023k6903k8055k6601k4106k1019
$$ 785341 811542 830802 841576 843879 837922 823555 801532 774629 746574 719973 695867 674848
60282F74848j7255j3390j0332q364p147o270n336m071k804k259k451k481j844
$$ 674848 657593 644203 633871 625507 618360 612090 606754 602683 599879 597620 595169 592688 590844
60269E90844j185j192j594j907k345l123l628l267k540k290k409k252j838j654
$$ 590844 589659 588467 586873 584966 582621 579498 575870 572603 570063 567773 565364 563112 561274 559620
60255E59620j586j087j82N67R02R37O52O1m10m34l22m07l40K24Q58J035J027J149
$$ 559620 558034 556947 556765 557332 558234 559171 559823 559884 559474 559040 558718 558311 557971 558195 559053 560088 561115 562264
60237E62264Q35l78j556j466m91kj44J44J074J712J894K695M421N778N771N161
$$ 562264 563099 562721 561165 559699 559208 559206 559062 559206 560280 561992 563886 566581 571002 576780 582551 587712
60221E87712N058N174M475K871J272M17L78R07J630K105K149K061K301L094M299
$$ 587712 592770 597944 602419 605290 606562 606979 607357 608264 609894 611999 614148 616209 618510 621604 625903
60206F25903N358N494M505L268K877L280L423K715J646Q47L21j82p20j288j794
$$ 625903 631261 636755 641260 644528 647405 650685 654108 656823 658469 659316 659637 659455 658735 657447 655653
60191F55653j791r12K61N63k84j410k201l119m529n646n479m328l459l437l510
$$ 655653 653862 652950 653211 653774 653490 652080 649879 646760 642231 636585 631106 626778 623319 619882 616372
60176F16372k744j275j66j38o78o69J30O85J52p95q08K31J050Q15J24m1L46O23
$$ 616372 613628 612353 612187 612049 611371 610702 610832 611517 611669 610874 610066 610297 611347 612162 612286 612245 612591 613214
60158F13214M88K93M74J015J428J158J89q11j160q24k28L94R84J384J597K068
$$ 613214 613702 613995 614469 615484 616912 618070 618259 617448 616288 615464 615236 615630 616614 617998 619595 621663
60142F21663L089M168M702N005N785O918P705Q170Q934R863J0081R499Q974Q651
$$ 621663 624752 628920 633622 638627 644412 651330 659035 667205 676139 686002 696083 705582 714556 723207
60128G23207P442M840J916l07k341n018p720r000q468o955n211l487k109j402
$$ 723207 730649 735489 737405 737098 734757 729739 722019 713019 704551 697596 692385 688898 686789 685387
60114F85387j070m98L02P22N68L00K64K67J67K62Q55J803K721L339L469K931J832
$$ 685387 684317 683819 684121 684843 685411 685711 685975 686242 686409 686671 687526 689329 692050 695389 698858 701789 703621
60097G03621P82M25P17Q60K13q97j529j292p63o08o79l55M83J332J922K639L944
$$ 703621 704403 704828 705545 706405 706618 705721 704192 702900 702137 701529 700850 700495 700978 702310 704232 706871 710815
60080G10815N675P052P340O463N073L905K985J645n11k985m980o318p410q647
$$ 710815 716490 723542 730882 737345 742418 746323 749308 750953 750442 747457 742477 736159 728749 720102
60066G20102j0063j1360j1856j0835q470o127n142n490o080o050n305m214l415
$$ 720102 710039 698679 686823 675988 667518 661391 656249 650759 644679 638629 633324 629110 625695
60053F25695l489m116l993k422n70r9r13j408q14N6M21O07J116J773K333L072
$$ 625695 622206 618090 614097 611675 611105 611006 610093 608685 607871 607927 608348 608955 610071 611844 614177 617249
60037F17249M173N178N500N048M072K905J930J305O37m37j457j682j383j675k972
$$ 617249 621422 626600 632100 637148 641220 644125 646055 647360 647997 647560 646103 644421 643038 641363 638391
60022F38391m552n751o644p356p688p734p949q217p835o731n810n654n788n643
$$ 638391 633839 628088 621444 614088 606400 598666 590717 582500 574665 567934 562124 556470 550682 545039
60008E45039n356n148m817m349m111l972l125j424K1K94p0r4J97J83p5O4P76J605
$$ 545039 539683 534535 529718 525369 521258 517286 514161 512737 512758 513052 512982 512888 513085 513268 513193 513257 514033 515638
59990E15638K193K548K741K856L060L480M051M690N278N496N108M455M042L622
$$ 515638 517831 520379 523120 525976 529036 532516 536567 541257 546535 552031 557139 561594 565636 569258
59976E69258K463O18q61j290j122j106j389j789k188k300j878j332j462k217k631
$$ 569258 571721 572339 571478 570188 569066 567960 566571 564782 562594 560294 558416 557084 555622 553405 550774
59961E50774k229j590j125m27P18J657J894J866J982J772P66n12j192j100n98
$$ 550774 548545 546955 545830 545403 546121 547778 549672 551538 553520 555292 556058 555546 554354 553254 552656
59946E52656K5M56L18k20m43o8L94N55N43K73n96j636j754r13m30r18j243m15
$$ 552656 552681 553137 553455 553235 552792 552724 553118 553673 554216 554489 553893 552257 550503 549590 549160 548242 546999 546584
59928E46584Q36J408J494J726J775J164M99N66R65R52Q51J328J957J856J114L98
$$ 546584 547420 548828 550322 552048 553823 554987 555486 556052 557017 557969 558820 560148 562105 563961 565075 565473
59912E65473k34q70q29M18J995K664K523K372K006O81j126k079j857j293q29k36
$$ 565473 565239 564369 563540 563958 565953 568617 571140 573512 575518 576199 575073 572994 571137 569844 569015 568779
59896E68779K83J64l60l76M26J623L007M516N560N623N311N522N889N442M515
$$ 568779 569062 569226 568866 568490 568916 570539 573546 578062 583622 589245 594556 600078 605967 611409 615924
59881F15924M409N264N884N776N728O123O285N942N824O199O117M815K779P85
$$ 615924 620333 625597 631481 637257 642985 649108 655393 661335 667159 673358 679475 684290 687069 687854
59867F87854j075k866m249n152o162p569q708q839q155p328o623n927n191m436
$$ 687854 686779 683913 679664 674512 668350 660781 652073 643234 635079 627751 621128 615201 610010 605574
59853F05574l610k753k015j363n95K52R68J601K469L734N398P501R769J1396J1891
$$ 605574 601964 599211 597196 595833 595238 595490 596458 598059 600528 604262 609660 617161 626930 638326 650217
59838F50217J2016J3013J4882J6129J5262J1976P083K134j014j280O41K987M577
$$ 650217 662233 675246 690128 706257 721519 733495 740578 742712 741698 740418 741059 744046 748623
59825G48623N106M135R47m340j0386j5636j9096k0253j9206j7103j5436j4521
$$ 748623 753729 757864 758811 754471 744085 728449 709353 689100 669894 652791 637355 622834
59813F22834j3357j1223q622o442m980m156l915l956l672k835j899j356j099p47
$$ 622834 609477 598254 589632 583190 578210 574054 570139 566183 562511 559676 557777 556421 555322 554575
59799E54575k08K27J41o65j799k448k317k121k572l266l332k850k649k827k566
$$ 554575 554367 554594 554735 554070 552271 549823 547506 545385 542813 539547 536215 533365 530716 527889 525323
59784E25323j598p75q64j581k164k289k071j749j548j434j007j08O51O54L73P44
$$ 525323 523725 522950 522086 520505 518341 516052 513981 512232 510684 509250 508243 508135 508786 509440 509813 510557
59768E10557J621J930J422J051J353J606J201P57J135K088K637K316J361J82q00
$$ 510557 512178 514108 515530 516581 517934 519540 520741 521498 522633 524721 527358 529674 531035 531217 530417
59753E30417j046k53J279K893M088M660M600M064L258K323J465J032J198J633
$$ 530417 529371 529118 530397 533290 537378 542038 546638 550702 553960 556283 557748 558780 559978 561611
59739E61611J801J473P11k40p65j17J509K651K114N09o08p50o86r16j137j113
$$ 561611 563412 564885 565596 565356 564591 564474 565983 568634 570748 571257 570649 569899 569213 568297 567160 566047
59723E66047j052r67o67m40q39j711k261k182j824j294m27M10N84L93Q15J844
$$ 566047 564995 564028 563361 562921 562082 560371 558110 555928 554104 552810 552383 552793 553377 553770 554585 556429
59707E56429K281J518M49J15M31Q52J297J863K322K526K697K886K780K391K313
$$ 556429 558710 560228 560677 560792 561223 562075 563372 565235 567557 570083 572780 575666 578446 580837 583150
59692E83150K891L704M176M098L352J811j08j413j486o76K12N88K58m99r44o17
$$ 583150 586041 589745 593921 598019 601371 603182 603074 601661 600175 599499 599711 600299 600557 600058 599114 598497
59676E98497kO3m98j171j796k486k937k827k663l014l189k107l47L09m78j116
$$ 598497 598495 598558 598060 596889 595093 592607 589670 586843 584180 581166 577977 575870 575523 575832 575354 574238
59660E74238o00J63K00j2K24N08K71o8J34P81J688L124M886N779N014L311J774
$$ 574238 573638 573801 574001 573989 574213 574721 574992 574924 575058 575839 577527 580651 585537 591316 596330 599641 601415
59643F01415M58j094k696l857m598n139n288m929m443m136l808l450l438l558
$$ 601415 601873 600779 598083 594226 589628 584489 579201 574272 569829 565693 561885 558435 554997 551439
59629E51439k774q21R89J382P35J98L9j30l13l63n97j069q57O95K471K566O65
$$ 551439 548665 547844 548833 550215 550950 551148 551187 551057 550744 550381 549784 548715 547858 548553 551024 553590 554255
59612E54255j627k773k702k200j733j219m67M23J100J406J617J898J750O33r36
$$ 554255 552628 549855 547153 544953 543220 542001 541534 541957 543057 544463 546080 547978 549728 550361 549425
59597E49425j776j571j128r62p66m48n24j079j414j303j375j753j574n65K34J48
$$ 549425 547649 546078 544950 543988 543222 542774 542250 541171 539757 538454 537079 535326 533752 533187 533421 533569
59581E33569n0L33N67j14j062j451j798k844l917m033l656l723l692k440n70J69
$$ 533569 533519 533852 534419 534305 533243 531792 529994 527150 523233 519200 515544 511821 508129 505689 505119 505288
59565E05288m20p48K1R17J003O71N90O36M98L71M78O10N66N00N63O79Q45J168
$$ 505288 504868 504120 504141 505058 506061 506732 507322 507958 508456 508827 509305 509915 510481 510981 511544 512223 513068 514236
59547E14236J539J683J619J663K020K685L632M743N874P273R501J2488J5304J7505
$$ 514236 515775 517458 519077 520740 522760 525445 529077 533820 539694 546967 556468 568956 584260 601765
59533F01765J9903K2837K4136K0420J0896r09r811j2969j1325p755m314j149K311
$$ 601765 621668 644505 668641 689061 699957 699048 689237 676268 664943 657188 652874 651725 654036
59520F54036N726P917Q362P768O885N627L784J828K73j144k958n106p193r093
$$ 654036 659762 667679 676041 683809 690694 696321 700105 701933 702206 701062 698104 692998 685805 676712
59506F76712j0650j1322j0889j0019r478r128q433p416o504n865n550n734o156
$$ 676712 666062 654740 643851 633832 624354 615226 606793 599377 592873 587008 581458 575724 569568
59493E69568n908m552k848j684r78m37m83j284j700n94J277K177J971K214L701
$$ 569568 563660 559108 556260 554576 553598 553161 552678 551394 549694 549100 550377 552554 554525 556739 560440
59478E60440N365N975N744N726O443P582Q506Q736Q253P488O674N439L402R83
$$ 560440 565805 571780 577524 583250 589693 597275 605781 614517 622770 630258 636932 642371 645773 646756
59464F46756r65k055k395j939m88J747M061N788O714P268Q454J1015J4350J6807
$$ 646756 645791 643736 641341 639402 638914 640661 644722 650510 657224 664492 672946 683961 698311 715118
59450G15118J7523J7292J7246J7527J7830J8231J8576J7770J4728R495K759m906
$$ 715118 732641 749933 767179 784706 802536 820767 839343 857113 871841 881336 884095 879189
59438H79189j2540j8482k1718k2817k2640k1068j8143j5236j3579j2581j1187
$$ 879189 866649 848167 826449 803632 780992 759924 741781 726545 712966 700385 689198
59427F89198r922r709r617p995n201k898j004K068O207R322J0702J2162J5064
$$ 689198 679276 669567 659950 651955 646754 643856 642852 644920 651127 660449 671151 683313 698377
59414F98377J8548K1611K4660K7832L0015L0959L2022L2725K8662J5939k913k0103
$$ 698377 716925 738536 763196 791028 821043 852002 884024 916749 945411 961350 958437 938334
59402I38334k9615l1222k7804k1594j3866o074P28O486J0442R589J011j3743k8206
$$ 938334 908719 877497 849693 828099 814233 808159 808887 815373 825815 835404 836415 822672 794466
59389G94466l6137l6486l2628k7850k3145j8755j5517j3710j2101r471o315m001
$$ 794466 758329 721843 689215 661365 638220 619465 603948 590238 578137 568666 562351 558350
59377E58350k835k104j474j206j209r91n01j44J0L04P79J154J413J855K516L161
$$ 558350 555515 553411 551937 550731 549522 548531 548030 547886 547896 548200 548979 550133 551546 553401 555917 559078
59361E59078L704M192M448M263L780L345L278L976N706P924R529J0350J1523J3715
$$ 559078 562782 566974 571422 575685 579465 582810 586088 590064 595770 603694 613223 623573 635096 648811
59347F48811J5936J7130J8001J9883K2449K4022K3882K2848K1728K0439J8709
$$ 648811 664747 681877 699878 719761 742210 766232 790114 812962 834690 855129 873838
59336H73838J6497J3661J0113O236K409j587n918r846j2601j4558j6537j8308
$$ 873838 890335 903996 914109 920345 922754 921167 915249 905403 892802 878244 861707 843399
59324H43399j9019j8670j7932j6883j5247j3531j2436j1498r795p790o853p032
$$ 843399 824380 805710 787778 770895 755648 742117 729681 718183 708388 700598 693745 686713
59312F86713o951o014n009m360l408j856m73J85M66O44M83J83N76J877L248M005
$$ 686713 679762 673748 668739 664379 660971 659115 658642 658827 659293 659937 660420 660603 661179 663056 666304 670309
59296F70309M350M759N576P379J0571J4507J7972K0624K2917K4735K5286K4198
$$ 670309 674659 679418 684994 692373 702944 717451 735423 756047 778964 803699 828985 853183
59284H53183K1241J5214N069p473j8225k4110k5184k2888j8151j1943n853r13
$$ 853183 874424 889638 894707 887234 869009 844899 819715 796827 778676 766733 760880 759967
59272G59967L155O688R276J0842J2270J4054J5502J6079J6361J6727J6248J3987
$$ 759967 763122 769810 779086 789928 802198 816252 831754 847833 864194 880921 897169 911156
59260I11156J0454O695K803j537n755q834j0745j2398j4309j5967j6532j5694
$$ 911156 921610 928305 931108 929571 923816 914982 904237 891839 877530 861563 845031 829337
59248H29337j3943j2134j0703r391p989o907o402n735m116k112q67j91J068K902
$$ 829337 815394 803260 792557 783166 775177 768270 761868 756133 752017 749905 749038 748847 749915 752817
59234G52817M064M284M751N918O524N651M154L069J914k37l074n578p455r072
$$ 752817 756881 761165 765916 771834 778358 784009 788163 791232 793146 792909 789835 784257 776802 767730
59220G67730j0607j1962j3011j3407j2796j1655j1026j1127j1114j0583j0151
$$ 767730 757123 745161 732150 718743 705947 694292 683266 672139 661025 650442 640291
59209F40291j0025r324p562n702m854m813m759m532m357m076l429k565j618m22
$$ 640291 630266 620942 613380 607678 602824 598011 593252 588720 584363 580287 576858 574293 572675 572253
59195E72253R02J743J827J600J484J521J959L089M258M190K838J783K152L253
$$ 572253 573155 574898 576725 578325 579809 581330 583289 586378 590636 594826 597664 599447 601599 604852
59181F04852L867L866L855M148M742N479N788N188M395M765O296P493P665P912
$$ 604852 608719 612585 616440 620588 625330 630809 636597 641785 646180 650945 657241 664734 672399 680311
59167F80311R186J0858J2064J3086J4425J5676J6297J6393J5852J3963J0810P801
$$ 680311 689497 700355 712419 725505 739930 755606 771903 788296 804148 818111 828921 836722
59155H36722N795L872J046k038m280n788p216q434r104r585j0144j0199r441q713
$$ 836722 842517 846389 847435 845397 841117 835329 828113 819679 810575 800990 790846 780647 771206 762493
59141G62493q582q107o373m315l601m391n502o186o464o340n854n488n436m952
$$ 762493 753911 745804 739431 735116 731515 727124 721622 715436 708972 702632 696778 691290 685854 680902
59127F80902l333j005J160K912M286N076N439O152P407Q343Q605R202J0796J2434
$$ 680902 677569 676564 677724 680636 684922 689998 695437 701589 708996 717339 725944 735146 745942 758376
59113G58376J3153J3579J4514J5146J4320J2637J1500J0843R539P533N820M659
$$ 758376 771529 785108 799622 814768 829088 841725 853225 864068 873607 881140 886960 891619
59101H91619L461K178J303P02k46j472k400l099m081n148n576n281m779m294l771
$$ 891619 895080 897258 898561 899263 899017 897545 895145 892046 887965 882817 877241 871960 867181 862887 859116
59086H59116l482l719m187m548n097o101p106p708q401r673j0981j1545j1516
$$ 859116 855634 851915 847728 843180 838083 831982 824876 817168 808767 799094 788113 776568 765052
59073G65052j1364j0885r902r087q930q677p544o177n556n303m499l481l157l160
$$ 765052 753688 742803 732901 723814 714884 706207 698663 692486 686930 681627 677128 673647 670490 667330
59059F67330k375r87l62j047k260l205l655l476k816k516l127l879l760l149l058
$$ 667330 664955 663968 663606 662559 660299 657094 653439 649963 647147 644631 641504 637625 633865 630716 627658
59044F27658l289k829j684q36n60l21p2k41m57J43J309J765J102L31L76J100J980
$$ 627658 624369 621540 619856 619020 618460 618139 618067 617826 617369 617512 618821 620586 621688 622019 622395 623495 625475
59027F25475K756L270L527L951M916O081O972P841R135J0395J0702R899Q549O951
$$ 625475 628231 631501 635028 638979 643895 649976 656948 664789 673924 684319 695021 704920 713469 720420
59013G20420N108L307J831M29j043j943j687q04j47L79J298K343K938L405M496
$$ 720420 725528 728835 730666 731095 730052 728109 726422 725618 725471 725850 727148 729491 732429 735834 740330
58998G40330O110P521Q475R036Q844P652O188N409N353N598O071O396N286K063
$$ 740330 746440 753961 762436 771472 780316 787968 794156 799565 804918 810516 816587 822983 828269 830332
58984H30332j918m769o361p767r159r905j0149j0472j0359q681n697k948j197
$$ 830332 828414 823645 817284 809517 800358 790453 780304 769832 759473 750792 745095 742147 740950
58971G40950J68J747L421M989O418P602Q707J0324J2428J3869J3983J3773J4255
$$ 740950 741118 742865 746286 751275 757693 765295 774002 784326 796754 810623 824606 838379 852634
58958H52634J4592J3369J0835Q176N421J913j947n312q611j2644j6527j8517j8538
$$ 852634 867226 880595 891430 899606 905027 906940 904993 899681 891070 878426 861899 843382 824844
58945H24844j7888j7002j5470j3854j3174j2842j1356q854o858n628m128k520
$$ 824844 806956 789954 774484 760630 747456 734614 723258 714404 707546 701918 697790 695270
58933F95270k294l589m710m737m532m701m597l935l484l608l683l477l495l681
$$ 695270 692976 689387 684677 679940 675408 670707 666110 662175 658691 655083 651400 647923 644428 640747
58919F40747l353k609k215j957q91P09J484J248J236J901K386K443K881L808M405
$$ 640747 637394 634785 632570 630613 629722 630431 631915 633163 634399 636300 638686 641129 644010 647818 652223
58904F52223M788O131Q458J0359J1374J2598J4397J5604J5688J5654J6003J5791
$$ 652223 657011 663142 671600 681959 693333 705931 720328 735932 751620 767274 783277 799068
58892G99068J4681J4028J4868J6505J8163K0383K3725K7368L0098L1503L1490
$$ 799068 813749 827777 842645 859150 877313 897696 921421 948789 978887 1010390 1041880
58881A041880K9854K6909K3366J9131J3571P255J773k674p730j4251k0862k5910
$$ 1041880 1071734 1098643 1122009 1141140 1154711 1161966 1163739 1161065 1153335 1139084 1118222 1092312
58869A092312k9265l1352l1939l0860k8668k5847k2506j9313j7291j6236j4859
$$ 1092312 1063047 1031695 999756 968896 940228 914381 891875 872562 855271 839035 824176
58858H24176j2984j1958j2326j2811j2414j1833j1964j2426j2489j2068j1128
$$ 824176 811192 799234 786908 774097 761683 749850 737886 725460 712971 700903 689775
58847F89775r464p639o785o877o703n918n513n757n532m377l343l090k925k527
$$ 689775 680311 672672 665887 659010 652307 646389 640876 635119 629587 625210 621867 618777 615852 613325
58833F13325k708l644m149l761l613m260m548l775l101l446l796k997j626o76
$$ 613325 610617 606973 602824 599063 595450 591190 586642 582867 579766 576320 572524 569527 567901 567225
58819E67225J30J286K217K440K625L207L271K263J394J822K694K529J472O50K69
$$ 567225 567355 568641 570858 573298 575923 579130 582401 584664 586058 587880 590574 593103 594575 595225 595494
58804E95494k00p10r10j012j288j363j030r24j502k137k105j616j090l94M21O82
$$ 595494 595294 594584 593674 592662 591374 590011 588981 588057 586555 584418 582313 580697 579607 579213 579634 580316
58788E80316K41M4P71J863K657L408M485N602O523P480Q270Q144P181O437O164
$$ 580316 580557 580601 581372 583235 585892 589300 593785 599387 605910 613390 621660 629804 636985 643422 649586
58773F49586N318L459J517j9k000m707o732p024o491o361o287n480m441m208m704
$$ 649586 654904 658363 659880 659861 657861 653154 646422 639398 632907 626546 620259 614779 610338 606130 601426
58758F01426n005m531l211j309L55R95J055J678K803L310L160L482M244M065K979
$$ 601426 596421 591890 588679 587370 587725 588720 589775 591453 594256 597566 600726 604208 608452 612517 615496
58743F15496L010M974P033P632P635Q179Q623Q230P744P675O944N106L960M937
$$ 615496 618506 623480 630513 638145 645780 653959 662582 670812 678556 686231 693175 698281 702241 707178
58729G07178O649O987O134N515N179M333L285K895L003K947K822K832K588K187
$$ 707178 713827 720814 726948 732463 737642 741975 745260 748155 751158 754105 756927 759759 762347 764534
58715G64534K711M454O104O839P489Q409Q162N926L286J813P02j407m016o090
$$ 764534 767245 771699 777803 784642 792131 800540 808702 814628 817914 819727 820429 819022 815006 808916
58701H08916q056j0464j2399j3258j4369j6721j8773j8826j7864j7632j7474j5692
$$ 808916 800860 790396 777997 764739 750370 733649 714876 696050 678186 660554 643080 627388
58689F27388j2717j0242q406o377m766m803n844o179n615n216n217n298n898p187
$$ 627388 614671 604429 596023 589646 584880 580077 574233 568054 562439 557223 552006 546708 540810 533623
58675E33623p697o158l716k221j374J64J989K797L010M105O070P903R750J2140
$$ 533623 525926 519768 516052 513831 512457 512621 514610 517407 520417 524522 530592 538495 548245 560385
58661E60385J4024J3938J2385J0628Q115L773j011l617l867l763m061l859l223
$$ 560385 574409 588347 600732 611360 619475 623248 622237 618620 614753 610990 606929 603070 599847
58648E99847l343m131m271l721l683m124l775k604j903j865j312k2R66J360J879
$$ 599847 596504 592373 588102 584381 580698 576574 572799 570195 568292 566427 565115 565093 566059 567419 569298
58633E69298K429K175J472J603K425K321P14j235k613l556l986l436k317j693
$$ 569298 571727 573902 575374 576977 579402 581723 582437 581202 578589 575033 571047 567611 565294 563601
58619E63601j553q09R28L019N093P231R035J0056J0841J2151J3382J3288J1775
$$ 563601 562048 561239 562167 565186 570279 577510 586545 596601 607442 619593 632975 646263 658038
58606F58038R615O981L920J511O86N05n69k215l030l046l481m417m810m504m203
$$ 658038 667653 674634 678554 680065 680751 681256 680687 678472 675442 672396 668915 664498 659688 655184 650981
58591F50981l832k768j363l47P52K691M661N471O013Q193J1694J4118J4283J3253
$$ 650981 647149 644381 643018 642671 643423 646114 650775 656246 662259 670452 682146 696264 710547 723800
58577G23800J2137J0856R200P333N227K972J325P05K88m99o00R29L076M687O702
$$ 723800 735937 746793 755993 763326 768553 771525 772850 773555 773843 773344 772744 773673 776749 781436 788138
58562G88138J0223J3721J5000J4835J5610J7113J6894J4320J1141Q136M436K60
$$ 788138 798361 812082 827082 841917 857527 874640 891534 905854 916995 925131 929567 929827
58550I29827k694m066n405p495r392j0390j0715j0182q374o282n559o228p115
$$ 929827 927133 923067 917662 910167 900775 890385 879670 869488 861114 854832 849273 843045 835930
58537H35930q213j0322j2702j3648j3244j3024j3092j2129j0170q663p804o369
$$ 835930 827717 817395 804693 791045 777801 764777 751685 739556 729386 720723 712919 706550
58525G06550m239k562j362L75K278K877K389K631L951M788M463L911L473K483
$$ 706550 702311 699749 698387 698762 701040 703917 706306 708937 712888 717676 722139 726050 729523 732006
58511G32006J217P97J039P90M03J330L207M043L500L331M326N377N817O219O542
$$ 732006 733223 734020 735059 735849 736252 737582 740789 744832 748332 751663 755989 761366 767183 773402 779944
58496G79944N908M513L454K615R06j428l140m344o108p908q193p211o611o424
$$ 779944 785852 790365 793819 796434 797340 795912 792772 788428 782320 774412 766219 759008 752397 745973
58482G45973n276l330k022j113R58L842N578O014O779P868P556N732L993K351
$$ 745973 740697 737367 735345 734232 735190 739032 744610 750624 757403 765271 772827 778559 782552 784903
58468G84903p24m709p007o961o533o560n777m070l127l216k603r49P9K41J365
$$ 784903 784179 779470 772463 765502 758969 752409 746632 742562 739435 736219 733616 732667 732746 732987 734352
58453G34352L815N629O035O545P679P816O225M143K190k79k635l148k393k989
$$ 734352 738167 743796 749831 756376 764055 771871 778096 782239 784429 784150 781515 778367 775974 772985
58439G72985n172o032m139j536k6J135K741L970M445N014N536M776L298L413N543
$$ 772985 767813 761781 757642 756106 756080 757215 759956 763926 768371 773385 778921 783697 786995 790408 795951
58424G95951P567Q313Q635Q709P705O432O732P803O905M101K336K359J808k5j007
$$ 795951 803518 811831 820466 829175 836880 843312 850044 857847 864752 868853 871189 873548 875356 875331 874324
58409H74324o52j272l443m683m065l817m865n167l966l390m075l562q85J514K232
$$ 874324 873672 872400 868957 864274 860209 856392 851527 846360 842394 839004 834929 831367 830482 831996 834228
58394H34228L068M823N289L487J729J340L74k154l948l565k916l354l263j782
$$ 834228 837296 842119 847408 850895 852624 853964 854338 852184 848236 844671 841755 838401 835138 833356
58380H33356r69j847k135l89J365J521J701L327M972N447O014P356P912P255P495
$$ 833356 832387 830540 828405 828016 829381 830902 832603 835930 840902 846349 852363 859719 867631 874886 882381
58365H82381R380J0699J0424J0460J1599J1877J0872J1146J3340J4290J2341J0113
$$ 882381 891761 902460 912884 923344 934943 946820 957692 968838 982178 996468 1008809 1018922
58353A018922R619R071O991N121M697M212L145L607N896O999N817N239O726P804
$$ 1018922 1028541 1037612 1044603 1049724 1054421 1058633 1061778 1065385 1071281 1078280 1084097 1089336 1096062 1103866
58339A103866P239P505R558J0484R144Q768J1062J3138J3273J4062J6646J7764
$$ 1103866 1111105 1118610 1128168 1138652 1147796 1156564 1167626 1180764 1194037 1208099 1224745 1242509
58327A242509J6014J5120J7068J7960J4898J1138R966R167O340M064M906O462
$$ 1242509 1258523 1273643 1290711 1308671 1323569 1334707 1344673 1353840 1360180 1364244 1369150 1375612
58315A375612O248O412Q818J0630R597Q634J0267J1800J0870J0501J3399J6446
$$ 1375612 1381860 1388272 1397090 1407720 1417317 1425951 1436218 1448018 1458888 1469389 1482788 1499234
58303A499234J6197J4868J5618J6903J6690J7096J9544K0582J7944J5525J6866
$$ 1499234 1515431 1530299 1545917 1562820 1579510 1596606 1616150 1636732 1654676 1670201 1687067
58292A687067J9002J8394J7414J9099K0954K0093J9268K1566K4321K4409K4373
$$ 1687067 1706069 1724463 1741877 1760976 1781930 1802023 1821291 1842857 1867178 1891587 1915960
58281A915960K7171L0114L0206L0117L2698L5054L4390L4056L7327M0897M1122
$$ 1915960 1943131 1973245 2003451 2033568 2066266 2101320 2135710 2169766 2207093 2247990 2289112
58270B289112M0907M3773M7054M7671M8575N2520N5834N5415N5330N9290O3386
$$ 2289112 2330019 2373792 2420846 2468517 2517092 2569612 2625446 2680861 2736191 2795481 2858867
58259B858867O3779O4340O8781P2685P1831P0826P4538P8526P7496P5749P9247
$$ 2858867 2922646 2986986 3055767 3128452 3200283 3271109 3345647 3424173 3501669 3577418 3656665
58248C656665Q4663Q6595Q8443R5513J04265J09112J13036J20922J29400J34067
$$ 3656665 3741328 3827923 3916366 4011879 4116144 4225256 4338292 4459214 4588614 4722681
58238D722681J39422J50673J63210J71379J79655J93642K08453K18192K28158
$$ 4722681 4862103 5012776 5175986 5347365 5527020 5720662 5929115 6147307 6375465
58229F375465K44954K63494K77149K91400L13513L38368L59139L82047M15038
$$ 6375465 6620419 6883913 7161062 7452462 7765975 8104343 8463482 8845529 9260567
58220I260567M52067M84956N20366N67917O22357O75471P34516Q09841Q95828
$$ 9260567 9712634 10197590 10717956 11285873 11908230 12583701 13318217 14128058 15023886
58211A5023886R84260J084558J209605J354343J511216J693685J920217K189303
$$ 15023886 16008146 17092704 18302309 19656652 21167868 22861553 24781770 26971073
58203B6971073K496900K864209L319852L869932M516453N288997O225303P340418
$$ 26971073 29467973 32332182 35652034 39521966 44038419 49327416 55552719 62893137
58195F2893137Q655394J0240445J2190566J4580145J7482846K0992807K5133612
$$ 62893137 71548531 81788976 93979542 108559687 126042533 147035340 172168952
58188A72168952K9717284L4279117L8018974L9659319L7504031L0127893J7501575
$$ 172168952 201886236 236165353 274184327 313843646 351347677 381475570 398977145
58181C98977145J601306j4234446k6833159l4476866l7176358l6060897l2545998
$$ 398977145 400578451 386344005 359510846 325033980 287857622 251796725 219250727
58174B19250727k7826816k2789827j8066498j3984993j0540336p648099n534176
$$ 219250727 191423911 168634084 150567586 136582593 126042257 118394158 112859982
58167A12859982m717925n436178p152202q817543r641265r516951q775185p747054
$$ 112859982 108142057 102705879 95553677 86736134 77094869 67577918 58802733 51055679
58159E1055679o629635n566473m656859l906284l269426k734706k314536j986390
$$ 51055679 44426044 38859571 34202712 30296428 27027002 24292296 21977760 19991370
58151A9991370j707033j466497j277019j126027r86576q60050p65940p00140o40451
$$ 19991370 18284337 16817840 15540821 14414794 13428218 12568168 11802228 11102088 10461637
58142A0461637n83443n41636n12640m82127m49946m25137m02323l69246l30750
$$ 10461637 9878194 9336558 8823918 8341791 7891845 7466708 7064385 6695139 6364389
58133F364389l00924k78294k51710k23619k04819j92744j77128j61548j57852
$$ 6364389 6063465 5785171 5533461 5309842 5105023 4912279 4735151 4573603 4415751
58124D415751j63766j66058j61954j58625j55616j46241j33125j24877j20139
$$ 4415751 4251985 4085927 3923973 3765348 3609732 3463491 3330366 3205489 3085350
58115C085350j11037r9255r3004r1199q5941p7785p3738p2866o8318o1218n8562
$$ 3085350 2974313 2875058 2782054 2690855 2604914 2527129 2453391 2380525 2312207 2250989 2192427
58104B192427n9535n7282n2204n0521n1705m9780m5196m3360m3385m0039l4859
$$ 2192427 2132892 2075610 2023406 1972885 1921180 1871400 1826204 1782844 1739459 1699420 1664561
58093A664561l3758l5551l4167l0269k9516l1147k9487k5161k3834k5297k4431
$$ 1664561 1630803 1595252 1561085 1530816 1501300 1470153 1440666 1415505 1391671 1366374 1341943
58082A341943k1660k1832k4070k3156j9912j9954k3050k3755k1805k1929k3999
$$ 1341943 1320283 1298451 1274381 1251225 1231313 1211359 1188309 1164554 1142749 1120820 1096821
58071A096821k3221j9735j8503j9791j8999j5817j4590j5607j4803j2095j1484
$$ 1096821 1073600 1053865 1035362 1015571 996572 980755 966165 950558 935755 923660 912176
58060I12176j2816j1854q648p634r340r931r106j0357j3299j3616j1070r871j0729
$$ 912176 899360 887506 878858 871224 861884 851953 842847 832490 819191 805575 794505 784634 773905
58047G73905j0106p668o997q311p867n256m284n758o335n140n004o458o964o495
$$ 773905 763799 756131 749134 740823 732956 727700 723416 717658 711323 706183 701179 694721 687757 681262
58033F81262p585r554r087o746o440q308q720p469p989j0158r985p179o043p645
$$ 681262 673677 664123 655036 648290 641850 633542 624822 617353 609364 599206 589221 582042 575999 568354
58019E68354q066n752m034m542m523k600j245j614j491k15k46k077k738j079L91
$$ 568354 560288 554536 550502 545960 541437 538837 537592 535978 534487 534272 534026 531949 529211 528132 528523
58004E28523M20Q81K289K381O90j18J055K163K271K889M035L548J481N88J427
$$ 528523 528943 529824 532113 534494 535184 535066 536121 538284 540555 543444 547479 551027 552508 553096 554523
57989E54523J447j04j042q90j806l823m104k231j395k932m303m089m237n751o606
$$ 554523 555970 555866 554824 553934 552128 548305 544201 541970 540575 537643 533340 529251 525014 519263 512657
57974E12657n822n326o061o285n323n008n834n791m470m213n551n665l188n53
$$ 512657 506835 501509 495448 489163 483840 478832 472998 467207 462737 458524 452973 447308 444120 443567
57960D43567K72O15J748K508K102J848K298J913K39r21r13j403k790k979j278
$$ 443567 443839 444454 446202 448710 450812 452660 454958 456871 457110 456189 455276 453873 451083 448104 446826
57945D46826M2l42p91j58K36l28l72O49R77J2k67J046K080J884K236L872M391
$$ 446826 446868 446526 445735 445577 445813 445485 445113 445762 446739 446751 446484 447530 449610 451494 453730 457602 461993
57928D61993K261l14r34m81p07j058m03M05J03p77j263j671k373k749k755l518
$$ 461993 464254 463940 463006 462525 461818 460760 460357 460762 460865 460088 458825 457154 454781 452032 449277 445759
57912D45759n106n868n156m497m861n223m962n209o455p300o984o771p428p725
$$ 445759 440653 434785 429629 425132 420271 415048 410086 404877 398422 391122 384138 377367 369939 362214
57898C62214o819n805n525n089l931l140l333l399k536j521q50J70J471J759R69
$$ 362214 355395 349590 344065 338976 335045 331905 328572 325173 322637 321116 320266 320436 321907 323666 324635
57883C24635Q32J960K862K887L440N067O043N339M454M705N101M457L337K436
$$ 324635 325467 327427 330289 333176 336616 341683 347726 353065 357519 362224 367325 371782 375119 377555
57869C77555J208l95j085n36m16j744l322l985m290m733m576l705l433m155m429
$$ 377555 378763 378368 377283 376747 376331 374587 371265 367280 362990 358257 353681 349976 346543 342388 337959
57854C37959l553k798k893k606j094O48J807K895L819L412K069K107M162N968
$$ 337959 334406 331608 328715 326109 325015 325663 327470 330365 334184 337596 339665 341772 345934 351902
57840C51902O099O017O821P019N558M131M225M482L347J884J540J334j53k018
$$ 351902 358001 364018 370839 377858 383416 387547 391772 396254 399601 401485 403025 404359 404206 402188
57826D02188k701k678l180l829l749l462l662l705l121k964l801m151k875j294
$$ 402188 399487 396809 393629 389800 386051 382589 378927 375222 372101 369137 365336 361185 358310 357016
57812C57016r51j069l42M98J77o27n81j57o80k070l473m940o737q142q719r372
$$ 357016 356065 354996 354654 355152 355329 354702 354121 353964 353284 351214 347741 342801 336064 327922 319203 309831
57796C09831j0549j0884r344p248o266n905m913l756l628m202m270l697l022k178
$$ 309831 299282 288398 279054 271806 265540 259635 254722 250966 247338 243136 238866 235169 232147 229969
57782B29969j128n81p69p38j37r7j011j280J64J895K397K518L564M709M591L860
$$ 229969 228841 228260 227491 226753 226616 226519 225508 224228 224392 226287 228684 231202 234766 239475 244066 247926
57766B47926L889M381M433M612N710O731O360N261M723M204K521L42q10j141j919
$$ 247926 251815 256196 260629 265241 270951 277682 284042 289303 294026 298230 300751 301093 300283 299142 297223
57751B97223l102l732l906m269m398l668k918l182l691l091j813j202j160p42
$$ 297223 294121 290389 286483 282214 277816 274148 271230 268048 264357 261266 259453 258251 257091 256349
57737B56349k75p47j720j882j224p39m99J03Q37J055J035J329J487J090J042K095
$$ 256349 256074 255327 253607 251725 250501 249762 249263 249366 250203 251258 252293 253622 255109 256199 257241 259336
57721B59336L083K619J484J331J835J452J82o66q98j364j957j838j364j631k437
$$ 259336 262419 265038 266522 267853 269688 271140 271322 270656 269758 268394 266437 264599 263235 261604 259167
57706B59167k678k452k697l089k396q50p2o25j433j726j839k000j830j236m76
$$ 259167 256489 254037 251340 248251 245855 245005 244933 244308 242875 241149 239310 237310 235480 234244 233768
57691B33768M61J553K103J673J018R12Q07O9m30L91J808K464K773M156O525Q582
$$ 233768 234229 235782 237885 239558 240576 241488 242295 242364 241934 242325 244133 246597 249370 253526 260051 268633
57675B68633J0232J2645J6249K0548K5719L2538M1013N0720O1966P4812Q7301
$$ 268633 278865 291510 307759 328307 354026 386564 427577 478297 540263 615075 702376
57664G02376R6246R8817R1654P0272L3283j2510n4454q2766r5600r6298q8897
$$ 702376 798622 897439 989093 1059365 1092648 1080138 1025684 942918 847318 751020 662123
57653F62123p7130o4574n3368m3611l4902k7516k1720j7287j4123j2258j0916
$$ 662123 584993 520419 467051 423440 388538 361022 339302 322015 307892 295634 284718
57642B84718r007o665m968m090l148j939j203j000m68M88J007R43J185J866J984
$$ 284718 275711 269046 264078 259988 256840 254901 253698 252698 252230 252718 253725 254668 255853 257719 259703
57627B59703J256O92P46M87o58j723j705r85m95m38n69q53j184j213q98n90l44
$$ 259703 260959 261651 262397 262884 262226 260503 258798 257813 257318 256880 256311 255458 254274 253061 252163 251573 251229
57610B51229N6K92k70j437k205k148j783j458r26k59j5k29k28J65K76l01j121
$$ 251229 251285 251577 251307 249870 247665 245517 243734 242276 241350 241091 241076 240847 240619 240784 241060 240759 239638
57593B39638j774k419l142l596l665l699l853l804l408k982k728k521k297k158
$$ 239638 237864 235445 232303 228707 225042 221343 217490 213686 210278 207296 204568 202047 199750 197592
57579A97592k045j815j577j473j358j185j367k101k797k859k599k612k821k866
$$ 197592 195547 193732 192155 190682 189324 188139 186772 184671 181874 179015 176416 173804 170983 168117
57565A68117k883l025k862k163j584j578j477p26p0j89k25P01J542Q34n82o24
$$ 168117 165234 162209 159347 157184 155600 154022 152545 151819 151749 151560 151335 152036 153578 154412 153830 153206
57549A53206P85J778J656J573K040K056J169L76L70O20P52J194K010K551K639
$$ 153206 153991 155769 157425 158998 161038 163094 164263 164639 165009 165629 166381 167575 169585 172136 174775
57534A74775K664K289P08j495k527j904j141j343j750j335k75P68J514J577N40
$$ 174775 177439 179728 180436 178941 176414 174510 173369 172026 170276 168941 168666 169434 170948 172525 173065
57519A73065q83j192j97O15M04J14O38J335J378J132J200J176N28k74m93k98k77
$$ 173065 172182 170990 170793 171408 171812 171926 172564 173899 175277 176409 177609 178785 179313 179039 178546 178248 177971
57502A77971m88n87m18L8O77R54K72j034j903j932j681j548j364j267j714k400
$$ 177971 177483 176896 176478 176516 177193 178147 178419 177385 175482 173550 171869 170321 168957 167690 165976 163576
57486A63576k347j483q93j141j507j351r90p74n22l60q78j858k101j173j71o5
$$ 163576 161229 159746 158853 157712 156205 154854 153864 153090 152568 152208 151330 149472 147371 146198 146027 145962
57470A45962l56j79L37N52L34j77j007j885k108j424m12L02O09M87p3n59l56K53
$$ 145962 145606 145427 145764 146316 146650 146473 145466 143581 141473 140049 139637 139939 140548 141035 140962 140403 140047 140300
57452A40300N02N49J154J960J740N83J18R60J741J389P22P76J083P83J68q9j21
$$ 140300 140802 141351 142505 144465 146205 146788 146906 147866 149607 150996 151718 152494 153577 154360 154528 154439 154318
57435A54318k40j15M03O33J87k71k52l28q90j170n70J36J06j07L51J056J110P26
$$ 154318 154078 153963 154366 154999 155186 154915 154663 154335 153445 152275 151705 151841 151947 151840 152191 153247 154357 155083
57417A55083O91Q73O54K57L89Q66P84j10j129j586j287l68P33J361J233O68Jo92
$$ 155083 155774 156647 157301 157558 157947 158813 159597 159487 158358 156772 155485 155117 155850 157211 158444 159112 159113 158421
57399A58421j106p69M8L98O7p0M15P25L14j0O03J617J941J471Q83N72O32J162
$$ 158421 157315 156546 156594 156992 157059 156989 157404 158129 158443 158433 159036 160653 162594 164065 164948 165520 166152 167314
57381A67314J788J676P26n2n0O9k07j62P57J542R94l96j227j231j206j438j505
$$ 167314 169102 170778 171504 171452 171402 171471 171264 171102 171859 173401 174395 173999 172772 171541 170335 168897 167392
57364A67392j311j169j121j066j164j382j088k2J004J226J081J345J832K014K195
$$ 167392 166081 164912 163791 162725 161561 160179 159091 159069 160073 161299 162380 163725 165557 167571 169766
57349A69766K831L279K571J076Q8M3K13N6k62n12o33m47O7M10K24n1J36N17N93
$$ 169766 172597 175876 178447 179523 179611 179654 179867 179923 179661 179149 178516 178069 178136 178546 178770 178719 178855 179372 179965
57330A79965N49P25P38J29n53l83N67J497K108K578K667J995R86M95O28P89O70
$$ 179965 180514 181239 181977 182106 181553 181170 181737 183234 185342 187920 190587 192582 193568 194063 194691 195480 196150
57313A96150M32Q9l63n46j46M98R28J189J310Q45j97p36p8P89N55m06p70l44O9
$$ 196150 196582 196671 196308 195762 195616 196114 197042 198231 199541 200386 200189 199453 199375 200164 200719 200313 199543 199199 199268
57294A99268M29J389K656L116K655K383K872L479L589L281K622J571P70J106K261
$$ 199268 199697 201086 203742 206858 209513 211896 214768 218247 221836 225117 227739 229310 230080 231186 233447
57279B33447K922K643K396K884L509L467K804J984J237P30N36K02q12k004k160
$$ 233447 236369 239012 241408 244292 247801 251268 254072 256056 257293 258023 258559 258761 257949 255945 253785
57264B53785j070K5J14l69m77l0N06P56N66qn05l78J99M91K73J16L99Q46J244
$$ 253785 252715 252740 252854 252485 252008 251978 252484 253240 253806 253798 253293 252915 253114 253605 253878 253994 254393 255239 256483
57245B56483J797K420K520J957J554K028L020L693L754L484L185L083L371L850
$$ 256483 258280 260700 263220 265177 266731 268759 271779 275472 279226 282710 285895 288978 292349 296199
57231B96199L888L183K304K060K518L061L269L408L945M834N376M948L841L115
$$ 296199 300087 303270 305574 307634 310152 313213 316482 319890 323835 328669 334045 338993 342834 345949
57217C45949L481M538N410N810O079O464O927P499Q276R144R925J0707J1575J2178
$$ 345949 349430 353968 359378 365188 371267 377731 384658 392157 400433 409577 419502 430209 441784 453962
57203D53962J2079J1397J0588R760Q810Q043Q020Q702R388R553R285Q951Q910
$$ 453962 466041 477438 488026 497786 506596 514639 522659 531361 540749 550302 559587 568538 577448
57190E77448R451J0481J1286J1203J0485J0049J0396J1241J2020J2303J1808J0702
$$ 577448 586899 597380 608666 619869 630354 640403 650799 662040 674060 686363 698171 708873
57178G08873R751R695J0520J1691J2817J3641J3834J3483J3391J4087J4912J4979
$$ 708873 718624 728319 738839 750530 763347 776988 790822 804305 817696 831783 846695 861674
57166H61674J4601J4732J5355J5723J5885J6581J7585J7699J6738J6070J6597
$$ 861674 876275 891007 906362 922085 937970 954551 972136 989835 1006573 1022643 1039240
57155A039240J7515J7787J7712J8051J8632J8820J8752J9025J9630K0053K0287
$$ 1039240 1056755 1074542 1092254 1110305 1128937 1147757 1166509 1185534 1205164 1225217 1245504
57144A245504K0926K2247K3816K5113K6138K7351K9137L1298L3118L4127L4728
$$ 1245504 1266430 1288677 1312493 1337606 1363744 1391095 1420232 1451530 1484648 1518775 1553503
57133A553503L5706L7280L9046M0819M2842M5133M7322M9354N1689N4521N7421
$$ 1553503 1589209 1626489 1665535 1706354 1749196 1794329 1841651 1891005 1942694 1997215 2054636
57122B054636O0104O2952O6395P0250P4167P8279Q3050Q8822R5863J04492J14757
$$ 2054636 2114740 2177692 2244087 2314337 2388504 2466783 2549833 2638655 2734518 2839010 2953767
57111B953767J26305J38966J53267J70146J90391K14542K43091K76517L15402
$$ 2953767 3080072 3219038 3372305 3542451 3732842 3947384 4190475 4466992 4782394
57102D782394L60810M14482M78709N56243O50362P64543R01886J065077J256629
$$ 4782394 5143204 5557686 6036395 6592638 7243000 8007543 8909429 9974506 11231135
57093A1231135J478296J729710K007810K307529K621966K940935L249488L528734
$$ 11231135 12709431 14439141 16446951 18754480 21376446 24317381 27566869 31095603
57085C1095603L758559L920022L996235L972382L835441L573424L175176K633258
$$ 31095603 34854162 38774184 42770419 46742801 50578242 54151666 57326842 59960100
57077E9960100J951075J150484K73223o26491j493462k279727k947447l469983
$$ 59960100 61911175 63061659 63334882 62708391 61214929 58935202 55987755 52517772
57069E2517772l833737m038896m097181m028281l857167l611585l318434l000596
$$ 52517772 48684035 44645139 40547958 36519677 32662510 29050925 25732491 22731895
57061B2731895k676345k360268k063231j791806j548997j335747j151364r93282
$$ 22731895 20055550 17695282 15632051 13840245 12291248 10955501 9804137 8810855
57053H810855q58079p43027o46193n65385m97981m41615l94061l52811l15898
$$ 8810855 7952776 7209749 6563556 5998171 5500190 5058575 4664514 4311703 3995805
57044C995805k82947k54238k28885k05238j82994j63423j47290j33796j21864
$$ 3995805 3712858 3458620 3229735 3024497 2841503 2678080 2530790 2396994 2275130
57035B275130j11234j01859r3381q5636p8784p2524o6015n8845n1306m3622l5680
$$ 2275130 2163896 2062037 1968656 1883020 1804236 1731712 1665697 1606852 1555546 1511924 1476244
57024A476244k7326j8054o654P742K4830M4624O8470R6251J23716J46030J63111
$$ 1476244 1448918 1430864 1424210 1431952 1456782 1501406 1569876 1666127 1789843 1935873 2098984
57013B098984J75926J75977J45207P3151k7018j24393j92705k24849k28400k13862
$$ 2098984 2274910 2450887 2596094 2669245 2642227 2517834 2325129 2100280 1871880 1658018
57003A658018j89406j61594j35352j12657r3241p6722o3255n2647m4061l6629
$$ 1658018 1468612 1307018 1171666 1059009 965768 889046 825791 773144 729083 692454
56993F92454k9936k4036j9253j5635j2533r151n628k939j583r37j64P44J048n4
$$ 692454 662518 638482 619229 603594 591061 581910 576282 573343 571760 570823 570659 571403 572451 572397
56979E72397l044p781j3316j8276k1699k3388k3515k2328k0262j7871j5449j2975
$$ 572397 569353 561572 548256 529980 508281 484893 461378 439050 418788 400917 385468 372493
56967C72493j0486q173o049l890j580P38K972N324Q055J1159J4242J6580J7357
$$ 372493 362007 353834 347785 343895 342315 343053 346025 351349 359404 370563 384805 401385 418742
56954D18742J5966J2111N807k372j0938j7906k2020k3380k2756k0714j7718j4494
$$ 418742 434708 446819 452626 450254 439316 421410 399390 376010 353254 332540 314822 300328
56942C00328j1648r020o016k474J129M308P014R657J2801J6690K0866K4482K7056
$$ 300328 288680 279660 273644 271170 272299 276607 283621 293278 306079 322769 343635 368117 395173
56929C95173K8299K7090K1664J1637p93j2447k1612k8132l1862l2329k9842k5761
$$ 395173 423472 450562 472226 483863 483070 470623 449011 420879 389017 356688 326846 301085
56917C01085k1409j7455j4336j2365j1193j0007q525p227o478o046n598n032m157
$$ 301085 279676 262221 247885 235520 224327 214320 205795 198568 192090 186044 180446 175414 171257
56904A71257k770j260m94p98j527j898j708j089j03J094K158K900L433L889M503
$$ 171257 168487 167227 166733 165935 164408 162510 160802 159713 159610 160704 162862 165762 169195 173084 177587
56889A77587N938Q797J2583J5814J7547J8023J7446J5032J0064L360l223q386
$$ 177587 183525 192322 204905 220719 238266 256289 273735 288767 298831 302191 298968 290582
56877B90582j1764j3110j2209r665o755m199j665J225M107O558R002J2244J6442
$$ 290582 278818 265708 253499 243834 237079 232880 231215 232440 236547 243105 252107 264351 280793
56864B80793K1147K6191L1859L8095M4132M8979N1632N0587M3893L0687J2685
$$ 280793 301940 328131 359990 398085 442217 491196 542828 593415 637308 667995 680680
56853F80680o300k2459l3569l9061l9514l6283l1024k4970j8682j2451o531q20
$$ 680680 674380 651921 618352 579291 539777 503494 472470 447500 428818 416367 409836 409016
56841D09016N276J2226J9885K7831L6057M5006N4918O5275P4655Q0804Q0905P2226
$$ 409016 414292 426518 446403 474234 510291 555297 610215 675490 750145 830949 911854 984080
56829I84080N3240K5016q029l9170o2304p4746p7603p3905o6619n7879m8800l9518
$$ 984080 1037320 1062336 1054307 1015137 952833 878087 800484 726579 659960 602081 553281 513763
56817E13763k9884k0435j2201n385J115Q509J6912K5742L4651M3480N1600N7623
$$ 513763 483879 463444 451243 445858 446973 455482 472394 498136 532787 576267 627867 685490
56805F85490N9536N4947M2075K1458l403k7569m6892n9057o3603o1859n6342m9283
$$ 685490 745026 799973 842048 863506 860103 832534 785642 726585 662982 601123 544781 495498
56793D95498m1630l3744k6464k0666j6132j1746o771j316M305J0017J5740K1228
$$ 495498 453868 420124 393660 372994 356862 345116 338345 337029 341334 351351 367091 388319
56781C88319K6131K9799L1097K8834K2363J1800j770j5953k7648l4915l8029l8277
$$ 388319 414450 444249 475346 504180 526543 538343 536573 520620 492972 458057 420028 381751
56769C81751l6327l2521k8001k4198k1317j8479j5316j2440j0257q409o670n424
$$ 381751 345424 312903 284902 260704 239387 220908 205592 193152 182895 174486 167816 162392
56757A62392m913m689m211l493k927k860l371m053m147l373k415j986j752j023
$$ 162392 157479 152790 148579 145086 142159 139299 135928 131875 127728 124355 121940 119954 118202 117179
56743A17179j29k1o20q46l33O3k29o92q26q86j056r39n03m92j202j768j445p41
$$ 117179 117050 117029 116409 115563 115230 115293 115064 114372 113546 112660 111604 110665 110162 109670 108468 106700 105255 104514
56725A04514m98n55k21M85J018J247J306R84J53m21K37J817K775K091M13p56o44
$$ 104514 104016 103461 103240 103725 104743 105990 107296 108280 108433 108012 108249 110066 112841 114932 115345 114589 113945
56708A13945K18P08K89n26q31l51L94Q90J097J098P57Q9m59m86j22J88K36J57
$$ 113945 114163 114871 115160 114634 113803 113452 113846 114736 115833 116931 117688 117777 117318 116832 116710 116898 117134 117291
56690A17291J76L84N43J91p49j553j434o07m2q5j59J13K92Lm01m96m49n61p59
$$ 117291 117467 117851 118394 118585 117836 116283 114849 114242 114200 114115 113956 114069 114361 114364 113963 113467 113018 112457 111698
56671A11698r90j431j917j831j033k31J20M54J122J517J105M80N01R37R84O62
$$ 111698 110708 109277 107360 105529 104496 104265 104385 104839 105961 107478 108583 109063 109564 110501 111485 112147
56655A12147O38J002J239J191J101Q92L11l14m21j75k12n49n81k15j4j52j46K55
$$ 112147 112785 113787 115026 116217 117318 118210 118521 118207 117786 117611 117399 116850 116269 116054 116040 115888 115742 115997
56637A15997O41O85N86O00P65J188K046L117L846L994L703K987J823P29M48R46
$$ 115997 116638 117323 117909 118509 119274 120462 122508 125625 129471 133465 137168 140155 141978 142707 143155 144101
56621A44101J405J379J207J145R27M99L99R12J472J440R56N96O22R51J413J642
$$ 144101 145506 146885 148092 149237 150164 150663 151062 151974 153446 154886 155842 156438 157060 158011 159424 161066
56605A61066J150M1p48m08P25J551J371M00o77j181p83K29J036J088O72M73O92
$$ 161066 162216 162257 161509 161101 161826 163377 164748 165148 164471 163290 162507 162736 163772 164860 165532 166005 166697
56588A66697R48J000J069J321J401Q00l32j127q96qN09J91l40l18J30K71o8k75
$$ 166697 167645 168645 169714 171035 172436 173236 172904 171777 170881 170873 171382 171573 171233 170915 171045 171316 171248 170973
56570A70973J52R91J731K162K321K180J769J435J665K677M197N685O814P724Q716
$$ 170973 171125 172116 173847 176009 178330 180510 182279 183714 185379 188056 192253 197938 204752 212476 221192
56555B21192R592R558Q062N520K964J138K83M72J476K470K567J820J107Q62O26
$$ 221192 230784 240342 248404 253924 256888 258026 258309 258781 260257 262727 265294 267114 268221 269083 269709
56540B69709On59n56l01n14j264j922k101k152k662l762m947n509n140m237l500
$$ 269709 269715 269156 268600 268299 267785 266521 264599 262498 260346 257684 253922 248975 243466 238326 234089 230589
56524B30589l258l319l455l686m004m160l985l622l189k509j456l84J63J41M7
$$ 230589 227331 224012 220557 216871 212867 208707 204722 201100 197911 195402 193946 193562 193725 193866 193913
56509A93913L02P78J040Q46L43j89o22r94j313j522j629j738j851j880j899k127
$$ 193913 194215 194993 196033 196879 197222 197033 196411 195417 194104 192582 190953 189215 187364 185484 183585 181458
56493A81458k500k531j955j246j106j565j976j819j106j55N98O81P8m48p8R48
$$ 181458 178958 176427 174472 173226 172120 170555 168579 166760 165654 165499 166097 166778 166856 166408 166330 167278
56477A67278J504R81k7o07n21j04L35O69Q61J026J353J798K127K309K484K482
$$ 167278 168782 169763 169736 169129 168608 168504 168839 169508 170369 171395 172748 174546 176673 178982 181466 183948
56461A83948J856O51l59m92J35R56J625K096K386K579K760K811K488J846J230
$$ 183948 185804 186455 186096 185604 185739 186695 188320 190416 192802 195381 198141 200952 203440 205286 206516
56446B06516P60K40l12n29k81O6J88Q2k98j106j952j924p38O30J062N74Qk22l75
$$ 206516 207276 207516 207204 206675 206394 206460 206648 206730 206432 205326 203374 201450 200712 201342 202404 202978 202986 202764 202389
56427B02389p22j175j530j621j320o97o9L62P35J168J453J343R01L49r9j34M47
$$ 202389 201667 200492 198962 197341 196021 195324 195255 195617 196352 197520 198973 200316 201217 201566 201467 201333 201780
56410B01780J256J553J201Q57Q84Q29L47o6N9K64p9o66p43k54K97P61J245J469
$$ 201780 203036 204589 205790 206647 207531 208360 208707 208641 208700 208964 208885 208219 207476 207222 207519 208280 209525 210994
56392B10994J135O97Q55J409J478Q07k0n96j032j214o62O41J984K728K795K300
$$ 210994 212129 212826 213681 215090 216568 217375 217355 216759 215727 214513 213851 214492 216476 219204 221999 224299
56376B24299J380N33L72Q37J199J138J161J682K228K059J143J56l09k34M4K52
$$ 224299 225679 226212 226584 227421 228620 229758 230919 232601 234829 236888 238031 238187 237878 237644 237688 237940
56360B37940L89M97M02n6m82j04J089J950J515L52j97J54N00L29J59L82M96L0
$$ 237940 238329 238826 239228 239172 238690 238586 239675 241625 243140 243492 243295 243449 243949 244278 244437 244819 245315 245345
56342B45345n30m59O7K79K8L0Q72K261L396L830L711L336K770K038J426J222J219
$$ 245345 244815 244356 244423 244702 244730 244760 245632 247893 251289 255119 258830 262166 264936 266974 268400 269622 270841
56325B70841R70N64O83J616K714L165K922K530K402K588K826K511J162o97j793
$$ 270841 271811 272375 273058 274674 277388 280553 283475 286005 288407 290995 293821 296332 297494 296797 295004
56310B95004j692j379j650j788q64N05R64N09L88J113J951K352K567K722K525
$$ 295004 293312 291933 290283 288495 287631 288136 289100 289609 289997 291110 293061 295413 297980 300702 303227
56295C03227K094J990K083J562L83k80M60K085L467M014L677K696J715J471J933
$$ 303227 305321 307311 309394 310956 311339 311059 311519 313604 317071 321085 324762 327458 329173 330644 332577
56280C32577K328K316K420L093M015M628M715M266L485L037L568M758N652O010
$$ 332577 334905 337221 339641 342734 346749 351377 356092 360358 363843 366880 370448 375206 380858 386868
56266C86868O393O876O843O355O456P525Q465Q297P630P660Q543R633J0619J1600
$$ 386868 393261 400137 406980 413335 419791 427316 435781 444078 451708 459368 467911 477544 488163 499763
56252D99763J2564J3596J5175J7529K0207K2866K5993L0065L4409L7809L9994
$$ 499763 512327 525923 541098 558627 578834 601700 627693 657758 692167 729976 769970
56241G69970M1890M4363M7354N0172N2201N3209N3185N1971M9182M4642L8714
$$ 769970 811860 856223 903577 953749 1005950 1059159 1112344 1164315 1213497 1258139 1296853
56230A296853L1838K3956J4970N541l307j1366j9176k6804l3480l8538m1961m3863
$$ 1296853 1328691 1352647 1367617 1373158 1369851 1358485 1339309 1312505 1279025 1240487 1198526 1154663
56218A154663m4367m4061m3653m3040m1638l9608l7731l5943l3408l0177k7423
$$ 1154663 1110296 1066235 1022582 979542 937904 898296 860565 824622 791214 761037 733614
56207G33614k5568k3630k1052j8697j7294j6228j4827j3512j2594j1211q681n947
$$ 733614 708046 684416 663364 644667 627373 611145 596318 582806 570212 559001 550320 544373
56195E44373m361l863l573l355l579l912l574k516j359n05j00l08q92j060m86
$$ 544373 540012 536149 532576 529221 525642 521730 518156 515640 514281 513776 513676 513368 512476 511416 510930
56180E10930J90N21J059K198L074K741J670J032J068J226J364J733K197K452K588
$$ 510930 511120 511641 512700 514898 517972 520713 522383 523415 524483 525709 527073 528806 531003 533455 536043
56165E36043K735K654K399K607L414L862L316K640K979M124N153N874O568P059
$$ 536043 538778 541432 543831 546438 549852 553714 557030 559670 562649 566773 571926 577800 584368 591427
56151E91427P203P648Q868J0116J0469J0253J0343J0725J1011J1639J3153J4914
$$ 591427 598630 606278 615146 625262 635731 645984 656327 667052 678063 689702 702855 717769
56139G17769J5895J6356J7330J8916K0454K2157K5120K9860L5925M2935N0981
$$ 717769 733664 750020 767350 786266 806720 828877 853997 883857 919782 962717 1013698
56128A013698O0139P0361Q1509R2735J02277J08521J10750J08308J00288Q7127
$$ 1013698 1073837 1144198 1225707 1318442 1420719 1529240 1639990 1748298 1848586 1935713
56118A935713P1634N7134M5324L6791L2214L1179L0713K7013J8672P212m869j5251
$$ 1935713 2007347 2064481 2109805 2146596 2178810 2209989 2240702 2267715 2286387 2293599 2288730 2273479
56106B273479k2032k4776k5439k7063l1801m0698n4002p0095q5055r5113r9247
$$ 2273479 2251447 2226671 2201232 2174169 2142368 2101670 2047668 1977573 1892518 1797405 1698158
56095A698158r8308r2855q3499p2196o1093n0626m0417l1253k4226j8806j3692
$$ 1698158 1599850 1506995 1423496 1351300 1290207 1239581 1199164 1167911 1143685 1124879 1111187
56084A111187q990n602l194p80J334K314K891M515O948Q824J0032J1398J2589
$$ 1111187 1102197 1096595 1093401 1092621 1093955 1096269 1099160 1103675 1110623 1119447 1129479 1140877 1153466
56071A153466J2596J1936J2038J2843J3220J3418J4736J7037J8871J9831K0592
$$ 1153466 1166062 1177998 1190036 1202879 1216099 1229517 1244253 1261290 1280161 1299992 1320584
56060A320584K0962K0177J8846J8295J8245J7451J6221J5873J6081J5355J3884
$$ 1320584 1341546 1361723 1380569 1398864 1417109 1434560 1450781 1466654 1482735 1498090 1511974
56049A511974J3283J3743J4067J4283J5561J7611J8926J9578K1046K3339K4954
$$ 1511974 1525257 1539000 1553067 1567350 1582911 1600522 1619448 1639026 1660072 1683411 1708365
56038A708365K5732K6990K8912L0503L2086L4951L8480M0558M1015M1814M3707
$$ 1708365 1734097 1761087 1789999 1820502 1852588 1887539 1926019 1966577 2007592 2049406 2093113
56027B093113M5485M6607M7768M8846M9118M9453N1376N4036N5190N5064N6156
$$ 2093113 2138598 2185205 2232973 2281819 2330937 2380390 2431766 2485802 2540992 2596056 2652212
56016B652212N9278O2915O6346P0135P3727P5930P7703Q1151Q6041R0499R4610
$$ 2652212 2711490 2774405 2840751 2910886 2984613 3060543 3138246 3219397 3305438 3395937 3490547
56005C490547R9711J04988J08749J12258J18061J25352J31561J37550J46203J56638
$$ 3490547 3590258 3695246 3803995 3916253 4034314 4159666 4291227 4428777 4574980 4731618
55995D731618J65434J73019J82981J95380K06808K17174K30078K46162K62355
$$ 4731618 4897052 5070071 5253052 5448432 5655240 5872414 6102492 6348654 6611009
55986F611009K78185K96510L17628L39184L62218L90541M23774M58086M94080
$$ 6611009 6889194 7185704 7503332 7842516 8204734 8595275 9019049 9477135 9971215
55977I971215N36472N85851O38813O96513P64483Q43668R30744J027765J141861
$$ 9971215 10507687 11093538 11732351 12428864 13193347 14037015 14967759 15995524 17137385
55968A7137385J275276J426268J600302J809048K058372K350089K696199L117761
$$ 17137385 18412661 19838929 21439231 23248279 25306651 27656740 30352939 33470700
55960C3470700L629553M240884M971610N850579O900326Q146209R643709J1476213
$$ 33470700 37100253 41341137 46312747 52163326 59063652 67209861 76853570 88329783
55952H8329783J3727770J6482344J9833687K3828299K8347022L3011683L7106979
$$ 88329783 102057553 118539897 138373584 162201883 190548905 223560588 260667567
55945B60667567L9448062L8373027L2270050K0659148N047258j1379754k5212084
$$ 260667567 300115629 338488656 370758706 391417854 396465112 385085358 359873274
55938C59873274l4327783l8408557l8418684l5769833l1757344k7335452k3080992
$$ 359873274 325545491 287136934 248718250 212948417 181191073 153855621 130774629
55931A30774629j9264610j5977541j3227804j0971534r130288p626418o403062
$$ 130774629 111510019 95532478 82304674 71333140 62202852 54576434 48173372
55924D8173372n411101m599376l927797l374247k920000k541086k219306j948153
$$ 48173372 42762271 38162895 34235098 30860851 27940851 25399765 23180459 21232306
55916B1232306j721317j526542j355476j208362j083943r74767q76475p91840
$$ 21232306 19510989 17984447 16628971 15420609 14336666 13361899 12485424 11693584
55908A1693584p21293o58725o00564n50149n09157m72880m37843m06189l78932
$$ 11693584 10972291 10313566 9713002 9162853 8653696 8180816 7742973 7336784 6957852
55899F957852l52446l25227l00978k81372k62621k42551k24472k10470j97273
$$ 6957852 6605406 6280179 5979201 5697829 5435208 5192657 4968185 4757715 4560442
55890D560442j82380j68365j57483j47449j36102j25102j15740j05845r3958q2013
$$ 4560442 4378062 4209697 4052214 3904765 3768663 3643561 3527821 3421976 3328018 3246005
55880C246005p0958n8335m3054k8151j5932m791O159J3424J3282N992o969k6178
$$ 3246005 3175047 3116712 3073658 3045507 3029575 3024784 3030943 3044367 3057649 3063641 3056672 3030494
55868C030494n1592p9446j04644j24043j35742j38290j32844j23441j13147j02056
$$ 3030494 2978902 2899456 2794812 2670769 2535027 2396737 2263893 2140452 2027305 1925249
55858A925249r0160p9169p0081o1887n4111m7886m3396l9269l5485l3772l4042
$$ 1925249 1835089 1755920 1685839 1623952 1569841 1521955 1478559 1439290 1403805 1370033 1335991
55847A335991l3848l2454l1932l2991l3346l1724k9942k9265k8179k5665k3301
$$ 1335991 1302143 1269689 1237757 1204766 1171420 1139696 1109754 1080489 1052310 1026645 1003344
55836A003344k2167k0855j8518j6879j7114j7612j6860j5809j5493j4942j3360
$$ 1003344 981177 960322 941804 924925 907811 890199 873339 857530 842037 827095 813735
55825H13735j1845j1178j0447r404r606j1545j3316j3690j3804j4344j3990j2339
$$ 813735 801890 790712 780265 770861 761255 749710 736394 722704 708900 694556 680566 668227
55813F68227j1287j1651j1418r425p662p668p612n536k831j693j539p01M73R24
$$ 668227 656940 645289 633871 624446 616784 609116 601504 595968 593137 591444 589905 589204 589677 590601
55799E90601J326K613L736L402K435K079J552m18l159n289o981q885j0244j0136
$$ 590601 591927 594540 598276 601678 604113 606192 607744 607326 604167 598878 591897 583012 572768 562632
55785E62632r242q508p423n353l225k207k215l200o045j0470j3872j4246j2569
$$ 562632 553390 544882 537459 532106 528881 526674 524459 521259 515214 504744 490872 476626 464057
55772D64057j0615q325n261k595j269OK525M936N153L480J584j95k220l732m027
$$ 464057 453442 445117 439856 437261 435992 435998 438523 443459 448612 452092 453676 453481 451261 447529 443502
55757D43502m177n314o486o493o368p593r220r381q493q293q696q319p309o913
$$ 443502 439325 434011 427525 421032 414664 407071 397851 388470 379977 371684 362988 354669 347360 340447
55743C40447o966o347n453n531o074n456l826k837k717k163j051p39j490j976
$$ 340447 333481 327134 321681 316150 310076 304620 300794 297957 295240 293077 292026 291287 289797 287821
55729B87821j686j705k612l582l967m194m558m644m330m074l916l399k625k237
$$ 287821 286135 284430 281818 278236 274269 270075 265517 260873 256543 252469 248553 245154 242529 240292
55715B40292k329k355k143j999j882j483q25K2J422L360M767M761L927L164K063
$$ 240292 237963 235608 233465 231466 229584 228101 227276 227298 228720 232080 236847 241608 245535 248699 250762
55700B50762j05k551l847m142m706n639n824n048m296l921l222k082j418j594
$$ 250762 250657 248106 244259 240117 235411 229772 223948 218900 214604 210683 207461 205379 203961 202367
55686B02367j815j477r81p48m92J40R72J653J992J894J522J347J492J298K39j183
$$ 202367 200552 199075 198094 197346 196854 196994 197966 199619 201611 203505 205027 206374 207866 209164 209403 208220
55670B08220k183k833l564m054l667k572j472o17k0m6p37j063j16J422K225K251
$$ 208220 206037 203204 199640 195586 191919 189347 187875 187258 187238 187192 186455 185392 185276 186698 188923 191174
55654A91174K459K964K966K288J657J464J479J695K245K546J703j53j915k911
$$ 191174 193633 196597 199563 201851 203508 204972 206451 208146 210391 212937 214640 214487 212572 209661
55640B09661l394l744m147m857n823o269n575m307l464l065k474j774j579j767
$$ 209661 206267 202523 198376 193519 187696 181427 175852 171545 168081 165016 162542 160768 159189 157422
55626A57422j626j141r29r92o62J86Q89R44M27m62j391j760j444j249j755k231
$$ 157422 155796 154655 153726 152734 152072 152258 153147 154091 154518 154056 152665 150905 149461 148212 146457 144226
55610A44226j796j031j058j523j155rM96j56r00r09o36o63q03q07q51r56q59o71
$$ 144226 142430 141399 140341 138818 137663 137654 138150 137994 137094 136185 135549 134886 134083 133276 132425 131469 130610 129939
55592A29939q51j334j543j346j124r33n19j32l11q43r72o35m48m73j50M70O41
$$ 129939 129088 127754 126211 124865 123741 122808 122289 122157 121846 121003 120031 119396 118948 118475 118325 118795 119436
55575A19436K17j4L82Q75R39O56K11l20n25M0R14J020J02r72j484j541j390j065
$$ 119436 119653 119639 120021 120896 121835 122491 122702 122382 121857 121897 122811 123831 123933 122961 121477 119936 118546 117481
55557A17481q84j263j890j938j365r86j102j070n26rK6j07o8mK5L05P57P07j19
$$ 117481 116597 115334 113444 111506 110141 109155 108053 106983 106457 106448 106474 106367 106299 106295 106320 106625 107382 108089 107970
55538A07970j079j442j160n40J53N27K10m39n30J61Q22Q40O29P82J018O68k37
$$ 107970 106891 105449 104289 103749 103902 104429 104639 104200 103670 103831 104653 105493 106122 106904 107922 108590 108353
55521A08353j029j296j300j420j560j209j14J163J600Q71j98o07l32p0k04n91
$$ 108353 107324 106028 104728 103308 101748 100539 100425 101588 103188 104059 103861 103254 102922 102852 102648 102057
55505A02057j100j701k096j944j376q58o07n40o26p90q11p66j144j971k301j368
$$ 102057 100957 99256 97160 95216 93840 92982 92375 91835 91209 90419 89608 88842 87698 85727 83426 82058
55489H2058J50R45P85N90Q92J261J180O63rn55o60k54K77O24J000J578K001K015
$$ 82058 82208 83153 83938 84528 85420 86681 87861 88524 88515 87960 87300 87046 87323 87947 88947 90525 92526 94541
55471I4541J988K051J451j82j630j481j97N22J87j51J45M75L17L9N6K14K83K60
$$ 94541 96529 98580 100031 99849 98219 96738 96541 97063 97250 97099 97244 97719 98036 98075 98131 98345 98628 98888
55453I8888M3m50q41p28l48j16J59O93Q20j12j359j574p19J52O74J253J619J001
$$ 98888 98931 98481 97640 96912 96564 96448 96607 97300 98120 98008 96649 95075 94356 94508 95182 96435 98054 99055
55435I9055k67r14o74n18p57o31L0L44J25L69J407K019J268j07r42j149j169r67
$$ 99055 98788 97874 97200 96682 95925 95294 95324 95668 95793 96162 97569 99588 100856 100749 99807 98658 97489 96522
55417I6522l57M25J084J534J568J025N20R19J923K241J399J92p87j752k515k303
$$ 96522 96165 96590 97674 99208 100776 101801 102321 103240 105163 107404 108803 108995 108208 106456 103941 101638
55401A01638j246o67j149j710j514j104j119j139p67n63q98r82j78P25N95l99
$$ 101638 100392 99725 98576 96866 95352 94248 93129 91990 91223 90660 89762 88780 88602 89327 89922 89523
55385H9523j256j525j347p92k8M38M43M94Q85J126Q68N35M80L83J03K09R46J542
$$ 89523 88267 86742 85395 84603 84575 85013 85456 85950 86835 87961 88829 89364 89844 90227 90330 90539 91485 93027
55367I3027J302O48K54J1m07o96n27k37j48J16Q48J474J332O55M5l80o88n88K8
$$ 93027 94329 94977 95231 95242 94835 94139 93612 93375 93227 93343 94191 95665 96997 97652 97697 97317 96629 96041 96069
55348I6069O50Q49Q61Q71M71m90j273j181n81k63l36l84j94J25K98j20j182j897
$$ 96069 96719 97568 98429 99300 99771 99281 98008 96827 96246 95983 95647 95263 95069 95194 95492 95372 94190 92293
55330I2293j154M77J175M35k60M8L41l19r46m11L92k2j156j273j27Q67R00N72
$$ 92293 91139 91616 92791 93226 92966 93014 93355 93036 92090 91679 92071 92049 90893 89620 89493 90360 91260 91832
55312I1832M64M21K64J07j33o43j132j127p12k79J77P76J190J106Q44P75O25J49
$$ 91832 92296 92717 92981 93088 92955 92312 91180 90053 89341 89062 89239 90015 91205 92311 93155 93930 94555 94704
55294I4704j28K58P04L96l42o60o08q33j183r02M0Q97J313J504J436Q83J88k8
$$ 94704 94576 94834 95538 95934 95592 94932 94324 93491 92308 91406 91446 92343 93656 95160 96596 97479 97667 97639
55276I7639J35Pn71j135j385j276o04N69J326P98m67j012l40O60J136J118R16
$$ 97639 97774 97781 97210 96075 94690 93414 92810 93379 94705 95503 95036 94024 93684 94344 95480 96598 97514
55259I7514O21M48P76J520K039J859J103K06l76l44J33L95k0q45j535j913j936
$$ 97514 98135 98583 99359 100879 102918 104777 105880 106086 105710 105366 105499 105894 105874 105029 103494 101581 99645
55242I9645j394m22K36J23k29j68J01J17J27M86P11K17m54l40L59O23K74K3km45
$$ 99645 98251 97829 98065 98188 97959 97791 97892 98009 98136 98622 99333 99550 99096 98756 99115 99738 100012 100035 100033 99588
55222I9588j298j568p94J80L99k9l73k70J23N15P73J018J447J879J764J001L02
$$ 99588 98290 96722 95928 96108 96507 96478 96105 95835 95958 96473 97246 98264 99711 101590 103354 104355 104657
55205A04657K24K99j56q44r66n12j20M8L00N34L73L8L7J23l82j291j672j309r47
$$ 104657 104881 105180 105024 104180 103214 102702 102582 102630 102930 103464 103837 103875 103912 104035 103653 102362 100690 99381 98434
55186I8434r90r79o17k88k55j70K25O96J025J293J428J177P15N88Q72J076R79
$$ 98434 97444 96465 95848 95560 95305 95135 95360 96056 97081 98374 99802 100979 101694 102282 103154 104230 105209
55169A05209Q45O94J43p94j492j560j262r21n37j80j34l33l14J25P02J256J854
$$ 105209 106054 106748 106891 106097 104605 103045 101783 100862 100325 100145 100011 99678 99364 99489 100191 101447 103301
55152A03301K176J614K40r56j245r85q59q52m91K65R17J092R20P34O70N59J76
$$ 103301 105477 107091 107331 106375 105130 104145 103286 102434 101943 102208 103125 104217 105137 105871 106541 107100 107276
55135A07276m34r74j216j120o95p3K08m15j627k316j948j209q35n65Q9P21O55
$$ 107276 106842 105868 104652 103532 102837 102764 102972 102557 100930 98614 96666 95457 94622 94057 94146 94867 95522
55118I5522J18k30l95p02p49O4J265J801J621J568J799J647J089R45J332J246
$$ 95522 95640 95410 95015 94313 93564 93628 94893 96694 98315 99883 101682 103329 104418 105363 106695 107941
55102A07941J59j115j681j661j457q92J89J196J509J418J643K263K667K368J491
$$ 107941 108100 106985 105304 103643 102186 101294 101483 102679 104188 105606 107249 109512 112179 114547 116038
55087A16038N52k5l05o77j206j358p56R5M24K45J27J14k75j020j469j340j057
$$ 116038 116590 116565 116260 115583 114377 113019 112263 112358 112782 113027 113154 113268 112993 111973 110504 109164 108107
55070A08107r43p54k13N81J330J703J418O13p0l38p83j813k561j957m81L70K08
$$ 108107 107164 106410 106197 106778 108108 109811 111229 111842 111772 111434 110651 108838 106277 104320 103839 104209 104417
55053A04417K3M01Q55J026J123R59lj296j543m48O85Q98Q02J169J666J682J332
$$ 104417 104440 104841 105696 106722 107845 108804 108801 107505 105962 105514 106199 107097 107899 109068 110734 112416 113748
55036A13748Q02j11j061r22M85J602J176J07L3R34J429Q94m7p54j085r34l24J94
$$ 113748 114550 114439 113378 112456 112941 114543 115719 115826 115859 116793 118222 119116 119069 118315 117230 116296 115972 116166
55018A16166P2l71m28j00L4k18n64q63j065p52M19J908K676K394J587P05k27j033
$$ 116166 116238 115867 115439 115339 115373 115155 114591 113728 112663 111911 112330 114238 116914 119308 120895 121600 121373 120340
55000A20340j233p00K6L49K10k4k8K30M82M20J9m32p25r47j127j046n73j5K14
$$ 120340 119107 118407 118433 118782 118992 118968 118940 119170 119652 120072 120091 119659 118934 117987 116860 115814 115241 115226 115440
54981A15440N6l17q19j323j483j020j67N10O97N81N37P22R73J059R85R68J055
$$ 115440 115496 115179 114360 113037 111554 110534 110367 110877 111574 112155 112692 113414 114387 115446 116431 117399 118454
54964A18454J028Q09O59O43L59l65q34l06Q12J376J120R02J345K021K243J900
$$ 118454 119482 120291 120950 121593 121952 121587 120753 120447 121259 122635 123755 124657 126002 128023 130266 132166
54948A32166J250M74k47p67j205j572j317m4J347J327k23j708j889j279q67o08
$$ 132166 133416 133890 133643 132876 131671 130099 128782 128738 130085 131412 131189 129481 127592 126313 125446 124838
54932A24838Q3J101J869K236K476K672K755K767K722K591K709L629N309P061Q546
$$ 124838 124921 126022 127891 130127 132603 135275 138030 140797 143519 146110 148819 152448 157757 164818 173364
54917A73364R953J0982J0704Q982O973N449L656P12k802n695p757r343j0094r449
$$ 173364 183317 194299 205003 213985 220958 226407 230063 230775 227973 222278 214521 205178 195084 185635
54903A85635p975o877o378n684m488l374k716k227j674j263j086r26o80m67k35
$$ 185635 177660 170783 164405 158721 154233 150859 148143 145916 144242 142979 141893 140967 140287 139820 139585
54888A39585J55N22M97J35r4K46J290K906M532N378N213M757M873N697O910Q231
$$ 139585 139740 140262 140759 140894 140800 141046 142336 145242 149774 155152 160365 165122 169995 175692 182602 190833
54872A90833R216R156P880O113M332J979j356m700o820q025r414j0711j0447q360
$$ 190833 200049 209205 217085 223198 227530 229509 228153 223453 216633 208608 199194 188483 178036 169676
54858A69676o114n145n062m705l757k678j858j498j674k004j804j029n05p73j321
$$ 169676 163562 158417 153355 148650 144893 142215 140357 138859 137185 135181 133377 132348 131843 131070 129749
54843A29749j446j317j557k147k411j889p57M62J182R18k87j613j988j072M02
$$ 129749 128303 126986 125429 123282 120871 118982 118225 118687 119869 120787 120500 118887 116899 115827 116229
54828A16229J290J030P8n62l22M16Q57P05L32J19N0M1J92M35L24l39r41o54M07
$$ 116229 117519 118549 118627 118065 117743 118159 119016 119721 120053 120172 120222 120263 120455 120890 121214 120875 119934 119280 119687
54809A19687J211J202J062J612K357J964J63j627j924q69K54O69O12M58J97j83
$$ 119687 120898 122100 123162 124774 127131 129095 129258 127631 125707 124838 125092 125761 126373 126831 127028 126845
54793A26845m85o65q85r54l15J134K541K806J689Q2p32j17J270K037J451K51l18
$$ 126845 126360 125695 124810 123856 123541 124675 127216 130022 131711 131793 131061 130944 132214 134251 135702 135953 135635
54776A35635j6M35O29R05J449J903K118K542L456M504N335O154P233Q443R588
$$ 135635 135619 136054 136683 137588 139037 140940 143058 145600 149056 153560 158895 165049 172282 180725 190313
54761A90313J0627J1172J0392P970M675J587r16l082n186p255r019r881r443q185
$$ 190313 200940 212112 222504 230474 235149 236736 235820 232738 227552 220297 211278 201397 191954 183769
54747A83769p045o198n049l454k101j326o60Q3L70R7M7N06O06j16o49j29N97L23
$$ 183769 176724 170526 165477 162023 159922 158596 157936 158019 158389 158486 158533 159039 159645 159529 158880 158751 159348 159671
54729A59671m89m39P23K115L251M137M395L819L461M630O937Q716R150Q657P350
$$ 159671 159182 158743 159466 161581 164832 168969 173364 177183 180644 185274 192211 200927 210077 218734 226084
54714B26084M818J444j609m016o441q771r755q967p634o862o315n431m670m550
$$ 226084 230902 232346 230737 226721 220280 211509 201754 192787 185153 178291 171976 166545 161875 157325
54700A57325m462l618k415j760j607j281q33r05j436j589j071n85o47p97m41P4
$$ 157325 152863 149245 146830 145070 143463 142182 141349 140444 139008 137419 136348 135763 135116 134319 133878 133952
54684A33952n7q06j266r43m93o73j120q39K85J266J406J097Q92O05r7q17r35n94
$$ 133952 133895 133089 131823 130880 130387 129714 128594 127755 128040 129306 130712 131809 132701 133306 133209 132392 131457 130863
54666A30863m63p06q94p87n46k52J65N45N60J99k45n96q21p39j41Q23J709K152
$$ 130863 130400 129694 128800 128013 127467 127215 127380 127925 128485 128684 128439 127843 127022 126283 126142 126965 128674 130826
54648A30826J987J332P27P64J200J030j04j154r69J27Q93Q44M74J85q2k52p0L38
$$ 130826 132813 134145 134872 135636 136836 137866 137762 136608 135639 135766 136659 137503 137977 138162 138080 137828 137758 138096
54630A38096N74N94N60L50j55n44m10j74n13j144j116k60N62O54J64m04o70m27
$$ 138096 138670 139264 139824 140174 140019 139475 139065 138891 138378 137234 136118 135858 136420 137074 137238 136834 136164 135737
54612A35737Q0J15o06j267j046m54n13r83o69O27J793K068J763J193K78o44q51
$$ 135737 135817 135932 135326 134059 133013 132559 132046 131063 130394 131021 132814 134882 136645 137838 138116 137472 136621
54595A36621m88n41j254j724j433r09m48M50J733K151R63p91j597j283o37p6L83
$$ 136621 136133 135592 134338 132614 131181 130272 129824 130274 132007 134158 135121 134330 132733 131450 130813 130737 131120
54578A31120M91N9n69j019j432j870j794q69K65P67P09O94Q54R43J009J197J128
$$ 131120 131611 131670 131101 130082 128650 126780 124986 124117 124382 125149 125858 126552 127406 128349 129358 130555 131683
54561A31683L46p94j375j047l35J23K01J30J11K02L25L80L42K29pl06l32J48P44
$$ 131683 132029 131235 129860 128813 128478 128601 128802 128932 129043 129245 129570 129950 130292 130521 130514 130208 129876 130024 130768
54542A30768Q15L75O6K31N91R12J252J411R25m8n64r6P24J042Q53O85P39Q72J021
$$ 130768 131583 131958 132024 132255 132846 133758 135010 136421 137346 137298 136734 136638 137362 138404 139257 139942 140681 141553 142574
54523A42574J120R91O59M31L52K5o41j070p96k11Lk38m93m90k47J34M65N08K85
$$ 142574 143694 144685 145344 145775 146127 146152 145511 144441 143645 143434 143437 143199 142706 142216 141969 142103 142568 143076 143361
54504A43361J10P2j14n39q75r38j032j338j451r21N1P66P09j66j353j945j323
$$ 143361 143471 143543 143429 142890 142015 141077 140045 138707 137256 136335 136386 137152 137861 137695 136342 134397 133074
54487A33074P7J121J264R95Q58P43M19J35J92M44O23P80R87J078R15O46M28L07
$$ 133074 133151 134272 135536 136531 137389 138132 138551 138686 138878 139322 139945 140725 141712 142790 143705 144351 144779 145086
54469A45086M31Q54J132P71R7o3L33N14K65K32N77N48j01m51Q2O83M15l57q00
$$ 145086 145517 146371 147503 148274 148371 148308 148641 149155 149420 149652 150229 150777 150676 150225 150307 150990 151405 151048 150248
54450A50248r31j115j050m26N6m54j544k055j685j073o09j96J00J39K55P98J389
$$ 150248 149317 148202 147152 146726 146782 146328 144784 142729 141044 139971 139362 139166 139266 139405 139660 140458 141847
54433A41847J387R08N52M18K03L2K38N93N74K70J75K85K29O4Q5O7m23j055j059
$$ 141847 143234 144142 144694 145112 145315 145347 145585 146178 146752 147022 147197 147482 147711 147775 147860 147927 147504 146449 145390
54414A45390l36N04J117J483J253J20j183j416n30K78L69M53J188K062K327K109
$$ 145390 145054 145558 146675 148158 149411 149531 148348 146932 146402 146680 147049 147502 148690 150752 153079 155188
54398A55188J901J562O64m66r09k45R51J792J885J421P32j2o91j059r71p47q55
$$ 155188 157089 158651 159315 158849 157940 157695 158646 160438 162323 163744 164476 164464 163773 162714 161743 160996 160141
54381A60141j123p69M36J512J360J38r94j279q91l16J25J90j58n42n83n31r26
$$ 160141 159018 158249 158685 160197 161557 161695 160701 159422 158531 158215 158340 158530 158372 157830 157247 156716 155790
54364A55790j687k096j731r18j78L06N72P06Q40R91Q33P9q98j292p89J16P90J107
$$ 155790 154103 152007 150276 149358 149180 149486 150058 150764 151604 152595 153428 153507 152609 151317 150528 150644 151434 152541
54346A52541J228J162P03k58j482k345k244j232j15K99m8o45j131j467j597j344
$$ 152541 153769 154931 155634 155376 153894 151549 149305 148073 147958 148257 148209 147564 146433 144966 143369 142025
54330A42025o87J23P07P49J93n99j051q91l31K42M98J88n51r52l11R11J483J074
$$ 142025 141338 141461 142168 142917 143110 142511 141460 140569 140238 140480 140978 141166 140615 139663 139352 140263 141746 142820
54312A42820O09O38M65l87r66k79R22J111K49k54K98J083J160N82j29p06j099
$$ 142820 143429 144067 144532 144145 143179 142900 143822 144933 145182 144928 145226 146309 147469 148051 147922 147216 146117
54295A46117j287j311j113m58N44J154R05L68L61P17P44M72M63O13L03l22l93
$$ 146117 144830 143519 142406 141948 142492 143646 144551 144919 145280 145997 146741 147213 147676 148289 148592 148270 147877
54278A47877L39J168J582J755J800J468P64J14k33k30L52J470K179J597L62o3
$$ 147877 148216 149384 150966 152721 154521 155989 156753 156867 156634 156404 156756 158226 160405 162002 162364 162301
54262A62301M35O03N9m2R28J889J755J063Q90J216J318R33J13j291l021m009l539
$$ 162301 162736 163339 163398 163356 164284 166173 167928 168991 169881 171097 172415 173348 173461 172170 169149 165140 161601
54245A61601k320j538j385j351j440j985k639k547j537m13j0m64j278j667j061
$$ 161601 159281 157743 156358 155007 153567 151582 148943 146396 144859 144446 144436 143972 142694 141027 139966
54230A39966K56J229J162M63PR4M57Q45J046P98K73J75Q07J422J234O10M51P06
$$ 139966 140222 141451 142613 143076 143083 143177 143634 144479 145525 146323 146596 146771 147578 149000 150234 150844 151295 152001
54212A52001M90l87j035q21k66j86o27j073j271j359j373j096m16L67P70O05J75
$$ 152001 152491 152104 151069 150248 149982 149796 149169 148096 146825 145466 144093 142997 142581 142948 143718 144323 144498
54195A44498j25k72m44m89l1Q83J652J870J746J530J007R4o32n82m3K14O3K7K75
$$ 144498 144373 144101 143657 143168 143137 144020 145672 147542 149288 150818 151825 151919 151287 150705 150662 150876 150939 150966 151241
54176A51241L75J92K18O80R48L52p80j446j150l47K39L35J65P8K15L79J90m87
$$ 151241 151616 151808 152026 152706 153654 154006 153226 151780 150630 150283 150522 150857 151022 151100 151315 151694 151884 151397
54158A51397j274j688j781k039k516k496j425J29J038J021Q19R12R03N04L46R88
$$ 151397 150123 148435 146654 144615 142099 139603 138178 138307 139345 140366 141185 142097 143000 143504 143850 144838
54142A44838J735J436K21n28n2Q97J309J179J019Q29L03l84p27o57o02p30p61
$$ 144838 146573 148009 148230 147702 147650 148547 149856 151035 152054 152883 153186 152802 152075 151418 150816 150086 149325
54125A49325m97j77j13k72l96l01N5N87J051J145Q70O56R34J585K035K019J901
$$ 149325 148828 148651 148538 148266 147870 147569 147624 148211 149262 150407 151277 151933 152867 154452 156487 158506 160407
54108A60407K122K515K514J890Q94j77j124j601j383r86j273k172k473j478r9
$$ 160407 162529 165044 167558 169448 170342 170165 169041 167440 166057 165071 163798 161626 159153 157675 157576
54093A57576L39q8k80J10L07j46p07p76n06k30J35P12J158J084O43K95K51M26
$$ 157576 157915 157827 157547 157657 157964 157818 157111 156335 155829 155599 155734 156446 157604 158688 159331 159626 159877 160303
54075A60303O93R38J005Q28N30K87K07L33N88P26N70K79J10J5k30n63o71m37J
$$ 160303 160996 161934 162939 163767 164297 164584 164791 165124 165712 166438 167008 167287 167397 167412 167182 166619 165948 165511 165512
54056A65512N72J234J707J737J560J655J965J956J469R68Q43R38R44Q22O80O97
$$ 165512 166084 167318 169025 170762 172322 173977 175942 177898 179367 180335 181178 182116 183060 183882 184562 185259
54040A85259J178K217L267L635L508L774M719N612N875N873O066O126N603M897
$$ 185259 186437 188654 191921 195556 199064 202838 207557 213169 219044 224917 230983 237109 242712 247609
54026B47609M819N417O011O200O128N778M796L265K074K001K679K918K111Q87
$$ 247609 252428 257845 263856 270056 276184 281962 286758 290023 292097 294098 296777 299695 301806 302693
54012C02693K00R6j18p46j349j655k100l052m092m631m800n069n389n395n164
$$ 302693 302893 302989 302871 302125 300776 299121 297021 293969 289877 285246 280446 275377 269988 264593 259429
53997B59429n017m763l976k877k117j768j334p71n99r67j448j842k348k774k510
$$ 259429 254412 249649 245673 242796 240679 238911 237577 236806 236207 235240 233792 231950 229602 226828 224318
53982B24318j587q60q79j299j685k046k344k265j856j590j525j249q80j128j960
$$ 224318 222731 221871 220992 219693 218008 215962 213618 211353 209497 207907 206382 205133 204253 203125 201165
53967B01165k310j646q20o38o69k69J77P4j96M4M79L67q3l2N99J086J108J069
$$ 201165 198855 197209 196389 195751 195082 194813 194990 195064 194868 194912 195391 195758 195675 195643 196242 197328 198436 199505
53949A99505J317J751K195K471K262J496P06M36N71P04Q37J173J485J469J384
$$ 199505 200822 202573 204768 207239 209501 210997 211703 212139 212710 213414 214251 215424 216909 218378 219762
53934B19762J646K093K286K332K649L149L435L594M030M605M771M520M489N015
$$ 219762 221408 223501 225787 228119 230768 233917 237352 240946 244976 249581 254352 258872 263361 268376
53920B68376N788O493P153P721P893P560P051O731O756P181P941Q699R049Q979
$$ 268376 274164 280657 287810 295531 303424 310984 318035 324766 331522 338703 346644 355343 364392 373371
53906C73371Q838Q827Q773Q399P575O366M979L558K006K33j308j825j190l09j02
$$ 373371 382209 391036 399809 408208 415783 422149 427128 430686 432692 432925 431617 429792 428602 428293 428191
53891D28191m98q09p61o64q55j342j832j839j126j09O71J614L647O382P690N914
$$ 428191 427693 426884 426123 425459 424604 423262 421430 419591 418465 418356 419027 420641 424288 430670 438360 444274
53875D44274J753k947p374j1605j5083j6817j6907j6462j5967j4941j3249j1563
$$ 444274 446027 443080 435706 424101 409018 392201 375294 358832 342865 327924 314675 303112
53863C03112j0299r130p844o718n802m752l637l062l151l220k851k447k408k490
$$ 303112 292813 283683 275839 269121 263319 258567 254930 251868 248717 245497 242646 240199 237791 235301
53849B35301k467k644l139l342k729j752j255j320j318r56o26p21j037j076o91
$$ 235301 232834 230190 227051 223709 220980 219228 217973 216653 215335 214379 213753 213032 211995 210919 210228
53834B10228k35n2l7J32L80K64k65n82k56K37J48m58q61p19l52n8J80L42K64k2
$$ 210228 209993 209941 209904 210036 210416 210680 210415 209833 209577 209814 209962 209504 208643 207924 207572 207514 207694 208036 208300 208278
53814B08278l01m98o02l57M02J230J501J331J469K194K908K986K596K455L155
$$ 208278 207977 207479 206877 206520 206922 208152 209653 210984 212453 214647 217555 220541 223137 225592 228747
53799B28747M661O227O900O485N813N716O070O338O501O653O226M743L068K646
$$ 228747 233408 239635 246535 253020 258833 264549 270619 276957 283458 290111 296337 301080 304148 306794
53785C06794L409L762K872J666J146Q95P1j155k050k469k751k962l048l278l882
$$ 306794 310203 313965 316837 318503 319649 320544 320615 319460 317410 314941 312190 309228 306180 302902 299020
53770B99020m602n094n425n663n469m645l667l100k856k585k466k893l671m149
$$ 299020 294418 289324 283899 278236 272767 268122 264455 261355 258499 255914 253448 250555 246884 242735
53756B42735l988l374k591j894j593j771k086k265k555l203l711l274j858k97
$$ 242735 238747 235373 232782 230888 229295 227524 225438 223173 220618 217415 213704 210430 208572 208275
53742B08275O91J033Q82K52o93j454j602j241q37o66n53j33O70J428J587J116
$$ 208275 208966 209999 210881 211133 210440 208986 207384 206143 205306 204640 204087 203954 204624 206052 207639 208755
53726B08755N88N16P93R95J077J347J830K053J605P41J48J76N04O30M93M56P33
$$ 208755 209343 209859 210652 211647 212724 214071 215901 217954 219559 220300 220448 220624 221128 221758 222251 222707 223440
53709B23440J147J497J862K268K390J993J473J510K146K789L145L644M686O001
$$ 223440 224587 226084 227946 230214 232604 234597 236070 237580 239726 242515 245660 249304 253990 259991
53695B59991P100Q023R146J0565J2123J3907J6092J8097J8404J5614R677K005
$$ 259991 267091 275114 284260 294825 306948 320855 336947 355044 373448 389062 398739 400744
53683D00744n464j1168j4289j4871j3837j2500j1620j0912r725p983o217m788
$$ 400744 395280 384112 369823 354952 341115 328615 316995 306083 296358 288375 282158 277370
53671B77370l654k869k694k980l069k656k216k161k048j312l21L0l67p13m63J12
$$ 277370 273716 270847 268153 265173 262104 259448 257232 255071 253023 251711 251390 251420 251053 250340 249877 249989
53655B49989N46P07N31j70j303k257k400j642m35N86R73P52M03K96L22K03j8j73
$$ 249989 250535 251242 251773 251603 250300 248043 245643 244001 243566 244152 245125 245877 246280 246576 246898 247101 247083 246910
53637B46910l84p59r09l88N04J077J257J586K146K365J904J080K14o13r61j11
$$ 246910 246526 245767 244858 244470 244974 246051 247308 248894 251040 253405 255309 256389 256603 255990 255029 254918
53621B54918J760L285L428K627J893J470J156J322K512M203N047M592L895M115
$$ 254918 256678 259963 263391 266018 267911 269381 270537 271859 274371 278574 283621 288213 292108 296223
53607B96223N044N488M747L296K112J699J833K019K019J896J725J435R51L45k08
$$ 296223 301267 306755 311502 314798 316910 318609 320442 322461 324480 326376 328101 329536 330487 330832 330624
53592C30624n51n86l10J10L36N1p72j825k680l087l070k729k073j207o08q35j846
$$ 330624 330073 329487 329177 329287 329623 329674 328902 327077 324397 321310 318240 315511 313438 312231 311623 310788 308942
53575C08942k879l190k760k137j805j870k120k244k096j839j643j313n61L58Q40
$$ 308942 306063 302873 300113 297976 296171 294301 292181 289937 287841 286002 284359 283046 282485 282843 283683
53560B83683Q06P80R43Q39L34L1K63M98L65M31J159J931K040J899K167K424K037
$$ 283683 284489 285269 286212 287051 287385 287416 287679 288177 288542 288973 290132 292063 294103 296002 298169 300593 302630
53543C02630J719K612M188M734L930L295L875N056O055P017P953Q001O656M885
$$ 302630 304349 306961 311149 315883 319813 323108 326983 332039 338094 345111 353064 361065 367721 372606
53529C72606M027M337N164N919O319O340O434P201Q503R520R900J0149J0624J1081
$$ 372606 376633 380970 386134 392053 398372 404712 411146 418347 426850 436370 446270 456419 467043 478124
53515D78124J1437J2037J2838J3378J3930J5410J7682J9276J9587J9983K1603
$$ 478124 489561 501598 514436 527814 541744 557154 574836 594112 613699 633682 655285
53504F55285K3360K3498K2255K1340K1338K1224K0259J8958J8006J7372J6762
$$ 655285 678645 702143 724398 745738 767076 788300 808559 827517 845523 862895 879657
53493H79657J6121J5491J4940J4646J4689J4809J4782J4757J4861J4880J4740
$$ 879657 895778 911269 926209 940855 955544 970353 985135 999892 1014753 1029633 1044373
53482A044373J4887J5545J6092J5804J4832J3800J2868J1926J1236J0986J0514
$$ 1044373 1059260 1074805 1090897 1106701 1121533 1135333 1148201 1160127 1171363 1182349 1192863
53471A192863Q933O330L599J187j121l438n580p683j0032j2281j3622j3957j4182
$$ 1192863 1201796 1208126 1211725 1212912 1211791 1208353 1202773 1195090 1185058 1172777 1159155 1145198 1131016
53458A131016j5039j6210j6860j6646j5995j5629j5956j6776j7528j7855j7845
$$ 1131016 1115977 1099767 1082907 1066261 1050266 1034637 1018681 1001905 984377 966522 948677
53447I48677j7680j7456j7398j7756j8174j7779j6355j4901j4409j4551j4183
$$ 948677 930997 913541 896143 878387 860213 842434 826079 811178 796769 782218 768035
53436G68035j2764j0645q303o098m491l683l154k197q46L31J180K112L446N142
$$ 768035 755271 744626 736323 730225 725734 722051 718897 716700 715854 716185 717365 719477 722923 728065
53422G28065P052Q875J0145J0825J1643J3195J5071J6574J7923J9765K1816K3068
$$ 728065 735117 743992 754137 764962 776605 789800 804871 821445 839368 859133 880949 904017
53410I04017K3370K3663K4553K5682K6836K8518L0906L3107L4287L4917L6127
$$ 904017 927387 951050 975603 1001285 1028121 1056639 1087545 1120652 1154939 1189856 1225983
53399A225983L8162M0229M1736M3004M4595M6409M7798M8407M8582M8862M9303
$$ 1225983 1264145 1304374 1346110 1389114 1433709 1480118 1527916 1576323 1624905 1673767 1723070
53388A723070M9574M9526M9271M8735M7623M6008M4404M2967M1135L8490L5476
$$ 1723070 1772644 1822170 1871441 1920176 1967799 2013807 2058211 2101178 2142313 2180803 2216279
53377B216279L2741L0077K6625K1996J6686J1521P054L354Nl570p578j1843j6383
$$ 2216279 2249020 2279097 2305722 2327718 2344404 2355925 2362979 2366333 2366338 2362768 2355190 2343347 2326964
53364B326964k1457k6832l1693l5747l9723m4143m8331n1301n3083n4259n4823
$$ 2326964 2305507 2278675 2246982 2211235 2171512 2127369 2079038 2027737 1974654 1920395 1865572
53353A865572n4422n3300n1972n0354m8197m6007m4439m3059m0993l8619l7342
$$ 1865572 1811150 1757850 1705878 1655524 1607327 1561320 1516881 1473822 1432829 1394210 1356868
53342A356868l7639l8496l8934l8899l8414l7042l4780l2424l0557k8838k6787
$$ 1356868 1319229 1280733 1241799 1202900 1164486 1127444 1092664 1060240 1029683 1000845 974058
53331I74058k4544k2433k0442j8522j6858j5494j4210j3029j2256j1777j0978
$$ 974058 949514 927081 906639 888117 871259 855765 841555 828526 816270 804493 793515
53320G93515r645q294p286o252m772l120j888j267j028q12k38R64K648M417O115
$$ 793515 783870 775576 768290 762038 757266 754146 752258 750991 749963 749151 748913 749877 752525 756942 763057
53305G63057P833R477J0832J2001J3204J4190J4597J4897J6109J8374K0673K2179
$$ 763057 770890 780367 791199 803200 816404 830594 845191 860088 876197 894571 915244 937423
53293I37423K3087K3867K4492K4949K5624K6649K7421K7423K6887K6181K5028
$$ 937423 960510 984377 1008869 1033818 1059442 1086091 1113512 1140935 1167822 1194003 1219031
53282A219031K2989K0377J7975J6111J4473J2649J0428P705M463Q04l076o780
$$ 1219031 1242020 1262397 1280372 1296483 1310956 1323605 1334033 1341738 1346201 1347005 1343929 1337149
53270A337149r649j1230j1937j2752j4139j5734j7181j8682k0371k1853k2718
$$ 1337149 1327500 1316270 1304333 1291581 1277442 1261708 1244527 1225845 1205474 1183621 1160903
53259A160903k3192k3737k4408k4930k5165k5201k5247k5584k6300k6989k7090
$$ 1160903 1137711 1113974 1089566 1064636 1039471 1014270 989023 963439 937139 910150 883060
53248H83060k6659k6247k5998k5450k4429k3406k2669k1868k0828k0086k0088
$$ 883060 856401 830154 804156 778706 754277 730871 708202 686334 665506 645420 625332
53237F25332k0384k0220j9467j8426j7258j6093j5233j4604j3563j1829j0191
$$ 625332 604948 584728 565261 546835 529577 513484 498251 483647 470084 458255 448064
53226D48064r551r656r562q984q399q020p527o856o422o415o515o451o352o382
$$ 448064 438513 428857 419295 410311 401912 393892 386365 379509 373087 366672 360157 353706 347354 340972
53212C40972o424o300n988n558n105m826m846m964m851m495m213m158m106l761
$$ 340972 334548 328248 322260 316702 311597 306771 301925 296961 292110 287615 283402 279244 275138 271377
53198B71377l105k375j841j647j744k005k400k912l248k933j953j074j057j668
$$ 271377 268272 265897 264056 262409 260665 258660 256260 253348 250100 247167 245214 244140 243083 241415
53184B41415j920j390q21j087j902k090j199k51m98j748k539k001q57k84l91m09
$$ 241415 239495 238105 237284 236197 234295 232205 231006 230755 230257 228509 225970 223969 223112 222828 222437 222028
53168B22028LM21N00M01K58j25p53j102o43M77J513J742J080K54K80J361K437
$$ 222028 222031 222452 222952 223353 223611 223486 222733 221631 220988 221465 222978 224720 225800 226054 226334 227695 230132
53151B30132K262R04l94p38m46k57m07o44p02m44k4M1n93j359j180J49J608K274
$$ 230132 232394 233298 232904 232166 231720 231463 231056 230412 229710 229266 229242 229283 228690 227331 226151 226300 227908 230182
53133B30182K351K516K815K728J998R20N4j31L59Q21M73n24j167r68n13l92l33
$$ 230182 232533 235049 237864 240592 242590 243510 243564 243433 243792 244613 245086 244562 243395 242427 241914 241522 241189
53116B41189L8L36K7n92q45o81m83k79J04L13j51r92j405j269j262j711k139k160
$$ 241189 241227 241563 241590 240998 240153 239472 238989 238710 238814 239127 238976 237984 236579 235310 234048 232337 230198 228038
53098B28038j998j862j465o94j44l97j063j218o70j55k43n14k13O56J310J192
$$ 228038 226040 224178 222713 222019 221875 221478 220415 219197 218527 218372 218129 217615 217402 218058 219368 220560
53082B20560N93J48N9J21K03L72N72N93L47l2m09p46r89j036q69n84l76n18j120
$$ 220560 221153 221301 221360 221481 221684 222056 222628 223221 223568 223536 223127 222381 221392 220356 219487 218903 218527 218009 216889
53063B16889j787j917j556j538k269k924k472j191k30%P8K85K12k19m01j35q4
$$ 216889 215102 213185 211629 210091 207822 204898 202426 201235 201005 201005 201083 201368 201580 201361 200960 200825 200741
53046B00741o24j100q45j70K90N52R15J109O72k60j089j531j668j533j161q07
$$ 200741 200117 199017 198172 198002 198292 198844 199759 200868 201540 201280 200191 198660 196992 195459 194298 193491
53030A93491o66n69l44j77k87m58k95K71J018J697K039J845J316R26P89O18M61
$$ 193491 192825 192256 191912 191735 191448 190990 190695 190966 191984 193681 195720 197565 198881 199807 200596 201214 201675
53013B01675Q08J579J770O66j052k127k129j542q89m49m68r69j512j684j554j281
$$ 201675 202483 204062 205832 206498 205446 203319 201190 199648 198759 198310 197842 196873 195361 193677 192123 190842
52997A90842o66L38J156J218P87M79L15n1n04n35l7O04J128J485J500R97K54k04
$$ 190842 190176 190514 191670 192888 193675 194154 194469 194418 193914 193379 193342 193946 195074 196559 198059 199056 199310 199106
52979A99106k13%K25L72L23O6j98m38r01j531j722j160m41j82k6P41J941K713
$$ 199106 198893 198893 199118 199490 199813 199879 199681 199243 198342 196811 195089 193929 193488 193306 193280 194021 195962 198675
52961A98675K767K540K210J486L96m98q72j007j186j294j200j053j053j188j317
$$ 198675 201442 203982 206192 207678 208074 207576 206704 205697 204511 203217 202017 200964 199911 198723 197406
52946A97406j300j075q32q59j020p38P6N63l5j192j707j226m48K1J48q3q06j613
$$ 197406 196106 195031 194199 193340 192320 191582 191658 192221 192186 190994 189287 188061 187613 187634 187782 187699 186893 185280
52928A85280j623n76O39R48K03q60j471j394q53j36O89J597K209J964R20j8j03
$$ 185280 183657 183081 183720 184668 184871 184011 182540 181146 180293 180157 180846 182443 184652 186616 187536 187518 187415
52911A87415L92O97O07M47K99n0n34p99p53o12m59k63j58k34j88K60P89Q48M80
$$ 187415 187807 188504 189111 189558 189857 189807 189273 188474 187721 187109 186650 186387 186229 185995 185807 186067 186856 187704 188184
52892A88184K27K87L72L03K26K64M39Q33J385J660J287M39m65j244j647j158K27
$$ 188184 188411 188698 189070 189373 189599 189863 190302 191135 192520 194180 195467 195906 195441 194197 192550 191392 191619
52875A91619J410J350M46j15r1j69m45k34M80P22P0n43j59Q91J628J653J165L67
$$ 191619 193029 194379 194825 194710 194619 194450 194005 193771 194251 194973 195043 194500 194341 195232 196860 198513 199678 200045
52857B00045n15r80o34L17J230J579J268O77M99J135K111K469J885J022O61P43
$$ 200045 199530 198550 197916 198233 199463 201042 202310 202987 203486 204621 206732 209201 211086 212108 212769 213512
52841B13512N45m13j774k573k204j175o55j077j695j795j716j983k117j236M09
$$ 213512 214057 213644 211870 209297 207093 205918 205263 204186 202491 200696 198980 196997 194880 193644 194053
52826A94053J584J691J277R58P37N02K93j22j054k125k389j529k99M35M86J70
$$ 194053 195637 197328 198605 199563 200300 200802 201095 200973 199919 197794 195405 193876 193577 194012 194498 194668
52810A94668l2M30J695L091L884M353N210O036N389K689r91m244o453p378o830
$$ 194668 194636 195066 196761 199852 203736 208089 213299 219335 224724 227413 226422 222178 215725 208347 201517
52795B01517n335m110l676l267k218j099p49r97j123j001r24p41j20O26P54Q9
$$ 201517 196182 192072 188396 185129 182911 181812 181063 180066 178943 177942 177018 176277 176157 176783 177537 177626
52779A77626p01r43o42l48m37o51l86M19J008P95K40J12K52Pl57R7J300K018J648
$$ 177626 176925 175982 175340 174992 174555 173904 173518 173937 174945 175740 175980 176092 176344 176351 175994 176091 177391 179409 181057
52760A81057R67O95M64j11n34l35J01M12R51J748J839O87o00o53K19P00M60K13
$$ 181057 182024 182719 183183 183072 182538 182203 182304 182716 183667 185415 187254 187941 187341 186688 186907 187607 188067 188280
52742A88280K17P1j67M3N99P17K11j55J35O28O84L11k6J8N48J427K263K611K367
$$ 188280 188497 188568 188401 188444 189043 189760 189971 189816 189951 190579 191263 191574 191548 191566 192114 193541 195804 198415 200782
52723B00782J748J010L50j00m73j092j928k411k197j787j859k288k406k040j633
$$ 200782 202530 203540 203890 203790 203317 202225 200297 197886 195689 193902 192043 189755 187349 185309 183676
52708A83676j411j102m93K81J057J759K079J600L94q30j411j317r46n71k12J31
$$ 183676 182265 181163 180670 180951 182008 183767 185846 187446 187840 187010 185599 184282 183336 182765 182553 182684
52692A82684L34L49L66N95P99M12o32j467j190n3Q48J028J064J457J827J686J297
$$ 182684 183018 183367 183733 184328 185127 185539 184907 183440 182250 182197 183045 184073 185137 186594 188421 190107 191404
52675A91404J207J369J272P03o8o44p17k20M66P40M45J8j95k77k70j2L20J78l70
$$ 191404 192611 193980 195252 195955 195887 195243 194526 194306 194772 195512 195957 195975 195780 195503 195233 195221 195541 195719 195349
52656A95349m05N21J566J783J477J582K178K666K912L191L213K300N80j009k011
$$ 195349 194944 195465 197031 198814 200291 201873 204051 206717 209629 212820 216033 218333 218913 217904 215893
52641B15893k852l775m183l509k116q99l39l17m86n75m67k58j76l61o82p75k62
$$ 215893 213041 209266 205083 201574 199458 198559 198220 197903 197417 196842 196375 196117 195941 195580 194898 194123 193861
52624A93861Q91K193K960K915K295J352J73r51j500j395j193j295j346q66o7M29
$$ 193861 194752 196945 199905 202820 205115 206467 206640 205689 204189 202794 201601 200306 198960 198094 198027 198456
52608A98456L70k5m47n81j71N62Q81M16k98n84n16n27n55k36M01J045J550J716
$$ 198456 198826 198801 198354 197773 197602 198164 199045 199461 199163 198579 198063 197536 196981 196745 197146 198191 199741 201457
52590B01457J084k68j120l50J408K361J792P39L93Q09J448K057K538K624K215
$$ 201457 202541 202273 201153 200803 202211 204572 206364 207103 207496 208305 209753 211810 214348 216972 219187
52575B19187J637J164O88J42j99j23J08J36j16n41j122j728j992j644q85k05Q8
$$ 219187 220824 221988 222676 222818 222619 222496 222604 222740 222624 222083 220961 219233 217241 215597 214712 214507 214595
52558B14595Kj98r4N76J465J680O41j097k232k019r72j22K15N26J095J473J265
$$ 214595 214597 214399 214305 214881 216346 218026 218667 217570 215338 213319 212347 212225 212440 212966 214061 215534 216799
52541B16799Q49P57O51k96k053l499l673k683j279j36L33J55j9N35J607K204J863
$$ 216799 217648 218405 219056 218760 216707 213208 209535 206852 205573 205437 205770 205925 205906 206441 208048 210252 212115
52524B12115J102M32j85n90j67J008J742J284M54L69P62O51Q0N8R63K082K631
$$ 212115 213217 213649 213464 212874 212707 213715 215457 216741 217195 217564 218326 218977 219057 219115 220078 222160 224791
52507B24791K444J788J159J041J327J196J74j119j889k228k564k671k215j734
$$ 224791 227235 229023 230182 231223 232550 233746 233920 232801 230912 228684 226120 223449 221234 219500
52493B19500j896k230j784p35j61l17m00N9P22J387K223K965K972K320J790J691
$$ 219500 217604 215374 213590 212855 212694 212377 211977 212036 212758 214145 216368 219333 222305 224625 226415 228106
52477B28106J595J353J365J634J643J314J116J032N13l22n45J68R72J129Q84P28
$$ 228106 229701 231054 232419 234053 235696 237010 238126 239158 239671 239349 238804 238972 239944 241073 241957 242685
52461B42685P04R13J654K587K655J401l28j544k118k270j919j225r37j531k480
$$ 242685 243389 244302 245956 248543 251198 252599 252271 250727 248609 246339 244420 243195 242258 240727 238247
52446B38247k992k854k189j071R1N03r1r91j513j714j760j399o16l8l6j84j63
$$ 238247 235255 232401 230212 229141 229232 229735 229644 228653 227140 225426 223666 222267 221651 221613 221577 221393 221230
52429B21230l59q52p77L42J429J221J54l44P4N83Q63J340J869J542J91j090j403
$$ 221230 220871 220019 219242 219584 221013 222234 222388 222044 222118 222701 223564 224904 226773 228315 228506 227416 226013
52412B26013j080p05q8J143K499L099K915K803L346M162M587M635M975O016P269
$$ 226013 224933 224228 224140 225283 227782 230881 233796 236599 239945 244107 248694 253329 258304 264320 271589
52397B71589P713O654M143P37k795n589o941o796n764m563l533k728k166j763
$$ 271589 279302 285956 290099 290836 288041 282452 275511 268715 262951 258388 254855 252127 249961 248198
52383B48198j302p16k75k43m90o06l03L60J053J400J361J401K028L049L633L312
$$ 248198 246896 246180 245905 245662 245172 244566 244263 244623 245676 247076 248437 249838 251866 254915 258548 261860
52367B61860K561K200K411K656K393J585N74l26j104j919k671k825j985n44N57
$$ 261860 264421 266621 269032 271688 274081 275666 276240 275914 274810 272891 270220 267395 265410 264866 265423
52352B65423Q14N59M07N93J013J388J333O13l89q51l95M85J085J236J216J247
$$ 265423 266237 266796 267203 267796 268809 270197 271530 272143 271754 270903 270508 270993 272078 273314 274530 275777
52336B75777J403J717K114K400K516K643K929L324L784M334M923N407N862O528
$$ 275777 277180 278897 281011 283411 285927 288570 291499 294823 298607 302941 307864 313271 319133 325661
52322C25661P434Q288Q873R127Q875P938O612N565N070M780M428M197M269M447
$$ 325661 333095 341383 350256 359383 368258 376196 382808 388373 393443 398223 402651 406848 411117 415564
52308D15564M541M643M766M713M563M805N611O521P074P303P255O709N785N186
$$ 415564 420105 424748 429514 434227 438790 443595 449206 455727 462801 470104 477359 484068 489853 495039
52294D95039N231N177M211K653J474R00L44m86j200j459j430j382j322j116o65
$$ 495039 500270 505447 509658 512311 513785 514685 515029 514543 513343 511884 510454 509072 507750 506634 505969
52279E05969K6O75Q09L89J03N59J381J714J492J542K336L343L910M182M689N433
$$ 505969 505995 506670 507479 507868 507971 508530 509911 511625 513117 514659 516995 520338 524248 528430 533119 538552
52263E38552N880N807N662N955O596P056P081O955O993P095P012O877P031P400
$$ 538552 544432 550239 555901 561856 568452 575508 582589 589544 596537 603632 610644 617521 624552 631952
52249F31952P471O980O256N634M865L467J538m6l39P77K387L348L407L358L888
$$ 631952 639423 646403 652659 658293 663158 666625 668163 668117 667778 668555 670942 674290 677697 681055 684943
52234F84943M637M835M553M566N103N586N719N940O456O631N952M895M272M150
$$ 684943 689580 694415 698968 703534 708637 714223 719942 725882 732338 738969 744921 749816 754088 758238
52220G58238M064L828L603L461L434L708M241M549M390M326M959N933O308N855
$$ 758238 762302 766130 769733 773194 776628 780336 784577 789126 793516 797842 802801 808734 815042 820897
52206H20897N302N375O087O930P281O734N508M455M286M803N266N337N264N278
$$ 820897 826199 831574 837661 844591 851872 858606 864114 868569 872855 877658 882924 888261 893525 898803
52192H98803N378N616O105O730P237P526P517O900N499L746K211Q15r38k957m520
$$ 898803 904181 909797 915902 922632 929869 937395 944912 951812 957311 961057 963268 964083 963145 960188 955668
52177I55668n295n732o181o335n960n612n993o831p052o073m505l458l402l872
$$ 955668 950373 944641 938460 932125 926165 920553 914560 907729 900677 894604 890099 886641 883239 879367
52163H79367m031l351j863l2J528K363K406J897J085P7r55j620j633j245j028
$$ 879367 875336 871985 870122 870090 871618 873981 876387 878284 879369 879446 878491 876871 875238 873993 872965
52148H72965j236j478j109J78K001L359L292J826K18k39M20J019O94l81j659k830
$$ 872965 871729 870251 869142 869320 871321 874680 877972 879798 880016 879777 880197 881216 881910 881529 879870 877040
52132H77040l633l760l337k949k718j980k66J881L562M627N562O670P870R059
$$ 877040 873407 869647 866310 863361 860643 858663 858397 860278 863840 868467 874029 880699 888569 897628
52118H97628J0114J0719J0658J0154R496Q552P062N265L767K825K147J365M56
$$ 897628 907742 918461 929119 939273 948769 957321 964383 969648 973415 976240 978387 979752 980208
52105I80208k34k63N07J687K771L845N469P757R968J1321J1744J1546J0908J0001
$$ 980208 979974 979711 980218 981905 984676 988521 993990 1001747 1011715 1023036 1034780 1046326 1057234 1067235
52091A067235R098P994N838K200k026n315o933p214o793o135n533m976m114k762
$$ 1067235 1076333 1084327 1090165 1092365 1090339 1085024 1078091 1070877 1064084 1057949 1052416 1047440 1043326 1040564
52077A040564j269o4Q62J591J911J787J777K364L174L522L390L195K979K558K231
$$ 1040564 1039295 1039231 1040093 1041684 1043595 1045382 1047159 1049523 1052697 1056219 1059609 1062804 1065783 1068341 1070572
52062A070572K468L020L148K665K109J909K047K472L099L426K863J593L88m58
$$ 1070572 1073040 1076060 1079208 1081873 1083982 1085891 1087938 1090410 1093509 1096935 1099798 1101391 1101779 1101321
52048A101321j393k672l881m626n124n775o518o981p080p216p820q692q872p490
$$ 1101321 1099928 1097256 1093375 1088749 1083625 1077850 1071332 1064351 1057271 1050055 1042235 1033543 1024671 1017181
52034A017181m870k325p39R4N09K59o18j044p0J724K982L300L216K937K339J986
$$ 1017181 1012311 1009986 1009247 1009341 1009850 1010109 1009491 1008447 1008377 1010101 1013083 1016383 1019599 1022536 1024875 1026861
52018A026861K724M154M916M579M057L895L573K949L008M270N552N364L791J958
$$ 1026861 1029585 1033739 1038655 1043234 1047291 1051186 1054759 1057708 1060716 1064986 1070538 1075902 1079693 1081651
$$ [...]
##END NTUPLES=NMR SPECTRUM
##END=
