
##TITLE=UV1256_M11_1332-1242_5_7409661_bY7sYACtgE
##JCAMPDX= 6.0         $$ Bruker NMR JCAMP-DX V2.0
##DATA TYPE= NMR SPECTRUM
##DATA CLASS= NTUPLES
##ORIGIN= BRUKER
##OWNER= Administrator
$$ 1.72 TOPSPIN		Version 2.1
$$ 2013-01-25 01:19:10.042 -0500  Administrator@X
$$ Compression mode = diff/dup
##.OBSERVE FREQUENCY= 400.02188249412
##.OBSERVE NUCLEUS= ^1H
##.ACQUISITION MODE= SIMULTANEOUS (DQD)
##.ACQUISITION SCHEME= undefined
##.AVERAGES= 8
##.DIGITISER RES= 22
##SPECTROMETER/DATA SYSTEM= spect
##.PULSE SEQUENCE= zg30
##.SOLVENT NAME= COFFEE_meoh
##.SHIFT REFERENCE= INTERNAL, COFFEE_meoh, 1, 14.98509
##AUDIT TRAIL= $$ (NUMBER, WHEN, WHO, WHERE, PROCESS, VERSION, WHAT)
$$ ##TITLE= Audit trail, TOPSPIN		Version 2.1
$$ ##JCAMPDX= 5.01
$$ ##ORIGIN= Bruker BioSpin GmbH
$$ ##OWNER= Administrator
$$ $$ E:\/data/COFFEE/nmr/UV1256_M11_1332-1242_5_7409661_bY7sYACtgE/10/pdata/1/auditp.txt
$$ ##AUDIT TRAIL=  $$ (NUMBER, WHEN, WHO, WHERE, PROCESS, VERSION, WHAT)
(   1,<2013-01-25 01:19:01.776 -0500>,<Administrator>,<X>,<go>,<TOPSPIN 2.1>,
      <created by zg
	started at 2013-01-25 01:17:54.964 -0500,
	POWCHK enabled, PULCHK disabled,
       configuration hash MD5:
       86 BA 57 50 F2 9D 5C 9B 26 00 A9 28 5F 66 2E 89
       data hash MD5: 64K
       9E F2 87 26 02 71 52 59 E5 52 93 E6 D3 78 67 90>)
(   2,<2013-01-25 01:19:04.792 -0500>,<Administrator>,<X>,<proc1d>,<TOPSPIN 2.1>,
      <Start of raw data processing
       efp LB = 0 FT_mod = 6 PKNL = 1 PHC0 = 0 PHC1 = 0 SI = 32K 
       data hash MD5: 32K
       39 CF 88 7E EE 8E F8 B0 4E 2C CA C8 72 8C 44 62>)
(   3,<2013-01-25 01:19:05.385 -0500>,<Administrator>,<X>,<proc1d>,<TOPSPIN 2.1>,
      <pk PHC0 = 99.94812 PHC1 = 0 
       data hash MD5: 32K
       17 A4 E2 F3 FA 9E CA 3E 78 2A 3A 9A 79 58 94 7A>)
(   4,<2013-01-25 01:19:05.604 -0500>,<Administrator>,<X>,<proc1d>,<TOPSPIN 2.1>,
      <abs ABSG = 1 
       data hash MD5: 32K
       C2 9A 14 0A 17 DF 97 BD A6 7B F8 51 C4 C2 B8 C1>)
(   5,<2013-01-25 01:19:05.745 -0500>,<Administrator>,<X>,<proc1d>,<TOPSPIN 2.1>,
      <abs ABSG = 2 
       data hash MD5: 32K
       D3 50 52 C2 6E 17 C9 BF 45 AD 4E D1 AF 61 B6 4A>)
(   6,<2013-01-25 01:19:05.885 -0500>,<Administrator>,<X>,<proc1d>,<TOPSPIN 2.1>,
      <abs ABSG = 3 
       data hash MD5: 32K
       55 7D 67 7A 55 17 24 6F 64 E9 BB 7A AA B0 26 E6>)
(   7,<2013-01-25 01:19:06.057 -0500>,<Administrator>,<X>,<proc1d>,<TOPSPIN 2.1>,
      <abs ABSG = 4 
       data hash MD5: 32K
       95 DA 98 C3 7B A7 83 54 DC 59 89 36 71 13 CA 0C>)
(   8,<2013-01-25 01:19:06.198 -0500>,<Administrator>,<X>,<proc1d>,<TOPSPIN 2.1>,
      <abs ABSG = 5 
       data hash MD5: 32K
       8A 06 FC 3D 6A 5C 9E 90 30 37 E6 56 7C D2 D8 3F>)
$$ ##END=
$$ 
$$ $$ hash MD5
$$ $$ C1 65 1D EE 69 7D 76 66 D4 62 90 33 22 EC 2E C7
##$RELAX= 
##$RELAX= 
##$RELAX= 
##$RELAX= 
##$RELAX= 
##$RELAX= 
##$RELAX= 
$$ Bruker specific parameters
$$ --------------------------
##$DU= <E:\>
##$EXPNO= 10
$$ [...]
##$TP= (0..7)
150 150 150 150 150 150 150 150
##$TP07= 0
##$TPNAME0= <>
##$TPNAME1= <>
##$TPNAME2= <>
##$TPNAME3= <>
##$TPNAME4= <>
##$TPNAME5= <>
##$TPNAME6= <>
##$TPNAME7= <>
##$TPOAL= (0..7)
0.5 0.5 0.5 0.5 0.5 0.5 0.5 0.5
##$TPOFFS= (0..7)
0 0 0 0 0 0 0 0
##$TUNHIN= 0
##$TUNHOUT= 0
##$TUNXOUT= 0
##$USERA1= <user>
##$USERA2= <user>
##$USERA3= <user>
##$USERA4= <user>
##$USERA5= <user>
##$V9= 5
##$VALIST= <valist>
##$VCLIST= <CCCCCCCCCCCCCCC>
##$VD= 0
##$VDLIST= <DDDDDDDDDDDDDDD>
##$VPLIST= <PPPPPPPPPPPPPPP>
##$VTLIST= <TTTTTTTTTTTTTTT>
##$WBST= 1024
##$WBSW= 4
##$XGAIN= (0..3)
0 0 0 0
##$XL= 0
##$YL= 0
##$YMAX_a= 681316
##$YMIN_a= -579983
##$ZGOPTNS= <>
##$ZL1= 120
##$ZL2= 120
##$ZL3= 120
##$ZL4= 120
##$ABSF1= 14.98509
##$ABSF2= -5.573092
##$ABSG= 5
##$ABSL= 3
##$ALPHA= 0
##$AQORDER= 0
##$ASSFAC= 0
##$ASSFACI= 0
##$ASSFACX= 0
##$ASSWID= 0
##$AUNMP= <proc_prof1d_extract_pilot.lims>
##$AXLEFT= 0
##$AXNAME= <>
##$AXNUC= <1H>
##$AXRIGHT= 0
##$AXTYPE= 0
##$AXUNIT= <>
##$AZFE= 0.1
##$AZFW= 0.1
##$BCFW= 0
##$BC_mod= 0
##$BYTORDP= 0
##$COROFFS= 0
##$CY= 15
##$DATMOD= 1
##$DC= 0
##$DFILT= <>
##$DTYPP= 0
##$F1P= 0
##$F2P= 0
##$FCOR= 0.5
##$FTSIZE= 32768
##$FT_mod= 6
##$GAMMA= 0
##$GB= 0
##$INTBC= 1
##$INTSCL= 1
##$ISEN= 128
##$LB= 0
##$LEV0= 0
##$LPBIN= 0
##$MAXI= 10000
##$MC2= 0
##$MEAN= 0
##$ME_mod= 0
##$MI= 0
##$NCOEF= 0
##$NC_proc= -8
##$NLEV= 6
##$NOISF1= 0
##$NOISF2= 0
##$NSP= 0
##$NTH_PI= 0
##$NZP= 0
##$OFFSET= 14.98509
##$PC= 1
##$PHC0= 99.94812
##$PHC1= 0
##$PH_mod= 1
##$PKNL= yes
##$PPARMOD= 0
##$PPDIAG= 0
##$PPIPTYP= 0
##$PPMPNUM= 2147483647
##$PPRESOL= 1
##$PSCAL= 4
##$PSIGN= 0
##$PYNMP= <proc.py>
##$REVERSE= no
##$SF= 400.02
##$SI= 32768
##$SIGF1= 0
##$SIGF2= 0
##$SINO= 400
##$SIOLD= 32768
##$SPECTYP= <>
##$SREGLST= <1H.CDCl3>
##$SSB= 0
##$STSI= 32768
##$STSR= 0
##$SW_p= 8223.68421052631
##$SYMM= 0
##$S_DEV= 0
##$TDeff= 65536
##$TDoff= 0
##$TI= <>
##$TILT= no
##$TM1= 0
##$TM2= 0
##$TOPLEV= 0
##$USERP1= <user>
##$USERP2= <user>
##$USERP3= <user>
##$USERP4= <user>
##$USERP5= <user>
##$WDW= 1
##$XDIM= 32768
##$YMAX_p= 473420621
##$YMIN_p= -758051
##$CURPLOT= <Network HP LaserJet P1505>
##$CURPRIN= <$Network HP LaserJet P1505>
##$DFORMAT= <normdp>
##$LAYOUT= <+/1D_H.xwp>
##$LFORMAT= <normlp>
##$PFORMAT= <normpl>
##$SURQMSG= 1
$$ End of Bruker specific parameters
$$ ---------------------------------
##NTUPLES= NMR SPECTRUM
##VAR_NAME=  FREQUENCY,     SPECTRUM/REAL,   SPECTRUM/IMAG
##SYMBOL=    X,             R,               I
##VAR_TYPE=  INDEPENDENT,   DEPENDENT,       DEPENDENT
##VAR_FORM=  AFFN,          ASDF,            ASDF
##VAR_DIM=   32768,         32768,           32768
##UNITS=     HZ,            ARBITRARY UNITS, ARBITRARY UNITS
##FACTOR=    0.250966925370066, 1,           1
##FIRST=     8223.43324360094, 208588,       50690
##LAST=      0,             -181259,         -109414
##MIN=       0,             -758051,         0
##MAX=       8223.43324360094, 473420621,    0
$$ Real data points
##PAGE= N=1
##DATA TABLE= (X++(R..R)), XYDATA
$$ [...]
19538h0124Q598j72871f7759A89496f943A93500J6971a73989O8781k34293k21138
19527e60639h8479r3142c8301m13470a77193C33456b63423R7199Q1876j96894
19517b81242A8090h4311p4223f1243j72752A74223b78417c4767j41339G0493C5079
19505B13345a36699j91651C34486e1015F3678e9730l8908d4921A32810C0051d16284
19493e3935C295a99170b1976A68942b96603f5205B7308d5002j83212H7320c53147
19481B21315a71282C75044A39730a20113m7846A37164h7664A02066M3561o1463
19471H4164a97863k18049D8707c9622J0533j93749A81025a40251c2469E4938d6806
19459a00837p004C5838c10319J12218g6412l5546A81311F2915a65581j04957E2529
$$ y = [-80124, -71526, -244397, -67759, 189496, -6943, 193500, 210471, -173989, -105208, -339501, -560639, -88479, -181621, -38301, -451771, -177193, 333456, -263423, -166224, -84348, -281242, 18090, -84311, -158534, -61243, -233995, 174223, -278417, -34767, -176106, 70493, 35079, 213345, -136699, -328350, 334486, -51015, 63678, -59730, -98638, -44921, 132810, 30051, -416284, -53935, 3295, -199170, -21976, 168942, -296603, -65205, 27308, -45002, -228214, 87320, -353147, 221315, -171282, 375044, 139730, -120113, -167959, 137164, -87664, 102066, 145627, 84164, -197863, -415912, 48707, -39622, -29089, -222838, 181025, -140251, -32469, 54938, -46806, -100837, -107841, 35838, -310319, -198101, -76412, -111958, 181311, 62915, -165581, -270538, 52529]
19447d442o1325F6674d7327k62868J39190j47468a25179M4031M173B88722A21006
19435H9814a59905A07125K123b09911B34344a69573d054A80136D8270c33310f9414
19423e2708a6433k987j8312k56975O6376e2852B09623K1053o1300D3104J4278
19412E7382a52256c1221J2905j10539M4186k86064a21254L8525B42091b54050
19401B38249r8257g0689l20358a60612B34999a95063q9597M2998j64754a45859
19390A63974c50378A70413c1192A02604P3739a0896r3823A85712b67080A04972
19379a72531A86842b11503p8127g804m8974j91994b5138G6789A5551B525d20251
19367A51986a09528K2593B36304b79132A53674c643l27758h0074a447B00320b12792
$$ y = [-4442, -65767, 66674, -47327, -310195, -171005, -318473, -125179, -81148, -76975, 288722, 121006, 89814, -159905, 107125, 109248, -209911, 234344, -169573, -4054, 180136, 48270, -333310, -69414, -52708, -16433, -19420, -37732, -294707, -228331, -52852, 209623, 230676, 169376, 43104, 57382, -152256, -31221, -18316, -128855, -84669, -370733, -121254, -82729, 242091, -254050, 238249, 139992, -70689, -391047, -160612, 234999, -195063, -284660, -241662, -406416, -145859, 163974, -350378, 170413, -31192, 102604, 176343, -10896, -104719, 185712, -267080, 104972, -172531, 186842, -211503, -289630, -7804, -56778, -248772, -25138, 76789, 15551, 2525, -420251, 151986, -109528, -86935, 236304, -279132, 153674, -3643, -331401, -80074, -1447, 200320, -212792]
19355a66843l00285b642j0415k6639j36847B87666I2657a80169h5185k99016a24899
19343C9598M00584i1236a4975j22171B569a36821B18679I5296R1177d02067B4274
19331B3287b78402n1250B50995b15304g5569l9925j88452a35280m23768C66855
19320A50141a74195n6624P3993H7692K66426j39652a68658j35282a39890E7585
19309f2616J5688A20214b12966N9457f4310j33871m5913e7422l6850B72182a75081
19297b6832I2199k3234J71305a66167F90a50815k21877A46669d43612J44783A55179
19285f4477D9370b01274h5939j30040a6500k0971C5940J23916b00650f9864n4510
19274a24374K4082J0778D1389e1941a1223m5307p0898C2001a47510K1484k64236
$$ y = [-166843, -467128, -2642, -13057, -39696, -176543, 287666, 92657, -180169, -85185, -384201, -124899, 39598, 440182, -91236, -14975, -137146, 2569, -136821, 218679, 95296, 186473, -402067, 24274, 23287, -278402, -329652, 250995, -215304, -75569, -115494, -303946, -135280, -559048, 366855, 150141, -174195, -230819, -156826, 87692, 354118, 214466, -168658, -303940, -139890, 57585, -62616, -46928, 120214, -212966, -153509, -64310, -198181, -244094, -57422, -94272, 272182, -175081, -26832, 92199, 68965, 240270, -166167, 690, -150815, -372692, 146669, -443612, -298829, 155179, -64477, 49370, -201274, -85939, -215979, -16500, -37471, 35940, 159856, -200650, -69864, -124374, -100292, -89514, 41389, -51941, -11223, -56530, -127428, 32001, -147510, -126026, -390262]
19263c90262c7443l10116f6818k20987A49150j8480c68909a58813m74619A79297
19252a35085G338Q1684a03330B97933a78408A31899a70784D3664h4137p642q7782
19241a79561A68797i8641r3L8718j10301A41836a64944g6249A12017a5834A94488
19229E1817c03389Q532i6477k3657n108m4287O0984C7338d7995H8183L0018b31217
19216a95991Q4112k5946j65108B19171a24979A49698a21859b9036l15428j61159
19206e05623a53342k27640a54060Q251D0886J85193G060d6605B6729h3550M1668
19195d1882I4660c05304J8936A58669d02439a43569o14482a67360B9308K11928
19185B41236a9454j5110r7125j16965M1732f5405o5209j83631d5844B57368a12617
$$ y = [-390262, -37443, -347559, -66818, -287805, 149150, 130670, -368909, -158813, -633432, 179297, -135085, 7338, 89022, -103330, 297933, -178408, 131899, -170784, 43664, -84137, -91779, -179561, 168797, -98641, -98734, -60016, -170317, 141836, -164944, -76249, 112017, -15834, 194488, 51817, -303389, -294857, -96477, -120134, -125242, -169529, -108545, 37338, -47995, 88183, 118201, -231217, -195991, -111879, -137825, -302933, 219171, -124979, 149698, -121859, -29036, -344464, -505623, -153342, -380982, -154060, -145809, 40886, 226079, 7060, -46605, 26729, -83550, -41882, 94660, -305304, -286368, 158669, -402439, -143569, -758051, -167360, 29308, 241236, -19454, -34564, -131689, -248654, -206922, -65405, -130614, -314245, -45844, 257368, -112617]
19173a8380j70134C4779J9446i7868p0876B73235I4126J34524a70247j39685g4477
19161e03441d207B14495F1309a43853j90844b2823j52763B00962b84030a39305
19150c93778J40001A94297a47962A05232b3097D7942A5342e41357A75760c93969
19139A16884N4241a25924l0225f3916k41757e0408n2918A68474p1304l1666c04601
19127D3722e173B0517b9294j18421d0981j07144F689L65264A30040J47780A03989
19115b52986B27058c9045n57N280q7926C5236b71114A96280a03322B78390a1099
19103b27825J11698M0657I3596O8950c11348b1791P607k32090A33523C299L34628
19092C37927C8142J9530b99327f5416j44102j31564h1908B4208b50608G5076i5694
$$ y = [-18380, -188514, 34779, 54225, -97868, -168744, 273235, 94126, 228650, -170247, -309932, -74477, -503441, -4207, 214495, 61309, -143853, -334697, -22823, -175586, 200962, -284030, -139305, -393778, -253777, 194297, -147962, 105232, -23097, 47942, 15342, -541357, 175760, -393969, 116884, 171125, -125924, -156149, -63916, -305673, -50408, -103326, 168474, 97170, 65504, -304601, 43722, -5173, 20517, -29294, -147715, -40981, -148125, 6689, 371953, 130040, 277820, 103989, -252986, 227058, -39045, -39602, -34322, -122248, 35236, -271114, 196280, -103322, 278390, -11099, -227825, -116127, -75470, 93596, 162546, -311348, -21791, -14184, -246274, 133523, 3299, 337927, 38142, 57672, -299327, -65416, -209518, -341082, -81908, 24208, -250608, 75076, -95694]
19080A81667a07650o0427j19039d0359b478I9286i9169A34032a52847C3090N9355
19069I2445J61399c11434F4955a75390e6391K6122j33014O895B1854L13024A1709
19057b75118b788j2190j21134N1749F9306j1365e2976A11447a23706N9546A92767
19045c31831B8204R0628m2579a14935p9461j86156A32203D6140j1388J07939n7945
19034H4746c60863N2975g892n3229o775D9117J20036a62477g3072l5973b2301
19022a63874K1269E04591a22971c1861A616a63487N8222B7606a07987d955j73200
19011a78155D4164c45925j518b9617j43056A18660b16342c4613A41626j6406b88300
18999B3735c06114k5634E4043P9585A1932c16238P9832e7438A4326d2994k39820
$$ y = [181667, -107650, -168077, -287116, -40359, -2478, 99286, -99169, 134032, -152847, 33090, 92445, 253844, -311434, 64955, -175390, -56391, -30269, -163283, -156388, 21854, 334878, 11709, -275118, -2788, -14978, -136112, -84363, 69306, 57941, -52976, 111447, -123706, -64160, 192767, -331831, 28204, 118832, 76253, -114935, -194396, -380552, 132203, 46140, 34752, 142691, 84746, -360863, -307888, -7892, -61121, -67896, 49117, 169153, -162477, -73072, -109045, -22301, -163874, -142605, 504591, -122971, -31861, 1616, -163487, -105265, 27606, -107987, -4955, -178155, 44164, -345925, -347443, -29617, -172673, 118660, -216342, -34613, 141626, 125220, -288300, 23735, -306114, -331748, 54043, 133628, 11932, -316238, -236406, -57438, 14326, -42994, -282814]
18988b82814A88852a80891j03410a3734j54098j72980D01853a0463A5543M0874
18978E6417a2727l20289O6172I0055a39209J0129q1527K6707A11321b00003J3870
18967a86133a9075q8028a9199A75655d13413e295j98312B3684Q1728a15550C25325
18955D1895d80788P5938A42483Q2877c42705J18936m1699c2930A07456K30352
18945C37808c91248d4401F7397i4591M0296B68505a66902A03852h3171A82727
18934b00524G7846N9943a05746j37065A13569L22517B5245i8864n4785p5431b6067
18922h8733A3255a57898I1798f0965I3567a45837f4935A02683c2113H8484k9864
18911E8620b18447l6791H575a35361b1265n1181b3238i653B02558j3842c22129
$$ y = [-282814, 188852, -180891, -284301, -13734, -167832, -340812, 401853, -10463, 15543, 56417, -12727, -333016, -266844, 90055, -139209, -129080, -210607, -183900, 111321, -200003, -186133, -19075, -107103, -19199, 175655, -413413, -5295, -203607, 23684, 105412, -115550, 325325, 41895, -480788, -404850, 142483, 225360, -342705, -223769, -265468, -32930, 107456, 337808, -391248, -44401, 67397, -94591, -54295, 268505, -166902, 103852, -83171, 182727, -200524, 77846, 137789, -105746, -242811, 113569, 436086, 25245, -98864, -153649, -229080, -26067, -88733, 13255, -157898, 91798, -60965, 93567, -145837, -64935, 102683, -32113, 88484, 58620, -218447, -255238, 8575, -135361, -21265, -72446, -23238, -9653, 202558, 188716, -322129]
18899a56512A36324E1245b82960e1719B5195g6553n2627H389e1481C18300e4012
18887i1938o1036j60692k3921K9925h2005j74821B2207L2423A036b2650k86249
18876c08899a34044L1397G6762b46135g8182j36802O2768G6288c15590i9350j13761
18865b13111R0524D0592h9320C29595G0573g777n7477A07663c94410A09339i8127
18853h6769F4438a0681j21914B75098A17586J2112B8288d0889A37421O2271a39847
18841d1883B0244a43157g1558A27848a37128k42814b6820j48109P1571m04219
18831e07577A10314c00927A09891a00738A02691P9993D8940c64171g9340A98979
18820A53250o0763a67784A85368d6688C61313a56189d2129B14830H8993J93171
$$ y = [-156512, 136324, 51245, -282960, -51719, 25195, -76553, -129180, 8389, -51481, 318300, -54012, -91938, -152974, -313666, -337587, -307662, -82005, -256826, 22207, 54630, 1036, -22650, -308899, -134044, -102647, 76762, -246135, -78182, -214984, -152216, 76288, -315590, -99350, -213111, -122587, 40592, -89320, 329595, 70573, -7777, -65254, 107663, -394410, 109339, -98127, -86769, 64438, -10681, -132595, 275098, 117586, 129698, 28288, -40889, 137421, 199692, -139847, -41883, 20244, -143157, -71558, 127848, -137128, -379942, -26820, -174929, -103358, -507577, 110314, -300927, 109891, -100738, 102691, 182684, 48940, -364171, -79340, 198979, 153250, 92487, -167784, 185368, -46688, 361313, -156189, -42129, 214830, 88993, 282164]
18810B82164A02415J26661F8576k6119N00940b36927B57528B1963Q2522J81987
18800B86472j23909b07376h8281k4345k22505J59678A0207e2069C19132F8477
18789F9542b62454A10209J4646g3891l38314J57668a9178j00521k42793a70248
18778f9883D8502b85047C21552b2065j12029L1962B2478O4852l0816b09608A36047
18766D6381b00127c8029A12941c17763B32479a81553h2219H8817D2842a73551
18755h7876B25192a34822I0882J31576D600e6374l1953J9443l06591a28936b2936
18743C3508b3364j61948L8269J0439j15605j65358A39779c33130b0070F4584M0391
18732A04975e7353A30663f7014a7864C5232b26927a03882k7800d7970k54989E8748
$$ y = [282164, 102415, 229076, 68576, 42457, 543397, -236927, 257528, 21963, 104485, 286472, 162563, -207376, -88281, -112626, -335131, -175453, 10207, -52069, 319132, 68477, 69542, -262454, 110209, 124855, -73891, -412205, -254537, -19178, -119699, -362492, -170248, -69883, 48502, -285047, 321552, -22065, -134094, -102132, 22478, 87330, 56514, -209608, 136047, 46381, -200127, -38029, 112941, -317763, 232479, -181553, -82219, 88817, 42842, -173551, -87876, 225192, -134822, 90882, 222458, 4600, -56374, -88327, -68884, -375475, -128936, -22936, 33508, -23364, -185312, -147043, -136604, -252209, -417567, 139779, -333130, -20070, 64584, 104975, -57353, 130663, -67014, -17864, 35232, -226927, -103882, -131682, -47970, -302959, 58748]
18720e2537E251a53692j06946a18378b3289m0597K6315B30671m3183a44985J6113
18709a28872B39222I2884b76976A90975I3049o093d05408g6551r4427a2590r5943
18698a08533I4256b7819k24899b4618G689c40647a02519C3131K4998a68634b7496
18686h0336a3270n4939n083l34363F7323a45768L0646j36943D15051I2385d5929
18674d9671B64849p1367a66419A33486g5111j84169G7250c4455k73301P1454A92239
18662a38979B9924c5919A21846J9179a00820C44422a36993j26394N0523c6929
18651i342G2538c83249R7151D9507f7141p0757j24944O3181n3231B89496b81837
18639A19920b19069N160B4316g1614j04614o3281C1857g9309c7504j10954m0425
$$ y = [-52537, 5251, -153692, -260638, -118378, -23289, -63886, -37571, 230671, 187488, -144985, -128872, 239222, 92884, -276976, 190975, 93049, 86956, -405408, -76551, -170978, -12590, -108533, 94256, -27819, -252718, -24618, 7689, -340647, -102519, 33131, 58129, -168634, -27496, -80336, -13270, -68209, -73292, -407655, 67323, -145768, -115122, -252065, 415051, 92385, -45929, -49671, 264849, 193482, -166419, 133486, -75111, -259280, 77250, -34455, -307756, -236302, 192239, -138979, 29924, -35919, 121846, 141025, -100820, 344422, -136993, -263387, -212864, -36929, -9342, 72538, -383249, -286098, 49507, -67141, -137898, -262842, -199661, -252892, 289496, -281837, 119920, -219069, -213909, 24316, -71614, -176228, -239509, 31857, -79309, -37504, -148458, -188883]
18628a88883e2793N389l1840c1101A14231L2287d1626B37340c20353a20776q4132
18617b04908F8753b01197B61238i9846A03569c5676J2525l9877m2211j81462C1344
18605C03635a09293F7230g141q6948A05856h9130k03220J10203F5240B1646b61842
18593A5311E909a01183j63698n2232a12007j75997c2156o1486j69441a08016B45658
18581d5722j95244n8976D50018d8955m5333A8043b4287l0706l41630j0318A01209
18569C64730A9610f1726q9867K1145J0756B1127n616N1176J12993n7342a46942
18557A44149a42408e3321g914n7359A30133n6288K04843b17892a1406l2025J3331
18546c0100B52191G4362K23377g1978l06553a46657l04983a55227D5907a11409
$$ y = [-188883, -52793, -47404, -79244, -31101, 114231, 146518, -41626, 237340, -320353, -120776, -204908, 68753, -201197, 261238, -99846, 103569, -35676, -23151, -63028, -105239, -286701, 31344, 303635, -109293, 67230, -7141, -94089, 105856, -89130, -292350, -182147, 65240, 21646, -261842, 15311, 5909, -101183, -264881, -317113, -112007, -288004, -32156, -93642, -263083, -108016, 245658, -45722, -240966, -299942, 450018, -48955, -94288, 18043, -24287, -54993, -396623, -406941, 101209, 364730, 19610, -61726, -151593, -130448, -119692, 21127, 15511, 66687, 179680, 122338, -146942, 144149, -142408, -53321, -7914, -65273, 130133, 73845, 278688, -217892, -11406, -43431, -30100, 252191, 74362, 297739, -71978, -378531, -146657, -451640, -155227, 45907, -111409]
18535a18469j72681B06885b03396A8367a67521I8507c2440j41433A60134K19875
18525C80009H5747a31981Q134I1020d3841D0779c6610n150k0443A18318a78539
18513b12818M3601l0841F0179F895a79020D87289k10408c05305h0698H0803b88884
18501B83456e5284A45406l3709a37114j30049A19814a91019A72186a36670m396
18491a41066r8316J09233n6228l2000c3619E07682i4727K7990O612B65901e7217
18479B71958r4456B5350A1310a96674g0338A24504b82295B0636c84k28128n1915
18468b80427Q6098j04070A16100a0334p9067A23558K2121e8881B08624b87414
18457a33386B01937c23041A78046J60851c34936B25518b45943A31330P5495C762
$$ y = [-118469, -291150, 206885, -203396, 18367, -167521, 98507, -32440, -173873, 160134, 380009, 85747, -131981, -123847, 91020, -43841, 40779, -36610, -41760, -62203, 118318, -178539, -212818, -169217, -200058, 60179, 6895, -179020, 487289, 276881, -305305, -80698, 80803, -288884, 283456, -55284, 145406, 111697, -137114, -267163, 119814, -191019, 172186, -136670, -141066, -239382, -130149, -186377, -218377, -33619, 507682, -94727, -66737, -60125, 265901, -57217, 271958, 177502, 25350, 11310, -196674, -70338, 124504, -282295, 20636, -384, -228512, -280427, -194329, -298399, 116100, -10334, -89401, 123558, 145679, -58881, 208624, -287414, -133386, 201937, -323041, 178046, 338897, -334936, 225518, -245943, 131330, 206825, 3762]
18446c77626J76171R8422J9687F1049b0706j04528K0639j4959N7895A56681a76755
18434g3748j23595O5691l98160f3065b800B26106B8148d1107A68446c80037J48870
18423b31167A40238f8219B69673b7724k92323a5159j77877O3549b8724l02240
18413c30964E8531a85973i950D006g2482j66049k60941g1417B76725c9885E184
18401C56819p4480j7097G1488b59527J03764L148N6784M5910n8736A6434c90224
18389b00380h6659A21101C3062b43763B5356j182c89108P5060J14471d5394A58519
18377B5943C906b47792B6750a15295D5411Q8009o2225O960P4339B4430f0542J1349
18365d9193B4621M8635j2779j7172J77478C9746a82598C9632a3687A77402a37414
$$ y = [-377626, -201455, -103033, -83346, 61049, -20706, -125234, -104595, -119554, -61659, 156681, -176755, -73748, -197343, -131652, -529812, -63065, -2800, 226106, 28148, -41107, 168446, -380037, -231167, 140238, -68219, 269673, -27724, -320047, -15159, -193036, -129487, -28724, -330964, 58531, -185973, -9950, 4006, -72482, -238531, -499472, -71417, 276725, -39885, 5184, 356819, 282339, 265242, 71488, -259527, -155763, -152615, -95831, -49921, -108657, 16434, -390224, -200380, -86659, 121101, 33062, -243763, 25356, 24174, -389108, -314048, -199577, -45394, 158519, 25943, 3906, -247792, 26750, -115295, 45411, 133420, 71195, 78155, 152494, 24430, -60542, -49193, 24621, 73256, 60477, 43305, 220783, 39746, -182598, 39632, -13687, 177402, -137414]
18353a478r8762K7319j40152J02229d1758o8596e2021R397j66064j28698i0586
18341b71090J24401C4718J65440b37815k4581b9383j74183A82331a71556I0820
18330E0169K986a01302E3182b0048m6305j41845A25196K6315g7584b9221H6743
18318A7923c7606B65294A11916J19641j03600A8075J31371J35610C2100a66731
18307i2337o096C6439J50641E2245A0211a95907a3279j28549e5681j64499i0654
18295i4494r4102R1808P205d2750k24003k21805A26237K1102a07883j00641A6899
18283G5132a86274k4679B53576a59684L5244j8570j170k48811a01308A10221J43003
18272B53224I8714h6029F9803i583j42296l8223G0753L2717b1537A58958c07375
$$ y = [-1478, -100240, -72921, -213073, -110844, -41758, -110354, -52021, -42624, -208688, -337386, -90586, -271090, -146689, 34718, 200158, -237815, -262396, -29383, -203566, 182331, -171556, 90820, 50169, 53155, -101302, 53182, -20048, -66353, -208198, 125196, 151511, -77584, -29221, 86743, 17923, -37606, 265294, 111916, 231557, 127957, 18075, 149446, 285056, 32100, -166731, -92337, -98433, 36439, 187080, 52245, 10211, -195907, -13279, -141828, -55681, -220180, -90654, -94494, -188596, -96788, -89583, -42750, -266753, -488558, 126237, 147339, -107883, -208524, 16899, 75132, -186274, -210953, 253576, -159684, -124440, -143010, -144180, -392991, -101308, 110221, 253224, 98714, -86029, 69803, -9583, -151879, -190102, 70753, 103470, -21537, 158958, -307375]
18260f3488A05725l3703b76333A76355i5313B03517i4846A03686L8611J05764
18250B48061a14548A50816M7070k4142b2917k78109m2888a49150A68639D2682
18239c57651d4782B15703D9550p772M3421k8775g6213j33825D2284a36208k77037
18228d13245G9338a81642l5745Q7958A26137A6391i5652p6076f9766q916I5069
18216a66692B02231b97375g7489A29537k5111j6313a27507A81027b67765f8264
18205F8867a06744I572J43675l1816c87580a14277A28239g9541j45599P1361A08226
18193H8076L3288C0122a01695C03940b7440G8542a04873k67297h3223A63988d86154
18181B67853H2586J33191b71645n5347C557a94667h658q8643k27459E4372e3307
$$ y = [-63488, 105725, 72022, -276333, 176355, -95313, 203517, -94846, 103686, 142297, 248061, -114548, 150816, 197886, 173744, -22917, -301026, -343914, -149150, 168639, 42682, -357651, -44782, 215703, 49550, 41778, 85199, 56424, -76213, -210038, 42284, -136208, -413245, 79338, -181642, -217387, -129429, 126137, 16391, -95652, -171728, -69766, -78682, 95069, -166692, 202231, -297375, -77489, 129537, 104426, 88113, -127507, 181027, -267765, -68264, 68867, -106744, 9572, 153247, 121431, -387580, -114277, 128239, -79541, -225140, -153779, 108226, 88076, 121364, 30122, -101695, 303940, -27440, 78542, -104873, -372170, -83223, 163988, -486154, 267853, 82586, 215777, -271645, -326992, 3557, -194667, -8658, -97301, -324760, 54372, -53307]
18169A90713a38169L2550I3116J95914Q06J40122d5190k50645A40063K0677b23331
18157f6303b8984k34508G0457c11943a21586A06020a1330j69802R295C0748Q1868
18146A12616D8692b6699B09807m9066a3609j46580N3156q5428I4054b21357c5590
18134h3278C44198A50675C2396d7603m9260B2404J34093a29048b1356B4818b8063
18122A89418N968G5720c344j3870D6614c0843G4818b81837a11516n1454A92466
18110d4370E0543b53079A9272a98418j50285E7488N901b33728A82195a37290A18061
18098b61325C83869A13971b15668J02027F6996a68109A04974Q2914g6658A54300
18087a38645L2547G625b3450E0148b56594B76591a08716B89928A500N0867J02328
$$ y = [190713, -138169, -105619, 93116, 289030, 289836, 429958, -45190, -295835, 140063, 160740, -223331, -66303, -28984, -263492, 70457, -311943, -121586, 106020, -11330, -181132, -171837, 30748, 112616, 48692, -26699, 209807, 160741, -13609, -160189, -107033, -192461, 94054, -221357, -35590, -83278, 344198, 150675, 32396, -47603, -96863, 22404, 156497, -129048, -21356, 24818, -28063, 189418, 195386, 75720, -3344, -17214, 46614, -30843, 74818, -281837, -111516, -162970, 192466, -44370, 50543, -253079, 19272, -198418, -348703, 57488, 63389, -233728, 182195, -137290, 118061, -261325, 383869, 113971, -215668, -113641, 66996, -168109, 104974, 187888, -76658, 154300, -138645, -106098, 7625, -23450, 50148, -256594, 276591, -108716, 289928, 1500, 52367, 154695]
18076A54695a07705g080A67755L4885a08276M834j78553j11591A26693e4375e737
18064d7135k1184j34723B64786b45463j01468F21a16029d7122o3921q3424B04911
18052A08757c49406f9261B34308f8214F256i2542B3427j948L25785c5953B16723
18040b07168D5149J68040D9118J83909L5976c25599A19813J59728e1827C48751
18029A89086b7422j28654P7771B99144H9651d82003A4812a18582G4446e7514q9146
18018a46660B5929b1120A9840f5852o1646F0188r440L0392f322q7045j36512N1424
18006a78455D37447h623F6818K82107A55271b10294l41d1684o0164D6402i6168
17994B25085d0993J6674l136m0341C25799b72101c9713A20190b7622B34592A7371
$$ y = [154695, -107705, -7080, 167755, 202640, -108276, -103442, -281995, -393586, 126693, -54375, -5737, -47135, -68319, -203042, 264786, -245463, -346931, 621, -116029, -47122, -111043, -194467, 204911, 108757, -349406, -69261, 234308, -68214, 6256, -92542, 23427, 21479, 347264, -35953, 216723, -207168, 45149, 213189, 49118, 233027, 269003, -325599, 119813, 279541, -51827, 348751, 189086, -27422, -156076, -78305, 299144, 89651, -482003, 14812, -118582, 74446, -57514, -146660, 25929, -21120, 19840, -65852, -127498, 60188, 50748, 81140, -6322, -93367, -229879, -178455, 437447, -8623, 66818, 348925, 155271, -210294, -210635, -41684, -101848, 46402, -96168, 225085, -40993, -24319, -27455, -67796, 325799, -272101, -39713, 120190, -27622, 234592, 17371]
17982A25616b61055b2493B6577a50939b9929l2048C45440f39l39391J03527N6892
17971a79611A55537b24942P256q6141J16224B37525a24791p1684a8046E707K5851
17960C1558a19211o0431A75565K986d1877m4098A36437f0461R019A31161F3420
17948A9648a2419A78399c53983a64764l70441a05781d6555n4836j05472O2787
17938a44076A07313d03631C02903b41953A28770i8922A64020j794G9849e4650
17927A28985P537j166J97082a06272A7623a24710l42088a03291B1969O9748b59290
17915D6426f9820B62917j02945m538O9932i1998k8920B6560f5227A35287K6285
17904A61572d392n3512A82987b99445G3957b02556N3969c6759o0743B07230I5640
$$ y = [125616, -261055, -22493, 26577, -150939, -29929, -61977, 345440, -639, -340030, -236503, -179611, 155537, -224942, -217686, -303827, -187603, 237525, -124791, -196475, -18046, 5707, 31558, -119211, -179642, 175565, 178551, -41877, -85975, 136437, -60461, -51442, 131161, 63420, 19648, -12419, 178399, -353983, -164764, -535205, -105781, -46555, -101391, -206863, -144076, 107313, -403631, 302903, -241953, 128770, -98922, 164020, 162226, 79849, -54650, 128985, 136522, 135356, 332438, -106272, 17623, -124710, -466798, -103291, 21969, 91717, -259290, 46426, -69820, 262917, 159972, 155434, 225366, -91998, -120918, 26560, -65227, 135287, 161572, -4392, -57904, 182987, -299445, 73957, -202556, -148587, -36759, -97502, 207230, 95640]
17892A69943B9303a3616A23393d65599A79168a72909i279I9296O1818M5502a55632
17880h9291E6254f3124k62635a32595B15880g0857K8154j35069G4889a56993G1388
17868a84442j5105O9901k01864H5437a11261j48224A2668K03146b33041B75348
17857E9329L7783P4681O5949a16522A01439a31958I5495h7585c9910H6011k6889
17846E9122p912L4903L9109e7649B91238A4530c83348B09162A02392A5068a83617
17834A73059b74571B4462e6230o0243G9704k77B5736i9471E9122a11496B51989
17822A87749J37890a03924k82417A58111j3470C6025J24021a7677H2819b17744
17811b07717c5076B02255a43999H2276g6632n5846C1233b01184B0767a70765A85506
$$ y = [169943, 29303, -13616, 123393, -465599, 179168, -172909, -9279, 99296, 161114, 206616, -155632, -89291, 56254, -63124, -325759, -132595, 215880, -70857, -42703, -177772, 74889, -156993, 71388, -184442, -199547, -129646, -331510, 85437, -111261, -259485, 12668, 215814, -233041, 275348, 59329, 97112, 171793, 237742, -116522, 101439, -131958, 95495, -87585, -39910, 86011, 59122, 51210, 86113, 125222, -57649, 291238, 14530, -383348, 209162, 102392, 15068, -183617, 173059, -274571, 24462, -56230, -116473, 79704, 79427, 25736, -99471, 59122, -111496, 251989, 187749, 325639, -103924, -386341, 158111, 144641, 36025, 160046, -17677, 82819, -217744, -207717, -35076, 202255, -143999, 82276, -76632, -132478, 31233, -201184, 20767, -170765, 185506]
17799A35932M9926a0092k23356A53371N2932a46234A9270a51130M0228B5616a56893
17787a47758k21712R9772a3571F7833c11914i7563c6156B51853A4853c06224c8750
17775A62822a85005B10848P5735m0051p2792a85957n2374A60220G1422l22h5072
17763a12400m5105e9349j26060D1287a95299D38235i9137H1248K578b6092B32444
17751A81064g3738A93832a18567A37087n7731J15547c0110A95042e3039j03932
17741a56971B75726o1605m7667a44316A81911C7040a83068I8241B4179a36390
17730i3065m1375H478J98437G8954R8643D1077a31830a2446A81472F9232J97141
17719B66373a77099h2886D4245j5142J32869a27849A79675c9660r2301D4486c44314
$$ y = [135932, 185858, -10092, -233448, 153371, 206303, -146234, 19270, -151130, -110902, 25616, -156893, -147758, -369470, -269698, -13571, 67833, -311914, -97563, -36156, 251853, 14853, -306224, -38750, 162822, -185005, 210848, 286583, 246532, 173740, -185957, -238331, 160220, 71422, 71100, -85072, -112400, -157505, -59349, -185409, 41287, -195299, 438235, -99137, 81248, 83826, -26092, 232444, 181064, -73738, 193832, -118567, 137087, 79356, 194903, -30110, 195042, -53039, -156971, 275726, 214121, 166454, -144316, 181911, 37040, -183068, 98241, 24179, -136390, -93065, -134440, 8478, 206915, 78954, 177597, 41077, -131830, -12446, 181472, 69232, 266373, -177099, -82886, 44245, 29103, 161972, -127849, 179675, -39660, -131961, 44486, -344314]
17707b0293A25989K08533A15678e2567C4305c2050D426a2326A11350J96337A1456
17695C91587d6248E0102R5767a34848j94475g51j60196B62369A17711f9786B70233
17683B26306c42476A06202m6459N0466k1917N8886a39352k94590D5899d9887k01448
17672b51335I2792b8622k0921p7164G9634J78151H6815k3940L73202e5489r0882
17661a46371l9849B04067k7434d7262A8481R138O0370J32479D8565a18483M6893
17650g1590G5372Q3621B2505b50062A12381c89247a46533C59244A11151d20172
17639h4396I0268B0818c00902d0766A87429h3550A88940N4610a1606B26444D1498
17627b33976j1928d7165A4825J468f6816j06722A64915p381j7117b46474A85750
$$ y = [-20293, 125989, 334522, 115678, -52567, 34305, -32050, 4426, -12326, 111350, 307687, 11456, 391587, -46248, 50102, 145869, -134848, -329323, -751, -160947, 262369, 117711, -69786, 270233, 226306, -342476, 106202, 59743, 110209, 88292, 147178, -139352, -433942, 45899, -49887, -251335, 92792, -28622, -49543, -126707, 79634, 257785, 86815, 62875, 436077, -55489, -146371, -186220, 204067, 176633, -47262, 18481, 27619, 87989, 220468, 48565, -118483, -71590, 75372, 158993, 22505, -250062, 112381, -389247, -146533, 359244, 111151, -420172, -84396, 90268, 20818, -300902, -40766, 187429, -83550, 188940, 243550, -11606, 226444, 41498, -233976, -245904, -47165, 14825, 16293, -66816, -173538, 164915, 157534, 140417, -246474, 185750]
17615A78013G9158Q5809a8764G1035c2492r3977j47988A02391g2691B4004d06664
17603e7979o3403J2798k6556D7118c1789l7243E4044b90955J8249L3852A72891
17591F8824j9028J45222d1360B25321e62n10C69237C5542a77767a1563A22490
17579a97102A22948a32520B58458a33117E8882L0824K39343F6639B0670a13842
17568C40674A38277f6677J6876B74378a39105l6273B14930a01906n6032B36966
17557f1882j47450E5063a56670A52896n3937O339a95406H3000J91937A29184K60872
17546C90056h8083F2559b89801G0800A5908K9897J64624f6460a3814A81388M7816
17535B29204K1246c8981F5321O3610b75095D32953a9158C5955f7832A4330J18146
$$ y = [178013, 79158, 164967, -18764, 71035, -32492, -126469, -274457, 102391, -72691, 24004, -406664, -57979, -121382, -108584, -135140, 47118, -31789, -69032, 54044, -290955, -272706, -238854, 172891, 68824, 49796, 195018, -41360, 225321, -562, -1072, 369237, 35542, -177767, -11563, 122490, -197102, 122948, -132520, 258458, -133117, 58882, 89706, 329049, 66639, 20670, -113842, 340674, 138277, -66677, -49801, 274378, -139105, -175378, 214930, -101906, -157938, 236966, -61882, -209332, 55063, -156670, 152896, 98959, 105298, -195406, 83000, 274937, 129184, 390056, -88083, 62559, -289801, 70800, 15908, 45805, 210429, -66460, -13814, 181388, 229204, 250450, -38981, 65321, 128931, -275095, 432953, -19158, 35955, -67832, 14330, 132476]
17524A32476b40409C60108A40603K4676J75195b61328c6353C71667C3105b0867
17513B88212A22446a25707A82494a24639C06154d0346j35856B24913p3623B7602
17502F0824a19940C30997b4598B37786n6778a49961A50842o9718B3260L02428
17492C25688b75424c0982p3651l305M1181D863L35644g2912b5686j5320F3131
17480b4659k24629A54444D6798K40726d7052N016B15521b4063B68587M3916H0712
17468A96394c6930A75717b6947k63p2641D0309q278h1143K2553i886G648K82479
17456B90127q8947L808C9002J52702n8587j8526J75129M1731q7995K47463G4766
17444C37294m8309E9589J46254H4365N6829e3194B01611J97487I4030K59848N3005
$$ y = [132476, -240409, 360108, 140603, 165279, 340474, -261328, -36353, 371667, 33105, -20867, 288212, 122446, -125707, 182494, -124639, 306154, -40346, -176202, 224913, 151290, 27602, 60824, -119940, 330997, -24598, 237786, 181008, -149961, 150842, 81124, 23260, 325688, -275424, -30982, -104633, -107938, -66757, 4863, 340507, -72912, -25686, -41006, 63131, -24659, -249288, 154444, 46798, 287524, -47052, -42036, 215521, -24063, 268587, 312503, 80712, 196394, -36930, 175717, -26947, -27210, -99851, 40309, 32031, -81143, -58590, -9886, 7648, 290127, 201180, 204988, 39002, 191704, 133117, 114591, 289720, 331451, 243456, 490919, 74766, 337294, 288985, 59589, 205843, 84365, 141194, -53194, 201611, 399098, 94030, 353878, 406883]
17433D06883l5138A07892o460b00760B59992H3677M00713O562j28891J20157H8898
17421C81425A11966J15322J01839E2744P240M87524O7718A91783J63404L11332
17411F66519B04481K02208I2436p669L69972C2366L1870d3495C69836d7370B9992
17399A22126a68533B6902d0709H9893J40723H5921K7874j1910L0995J16091L0700
17388B79671A8037K39462M8623A15548a46834F0995K45559j27968i8042B74712
17377G0344a8003C92196C116Q4293R6839m6633D1543R7840J8730J14112A20030
17365C01345E2140N3402j0316c8823C95512b61373B8061h9589A80252l6410G1595
17353a01384D41783a55280A94430l5055B3390J49524N6147L12481A88087E1339
$$ y = [406883, 371745, 107892, 101432, -200760, 259992, 83677, 484390, 490952, 362061, 482218, 88898, 381425, 111966, 227288, 329127, 52744, 59984, 547508, 615226, 191783, 355187, 666519, 204481, 406689, 92436, 84767, 454739, 32366, 64236, -43495, 369836, -47370, 29992, 122126, -168533, 26902, -40709, 89893, 230616, 85921, 113795, 101885, 132880, 248971, 279671, 18037, 257499, 306122, 115548, -146834, 60995, 306554, 178586, -98042, 274712, 70344, -18003, 392196, 3116, 87409, 184248, 137615, 41543, 139383, 158113, 272225, 120030, 301345, 52140, 105542, 95226, -38823, 395512, -261373, 28061, -89589, 180252, 143842, 71595, -101384, 441783, -155280, 194430, 159375, 23390, 172914, 229061, 541542, 188087, 51339]
17342A53301N7135J21172o6562L076q1194G3605J37932G5350e0710l440B75785
17330a09985c7496B49379d4555B99981A07390J48218n8884n0860J71355D4427
17319D63309A99838E3954k1553L26038J28243A31326K29173I8283J23608J01887
17309C23778A43983J14038K57972q4402c3621B34925N5933r1591j9843B8946L20609
17298C49555P8506F5336L66940A17412K55543n4595I1712K13262A49253J30026
17288B79279R8694q425e1395D41442k10686n6745a08052B98781C0108K43474A04178
17276A13975l7895a48313D55592k11052r5375K4939K45106A56691B3129K56200
17266B79329Q8996l7198p7308a44448B03389a77015B4415K40651p9859J39104
$$ y = [153301, 210436, 331608, 265046, 268122, 186928, 73605, 211537, 75350, -50710, -54150, 275785, -109985, -37496, 249379, -44555, 299981, 107390, 255608, 196724, 145864, 317219, 44427, 463309, 199838, 53954, 32401, 358439, 486682, 131326, 360499, 98283, 221891, 323778, 143983, 258021, 515993, 431591, -33621, 234925, 290858, 199267, 179424, 28946, 349555, 428061, 65336, 432276, 117412, 372955, 318360, 91712, 304974, 149253, 279279, 377973, 369548, -51395, 441442, 230756, 174011, -108052, 298781, 30108, 273582, 104178, 113975, 76080, -148313, 455592, 244540, 149165, 174104, 419210, 156691, 23129, 279329, 368325, 331127, 253819, -144448, 203389, -177015, 24415, 265066, 185207, 324311]
17256C24311A03641K06176k9870j19838D7340L06712J86626l7554B47634A00494
17245A96813J20123K62947B49135L8462k9288j07696M667L00608b0364A91379
17234C92632M6541j48666A00701J39761r7915a76622C08513A53550o7344P1773
17224A57979p4161K67281G8450b35058B41484K9924j29063m5598M3295L03722
17214D43764j49977a16923e2375E37034j31753I0257K30908m0813A31505J15887
17204B47392K38526A62841N4841b20753A60451J36203J95606C610O14031B15823
17193E95806C5709K04479E9032M57724l2984m6353A37481M28492B28809E9559
17182E05839A02417J58880j0109N0154H1724L77800p912j2786j33447m6794R4957
$$ y = [324311, 103641, 309817, 279947, 160109, 47340, 354052, 540678, 503124, 247634, 100494, 196813, 316936, 579883, 249135, 287597, 258309, 150613, 155280, 455888, -20364, 191379, 392632, 439173, 290507, 100701, 240462, 142547, -176622, 308513, 153550, 86206, 157979, 83818, 351099, 78450, -235058, 241484, 271408, 142345, 96747, 140042, 443764, 293787, -116923, -52375, 537034, 405281, 90257, 321165, 280352, 131505, 247392, 485918, 162841, 217682, -220753, 160451, 296654, 492260, 3610, 617641, 215823, 595806, 35709, 240188, 59032, 516756, 483772, 437419, 137481, 565973, 228809, 59559, 505839, 102417, 261297, 251188, 301342, 81724, 459524, 451612, 438826, 305379, 258585, 353542]
17171C53542A31152J24326j10636J99354r2718O0248J03889m6537N24130E4410
17160D60524A26051L17084o6899j5242J10127q0755A86443M86230f8058A80690
17149B35849C7361n729L57461J94716B06359J59729j49713J8373p4596J07276
17139B67428J25152j64781r9624L02742j93622L5105F4221P2793N5851J18402
17129C11267J31848A76094M5768K75842J4466p2514l2941K93808I8890L73994
17119D72884A13819l1002O94209k74912j85052P2588L13613k07427j51831o264
17109C37741L09853j41960K00344B76842Q0280L44431p1661k59024L19833k57378
17099D33323A97887K98247k3992k04162J04064J90827j45469n8088P7617m6107
$$ y = [353542, 131152, 255478, 144842, 344196, 251478, 311726, 415615, 369078, 893208, 54410, 460524, 126051, 443135, 376236, 360994, 471121, 390366, 186443, 672673, -68058, 180690, 235849, 37361, 31632, 389093, 583809, 206359, 366088, 216375, 234748, 160152, 267428, 392580, 227799, 128175, 430917, 237295, 272400, 64221, 137014, 192865, 311267, 443115, 176094, 221862, 497704, 512170, 439656, 406715, 700523, 98890, 472884, 113819, 82817, 777026, 502114, 317062, 389650, 703263, 495836, 344005, 337741, 647594, 505634, 705978, 276842, 357122, 701553, 629892, 370868, 690701, 433323, 197887, 496134, 472142, 267980, 372044, 562871, 417402, 359314, 436931, 390824]
17089C90824Q2141R7058j35619L8365j19425J16284L8994j59685K26628j27961
17079D47604J93418N9289j50459N93550E57223j63750J13766l4021n5507R9855
17069E17566n718j37401G5596M26236K76383m7241B26304L2730M82078J08617
17059H49729j02959l58393k3402K50871O3411k6215k33581L20883k74014p8970
17049C87360m7615K24389K50555o5485j68452j06793J34685J10821o8140R9118
17039G50443O101j54114J99583k10157k51830J78727L0807j06043O9915j2954
17029E00478K24798K53624l22240o4045K31243k7474j88237B88056M95355P5653
17019H59064L1321k98880L9260K31703J5033j6585R194l51748K69401k30386K75742
$$ y = [390824, 472965, 570023, 434404, 472769, 353344, 469628, 508622, 348937, 575565, 447604, 641022, 700311, 549852, 1143402, 557223, 393473, 507239, 473218, 417711, 517566, 511848, 374447, 75596, 501832, 778215, 730974, 226304, 259034, 741112, 849729, 746770, 388377, 364975, 615846, 679257, 653042, 419461, 740344, 466330, 387360, 339745, 564134, 814689, 749204, 580752, 473959, 608644, 719465, 651325, 750443, 756544, 602430, 802013, 591856, 340026, 518753, 549560, 443517, 513432, 500478, 725276, 978900, 656660, 592615, 823858, 796384, 608147, 288056, 783411, 859064, 890385, 591505, 630765, 862468, 877501, 860916, 870110, 518362, 787763, 557377, 833119]
17008H33119J67138l97617q7158M00225j01430l5420J85935j60056k44395L25029
16998H85370K7023J6476o6081m7027j15283K19513N48812o47087L03876M0009
16988A165601k2243k01630k70216L16144K05450k63742J51051l79702M05974l30859
16978G75828L51758l1912m99539M5973L87476j69501K05484k39256K28692Q657
16968A063660l43530M29859L8568k91061R284J43415p6709J41375k91652N36711
16958A359920j69550j82732N8084L26242k05566K57901N0674l00483j77753L10524
16948A327261m1102j85276K75111l5993J2974l12850R4524J53533p9292K56724
16938A465614L8356j41459P5017l97775Q8957L04957j78276k3391J88503J64297
$$ y = [833119, 1000257, 602640, 515482, 915707, 814277, 778857, 964792, 804736, 560341, 885370, 912393, 928869, 862788, 815761, 700478, 919991, 1468803, 821716, 1125592, 1165601, 1143358, 941728, 671512, 987656, 1193106, 929364, 1080415, 700713, 1106687, 775828, 1127586, 1095674, 596135, 642108, 1029584, 860083, 1065567, 826311, 1055003, 1063660, 720130, 1149989, 1188557, 897496, 906780, 1050195, 973486, 1114861, 823209, 1359920, 1190370, 1007638, 1065722, 1391964, 1186398, 1444299, 1494973, 1194490, 1016737, 1327261, 1286159, 1100883, 1375994, 1340001, 1352975, 1040125, 1134649, 1288182, 1208890, 1465614, 1503970, 1362511, 1437528, 1039753, 1128710, 1433667, 1255391, 1232000, 1420503, 1584800]
16928A584800q2779j21680P5737K16035j10801J76332m73855L25012Q5292K29850
16918A903943j23914j64470n6431M05351j77634m57886J69535J02263k43176J58883
16908A516464M7159M55317m66932o1250N81774j04125n3162O2210o9478j65828
16898A742149L74134j18091J41221r3454J10265j57596R8864K16768j74990j24250
16888B015020L77719j0533l20763L70262k71415J83260m0670J05712j89618J22540
16878B341514J01403r4713J83974J69984r7576M34691j3701k16031m7382j54988
16868B607175M42742k33870L83453l75800N4125J84265m3641k52117L26041L51814
16858C444187k03815P25575o02330M63185k82722j73194L75508n2075j72727J24081
$$ y = [1584800, 1502021, 1380341, 1456078, 1672113, 1561312, 1737644, 1263789, 1588801, 1674093, 1903943, 1780029, 1615559, 1559128, 1964479, 1786845, 1328959, 1498494, 1600757, 1357581, 1516464, 1563623, 2018940, 1552008, 1490758, 2072532, 1968407, 1915245, 1977455, 1907977, 1742149, 2116283, 1998192, 2139413, 2045959, 2156224, 1998628, 2097492, 2314260, 2139270, 2015020, 2392739, 2382206, 2061443, 2431705, 2160290, 2343550, 2302880, 2408592, 2218974, 2341514, 2442917, 2348204, 2532178, 2702162, 2604586, 3039277, 3025576, 2809545, 2762163, 2607175, 3049917, 2816047, 3199500, 2823700, 2877825, 3062090, 3018449, 2766332, 3092373, 3444187, 3240372, 3965947, 3363617, 3826802, 3544080, 3370886, 3746394, 3694319, 3521592, 3645673]
16848C645673J23971J4484k07507L69366L5493K93605m9886J26027k97650K39521
16838D293097L0670j3532M66967P1535j63384O8953l1149o268J39953J27875M4740
16827E029457O64782k04681L71204k17267p5319J83632n1695L95865k37930K30992
16817F089040M69242j01373K26559q8595J07982J04248J70493K6279N86437R1178
16807G681490j12397Q4493M43857K60855k711L60928J88460J51853O2127K27268
16797I346223K94033K22855J18589M50408j35591K76159R32545m27864Q93790
16788A1971147J7135K31888L61818M05023M88707J64114K59695O32471K38884
16779A4770882O45818L59835M16466O04642O2884P60379Q27721L35307O30723
$$ y = [3645673, 3769644, 3784128, 3576621, 3945987, 3981480, 4275085, 4225199, 4351226, 4053576, 4293097, 4323767, 4310235, 4777202, 4848737, 4685353, 4754306, 4723157, 4716889, 4856842, 4984717, 5029457, 5694239, 5489558, 5860762, 5643495, 5568176, 5751808, 5700113, 6095978, 5858048, 6089040, 6558282, 6456909, 6683468, 6594873, 6702855, 6807103, 6977596, 7003875, 7590312, 7681490, 7569093, 7653586, 8097443, 8358298, 8355587, 8716515, 8904975, 9056828, 9118955, 9346223, 9640256, 9863111, 9981700, 10432108, 10296517, 10572676, 11505221, 11077357, 11971147, 11988282, 12220170, 12581988, 12987011, 13475718, 13639832, 13899527, 14531998, 14770882, 15416700, 15776535, 16193001, 16797643, 16860527, 17620906, 18448627, 18783934, 19414657]
16770A9414657P62011O06610N45783J133920K08351J143148Q85976J078211J086198
16761B6864865N23190Q60512J274282J460266J326120J035250J695118J110164
16753C6149767J830126J693075J734526J324379K191526K261558K201245K217090
16745E1603292K683019K597016K890984L265544L129985L274116L879567L364190
16737G6687713M204384M959625M713786M534840N185792M748186N883148N804265
16729A16721739O160194O275803O154394O005393O545693N860269N511839N537778
16721A64773102M777076M600974L908292K383110K303879J025861k11509j385959
16713A82174826j947790k793085l637992m792948n400605n200609o064246o156252
$$ y = [19414657, 20176668, 20783278, 21329061, 22462981, 22671332, 23814480, 24700456, 25778667, 26864865, 27388055, 28248567, 29522849, 30983115, 32309235, 33344485, 35039603, 36149767, 37979893, 39672968, 41407494, 42731873, 44923399, 47184957, 49386202, 51603292, 54286311, 56883327, 59774311, 63039855, 66169840, 69443956, 73323523, 76687713, 80892097, 85851722, 90565508, 95100348, 100286140, 105034326, 110917474, 116721739, 122881933, 129157736, 135312130, 141317523, 147863216, 153723485, 159235324, 164773102, 169550178, 174151152, 178059444, 180442554, 182746433, 183772294, 183560785, 182174826, 180227036, 177433951, 173795959, 169003011, 163602406, 158401797, 152337551, 146181299]
16705A46181299n935586o417321o735487n985300o134337o029756n357336n658804
16697I7927372n023827n039694m706703m320880m099355l878429l713111l341582
16689F3803791l149767l372608k760975k040310k859574k121628k426299k384764
16681D2687866j633969j668415j754860k003950j088288j496404j272346j362620
16673C0407014j314657j096932j161109r21930j005294r26154q59111j064506
16665B2057321p66143p06529n34870q60922n70414n06095n40870l94884r94254
16656A6182340k54798n29055n58672l45650n74149l17715k40105m89176j68218
16647A2704802o54040k93222k22470k35550p22722K24142l68720l18454n68621
$$ y = [146181299, 140245713, 133828392, 127092905, 121107605, 114973268, 108943512, 103586176, 97927372, 92903545, 87863851, 83157148, 78836268, 74736913, 70858484, 67145373, 63803791, 60654024, 57281416, 54520441, 52480131, 49620557, 47498929, 45072630, 42687866, 41053897, 39385482, 37630622, 35626672, 34538384, 33041980, 31769634, 30407014, 29092357, 27995425, 26834316, 25912386, 24907092, 23980938, 23121827, 22057321, 21291178, 20584649, 20049779, 19188857, 18618443, 18112348, 17571478, 17176594, 16182340, 15927542, 15398487, 14839815, 14494165, 13920016, 13602301, 13362196, 12873020, 12704802, 12050762, 11757540, 11535070, 11299520, 10576798, 10800940, 10432220, 10113766, 9545145]
16638I545145J15516r5409l07186j18137p64101p4217j81425l20689J2788j86755
16628G625530o1677j25607r7669p6571j64846n21542k37251j49937j88696J37052
16618F138786m3836q9205m69679J38059K28070m34091l41070R1354J25855m34504
16608D909739k75894L17732l2877l14455j19880j74776K53393k98933K40628k06878
16598D297799K206j05321m02259P2068j31015J38386j45035O2994p083p7044l3497
16587C672199j56188J90286l31196j90660J65294k01681k5063K2562j58570j36563
16577B850420L39726m51098L15755k62296J50650k75269o8132K72573o0979l67339
16567B444011K56022j76893l13697M81640P9054l13292j31177J82174n21708K95875
$$ y = [9545145, 9660661, 9565252, 9258066, 9139929, 8375828, 8301611, 8120186, 7799497, 7812285, 7625530, 7563853, 7438246, 7340577, 7264006, 7099160, 6577618, 6340367, 6190430, 6001734, 6138786, 6094950, 6005745, 5536066, 5674125, 5902195, 5468104, 5127034, 5218388, 5344243, 4909739, 4633845, 4951577, 4918700, 4604245, 4484365, 4309589, 4562982, 4264049, 4504677, 4297799, 4300005, 4194684, 3792425, 3864493, 3733478, 3871864, 3726829, 3789823, 3782740, 3705696, 3672199, 3516011, 3706297, 3375101, 3184441, 3349735, 3148054, 3122991, 3145553, 2986983, 2850420, 3190146, 2739048, 3054803, 2792507, 2943157, 2667888, 2599756, 2872329, 2811350, 2444011, 2700033, 2523140, 2209443, 2691083, 2770137, 2456845, 2325668, 2507842, 1986134, 2282009]
16557B282009L1308J01566k80370j62540J13203m42680K50290l7501K88691j70492
16547A973484m46384N00849l01092j49821J33746K74572n9916l30681M56616m74115
16537A577258O1236L1175N3804j56812M54484m45787M6650j54183J10586l65244
16527A213167K45049M8596L32931j68734n787M789k66046K71463k55701k35166
16517A184561m3993j9436K24271r3032J3865J79689k91857J1140J44248k41248
16507A068208Q7017J41998l61020K31344m2369j61256o4630J03822R1116M8938
16497A143168J01209n8129l29248J02355j33340J15666M09743j4954k68637K84014
16487A351847l73366k79481J66873J21404J82196k74421J8295R488J31898k39613
$$ y = [2282009, 2313317, 2414883, 2134513, 1971973, 2085176, 1642496, 1892786, 1855285, 2143976, 1973484, 1527100, 2027949, 1726857, 1577036, 1710782, 1985354, 1925438, 1594757, 2051373, 1577258, 1638494, 1669669, 1723473, 1566661, 2021145, 1575358, 1622008, 1467825, 1578411, 1213167, 1458216, 1506812, 1839743, 1671009, 1665222, 1670011, 1403965, 1675428, 1419727, 1184561, 1140568, 1121132, 1345403, 1252371, 1266236, 1445925, 1154068, 1165208, 1309456, 1068208, 1155225, 1297223, 936203, 1167547, 1125178, 963922, 899292, 1003114, 1094230, 1143168, 1244377, 1186248, 857000, 959355, 826015, 941681, 1351424, 1336470, 1067833, 1351847, 978481, 699000, 865873, 987277, 1169473, 895052, 913347, 922835, 1054733, 815120]
16477H15120L5497O6341k31281Q5368l3549M94729m91075L34084k27515J72449
16467A020168p5552J71599l23059K02025k3970k51847J62248j56117J1474j7118
16457G19851K63744J63887n09584L12409p6547j85681k48810J13710K11217k35568
16447E28628M13298l76128K42704n0319k134j98523K95646j24655K06176l35279
16437E99414p3114J47981j04100N4142l4678j64992J0674P4618j75377j44275
16427A90293L81556k9119j58938J02964L21647l72133J75423m5735M79091l43188
16417G01861C28391K95901k41422L79762l32613j33626J27308K46871k39163o4660
16407C66749J44849J33900l12613k9998P9016J71565j5775r2586r7630L9060J52597
$$ y = [815120, 850617, 916958, 685677, 771045, 737496, 1232225, 741150, 1075234, 847719, 1020168, 944616, 1116215, 793156, 995181, 971211, 719364, 881612, 725495, 736969, 719851, 983595, 1147482, 637898, 950307, 873760, 688079, 439269, 552979, 764196, 528628, 941926, 565798, 808502, 758183, 756049, 557526, 853172, 728517, 934693, 599414, 526300, 674281, 570181, 624323, 589645, 424653, 435327, 509945, 334568, 190293, 571849, 542730, 383792, 486756, 808403, 436270, 611693, 565958, 1045049, 701861, 328391, 624292, 382870, 762632, 430019, 296393, 423701, 670572, 431409, 366749, 511598, 645498, 332885, 302887, 381903, 553468, 537693, 445107, 347477, 386537, 539134]
16396E39134K6597j42641R9716B34751E8230P1374J89478j19252J48033r8320
16386B49543J91642k01251K95709J6150j23887J87551j78232r7121J7208r9448
16376B57864J60383I0509a00186E06732l2156j22148J44486B45380p5092J64300
16366C34588q1705J2535J63588j97325j466M0624K6461q4756J2288K94386b9023
16354D06095A96016J37129n2817J38112n8546I5490b6385B75678j13585P5530
16344B37623N8125D9410P0443L10788o1288A57996J530c0683E73713k16206o5953
16333B91554K39419j97626P4574j74516J09071A42199E6774R3823N21462j15748
16323E56311B04540P8298m0292Q3802F5746J11915J28418n1288K27862D7317c00094
$$ y = [539134, 565731, 423090, 522806, 234751, 58230, 129604, 319082, 199830, 347863, 249543, 441185, 239934, 535643, 551793, 427906, 615457, 437225, 340104, 357312, 257864, 418247, 90509, -100186, 506732, 474576, 352428, 496914, 245380, 170288, 334588, 252883, 265418, 429006, 231681, 230215, 270839, 297300, 212544, 224832, 519218, -29023, 406095, 196016, 333145, 280328, 418440, 359894, 95490, -26385, 275678, 162093, 237623, 295748, 49410, 119853, 430641, 369353, 157996, 159526, -30683, 573713, 357507, 291554, 530973, 333347, 407921, 233405, 342476, 142199, 56774, 150597, 672059, 556311, 204540, 282838, 242546, 326348, 65746, 177661, 306079, 254791, 482653, 47317, -300094]
16311I5175K40603J5770J32084b3996G4514N5478m6183k9863B5637a04956E2317
16299A11824N6407q883i5353A71375L20158A67221G4297l4715R6755R848N2002
16288A98187j8981K03683j16628J13862A37767K5020J26166j37317O0621K35641
16278D47898h2069F74968C16845A49023j2778N6651p4814c8589B35273O168a5075
16266i9253A31386J31954b63234B889h9482C05179n1632q6957D1786O7949m7821
16255F1914L14827J4365H3052L2698J89789B2490J33205J26256i5084B48289a31403
16243E35467I1330N8198F7864J32339m8037O0417J22207D6199L35674I296M01798
16232D11094j57779g5581C56601C3136j2831M15241I8481a99659E16920I3004
$$ y = [95175, 335778, 351548, 483632, -23996, 74514, 129992, 83809, 53946, 25637, -104956, 52317, 111824, 168231, 159348, -95353, 171375, 491533, 167221, 74297, 39582, 136337, 146185, 198187, 179206, 382889, 266261, 380123, 137767, 162787, 288953, 151636, 212257, 447898, -82069, 674968, 316845, 149023, 136245, 192896, 118082, -38589, 235273, 241441, -15075, -99253, 131386, 263340, -263234, 2889, -89482, 305179, 253547, 166590, 41786, 109735, 61914, 376741, 391106, 83052, 115750, 305539, 22490, 155695, 281951, -95084, 248289, -131403, 535467, 91330, 149528, 67864, 200203, 152166, 212583, 334790, 46199, 381873, 9296, 411094, 253315, -75581, 356601, 33136, 20305, 435546, 98481, -199659, 516920, 93004]
16221G7069k9633K07196G6386N234M067J83833D519K10119B4049J64678O6633
16210B55360A9122k956b41076A11713L2662l4450Q7082b88162A77633F905L13115
16199C20020A31522N8414b88894A37850E6588K85716g8068A69938J01677f3328
16188A80912b98999a29295D17241r4272j59692J5198i4723C28650c3818P114A29152
16176A03939g6959B24189O2764b1667I7955J52445J77507b04255i7111j86406
16166b83517a19184C84957C9274b2472j68481b7019F6296Q7936a42672A55173
16155a68170A74929e8200F3547d6150j36917h558B5262i158I1229J51617p8267
16144A64579a69156j87715b9578A96073B6812K41465a73961J5041a9527A27846
$$ y = [77069, 47436, 254632, 76386, 81620, 85687, 269520, 4519, 214638, 24049, 188727, 255360, 19122, 16166, -241076, 111713, 144375, 109925, 197007, -288162, 177633, 6905, 320020, 131522, 189936, -288894, 137850, 56588, 342304, -78068, 169938, 271615, -63328, 180912, -298999, -129295, 417241, 322969, 163277, 178475, -94723, 328650, -33818, -26704, 129152, 103939, -76959, 224189, 286953, -21667, 97955, 250400, 427907, -204255, -97111, -283517, -119184, 384957, 39274, -22472, -190953, -27019, 66296, 154232, -142672, 155173, -168170, 174929, -58200, 63547, -46150, -183067, -8558, 25262, -9158, 91229, 242846, 164579, -169156, -356871, -29578, 196073, 26812, 268277, -173961, -158920, -19527, 127846]
16133F5324J79581e2096j34894A43489d8612l4374D83032j85642b28346A18184
16122I1141b29000E7848b32018D39658i5862j88880G8050d7627A82745J52041
16112C34786A17621P7154F4229B9244M2768e3510j04053N649A09040b00048C4400
16100E82541E5308J89530q5774M3244c3958A10033b87895D0448a26701B3432J85349
16089B08781b54104A09675a45394A91375a91812e7413a6139q9131A66740b33513
16078i7413d6902k08072A64645F9305N9527N3303k2413L8696f4946E7531J86018
16067B43549E4955i2710b0466l817j15590B37053e1411j49614f3044E2768a44881
16055f6774H6482c64151A64997a15907M5733j29087B9353e0387A28884G583h5819
$$ y = [65324, 244905, -52096, -186990, 143489, -48612, -82986, 483032, 297390, -228346, 118184, 91141, -229000, 57848, -232018, 439658, -95862, -284742, 78050, -47627, 182745, 334786, 117621, 194775, 64229, 29244, 72012, -53510, -157563, -151914, 109040, -200048, 34400, 582541, 55308, 244838, 159064, 202308, -33958, 110033, -287895, 40448, -126701, 23432, 208781, -254104, 109675, -145394, 191375, -191812, -57413, -16139, -105270, 166740, -233513, -97413, -46902, -254974, 164645, 69305, 128832, 182135, 159722, 198418, -64946, 57531, 243549, 54955, -92710, -20466, -24283, -139873, 237053, -51411, -201025, -63044, 52768, -144881, -66774, 86482, -364151, 164997, -115907, -70174, -199261, 29353, -50387, 128884, 7583, -85819]
16043a76823d5276o1299m54184C07044k8662A13969j4965a13065A4748K68584
16033B83332c06466d6979k02800d3058A1290b6777k58641C1138c1419A14478J41409
16022B55887q6371J72310a62677L9126A8996J17675K5542K70998e1097k82776
16012c33873J63722A0366M235a47334k2599j3584j47612G0542q203a74627a9387
16000B2182J05585J4181B9761H565J20732a21515p4724g2366b9537m1193l5523
15989a06253D76273h5996r0417A16340b74389A75676k217J17990k1326n4487O7797
15978B83433m5700a4190j1212q3857A92806i5906a2564D2336n969K90208f4622
15966A45746J94999n3259A6207b29628B00993a65996A6329a59328j66237d5546
$$ y = [-176823, -45276, -106575, -560759, 307044, 278382, 113969, 99004, -113065, 14748, 283332, -306466, -46979, -249779, -43058, 11290, -26777, -285418, 31138, -31419, 114478, 255887, 169516, 341826, -162677, -123551, 18996, 136671, 162213, 433211, -51097, -333873, -170151, 10366, 14601, -147334, -169933, -183517, -331129, 70542, 62339, -174627, -19387, 22182, 127767, 141948, 29761, 8565, 129297, -121515, -196239, -72366, -29537, -70730, -106253, 476273, -85996, -176413, 116340, -274389, 175676, 173459, 291449, 270123, 215636, 283433, 237733, -14190, -25402, -109259, 192806, -95906, -12564, 42336, 36367, 326575, -64622, 145746, 340745, 287486, 16207, -229628, 200993, -165996, 16329, -159328, -325565, -45546]
15955A32846j3629a46823M3709d3750q3672C12389b2927A64399b92607m2562h2305
15943a88116f0985A86636b38901A44622a58823j34598B19294a29443A72696a02126
15932G8616a07221A58530d3336j90817L1059A53147b20735A04247b06094K5036
15922a81058d8927A40663d1562A69087b64655a8014k54497e6764l3361G0978a12883
15910A19941D2396O2179J6718K56334A04545N1297c51077A55173l501E049a33023
15898A88402b22192F5834a98210I6783i1288B44392p7948D9748P9778o3181Q7523
15887A53868n7511a7197j16045G6750c40102a26103b0763B25485E1111K6290e3811
15875B68693a31472k1572f1358C71442h7724K3733b9488q6374J387A10109b87320
$$ y = [132846, 119217, -146823, -103114, -43750, -127422, 312389, -22927, 164399, -292607, -335169, -82305, -188116, -60985, 186636, -238901, 144622, -158823, -293421, 219294, -129443, 172696, -102126, 78616, -107221, 158530, -43336, -234153, -203094, 153147, -220735, 104247, -206094, -181058, -48927, 140663, -41562, 169087, -264655, -18014, -272511, -56764, -90125, 70978, -112883, 119941, 42396, 104575, 121293, 377627, 104545, 155842, -351077, 155173, 151672, 5049, -133023, 188402, -222192, 65834, -198210, 96783, -91288, 244392, 166444, 49748, 129526, 66345, 153868, 96357, -17197, -133242, 76750, -340102, -126103, -20763, 225485, 51111, 77401, -53811, 268693, -131472, -153044, -61358, 371442, -87724, -63991, -29488, -115862, -114475, 110109, -287320]
15863b41437k0338g6030G1045J23152a5185j21836A41522a7594k2538K733B08270
15851A38158c21705G0592b36412F3516K12961a7332A52142a24230D2193c4056
15840D512J6136h2259j10962G6041a67471m2388e417k05810D5577a65110N2710
15829a12400E5221j9469M0047j5924a14447J6876B04512a12083C8135K3657a15931
15817C35214A23091M5331b28253M6194B39924a67081A373g9149C19180b77869
15806a79372F2526h8413A45000p146c51122a7613q9954F3648a51506o5967O5983
15795a51490m2550j67532G5446i3285B47253B8014d26229B60749m1913R4903B9674
15783b09996i9512A76805c70692A87791g8309F2770b26717B5754K43041I4876
$$ y = [-241437, -261775, -76030, 71045, 194197, -15185, -137021, 141522, -17594, -40132, -37399, 208270, 138158, -321705, 70592, -236412, 63516, 276477, -17332, 152142, -124230, 42193, -34056, 4512, 20648, -82259, -193221, 76041, -167471, -209859, -5417, -211227, 45577, -165110, -112400, 55221, 35752, 75799, 59875, -114447, -97571, 204512, -112083, 38135, 61792, -115931, 335214, 123091, 168422, -228253, -182059, 239924, -167081, 1373, -79149, 319180, -277869, -179372, 62526, -88413, 145000, 137854, -351122, -17613, -107567, 63648, -151506, -217473, -151490, -194040, -361572, 75446, -93285, 247253, 28014, -426229, 260749, 218836, 313739, 29674, -209996, -99512, 176805, -370692, 187791, -78309, 62770, -226717, 25754, 268795, 94876]
15772b84737C9161d9955B03358G9407a40464D9488b42159A91374j9226o5790C6673
15760A97174J6384J63980a799B71453A26374B4016R3497R2858P4820b86366I54
15748B26411B6483J93690G1482K42855a46138A77707K3466E0056J10324p8100
15738H2280a49196k4793a3031A49756J06469a26974k48724B08196b31699D65295
15727i4817H2339j9936h15j46723A38110a38871m321J1994A29568a71221d3923
15715g3470k26390A29418b19235Q5348n504C2369M1384a76568q4395B60914c5743
15703G834b04915B70702g9668b2949g793B21034a15114C47573q8231j04193b28111
15691A03072b03059A88607J69266D4783a50853m3276A0747g9751B51588F6273
$$ y = [-284737, 39161, -49955, 203358, 79407, -140464, 49488, -242159, 191374, 172148, 106358, 36673, 197174, 213558, 377538, -1799, 271453, 126374, 24016, 117513, 210371, 285191, -286366, 954, 226411, 26483, 220173, 71482, 314337, -146138, 177707, 201173, 50056, 160380, 82280, -149196, -173989, -13031, 149756, 256225, -126974, -375698, 208196, -231699, 465295, -94817, 82339, 62403, -815, -147538, 138110, -138871, -143192, -131198, 129568, -171221, -43923, -73470, -299860, 129418, -219235, -133887, -139391, 32369, 73753, -176568, -260963, 260914, -35743, 7834, -204915, 270702, -79668, -22949, -7793, 221034, -115114, 347573, 259342, 155149, -228111, 103072, -203059, 188607, 357873, 44783, -150853, -194129, 10747, -79751, 251588, 66273]
15680B22152c5528m58165G8117k3966K32437C6377K7941b1548j68664E0954Q6999
15669A37953D0666B792J60317b2913j47129O7481D16413a49070B24891b0008m65916
15658d85924a47221j15616A593h325o3895C24036d09801J84624O5477j4499d542
15646d8338B8446d8334A48243B0471L2574a54413p0931c7311k93402G0335b30319
15634i9048p9594E0863a83215h108o7778B0874R4260J10486d7388j70980C7006
15622a04704I6972i637A22988j145a09053G2019a08299c4041F3227L46986a3733
15610a5602k11220f3005B06296b66813A70664b26962p7439D5558b7206p052j57352
15599a91610I7474O9502F9380b66326N8169E1981k4129g3718r5331g6307D836
$$ y = [222152, -35528, -493693, 78117, 54151, 286588, 36377, 64318, -21548, -190212, 50954, 137953, 40666, 2792, 163109, -22913, -170042, -102561, 416413, -149070, 224891, -20008, -485924, -147221, -262837, 1593, -8325, -72220, 324036, -409801, -225177, -159700, -174199, -4542, -48338, 28446, -48334, 148243, 20471, 53045, -154413, -225344, -37311, -330713, 70335, -230319, -99048, -178642, 50863, -183215, -8108, -75886, 20874, 115134, 225620, -47388, -218368, 37006, -104704, 96972, -9637, 122988, 121843, -109053, 72019, -108299, -34041, 63227, 410213, -13733, -15602, -226822, -63005, 206296, -266813, 170664, -226962, -304401, 45558, -27206, -34258, -191610, 97474, 166976, 69380, -266326, -208157, 51981, 27852, -73718, -169049, -76307, 4836]
15587d5667j96602B60849b13737c581C08413A07784a10072B39340a34693D55097
15576b01187f3157r0461h551j50791C3983a63897K5633d5615a786l582A0648P0510
15564H1158L07921j05644p4487g7237k31162B68754c10088D4957K45840q6229
15554B04568m4862a49795j48156C0699J87920e0682j7904j96350A25873i9928
15543H6568R682D0057a32057A55174F5907a9423H5193d2728d798m7911j23139
15532a75848I8468b11626A11293Q2019g8964B34453i3029B19438j02818i2610
15521C17196E1410J80725R575a16907B44788j04321a07408k00312j4060C40426
15510f2479A96574e950k42888g999B11680a24339c4652F240J43047c3310A77230
$$ y = [-45667, -242269, 260849, -213737, -3581, 308413, 107784, -110072, 239340, -134693, 455097, -201187, -63157, -153618, -8551, -159342, 33983, -163897, -138264, -45615, -1786, -5368, 10648, 81158, 389079, 283435, 208948, -77237, -308399, 268754, -310088, 44957, 290797, 204568, 159706, -149795, -297951, 30699, 218619, -50682, -68586, -264936, 125873, -99928, 86568, 96250, 40057, -132057, 155174, 65907, -19423, 85193, -42728, -4798, -52709, -175848, 98468, -211626, 111293, 193312, -78964, 234453, -93029, 219438, 116620, -92610, 317196, 51410, 232135, 241710, -116907, 244788, 140467, -107408, -307720, -321780, 340426, -62479, 196574, -5950, -248838, -7999, 211680, -124339, -34652, 6240, 149287, -33310, 177230]
15498e1434J1069r760j28566Q0368E5664c8415j90968A09128l0045K15988a19128
15486A52059a10958k58601B9353b03157H8063l30a59589A12079J03537m7322D5981
15474a1320C30696e1789E9943h6441k38622K2295J3609A47289b68959a657o6694
15463f8351B99267A26436P2723a12414D37922a80553n5242A02600a58225q1542
15453b39767K5797A53820E7585R0380g1460J6361j25991b3843k96097F3873a55650
15441b80258A22195b35735A64180E7552i5197B95824a37053J853j10055A95323
15430A57125P3405E6619O1951c55529j57621a42120j3815B80230m3048L3320a99037
15418A46262e3026q8054C2085N1932b09947A01429h0463b8869m506l23020B16943
$$ y = [-51434, -40365, -50125, -178691, -98323, 55664, -38415, -229383, 109128, 79083, 295071, -119128, 152059, -110958, -369559, 29353, -203157, 88063, 87733, -159589, 112079, 215616, 168294, 45981, -11320, 330696, -51789, 59943, -86441, -325063, -302768, -289159, 147289, -268959, -1657, -68351, 299267, 126436, 199159, -112414, 437922, -180553, -235795, 102600, -158225, -239767, -213970, 153820, 57585, 147965, -71460, -55099, -181090, -23843, -319940, 63873, -155650, -280258, 122195, -235735, 164180, 57552, -95197, 295824, -137053, -135200, -245255, 195323, 157125, 230530, 56619, 118570, -355529, -513150, -142120, -155935, 280230, 237182, 270502, -199037, 146262, -53026, -141080, 32085, 84017, -209947, 101429, -80463, -28869, -33375, -356395, 216943]
15406A55697K4824l1673J81074A51968a8757D0167L82300a21365q005O2119k0427
15395h7678B983J05550l5056d752j21305b7767j30299A11683f1626j1484A32192
15383a02433L7651K5554h02I0010b86443A39980Q5893A05805b31775C4593K2927
15372E7520R6625d00856H1830a3557E0180d5236J4159A33419K03733b42755A41626
15360A11607J10673a26544H5703i1158B51702c1787k75849g0153A35380B0471
15349a57052I306f2230j4223o1571A58715Q5830b877j11024j23200Q0647A59193
15337c65775C45725a09702b7042A52340q547E1513a93391Q5630E858O4215a12542
15325b98965I7315O2560a58878j13121A32878R3033g6632a6286j99677A41673
$$ y = [155697, 180521, 148848, 329922, 151968, -18757, 40167, 422467, -121365, -129370, -67251, -87678, 2983, 108533, 73477, -4752, -126057, -27767, -158066, 111683, -61626, -73110, 132192, -102433, -64782, -39228, -802, 90010, -286443, 139980, 225873, 105805, -231775, 34593, 57520, 154145, -400856, 81830, -13557, 50180, -45236, -31077, 133419, 337152, -242755, 141626, 111607, 222280, -126544, 85703, -91158, 251702, -31787, -307636, -70153, 135380, 20471, -157052, 9306, -62230, -76453, -138024, 158715, 244545, -2877, -113901, -237101, -156454, 159193, -365775, 345725, -109702, -27042, 152340, 143793, 51513, -193391, -107761, 5858, 70073, -112542, -298965, 97315, 159875, -158878, -271999, 132878, 225911, -76632, -16286, -215963, 141673]
15314i2254C08754b89734J02605h4655j08261b5483A71451G4102e666A81412a07724
15302A75537g4640j24645a5610A23443N9910G0694M0101N2127B1290K9210a13639
15290D35588G7574b12508B8801J80757l3797c7587A96385a54261F113a6556A24506
15278c54702J42969M9041B85141j37374J2434a54038B16039f510B49252i4125
15267B60490E9760e9598b4317C05954d66022a30544A95132N4674L7640A24879
15256A3026J43169E772L6442a33009A65539J9291R9117N58039N65146j4847j0113
15245A382172J68015E11208b46441A24880J44536a65539D61380k13093a96237
15235i9465C38760A29926l0591f5253j41428e4651A29903a94067B67146D1160
$$ y = [-92254, 308754, -289734, -187129, -84655, -192916, -25483, 171451, 74102, -5666, 181412, -107724, 175537, -74640, -199285, -15610, 123443, 183353, 70694, 110795, 162922, 21290, 50500, -113639, 435588, 77574, -212508, 28801, 209558, 175761, -37587, 196385, -154261, 6113, -16556, 124506, -354702, -211733, -162692, 285141, 147767, 160201, -154038, 216039, -6510, 249252, -94125, 260490, 59760, -59598, -24317, 305954, -466022, -130544, 195132, 249806, 287446, 124879, 13026, 156195, 5772, 42214, -133009, 165539, 184830, 283947, 841986, 1407132, 1392285, 1382172, 1550187, 511208, -246441, 124880, 269416, -165539, 461380, 248287, -196237, -99465, 338760, 129926, 99335, -65253, -206681, -54651, 129903, -194067, 267146, 41160]
15224a35626A40288J85427A61899b20251f7902B25977r2759O9041b60688C58848
15213E9610K88854A9311K71803H6572l5937J03300A5080L10848E7439k6486K30059
15202B61012J4735G517R6962j0190J08094J19433B1134J09647l1802e4047A5883
15190d7916A42807K43163I9099b07362B12073p3455a22406e5339A47992F9978
15179B68961N7183a36949N4426H1415b6564A07468K29239m4675A35533K9548J24770
15168B89851b39559A78017E1172e2798k64103C74491a14072A48972J2580g3996
15157A59151a04430B72638b8192A48329B6824g0809B24169b22605g0002n0332
15147a20334D02907E8205P2462b42116a01674j59868E30754a23077i545A50424
$$ y = [-135626, 140288, 325715, 161899, -220251, -67902, 225977, 133218, 202259, -260688, 358848, 59610, 348464, 19311, 291114, 86572, 50635, 153935, 15080, 325928, 57439, 30953, 261012, 275747, 7517, 104479, 94289, 202383, 321816, 21134, 130781, 98979, -54047, 15883, -47916, 142807, 385970, 99099, -207362, 212073, 138618, -122406, -55339, 147992, 69978, 268961, 326144, -136949, -82523, 81415, -26564, 107468, 336707, 292032, 135533, 165081, 289851, -239559, 178017, 51172, -52798, -316901, 374491, -114072, 148972, 161552, -73996, 159151, -104430, 272638, -28192, 148329, 26824, -70809, 224169, -222605, -70002, -120334, 402907, 58205, 130667, -242116, -101674, -261542, 530754, -123077, -9545, 150424]
15136b6973m5533A26385A2034J73187L19833k12280R8103c5279e172B17420n1817
15125A65603J7565j1707J11174B9056K15962m5892R2056d6696A4767J86592q1619
15114A19740M5995N8234a3692A36330a9586B40284J54995D6885a33060A6981L13651
15103C30632a4273B63664g5169D4775a12997a8285A34869B4315N3487a99896C53675
15091a75338D32948a61320A47353n309k3322K74728I6320l7680K94905A62451
15080C46030R3771h7009C26441G7486C7530K45203q0725h5415D5037L69993A64626
15068B84199A09846b19900g631C63502f9192C41145A13792M7291l2339J48932
15058B77676J461a35391B92070j10868F5397L58079a06080A6918N37869B14522
$$ y = [-26973, -72506, 126385, 12034, 185221, 505054, 292774, 390877, -35279, -5172, 217420, 165603, 183168, 171461, 282635, 29056, 245018, 199126, 291182, -46696, 14767, 201359, 119740, 165735, 223969, -13692, 136330, -19586, 240284, 395279, 46885, -133060, 16981, 330632, -14273, 263664, -75169, 44775, -112997, -18285, 134869, 24315, 77802, -199896, 353675, -175338, 432948, -161320, 147353, 142044, 118722, 393450, 96320, 58640, 353545, 162451, 346030, 439801, -87009, 326441, 77486, 37530, 282733, 202008, -85415, 45037, 415030, 164626, 284199, 109846, -219900, -7631, 363502, -69192, 341145, 113792, 161083, 128744, 277676, 279137, -135391, 292070, 181202, 65397, 423476, -106080, 16918, 554787, 214522]
15047a77830C81531d2582D06601I6600b5490A62261f7716F96708B57401j00925
15037A56476P7149j1351G7552a58368A39028K16859A27702J9765G0134R904f598
15025D6036K21510i380D8605K08899J35587f282C25246j37653g6826A5980J14491
15014A30471J01154J15513n7459A26527k7516J57904P5908Q1469A67668D7066
15003B25015R1320A00142J75548b19533B19110m0612G5137K98766P062K15049
14993E96014B95708l1677r9365k2527L8285O6919p4516J53287I8386N6102J54616
14982C09104J14382r9972K32K05851l0454A56307M97973A1512M20463j62026J62031
14971D31980g3986A62378p3679K90612A79242d5074F9394M0171K82436j52466
$$ y = [-177830, 381531, -42582, 406601, 96600, -25490, 162261, -67716, 696708, 257401, 156476, 233625, 222274, 77552, -158368, 139028, 355887, 127702, 147467, 70134, 80038, -6598, 46036, 267546, -9380, 48605, 257504, 393091, -6282, 325246, 187593, -76826, 15980, 130471, 231625, 347138, 289679, 126527, 99011, 256915, 332823, 414292, 167668, 47066, 225015, 316335, 100142, 275690, -219533, 219110, 178498, 75137, 373903, 380965, 596014, 295708, 264031, 164666, 142139, 180424, 247343, 172827, 326114, 98386, 154488, 309104, 423486, 323514, 323746, 529597, 499143, 156307, 654280, 11512, 431975, 269949, 431980, -73986, 162378, 88699, 379311, 179242, -45074, 69394, 109565, 392001, 239535]
14961B39535q9895L06718j20508L0724r3643Q1797B2405L07532L6720J06623p5322
14950C97958j50408K48812H5063K85406c9066G0897K23748L5264r5657J248p5600
14939A59900J44735I2628K71204J1020j07192j718M2371P8530j54452K44608H8748
14927C91781A45566J19938n8021Q3486q6045R4251J16009o4429K0439J14357A67816
14915C51247R4509n3411l7341L0554j67297M02166K7422j29985J5448j25000L1940
14904D40252k18672L75001k76499A36854O9482l4485E4174J28302J64989J2693
14894C60158C9930L04826j54513J92201m7745M5518J3648p1403K55278j42538
14884D35202j34865R3488j6711R5137j83795l5109R6389Q9711J68421B04837K31000
$$ y = [239535, 149640, 456358, 335850, 366574, 272931, 354728, 22405, 329937, 366657, 473280, 397958, 247550, 496362, 85063, 370469, -39066, 70897, 294645, 329909, 234252, 235500, 159900, 304635, 92628, 363832, 374852, 267660, 265942, 308313, 386843, 232391, 476999, 88748, 391781, 145566, 265504, 207483, 290969, 204924, 299175, 415184, 350755, 371194, 485551, 167816, 351247, 445756, 392345, 355004, 385558, 218261, 620427, 647849, 517864, 533312, 408312, 440252, 221580, 596581, 320082, 136854, 206336, 171851, 54174, 182476, 347465, 360158, 39930, 344756, 190243, 382444, 334699, 380217, 393865, 322462, 577740, 435202, 300337, 393825, 377114, 472251, 288456, 253347, 349736, 439447, 607868, 204837, 435837]
14873D35837n6500j00145K14494N6958B02792J36721K14238j45709J41859M6087
14863E95988K9996B33471K60975p2704K558j69312L1939J52304L3230J90382B40520
14851F90479l03298j32972L42017r3403k19392J98199l0348j09312L27655j03512
14841E66113B33839K91810r9600M9965j14773K16659j19943J50232K9813l14094
14831C23908L39578k69361J91426A64963p9463M14320B29305K31972J20027A23392
14820G50376m9792O687l07339R2293O6370K9934J02320C23620k3245J45499k10735
14809B35139J98626r2734J4642J24439K13085k33824B11123M06639k2235K06810
14799H02337k37672A99888N38251j77906R4321j86925j15154J55032J21087n199
$$ y = [435837, 379337, 279192, 493686, 550644, 202792, 339513, 553751, 408042, 549901, 595988, 625984, 233471, 494446, 421742, 424300, 254988, 286927, 439231, 472461, 662843, 240520, 690479, 387181, 254209, 596226, 502823, 283431, 481630, 451282, 341970, 669625, 566113, 233839, 525649, 426049, 476014, 361241, 577900, 457957, 608189, 638002, 323908, 663486, 394125, 585551, 164963, 85500, 499820, 229305, 461277, 581304, 123392, 750376, 700584, 707271, 399932, 492225, 558595, 588529, 690849, 323620, 300375, 445874, 235139, 433765, 341031, 355673, 480112, 693197, 459373, 211123, 617762, 595527, 802337, 564665, 199888, 738139, 560233, 654554, 467629, 352475, 507507, 628594, 623395]
14789F23395J37964j52367J17256j70948j94316K32686k73429K80895r9595K87764
14779G89305j79465Q9025p8444j48818M21459l94725K27813k68155N15759m27763
14769E45991j33910j8055N44694j3463j45828j33789k34682K41895k7562O7268
14759F92559L83670D89504M22122l39272j56184N32214R3914k76568k24092O0720
14749F02358J17397K17116j09852N0780k24688M27916j44474l04609N65875m77625
14739G20194J2600j98489M96735j30128q1456k60404L18143k65254K24126r3243
14729G42824J76040k36120K63094k44446p7924Q7066J01197J38264l39208K14076
14719H24863L01962l78856R0267j14385j30128k8011M45470k36705K82917k35740
$$ y = [623395, 761359, 608992, 726248, 555300, 360984, 593670, 320241, 601136, 501541, 789305, 609840, 698865, 620421, 471603, 893062, 498337, 726150, 457995, 973754, 545991, 412081, 394026, 938720, 925257, 779429, 645640, 410958, 652853, 625291, 692559, 1076229, 489504, 911626, 572354, 416170, 948384, 1042298, 765730, 541638, 602358, 719755, 936871, 827019, 877799, 653111, 1081027, 936553, 631944, 1197819, 720194, 732794, 534305, 1031040, 900912, 819456, 559052, 877195, 611941, 836067, 742824, 918864, 682744, 945838, 701392, 623468, 710534, 811731, 949995, 610787, 824863, 1126825, 747969, 838236, 723851, 593723, 565712, 1011182, 774477, 1057394, 821654]
14709H21654l93010N14333M6479j16710Q1554m21143M05962K46132l88376J12551
14699I09426K30473J23402j81448k75417M2612K2185L0685j78239J61854K68069
14689A153602k82385k72210K70360J79368k5626L8163k39473n5605J46612J56906
14679A069712m51634K08574J19218L93932o8279l00548R5951j40817P6013O0478
14669A062600K31384j37792o218j95301J30852M2557j07818K6542L36284j04194
14659A278896O2857l03126j9102L74141J13327l74161N94K40909R8174j50057
14649A322452m53717N86116n83809L03566Q5197j79806j0298K04987J20569r120
14639A386137J78833j44203K96737n19667L18480j69102q4740J57699K49004j58180
$$ y = [821654, 428644, 942977, 989456, 872746, 954300, 533157, 939119, 1185251, 796875, 909426, 1139899, 1263301, 1081853, 806436, 849048, 871233, 901918, 723679, 885533, 1153602, 871217, 599007, 869367, 1048735, 1023109, 1061272, 821799, 766194, 912806, 1069712, 618078, 826652, 945870, 1339802, 1271523, 970975, 1066926, 926109, 1002122, 1062600, 1293984, 1156192, 1149974, 954673, 1085525, 1128082, 1020264, 1046806, 1383090, 1278896, 1341753, 1038627, 1019525, 1393666, 1506993, 1132832, 1133426, 1374335, 1472509, 1322452, 868735, 1454851, 871042, 1174608, 1259805, 1079999, 1069701, 1274688, 1395257, 1386137, 1564970, 1420767, 1717504, 1197837, 1516317, 1347215, 1262475, 1420174, 1669178, 1510998]
14629A510998k70602J12429K32810l10206J89642N3542k51553J30448J03377l6357
14619A464528K91550j83123J9696j61260J37123j77892L1714j73270K27640J02227
14609A578933M7755J19780m09768K89821P2202J21109l66048K74010K73839m09948
14599A591685J51510O1700j0095l59635O96281l45421k96714m2182M34573k87813
14589A593889L9556K63510j39670J21384O4478j13371K38169N7139j94539P2076
14579B002621O9379L1598j37253L33471j52343J56756r8841J74228J35709l65600
14569B149725J2553L08187K77936k19666J52964l20480J2564P9253O01534l17250
14559B737320K47543J79704J94977k56752P2972J55707K81286P89082M44885J036047
$$ y = [1510998, 1240396, 1352825, 1585635, 1275429, 1465071, 1518613, 1267060, 1397508, 1500885, 1464528, 1756078, 1572955, 1592651, 1431391, 1568514, 1390622, 1422336, 1249066, 1476706, 1578933, 1626688, 1746468, 1336700, 1626521, 1698723, 1819832, 1453784, 1727794, 2001633, 1591685, 1743195, 1804895, 1794800, 1435165, 2131446, 1786025, 1489311, 1447129, 1881702, 1593889, 1633445, 1896955, 1757285, 1878669, 1943147, 1829776, 2067945, 2125084, 1930545, 2002621, 2072000, 2103598, 1966345, 2299816, 2147473, 2304229, 2205388, 2379616, 2515325, 2149725, 2162278, 2470465, 2748401, 2528735, 2681699, 2361219, 2373783, 2453036, 3054570, 2737320, 2984863, 3164567, 3359544, 3102792, 3175764, 3331471, 3612757, 4401839, 4846724, 5882771]
14549E882771J655058M251075Q171982K0360864J1305533B4164358I978272D672432
14540C255355l58981o65137l0758k5913K64283m44629j05787L00652k12244J97648
14530B174489M13228k80728K00413m7180q6948J00672j74463P33024n73900O5305
14520B523912P4550k0800j00396L32921N9633j83092M96053k51641j48756O2549
14510B844933J17654N5938J16131o05350M19337L56919m15363N15637k02876J21421
14500C324381l08074M58737O743o5159k53354K46954J81078K57683o42296L99874
14490C606567j12632O8513L3118M33832l87705J55543j39230L25381p6272L73380
14480D280495K74197k60100N9506k48055J82482j90803K80869J70487J95275l03133
$$ y = [5882771, 7537829, 11788904, 19960886, 40321750, 51627283, 24164358, 9978272, 4672432, 3255355, 2896374, 2231237, 2200479, 2174566, 2438849, 1994220, 1888433, 2189085, 1976841, 2174489, 2587717, 2306989, 2507402, 2460222, 2373274, 2473946, 2299483, 3032507, 2458607, 2523912, 2598462, 2577662, 2477266, 2810187, 2869820, 2686728, 3182781, 2931140, 2782384, 2844933, 2962587, 3018525, 3134656, 2529306, 2948643, 3305562, 2890199, 3405836, 3202960, 3324381, 3016307, 3475044, 3481787, 3416628, 3163274, 3410228, 3591306, 3848989, 3206693, 3606567, 3493935, 3562448, 3595566, 4029398, 3641693, 3797236, 3658006, 3983387, 3907115, 4280495, 4554692, 4294592, 4354098, 4106043, 4288525, 4097722, 4378591, 4549078, 4744353, 4441220]
14470D441220j25089J48781J99955k33044J75699J17263K28189j49835K81092
14461E084231l7420j64294N06473j20345j27308K62496r2780N2887M48503r2330
14451E720113k08543n536K60279j38721J30726J07262M23594m55460N84843k02322
14441F216235J51902k72909L93471N0048q4431j93472M08163L86806j25216J04146
14431G034743j11206K54456K10697n4110L02180J45550K6226j08944J47969N44765
14421H392326j00751r4357M08185o7450K28778M3437J65146j29310L75249Q6221
14411I307474K36120j4577K03075R89N7349N1369N63958j24477L94503k2144J77772
14400A0831411j33411N81187J83483R5078O21288q4997J41195K56776K51711J55863
$$ y = [4441220, 4316131, 4464912, 4664867, 4431823, 4607522, 4724785, 4952974, 4803139, 5084231, 5046811, 4882517, 5388990, 5268645, 5141337, 5403833, 5311053, 5363940, 5812443, 5720113, 5511570, 5506034, 5766313, 5627592, 5758318, 5865580, 6289174, 5833714, 6418557, 6216235, 6368137, 6095228, 6488699, 6538747, 6454316, 6260844, 6669007, 7055813, 6930597, 7034743, 6923537, 7177993, 7388690, 7334580, 7636760, 7782310, 7808536, 7699592, 7847561, 8392326, 8291575, 8197218, 8605403, 8537953, 8766731, 8810168, 8975314, 8846004, 9221253, 9307474, 9543594, 9529017, 9732092, 9733081, 9790430, 9841799, 10405757, 10281280, 10675783, 10653639, 10831411, 10698000, 11279187, 11462670, 11557748, 12179036, 12094039, 12235234, 12492010, 12743721, 12899584]
14390A2899584P7645L98964J56861K72329O7447K46424J82530M31347K93946M88330
14380A5515407j7451R8487O30637P15744j80574K21113N29354K37845L59543N65940
14370A8676045l00916P54142L81296J73791R03748K33549M65610K70073P8612
14361B1635950P58527N38600N50843O11159J60254Q25212O62914L30223N57827
14352B6631509N60109J044833Q03172M44245J078957O68519P58330O32075Q17301
14343C3439050P12371J176326Q97910O43920J066798J172983R53626R88963J383679
14334D2435626J491030J594516P89089J356505J822603J348225J409412J946881
14326E4193887J747516J678490J812083J999888K388493J696705K543196K553098
$$ y = [12899584, 12977229, 13376193, 13533054, 13805383, 13872830, 14119254, 14301784, 14733131, 15027077, 15515407, 15497956, 15596443, 16227080, 16942824, 16762250, 16983363, 17512717, 17750562, 18110105, 18676045, 18375129, 19129271, 19510567, 19684358, 20588106, 20821655, 21287265, 21557338, 21635950, 22394477, 22933077, 23483920, 24095079, 24255333, 25080545, 25743459, 26073682, 26631509, 27191618, 28236451, 29039623, 29483868, 30562825, 31231344, 31989674, 32621749, 33439050, 34151421, 35327747, 36225657, 36869577, 37936375, 39109358, 40062984, 41051947, 42435626, 43926656, 45521172, 46310261, 47666766, 49489369, 50837594, 52247006, 54193887, 55941403, 57619893, 59431976, 61431864, 63820357, 65517062, 68060258, 70613356]
14318G0613356K169438K957219K525716K930622L295773L681502L274938M201488
14310I5650052L436319M046949L997866N017599M483898N707311M951182N552666
14302A32843842O412606O474185O732414P167448P377726P736073Q613671R295648
14294A92653613R648318R934758J0601440J1347084J1916523J2067459J2743087
14287B70912282J3633118J3814416J4342144J4681552J5034004J5328890J5166707
14280C72913113J5120750J4463913J4483199J3329232J2584687J0892386R478598
14273D63265878O801110K531357M14758M07518q7033m606688l130151m745960
14265D60850789p211035r676399j1275508j2804469j4245439j5137368j5743866
$$ y = [70613356, 72782794, 75740013, 78265729, 81196351, 84492124, 88173626, 91448564, 95650052, 99086371, 103133320, 107131186, 112148785, 116632683, 122339994, 127291176, 132843842, 139256448, 145730633, 152463047, 159630495, 167008221, 174744294, 183357965, 192653613, 202301931, 212236689, 222838129, 234185213, 246101736, 258169195, 270912282, 284545400, 298359816, 312701960, 327383512, 342417516, 357746406, 372913113, 388033863, 402497776, 416980975, 430310207, 442894894, 453787280, 463265878, 470066988, 472598345, 473013103, 473420621, 473333588, 468726900, 465596749, 460850789, 453639754, 443963355, 432687847, 419883378, 405637939, 390500571, 374756705]
14258C74756705j5769967j5512685j5821047j4689185j4177778j4368877j3875939
14251B70541227j3051030j2781256j1600968j1928427j0498187j0107734r372228
14244A91201397q615054q740071q185240p572994p347139o794257n946012n684294
14236A32316336o122930n316902n006958n108415m196037m164444l842549m057593
14228I4500508l745048l561410k883752l705422k756246k732420k631298k775008
14220F9709904k194843k223342k322666j757938k092566k092745j065707j877838
14212E4082259j551526j974085j524306j263575j423756p64691j296147j446939
14204D2837234j033364j470162j237948j070003l91544j298169j143649p97777
$$ y = [374756705, 358986738, 343474053, 327653006, 312963821, 298786043, 284417166, 270541227, 257490197, 244708941, 233107973, 221179546, 210681359, 200573625, 191201397, 182586343, 173846272, 165661032, 158088038, 150740899, 143946642, 138000630, 132316336, 126193406, 120876504, 115869546, 110761131, 106565094, 102400650, 98558101, 94500508, 90755460, 87194050, 84310298, 80604876, 77848630, 75116210, 72484912, 69709904, 67515061, 65291719, 62969053, 61211115, 59118549, 57025804, 55960097, 54082259, 52530733, 50556648, 49032342, 47768767, 46345011, 45580320, 44284173, 42837234, 41803870, 40333708, 39095760, 38025757, 37634213, 36336044, 35192395, 34394618]
14196C4394618r76453o80598p56648q15815p74797r90365m40978q30929m54977
14187B7673058j075222j13516q07893p36467l95925m56523n66730p65655l50173
14178B2404954p40636j45656m22639l29539l72946o11613j36259o86063k02761
14169A8756842j44769m78007k31639o01459l47956k98856r9738l54587j11994
14160A6087837n48851p2801j84993j78319k12591p47130l07879K236l07408j85431
14150A3344670n2953k78321j18170k45451l68142j52139J36110o25011J05075
14141A1745668k12621n12872J85165k09807k73629j71873p0050j75257R0736n19413
14131I876047r5034m8408J87913m24764l47459K2702j97244j1962k37975k28249
$$ y = [34394618, 33418165, 32737567, 31980919, 31165104, 30390307, 29399942, 28958964, 28128035, 27673058, 26597836, 26484320, 25676427, 24939960, 24544035, 24087512, 23520782, 22755127, 22404954, 21664318, 21518662, 21096023, 20766484, 20393538, 19781925, 19645666, 18959603, 18756842, 18612073, 18134066, 17902427, 17300968, 16953012, 16654156, 16554418, 16199831, 16087837, 15538986, 15466185, 15281192, 15102873, 14890282, 14143152, 13835273, 13837509, 13530101, 13344670, 13291717, 13013396, 12895226, 12649775, 12281633, 12129494, 12265604, 11640593, 11745668, 11533047, 11020175, 11205340, 10995533, 10721904, 10550031, 10479981, 10304724, 10395460, 9876047, 9781013, 9732605, 9920518, 9495754, 9148295, 9170997, 8973753, 8961791, 8723816, 8495567]
14121H495567K15062Q5268p46725J00158j00373P0527M2075J2166n56574j261
14111G615890k95164J58506m70414K46508j70738r0597l4742j14212J92087j14305
14101F922819l67577q3844q3455p0133J12154o06579j25855L16867K3885o9062
14091E969220M3665n50111L67883m14591K85752j06144m39750K76693P7206m30487
14081E079336O3949R0912k21402n172n4428J33784l39105K51545k0944J1380l59437
14070D630418M80060l63519k39212n86k4978J78391Q9775l08931k4244J79187
14060D596361j77377P1597K1435L44448k15514n90185j67679K33172N6755q1390
14050D091623o6909k39333o5798L223k06436R1765K759j08236J54748k9036J58860
$$ y = [8495567, 8710629, 8795897, 8049172, 8149330, 8048957, 8119484, 8161559, 8173725, 7617151, 7615890, 7320726, 7479232, 7008818, 7255326, 7084588, 6993991, 6959249, 6845037, 7037124, 6922819, 6555242, 6471398, 6387943, 6317810, 6429964, 5823385, 5697530, 6014397, 6038282, 5969220, 6012885, 5462774, 5830657, 5416066, 5701818, 5595674, 5155924, 5432617, 5509823, 5079336, 5143285, 5234197, 5012795, 5007623, 4953195, 5086979, 4747874, 4999419, 4978475, 4989855, 4630418, 5110478, 4746959, 4507747, 4507161, 4482183, 4660574, 4750349, 4441418, 4417174, 4596361, 4418984, 4490581, 4512016, 4856464, 4640950, 4050765, 3883086, 4116258, 4173013, 4091623, 4024714, 3785381, 3719583, 3722806, 3516370, 3608135, 3610894, 3502658, 3657406, 3628370, 3787230]
14039C787230o34241L42904l5425n9129J44364o4515m3928j28613K42748j51246
14029C400149k02192J40542l97396J81235L1909k6132k38981J81044J01053l64134
14019B807097O79R9345q7671j98009J51745k48899M77628j25395l11688l9532
14009B525300J11181k2632J07432k81581j30626J04093K82542k22118o3000K80311
13999B690902k88728q0938n39933O41220m35209K06875K0983l61919N23108K04072
13989B580433P51265K852218O676917J7268882K2414098k2632211j4487012o260594
13981I163996k522743j307214o70475p36196j35637n07549j07241L3k72157j35500
13971B769317L18902k29401k4204m02350L31060k11651J26667l14905j22260J07267
$$ y = [3787230, 3152989, 3495893, 3460468, 3401339, 3545703, 3481188, 3437260, 3308647, 3551395, 3400149, 3197957, 3338499, 2941103, 3122338, 3154247, 3128115, 2889134, 3070178, 3171231, 2807097, 2807776, 2907121, 2819450, 2621441, 2773186, 2524287, 3001915, 2876520, 2564832, 2525300, 2636481, 2613849, 2721281, 2439700, 2309074, 2413167, 2695709, 2473591, 2410591, 2690902, 2402174, 2321236, 1781303, 2422523, 1987314, 2194189, 2215172, 1853253, 2376361, 2580433, 3331698, 6183916, 12860833, 30129715, 52543813, 29911602, 15424590, 9163996, 6641253, 5334039, 4663564, 3927368, 3791731, 3284182, 3176941, 3176974, 2904817, 2769317, 3088219, 2858818, 2834614, 2432264, 2763324, 2551673, 2678340, 2363435, 2241175, 2348442]
13961B348442K32753k14619O9556k08958L41056k23378M19098o56443J31132l11414
13951A927225K1600K0852L16257p037k64257q8055J20701m4956O8036j05414j15486
13940A849466P7962n0355l0973L2155k45031K70211K30615j07424l38375J29752
13930A818003k34824j19283L84255j99832J41533l31450L30667o8575j17049J23860
13920A727305K14781m20469L24848k22867r5003k2020J91260k58782j19360j10919
13910A208774J74090j446j14733K12142J33697k18651k23634K40198Q6985j36028
13900A361394L52182m60927M6417K20547J30966l31381P613l115J53075J04154
13890A580925n49388R2114Q6168r9528L05351J93018l6732m50929P2617j76856
$$ y = [2348442, 2581195, 2366576, 2436132, 2227174, 2568230, 2344852, 2763950, 2107507, 2238639, 1927225, 1948825, 1969677, 2285934, 2278897, 2014640, 1926585, 2047286, 2002330, 2070366, 1964952, 1849466, 1927428, 1877073, 1846100, 1878255, 1633224, 1903435, 2134050, 2026626, 1688251, 1818003, 1583179, 1463896, 1848151, 1648319, 1789852, 1458402, 1789069, 1720494, 1603445, 1727305, 1942086, 1521617, 1846465, 1623598, 1528595, 1506575, 1697835, 1439053, 1319693, 1208774, 1382864, 1381418, 1266685, 1478827, 1612524, 1393873, 1170239, 1410437, 1497422, 1361394, 1713576, 1252649, 1299066, 1519613, 1650579, 1319198, 1326811, 1323696, 1476771, 1580925, 1031537, 1123651, 1209819, 1110291, 1415642, 1608660, 1571928, 1120999, 1193616, 1016760]
13880A016760N27276M5484n67414L04359j5943k57798L57499n39210M41428j09733
13870A202708K12447j57911m3563J87343m57323J07350K74776k20154K13879j44950
13860A174602K43623l28966j03655J78960J43954l64682K72710j92147P1938o2089
13850A034248q0392P7829m8011M14520m00483M5259K33680k7533k80678j00867
13840H67572J38877j25665r543L15352J68580o33856K48509J82090M4630K8155
13830A224701j85310l25742N36618o15969J04631J9296L09334O7509k47879J25297
13820A012486r4548K09334k40531L0520k22599L19594j60848K4656l8574J23317
13810I62807J17181l20891O5554k3324K35868q9716l50419L11184k38493p7824
$$ y = [1016760, 1544036, 1589520, 1022106, 1326465, 1310522, 1052724, 1410223, 871013, 1312441, 1202708, 1415155, 1257244, 1213681, 1401024, 943701, 1051051, 1325827, 1105673, 1319552, 1174602, 1418225, 1089259, 985604, 1164564, 1308518, 943836, 1216546, 1024399, 1096337, 1034248, 953856, 1031685, 983674, 1398194, 997711, 1042970, 1276650, 1249117, 968439, 867572, 1006449, 880784, 871241, 1186593, 1355173, 721317, 969826, 1151916, 1196546, 1224701, 1039391, 713649, 1250267, 634298, 738929, 758225, 1067559, 1135068, 887189, 1012486, 917938, 1127272, 886741, 917261, 694662, 1014256, 853408, 878064, 839490, 962807, 1079988, 759097, 824651, 801327, 1037195, 947479, 597060, 908244, 669751, 591927]
13800E91927L67269m67263K99791j82463M11978K9413m60877L22407l157k16029
13790F92996J20531p3645L57348l59599K46733C50477K91046J96526Q414o8137
13780G78326Q5359L643L49720m21144j90418L3853L14875C29884M85323j97436
13770F17771Q5439j14803j09989L31936j42744J52068q6043j54844L65302j22714
13760H21379n7900J037J90643B80777N23226O2097J2422r3890l54568K91476J12029
13749H33569o0308M9349k25442J22486j95848K71300Q4757m09297J49303j76493
13739D43376l729M0043L21779l87010N36088o5053D04837J41379J04125j67924
13729D82417K39376J00776k36724K18097k45657J50043L9012C33375L46785l9979
$$ y = [591927, 959196, 491933, 791724, 609261, 1021239, 1050652, 589775, 912182, 909025, 692996, 813527, 739882, 1097230, 737631, 984364, 350477, 641523, 838049, 846463, 778326, 863685, 867328, 1217048, 795904, 605486, 639339, 954214, 329884, 815207, 617771, 703210, 588407, 478418, 810354, 667610, 819678, 733635, 578791, 944093, 821379, 763479, 764516, 955159, 280777, 804003, 866100, 878522, 784632, 430064, 721540, 833569, 773261, 822610, 597168, 719654, 523806, 795106, 879863, 470566, 619869, 443376, 439647, 479690, 801469, 414459, 950547, 885494, 404837, 546216, 650341, 482417, 721793, 822569, 585845, 803942, 558285, 708328, 747340, 333375, 680160, 640181]
13719F40181L22854m21688k43726L46413J60235j77869J02206j13003j50660K89015
13709G53958j10969j81810k08731K23108J53714L54173l06475q9679k0239R9077
13699F66127l2729k7637j64625j43841K07564J98224j72374J50909B54576K29507
13689D84083k091K8276M24471D51450K14539C10739M07415r5195r5494j53184
13679C74281K95562l11172J97316Q3990j76201J95892A14322P55555C96446K26249
13669F22695j55298l733J12189o2372K1450O4523B94284K60534N22K61108B94633
13657A20882M66003J83848j39408m2763A48926L00007j22766K92172H3517O54153
13647G37670k58691n2769Q9876q6078q412j92316J94799M565k2690j84633L02400
$$ y = [640181, 963035, 541347, 297621, 644034, 804269, 626400, 728606, 615603, 464943, 753958, 642989, 461179, 252448, 475556, 629270, 983443, 676968, 587289, 567050, 666127, 633398, 605761, 441136, 297295, 504859, 703083, 530709, 681618, 254576, 484083, 481992, 510268, 934739, 451450, 665989, 310739, 718154, 622959, 527465, 374281, 669843, 358671, 555987, 639977, 463776, 659668, 114322, 869877, 396446, 622695, 467397, 463664, 575853, 513481, 534931, 599454, 294284, 554818, 555340, 816448, 294633, 120882, 586885, 770733, 631325, 588562, 148926, 448933, 326167, 618339, 83517, 737670, 478979, 426210, 516086, 430008, 421596, 229280, 424079, 428644, 405954, 221321, 523721]
13636E23721r1956p8452J71686m3297H1141M28458q5894K4386j04554Q3751p2563
13625C54725Q0495L1790R7842K87884l38019k45360N97632l54174o3311K24397
13615F73901j11192n5527J22357H7370M74765B00541L06763k45386L96847j02967
13605E55798j19639r1242K21833j28874N6672Q4241A73489K36756A51300K18579
13595C69879K07837j07786K61684A98677M58979B78641J35028R5304k26611G4907
13584B41694L84771A37151L10638F4707M26289l4996K52772B26550K76539A95053
13573C41835L76625C00585j32436o4600L77569F1333K19966L36385k82151J63150
13563D98683k21714c278D65544j48179j35159J54245j18787n8609Q4709J13446
$$ y = [523721, 431765, 353313, 524999, 481702, 81141, 509599, 423705, 448091, 343537, 427288, 354725, 435220, 467010, 564852, 852736, 514717, 269357, 866989, 512815, 449504, 673901, 562709, 507182, 629539, 87370, 562135, 200541, 507304, 261918, 658765, 555798, 436159, 344917, 566750, 437876, 494548, 578789, 173489, 410245, 151300, 369879, 577716, 469930, 731614, 198677, 657656, 278641, 413669, 508973, 282362, 74907, 241694, 626465, 137151, 447789, 64707, 490996, 456000, 708772, 226550, 503089, 195053, 341835, 718460, 300585, 168149, 103549, 481118, 61333, 281299, 617684, 335533, 498683, 276969, -3278, 465544, 317365, 182206, 336451, 217664, 159055, 243764, 357210]
13553C57210J68687j62133A378M02708K57833j51736C9249L50043K04000B06674
13542G18409C48052o8118p2396O0485K88958H0485M9429m81J85271J91010j34840
13531C70874p3306j5081N6668O8773A92174M8464K01991i3259D59423m3424l657
13520D12342I6227J58737K39558A65667n6219j860J27067J53756L13268A8393
13509D69706j58795P9518Q499a2511D33268k00498j03971J57257A8137L60433
13499C78570G8591K46099J69729A80844L4487K31819j69417p8815q842J93572
13489C83648b61073C82883b1120E2325M43039j70156K54188f4273B60242l6613
13479B23629P573m6027N8206m3021J84413O9649e0328D58686b1244o7923D63227
$$ y = [357210, 525897, 363764, 1378, 404086, 661919, 510183, 39249, 389292, 593292, 206674, 718409, 348052, 279934, 207538, 268023, 556981, 80485, 129914, 129433, 314704, 505714, 370874, 297568, 282487, 339155, 407928, 192174, 240638, 442629, -93259, 459423, 415999, 412342, 96227, 254964, 494522, 165667, 109448, 107588, 234655, 388411, 701679, 18393, 469706, 310911, 390429, 398928, -12511, 433268, 232770, 128799, 286056, 18137, 378570, 78591, 324690, 494419, 180844, 215331, 447150, 277733, 198918, 190076, 383648, -261073, 382883, -21120, 52325, 495364, 325208, 579396, -64273, 260242, 223629, 231202, 185175, 243381, 200360, 384773, 454422, -50328, 458686, -21244, -89167, 463227]
13467C55332j31646F9859J30120m6824R1970p6338q4267a32033B51451r7442J53439
13456C07448p9483H1530J0437M7753j6078J23811n7606O6355r5813K49428j77620
13445B32197r4428K22248A03469A4832K32593K0308J51522k07593M9907L5433
13435B97002a65659C76677G0268L55104j28859J99239k5212D1004b5537C13890
13424A68874P0602J6260P2938L601B2741J08964F1225J14896H7113J60849j3805
13413B34157f0820A44908J17698j21262J16092K4992l6050g8324A10009J05414
13403B15423L21183E7518K33117A30044K23090n934a32639C74737q1761J60640
13393D53616b17943H539P255M30294A82455J35744D9195K38134J89143B30231
$$ y = [355332, 223686, 69859, 199979, 153155, 245125, 168787, 84520, -132033, 251451, 154009, 307448, 227965, 81530, 91967, 139720, 123642, 247453, 189847, 256202, 160389, 409817, 232197, 137769, 360017, 103469, 14832, 247425, 267733, 419255, 211662, 261569, 297002, -165659, 376677, 70268, 425372, 296513, 495752, 470540, 41004, -25537, 313890, 168874, 239476, 255736, 328674, 332275, 22741, 131705, 61225, 176121, 87113, 247962, 234157, -60820, 144908, 262606, 141344, 257436, 282428, 246378, -78324, 110009, 215423, 536606, 57518, 290635, 130044, 353134, 347200, -132639, 374737, 292976, 453616, -217943, 8539, 15794, 446088, 182455, 318199, 49195, 287329, 476472, 230231]
13382A11734N0677J09758c9527C0712J85448K07467A85795J48928J42005A6097
13371A63748R5678k8169M2612M7507G7793K02602A31736K30781l8550I9298J99723
13360B99021Q1908p2324K53586A56557o7149e2236D30275C2977J91397l1734K64907
13349D57547j75302K4106q191j18416J72978K96818I2734M26043n1749j8586A99233
13337B54413E6557L78042J5520G8115L09692j70137Q2972K59717A17485P6223
13327A93708K17431q6321H9846L02896j3204A10237K37725j63859a08452D34634
13316e5768A45337H909O03710k93625A02771J51464J09867J08803C0059J28426
13306A58485A4411J28832F7160K62813I5363J49062J08554I2187m3896M54397
$$ y = [111734, 162411, 272169, -39527, 30712, 216160, 423627, 185795, 334723, 476728, 16097, 163748, 259426, 231257, 273869, 321376, 77793, 280395, 131736, 362517, 323967, 99298, 299021, 380929, 308605, 562191, 156557, 89408, -52236, 430275, 32977, 224374, 192640, 457547, 282245, 306351, 298160, 179744, 352722, 649540, 92734, 518777, 467028, 448442, 199233, 254413, 56557, 434599, 450119, 78115, 387807, 217670, 300642, 560359, 117485, 193708, 411139, 324818, 89846, 392742, 379538, 110237, 347962, 184103, -108452, 434634, -55768, 145337, 8909, 612619, 318994, 102771, 254235, 364102, 472905, 30059, 158485, 14411, 143243, 67160, 329973, 95363, 244425, 352979, 92187, 48291, 502688]
13296E02688j11911j34986o3240a87006B76534j06364p1386d9852C04658j31067
13286A73591J8786M7150D3309C203J84761f118A26593q576g6285A12586L7249
13275A49835J8353C9408M12593A73268B4957g6087I9120K8627P4423L1738o9209
13264A64699F0726j4362d0407D6459J48141m6694k5994J98304b5958C0986Q8068
13253A19054R2239I8717A9759a49962A25266J31675J83900A10513O6004k5740
13243A50777k5635L8973g3375k35993A86396E3017K47904j6260j13534d8525B00789
13231i4954d7089I1818b43986B46203J943r4880m5892m0688J59756M1220O9348
13220C37010A62771K7260A4824K5453i963C86688j45909D1340P1686J69132q9350
$$ y = [502688, 390777, 255791, 192551, -187006, 276534, 170170, 98784, -49852, 304658, 173591, 192377, 239527, 43309, 3203, 187964, -6118, 126593, 118017, -76285, 112586, 149835, 168188, 39408, 452001, 173268, 24957, -76087, 99120, 127747, 202170, 233908, 164699, 60726, 46364, -40407, 46459, 194600, 147906, 121912, 320216, -25958, 30986, 119054, 211293, 98717, 19759, -149962, 125266, 256941, 440841, 110513, 176517, 150777, 125142, 164115, -73375, -309368, 186396, 53017, 300921, 284661, 171127, -48525, 200789, -94954, -47089, 91818, -243986, 246203, 248146, 153266, 107374, 66686, 226442, 267662, 337010, 162771, 190031, 14824, 40277, -9963, 386688, 240779, 41340, 113026, 282158, 192808]
13209A92808B8865c8445A02582f467B56153h5538I5878a4423r6472B13070a17432
13197a60616B32740a58925B30404B1703L65466b22521F4467f5906B91491B3421
13186B94488j24981R3277I3802J52642k9469K3528b387B41496d0747q7067k7680
13175a55494H0168j0349J21852q6644a7745A32705K14607D9350C531N33476c22927
13163d32650g2922I4177a89575D2229J76363l2456o9866c18743C7416q982J44532
13152A72966A9569K99899c1544j66224G0235J67910O7551p0993f2737B46301e5361
13140A98425m8624k8292a25235G6673j8538i2344A46356J06404m7701o9228E3014
13128D9938K84759j26824A9182Q1242a18024A40808a08270A55350m3792b3642
$$ y = [192808, 28865, -38445, 102582, -6467, 256153, -85538, 95878, -14423, -110895, 213070, -117432, -160616, 232740, -158925, 230404, 21703, 387169, -222521, 64467, -65906, 291491, 23421, 294488, 169507, 262784, 93802, 246444, 216975, 240503, -2387, 241496, -40747, -127814, -155494, 80168, 69819, 191671, 105027, -17745, 132705, 347312, 49350, 3531, 537007, -322927, -432650, -72922, 94177, -189575, 42229, 218592, 186136, 116270, -318743, 37416, 28434, 172966, 19569, 319468, -31544, -197768, 70235, 238145, 305696, 234703, -62737, 246301, -55361, 198425, 149801, 121509, -125235, 76673, 58135, -92344, 146356, 252760, 205059, 135831, 53014, 49938, 334697, 207873, 19182, 100424, -118024, 140808, -108270, 155350, 111558, -23642]
13117C42812j51633b6183A01928K11632j08092l6287g8283A29173P5815c436A05039
13105b04973B69963l6764E1568h0611J1518j24377P1507J1758M2299j467C02275
13093H6148l4084M5602Q9909N28067A45845A753M07649g0538A7350a28381D90339
13081i2584A63245E1116a64413C17384m3512J21104h9558G0168i5896I8388b19026
13069A05433l5587M5970J47957K1697E5420K39584h9773C93056E5797J61026a07104
13057D92741j49652A35967k9M8419G1055a06606B68269A00288J86900I8351K49312
13046C47663j55257a15105b3641j42519N7014A14038J48864O6244j27466r0093
13036A11587K02378A3464d6099p6309d874A66643j2226F8929J21896C8244a18441
$$ y = [342812, 191179, -26183, 101928, 313560, 205468, 169181, -78283, 129173, 204988, -3436, 105039, -204973, 269963, 233199, 51568, -80611, -69093, -193470, -121963, -110205, -67906, -69373, 302275, 86148, 52064, 97666, 187575, 715642, 145845, 1753, 409402, -70538, 17350, -128381, 490339, -92584, 163245, 51116, -164413, 317384, 273872, 394976, -89558, 70168, -95896, 98388, -219026, 105433, 69846, 115816, 263773, 285470, 55420, 295004, -89773, 393056, 55797, 216823, -107104, 492741, 343089, 135967, 135938, 184357, 71055, -106606, 268269, 100288, 287188, 98351, 347663, 192406, -115105, -23641, -166160, -109146, 114038, 262902, 329146, 201680, 111587, 313965, 13464, -46099, -122408, -4874, 166643, 154417, 68929, 190825, 38244, -118441]
13024E00574J271D1754a36636a0464o8090B11429K28934k12340k0299B3619a80826
13012A56020K0988j8546n7226a02705I9668K6394A7934G026i201B93451a49279
13000a0583r3422A12996e8854A32182g1426A85648M8268K55987g5565k1124A9293
12988B36545b1496I4652C7954J01469M4570F4505a0061j50400C25381f8804I0577
12976A28676C8131d057C47517A63304O475a03189B10255c1256k12319A45984D5714
12964A7230J917O1320a9484k11847a06341D04849b3254N486l671A02182l7220
12953F4962b94756b9735A65000j0911G3372R4640j1589K00292A30291b54863F3011
12941A20290J2950E6747R1601R9416b52698A34685a57983B9589N6558r370a56030
$$ y = [500574, 501845, 41754, -136636, -10464, -78554, 211429, 440363, 228023, 207724, 23619, -180826, 156020, 177008, 158462, 101236, -102705, 99668, 126062, 17934, 7026, -9201, 293451, -149279, -10583, -104005, 112996, -58854, 132182, -71426, 185648, 233916, 489903, -75565, -96689, 19293, 236545, -21496, 94652, 37954, 139423, 183993, 64505, -10061, -160461, 325381, -68804, 90577, 128676, 38131, -4057, 347517, 163304, 169779, -103189, 210255, -31256, -243575, 145984, 45714, 17230, 19147, 80467, -19484, -231331, -106341, 404849, -23254, -17768, -21439, 102182, 64962, -294756, -29735, 165000, 154089, 73372, 168012, 156423, 356715, 130291, -254863, 63011, 120290, 133240, 56747, 148348, 247764, -252698, 134685, -157983, 29589, 86147, 76777, -156030]
12929f8623j19394c2088H6368J04501c1042B752N0767b23607c4346j35283e5078
12917h9668A6536a72065F5601f1401A98023j7783b37092j10085A87552q1252g2456
12905a03593H7953e8711A38870L1643a51691j69684B45687B6385b43969p3915
12895c17884G3120h9509I5967A9615H885L64159b0393A10581N3276F5631J99529
12884B65160H4163a11679b1343A09818a11532b6314E6736J66528R948p0440c4356
12872a18941A14974a76999A49036M0666c96763F8022J68418D2585K16302j10462
12862A48425f1223F1808a07112p2770B13530c22122A23380J68646c64769h01B90189
12850a76047f7328k51160g8027C7167a7456C64172A40097j7056P3710H1187a52317
$$ y = [-68623, -188017, -32088, 86368, 190869, -31042, 2752, 53519, -223607, -34346, -169629, -55078, -89668, 16536, -172065, 65601, -61401, 198023, 180240, -237092, -347177, 187552, 106300, -72456, -103593, 87953, -58711, 138870, 170513, -151691, -321375, 245687, 26385, -243969, -317884, 73120, -89509, 95967, 19615, 8885, 373044, -20393, 110581, 163857, 65631, 265160, 84163, -111679, -21343, 109818, -111532, -26314, 56736, 223264, 233212, 162772, -34356, -118941, 114974, -176999, 149036, 189702, -396763, 68022, 236440, 42585, 258887, 148425, -61223, 61808, -107112, -179882, 213530, -322122, 123380, 292026, -364769, -801, 290189, -176047, -67328, -318488, -78027, 37167, -17456, 364172, 140097, 123041, 196751, 81187, -152317]
12838A3998J5277L98572H7621a20024C10113a67610A64227b89358I7579J66747
12828B64326a35576q3761D1972j6633L92498b10593i451l33759B44344f4991G2548
12816C16341a03841j93095A35114a38663C11553a85121A07485k2103E948a37342
12805C7912K71593F6552a21136D88076d36464B31328A3522M34389d3507j74989
12795b18496H486a43146f4531G2957O3156p304e3296D63070a00275N809J0877
12784h3589C0046J21018j0070n4999c81960a13702l5005e1226C2460h9662B04145
12772b20649B16306F8342J7158K60173f1960A62558l7460e8531k74809a48914
12761b53386F8787J85012H3977J66988b7368A09788J35294n2249J02565R7550
$$ y = [13998, 29275, 427847, 87621, -120024, 310113, -167610, 164227, -289358, 97579, 264326, -135576, -219337, 41972, 25339, 417837, -210593, -9451, -343210, 244344, -64991, 72548, 316341, -103841, -296936, 135114, -138663, 311553, -185121, 107485, 85382, 5948, -137342, 37912, 309505, 66552, -121136, 488076, -436464, 231328, 13522, 447911, -43507, -218496, 8486, -143146, -64531, 72957, 136113, 128809, -53296, 463070, -100275, -94466, -83589, 30046, 151064, 140994, 85995, -381960, -113702, -148707, -51226, 32460, -89662, 204145, -220649, 216306, 68342, 85500, 345673, -61960, 162558, 125098, -58531, -333340, -148914, -253386, 68787, 253799, 83977, 250965, -27368, 109788, 245082, 192833, 295398, 392948]
12751C92948b13955C5056J18534g3357B74712M6345b02730d0679A3121a20147
12740A92318J0102a75961d1381B70765F3447a85985A60040o9448R7166D5770a5640
12728B29114k5071G1705J71459h3395A30831h3220C93359e3807j8837A85268p3682
12717A11586A5278a25452A89578R913a72570A35066P902f7353A02763o412K24470
12706C20821a48794A97638D0482J08063R702a34358k8180d5955A58738J17844
12696B76582A14905a21028j63652H5530B740g9746p422c6426B77064l0677F7366
12684B87919a73422e8513E7737c8578B00781J18238J93186A62405F1803J81877
12674B43680J03316d4882B8045E047J70017d39117G9733e8351o9227G4173J77729
$$ y = [392948, -213955, 35056, 153590, -73357, 274712, 321057, -202730, -40679, 13121, -120147, 192318, 202420, -175961, -41381, 270765, 63447, -185985, 160040, 90592, 187758, 45770, -15640, 229114, 204043, 71705, 243164, -83395, 130831, -83220, 393359, -53807, -72644, 185268, 111586, 15278, -125452, 189578, 199491, -172570, 135066, 142968, -67353, 102763, 96351, 320821, -148794, 197638, 40482, 148545, 158247, -134358, -162538, -45955, 158738, 276582, 114905, -121028, -284680, 85530, 2740, -79746, -87168, -36426, 277064, 246387, 67366, 287919, -173422, -58513, 57737, -38578, 200781, 319019, 512205, 162405, 61803, 243680, 346996, -44882, 28045, 5047, 175064, -439117, 79733, -58351, -127578, 74173, 251902]
12663B51902C3619J1399J17195K61257A19208k2795m2815a77753A58936N4015
12653B12951J13580a63367C7231b43383D5719K26053L2668a40858B17226i408
12642a10376L401j79540H5621P4613b24557N8802j1418D550O31104i2381k30230
12631c22611A76782D0506J96019R2820a65066B32138G3411M09799F8640i6757
12620A85379L958a8864j9560B37292n3892a90197C799b05064A32344O2860n8829
12609A36375a05717A46001l4263L4309J31264a86868f3011H7656O066J09616a45843
12597a19813B84220a68850B7464P5281a73449f9555F6359L13888M507a98052g8033
12585H0179Q8760a57555c6537A9403b35266a06864d2705E23238B6601f5339j42155
$$ y = [251902, 33619, 45018, 162213, 423470, 119208, 96413, 53598, -177753, 158936, 212951, 326531, -163367, 37231, -243383, 45719, 271772, 304440, -140858, 217226, -9408, -110376, -106975, -286515, 85621, 160234, -224557, -165755, -177173, 4550, 635654, -92381, -322611, 176782, 40506, 236525, 329345, -165066, 232138, 73411, 483210, 68640, -96757, 185379, 189337, -18864, -38424, 237292, 183400, -190197, 3799, -205064, 132344, 195204, 136375, -105717, 146001, 111738, 146047, 277311, -186868, -63011, 87656, 93722, 203338, -145843, -119813, 284220, -168850, 27464, 102745, -173449, -69555, 66359, 380247, 384754, -198052, -78033, 80179, 168939, -157555, -36537, 19403, -235266, -106864, -42705, 523238, 26601, -65339, -207494]
12574b07494p3696D8842a67796i319F5098a5456F523i9100A25002b89350J14254
12563a75096D0212b01254f5628p0463H6059P2958a61604L8855F9078K37353h2437
12551D2219K2119c07850e9153A48470a13135A253b74796e7849b1085A58580a01751
12539B8156Q5078J68949B1399M2405i7181F1670L10355c1890C06085k7831d9469
12527c4934j34270M0577A8664K63226a89186a2506B72987c1686k40350I3940a7375
12515d7403C9443N0295J24300C6226P9747a2340B50548I3575j2828M5959n533
12504A21173K5236a86303P5785A31821b23572A67674g1956A75543L8899A1187
12493C8716a27930G0536a74048H3408K9741n4489K15182n2469q1145A953c6437
$$ y = [-207494, -281190, 48842, -167796, -9319, 65098, -15456, 6523, -99100, 125002, -289350, -175096, 40212, -201254, -65628, -136091, 86059, 159017, -161604, -122749, 69078, 306431, -82437, 42219, 64338, -307850, -59153, 148470, -113135, 1253, -274796, -57849, -21085, 158580, -101751, 28156, 113234, 282183, 21399, 63804, -97181, 61670, 372025, -31890, 306085, 278254, -49469, -34934, -169204, -128627, 18664, 281890, -189186, -12506, 272987, -31686, -272036, 93940, -17375, -47403, 39443, 89738, 214038, 36226, 115973, -12340, 250548, 93575, 80747, 126706, 121173, 146409, -186303, -110518, 131821, -223572, 167674, -71956, 175543, 214442, 11187, 38716, -127930, 70536, -174048, 83408, 113149, 58660, 273842, 221373, 140228, 1953, -36437]
12481F9349J17869b26699L5716B3721P5516a415k7608k75476B13987a02173q860
12470a11033D1449a91823B408L29057j45918b42317G8130J15324I5758B9013b37985
12458B76205b27826A02878K07795A26968e5623k45770F4043e6463B02819r0898
12448A11921m8920O8348D1068d8330q4250n9036d2487J9789C5997K51242E4885
12436C30681D9145f8964j4229A33935e1994j35344l6894H1351K753c08195j16283
12425d24478C02227r474q9314r865b1999B36478a1777B95789E6348c243o7131
12414g0374C5337a32071M7763B13275A4328a14466B24757a33616G6934a08337
12403h6360A99122b3637k38297d6277B73892a84074D9757j0104J51193F7372d1869
$$ y = [69349, 187218, -226699, -190983, 23721, 99237, -1415, -29023, -304499, 213987, -102173, -111033, 41449, -191823, 2408, 331465, 185547, -242317, 78130, 193454, 95758, 29013, -237985, 276205, -227826, 102878, 310673, 126968, -55623, -301393, 64043, -56463, 202819, 111921, 63001, 131349, 41068, -48330, -132580, -191616, -42487, -22698, 35997, 287239, 54885, 330681, 49145, -68964, -83193, 133935, -51994, -187338, -224232, 81351, 84104, -308195, -424478, 302227, 292753, 203439, 193574, -21999, 236478, -11777, 295789, 56348, -3243, -70374, 35337, -132071, -84308, 213275, 14328, -114466, 224757, -133616, 76934, -108337, -86360, 199122, -23637, -261934, -46277, 273892, -184074, 49757, 39653, 190846, 67372, -41869]
12391H4754J99657b10932d6093A30089i5228A06074J1129q915c21560a6042C31759
12379b47022L438C0185a455j09652B3618J16428j1272J85777d38538J32286P6609
12368b29643A76354g2187D02314f6792R384k02921A32532b8642l1474B35873h338
12356A72032a91208H5231d2387j6185G5635J64748a7124C1412J51442j2932a5305
12344A91687a3504A80113b46515a02781j00008M5496O9422B71680b62829A60254
12333g7860p4208j10444G1908R9571E085b15139A58652n3926A3047b5327q3875
12322a09202b3395j22475k27955A52912a21642o5537B5754M6034b14139A75989
12311A22118m071b79042b9688D928a57663l31579A50717E6835i4052A42216o9608
$$ y = [84754, 284411, -210932, -46093, 130089, -95228, 106074, 117203, 108288, -321560, -16042, 331759, -247022, -243584, 30185, -1455, -111107, 23618, 140046, 128774, 314551, -438538, -306252, -229643, 176354, -72187, 402314, -66792, -57408, -260329, 132532, -28642, -60116, 235873, -8338, 172032, -191208, 85231, -42387, -58572, 75635, 240383, -17124, 31412, 182854, 169922, -15305, 191687, -13504, 180113, -246515, -102781, -202789, -157293, -87871, 271680, -262829, 160254, -77860, -152068, -262512, 71908, 171479, 5085, -215139, 158652, 104726, 13047, -25327, -109202, -23395, -145870, -373825, 152912, -121642, -187179, 25754, 71788, -214139, 175989, 122118, 118047, -279042, -29688, 4928, -157663, -489242, 150717, 56835, -94052, 142216, 72608]
12300G2608a63698B17339C9650a27419A01444a5078B28243D5266a3922e756A9215
12288b48549i2188k47304H5717J36911B0602K37005h0763A10922a42859B86170
12277F99494k84026i4535A53962J77942d8396A28565n0332a604E2590K52776k9986
12266B75380A31863a65051A0325J6786d5060g968D21123A3394N024g0968a924
12254e367B54951c0992D174J20101e4834A74014G1044q913J31381E2484K05151
12243B57635K7052J04115j81603a11097C7241K10475F6085K56081a43757C18013
12232C6081a52457A78365d0089M323j0191B51796F5567O23087A92310J82761G0140
12220D52721l4999j31908J26861a7985j85787B17861A2028L35852c8938B0744
$$ y = [72608, -163698, 217339, 39650, -127419, 101444, -15078, 228243, 45266, -13922, -5756, 19215, -248549, -92188, -339492, 85717, 222628, 20602, 257607, -80763, 110922, -142859, 286170, 699494, 415468, -94535, 153962, 331904, -48396, 128565, 78233, -1604, 52590, 305366, 275380, 131863, -165051, 10325, 27111, -45060, -7968, 421123, 13394, 18418, -70968, -1924, -5367, 254951, -30992, 4174, 124275, -54834, 174014, 71044, 62131, 193512, 52484, 257635, 284687, 388802, 207199, -111097, 37241, 247716, 66085, 322166, -143757, 318013, 36081, -152457, 178365, -40089, -35766, -45957, 251796, 65567, 688654, 192310, 375071, 70140, 452721, 417722, 285814, 412675, -17985, -203772, 217861, 12028, 347880, -38938, 20744]
12209C30457D919J83115m2727a46255c2405H1296d2379D97878j79078j36553k8130
12198A54117D3605h5343D31395d4993j12556B95958o8490j4679i0254o9698d2705
12186a00897C25682r0506K69585d2564B6680j2910J62324b82476C10055q7282
12176B22773b08143A07243D7215d2978m7517C25756j30604K23070B05668l1509
12166A74159o370N719L6482a26440A85184h1303A6773a59969A66186J46307r9979
12155B12514j8979h0826r3491P0688I7620K26997a46953M0007E71516d9287j20800
12144a70087B2924f4435B12439O7472h6074j53587j06514A73520L07061b57797
12133C21893j04392r8197C7931b551A89719h3335H4925k823f0206l69651B04393
$$ y = [330457, 4919, 188034, 145307, -146255, -32405, 81296, -42379, 497878, 318800, 182247, 154117, 43605, -85343, 431395, -44993, -157549, 295958, 227468, 212789, -90254, -159952, -42705, -100897, 325682, 235176, 504761, -42564, 26680, 13770, 176094, -282476, 310055, 222773, -208143, 107243, 47215, -42978, -90495, 325756, 195152, 418222, 205668, 174159, 167789, 173508, 209990, -126440, 185184, -81303, 16773, -159969, 166186, 312493, 212514, 193535, -80826, -174317, -103629, 97620, 324617, -146953, -106946, 571516, -49287, -170087, 22924, -64435, 212439, 279911, -86074, -239661, -346175, 173520, 480581, -257797, 321893, 217501, 119304, 37931, -2551, 189719, -83335, 84925, 82102, -60206, -429857, 204393]
12121a36062a0859k73721A13306d1160j06388C36860j45620A0253g4198q9573
12111a63771j2178M8305B99144D8724f9856A23611A6130K50038q4635q8193L505
12100I6845k4001n392J23265b38977E2533L4628a43733A15407a18272o0082e1502
12088A06049D3995c92704J81010J00409j50518F7999a27124C6359K47431j36705
12078A47085O96854J339169I18625A63524b42E86399k47134A54080G3402L32230
12068D05632i0878A02486J07957e6832A06272a74049L0346C72460H0792b998j15098
12057a18096n3278K1559F9298a64752M5963C76766a81406o0777I7957M87634C8763
12045A72092b23343I5572g8351B16995L3241a00803l4548G3416d9798a9615A31890
$$ y = [-136062, -10859, -284580, 113306, -41160, -147548, 336860, 191240, 10253, -74198, -163771, -175949, -127644, 299144, 48724, -69856, 123611, 16130, 266168, 181533, 93340, 96845, 72844, 67452, 190717, -238977, 52533, 87161, -143733, 115407, -118272, -178354, -51502, 106049, 43995, -392704, -211694, -111285, -261803, 67999, -127124, 36359, 283790, 147085, 843939, 2183108, 918625, 163524, -242, 586399, 339265, 154080, 73402, 405632, -90878, 102486, 210443, -56832, 106272, -174049, -143703, 372460, 80792, -2998, -118096, -171374, -149815, 69298, -164752, -118789, 376766, -181406, -242183, 97957, 585591, 38763, 172092, -223343, 95572, -78351, 216995, 250236, -100803, -135351, 73416, -49798, -19615, 131890]
12033A41949a46848B7009d33300h7704j4940b6115E17204C4156a20956b7969A76195
12021c5287E6355d3980k9759A94329D4079a99126M3442B8724M5943K15679A08947
12009A85511K71275E2043a11320B09426i0092I9515c40725f1395B10444C7330
11998a79660A05707e9113m5381D09042E2182J26914a41718A3272a43828A29477
11987a84218i1814A13649M5475K70143d4195A44889B8955a53815A22023D4052
11976e3938j61443b3957k7636k61911b2338A01479D5918a93922R5223k10278J07498
11965b01479o4130E2103O608b26151A65527a19709A38232m9213h1356A92071A3320
11953F9352R9502c6105j21835K5195A88787a00194p6210A05451c04578h0575J4175
$$ y = [141949, -146848, 27009, -433300, -87704, -102644, -26115, 517204, 34156, -120956, -27969, 176195, -35287, 56355, -43980, -73739, 194329, 44079, -199126, -155684, 28724, 74667, 290346, 108947, 185511, 456786, 52043, -111320, 209426, -90092, 99515, -340725, -61395, 210444, 37330, -179660, 105707, -59113, -104494, 409042, 52182, 179096, -141718, 13272, -143828, 129477, -184218, -91814, 113649, 159124, 429267, -44195, 144889, 28955, -153815, 122023, 44052, -53938, -215381, -23957, -51593, -313504, -22338, 101479, 45918, -193922, -98699, -308977, -201479, -265609, 52103, 58711, -226151, 165527, -119709, 138232, 89019, -81356, 192071, 13320, 69352, 168854, -36105, -157940, -132745, 188787, -100194, -176404, 105451, -304578, -80575, -66400]
11942f6400j06386G9487a36029B26032c6889C7358J37677K1784K50878c11730
11931C46601E4989c1476A11635e3599j27934B00641h7659g707C13217l6588b32132
11919A22800h9689k520K0930j19227h547G6202c4331j94990j85712L6688h983
11907B540A105b9459j41429I3965N6317G842J6161e9974H2792h2750C2269a38386
11894b5872I3787b03195A41005a0985E0846d27879b10938Q5506e7076b4888j70310
11883a95198b8463l28596B45585a33914f0714C1412h8715j53328H7717r790a73066
11871d95414A28052c68562c6928p6901J1774A89152O029d2041A11797b73475i0578
11859B96534b08982B69909P9493j02751a89676f6931A26134a39068k07895E9642
$$ y = [-66400, -172786, 79487, -136029, 226032, -36889, 37358, 175035, 196819, 447697, -311730, 346601, 54989, -31476, 111635, -53599, -181533, 200641, -87659, -7707, 313217, 276629, -232132, 122800, -89689, -92209, -71279, -190506, -8547, 76202, -34331, -229321, -415033, -378345, -8983, 2540, 1105, -29459, -170888, 93965, 150282, 7842, 24003, -59974, 82792, -82750, 32269, -138386, -25872, 93787, -203195, 141005, -10985, 50846, -427879, -210938, -125432, -57076, -24888, -195198, -28463, -357059, 245585, -133914, -60714, 31412, -88715, -242043, 87717, 77927, -173066, -495414, 128052, -368562, -36928, -113829, -102055, 189152, 195181, -42041, 111797, -273475, -90578, 296534, -208982, 269909, 349402, 246651, -189676, -66931, 126134, -139068, -346963, 59642]
11848A07925a13138l9546n4378a4252k5870j14069A05119a35913C62307e7511
11837h2541a9471k8525j48633L4396D1297q314d2749k25360a22867A18506R0322
11826B08828a09887K8831L1947a2599j06745J8220m4596k4494e5497B6416E851
11814A92547H7534i5994B01420h1958E0888b79151O7343E8933a14049n872o6278
11803a86199G9672O5186a99245g1807p1861l8633M5652A59514I692g7362r8586
11792a75948M1509d295B32000g4677J9891D8847h8364L8418G1923j1633K46927
11781C07217G415K55808D0091L63960a30256k8239L7144A39875b76838D3626d2721
11769b92935E4217a23844K9313B23009i7976A98610a43791M197I366Q3732b66189
$$ y = [107925, -113138, -152684, -207062, -14252, -40122, -154191, 105119, -135913, 362307, -57511, -82541, -19471, -47996, -196629, -162233, 41297, 32983, -42749, -268109, -122867, 118506, 208828, -109887, -81056, -49109, -12599, -119344, -101124, -145720, -170214, -55497, 26416, 5851, 192547, 87534, -95994, 201420, -81958, 50888, -279151, -211808, 58933, -114049, -119921, -186199, 79672, 144858, -199245, -71807, -143668, -182301, -136649, 159514, 9692, -77362, -175948, -134439, -4295, 232000, -74677, -54786, 48847, -88364, -49946, 71923, 60290, 307217, 7415, 263223, 40091, 404051, -130256, -158495, -121351, 139875, -276838, 43626, -42721, -292935, 54217, -123844, -94531, 223009, -97976, 198610, -143791, -139594, 9366, 93098, -266189]
11757D1825b00290B701a3961K464B32747b30174g1553C65352A55581e6533A5447
11745c4520k69476i174k90930F5733a11551I1299b41611Q5976D4703R9204i7257
11733d35251C6135O7199A5598K61726b54059j9838a381o3370K1473k2094k41261
11722c06633J22350A29565J16333o4737O5181A8400C059Q8639k6533d6089G846
11710b9857l22008B52816H1238c9488n8030C0541h9487H9533b09081D7915J52296
11699B00211P0614e5655K2768k08239A42941R3779J0117j22197j426l9314l2299
11688E1601O6054n682a99445D08085i9126a6999A468d0208C0369c6653A41554
11676g405H1114c7074E2982a09897G7190i4668E73L30232d8316p4238e2246A04695
$$ y = [41825, -200290, 2701, -13961, -11497, 232747, -230174, -71553, 365352, 155581, -56533, 15447, -34520, -303996, -9174, -300104, 65733, -111551, 91299, -241611, -155635, 44703, 143907, -97257, -435251, 36135, 103334, 15598, 277324, -254059, -273897, -1381, -64751, -43278, -65372, -306633, -184283, 129565, 245898, 181161, 246342, 18400, 3059, 91698, 65165, -46089, 7846, -29857, -351865, 252816, 81238, -39488, -97518, 30541, -89487, 89533, -209081, 47915, 200211, 270825, -55655, -32887, -241126, 142941, 236720, 246837, 124640, 123214, 83900, 51601, 117655, 111973, -199445, 408085, -99126, -16999, 1468, -40208, 30369, -36653, 141554, -7405, 81114, -37074, 52982, -109897, 77190, -94668, 573, 330805, -48316, -122554, -52246, 104695]
11663g2084C15170a56613G2015K1270B2848b92615g8481B84741G0534C0754a30346
11651B13891p3579h156A39206K47037b64246E0958a90497A15434a2448B9930b87258
11639C9027N6810K04681j34606k8916a29055b3239A37145i6507A00288j9472r235
11628G1581J68143G6432J15115G0680Q5973F0558b39158F9369k132c73751D11499
11616b07069N0555N0664B5836f6619J0413q8434C5268a16910N5349j78590A001
11604b08965A52944b26963d2661A9747a6037C40766I3860a25186C93702I4846
11593d1538A03164N2681f1019b9428A49977d7781r3745B38558e9142o4879A1815
11581F5362O9883m074A7369K3677j1389L36776A52559h0613B72700n4158d069
$$ y = [-72084, 315170, -156613, 72015, 93285, 22848, -292615, -78481, 284741, 70534, 30754, -130346, 213891, 140312, -8156, 139206, 386243, -264246, 50958, -190497, 115434, -12448, 29930, -287258, 39027, 95837, 300518, 165912, 136996, -129055, -23239, 137145, -96507, 100288, 80816, 71581, 239724, 76432, 191547, 70680, 156653, 60558, -239158, 69369, 67237, -373751, 411499, -207069, -156514, -105850, 25836, -66619, -56206, -144640, 35268, -116910, -61561, -240151, 1001, -208965, 152944, -226963, -42661, 19747, -16037, 340766, 93860, -125186, 393702, 94846, -41538, 103164, 155845, -61019, -29428, 149977, -47781, -141526, 238558, -59142, -124021, 11815, 65362, 135245, 131171, 17369, 41046, 29657, 366433, 152559, -80613, 272700, 218542, -4069]
11569a1206A2817J0169J07249b38948i3946A07818J50920a93652C34288j61537
11559A72751a44152A05404L85332B34941d3711D820J68910K40355j96860a38242
11548B95272a16733F4962A1431J96229a337A98074K53017j46927a36722A61108
11537D88860A23005B8039K91638I7926c905j38726E17562A0505P1436J87398e648
11525D73378k17147j17333j762E1634b134A13499O928a1302k49709I9588K14691
11514C14279i3060B46293C0455b6151C13794a97558A25495m9515K71266D6410
11503A77115J30688n9012B441d9248A15716A968K62070p0626a828A19406a49079
11491c282E54018a83651k87342A27108P6978p2873E2338K07012C2420O7698K02196
$$ y = [-11206, 12817, 22986, 130235, -238948, -93946, 107818, 258738, -193652, 334288, 172751, -144152, 105404, 490736, 234941, -43711, 4820, 173730, 414085, 217225, -138242, 295272, -116733, 64962, 11431, 207660, -1337, 198074, 451091, 304164, -136722, 161108, 488860, 123005, 28039, 319677, 97926, -3905, -142631, 517562, 10505, 81941, 269339, -5648, 473378, 256231, 138898, 137136, 51634, -2134, 113499, 120427, -11302, -261011, 99588, 314279, -93060, 246293, 30455, -26151, 313794, -197558, 125495, 75980, 347246, 46410, 177115, 307803, 248791, 2441, -49248, 115716, 1968, 264038, 193412, -1828, 119406, -149079, -3282, 554018, -183651, -470993, 127108, 204086, 131213, 52338, 259350, 32420, 100118, 302314]
11480C02314E907Q2530a72420O2158A38683N6304o4723a11960A54074J44900C1503
11468A74366k256j3572c5450D93723f6691A46256E5384P8654L28706F371J44702
11457A51073a30628A07292b21562g8762j98341A26109a1542C18822A35834B120
11446A94288N9008b1829A12261O1179j2181c7654F3569J56140a1259p6535L561
11435h4233j5500A87322n0411J30698a64721j98061B56567C3429K45845i607A5367
11423a11648B48851q5242e3800C49111p9878e0685j57950h6071m055c7233j00371
11412a37604A3942b13831A10514J07438o6921c2608J6122A51840b1096G8444a97659
11400a56190I2718a37367M4198B35635G1421a31033d4856I523K84861e2252G8390
$$ y = [302314, 5907, 88437, -172420, -110262, 138683, 194987, 130264, -111960, 154074, 298974, 31503, 174366, 172110, 158538, -35450, 493723, -66691, 146256, 55384, 134038, 462744, 6371, 151073, -130628, 107292, -221562, -78762, -277103, 126109, -11542, 318822, 135834, 2120, 194288, 253296, -21829, 112261, 173440, 161259, -37654, 63569, 219709, -11259, -87794, -84233, -99733, 187322, 136911, 267609, -164721, -362782, 256567, 33429, 279274, -9607, 15367, -111648, 248851, 163609, -53800, 349111, 269233, -50685, -208635, -86071, -90126, -37233, -137604, 13942, -213831, 110514, 217952, 151031, -32608, -16486, 151840, -21096, 78444, -197659, -156190, 92718, -137367, -93169, 235635, 71421, -131033, -44856, 9523, 294384, -52252, 78390]
11388A62643B2641a22138I2436d3332j84366F1485a56881j40227h7572n9694A49093
11376g6727j37141E855e5436B99386m4273G7100a98494B18980c63887A59174i0728
11364F1494O1104a11614m8409a5064r6421A27700B9439K07479K6691E587a74823
11352C46137B2173K83515a003A76425d5122r4201B40286c503j71902l05269B03559
11340g7308k45725g7133L3158n3282l88761A52320g8567n285F1137a34765B919
11328G6860A1132b1359j53865j8275e6626H8064a95093C94132e2252j10495C99346
11316a76475g0324j39640B04854a39880B47965c09537C8896P1864a41085c2547
11305D6084c1984A16804L5423a26941e4207C20377b1646O078A40373c10254Q2775
$$ y = [162643, 22641, -122138, 92436, -43332, -227698, 61485, -156881, -297108, -87572, -147266, 149093, -76727, -213868, 5855, -55436, 299386, 255113, 77100, -198494, 218980, -363887, 159174, -90728, 61494, 122598, -111614, -160023, -15064, -111485, 127700, 29439, 236918, 263609, 5587, -174823, 346137, 22173, 305688, -1003, 176425, -45122, -139323, 240286, -3503, -175405, -480674, 203559, -77308, -323033, -77133, -43975, -97257, -486018, 152320, -78567, -83852, 61137, -134765, 2919, 76860, 11132, -21359, -175224, -193499, -56626, 88064, -195093, 394132, -52252, -162747, 399346, -176475, -70324, -209964, 204854, -139880, 247965, -309537, 38896, 110760, -141085, -32547, 46084, -31984, 116804, 152227, -126941, -54207, 320377, -21646, -15568, 140373, -310254, -227479]
11294b27479h5273K628B17918b02705B13523d40608i855D56825a17719B4336a06608
11282c22098I6216a27615M4251A73764f5924j68339P6903k0056j67314g0471b8513
11270a08362k38544g5913b483j486A01114h6880N778B58815b50045f3358Q900
11259e4458I4877a34409A86177n8524P6945i7036j73594f206A42112f9522j42661
11248b12183j0313H0401i2437H5084a39866K1695j18746a8925l00873e5314A56448
11236b86613c1728j28869r6203B71248o0018a23519k33088J03810B59489a1776
11225H0971K31392m6324J89934a30399B14642p2687m7368q60J71185a07952j95650
11214c03602A7704J20200a48554j13174B08278k2274e1616j30768j1352B31759
$$ y = [-227479, -85273, -82645, 217918, -202705, 213523, -440608, -9855, 456825, -117719, 24336, -106608, -322098, 96216, -127615, -83364, 173764, -65924, -234263, -157360, -177416, -344730, -70471, -28513, -108362, -346906, -75913, -2483, -3969, 101114, -86880, -81102, 258815, -250045, -63358, -54458, 94877, -134409, 186177, 127653, 204598, -97036, -270630, -6206, 142112, -69522, -212183, -222496, 80401, -92437, 85084, -139866, -118171, -236917, -18925, -319798, -55314, 156448, -286613, -31728, -160597, -256800, 271248, 211230, -123519, -356607, -252797, 259489, -11776, 80971, 312363, 266039, 455973, -130399, 214642, 141955, 94587, 93727, 264912, -107952, -303602, 17704, 137904, -148554, -261728, 208278, 186004, -51616, -182384, -193736, 231759]
11203d090o4020A8995B538f6300K6609C6332J01477L20441a07668C0312Q8638
11192A18950K8385m6429b93015I4732b9401k37209e5282C7278a9021F2350f7679
11180c26436C7767d0779B61662d9235j63712i8198J368n2266B40643A02708g3948
11168b34159j07031A81383a5875q6148C8709i8180D7761M4242c75624p3915J70530
11157b79009G5692a18760j32758a0079o2110E7856c8867l2550m4185k2303q3893
11146b21798C4428b40386k737A39034B4983j2184c69831D8621M4155b95006j7772
11135c12778C27090B0016b39604M4318f2138B74669G8968G703a85171B99709c01882
11123c0685j63047B4230a08426G2343A322N2971b76864A02479J66558O5605a00591
$$ y = [-4090, -68110, 18995, 2538, -66300, -39691, 36332, 137809, 458250, -107668, 30312, 118950, 147335, 100906, -293015, 94732, -29401, -266610, -55282, 37278, -19021, 62350, -67679, -326436, 37767, -40779, 261662, -49235, -212947, -98198, -96830, -149096, 240643, 102708, -73948, -234159, -341190, 181383, -15875, -102023, 38709, -98180, 47761, 92003, -375624, -449539, -279009, 75692, -118760, -251518, -10079, -72189, 57856, -38867, -71417, -115602, -137905, -221798, 34428, -240386, -243123, 139034, 24983, 12799, -369831, 48621, 92776, -295006, -312778, 327090, 20016, -239604, -195286, -62138, 274669, 78968, 7703, -185171, 299709, -301882, -30685, -193732, 24230, -108426, 72343, 1322, 54293, -276864, 102479, 269037, 334642, -100591]
11111e8484a0563A85215k3590D3517J62725J21740J8224j45868J9634J25888j57706
11100A88154N9010l4441O7345j33356J00434A03516K0810D4992K2070M14835B751
11088A50812f6447m2513C55439j15505p4165k5381k1163A2841M0606J92614L2736
11077B78797Q0423E7637P1522J02934p0260Q8404n5054J10785D2570M61254B27627
11065D88686p8218n5968j37244J5578L07407J30494j10144J77199j37352k3695
11055E76743K5575k81149L55019p5619J47813l37959K35210J03634J81813D39252
11044F05287k16880K04668m479K18602m4394j65987L7165r4669j16749J27277
11034E49841M58516l19916q1340K60131k95043K746O5080O4849M20367n52864
$$ y = [-58484, -10563, 185215, 161625, 43517, 206242, 327982, 346206, 200338, 219972, 345860, 188154, 247164, 212723, 280068, 146712, 247146, 103516, 124326, 44992, 67062, 481897, 2751, 150812, -66447, -108960, 355439, 239934, 165769, 140388, 119225, 12841, 53447, 246061, 278797, 359220, 57637, 129159, 232093, 161833, 250237, 195183, 305968, 42570, 503824, 227627, 488686, 410468, 354500, 217256, 232834, 540241, 670735, 560591, 737790, 600438, 576743, 602318, 321169, 676188, 600569, 748382, 410423, 645633, 749267, 931080, 439252, 605287, 388407, 593075, 588596, 807198, 762804, 596817, 633982, 539313, 422564, 549841, 1008357, 688441, 607101, 867232, 572189, 574935, 640015, 704864, 1125231, 572367]
11024E72367j36225j58303L52618Q1449m8366j03009K9958j78968O13237m60637
11014E64121j8712q907J64739q0424m0293M0208J28707o6765R486j36583k04465
11003C51112K03246J41827O3375j95426j78973N04572C77033N20176l00718m059
10993E92432k49752K26344r654M1444K84455D31512M11215K45067K17143j92847
10983A112090k1452m32304Q38367j51943j10332L0828R9556M15605K78987J25928
10973B185330P054M48565J80118O2048N4326m07255m34440q0197l68129j7397
10963A630023q6099J46495J22485l46387M63721n8505j90099K49517n8530q6462
10953A786159k21220k35203p6343P9186l83754j64801k72308o3640O6180E1146
$$ y = [572367, 436142, 277839, 630457, 711906, 663540, 560531, 590489, 411521, 1024758, 564121, 545409, 536502, 701241, 620817, 580524, 620732, 749439, 682674, 692160, 555577, 351112, 554358, 696185, 759560, 564134, 385161, 889733, 377033, 897209, 596491, 592432, 342680, 569024, 559370, 600814, 885269, 431512, 842727, 1087794, 1304937, 1112090, 1090638, 658334, 1496701, 1344758, 1234426, 1265254, 1364810, 1780415, 2059402, 2185330, 2192384, 2640949, 2821067, 2883115, 2937441, 2530186, 2095746, 2015549, 1647420, 1630023, 1543924, 1690419, 1812904, 1466517, 1930238, 1871733, 1681634, 1931151, 1872621, 1786159, 1564939, 1329736, 1253393, 1332579, 948825, 784024, 511716, 448076, 514256, 51146]
10942E12467j26381K8191K5953B12090K408l1020J42657d4903D84644l9833a050
10930a77360A55027L8972a0175j9582L824A22267M22925a21845E66790A83693
10919G3875J48357C0569b07168j42709B44034H5939b79l37847a27489A3074a62263
10907a50217A16051j6879D7395J85477b83482d4090m510A12823h6988o7050j31502
10896b85540C39502I5530g017j35931A0252a43187B49854e0015l1684A4446M3446
10885E7892c68290B53603l6384c33475k21424d5964o7905j73856d3954l5525j00085
10874a79564A70847j9741J44851d2853C12574h8852l23774J68211a16611C5921
10863a62803B07020r7758a43496O5925h53D4762J22318b014j62596b319j25234
$$ y = [512467, 386086, 414277, 440230, 212090, 214498, 183478, 326135, -44903, 484644, 444811, -1050, -177360, 155027, 193999, -10175, -29757, -25933, 122267, 545192, -121845, 566790, 183693, 73875, 222232, 30569, -207168, -349877, 244034, 85939, -279, -338126, -127489, 13074, -162263, -150217, 116051, 99172, 47395, 232872, -283482, -44090, -48600, 112823, -86988, -154038, -285540, 339502, 95530, -7017, -142948, 10252, -143187, 249854, -50015, -81699, 14446, 57892, -368290, 253603, 217219, -333475, -554899, -45964, -113869, -287725, -43954, -79479, -179564, 170847, 151106, 295957, -42853, 312574, -88852, -412626, -244415, -116611, 35921, -162803, 207020, 109262, -143496, -77571, -853, 44762, 167080, -2014, -164610, -2319, -127553]
10852a27553K5896j53427b8580A19755b70410J5734o4594F4310a6573C29985H5874
10840D8121c16153J1375f1951C63007A14700j8599a44892H1485P5929h2272I998
10828A95747J23135a37730B05724o9715K47490c38587J17546A89911P1695b17206
10817a07318b5332A62758a81075d6220A9799J31635k4872a43573r5696A1298a31624
10805A98385Q0945j16140N1021A03646m9313B5955M2892a94310p9501r8619f9001
10793b71646A03675K4889D346b33757D8693O7438b04055i5398B65524c05981J32372
10782a73609Q4692B3092i0614J8368B49779d14042i3388c2516D0354J3616c8402
10770a06481C5377K18953b55726g2778k33416J05090k2271F9973N1805k1363a07508
$$ y = [-127553, -101657, -255084, -28580, 119755, -270410, -254676, -319270, 64310, -16573, 329985, 85874, 48121, -316153, -304778, -61951, 363007, 114700, 96101, -144892, 81485, 157414, -82272, 9998, 195747, 318882, -137730, 205724, 136009, 383499, -338587, -221041, 189911, 261606, -217206, -107318, -25332, 162758, -181075, -46220, 19799, 151434, 126562, -143573, -239269, 11298, -131624, 198385, 279330, 163190, 214211, 103646, 54333, 25955, 68847, -194310, -273811, -372430, -69001, -271646, 103675, 128564, 4346, -233757, 48693, 116131, -204055, -95398, 265524, -305981, -173609, -88917, 23092, -90614, -72246, 249779, -414042, -93388, -32516, 40354, 53970, -38402, -106481, 35377, 254330, -255726, -72778, -306194, -201104, -223375, 69973, 121778, 100415, -107508]
10758a01571A1327L91568c00668R4227h896n4526A36170b80129E0094M6415g3223
10746e2518B34253J7641i7029I9710o918M8058o7001J98833B3980b39923O7499
10735a72424E1495J76921J01329A46110J7468l3394J76666q1897a51093b5046
10724c07129Q4844N5371j88296b1566m27898a25648c4129k45226J7152B30739
10713C35278a8241A3992b9810l404G729J60354D4546J20984a76933D1852J72377
10702B14229h8028B40218b7516m122q9096C21808b66847d2134o6750G6995b27263
10690b9959A49869J13178L7387a80363B635J86822r3177J6952c5470k10671C9835
10678C10928F7942O0242a35752R289l8022G0399l1137B863J06489m9259R1753
$$ y = [-101571, 11327, 402895, -300668, -206441, -8896, -63422, 136170, -280129, 50094, 96509, -73223, -52518, 234253, 251894, -97029, 99710, 92792, 140850, 73849, 272682, 23980, -239923, -172424, 51495, 228416, 329745, 146110, 163578, 130184, 306850, 224953, -151093, -25046, -307129, -222285, -166914, -355210, -21566, -449464, -125648, -34129, -279355, -262203, 230739, 335278, -18241, 13992, -29810, -33214, 7729, 168083, 44546, 165530, -176933, 41852, 214229, -88028, 240218, -27516, -31638, -120734, 321808, -266847, -42134, -108884, 76995, -227263, -29959, 149869, 263047, 300434, -180363, 2635, 189457, 96280, 113232, -35470, -246141, 39835, 310928, 67942, 128184, -135752, -126463, -164485, 70399, 39262, 2863, 109352, 60093, 151846]
10667A51846i2878j00864b1801B39824a12067q5672e6745G2225i7254o9009a630
10655a15366e1444l7944A82934a15302j56457a8412n30308a86680h5966A63658
10644H2255h3389J6282r8877d4760F5641a96779c4275k61413B67882j10513a841
10632b56603d5499d053A7728J67138d6708j20857b5882k42487a32545L357K9195
10621i9993L5838B16019d2757G3428h7644L9726l1936J0725c1224l31810A8962
10609a20494A08008c90102a39865o6607c3539B02605a85375g5921A7454J03281
10599A20735R1979b4048j64202A26970b7353c528A00563J01857c41545c6949j5038
10588e1987n8037b4177C5623h249k1066j92742g2170l31825A05046b18735k2191
$$ y = [151846, -92878, -193742, -21801, 239824, -112067, -197739, -56745, 72225, -97254, -166263, -1630, -115366, -51444, -89388, 182934, -115302, -271759, -18412, -548720, -186680, -85966, 163658, 82255, -83389, -67107, -165984, -44760, 65641, -196779, -34275, -295688, 267882, 157369, -1841, -256603, -45499, -4053, 17728, 184866, -46708, -167565, -25882, -268369, -132545, -129188, -99993, -64155, 216019, -42757, 73428, -87644, -47918, -79854, -69129, -31224, -363034, 18962, -120494, 108008, -390102, -139865, -206472, -33539, 202605, -185375, -75921, 17454, 120735, 212714, -24048, -188250, 126970, -27353, -3528, 100563, 202420, -341545, -36949, -51987, -110024, -24177, 35623, -8249, -29315, -222057, -72170, -403995, 105046, -218735, -240926]
10577b40926a5479o301j32975e5448h583l36491R9603E8891h0743o7971O8319
10566h0395A47298e6219B0572f6664j58158f1702b891j9177r5974M9564A93570
10554d7801j42719e7913p8458j70891A08135P7582q5982m8369J45800E6706d6051
10542a10015g963A45156a01515H7618c25606I332R2904N1929A1665a21975M6546
10531g5429o3158D5130h2101A95372g2539o188C23590J59863A44191b28835O1502
10520a67333B08170r9548P9048d9992A31819a6662A13219c97944A05803a33981
10509a07353g641l31012a61270j2493c5558k9248j57817d2453j29657B499b12917
10497a50707F2963K0054a86264M7774A42846i6038A2434M8966L9369K63879a54836
$$ y = [-240926, -15479, -21780, -154755, -55448, -8583, -345074, -245471, 58891, -80743, -148714, -80395, 147298, -56219, 20572, -66664, -224822, -61702, -2891, -22068, -118042, -68478, 193570, -47801, -190520, -57913, -136371, -307262, 108135, 185717, 99735, 51366, 197166, 56706, -46051, -110015, -7963, 145156, -101515, 87618, -325606, 9332, 102236, 154165, 11665, -121975, -75429, -138587, 45130, -82101, 195372, -72539, -78727, 323590, 483453, 144191, -228835, -167333, 208170, 108622, 187670, -49992, 131819, -16662, 113219, -397944, 105803, -133981, -107353, -7641, -338653, -161270, -173763, -35558, -64806, -222623, -42453, -172110, 2499, -212917, -150707, 62963, 83017, -186264, -138490, 142846, -96038, 12434, 61400, 100769, 364648, -154836]
10485a97945C61660G7775a2316D43899j33798L98652k13778J80131l01691j12798
10475B60617a18173E2138K90639j33136m8022a36621A82302d2755n152j40453
10465a88360A59917f7631C88021A18898b57239E9b95456D72067i9233j41329O4681
10454a75881e4968j88449B53356a27551D2989b54121A44360b89860A60253D8784
10443B96141a67945K1846j49111a27436J6643I0539c52505J75563c4012H1844
10432g0216j3833k02246D83636A73070L1681o2591a7634A52672B2507a89399A38405
10420A9981a25073m9408q3799I1766i5623k4914D9863a1734C13475C0370P4054
10409A04424a08110d2407F2699N2239m7481b53B26432F2539P9018b30623C6654
$$ y = [-197945, 361660, 77775, -12316, 443899, 310101, 708753, 494975, 675106, 373415, 260617, -118173, 52138, 342777, 209641, 161619, -136621, 182302, -42755, -47907, -188360, 159917, -67631, 388021, 118898, -257239, 59, -295456, 472067, -99233, -240562, -175881, -54968, -243417, 253356, -127551, 42989, -254121, 144360, -289860, 160253, 48784, 296141, -167945, -146099, -295210, -127436, -110793, 90539, -352505, -176942, -34012, 81844, -70216, -84049, -286295, 483636, 173070, 204751, 142160, -17634, 152672, 22507, -189399, 138405, 19981, -125073, -174481, -258280, 91766, -95623, -120537, 49863, -11734, 313475, 30370, 104424, -108110, -42407, 62699, 114938, 67457, -253, 226432, 62539, 141557, -230623, 36654]
10397i0585K6850q3665H8678A2238a88194A83439n2969D6589N6077a37276A3126
10385A44180i8540A48661a1966k8547B47797G8677a740p8612C11960a7629B93853
10373E8370L12276j73145J34052j0220P0302A95152N8508j13069D1926L83792
10363D25718A46182Q2815J24855o1942E1030J30813N9584G9102C2573J6976M26696
10352D76245J38148r6554j64336J74941J74826j63224C1958J40690K00174K60640
10342F33462B13515n0156M5432N7098E7125M08362j36968h7958B60697o2468K15529
10331D13758k02935F7200O4290J0513L34744d5237l0125I2778K5619K88153h2119
10319C67707a0537A10204J57635A14313J43551p6900n2421n032a66132A04174
$$ y = [-90585, -63735, -147400, 88678, 12238, -188194, 183439, 130470, 46589, 102666, -137276, 13126, 144180, -98540, 148661, -11966, -40513, 247797, 78677, -1740, -80352, 311960, -17629, 293853, 58370, 370646, 197501, 331553, 321333, 391635, 195152, 253660, 140591, 41926, 425718, 146182, 228997, 353852, 291910, 51030, 181843, 241427, 79102, 32573, 49549, 476245, 614393, 517839, 353503, 528444, 703270, 540046, 31958, 172648, 372822, 633462, 213515, 163359, 208791, 265889, 57125, 465487, 328519, -87958, 260697, 198229, 413758, 210823, 67200, 131490, 142003, 476747, -45237, -75362, 92778, 118397, 406550, -82119, 367707, -10537, 110204, 267839, 114313, 257864, 180964, 128543, 123511, -166132, 104174]
10308E3005J96523B6484J04793J96485j63576a85001b7171A21505b97396J26714
10298a70682f1686f979A77308E55c21662a27999A0469R9606c38547J59165l1872
10287b11254c7290m9976j23071F4011a22954n7227j34515h103B22305J4232d91551
10275a77658o5449E9921k7525a18778b5960j10558F0871e0279F546a62863J4275
10264a48588j0928A45482b34583A30L52588j21031N672K13448A10890R8393n4039
10253A55244L0291B4111J51236g6481c1272A2749a07274B4641c19018d6549F2751
10241c7996m1728j13774A23854a70138a1093j31745q9419b7215j23696P1051m600
10230h4460A32761c65713a1326k27223g4347C47397d03236c1543j44165B21987
$$ y = [53005, 249528, 26484, 131277, 327762, 164186, -185001, -27171, 121505, -297396, -170682, -61686, -6979, 177308, 555, -321662, -127999, 10469, 110075, -338547, -179382, -211254, -37290, -87266, -210337, 64011, -122954, -180181, -314696, -8103, 222305, 236537, -491551, -177658, -243107, 59921, 32396, -118778, -25960, -136518, 60871, -50279, 6546, -162863, -148588, -159516, 145482, -234583, 130, 352718, 231687, 237359, 450807, 110890, 209283, 155244, 185535, 24111, 175347, -76481, -31272, 12749, -107274, 24641, -319018, -46549, 62751, -37996, -79724, -193498, 123854, -170138, -11093, -142838, -232257, -27215, -150911, -79860, -84460, 132761, -365713, -11326, -238549, -74347, 347397, -403236, -31543, -175708, 221987]
10219B72721b58523k16675A74912J22243F3391h3523A46383i8058j01373A55976
10208b7239j34808B8147c1331C5477b39990A93527d49362b00607A03824k4927
10198G8897L31018d5270A46769a21600n7913a7930k48070g8705j98472H2570K15272
10187B97842c11178d9395A86068a84108I9523K1530J39512a54269O5370A03633
10176b28211n9036A98411a9127o3372d1084r4422j41409i9689F0840c40342B05204
10164a51149k64836A55358C680b66770Q4952j00330k1830q3807f4314A6359i938
10152a24759j57273R9353L1192A18405a44902A90958a91715I3936h2105B43563
10141B5814f5658q7878r4653i7060o0856n8026h3600G1843J59464c20958m8126
$$ y = [272721, -258523, -475198, 174912, 297155, 63391, -83523, 146383, -98058, -199431, 155976, -27239, -162047, 28147, -31331, 35477, -239990, 193527, -449362, -200607, 103824, 78897, 409915, -45270, 146769, -121600, -179513, -17930, -266000, -78705, -277177, 82570, 297842, -311178, -49395, 186068, -184108, 99523, 121053, 260565, -154269, -88899, 103633, -228211, -287247, 198411, -19127, -82499, -41084, -135506, -276915, -99689, 60840, -340342, 205204, -151149, -415985, 155358, 3680, -266770, -181818, -282148, -303978, -387785, -64314, 16359, -9938, -124759, -282032, -182679, -151487, 118405, -144902, 190958, -191715, 93936, -82105, 243563, 25814, -65658, -153536, -248189, -97060, -157916, -215942, -83600, 71843, 231307, -320958, -369084]
10130c69084j01321e7829j32493B33473b75077B26917b47891A22313a89904F9062
10119A43371a80951d7021j37921c3690k05471R5489h881m4632r9869F8280K44973
10108C13253c2079k84597Q4281o4610A45798i7444C82407i1851D3128N2946b89674
10096d3109B80264A30416J50277C0982M0100K01839b05683A70431n7616B4130
10085a61173k4179c2900A23399a82485R0720L4918A9328a73104j3242f4244o8178
10074a32422I9710a40568c8476n2268E2915J44416a19790L3663A49165P69R274
10063A59208G3100c7564A15028g3575k1236E3416c30937J29422i3007k19950a34364
10051B13996A06731N5132i6601A56379f057j92657o9522D7335a42116j4133B29201
$$ y = [-369084, -470405, -57829, -190322, 233473, -275077, 226917, -247891, 122313, -189904, 69062, 143371, -180951, -47021, -184942, -33690, -239161, -143672, -8881, -53513, -153382, 68280, 313253, -32079, -316676, -232395, -297005, 145798, -97444, 382407, -91851, 43128, 96074, -289674, -43109, 280264, 130416, 280693, 30982, 71082, 272921, -205683, 170431, 112815, 24130, -161173, -185352, -32900, 123399, -182485, -91765, -56847, 19328, -173104, -186346, -64244, -132422, 99710, -140568, -38476, -90744, 52915, 197331, -119790, -86127, 149165, 149934, 159208, 73100, -37564, 115028, -73575, -94811, 53416, -330937, -201515, -93007, -312957, -134364, 213996, 106731, 161863, -96601, 156379, -6057, -198714, -268236, 47335, -142116, -156249, 229201]
10039H9266A1798g5895l16181c4305k50857B08060c5454C7388a49894A47928a71529
10027b3787j96982R8330N1282k066A20389C6510e4947j4538l54415F9754g0282
10015G6709a39860k21055c5171q3505B2685Q1126C3223c08599a04561A0440M7832
10004E8272a69276j16052a21450d1561b506D3218f7019q6426c3110m9587b5340
9992F3300b26730N3911A27404F3351g6660r2057d3531j41474o5725j91482C68185
9980A52185h4363A49664a22362j58725o5432A44134a29521r4884A4392a78206
9969H2919a35104m319b2737q718j86065A86803a22463n0102B9738b77468f9270
9957d7357j34034B09145c9628A86705A4099J6013J89339a29918j92208A91889
$$ y = [89266, 11798, -75895, -392076, -34305, -285162, 208060, -35454, 37388, -149894, 147928, -171529, -23787, -220769, -122439, -71157, -73223, 120389, 36510, -54947, -69485, -423900, 69754, -70282, 76709, -139860, -360915, -35171, -118676, 22685, 103811, 33223, -308599, -104561, 10440, 58272, -169276, -285328, -121450, -41561, -2506, 43218, -67019, -153445, -33110, -82697, -25340, 63300, -226730, -172819, 127404, 63351, -76660, -168717, -43531, -185005, -250730, -442212, 368185, 152185, -84363, 149664, -122362, -281087, -346519, 144134, -129521, -224405, 14392, -178206, 82919, -135104, -139423, -22737, -31455, -217520, 186803, -122463, -172565, 29738, -277468, -69270, -47357, -181391, 209145, -39628, 186705, 14099, 30112, 219451, -129918, -322126, 191889]
9946b50499n4015q0260e1267B59471C0793a02030j9639j31987A8673J37272a49322
9934a58766p0387R2749k68933o3479K03871J03893j984B52766d1211A75791b6711
9922A2500M02982A4477f0654p7060e4895D500b97234a39092A05672a6211A59700
9910a87433e6362m06255h2367n177A63069c24953A02044e2726A5371e57081A02035
9898B6529J7305a66721q0248j38584c1987p0899A40890c37895f7467B31509b39100
9886a7598A77528a40827A97165o5436c54793C3761a20498B4993i4853o3134F6303
9874b22534j69238J21474L7802M7263l02349B80059H1456k2132J47863m5820A038
9862b30893G7800Q2514F4270O8777K25185a24809A86100c69458C9138a83238Q1115
$$ y = [-250499, -304514, -384774, -51267, 259471, 30793, -102030, -121669, -253656, 18673, 155945, -149322, -158766, -229153, -136404, -405337, -468816, -264945, -161052, -163036, 252766, -41211, 175791, -26711, 12500, 415482, 14477, -60654, -137714, -54895, 4500, -297234, -139092, 105672, -16211, 159700, -187433, -56362, -462617, -82367, -87544, 163069, -324953, 102044, -52726, 15371, -557081, 102035, 26529, 43834, -166721, -246969, -385553, -31987, -102886, 140890, -337895, -67467, 231509, -239100, -17598, 177528, -140827, 197165, 131729, -354793, 33761, -120498, 24993, -94853, -157987, 66303, -222534, -391772, -270298, -232496, -185233, -487582, 280059, 81456, 59324, 207187, 161367, 1038, -230893, 77800, 160314, 64270, 133047, 358232, -124809, 186100, -369458, 39138, -183238, -102123]
9851a02123j24021d5327l24179K3246a13486n7264r7342J05512O0397j23946f371
9839B10586a89575A02291E309d4827n9659A2891L22359C3840a97121a262H9502
9827h8550A04750b5471n4893j41058A44887c13384h7874m6210o6534j59595D2651
9815A32857J8887J14838c61787J57272m2325J0449C4943c3910r948j05536A22652
9803e0950D67253a18172J4603j16056j17200J52321E4635K47164A8096a46636
9792A23872E9749i8627c285B6718g2361B61468a96111I7180b61058k0094e7629
9780f3946j41386B71016b6576k47109I6090b79336F719N4528i4554j33781D2075
9768d138B87877e7328I1349a7271j72774A90500i4206M4580d261B07751b10393
$$ y = [-102123, -226144, -45327, -369506, -346260, -113486, -170750, -268092, -162580, -102183, -226129, -6371, 210586, -189575, 102291, 5309, -44827, -104486, 12891, 335250, 33840, -197121, -1262, 89502, -88550, 104750, -25471, -80364, -221422, 144887, -313384, -87874, -134084, -200618, -360213, 42651, 132857, 151744, 266582, -361787, -204515, -246840, -236391, 34943, -33910, -43858, -149394, 122652, -50950, 467253, -118172, -103569, -219625, -336825, -184504, 54635, 301799, 18096, -146636, 123872, 59749, -98627, -3285, 26718, -72361, 261468, -196111, 97180, -261058, -281152, -57629, -63946, -205332, 271016, -26576, -273685, 96090, -279336, 6719, 61247, -94554, -228335, 42075, -4138, 287877, -57328, 91349, -17271, -190045, 190500, -94206, -49626, -4261, 207751, -210393]
9756a25779j78935C3749J98866a72899B5534a10663A09079a3499k78115g2714
9745a4690j81202l4224a1684o4561m896b7685H2835f0610m88891A4271b96352
9733b10397b6886r00l7975j21886R3161k37544a13048D8300b76388J34103r2971
9722b35256A14000i3908A21779i219j98877r479c7849A59213J30920c99807g1920
9710a15718E7381a72788A16344b7226k72492J15915N7574K6888A85359b9153j71465
9699b00618M1136A17713J01616a96877b153A22429L366a91838H1114b48713B1037
9687c77534g8594A78110a35469C05038a45966k91917F2701J89913d1970p3029
9677a14999j38368A29809B8015c19085A43910b21015K0828r3301a01757G480Q121
$$ y = [-125779, -304714, 33749, 232615, -172899, 25534, -110663, 109079, -13499, -291614, -72714, -14690, -195892, -230116, -11684, -76245, -81141, -27685, 82835, -60610, -549501, 14271, -296352, -210397, -26886, -27786, -65761, -187647, -94486, -332030, -113048, 48300, -276388, -142285, -235256, 114000, -93908, 121779, -9219, -208096, -217575, -37849, 159213, 290133, -399807, -71920, -115718, 57381, -172788, 116344, -27226, -299718, -183803, -126229, -99341, 185359, -29153, -200618, -159482, 117713, 219329, -196877, -2153, 122429, 125795, -191838, 81114, -248713, 21037, -377534, -78594, 178110, -135469, 305038, -145966, -437883, 62701, 252614, -41970, -114999, -253367, 129809, 28015, -319085, 143910, -221015, -200187, -293488, -101757, 7480, 15601]
9666A5601e8373k09142f2124I7629c90723F8516M9199c70255a40537E2906d04864
9654a54667m062l3350A8867a3934l74891f1834m35675A6002d1063j40812j19244
9643c01119J26653k7100H4070a06043D755b20612A51144a61265A81481a88815
9632b81958A77263a80775d7386E4708J35199q9067g5227A20790b65008A06382
9621d6750j56478D2300J63792a0005k75032i0260b1809C15710b91892B2023a03051
9609A04542e461B5642K11559J07915k2816b38133J14921m2001G2447a05257A94479
9597a33379l42081a18342B01840c33675I6548k1541b70631e5491k33289G940Q432
9586A6372b25142C2347K90205c44363a1947A5691J08d9557q8024K657M37D6932
$$ y = [15601, -58373, -267515, -62124, 97629, -390723, 68516, 117715, -370255, -140537, 52906, -404864, -154667, -158729, -192079, 18867, -13934, -388825, -61834, -497509, 16002, -41063, -181875, -301119, -174466, -201566, 84070, -106043, 4755, -220612, 151144, -161265, 181481, -188815, -281958, 177263, -180775, -47386, 54708, 189907, 100840, -75227, 120790, -265008, 106382, -46750, -203228, 42300, 206092, -10005, -285037, -90260, -21809, 315710, -291892, 22023, -103051, 104542, -5461, 25642, 237201, 345116, 322300, -238133, -123212, -165213, 72447, -105257, 194479, -133379, -475460, -118342, 201840, -333675, 96548, 75007, -270631, -55491, -288780, 7940, 16372, -225142, 32347, 322552, -344363, -11947, 15691, 15799, -49557, -137581, -134924, -134487, 46932]
9573B14689n2613g220A09835a52916M8341D83743A78614a19155M7568B30859I6783
9561I2781M1638c26562A07380b78455A85838J19714b73124O651d1522A56135B3893
9549h2486k16254f0278a4500C3627L0161B2890b1154C45603l4720a46601f1860
9537d20699a50052M4780k07815C56912b79157A47791b79151k9938A55656a06150
9526b57767Q4711B54289a47627j40484a39146L1333d6892k62477i4396b0046D9411
9514E3587f45671a11363n5922D0901d30335G48a6692j3345m3284A25506b14807
9502a07796k10179c3681A41636h1040A73583p3041a1772B14371a59532a6060m47777
9491d63837E8285J3685k8902j1972J5786a36749r5394J3382D9803g1649A7151
$$ y = [214689, 162076, -7220, 109835, -152916, -104575, 483743, 178614, -119155, -71587, 230859, 96783, 92781, 134419, -326562, 107380, -278455, 185838, 305552, -273124, -266473, -41522, 156135, 23893, -82486, -298740, -60278, -14500, 33627, 63788, 22890, -21154, 345603, 310883, -146601, -61860, -420699, -150052, -105272, -313087, 356912, -279157, 147791, -279151, -309089, 155656, -106150, -257767, -173056, 254289, -147627, -288111, -139146, -107813, -46892, -309369, -94396, -20046, 49411, 53587, -645671, -111363, -167285, 40901, -430335, 748, -16692, -30037, -73321, 125506, -214807, -107796, -317975, -33681, 141636, -81040, 173583, 100542, -11772, 214371, -159532, -16060, -463837, 58285, 71970, 43068, 31096, 46882, -136749, -232143, -218761, 49803, -71649, 17151]
9479a19377C2046K3061a4818m7359I4003P2354B1003c21743a00522D5576b86087
9467E120b01662g8745g520E5610b26819c7973n8400I1641A6915a72115k3814B00580
9454b0450q1581d4953a6716A44212a76177A62512a38177M7843j20446k39935A3700
9442a77356j6188C78970e3582k34318J16897k17630g9491F0941e2105p0994F7515
9430f6771o4705C87585a40015K4720m0067c9350H8187A2260a69152p0151A50986
9418g9503k2025G0999A5889c0827I5434J56936b56828d1045H2941J43103F3879
9406h6241r7795i1584l07956f2559j0542C28209n2203A11084h1308m2831j80350
9395c04489B7231d2764a8051A69949n9976a73660A14949f9959I2143C9633J32540
$$ y = [-119377, 32046, 55107, -14818, -62177, 94003, 166357, 21003, -321743, -100522, 45576, -286087, 5120, -201662, -78745, -7520, 55610, -226819, -37973, -96373, 91641, 16915, -172115, -195929, 200580, -20450, -102031, -44953, -16716, 144212, -176177, 162512, -138177, -90334, -210780, -450715, 13700, -177356, -193544, 378970, -53582, -287900, -171003, -388633, -79491, 60941, -52105, -123099, 67515, -66771, -131476, 387585, -140015, -115295, -155362, -39350, 88187, 12260, -169152, -239303, 150986, -79503, -101528, 70999, 15889, -30827, 95434, 252370, -256828, -41045, 82941, 226044, 63879, -86241, -184036, -91584, -399540, -62559, -73101, 328209, 276006, 111084, -81308, -124139, -304489, 27231, -42764, -18051, 169949, 109973, -173660, 114949, -69959, 92143, 39633, 172173]
9384A72173a52390h515C02946G3573g0769k32520c4895m6603H8478A4178a00970
9372c2497m0558o1544K029A27174a8609l94833J62452J19779C2398k144c2924
9360a66672e5269A74478d30472a22476A86750J5003a72955K9665F3744K0289a11390
9348b08362H3628a39140H3552d1837B33208a60365j47488L0795D5777b55128B94449
9336F05h8849H4509c13786A27205b28695k5390N6932A62346b22616i2410l76922
9325d69332a11976b451j88113a6819A571a40294o1446Q3648i72G6489g0021K7725
9313d2296n4660a1308B6229M6718L16786e9467C244a03280I6262C3449M9397a48700
9300F1622M7846a82431M887k40158f9820F3590c7640j12886j6958H8148b47668
$$ y = [172173, -152390, -8515, 302946, 73573, -70769, -303289, -34895, -81498, 88478, 14178, -100970, -32497, -73055, -134599, -132570, 127174, -18609, -413442, -250990, -131211, 32398, 30254, -32924, -166672, -55269, 174478, -430472, -122476, 186750, 201753, -172955, -143290, 63744, 84033, -111390, -208362, 83628, -139140, 83552, -41837, 233208, -160365, -307853, -277058, 45777, -255128, 294449, 605, -88849, 84509, -313786, 127205, -228695, -254085, -197153, 162346, -222616, -92410, -469332, -111976, -2451, -190564, -16819, 1571, -140294, -201740, -118092, -972, 76489, -70021, -42296, -96956, -11308, 26229, 72947, 389733, -59467, 3244, -103280, 96262, 33449, 82846, -148700, 61622, 109468, -182431, -177544, -417702, -69820, 63590, -37640, -150526, -167484, 88148, -247668]
9288d4896j45131M6499H7787b73458J6649r7215a7140k73677D348q41a82059d7117
9275a24147B50879H6507g4410m9099C1883c11345B37820a33655l03007O7952i3102
9263A00118A555a06461f351j28614n1915M8557e156A44482g4729F0783b12035
9251b57534l2712J12811k01434a62591I6477c60813J53636A5575a13002A99857
9240B53573H322J40421c04325a0024C627b49515i1558K4595A54248b28971R5408
9229a33563k3771D3884b75619J19741C9419b0011D511c97991A5410J49668d107
9217B14385D3922L74350c7909B8725b22398m4098g2343A09225b04143C3435M1991
9206G5426J13998b04908i342k597G9401c6865j41717k1190q4782m799P7650i5986
$$ y = [-44896, -190027, -143528, 87787, -273458, -256809, -354024, -17140, -290817, 4348, 3507, -182059, -47117, -124147, 250879, 86507, -74410, -123509, 31883, -311345, 237820, -133655, -436662, -368710, -93102, 100118, 1555, -106461, -6351, -134965, -186880, -138323, -5156, 144482, -74729, 60783, -212035, -257534, -290246, -177435, -378869, -162591, 96477, -360813, -207177, 15575, -113002, 199857, 253573, 8322, 148743, -304325, -10024, 3627, -249515, -91558, -66963, 154248, -228971, -133563, -157334, 43884, -275619, -155878, 39419, -20011, 4511, -397991, 15410, 165078, -4107, 214385, 43922, 418272, -37909, 28725, -222398, -266496, -72343, 109225, -204143, 33435, 75426, 189424, -204908, -9342, -11939, 79401, -36865, -178582, -199772, -284554, -289353, -211703, -95986]
9193C17362b85790N1204B97082d4883k52479A47637d52733b18761A60035d3187
9182g2800E64116c22422Q6714i2360j1812b1811B65558a83710A40895l4497L16682
9171D23080C6981b42947B46799a73390B3711b53060g3800i396j56541F5245e24863
9159h8200F4536J43733H8541a91728A43810E1695k305h5563D60334f8984F1797
9147b60221b1285q8315R724j71222d6525K1354H9973Q6462n8669a63314j39775
9136c03089a23390D539K19880G8617B5385J90679a7365A17542b41388O2090B6418
9124b194l1028A35832n739a88851e9794P361j17241q1431a1694p3980L2950o5026
9112a17750A45646J2006F898c08921J7183i1068j63907G2536a69172B2914K60820
$$ y = [317362, -285790, -234586, 297082, -44883, -297362, 147637, -452733, -218761, 160035, -43187, -72800, 564116, -322422, -235708, -92360, -104172, -21811, 265558, -183710, 140895, 106398, 423080, 36981, -242947, 246799, -173390, 23711, -253060, -73800, -9396, -165937, 65245, -524863, -88200, 64536, 208269, 88541, -191728, 143810, 51695, 49390, -85563, 460334, -68984, 61797, -260221, -21285, -109600, -99876, -271098, -46525, -25171, 89973, 176435, 117766, -163314, -303089, -123390, 4539, 224419, 78617, 25385, 216064, -17365, 117542, -241388, -179298, 26418, -2194, -33222, 135832, 130093, -188851, -59794, -52433, -169674, -251105, -11694, -85674, -52724, -117750, 145646, 157652, 6898, -308921, -291738, -91068, -254975, 72536, -169172, 22914, 283734]
9101B83734G066a446j97337D952b26003k2680F586a31915l9092j91123B41661
9089a4386m10551a41817B53270n7119c0882i243B455b07347a3130F6811j2756
9078E4055d86499d6999j07454B4161i6261I2297c02931f1686o9148l0924B037
9066b62546a09269j0972F1824N9224a63923j17652N3522C7330K38348b89072B12416
9054e2605k06005a23068F3659a77987C7565h0028j9587p1319A09586a55569G627
9042H0382j1320A6866B886o90K2858h4560j39237A22755b67680a04788n3646E1304
9029e4302D1474c2936C31484a85363j39601c0829p9261a5009H4028A0375K25972
9018B36347I8612C3210c5559k97612h6017K42o4253k69I5720a5577O549j37710
$$ y = [283734, 7066, -1446, -198783, 4952, -226003, -248683, 6586, -131915, -171007, -362130, 241661, -14386, -424937, -141817, 253270, 196151, -30882, -9243, 2455, -207347, -13130, 66811, 54055, -486499, -46999, -154453, 24161, -96261, 92297, -302931, -61686, -130834, -161758, 2037, -262546, -109269, -120241, 61824, 121048, -163923, -281575, -228053, 37330, 275678, -289072, 212416, -52605, -258610, -123068, 63659, -177987, 37565, -80028, -99615, -170934, 109586, -155569, 7627, 80382, 69062, 16866, 2886, 2196, 25054, -84560, -223797, 122755, -267680, -104788, -158434, 51304, -54302, 41474, -32936, 331484, -185363, -324964, -30829, -110090, -15009, 84028, 10375, 236347, 98612, 33210, -35559, -333171, -86017, -85775, -150028, -150297, 95720, -15577, -9028, -146738]
9006a46738p6396D6004d1211k07477a3441B3225P1211h2050j47984E2955b88477
8994a08237B72997c6298A46314c05390a03043k34633A00182m6778b05525j11833
8984c17358P353b2490k33341A39788i4261I4490O3188j9841F5562B4116a22050
8972a21993d9539j05077k68230A83087c57765d5381D5073b36143a17176l5993
8962a53169B9728c9883B2240O3596l9384b22133F1541e3004q1747c2030A18952
8950a3338A01391H83J0186a68804Q1057B57375k2285a60836o1332j13351b093
8938b91036C4973a8544A36711o462L10040p6672d7642j16257A73825b22117P2802
8927a49315B01184J51269H3193N03690J173979M558648J3703025F841334B375021
$$ y = [-146738, -223134, 46004, -41211, -248688, -13441, 23225, 94436, -82050, -230034, 52955, -288477, -108237, 272997, -36298, 146314, -305390, -103043, -337676, 100182, 53404, -205525, -317358, -310005, -22490, -255831, 139788, -94261, 94490, 157678, 137837, 65562, 24116, -122050, -121993, -49539, -154616, -422846, 183087, -357765, -45381, 45073, -236143, -117176, -153169, 29728, -39883, 22240, 85836, 46452, -222133, 61541, -53004, -134751, -32030, 118952, -13338, 101391, 883, 11069, -168804, -87747, 257375, 235090, -160836, -222168, -335519, -2093, -291036, 34973, -18544, 136711, 130249, 440289, 363617, -47642, -163899, 173825, -222117, -149315, 201184, 352453, 83193, 586883, 1760862, 6319510, 20022535, 6841334, 2375021]
8917H82829j11276k37152k61730A5746K53537J02043j2943c90845J9396B48738
8906A88981l8725c81150h398n9C36982A5354J14761l4365k1126N2975a96515A38871
8893a84803H9597a88244j87982J55166a02109E5252j94b43148M4659f9636m4241
8882a13877p9350q7548B25044L2264F485e2290A62830i3683B18936a19343a1543
8870A61179J11222d1552j08021G8087a05990A36957K24894a88084d1377m8940
$$ y = [882829, 771553, 534401, 272671, 15746, 269283, 371326, 358383, -390845, -371449, 248738, 188981, 150256, -381150, -8398, -8457, 336982, 15354, 130115, 95750, 74624, 127599, -196515, 138871, -184803, 89597, -188244, -376226, -221060, -102109, 55252, 55058, -243148, -198489, -69636, -113877, -193227, -280775, 225044, 257308, 6485, -52290, 162830, -93683, 218936, -119343, -11543, 161179, 272401, -41552, -149573, 78087, -105990, 136957, 361851, -188084, -41377, -90317]
$$ [...]
##END NTUPLES=NMR SPECTRUM
##END=
