
##TITLE=UV1256_M11_1332-1242_5_7409661_bY7sYACtgE
##JCAMPDX= 6.0         $$ Bruker NMR JCAMP-DX V2.0
##DATA TYPE= NMR SPECTRUM
##DATA CLASS= NTUPLES
##ORIGIN= BRUKER
##OWNER= Administrator
$$ 1.72 TOPSPIN		Version 2.1
$$ 2013-01-25 01:32:12.778 -0500  Administrator@X
$$ Compression mode = diff/dup
##.OBSERVE FREQUENCY= 400.02188249412
##.OBSERVE NUCLEUS= ^1H
##.ACQUISITION MODE= SIMULTANEOUS (DQD)
##.ACQUISITION SCHEME= undefined
##.AVERAGES= 64
##.DIGITISER RES= 22
##SPECTROMETER/DATA SYSTEM= spect
##.PULSE SEQUENCE= noesygpps1d.comp
##.SOLVENT NAME= COFFEE_meoh
##.SHIFT REFERENCE= INTERNAL, COFFEE_meoh, 1, 14.96113
##AUDIT TRAIL= $$ (NUMBER, WHEN, WHO, WHERE, PROCESS, VERSION, WHAT)
$$ ##TITLE= Audit trail, TOPSPIN		Version 2.1
$$ ##JCAMPDX= 5.01
$$ ##ORIGIN= Bruker BioSpin GmbH
$$ ##OWNER= Administrator
$$ $$ E:\/data/COFFEE/nmr/UV1256_M11_1332-1242_5_7409661_bY7sYACtgE/12/pdata/1/auditp.txt
$$ ##AUDIT TRAIL=  $$ (NUMBER, WHEN, WHO, WHERE, PROCESS, VERSION, WHAT)
(   1,<2013-01-25 01:32:06.793 -0500>,<Administrator>,<X>,<go>,<TOPSPIN 2.1>,
      <created by zg
	started at 2013-01-25 01:20:36.339 -0500,
	POWCHK enabled, PULCHK disabled,
       configuration hash MD5:
       86 BA 57 50 F2 9D 5C 9B 26 00 A9 28 5F 66 2E 89
       data hash MD5: 64K
       1A AD 99 AA 14 62 BA CF 9A 8E 24 90 17 9D 7D 96>)
(   2,<2013-01-25 01:32:09.872 -0500>,<Administrator>,<X>,<proc1d>,<TOPSPIN 2.1>,
      <Start of raw data processing
       efp LB = 0.3 FT_mod = 6 PKNL = 1 PHC0 = 0 PHC1 = 0 SI = 128K 
       data hash MD5: 128K
       84 5B 12 DB 5D D4 EE 25 79 97 0C D2 E0 74 D2 54>)
(   3,<2013-01-25 01:32:10.950 -0500>,<Administrator>,<X>,<proc1d>,<TOPSPIN 2.1>,
      <pk PHC0 = -77.76672 PHC1 = 0 
       data hash MD5: 128K
       E8 BB 72 5D F3 00 C0 60 36 B8 65 34 92 B0 20 B6>)
(   4,<2013-01-25 01:32:11.653 -0500>,<Administrator>,<X>,<proc1d>,<TOPSPIN 2.1>,
      <abs ABSG = 1 
       data hash MD5: 128K
       D8 A1 0C F5 C2 3F 4E B6 E4 BB EC A0 E1 ED DE 44>)
(   5,<2013-01-25 01:32:11.872 -0500>,<Administrator>,<X>,<proc1d>,<TOPSPIN 2.1>,
      <abs ABSG = 2 
       data hash MD5: 128K
       39 E2 F4 23 9B FA BC 59 7A 8F E1 9E B9 6A 32 02>)
(   6,<2013-01-25 01:32:12.043 -0500>,<Administrator>,<X>,<proc1d>,<TOPSPIN 2.1>,
      <abs ABSG = 3 
       data hash MD5: 128K
       A8 2C 7F F8 21 2B 9B 92 68 6F D2 AF 52 3B 71 D9>)
(   7,<2013-01-25 01:32:12.247 -0500>,<Administrator>,<X>,<proc1d>,<TOPSPIN 2.1>,
      <abs ABSG = 4 
       data hash MD5: 128K
       1B 96 75 3B C9 0C B5 D1 FF 4F 38 F8 A8 FC D7 C2>)
(   8,<2013-01-25 01:32:12.434 -0500>,<Administrator>,<X>,<proc1d>,<TOPSPIN 2.1>,
      <abs ABSG = 5 
       data hash MD5: 128K
       01 23 D1 5B 82 05 DB 1C 18 5C 9A 91 C5 90 6B 3C>)
$$ ##END=
$$ 
$$ $$ hash MD5
$$ $$ 33 3F A5 54 B5 87 22 9A 98 65 DC 01 2A 87 26 FA
##$RELAX= 
##$RELAX= 
##$RELAX= 
##$RELAX= 
##$RELAX= 
##$RELAX= 
##$RELAX= 
##$RELAX= 
$$ Bruker specific parameters
$$ --------------------------
##$DU= <E:\>
##$EXPNO= 12
$$ [...]
##$TP07= 0
##$TPNAME0= <>
##$TPNAME1= <>
##$TPNAME2= <>
##$TPNAME3= <>
##$TPNAME4= <>
##$TPNAME5= <>
##$TPNAME6= <>
##$TPNAME7= <>
##$TPOAL= (0..7)
0.5 0.5 0.5 0.5 0.5 0.5 0.5 0.5
##$TPOFFS= (0..7)
0 0 0 0 0 0 0 0
##$TUNHIN= 0
##$TUNHOUT= 0
##$TUNXOUT= 0
##$USERA1= <user>
##$USERA2= <user>
##$USERA3= <user>
##$USERA4= <user>
##$USERA5= <user>
##$V9= 5
##$VALIST= <valist>
##$VCLIST= <CCCCCCCCCCCCCCC>
##$VD= 0
##$VDLIST= <DDDDDDDDDDDDDDD>
##$VPLIST= <PPPPPPPPPPPPPPP>
##$VTLIST= <TTTTTTTTTTTTTTT>
##$WBST= 1024
##$WBSW= 4
##$XGAIN= (0..3)
0 0 0 0
##$XL= 0
##$YL= 0
##$YMAX_a= 6432260
##$YMIN_a= -13402929
##$ZGOPTNS= <>
##$ZL1= 120
##$ZL2= 120
##$ZL3= 120
##$ZL4= 120
##$ABSF1= 14.96113
##$ABSF2= -5.597052
##$ABSG= 5
##$ABSL= 3
##$ALPHA= 0
##$AQORDER= 0
##$ASSFAC= 0
##$ASSFACI= 0
##$ASSFACX= 0
##$ASSWID= 0
##$AUNMP= <proc_prof1d_extract.lims>
##$AXLEFT= 0
##$AXNAME= <>
##$AXNUC= <1H>
##$AXRIGHT= 0
##$AXTYPE= 0
##$AXUNIT= <>
##$AZFE= 0.1
##$AZFW= 0.1
##$BCFW= 0
##$BC_mod= 0
##$BYTORDP= 0
##$COROFFS= 0
##$CY= 15
##$DATMOD= 1
##$DC= 0
##$DFILT= <>
##$DTYPP= 0
##$F1P= 0
##$F2P= 0
##$FCOR= 0.5
##$FTSIZE= 131072
##$FT_mod= 6
##$GAMMA= 0
##$GB= 0
##$INTBC= 1
##$INTSCL= 1
##$ISEN= 128
##$LB= 0.3
##$LEV0= 0
##$LPBIN= 0
##$MAXI= 10000
##$MC2= 0
##$MEAN= 0
##$ME_mod= 0
##$MI= 0
##$NCOEF= 0
##$NC_proc= -2
##$NLEV= 6
##$NOISF1= 0
##$NOISF2= 0
##$NSP= 0
##$NTH_PI= 0
##$NZP= 0
##$OFFSET= 14.96113
##$PC= 1
##$PHC0= -77.76672
##$PHC1= 0
##$PH_mod= 1
##$PKNL= yes
##$PPARMOD= 0
##$PPDIAG= 0
##$PPIPTYP= 0
##$PPMPNUM= 2147483647
##$PPRESOL= 1
##$PSCAL= 4
##$PSIGN= 0
##$PYNMP= <proc.py>
##$REVERSE= no
##$SF= 400.020009586737
##$SI= 131072
##$SIGF1= 0
##$SIGF2= 0
##$SINO= 400
##$SIOLD= 131072
##$SPECTYP= <>
##$SREGLST= <1H.CDCl3>
##$SSB= 0
##$STSI= 131072
##$STSR= 0
##$SW_p= 8223.68421052631
##$SYMM= 0
##$S_DEV= 0
##$TDeff= 65536
##$TDoff= 0
##$TI= <>
##$TILT= no
##$TM1= 0
##$TM2= 0
##$TOPLEV= 0
##$USERP1= <user>
##$USERP2= <user>
##$USERP3= <user>
##$USERP4= <user>
##$USERP5= <user>
##$WDW= 1
##$XDIM= 131072
##$YMAX_p= 469782743
##$YMIN_p= -10856
##$CURPLOT= <Network HP LaserJet P1505>
##$CURPRIN= <$Network HP LaserJet P1505>
##$DFORMAT= <normdp>
##$LAYOUT= <+/1D_H.xwp>
##$LFORMAT= <normlp>
##$PFORMAT= <normpl>
##$SURQMSG= 1
$$ End of Bruker specific parameters
$$ ---------------------------------
##NTUPLES= NMR SPECTRUM
##VAR_NAME=  FREQUENCY,     SPECTRUM/REAL,   SPECTRUM/IMAG
##SYMBOL=    X,             R,               I
##VAR_TYPE=  INDEPENDENT,   DEPENDENT,       DEPENDENT
##VAR_FORM=  AFFN,          ASDF,            ASDF
##VAR_DIM=   131072,        131072,          131072
##UNITS=     HZ,            ARBITRARY UNITS, ARBITRARY UNITS
##FACTOR=    0.0627417313425164, 1,          1
##FIRST=     8223.62146879497, -303,         -64278
##LAST=      0,             1840,            -64802
##MIN=       0,             -10856,          0
##MAX=       8223.62146879497, 469782743,    0
$$ Real data points
##PAGE= N=1
##DATA TABLE= (X++(R..R)), XYDATA
$$ [...]
63921D730431j96399k18429k33641k42856k46941k46415k41998k34628k24692
63912B644432k11932j96477j79428j62170j45494j29637j14730j00957q8536p7744
63902A237327o8692o0926n3701m6702m0287l4955l0997k8518k7221k6150k4344
63891G94834k2007k0361j9995j9977j9043j7123j5175j3821j2695j1022q437n308
63879F09870k365J1K104M264O242P742R384J2253J6214J9679K1514K2359K3427
63866G52698K4714K5324K5084K4775K4885K4973K4343K2764K0379J7510J4590
63855A002039J1930R348O391K929p37m349p897j1301j4319j6941j9553k2489k5570
63842I09481k8260l0179l1253l1497l0985l0090k9421k9263k9208k8646k7544
$$ y = [4730431, 4534032, 4315603, 4081962, 3839106, 3592165, 3345750, 3103752, 2869124, 2644432, 2432500, 2236023, 2056595, 1894425, 1748931, 1619294, 1504564, 1403607, 1315071, 1237327, 1168635, 1107709, 1054008, 1007306, 967019, 932064, 901067, 872549, 845328, 819178, 794834, 772827, 752466, 732471, 712494, 693451, 676328, 661153, 647332, 634637, 623615, 615178, 609870, 607505, 607516, 609620, 613884, 620126, 627868, 637252, 649505, 665719, 685398, 706912, 729271, 752698, 777412, 802736, 827820, 852595, 877480, 902453, 926796, 949560, 969939, 987449, 1002039, 1013969, 1023317, 1029708, 1032637, 1031900, 1027551, 1019654, 1008353, 994034, 977093, 957540, 935051, 909481, 881221, 851042, 819789, 788292, 757307, 727217, 697796, 668533, 639325, 610679, 583135]
63831E83135k6343k5155k3585k1537j9596j8218j7055j5597j4062j3007j2363
63820C76617j1525j0248q800p372o043n210n251n773n902n370m681m141l508k664
63806B90129j916j452j216j376k133k962k955k188j805k370l046k969k556k654
63792B58531l130l197k687k211k234k599k871k684j939j020n22n88p91q73j072
63777B30113j420j367n52N22J075R31L98k70q56j060q71o93o99m86K18R88J341
63760B27312J385J365J023J27p83r56n25l02o21r91q74k62N26J219J674J833J706
63743B32856J328Q60O24Q08J162J435J899K831L572L067J522M70Q09J777K370
63728B57390K736L328L775L617L410L901M689M879M580M584M869M611L552K247
$$ y = [583135, 556792, 531637, 508052, 486515, 466919, 448701, 431646, 416049, 401987, 388980, 376617, 365092, 354844, 346044, 338672, 332629, 327419, 322168, 316395, 310493, 305123, 300442, 296301, 292793, 290129, 288213, 286761, 285545, 284169, 282036, 279074, 276119, 273931, 272126, 269756, 266710, 263741, 261185, 258531, 255401, 252204, 249517, 247306, 245072, 242473, 239602, 236918, 234979, 233959, 233437, 232849, 232058, 231185, 230113, 228693, 227326, 226774, 227296, 228371, 229302, 229700, 229430, 228574, 227514, 226643, 225950, 225251, 224765, 224983, 225971, 227312, 228697, 230062, 231085, 231212, 230429, 229473, 228948, 228646, 228025, 227034, 226160, 225898, 226424, 227643, 229317, 231150, 232856, 234184, 235044, 235668, 236476, 237638, 239073, 240972, 243803, 247375, 250442, 251964, 252434, 253243, 255020, 257390, 260126, 263454, 267229, 270846, 274256, 278157, 282846, 287725, 292305, 296889, 301758, 306369, 309921, 312168]
63714C12168J042k02j374k075k389k798l327l563l523l606l663l040j700m63Q9
63699B81576K18L98P21J239K117L186L886L987L889L960L989L562K674J720J122
63684C18244R94J063R27N62L48L77J96m09q47n69j8Lm04n11k44j14k7O64J807
63665C22042K286J590N97K00J01m40j399k287l086m034m854n014m621m354m432
63650B92295m291l449k217j252o81j42M50O62L11K0N04J479J932J570J303J975
63634B90469L240M179M530M773N318O186P229Q093Q322Q019Q125R303J0862J1598
63620C90246J1506J1854J3447J5723J7712J9183K0575K2289K4354K6469K8230
63609F01588K9577L0909L2373L3177L2138K8887K4032J8214J1652M695j817p000
$$ y = [312168, 313210, 313008, 311634, 309559, 307170, 304372, 301045, 297482, 293959, 290353, 286690, 283650, 281950, 281487, 281576, 281794, 282192, 282913, 284152, 286269, 289455, 293341, 297328, 301217, 305177, 309166, 312728, 315402, 317122, 318244, 319238, 320301, 321228, 321790, 322138, 322515, 322711, 322302, 321455, 320886, 320868, 320871, 320467, 319956, 319712, 319598, 319571, 320235, 322042, 324328, 325918, 326515, 326715, 326816, 326376, 324977, 322690, 319604, 315570, 310716, 305702, 301081, 296727, 292295, 288004, 284555, 282338, 281086, 280405, 280263, 280713, 281375, 281686, 281706, 282210, 283689, 285621, 287191, 288494, 290469, 293709, 297888, 302418, 307191, 312509, 318695, 325924, 334017, 342339, 350358, 358483, 367786, 378648, 390246, 401752, 413606, 427053, 442776, 460488, 479671, 500246, 522535, 546889, 573358, 601588, 631165, 662074, 694447, 727624, 759762, 788649, 812681, 830895, 842547, 847242, 845425, 838425]
63597H38425j0329j1692j1481j0637j0068r973j0164j0869j2582j5136j7714j9872
63585F87908k1879k3819k5073k5018k3724k1648j9156j6601j4377j2515j0589
63574D73509q304n912l857k253q97M65J991L589M910N768O493P526Q720R502R770
63559E11020J0038J0711J1707J2847J4145J5624J7353J9737K3167K7345L1597
63548G05291L5910M0791M5627M7977M5259L6992K5064J2136K96r163j5549j8797
63536I51834j9505j8600j6794j4363j1473q691o954o945q726j1997j6352k1060
63524G90374k5104k7887k9587l0505l0534k9692k8578k7610k6292k4054k1377
63513D89154j9165j7368j5316j3134j1575j0577r264p551o382o116n872m990l995
$$ y = [838425, 828096, 816404, 804923, 794286, 784218, 774245, 764081, 753212, 740630, 725494, 707780, 687908, 666029, 642210, 617137, 592119, 568395, 546747, 527591, 510990, 496613, 484098, 473509, 465205, 459293, 455436, 453183, 452286, 452751, 454742, 458331, 463241, 469009, 475502, 483028, 491748, 501250, 511020, 521058, 531769, 543476, 556323, 570468, 586092, 603445, 623182, 646349, 673694, 705291, 741201, 781992, 827619, 875596, 920855, 957847, 982911, 995047, 995343, 986180, 970631, 951834, 932329, 913729, 896935, 882572, 871099, 862408, 855454, 848509, 839783, 827786, 811434, 790374, 765270, 737383, 707796, 677291, 646757, 617065, 588487, 560877, 534585, 510531, 489154, 469989, 452621, 437305, 424171, 412596, 402019, 392755, 385204, 378822, 372706, 366834, 361844, 357849]
63500C57849l524l329k962k509k005j033L22R83K24j145j847j794j753j873j548
63485C34056n64N79J432K010K381K525K593K875L365L685L525L003K555K493K545
63470C69058J921K25j797k925k943k799l187l711l803l652l672l695l354k811
63456C32855k405k017j322l70P33K236M196N845O368O107O242P301Q715R899J1077
63441C95460J2754J4911J7112J9277K1995K5917L0724L4713L5786L3104K7654
63430F69407K1155J4724Q819L951Q12j52J120M498R538J5271K0597K5132K9344
63417H24216L3730L7915M0590M0350L6643L0136K2123J3673N297k605r290j3817
63405A058961j5618j4983j3114j1561j1344j2578j4956j8267k2180k5892k8693
$$ y = [357849, 354325, 350996, 348034, 345525, 343520, 342487, 342809, 343792, 344016, 342871, 341024, 339230, 337477, 335604, 334056, 333492, 334071, 335503, 337513, 339894, 342419, 345012, 347887, 351252, 354937, 358462, 361465, 364020, 366513, 369058, 370979, 371204, 369407, 366482, 363539, 360740, 357553, 353842, 350039, 346387, 342715, 339020, 335666, 332855, 330450, 328433, 327111, 326741, 327474, 329710, 333906, 339751, 346119, 352226, 358468, 365769, 374484, 384383, 395460, 408214, 423125, 440237, 459514, 481509, 507426, 538150, 572863, 608649, 641753, 669407, 690562, 705286, 714105, 718056, 718868, 718716, 719836, 724334, 733872, 749143, 769740, 794872, 824216, 857946, 895861, 936451, 976801, 1013444, 1043580, 1065703, 1079376, 1084673, 1082068, 1072778, 1058961, 1043343, 1028360, 1015246, 1003685, 992341, 979763, 964807, 946540, 924360, 898468, 869775]
63394H69775l0658l2208l3141l2876l1635l0370k9372k7811k5154k2077j9446
63383E55027j7084j4364j1399q864o900n006k865o74J269K859M089N102O288P940
63369E15418R892J1783J3567J5473J7589J9776K1969K4225K6538K8757L0787L2719
63357G68493L4717L6705L8118L8116L6171L2307K6679J9432J1297L780k059o611
63345A037145j0723j4000j5270j4607j3532j3084j3063j3585j5789k0039k4672
63334H68781k7812k9549l1073l2398l2348l0437k7439k4145k0754j7481j4565
63323E80780j1448p042j433L242M293P99n621j2102j6565j8736j9486j9486j8746
63310D58449j7279j5492j3637j1565r379p758p039o505n262l514k225j818j860
$$ y = [869775, 839117, 806909, 773768, 740892, 709257, 678887, 649515, 621704, 596550, 574473, 555027, 537943, 523579, 512180, 503316, 496416, 491410, 488545, 487871, 489140, 491999, 496088, 501190, 507478, 515418, 525310, 537093, 550660, 566133, 583722, 603498, 625467, 649692, 676230, 704987, 735774, 768493, 803210, 839915, 878033, 916149, 952320, 984627, 1011306, 1030738, 1042035, 1045815, 1043756, 1037145, 1026422, 1012422, 997152, 982545, 969013, 955929, 942866, 929281, 913492, 893453, 868781, 840969, 811420, 780347, 747949, 715601, 685164, 657725, 633580, 612826, 595345, 580780, 569332, 562290, 560857, 564099, 568392, 569191, 563570, 551468, 534903, 516167, 496681, 477195, 458449, 441170, 425678, 412041, 400476, 391097, 383339, 376300, 369795, 364533, 361019, 358794, 356976, 355116]
63297C55116j921j990k071k010j763j475j247j186j512k257k919k844j936p96
63283C29189j84m67j341j897j352M5J143J113K73n22q25o56j79K35J39l68n58
63266C23788nQ68J573K180K711K653J873J352K070L603M715M958M820M684M543
63251C66386M559M867N047M663M214M664O063P516Q493R346J0487J1831J3215
63238D61351J4691J6231J7729J9304K1167K3210K5158K6979K8568K9407K9253
63227G13048K8794K8803K8921K8249K6914K5933K5535K4888K3742K3111K3799
63216A001737K5180K6042K5945K5107K3622K1351J8213J4007Q373J377o125j3105
63204A171724j9167k4500k9243l3222l6109l7680l7935l7068l5255l2578k9277
$$ y = [355116, 353195, 351205, 349134, 347124, 345361, 343886, 342639, 341453, 339941, 337684, 334765, 331921, 329985, 329189, 329005, 328538, 327197, 325300, 323948, 323993, 325136, 326249, 326522, 326000, 325175, 324519, 324340, 324575, 324714, 324346, 323788, 323783, 324651, 326224, 328404, 331115, 333768, 335641, 336993, 339063, 342666, 347381, 352339, 357159, 361843, 366386, 370945, 375812, 380859, 385522, 389736, 394400, 400463, 407979, 416472, 425818, 436305, 448136, 461351, 476042, 492273, 510002, 529306, 550473, 573683, 598841, 625820, 654388, 683795, 713048, 741842, 770645, 799566, 827815, 854729, 880662, 906197, 931085, 954827, 977938, 1001737, 1026917, 1052959, 1078904, 1104011, 1127633, 1148984, 1167197, 1181204, 1189577, 1190954, 1184829, 1171724, 1152557, 1128057, 1098814, 1065592, 1029483, 991803, 953868, 916800, 881545, 848967, 819690]
63193H19690k5813k2436j8897j4978j0986p271l602L71M262P274R336J1157J3203
63180G61310J5246J6995J8432J9407J9587J9019J8239J7658J7298J7152J7262
63169I57605J7350J6903J5756J4123J2047R347O094K559j317n827j0832j5845
63157A017963k0675k5268k9005l1012l1450l1514l1891l2011l1156k9516k7600
63146F96865k5432k2908k0376j8209j6207j3980j1586r400p670o586o306o503
63134E31702o333n327m011l180k850k397j451j44J247K455L179L378L519M077
63120E23864M838N104M581L695L010K674K577K768L368M132M408L770K561J613
63106E72963J379J605J844J887J596P57m74j398j507j159j020j110r23l97m1j40
$$ y = [819690, 793877, 771441, 752544, 737566, 726580, 719309, 715707, 716078, 720340, 727614, 736950, 748107, 761310, 776556, 793551, 811983, 831390, 850977, 869996, 888235, 905893, 923191, 940343, 957605, 974955, 991858, 1007614, 1021737, 1033784, 1043131, 1049225, 1051784, 1050467, 1044640, 1033808, 1017963, 997288, 972020, 943015, 912003, 880553, 849039, 817148, 785137, 753981, 724465, 696865, 671433, 648525, 628149, 609940, 593733, 579753, 568167, 558767, 551097, 544511, 538205, 531702, 525369, 520042, 516031, 512851, 510001, 507604, 506153, 506009, 507256, 509711, 512890, 516268, 519787, 523864, 528702, 533806, 538387, 542082, 545092, 547766, 550343, 553111, 556479, 560611, 565019, 568789, 571350, 572963, 574342, 575947, 577791, 579678, 581274, 582031, 581557, 580159, 578652, 577493, 576473, 575363, 574440, 574043, 574002, 573862]
63090E73862l87l75nO63J466K020K058J881K050K627L194L585M009M445M542M389
63074F10024M717O041P897R308R735R442R189R635J0875J2415J3735J4793J5849
63061G43655J7141J8999K1842K5539K9081L1658L3807L6773M0841M5119M8928
63050A093383N2489N6087N9404O2003O3892O5241O5999O6040O5340O3913O1893
63039A775684N9692N7732N6141N5088N5021N5958N6877N6632N5158N2899M9340
63028B386222M3353L4925K5217J4725K654j1441k6485m0905n3857o5009p4007
63017B235392q0744q5364q7572q6778q3246p8201p2406o5643n7942n0127m2504
63006A444865l4302k5237j6544r418l402K539Q306J3206J7467K1790K5911K8909
$$ y = [573862, 573475, 573100, 573095, 573758, 575224, 577244, 579302, 581183, 583233, 585860, 589054, 592639, 596648, 601093, 605635, 610024, 614741, 620782, 628679, 637987, 647722, 657164, 666353, 675988, 686863, 699278, 713013, 727806, 743655, 760796, 779795, 801637, 827176, 856257, 887915, 921722, 958495, 999336, 1044455, 1093383, 1145872, 1201959, 1261363, 1323366, 1387258, 1452499, 1518498, 1584538, 1649878, 1713791, 1775684, 1835376, 1893108, 1949249, 2004337, 2059358, 2115316, 2172193, 2228825, 2283983, 2336882, 2386222, 2429575, 2464500, 2489717, 2504442, 2507096, 2495655, 2469170, 2428265, 2374408, 2309399, 2235392, 2154648, 2069284, 1981712, 1894934, 1811688, 1733487, 1661081, 1595438, 1537496, 1487369, 1444865, 1410563, 1385326, 1368782, 1359364, 1355962, 1358501, 1366807, 1380013, 1397480, 1419270, 1445181, 1474090]
62994A474090L0627L1633L2045L1684L1132L1373L2279L2561L1442K9400K7096
62983A815362K4415K0894J6297J0541L606m228j2526k1175l0254l9313m7365n3713
62971A682541n8322o1320o2628o2322o0908n8980n6821n4410n1625m8349m4634
62960A062222m0799l7189l3838l0576k7482k4911k3106k1944k1074k0171j9151
62949G61981j8242j7779j7717j7533j6752j5510j4330j3443j2578j1382r870q421
62937E88424p470p184p390p714p711o969n392l558k396k173k142j557p55n51r19
62922E24543j106q73p23q69r45r17j313k236l024l299l416l543l177k187j401
62907D95514j498k078k450k618k811k808k469k211k141j518k8J188R89P7O1J014
$$ y = [1474090, 1504717, 1536350, 1568395, 1600079, 1631211, 1662584, 1694863, 1727424, 1758866, 1788266, 1815362, 1839777, 1860671, 1876968, 1887509, 1891115, 1886887, 1874361, 1853186, 1822932, 1783619, 1736254, 1682541, 1624219, 1562899, 1500271, 1437949, 1377041, 1318061, 1261240, 1206830, 1155205, 1106856, 1062222, 1021423, 984234, 950396, 919820, 892338, 867427, 844321, 822377, 801303, 781132, 761981, 743739, 725960, 708243, 690710, 673958, 658448, 644118, 630675, 618097, 606715, 596845, 588424, 580954, 573770, 566380, 558666, 550955, 543986, 538594, 535036, 532640, 530467, 528325, 526768, 526013, 525462, 524543, 523437, 522564, 521841, 520972, 520027, 519110, 517797, 515561, 512537, 509238, 505822, 502279, 499102, 496915, 495514, 494016, 491938, 489488, 486870, 484059, 481251, 478782, 476571, 474430, 472912, 472884, 474072, 475061, 475138, 475199, 476213]
62891D76213J426M95q59j490j357r31l33M06R43J043R51R22Q39N83M32O46R17
62874D80846O79j46r85j317j324j642k440l023k617j399l61j89o38r96p36K77
62858D63989J654K566K537K167K391K973K706J240l18j047j300j611j587q30K7
62843D75557K74K94P74J383J360Q21L48j82j156k085k179j696j447j275m49O92
62827D71034R47K07k61K97J278K042K736L347L262K459K064K800L789L710K609
62812E02320J749K100L566N399O826P462P572P716Q017Q087P871P965Q819R994
62798E95463J0746J0951J1124J1679J2628J3864J5463J7638K0473K3722K6985
62787G70736L0234L3969L8604M3865M9216N4659O0600O7073P3624Q0026Q6446
$$ y = [476213, 477639, 478134, 477275, 475785, 474428, 473497, 473164, 473570, 474513, 475556, 476507, 477429, 478268, 478851, 479283, 479929, 480846, 481525, 481379, 480394, 479077, 477753, 476111, 473671, 470648, 468031, 466632, 466271, 466082, 465444, 464448, 463712, 463989, 465643, 468209, 470746, 472913, 475304, 478277, 480983, 482223, 481905, 480858, 479558, 477947, 476360, 475530, 475557, 475831, 476125, 476899, 478282, 479642, 480463, 480811, 480629, 479473, 477388, 475209, 473513, 472066, 470791, 470342, 471034, 471981, 472188, 471927, 472224, 473502, 475544, 478280, 481627, 484889, 487348, 489412, 492212, 496001, 499711, 502320, 504069, 506169, 509735, 515134, 521960, 529422, 536994, 544710, 552727, 560814, 568685, 576650, 585469, 595463, 606209, 617160, 628284, 639963, 652591, 666455, 681918, 699556, 720029, 743751, 770736, 800970, 834939, 873543, 917408, 966624, 1021283, 1081883, 1148956, 1222580, 1302606, 1389052]
62776A389052R2886R8941J04196J08272J10409J09677J05838R9450R0796P9363
62766B388880O4812M7965L0205J2152o421k5452m3899o0384p4133q5053r3153
62755B155519r8308j00737j01285j00844r9543r6921r2870q7996q2874p7499p1747
62744A144895o5890o0221n4561m8671m2878l7774l3469k9643k6174k3254k0941
62733G01419j9033j7260j5319j3027j0756r304q799q200o590m599l618l742l462
62720E77710j581J343L798M937N081N089N623O830Q503J0424J2472J4357J5761
62707F70347J6975J8935K2147K6045K9892L3818L8269M2949M7199N1129N5322
62696A053027N9682O3601O7149P0934P4623P6723P6139P3095O8204O1468N2692
$$ y = [1389052, 1481938, 1580879, 1685075, 1793347, 1903756, 2013433, 2119271, 2218721, 2309517, 2388880, 2453692, 2501657, 2531862, 2544014, 2537593, 2512141, 2468242, 2407858, 2333725, 2248672, 2155519, 2057211, 1956474, 1855189, 1754345, 1654802, 1557881, 1465011, 1377015, 1294141, 1216642, 1144895, 1079005, 1018784, 964223, 915552, 872674, 834900, 801431, 771788, 745614, 722360, 701419, 682386, 665126, 649807, 636780, 626024, 616720, 607921, 599721, 593131, 588532, 584914, 581172, 577710, 576129, 577472, 581270, 586207, 591288, 596377, 602000, 608830, 617333, 627757, 640229, 654586, 670347, 687322, 706257, 728404, 754449, 784341, 818159, 856428, 899377, 946576, 997705, 1053027, 1112709, 1176310, 1243459, 1314393, 1389016, 1465739, 1541878, 1614973, 1683177, 1744645, 1797337]
62685A797337M2062K9907J6498K481j1184k4112l6675m8826n9343o6854p1245
62674A570046p3507p4489p4268p2573o9446o5465o1523n8233n5411n2271m8163
62663H64697m3096l7666l2690k8807k6039k3869k1854j9981j8229j6258j4078
62652E82130j2511j2215j2551j2245j1003r630q690q040p577p424p178o091m281
62639D62694k853k392k174j365k17M22K16n49j455k134k371k325k287k123j477
62624D39610n76j21k34k34K86R67J475J987K532K676K410K506L408M511N164N720
62608D72087O808Q167R047R377R743J0478J1525J2975J5093J7849K1007K4525
62596F28681K8428L2437L6229L9969M4012M8128N1473N3443N4097N3672N1986
$$ y = [1797337, 1839399, 1869306, 1885804, 1888285, 1877101, 1852989, 1816314, 1767488, 1708145, 1641291, 1570046, 1496539, 1422050, 1347782, 1275209, 1205763, 1140298, 1078775, 1020542, 965131, 912860, 864697, 821601, 783935, 751245, 722438, 696399, 672530, 650676, 630695, 612466, 596208, 582130, 569619, 557404, 544853, 532608, 521605, 511975, 503285, 495245, 487668, 480244, 473066, 466975, 462694, 459841, 457449, 455275, 453910, 453693, 454115, 454331, 453782, 452327, 450193, 447822, 445497, 443210, 441087, 439610, 439034, 438913, 438679, 438445, 438731, 439698, 441173, 443160, 445692, 448368, 450778, 453284, 456692, 461203, 466367, 472087, 478895, 487062, 496109, 505486, 515229, 525707, 537232, 550207, 565300, 583149, 604156, 628681, 657109, 689546, 725775, 765744, 809756, 857884, 909357, 962800, 1016897, 1070569, 1122555]
62585A122555M8544M3159L6213K8291J9652J0259L39r396j8305k6304l3516l9667
62573A181824m4316m7450m9285m9665m8361m5903m3401m1346l9254l6615l3601
62562G02627l0599k7678k4824k2110j9451j6609j3791j1703j0693j0246r665q841
62550D96417q070p391o459m977l113j567j061j496j875j467p70p19j261j529j242
62535D53420r49q84n67K68J198J881K454K978L371M032N592P767R478J0492J1857
62520E12388J4171J6549J8039J9170K1169K4301K7879L1363L4642L7612M0120
62509G97403M2090M3284M3416M2752M1896M0589L7563L2195K5466J8560J1418
62498A176632L650m037j0422j5333j9335k2284k3393k2683k1120j9193j6352j2216
$$ y = [1122555, 1171099, 1214258, 1250471, 1278762, 1298414, 1308673, 1309012, 1299616, 1281311, 1255007, 1221491, 1181824, 1137508, 1090058, 1040773, 991108, 942747, 896844, 853443, 812097, 772843, 736228, 702627, 672028, 644350, 619526, 597416, 577965, 561356, 547565, 535862, 525169, 514923, 505258, 496417, 488347, 480956, 474497, 469520, 466407, 464840, 463779, 462283, 460408, 458941, 458171, 457452, 456191, 454662, 453420, 452471, 451587, 451020, 451288, 452486, 454367, 456821, 459799, 463170, 467202, 472794, 480561, 490039, 500531, 512388, 526559, 543108, 561147, 580317, 601486, 625787, 653666, 685029, 719671, 757283, 797403, 839493, 882777, 926193, 968945, 1010841, 1051430, 1088993, 1121188, 1146654, 1165214, 1176632, 1180282, 1176245, 1165823, 1150490, 1131155, 1108871, 1085478, 1062795, 1041675, 1022482, 1006130, 993914]
62486I93914p543l448j83K911O480J0490J4346J7343J8844J8200J4970R624L695
62473A099643j394n651j0138j5388k0927k6287l1439l5936l8702l9315l8752l8175
62461G97539l7608l6392l4313l1555k8139k4183k0348j7303j4992j2973j1108
62450E28625r455p822n952l912j922j08J331K171K687L517M742N708O056O206
62436E31872O482O559O206N736N086L441M94k687m897o188p253q197q823r355
62422E18476r945j0040r241q154p484o886n777m626m324m704m838m444l977l587
62408D30449l040k359j723j026l41l04j077j564p48P21J473J444J612K156K368
62393D28041K190K353K935L175K818K466K502K796L457M687N889O188N923O293
$$ y = [993914, 986371, 982923, 982740, 985651, 992131, 1002621, 1016967, 1034310, 1053154, 1071354, 1086324, 1095948, 1099643, 1098249, 1092598, 1082460, 1067072, 1046145, 1019858, 988419, 952483, 913781, 874466, 835714, 797539, 759931, 723539, 689226, 657671, 629532, 605349, 585001, 567698, 552706, 539733, 528625, 519170, 511348, 505396, 501484, 499562, 499454, 500785, 502956, 505643, 509160, 513902, 519610, 525666, 531872, 538354, 544913, 551119, 556855, 561941, 565382, 565876, 563189, 558292, 552104, 544851, 536654, 527831, 518476, 508531, 498491, 489250, 481096, 473612, 466726, 460949, 456323, 451999, 447295, 442457, 438013, 434036, 430449, 427409, 425050, 423327, 422301, 421960, 421656, 420579, 419015, 418267, 418988, 420461, 421905, 423517, 425673, 428041, 430231, 432584, 435519, 438694, 441512, 443978, 446480, 449276, 452733, 457420, 463309, 469497, 475420, 481713]
62379D81713P423Q190Q154Q235Q998R669R546R137R167R525R986J1032J3030J5324
62365F19129J7029J8208J9627K1745K4604K8211L2448L6899M1244M5527M9731
62354I54402N3435N6264N8114N8577N6594N1285M2994L3150K3219J4011N728j712
62342A406061q354j4077j8766k2634k6258l0218l4678l9072m2172m2905m1398
62331A085529l8881l6305l3486k9978k6159k2771j9972j7672j6349j6467j7401
62320H10088j8021j8212j8701j9444j9458j8441j7366j6987j6670j5351j2906
62309F18531j0048p406n202l472k046n94J069K845M495N677N994N448M664M152
62295F24107L564K394J118P64J343J707J147J81m76r34j656k679l647m202m104
$$ y = [481713, 489136, 497326, 505480, 513715, 522713, 532382, 541928, 551065, 560232, 569757, 579743, 590775, 603805, 619129, 636158, 654366, 673993, 695738, 720342, 748553, 781001, 817900, 859144, 904671, 954402, 1007837, 1064101, 1122215, 1180792, 1237386, 1288671, 1331665, 1364815, 1388034, 1402045, 1407773, 1406061, 1397707, 1383630, 1364864, 1342230, 1315972, 1285754, 1251076, 1212004, 1169832, 1126927, 1085529, 1046648, 1010343, 976857, 946879, 920720, 897949, 877977, 860305, 843956, 827489, 810088, 792067, 773855, 755154, 735710, 716252, 697811, 680445, 663458, 646788, 631437, 618531, 608483, 601077, 595875, 592403, 590357, 589763, 590832, 593677, 598172, 603849, 609843, 615291, 619955, 624107, 627671, 630065, 631183, 631947, 633290, 634997, 636144, 636325, 635849, 634915, 633259, 630580, 626933, 622731, 618627]
62280F18627l465k910k922l051k442j155j01M28J247K933M944O483P523Q466R480
62265F44085J0763J2859J6068J9922K3759K7450L1266L5326L9598M4157M9061
62254I54314N4069N8647O2091O3643O2706N9017N2541M3499L2895K2511J3674
62243A479607O105j382r298j7256k4986l2504l9399m4977m9217n2597n4940n5472
62231A103684n4148n1823m8840m4681l9445l4449l0721k7860k5093k2470k0245
62220G03909j7936j5018j1971r764q619q030p619p361p197p045o944o809o285
62207E83311n225l983k905j867o27O93J780K449K652K560K752L749N244O390O980
62192F03953P674Q846R991J0641J1030J1409J1524J1326J1455J2267J3044J2867
$$ y = [618627, 615162, 612252, 609330, 606279, 603837, 602682, 602581, 603009, 604256, 607189, 612133, 618616, 626139, 634605, 644085, 654848, 667707, 683775, 703697, 727456, 754906, 786172, 821498, 861096, 905253, 954314, 1008383, 1067030, 1129121, 1192764, 1255470, 1314487, 1367028, 1410527, 1443422, 1465933, 1479607, 1485712, 1484330, 1475032, 1457776, 1432790, 1400286, 1360887, 1315910, 1266693, 1214096, 1159156, 1103684, 1049536, 997713, 948873, 904192, 864747, 830298, 799577, 771717, 746624, 724154, 703909, 685973, 670955, 658984, 649220, 640601, 632571, 624952, 617591, 610394, 603349, 596405, 589596, 583311, 578086, 574103, 571198, 569331, 568704, 569397, 571177, 573626, 576278, 578838, 581590, 585339, 590583, 596973, 603953, 611627, 620473, 630464, 641105, 652135, 663544, 675068, 686394, 697849, 710116, 723160, 736027]
62180G36027J1796J0487R132P555N980M914M474M477N074O693R435J2920J6707
62167H45671K0526K4272K8070L2174L6510M0439M3135M4046M2808L9154L3181
62156A229986K5531J7209R285K707k232o242j0432j5173j9952k4305k8310l2012
62144A146060l5003l6776l7109l6000l3746l1032k8341k5372k1685j7790j4691
62133H28515j2420j0121p615n710m770m204l745l867m426m241k788j082J05J679
62119G65310M733Q535J1285J2187J1651J0031P394M208J149j532l649m492l654
62106H23156k158j838l604o826j0200j2575j3320j2586j1076r132o488l233l19
62093G29801J571K934M390N453N372M627M417M967N474N522N549N881O265O453
$$ y = [736027, 747823, 758310, 767442, 774997, 780977, 785891, 790365, 794842, 799916, 806609, 816044, 828964, 845671, 866197, 890469, 918539, 950713, 987223, 1027662, 1070797, 1114843, 1157651, 1196805, 1229986, 1255517, 1272726, 1282011, 1284718, 1282486, 1276244, 1265812, 1250639, 1230687, 1206382, 1178072, 1146060, 1111057, 1074281, 1037172, 1001172, 967426, 936394, 908053, 882681, 860996, 843206, 828515, 816095, 805974, 798359, 792649, 787879, 783675, 779930, 776063, 771637, 767396, 764608, 763526, 763631, 765310, 770043, 778578, 789863, 802050, 813701, 823732, 831126, 835334, 836483, 834951, 831302, 826810, 823156, 820998, 819160, 815556, 808730, 798530, 785955, 772635, 760049, 748973, 739841, 733353, 730120, 729801, 731372, 734306, 738696, 744149, 749521, 754148, 758565, 763532, 769006, 774528, 780077, 785958, 792223, 798676]
62079G98676O521O577O813P727R708J2422J5111J7347J9078K0273K1033K1739
62067I63025K2541K3053K3104K3368K4541K6307K7806K8627K8577K6962K3170
62056A241081J7726J1839O061L02n067r194j1902j4038j6526j9678k3414k7460
62044A149730l1292l4380l6543l7787l8080l7715l7360l7124l6089l3541l0184
62033G59635k7252k4904k2535k0175j8393j7005j5264j3229j1791j1163j0562
62022E67362r589q729q271p819p234p066p567q104q079p636p074o263n154m177
62008D64600l654l328k821k031p83J196L514N055N182M562M226M310M226L677
61994D87931K815J700K62j239k324k927l499m324n071n315n288n743o931q087
$$ y = [798676, 805197, 811774, 818587, 826314, 836022, 848444, 863555, 880902, 899980, 920253, 941286, 963025, 985566, 1008619, 1031723, 1055091, 1079632, 1105939, 1133745, 1162372, 1190949, 1217911, 1241081, 1258807, 1270646, 1276707, 1277009, 1271942, 1262748, 1250846, 1236808, 1220282, 1200604, 1177190, 1149730, 1118438, 1084058, 1047515, 1009728, 971648, 933933, 896573, 859449, 823360, 789819, 759635, 732383, 707479, 684944, 664769, 646376, 629371, 614107, 600878, 589087, 577924, 567362, 557773, 549044, 540773, 532954, 525720, 518654, 511087, 502983, 494904, 487268, 480194, 473931, 468777, 464600, 460946, 457618, 454797, 452766, 451983, 453179, 456693, 461748, 466930, 471492, 475718, 480028, 484254, 487931, 490746, 492446, 492708, 491469, 489145, 486218, 482719, 478395, 473324, 468009, 462721, 456978, 450047, 441960]
61980D41960q242p354o189n230m318l469l215l706m094l559k501j939j962j608
61966C84574l18J232J979J715J218J384K332L333L638L375L336L809M152L759
61952D19518K929K437K648L488M782O152P072P624Q626J0424J2111J2730J2720
61939E13261J3300J4781J6393J7474J7945J7874J7544J7634J8347J8609J7212
61928G00374J4685J2765J2003J1057Q674N178J620j603m589p148q830r473r310
61915G25403q691p796o363l846k63L451O475R206J2447J5770J7740J7754J6568
61902G97855J4836J2302Q755M762R12k808o345r157j1029j2587j4333j5802j6368
61889G50993j6360j6536j6828j6401j4903j3031j1710j1143j0846j0428j0138
$$ y = [441960, 433718, 426364, 420175, 414945, 410627, 407158, 403943, 400237, 396143, 392584, 390083, 388144, 386182, 384574, 384256, 385488, 387467, 389182, 390400, 391784, 394116, 397449, 401087, 404462, 407798, 411607, 415759, 419518, 422447, 424884, 427532, 431020, 435802, 441954, 449026, 456650, 465276, 475700, 487811, 500541, 513261, 526561, 541342, 557735, 575209, 593154, 611028, 628572, 646206, 664553, 683162, 700374, 715059, 727824, 739827, 750884, 759558, 764736, 766356, 764753, 760164, 753016, 744186, 734713, 725403, 716712, 708916, 702553, 698707, 698444, 701895, 708370, 717576, 730023, 745793, 763533, 781287, 797855, 812691, 824993, 833748, 838510, 839422, 836614, 830269, 821112, 810083, 797496, 783163, 767361, 750993, 734633, 718097, 701269, 684868, 669965, 656934, 645224, 634081, 623235, 612807, 602669]
61878F02669j0465j1267j1604j0772r170p735o715n628m284l036k000p66P80K006
61864E22013K395K429L164N011P305R045R930J0684J2283J4970J8120K1125K3872
61851F62346K6259K7888K8815K9945L1887L3797L4242L2951L0821K8439K5589
61840I92979K2059J7924J2966O861J66n782j0146j3000j4391j3989j1926r093
61828I74628o104k729J310N641R669J3059J5446J6300J5426J3098R519M684j070
61815A068877p070j2978j8803k4115k8065l0389l1653l2264l2092l1240l0202
61804G90006k8957k6855k3905k1161j9265j7565j5333j3002j1368j0355r421q532
61792E84287p913p333o504n715n261m745l774k906k948l566l592k645j591j305
$$ y = [602669, 592204, 580937, 569333, 558561, 549391, 541656, 534941, 529313, 525029, 521993, 519993, 519227, 520007, 522013, 524408, 526837, 530001, 535012, 542317, 551362, 561292, 571976, 584259, 599229, 617349, 638474, 662346, 688605, 716493, 745308, 775253, 807140, 840937, 875179, 908130, 938951, 967390, 992979, 1015038, 1032962, 1045928, 1052789, 1052955, 1047173, 1037027, 1024027, 1009636, 995647, 983721, 974628, 968524, 965795, 967105, 972746, 982415, 995474, 1010920, 1027220, 1042646, 1055744, 1065263, 1069947, 1068877, 1061807, 1048829, 1030026, 1005911, 977846, 947457, 915804, 883540, 851448, 820208, 790006, 761049, 734194, 710289, 689128, 669863, 652298, 636965, 623963, 612595, 602240, 592819, 584287, 576374, 569041, 562537, 556822, 551561, 546816, 543042, 540136, 537188, 533622, 530030, 527385, 525794, 524489]
61778E24489j715k173k256j984j702j784k231k568k404j928j521j122m43L21O12
61763E01591L81L34J038K139K730K454J866J709J980J977J203l1j076j664j940
61748E14691j980j772j527j571j874k109k164k192k199j992j665j668k176k715
61734D87087k604j645l24O06Q16P71J163J931K255J788J242J230J278P43J32M49
61718D96918J503K110J851J478J533J633J335P26p4j119k199k982l714m863o003
61703D88133o156n280m412m110l984l865m198m831m814l975l431l843m367m155
61689D26712l666l597l559k912k007j541j417j261j376k154l122l494l196k528
61675C90882j472k16L70j95j004r34k76j20n84p94l68J95M80N30L69L4o2M09R98
$$ y = [524489, 522774, 520601, 518345, 516361, 514659, 512875, 510644, 508076, 505672, 503744, 502223, 501101, 500658, 500979, 501591, 501972, 502306, 503344, 505483, 508213, 510667, 512533, 514242, 516222, 518199, 519402, 519371, 518295, 516631, 514691, 512711, 510939, 509412, 507841, 505967, 503858, 501694, 499502, 497303, 495311, 493646, 491978, 489802, 487087, 484483, 482838, 482514, 483120, 483936, 484707, 485870, 487801, 490056, 491844, 493086, 494316, 495594, 496337, 496469, 496918, 498421, 500531, 502382, 503860, 505393, 507026, 508361, 509087, 509013, 507894, 505695, 502713, 498999, 494136, 488133, 481977, 476697, 472285, 468175, 464191, 460326, 456128, 451297, 446483, 442508, 439077, 435234, 430867, 426712, 423046, 419449, 415890, 412978, 410971, 409430, 408013, 406752, 405376, 403222, 400100, 396606, 393410, 390882, 389410, 389194, 389564, 389369, 388365, 387431, 387155, 387035, 386451, 385657, 385289, 385484, 385964, 386494, 386863, 386897, 386835, 387244, 388242]
61656C88242J036P16P69J261J578J483J350J378J417J549K058K742L046K930K920
61641D14475L221L411L189K752K328J817J028j06j558l038l872l611k767k425
61627D14844k968l680l727l104k380j882j430p68NN03N64N14P01Q72L76q90k122
61610C95428k433j858j360k001l963o176p012n945m313l823m476m871m426m050
61596C38721m309m293l155j607q69r00q23m85m55q00r77q05o70p24o50k53K65
61579C17211N64M17j48o37m80J19J84o96j710j895j323n71J87Q51Q61Qp59m21
61561C11762O28J193J045J022J496J853J576R46M92M01N75P62O50J97k26l84n05
61544C23483o71l73P23K064K948L457L919L990L237K188J754J871J726J129O22
$$ y = [388242, 389278, 389994, 390763, 392024, 393602, 395085, 396435, 397813, 399230, 400779, 402837, 405579, 408625, 411555, 414475, 417696, 421107, 424296, 427048, 429376, 431193, 432221, 432115, 430557, 427519, 423647, 420036, 417269, 414844, 411876, 408196, 404469, 401365, 398985, 397103, 395673, 394905, 394910, 395413, 395977, 396491, 397192, 398064, 398440, 397550, 395428, 392995, 391137, 389777, 387776, 383813, 377637, 370625, 364680, 360367, 356544, 352068, 347197, 342771, 338721, 334412, 330119, 326964, 325357, 324488, 323588, 322765, 322280, 321825, 321025, 320048, 319243, 318573, 317849, 317199, 316946, 317211, 317775, 318192, 318044, 317407, 316927, 317046, 317230, 316534, 314824, 312929, 311606, 311035, 311222, 312073, 312934, 312942, 312183, 311762, 312390, 313583, 314628, 315650, 317146, 318999, 320575, 321521, 322013, 322414, 322989, 323751, 324401, 324598, 324372, 323988, 323483, 322812, 322439, 323162, 325226, 328174, 331631, 335550, 339540, 342777, 344965, 346719, 348590, 350316, 351445, 352067]
61529C52067L62n1o65j072j279j731k421k779k595k273k101j911j499q51K4Q32
61513C32057R11N6q52r52o77r94j612j331o1Q62O51J20K03N61L57l36o12J13J524
61494C29988K654K573J185m19q86K1J281J871J677J232J033J265J693J852J639
61479C48659J512J756J845J185J02o06q20r42r08l27N18Q49N71K72Q0m33j139
61462C52174j294q50p04j285j885j850j515j374j165m28O08J349J599J520J207
61447C46107P52L69J78J27K79Q04J579K180K466K681K930L017K969L149L693M233
61431C77513M377M079L451K631J867J362J026P50P55J256J980K523K893L167K931
61416D12561J876O07o5l13p92j201o93M00O92k69j407j921k307k980l263k558
$$ y = [352067, 352429, 352378, 351713, 350641, 349362, 347631, 345210, 342431, 339836, 337563, 335462, 333551, 332052, 331201, 331225, 332057, 332968, 333024, 332172, 331220, 330543, 329549, 327937, 326606, 326545, 327407, 328058, 328178, 328381, 328942, 329299, 328963, 328351, 328464, 329988, 332642, 335215, 336400, 335981, 335095, 335116, 336397, 338268, 339945, 341177, 342210, 343475, 345168, 347020, 348659, 350171, 351927, 353772, 354957, 355059, 354453, 353633, 352691, 351783, 351456, 351974, 352823, 353394, 353666, 353746, 353313, 352174, 350880, 350030, 349326, 348041, 346156, 344306, 342791, 341417, 340252, 339824, 340432, 341781, 343380, 344900, 346107, 346859, 347228, 347406, 347533, 347812, 348616, 350195, 352375, 354841, 357522, 360452, 363469, 366438, 369587, 373280, 377513, 381890, 385969, 389420, 392051, 393918, 395280, 396306, 397056, 397811, 399067, 401047, 403570, 406463, 409630, 412561, 414437, 415044, 414979, 414666, 413874, 412673, 411980, 412380, 413072, 412803, 411396, 409475, 407168, 404188, 400925, 398367]
61400C98367j431o73j38N28Q47K01r52j523j171m30K06O66R62J142J439K015K638
61383D02693K910K683K091J509J483K239L063K876J688P44Q73J424J365P26J98
61368D28565o5l52n02q7O29P36j48j331j793j113M43K255L657M233M147M053M530
61351D47857N542O547P152P519P957Q159P331N286L006J735J728K310K858L196
61337E18183L262L026K713K511K094R32q87k652l781m132l741k823j915j405r79
61322E10406k03N69O18J52K29J309K676L516L813L985M291M863N760O788P784
61307E56556R045J0913J2965J4327J4699J4320J3091J0708P596M702K257j94k536
61294F68449m031m696n429o463o992o790o814p584q225q031p660p858q035p226
$$ y = [398367, 396936, 396263, 396125, 396653, 397500, 397701, 396749, 395226, 394055, 393625, 393831, 394497, 395459, 396601, 398040, 400055, 402693, 405603, 408286, 410377, 411886, 413369, 415608, 418671, 421547, 423235, 423979, 424852, 426276, 427641, 428367, 428565, 428500, 428148, 427646, 427559, 428188, 428924, 428776, 427445, 425652, 424539, 424982, 427237, 430894, 435127, 439274, 443327, 447857, 453399, 459946, 467098, 474617, 482574, 490733, 498064, 503350, 506356, 508091, 509819, 512129, 514987, 518183, 521445, 524471, 527184, 529695, 531789, 532721, 531834, 529182, 525401, 521269, 517528, 514705, 512790, 511385, 510406, 510203, 510772, 511390, 511542, 511771, 513080, 515756, 519272, 523085, 527070, 531361, 536224, 541984, 548772, 556556, 565601, 576514, 589479, 603806, 618505, 632825, 645916, 656624, 664220, 668922, 671179, 670985, 668449, 664418, 659722, 654293, 647830, 640838, 634048, 627234, 619650, 611425, 603394, 595734, 587876, 579841, 572615]
61280E72615n574l829k197p39l4j45J86J974M097M538L200J951J915K265K020
61265E82243J614J992L126M309N318O551Q144R620J0379J0198R218P754O156M721
61251F71343L476K045Qk438m358m983m611m338m849n799o314n827m484l104k584
61236F23183l073l760l888l612l383k904j594J78J361J721K080K874L550L720
61222F16453L907M613N487O034O376O812P162P139O893O683O480O230O013N663
61208G01945M860L843L356L548L673L293L068L819N442P312R090J0693J2064J3496
61194G89502J5508J7821J9011J7903J4845J1170P883N328L574K421J405K74q51
61181I05794j989l430n009n993o199o512p706r315j0372j0709j0833j0968j0976
$$ y = [572615, 567041, 563212, 561015, 560276, 560242, 560097, 560283, 562257, 566354, 570892, 574092, 576043, 577958, 580223, 582243, 583857, 585849, 588975, 593284, 598602, 605153, 613297, 622917, 633296, 643494, 652712, 660466, 666622, 671343, 674819, 676864, 676872, 674434, 670076, 665093, 660482, 656144, 651295, 645496, 639182, 633355, 628871, 625767, 623183, 620110, 616350, 612462, 608850, 605467, 602563, 600969, 601147, 602508, 604229, 606309, 609183, 612733, 616453, 620360, 624973, 630460, 636494, 642870, 649682, 656844, 663983, 670876, 677559, 684039, 690269, 696282, 701945, 706805, 710648, 714004, 717552, 721225, 724518, 727586, 731405, 736847, 744159, 753249, 763942, 776006, 789502, 805010, 822831, 841842, 859745, 874590, 885760, 893643, 898971, 902545, 904966, 906371, 906645, 905794, 903805, 900375, 895366, 889373, 883174, 876662, 868956, 859641, 849269, 838560, 827727, 816759, 805783]
61168H05783j0903j0933j0959j0749j0458j0596j1455j2693j3422j2845j1171
61157F79599r591q825q012n963l107r56K31J663L655M807M179K717J497j3k630
61142F59251n584p355p638p195o427n258l910k667j314L03J681K519L548N477
61128F25431P748R339J0237J1109J2111J3157J4705J7075J9444K0861K1799K3362
61116H06378K5301K6267K6006K5802K6543K7596K8030K7813K7338K6552K5186
61105A098812K3391K1611K0024J8246J5575J1703P268L491R23j023l092n229p015
61092A204685q471r728j0428j0179r289q376p485o268m797l522k507j324K63J913
61078A124487L019L252K913K816L486M492M955M660M062L390K561J866J690J466
$$ y = [805783, 794880, 783947, 772988, 762239, 751781, 741185, 729730, 717037, 703615, 690770, 679599, 670008, 661183, 653171, 647208, 644101, 643145, 643376, 645039, 648694, 653501, 657680, 660397, 661894, 661881, 659251, 653667, 646312, 638674, 631479, 625052, 619794, 615884, 613217, 611903, 612206, 613887, 616406, 619954, 625431, 633179, 642518, 652755, 663864, 675975, 689132, 703837, 720912, 740356, 761217, 783016, 806378, 831679, 857946, 883952, 909754, 936297, 963893, 991923, 1019736, 1047074, 1073626, 1098812, 1122203, 1143814, 1163838, 1182084, 1197659, 1209362, 1216630, 1220121, 1221044, 1220021, 1216929, 1211700, 1204685, 1196214, 1186486, 1176058, 1165879, 1156590, 1148214, 1140729, 1134461, 1129664, 1126142, 1123635, 1122311, 1122574, 1124487, 1127506, 1130758, 1133671, 1136487, 1139973, 1144465, 1149420, 1154080, 1158142, 1161532, 1164093, 1165959, 1167649, 1169115]
61064A169115K30j616k507k160k261l930n958o610n967n295n106n015m640l667
61050A114613j803M21J784K112K793M658O648P682Q468J0069J2005J3286J4230
61037A196966J5521J6536J6455J6177J7278J9675K2068K4168K6775L0019L3047
61026A434685L5182L6197L5964L5202L5787L8997M4201N0487N8402O8557P9685
61015A953346Q9960R9385J09341J21148J36883J60023J93033K35829K88718L54521
61005C742187M34926N27815O32839P57241R11115J100835J334504J625062J961647
60996A3028171K262976K378916K177757J656862R66850L19758j29250l23890k73295
60987B2064855k5441L12342N62669N44271J84810m25059j092232j638163j973262
$$ y = [1169115, 1169345, 1167729, 1165222, 1163062, 1160801, 1156871, 1150913, 1144303, 1138336, 1133041, 1127935, 1122920, 1118280, 1114613, 1112810, 1113231, 1115015, 1117127, 1119920, 1124578, 1131226, 1138908, 1147376, 1157445, 1169450, 1182736, 1196966, 1212487, 1229023, 1245478, 1261655, 1278933, 1298608, 1320676, 1344844, 1371619, 1401638, 1434685, 1469867, 1506064, 1542028, 1577230, 1613017, 1652014, 1696215, 1746702, 1805104, 1873661, 1953346, 2043306, 2142691, 2252032, 2373180, 2510063, 2670086, 2863119, 3098948, 3387666, 3742187, 4177113, 4704928, 5337767, 6095008, 7006123, 8106958, 9441462, 11066524, 13028171, 15291147, 17670063, 19847820, 21504682, 22471532, 22791290, 22662040, 22338150, 22064855, 22039414, 22351756, 22914425, 23458696, 23643506, 23218447, 22126215, 20488052, 18514790]
60978A8514790k094513k046598j890265j683594j467951j262815j074010r04768
60970F090276p57898o32748n26202m36492l63256l04876k58427k21508j92171
60961B396698j68001j47202j29792j15953j04129r2399q0767p0360o1222n2662
60951A374211m5050l9467l5947l3643l2330l2258l2763l2443l0724k8280k6057
60940A005249k4638k4195k4297k3988k2797k1260k0044j9104j8196j7453j6842
60929G72435j5866j4412j3116j2232j1043r181p582p232p719p940p541o840n999
60916F45732n117m533m265l806l035k522k340j597K8J285R72l21j160j254j372
60901F16695j855k404k946l643m318m664m862n334o120p039q019q820q881p960
$$ y = [18514790, 16420277, 14373679, 12483414, 10799820, 9331869, 8069054, 6995044, 6090276, 5332378, 4699630, 4173428, 3736936, 3373680, 3068804, 2810377, 2588869, 2396698, 2228697, 2081495, 1951703, 1835750, 1731621, 1639222, 1558455, 1488095, 1426873, 1374211, 1329161, 1289694, 1253747, 1220104, 1187774, 1155516, 1122753, 1090310, 1059586, 1031306, 1005249, 980611, 956416, 932119, 908131, 885334, 864074, 844030, 824926, 806730, 789277, 772435, 756569, 742157, 729041, 716809, 705766, 696585, 689003, 681771, 674052, 666112, 658571, 651731, 645732, 640615, 636082, 631817, 628011, 624976, 622454, 620114, 618517, 618545, 619830, 620802, 620481, 619321, 618067, 616695, 614840, 612436, 609490, 605847, 601529, 596865, 592003, 586669, 580549, 573510, 565491, 556671, 547790, 539830]
60887E39830o473m938l616k885l138m018m602m678m833n094m740l866l667m395
60873D78887m579l229j447o71n62K4J063J781K164K651L043L093L439M654N938
60858D96249O068N124M111L380K651K064J933J855J316Q33J291K362K706J693
60844E33636J4j297j748j534j396k069l414m571n235n953o830p040o333n780o107
60829D74343o524o221n793n859n604m255k891l020m133m593m180l944m044l732
60815D09550l149l197l745l723l025k605k636k310j587j423j968k122j333l79
60801C76348P7L99R24J172P83K53J35L08M52O26R75J420J860K210K264J969J681
60784C93856J575J150Q7q61p82n8K27K1J80P77Q86K12m48n73n70p20o58l11k96
$$ y = [539830, 533357, 528419, 524803, 521918, 518780, 514762, 510160, 505482, 500649, 495555, 490815, 486949, 483282, 478887, 474308, 471079, 469632, 468961, 468399, 468423, 469486, 471267, 473431, 476082, 479125, 482218, 485657, 490311, 496249, 502317, 507441, 511552, 514932, 517583, 519647, 521580, 523435, 524751, 525584, 526875, 529237, 531943, 533636, 533650, 532353, 530605, 529071, 527675, 525606, 522192, 517621, 512386, 506433, 499603, 492563, 486230, 480450, 474343, 467819, 461598, 455805, 449946, 444342, 440087, 437196, 434176, 430043, 425450, 421270, 417326, 413282, 409550, 406401, 403204, 399459, 395736, 392711, 390106, 387470, 385160, 383573, 382150, 380182, 378060, 376727, 376348, 376425, 376824, 377748, 378920, 379703, 379956, 380091, 380399, 380851, 381477, 382452, 383872, 385732, 387942, 390206, 392175, 393856, 395431, 396581, 396668, 395807, 395025, 394967, 395194, 395215, 395395, 396172, 397058, 397270, 396822, 396249, 395679, 394959, 394301, 393990, 393694]
60765C93694q57j316j137p32o42o07r2O90Q41j77j852k856k253o29L37j74j062
60748C81176q31M48J638K423L348M153L620J433j091k654l395m045m593m580m121
60733C72929l818l849l743l058j967j096p88o13J09J263J878J439P23P63J459
60718C61631J917J769J394J045O40L06L75Q10J272J659K054K233J824Q53k92j245
60702C78245j608j026J05N88j74j218j358r00r83j701k123j938j700j541r33P1
60686C61806O06L52P0M73J309J956K200K243K401K941L641L680K655J441J170
60671C88944J563J327J22j051j539j902k718l530l564k761j610n44J18J77j30
60656C72902j94K92J048J623J799J575J180R99J205J578K001K666L372L223J766
$$ y = [393694, 392837, 391521, 390384, 389652, 389010, 388403, 388311, 389001, 389842, 389665, 387813, 384957, 382704, 382075, 382412, 382238, 381176, 380345, 380793, 382431, 384854, 388202, 392355, 395975, 397408, 396317, 393663, 390268, 386223, 381630, 377050, 372929, 369111, 365262, 361519, 358461, 356494, 355398, 354610, 353997, 354106, 355369, 357247, 358686, 359409, 360172, 361631, 363548, 365317, 366711, 367756, 368396, 368702, 369077, 369887, 371159, 372818, 374872, 377105, 378929, 379782, 379490, 378245, 376637, 375611, 375716, 376304, 376130, 374912, 373554, 372654, 371671, 369970, 367847, 365909, 364209, 362668, 361735, 361806, 362412, 362764, 362834, 363307, 364616, 366572, 368772, 371015, 373416, 376357, 379998, 383678, 386333, 387774, 388944, 390507, 391834, 391956, 390905, 389366, 387464, 384746, 381216, 377652, 374891, 373281, 372737, 372855, 373032, 372902, 372708, 373000, 374048, 375671, 377470, 379045, 380225, 381224, 382429, 384007, 386008, 388674, 392046, 395269, 397035]
60641C97035j05j249j780k482l287l511l230l092k967k158q98k00j74J65J163
60626C73230J926J821J321R28L89m31r42p16j88J31L70P49J027R63P46N38J52
60609C82014m37p60m17M28J276J669J328M62j47M0N24L84l58q19n84j03K57P17
60591C85474J502K448L294L765L459K402J436J327J614J323N82M22J107J779J811
60576D13745J411Q69L21K59J152K476L299L836N205P564R845J1515J3094J4583
60562D89174J4878J3457J1335R575P918N576K508p73l783n957o734o318n563m818
60548E20475l669k060o12M49J648L168M519N616P130R282J1472J3540J6165J9484
60534F06607K2523K4676K6400K7757K7550K4915K0646J5895J0596M367j912o718
$$ y = [397035, 396930, 395681, 393901, 391419, 388132, 384621, 381391, 378299, 375332, 373174, 372276, 372076, 371902, 372067, 373230, 375156, 376977, 378298, 379226, 379615, 379184, 378242, 377526, 377338, 377469, 377839, 378588, 379615, 380578, 381324, 381862, 382014, 381577, 380817, 380400, 380828, 382104, 383773, 385101, 385563, 385416, 385456, 385980, 386364, 386006, 385187, 384603, 384500, 384757, 385474, 386976, 389424, 392718, 396483, 399942, 402344, 403780, 405107, 406721, 408044, 408626, 409048, 410155, 411934, 413745, 415156, 416025, 416346, 416605, 417757, 420233, 423532, 427368, 432573, 440137, 449982, 461497, 474591, 489174, 504052, 517509, 528844, 538419, 546337, 551913, 554421, 553648, 549865, 543908, 537174, 530856, 525293, 520475, 516806, 514746, 514134, 514583, 516231, 519399, 523918, 529534, 536664, 545946, 557418, 570958, 587123, 606607, 629130, 653806, 680206, 707963, 735513, 760428, 781074, 796969, 807565, 811932, 810020, 803302]
60522H03302r579j1166j2113j2660j3099j3607j3863j3329j1778r339o471m042
60510F72256k699j986r11N13J465K239M423Q459J2612J5480J8147K2470K8304
60497G80772L4037L9080M4192M9635N4516N7872N9275N8449N5384N0807M5569
60486A329588L9524L1817K2251J1642P75j0275k1623l2917m3404n2368n9392o4327
60474A151291o6928o6677o3401n8099n2558m7867m3745l9479l4965l0554k6488
60463F20530k2849j9640j6697j4029j2182j1533j1266j0055p893o184n653n376
60451D77173m466l452l220l567l731l512l063k334j499j221j644j955j670j523
60437D40316k188l006l046k623k564k613j920p02r1m08p83n55o6Q4j52m18m14
$$ y = [803302, 793723, 782557, 770444, 757784, 744685, 731078, 717215, 703886, 692108, 682769, 676298, 672256, 669557, 667571, 666660, 667173, 668638, 670877, 675300, 683759, 696371, 711851, 729998, 752468, 780772, 814809, 853889, 898081, 947716, 1002232, 1060104, 1119379, 1177828, 1233212, 1284019, 1329588, 1369112, 1400929, 1423180, 1434822, 1435597, 1425322, 1403699, 1370782, 1327378, 1275010, 1215618, 1151291, 1084363, 1017686, 954285, 896186, 843628, 795761, 752016, 712537, 677572, 647018, 620530, 597681, 578041, 561344, 547315, 535133, 523600, 512334, 502279, 494386, 488202, 482549, 477173, 472707, 469255, 466035, 462468, 458737, 455225, 452162, 449828, 448329, 447108, 445464, 443509, 441839, 440316, 438128, 435122, 432076, 429453, 426889, 424276, 422356, 421654, 421563, 421155, 420372, 419817, 419751, 419835, 419683, 419265, 418851]
60420D18851r7K81M09L92P55J712K793L378L292K642J634P48N07P46P34L37L03
60403D39417J013J715J566P54K9k52j05M50J165J558J547J607J964K324K616L132
60387D60500L642L422K553K087K381K486J841J285J585K199K479K835L606L947
60373D96848L195K278K367L009L013K432K144K122J657Q68N08O39P91J107K022
60358E25000L155L735L893M337N127N932P095R067J1043J1605J0627R248Q055
60345F17919O516M278J723q46l491n925p513q147q334q360q117p649p085o209
60331E58760m925l933m020m828n274n078m889m956m728l855k649j459l22O81J405
60316E09930K031K855L771M625N838P939J0543J2607J3597J3793J3468J2559J1174
$$ y = [418851, 418754, 419035, 419444, 419836, 420591, 422303, 425096, 428474, 431766, 434408, 436042, 436790, 437297, 438043, 438777, 439114, 439417, 440430, 442145, 443711, 444465, 444494, 444242, 444137, 444587, 445752, 447310, 448857, 450464, 452428, 454752, 457368, 460500, 464142, 467564, 470117, 472204, 474585, 477071, 478912, 480197, 481782, 483981, 486460, 489295, 492901, 496848, 500043, 502321, 504688, 507697, 510710, 513142, 515286, 517408, 519065, 519933, 520441, 521080, 521871, 522978, 525000, 528155, 531890, 535783, 540120, 545247, 551179, 558274, 567341, 578384, 589989, 600616, 609864, 617919, 624435, 628713, 630436, 629590, 626099, 620174, 612661, 604514, 596180, 587820, 579703, 572054, 564969, 558760, 553835, 549902, 545882, 541054, 535780, 530702, 525813, 520857, 516129, 512274, 509625, 508166, 507844, 508525, 509930, 511961, 514816, 518587, 523212, 529050, 536989, 547532, 560139, 573736, 587529, 600997, 613556, 624730]
60303F24730R796Q923Q777R222R610R080P341M849J826k168p213j2265j6136j8535
60289F37837j9504j8717j6315j3610j1773j0361q348o033m664m498m598m352l988
60276E11076l720l446l227l179l027k547k131k130k136j747j503j984k577k280
60262D75442j183q4P65J339J013m22j595j071M10R23K84O2R11J795K009K057K164
60245D84819J673M90l48j99L05L65o0p66j614k095j664o89n3K30P78J374J268
60228D83814R18J727L650M820M181K873K277K163J762J367J706K671L680M593
60214E22202N493O179O579P014P524P592P039O482O380O352N910N240M662M070
60200F08718L395L012L149L377L186K640K099J655J178N14m46j659k803l621m228
$$ y = [624730, 634526, 643449, 652226, 661448, 671058, 680138, 687479, 692328, 694154, 691986, 684773, 672508, 656372, 637837, 618333, 599616, 583301, 569691, 557918, 547557, 539209, 533176, 528512, 524014, 519416, 515064, 511076, 507356, 503910, 500683, 497504, 494477, 491930, 489799, 487669, 485533, 483786, 482283, 480299, 477722, 475442, 474259, 474175, 474940, 476279, 477292, 476870, 475275, 474204, 474614, 475537, 475821, 475883, 476794, 478589, 480598, 482655, 484819, 486492, 486982, 486634, 486435, 486740, 487105, 487045, 486279, 484665, 482570, 480906, 480217, 480164, 480394, 481172, 482546, 483814, 484732, 486459, 490109, 494929, 499110, 501983, 504260, 506423, 508185, 509552, 511258, 513929, 517609, 522202, 527695, 533874, 540453, 547467, 554991, 562583, 569622, 576104, 582484, 588836, 594746, 599986, 604648, 608718, 612113, 615125, 618274, 621651, 624837, 627477, 629576, 631231, 632409, 632923, 632477, 630818, 628015, 624394, 620166]
60185F20166m640m436l496k716l006l939m369m175m179m545m515l829l050k376
60171E66895j331R9J161J458J308Q84K7r27j327j316j542j713q94N94J182L78
60155E64936m79l28K50M88P26J354J800J641J494J833J962J290O26J055K270L121
60139E84039L226L071L028L204L768M736N757O633P528Q219P879O189L935J959
60125F53171K21j440k453k255j314n68k85j08K39P64J395J819J597P95j4o23j376
60108F49565k182k286j474p00p85j345j676j941k622l394l503k900k232j923j838
60093F18764j649j089j21Q65J312J208J123J327J433J131O62K97j24p02j205j479
60077F21753j708k020k374k967m009n110n633n798o461p624q202p597o470n561
$$ y = [620166, 615526, 611090, 607594, 604878, 601872, 597933, 593564, 589389, 585210, 580665, 576150, 572321, 569271, 566895, 565564, 565663, 566824, 568282, 569590, 570474, 570501, 569574, 568247, 566931, 565389, 563676, 562782, 563376, 564558, 564936, 564457, 564129, 564379, 564867, 565593, 566947, 568747, 570388, 571882, 573715, 575677, 576967, 577593, 578648, 580918, 584039, 587265, 590336, 593364, 596568, 600336, 605072, 610829, 617462, 624990, 633209, 641088, 647277, 651212, 653171, 653392, 651952, 649499, 647244, 645930, 645362, 645077, 644969, 645208, 645972, 647367, 649186, 650783, 651578, 651564, 650941, 649565, 647383, 645097, 643623, 642923, 642138, 640793, 639117, 637176, 634554, 631160, 627657, 624757, 622525, 620602, 618764, 617115, 616026, 615905, 616770, 618082, 619290, 620413, 621740, 623173, 624304, 624966, 625263, 625139, 624437, 623232, 621753, 620045, 618025, 615651, 612684, 608675, 603565, 597932, 592134, 585673, 578049, 569847, 562250, 555780, 550219]
60063E50219m828m234m312n155n847n561m525l314k011o98J63M76Q56J586K091
60048E14906K018J962K426K991L287L807M846N515M906L517K535K176J814J226
60034E57932P02K17n42j445k004k103k110k400l144m298n471o139o346o725p573
60019E08551q370q518p960o899n557m463m221m574m505l600k519j818j304q57
60005D43386q62j211j025j06M64j0o02k13P46J232J292J584J895J472N39J91Q07
59988D49579J609J864J744J853K444L207L556L167K330J549P92l48j777k845l232
59973D65492l109k472j201K9J37p55j244n76M84J213J972L024L639L307K737K618
59957D75295K513J885J235J084Q54j13j273j765j763j880j974j690j432j702k094
$$ y = [550219, 545391, 541157, 536845, 531690, 525843, 520282, 515757, 512443, 510432, 509734, 509897, 510373, 511229, 512815, 514906, 516924, 518886, 521312, 524303, 527590, 531397, 536243, 541758, 546664, 550181, 552716, 554892, 556706, 557932, 558634, 558851, 558309, 556864, 554860, 552757, 550647, 548247, 545103, 540805, 535334, 529195, 522849, 516124, 508551, 500181, 491663, 483703, 476804, 471247, 466784, 462563, 457989, 453484, 449884, 447365, 445547, 444243, 443386, 442524, 441313, 440288, 440182, 440646, 440636, 440034, 439821, 440567, 441799, 443091, 444675, 446570, 448042, 448581, 448772, 449579, 451188, 453052, 454796, 456649, 459093, 462300, 465856, 469023, 471353, 472902, 473694, 473346, 471569, 468724, 465492, 462383, 459911, 458710, 458739, 458876, 458121, 456877, 456301, 456785, 457998, 459970, 462994, 466633, 469940, 472677, 475295, 477808, 479693, 480928, 482012, 482866, 482753, 481480, 479715, 477952, 476072, 474098, 472408, 470976, 469274, 467180]
59942D67180k084k059k492k788k178j116o82r98j313j131l59J105K947M292M876
59927D63200N609O930P555O119L290Q54n77j559k154j929j274j091j305j032j24
59912D82512P22J232J747K287K570K893L785M837M999M068K885K070J448P62P4
59897E18891n88j149j155k07J268K335K543K183J787J874K750M038M821M732M401
59882E48524M391M462M440M849N901O692O429N619N144M906M385L694L037J957
59868F14430K65j126j471j440j871k212j614o53l95m84P6J008J305J196J715K733
59852F11462L241L340M092N536O676P377Q330R059P873M317R8k908m276m256k879
59837F57082n21J679K625K007J43k207l970m525m376m316m253l735l185l437m290
$$ y = [467180, 465096, 463037, 460545, 457757, 455579, 454463, 453781, 452783, 451470, 450339, 449980, 451085, 454032, 458324, 463200, 468809, 475739, 483294, 489413, 492703, 493557, 492980, 491421, 489267, 487338, 486064, 484973, 483668, 482636, 482512, 483234, 484466, 486213, 488500, 491070, 493963, 497748, 502585, 507584, 511652, 514537, 516607, 518055, 518817, 518891, 518303, 517154, 515999, 515792, 517060, 519395, 521938, 524121, 525908, 527782, 530532, 534570, 539391, 544123, 548524, 552915, 557377, 561817, 566666, 572567, 579259, 585688, 591307, 596451, 601357, 605742, 609436, 612473, 614430, 614695, 613569, 612098, 610658, 608787, 606575, 604961, 604308, 603913, 603429, 603505, 604513, 605818, 607014, 608729, 611462, 614703, 618043, 622135, 627671, 634347, 641724, 650054, 659113, 666986, 671303, 671401, 668493, 664217, 659961, 657082, 656561, 658240, 660865, 662872, 663015, 660808, 656838, 652313, 647937, 643621, 639368, 635633, 632448, 629011, 624721]
59822F24721m720m443m145m291m717n232n611n264l917k370j551j310j127j305
59808E74718k180k859k391j514j502j868j154K77M86j042k664l109k821k501k148
59793E47728j974k545l526l865l505l390l456k543p40O7j101k734k970j953j041
59778E12452q28r35r84q06l04L95J034J688K548L345L733M050M712N191M758L980
59762E44029M034M805N197N136N532O295O343N695N628O408O841O498O443P076
59748F25960P237O310N378N344N599N532N649O101N709L797J633P88J127J534
59734F87698J530J135J83j127j972k108k325k914k845j436K89R60N72j05p83j316
59718F75436j188m07%m95q97j89R54J200M92j74k44K09J131K249K737K186J416
$$ y = [624721, 620001, 615558, 611413, 607122, 602405, 597173, 591562, 586298, 582381, 580011, 578460, 577150, 576023, 574718, 572538, 569679, 567288, 565774, 564272, 562404, 561250, 561527, 562013, 560971, 558307, 555198, 552377, 549876, 547728, 545754, 543209, 539683, 535818, 532313, 528923, 525467, 522924, 522184, 522251, 521150, 518416, 515446, 513493, 512452, 511624, 510689, 509705, 508899, 508595, 508990, 510024, 511712, 514260, 517605, 521338, 525388, 530100, 535291, 540049, 544029, 548063, 552868, 558065, 563201, 568733, 575028, 581371, 587066, 592694, 599102, 605943, 612441, 618884, 625960, 633197, 639507, 644885, 650229, 655828, 661360, 667009, 673110, 678819, 682616, 684249, 685037, 686164, 687698, 689228, 690363, 690546, 689419, 687447, 685339, 683014, 680100, 677255, 675819, 676108, 677068, 677640, 677535, 676752, 675436, 674248, 673841, 673841, 673346, 672449, 672260, 673214, 674414, 674906, 674732, 674488, 674697, 675828, 678077, 680814, 683000, 684416]
59701F84416J425J978K144J682R91K19n93r65n24J38K8j009k280l178l559l461
59685F77452l055k687k531k425k271k273k565l034l736m876o213p090p247p030
59671F20419o647n996n282m959m886m487l880l804m162l901k728j697j502j370
59657E65118m64Q28J737K297K781K922K529K087J926J544O00k82n12o03j369k711
59641E78428l904m561m609m002l134k804l087k960j784l89O6l82q92j171j535
59626E43280k108k752l468m275m892n010m580l664k449j522j403j723j641j167
59612E02626j103j506j444n89J38J01j07J22L73J52j68q2K81P78J729L092M035
59595E08428L992L344K638K061J976K805L891L877K665J626J338P78m56j039k69
$$ y = [684416, 685841, 687819, 689963, 691645, 692636, 692855, 692262, 691297, 690773, 690911, 690939, 689930, 687650, 684472, 680913, 677452, 674397, 671710, 669179, 666754, 664483, 662210, 659645, 656611, 652875, 647999, 641786, 634696, 627449, 620419, 613772, 607776, 602494, 597535, 592649, 588162, 584282, 580478, 576316, 572415, 569687, 567990, 566488, 565118, 564654, 565482, 567219, 569516, 572297, 575219, 577748, 579835, 581761, 583305, 583905, 583623, 583111, 582508, 581139, 578428, 574524, 569963, 565354, 561352, 558218, 555414, 552327, 549367, 547583, 547194, 547260, 546878, 545986, 544815, 543280, 541172, 538420, 534952, 530677, 525785, 520775, 516195, 512531, 510082, 508560, 507157, 505434, 503793, 502626, 501523, 500017, 498573, 497984, 498122, 498223, 498116, 498238, 498611, 498763, 498595, 498513, 498794, 499572, 501301, 504393, 508428, 512420, 515764, 518402, 520463, 522439, 525244, 529135, 533012, 535677, 537303, 538641, 539419, 538963, 537924, 537655]
59580E37655L02q58k779l491k865k238k165k230k300k373j894o58K21k79j393
59565E12655j613q24M0P41J590K148J709P14K25K18k13j185j911k086k084j974
59549E08150j414m47O23J900L480M750N159N294O151P707R427J1801J5888K1195
59535E99664K5156K4989J9673J0504N45o824r985r853q304o270l939j898p68k28
59521F32462M07Q66L69r45k135k950m035n643p114p819p785p303o593n955n701
59506E70126n844o159o405o257n400m059l016k711k725k526k138j724j157m80
59492E19525j18j92k72j86k65m37l4R78J630J444J156J360J606J608K037L185
59476E33025M102M212M435N476O260N608M253L578L372K556J328P86R76J087J095
$$ y = [537655, 537957, 537099, 534320, 530829, 527964, 525726, 523561, 521331, 519031, 516658, 514764, 514106, 514327, 514048, 512655, 511042, 510218, 510258, 510999, 512589, 514737, 516446, 517160, 517385, 517603, 517390, 516205, 514294, 512208, 510124, 508150, 506736, 506289, 506912, 508812, 512292, 517042, 522201, 527495, 533646, 541353, 550780, 562581, 578469, 599664, 624820, 649809, 669482, 679986, 680531, 673707, 663722, 653869, 645565, 639295, 635356, 633458, 632690, 632462, 632869, 633735, 634104, 633159, 631024, 628074, 624039, 618396, 611282, 603463, 595678, 588375, 581782, 575827, 570126, 564282, 558123, 551718, 545461, 540061, 536002, 532986, 530275, 527550, 525024, 522886, 521162, 520005, 519525, 519407, 519215, 518943, 518757, 518492, 518055, 518021, 518999, 520629, 522073, 523229, 524589, 526195, 527803, 529840, 533025, 537127, 541339, 545774, 551250, 557510, 563118, 567371, 570949, 574321, 576877, 578205, 578991, 579967, 581054, 582149]
59461E82149J616K483L025L361M055M847N160N331N978O615O425N820N695N649
59447F48209M671L191K535K592J862q2k042l210m105n130n732n443m566l448k144
59432F27158j008n53n72l27K92Q29J461K982N414P746R325J0596J2178J4011J5684
59417G05216J6966J7835J8437J9302K1197K4620K9130L2672L1745K3770J0097
59406I50987m157j4136j8529j8691j6084j1635o114L69Q028J5100J7133J0818
59394I13089j880j5070k4061k7893k7824k5524k2636k0095j7581j4580j1693r801
59382F94451q571p219o022n565n195l980k572k231k489j797j76Q02O27M59J072
59367F51594K038K983L999M656M319L536L584M614N709O659Q020R538J0296J0462
$$ y = [582149, 583765, 586248, 589273, 592634, 596689, 601536, 606696, 612027, 618005, 624620, 631045, 636865, 642560, 648209, 652880, 656071, 658606, 661198, 663060, 662978, 660936, 657726, 653621, 648491, 642759, 637316, 632750, 629302, 627158, 626150, 625597, 625025, 624698, 624990, 625819, 627280, 630262, 635676, 643422, 652747, 663343, 675521, 689532, 705216, 722182, 740017, 758454, 777756, 798953, 823573, 852703, 885375, 917120, 940890, 950987, 946830, 932694, 914165, 895474, 879390, 867755, 861641, 862010, 870038, 885138, 902271, 913089, 911209, 896139, 872078, 844185, 816361, 790837, 768201, 748106, 730525, 715945, 704252, 694451, 685880, 678661, 672639, 667074, 661879, 657899, 655327, 653096, 650607, 648810, 648634, 649436, 650063, 650522, 651594, 653632, 656615, 660614, 665270, 669589, 673125, 676709, 681323, 687032, 693691, 701711, 711249, 721545, 732007]
59353G32007J1148J2430J3208J3208J3402J4176J4734J4525J3886J3035J1827
59342H77586J0551R574Q275N746K410n58l142o121r169j1222j2527j4299j6365
59329H40739j7254j6751j6161j5963j5353j4361j4054j4257j3383j1201r484r125
59317F73392q868p828p059p387p703o844n461m611l901k462n75R66K186L565N229
59302F22639P287J0139J3551J6303J7252J6006J2289N937j914q845j3110j4789
59290F82745j4766j3662j2039j0424q627o138l419j586o14O88K698M466N546O732
59276F31600Q405R703J0110J0442J1516J2944J3931J4223J3804J2761J1766J1536
59264G72741J1518J0343P842N207L043P74j707l493m254m792n506n848n759o055
$$ y = [732007, 743155, 755585, 768793, 782001, 795403, 809579, 824313, 838838, 852724, 865759, 877586, 888137, 897711, 905986, 911732, 914142, 913584, 910442, 904321, 895152, 883930, 871403, 857104, 840739, 823485, 806734, 790573, 774610, 759257, 744896, 730842, 716585, 703202, 692001, 682517, 673392, 664524, 656696, 649637, 642250, 634547, 627703, 622242, 617631, 613730, 611268, 610693, 611659, 613845, 617410, 622639, 629926, 640065, 653616, 669919, 687171, 703177, 715466, 721403, 719489, 710644, 697534, 682745, 667979, 654317, 642278, 631854, 623227, 617089, 613670, 612084, 611470, 612158, 614856, 619322, 624868, 631600, 640005, 649708, 659818, 670260, 681776, 694720, 708651, 722874, 736678, 749439, 761205, 772741, 784259, 794602, 802444, 807651, 810694, 811468, 809761, 806268, 802014, 797222, 791716, 785868, 780109, 774054]
59250G74054o784o783n496l799k475j407o79q93j735j852p76M46J016J199R67
59235G45003l26k345l633l746l871m716n575o040o758p800q222p992q310r250
59221F66419r266q028p414q385r061p577m893l034k281j804j564j751j641o67
59207E99053M06P48P90J070J060M19M5N27R31M87J39Q73J777J461L01l08j32Q1
59189F09728J59M67Q85J005Q67O16J66k68q1N64O45j14p04n02j00J86J008K428
59171F16955L305L087K636K454J892J039J326L002M102L290J785R48O9j648k994
59156F41248k866k637m054o167o811o004n466n718n904n805n930o068n641n032
59142E67145m973n164m968m699m754m452l235k113k227k876k565j190L81J868
$$ y = [774054, 767270, 760487, 754991, 751192, 748717, 747310, 746631, 745738, 744003, 742151, 741375, 741821, 742837, 744036, 745003, 744677, 742332, 738699, 734953, 731082, 726366, 720791, 714751, 707993, 700193, 691971, 683979, 675669, 666419, 657153, 649125, 641711, 633326, 624265, 616688, 611795, 608761, 606480, 604676, 603112, 601361, 599720, 599053, 599459, 600207, 600997, 602067, 603127, 603546, 603591, 604118, 605049, 605536, 605675, 606548, 608325, 609786, 610087, 609779, 609647, 609728, 609887, 610354, 611239, 612244, 613111, 613727, 613893, 613625, 613544, 614108, 614753, 614639, 613935, 613433, 613333, 613519, 614527, 616955, 620260, 623347, 625983, 628437, 630329, 631368, 632694, 635696, 639798, 643088, 644873, 645821, 645890, 644242, 641248, 638382, 635745, 631691, 625524, 618713, 612709, 607243, 601525, 595621, 589816, 583886, 577818, 572177, 567145, 562172, 557008, 552040, 547341, 542587, 538135, 534900, 532787, 530560, 527684, 525119, 523929, 524310, 526178]
59128E26178L146L331K218J546K878N058N873N475N919P703R134R076Q363Q246
59114F04144R000J0312J1724J2600J2549J1969J1393J0713R726Q783Q116P188
59102G28217N597L835K339P28j187k691l385l963m784m986m056k972k518j890
59088G08284m13P97M11j064k291l019l564l751l818m946p294q981q696p735p648
59073F46272p569o086m138l610m204m222l506l139l191l034l112m037m777m031
59059E87616k653k342k748k275j088q05j620k196k093k013j945j197r4L68K72
59044E65187L51L68k31p00j76L55n64k135k294r47J77M33P00J305J776K440L972
59027E70017N713O522O941Q397J0650J2265J3086J3948J4474J3651J2065J1042
$$ y = [526178, 529324, 532655, 534873, 536419, 539297, 544355, 550228, 555703, 561622, 569325, 578459, 587535, 595898, 604144, 613144, 623456, 635180, 647780, 660329, 672298, 683691, 694404, 704130, 712913, 721029, 728217, 733814, 737649, 739988, 740716, 739529, 736838, 733453, 729490, 724706, 719720, 715664, 712692, 710174, 708284, 707871, 708668, 709079, 708015, 705724, 702705, 699141, 695390, 691572, 686626, 679332, 670351, 661655, 653920, 646272, 638703, 632617, 628479, 624869, 620665, 616443, 612937, 609798, 606607, 603573, 600461, 596424, 591647, 587616, 584963, 582621, 579873, 577598, 576510, 575705, 574085, 571889, 569796, 567783, 565838, 564641, 564547, 564915, 565187, 565538, 565906, 565675, 564975, 564799, 565154, 564590, 562455, 560161, 559214, 559391, 559824, 560524, 561829, 563605, 566045, 570017, 575730, 582252, 589193, 597590, 608240, 620505, 633591, 647539, 662013, 675664, 687729, 698771]
59015F98771R948P057K779p03k798m717o453o558n105l995l836l184j370M42J542
59000F81820K583L723M128L811L726L751K797J255Q43J720K181J630J266J327
58986G16561L38k027l937m218l867l679k707l57K053L252L882N134O952Q628R954
58971G35962J0906J1323J1574J2361J3408J3576J2641J1631J1235J1169J1218
58960H67004J1345J0741Q424M929J874l31k684n620q554j1315j4220j6733j7931
58947H26929j8208j8581j8536j6783j3990j2238j1750j0733q641o926o111m899
58935F79533k947j786k030k143j082J25N04O84J218J381P17l5n42j521k929l466
58919F65681k791k263k603k759k108j743k388k931k225p71N87K027L779N278O305
$$ y = [698771, 708719, 715776, 718555, 717852, 715054, 710337, 703884, 697326, 692221, 688226, 684390, 681206, 679836, 680278, 681820, 684403, 688126, 692254, 696065, 699791, 703542, 706339, 707594, 708437, 710157, 712338, 713968, 715234, 716561, 716899, 714872, 710935, 706717, 702850, 699171, 696464, 696107, 698160, 701412, 705294, 710428, 717380, 726008, 735962, 746868, 758191, 769765, 782126, 795534, 809110, 821751, 833382, 844617, 855786, 867004, 878349, 889090, 897514, 902443, 904317, 903986, 901302, 895682, 887128, 875813, 861593, 844860, 826929, 808721, 790140, 771604, 754821, 740831, 728593, 716843, 706110, 697469, 690543, 684432, 679533, 676586, 674800, 672770, 670627, 669545, 669670, 670174, 670858, 672076, 673457, 674174, 674139, 673597, 672076, 669147, 665681, 662890, 660627, 658024, 655265, 653157, 651414, 649026, 646095, 643870, 643099, 643686, 645713, 649492, 654770, 661075]
58904F61075P574R376J0972J2021J3130J4382J4947J4711J4600J4765J4225J2957
58892H14735J2387J3171J4331J5359J7149J9892K2017K2233K0973J8940J6005
58881A007192J2361Q985O048K577j559n084p459r639j1988j3479j3851j4412j5597
58868I44095j5840j4124j1703r976q500o467m524l715m040n070o698q326q947
58855H36165q846r557j1274j2147j1036r211q237p970p743p725q006p967p602
58842G18844p824q688r020q624q801r824j0055q701p257o958o848n852m661m052
58828F11679l232j473K70R42J028J264J313J010J317K650L909M324M673N436N613
58813F40723M643L663L455K992J541L50N94J316J072J17o85j632l199m578m793
$$ y = [661075, 668649, 678025, 688997, 701018, 714148, 728530, 743477, 758188, 772788, 787553, 801778, 814735, 827122, 840293, 854624, 869983, 887132, 907024, 929041, 951274, 972247, 991187, 1007192, 1019553, 1028538, 1034586, 1037163, 1035604, 1030520, 1023061, 1013422, 1001434, 987955, 974104, 959692, 944095, 928255, 914131, 902428, 892452, 883952, 877485, 872961, 869246, 865206, 860136, 853438, 845112, 836165, 827319, 817762, 806488, 794341, 783305, 774094, 765857, 757887, 750144, 742419, 734413, 726446, 718844, 711020, 702332, 693312, 684688, 675887, 666063, 656008, 647307, 640050, 633092, 626244, 620392, 615731, 611679, 608447, 606974, 607244, 608186, 609214, 610478, 611791, 612801, 614118, 616768, 620677, 625001, 629674, 635110, 640723, 645366, 649029, 652484, 655476, 657017, 657367, 657961, 659277, 660349, 660466, 659781, 658149, 654950, 650372, 645579]
58798F45579m252l967m271n185o703p951p635o077n056m962m221k314r15q06l12
58783E80952J649L420L357K495K436K700K221J705K195K973K794J840O91j122
58769F10306l843o308p607q399r109q692o709m752m085l730k644j699j633j143
58755E39953Q69L004L541L091K950K639J395L44P76J732J728J483K602M776O562
58740E77445P707Q603Q687P514O283O301P015P359P692Q549R050Q522Q133Q810
58726F87670R128P542N225M297M512M188L218K823L255L972N158O953Q141P627
58712G63709O294N503M868L367J459J07j224l613o661r219j1136j2748j3852j4651
58698G12203j6278j8826k0420j9845j8376j7401j6181j3854j1518j0236q959o690
$$ y = [645579, 641327, 637360, 633089, 627904, 621201, 613250, 605615, 599538, 594482, 589520, 585299, 582985, 582070, 581264, 580952, 582601, 586021, 589378, 591873, 594309, 597009, 599230, 600935, 603130, 606103, 608897, 610737, 611428, 610306, 606463, 600155, 592548, 584149, 575040, 566348, 559639, 554887, 550802, 547072, 544428, 542729, 541096, 539953, 540822, 543826, 547367, 550458, 553408, 556047, 557442, 557786, 558562, 560294, 562022, 563505, 566107, 570883, 577445, 585152, 593755, 602442, 609956, 616239, 622540, 629555, 636914, 644606, 653155, 662205, 670727, 678860, 687670, 696798, 704340, 709565, 713862, 718374, 722562, 725780, 728603, 731858, 735830, 740988, 747941, 756082, 763709, 770003, 775506, 780374, 783741, 785200, 785307, 784083, 780470, 773809, 764590, 753454, 740706, 726854, 712203, 695925, 677099, 656679, 636834, 618458, 601057, 584876, 571022, 559504, 549268, 540309, 533619]
58686E33619m765m566m919m236l359l687m325l811k936l051l229j926O6J103J631
58671D91609K916M332M722M987O547Q670J0013J1289J3594J5672J5698J4195J2315
58658F16559R079L504k209n167o027p325q995r175q179p882q038o956n136m600
58644E49453n114m573k765j465j146o65J58N72J064K598M324M743M381M483M109
58629E60157J673j587k946k299j726j727j152k02j22m40K72J488J596J118J830
58614E55933L378L999L834M267M652L270P91n40p18j400k217j302Q22J624O48
58599E77041k38m75j268k553k868k219j911j704l66J416J962K021L726O498P650
58584E86712O908O776Q283R898J0647J1075J1041R811Q257P902Q037O903N266
$$ y = [533619, 528854, 524288, 519369, 515133, 511774, 508087, 503762, 499951, 497015, 493964, 490735, 488809, 488875, 489978, 491609, 494525, 498857, 503579, 508566, 515113, 523783, 533796, 545085, 558679, 574351, 590049, 604244, 616559, 625638, 629142, 626933, 621766, 615739, 608414, 599419, 590244, 582065, 574183, 566145, 559189, 554053, 549453, 544339, 539766, 537001, 535536, 534390, 533725, 533883, 534455, 535519, 538117, 542441, 547184, 551565, 556048, 560157, 561830, 560243, 557297, 554998, 553272, 551545, 550393, 550191, 550069, 549629, 549901, 551389, 552985, 554103, 555933, 559311, 563310, 567144, 571411, 576063, 579333, 580124, 579584, 578866, 577466, 575249, 573947, 574769, 576393, 577041, 576803, 576328, 575060, 572507, 569639, 567420, 565509, 563805, 563439, 564855, 566817, 568838, 572564, 579062, 586712, 593620, 600396, 608679, 618577, 629224, 640299, 651340, 661151, 669408, 677310, 685347, 692250, 697516]
58571F97516N409P098Q171Q666J0667J4208J7184J9191K1762K4828K6606K6992
58559H88298K7379K7231K4549J9716J5166J1329O589J171k792n009p075q888q860
58546I88804p672p767r164r699r393j0481j3086j4994j5906j7664k0059k0639
58534H32280j9028j7396j6368j4562j2298j1506j1704j0348p437n524m962l632
58522F97515j578j199k466k709j640j771l306l544k144j927l458l872k293j407
58508F64201k311k655j415q22j848k356j367q33j553j657n88l58j408j549l20
58493F43161N6p58k38K080L402K863L101N128O462O096O505Q815J0670J0902J1676
58478G19921J3935J5250J4295J3071J2616J0925P082L185L14l060o987q910q410
$$ y = [697516, 702925, 710023, 718194, 726860, 737527, 751735, 768919, 788110, 809872, 834700, 861306, 888298, 915677, 942908, 967457, 987173, 1002339, 1013668, 1020257, 1021428, 1018636, 1013627, 1006552, 997664, 988804, 981132, 973365, 964201, 954502, 945109, 934628, 921542, 906548, 890642, 872978, 852919, 832280, 813252, 795856, 779488, 764926, 752628, 741122, 729418, 719070, 711633, 706109, 701147, 697515, 695937, 694738, 692272, 689563, 687923, 686152, 682846, 679302, 677158, 675231, 671773, 667901, 665608, 664201, 661890, 659235, 657820, 656998, 655150, 652794, 651427, 650594, 649041, 647384, 646796, 646438, 645030, 643481, 643161, 643217, 642459, 642221, 644301, 647703, 650566, 653667, 658795, 665257, 671353, 677858, 686673, 697343, 708245, 719921, 733856, 749106, 763401, 776472, 789088, 800013, 807095, 810280, 810594, 807534, 800547, 791637, 783227]
58465G83227q351r601r421o845m547l597j572K066M184L937M943Q783J1837J1555
58451G86598J0508J0880J0208O229J244k045m600p583r215q465p659q222p940
58438G69938n528l481l431l098r68N36j68m81J562L627L639L646N588P499P431
58423G86311P104Q170Q827P435N528M221J752k405n327n579n899q004r313p995
58409G84826o552p071p568o377n421n869n324k702j003j824k125J49K360K595
58395G38094L329N953P209N190L398M502N477L464J136J491K480J651J131L099
58381G87604N176N105N279P884J0322J0091R350J0122J0009P263N026N729O535
58368H85495M990L854N445O818N583M907P415R877R333Q702J0701J2061R703O827
$$ y = [783227, 774876, 765275, 755854, 749009, 744462, 740865, 739293, 741359, 745543, 749480, 754423, 763206, 775043, 786598, 797106, 807986, 818194, 824423, 825667, 823622, 819022, 811439, 802224, 793759, 786100, 777878, 769938, 764410, 760929, 757498, 754400, 753432, 753968, 753800, 753319, 754881, 758508, 762147, 765793, 771381, 778880, 786311, 793415, 801585, 810412, 817847, 823375, 827596, 829348, 826943, 821616, 816037, 810138, 802134, 792821, 784826, 778274, 771203, 763635, 757258, 751837, 745968, 740644, 737942, 736939, 735115, 732990, 733139, 735499, 738094, 741423, 747376, 754585, 759775, 763173, 767675, 773152, 776616, 777752, 779243, 781723, 783374, 784505, 787604, 792780, 797885, 803164, 811048, 821370, 831461, 840811, 850933, 860942, 868205, 873231, 878960, 885495, 890485, 894339, 899784, 906602, 912185, 917092, 924507, 934384, 943717, 952419, 963120, 975181, 984884, 991711]
58354I91711O793O736L557N12J234K863J778O48K986N972N642M101M908O397O132
58339A051970O665J0239J3280J2795J2460J5619J8341J6617J4139J5276J6575
58328A203976J3414R016Q353Q886N990K107J759K857J526K88K761N634M568K674
58314A273809M469P051O170N191Q739J3238J3278J1632J3352J5773J4283J2108
58302A399093J4227J7364J6386J4680J7554K1321J9934J6545J7325J9714J8329
58291A592472J6440J9706K4345K3735K0979K2575K5516K3456J9788K1404K5182
58280A835598K4197K1652K4787L0444L0917K8801L1619L6991L7816L6891M1296
58269B181009M7512M7477M4358M6719N2160N2662N0898N4790O1023O0886N7453
$$ y = [991711, 998504, 1005240, 1008797, 1009309, 1010543, 1013406, 1015184, 1015832, 1018818, 1024790, 1030432, 1034533, 1039441, 1045838, 1051970, 1058635, 1068874, 1082154, 1094949, 1107409, 1123028, 1141369, 1157986, 1172125, 1187401, 1203976, 1217390, 1226406, 1234759, 1243645, 1249635, 1251742, 1253501, 1256358, 1257884, 1258172, 1260933, 1266567, 1271135, 1273809, 1278278, 1285329, 1291499, 1296690, 1305429, 1318667, 1331945, 1343577, 1356929, 1372702, 1386985, 1399093, 1413320, 1430684, 1447070, 1461750, 1479304, 1500625, 1520559, 1537104, 1554429, 1574143, 1592472, 1608912, 1628618, 1652963, 1676698, 1697677, 1720252, 1745768, 1769224, 1789012, 1810416, 1835598, 1859795, 1881447, 1906234, 1936678, 1967595, 1996396, 2028015, 2065006, 2102822, 2139713, 2181009, 2228521, 2275998, 2320356, 2367075, 2419235, 2471897, 2522795, 2577585, 2638608, 2699494, 2756947]
58258B756947N9743O4921O3933N9691O1521O6687O6069O3025O7405P5946P8398
58247C484286P7963Q5216R6943J02017J03172J11166J22680J26582J26911J36041
58237D572977J50215J56201J57146J66534J81607J89148J92680K06508K27531
58228F200547K41286K51082K71674K99088L17646L31922L59314L96064M24708
58219I093331M49990M91328N44902N91395O36049P00631P81064Q56299R33741
58210A5078730J039670J170206J301787J444865J633236J865658K117134K403439
58202B8054725K771468L232611L777995M454254N343793O473212P826494R437191
58194G1371743J1363981J3593821J6108301J9042702K2625172K6978435L2174333
$$ y = [2756947, 2816690, 2881611, 2945544, 3005235, 3066756, 3133443, 3199512, 3262537, 3329942, 3405888, 3484286, 3562249, 3647465, 3744408, 3846425, 3949597, 4060763, 4183443, 4310025, 4436936, 4572977, 4723192, 4879393, 5036539, 5203073, 5384680, 5573828, 5766508, 5973016, 6200547, 6441833, 6692915, 6964589, 7263677, 7581323, 7913245, 8272559, 8668623, 9093331, 9543321, 10034649, 10579551, 11170946, 11806995, 12507626, 13288690, 14144989, 15078730, 16118400, 17288606, 18590393, 20035258, 21668494, 23534152, 25651286, 28054725, 30826193, 34058804, 37836799, 42291053, 47634846, 54108058, 61934552, 71371743, 82735724, 96329545, 112437846, 131480548, 154105720, 181084155, 213258488]
58187B13258488L8336132M5045126N0249351N0292633M2058251K5651982M890780
58180D69782743j4999394l0233061l9550549m3511161m3423872m0737053l6716620
58173B20611033l2226675k7740574k3537089j9804518j6600857j3871957j1564687
58166G5264676r663115q121329o850602n789945m923764m222778l631191l121000
58158B8940952k701287k364510k074789j816113j603117j436019j289368j152405
58150A4503344j038561r47901q59477p67886o90525o31784n74524n13226m62422
58141H017038m25940l89395l49650l21466l08210k94379k73705k57653k49726
58132E146914k37606k17405k00997j92540j81217j63589j50528j45625j38328
$$ y = [213258488, 251594620, 296639746, 346889097, 397181730, 439239981, 464891963, 469782743, 454783349, 424550288, 384999739, 341488578, 298064706, 257327653, 220611033, 188384358, 160643784, 137106695, 117302177, 100701320, 86829363, 75264676, 65601561, 57480232, 50629630, 44839685, 39915921, 35693143, 32061952, 28940952, 26239665, 23875155, 21800366, 19984253, 18381136, 16945117, 15655749, 14503344, 13464783, 12516882, 11657405, 10889519, 10198994, 9567210, 8992686, 8479460, 8017038, 7591098, 7201703, 6852053, 6530587, 6222377, 5927998, 5654293, 5396640, 5146914, 4909308, 4691903, 4490906, 4298366, 4117149, 3953560, 3803032, 3657407, 3519079]
58123C519079j24756j14676j11760j06805r6450q9512q8964q6028p7751p2625
58113B549752p3400p1667o4664o0541o1870o0495n3873n0289n2739n3304m8697
58102A898213m5975m7809m7144m1672l8860m1340m1499l5938l1423l1311k9672
58091A465570k4162k1392k4019k5241k1585j8903k0438k0970j8019j7033k0307
58080A233501k2148k0082j9620k2991k4304k0899j8549k0358k1222j8314j6488
58069A008526j8203j8396j4574j1940j3350j3989j1049r061j0573j1007p835n623
58057H62926p064q077o642p289j1760j4379j1949r405j0450j1266q784o678p610
58044G41573p906n322m036o461q091n995m555p091r457p878n794o941q530p339
$$ y = [3519079, 3394323, 3279647, 3167887, 3061082, 2964632, 2875120, 2786156, 2700128, 2622377, 2549752, 2476352, 2404685, 2340021, 2279480, 2217610, 2157115, 2103242, 2052953, 2000214, 1946910, 1898213, 1852238, 1804429, 1757285, 1715613, 1676753, 1635413, 1593914, 1557976, 1526553, 1495242, 1465570, 1441408, 1420016, 1395997, 1370756, 1349171, 1330268, 1309830, 1288860, 1270841, 1253808, 1233501, 1211353, 1191271, 1171651, 1148660, 1124356, 1103457, 1084908, 1064550, 1043328, 1025014, 1008526, 990323, 971927, 957353, 945413, 932063, 918074, 907025, 897964, 887391, 876384, 868549, 862926, 855862, 847785, 841143, 833854, 822094, 807715, 795766, 786361, 775911, 764645, 755861, 749183, 741573, 733667, 728345, 724309, 717848, 709757, 703762, 699207, 692116, 682659, 674781, 668987, 662046, 653516, 646177]
58030F46177n997p422r135q677q677j1191j2935j1295r277r494r170o076l477
58017E33354m091m881k947q80j332j948p30o05l499n512l429o10j032k626k016
58002D97216q20j655k629j297K47m94j443j88J139K13m95J733M440M195K447K177
57986E04786K403R74o91m82L0j357l249l705m094n891p131o098n005n835o355
57971D58300m354k105k155k502n40J745J293n73q80j99n55r83K63J718J196j61
57955D49508k72or99k231k302k385l520l921k360j026j576j835L8J764J189N98
57939D30664K540N042N411N301P298R763J0015R531J0885J2312J0486O377L235
57926E28860R28k678o691q560q857r980j1516j1384j0182j0038j0481r618q068
$$ y = [646177, 640180, 632758, 623623, 614946, 606269, 595078, 582143, 570848, 561571, 552077, 542907, 536831, 533354, 529263, 524382, 521435, 520555, 519223, 517275, 516545, 515940, 512441, 506929, 503500, 502890, 501858, 499232, 497216, 496396, 494741, 492112, 490815, 491062, 490568, 489125, 488937, 490076, 490289, 489794, 491527, 495967, 500162, 502609, 504786, 507189, 508163, 507472, 506990, 507020, 505663, 502414, 498709, 494615, 488724, 481593, 475495, 470490, 464655, 458300, 453946, 451841, 449686, 447184, 446644, 448389, 449682, 449109, 448229, 448030, 447475, 446492, 446755, 448473, 449669, 449508, 449236, 449230, 448231, 446000, 443698, 441313, 437793, 433872, 431512, 430486, 428910, 427075, 427113, 428877, 430066, 430664, 433204, 438246, 443657, 448958, 456256, 466019, 476034, 485565, 496450, 508762, 519248, 525625, 528860, 529788, 527110, 520419, 511859, 503002, 493022, 481506, 470122, 459940, 449902, 439421, 429803, 421735]
57913D21735p678p646n970l393k057j502J19K165K584J668J119O42r49k585k392
57898C95860j138q42j306j133p18j013r32P04K330K057J195K013L765M367M157
57883D09366M512M534K892J145J469K683K265P43K17K34r19k301j769m8N16P6
57867D25615L79J029N31k48M94J806J611P27J350K792K883K359L497N379N025
57852D55229K609J163J419J243k1o68k49k37j053j784k670m472n841m807k484
57837D37377j771k722k839j496l91Q8J169K510K478J517J689K873L037K226K535
57822D48280M065M643L832L516M073L614J667J38j64p94k700m931o958r422j1938
57807D36921j2884j2011j0844j0117r177q022p420o947n518l788l346l716l036
$$ y = [421735, 414057, 406411, 400441, 397048, 394991, 393489, 393608, 395773, 398357, 400025, 401144, 401786, 400837, 398252, 395860, 394722, 393880, 392574, 391441, 390723, 389710, 388778, 389482, 391812, 393869, 395064, 397077, 400842, 405209, 409366, 413878, 418412, 421304, 422449, 423918, 426601, 428866, 429609, 429826, 430060, 429141, 426840, 425071, 425023, 425539, 425615, 425994, 427023, 427554, 427306, 427800, 429606, 431217, 431944, 433294, 436086, 438969, 441328, 444825, 450204, 455229, 457838, 459001, 460420, 461663, 461642, 460974, 460725, 460488, 459435, 457651, 454981, 450509, 444668, 439861, 437377, 435606, 432884, 430045, 428549, 428158, 428246, 429415, 431925, 434403, 435920, 437609, 440482, 443519, 445745, 448280, 452345, 456988, 460820, 464336, 468409, 472023, 473690, 473828, 473664, 472870, 470170, 465239, 458281, 448859, 436921, 424037, 412026, 401182, 391065, 381888, 373866, 366446, 359499, 353981, 350193, 346847, 343131, 340095]
57794C40095j535j253k284k530j415o73r82r19K05J309J929K885M062M219L462
57779C46575L283L861L925L551M244N876O476N483M459L959K663K39j663k168
57765C90763k362k933l133k823l158m423n311n102m475l802k671j463j187j471
57751C46449q67N90J442J485J996L152L665L239K933K945K403J498J287J398N65
57736C74180o59n52M61K88r76r96O37J621R91N10J113J317L26m12p8L7p13r49
57718C76146MO88J36o00p96j347k415k481j132k80j105k153j956j231r97p67j56
57701C59558o5q69j309n88L79Q82J487K181J773K29p14m30m43j366j581m13J72
57684C58883j051k104r94R97J663J504K461M608O642Q485J1104J4587J8461K3122
$$ y = [340095, 338560, 337307, 335023, 332493, 331078, 330405, 329423, 328504, 328709, 330018, 331947, 334832, 338894, 343113, 346575, 349858, 353719, 357644, 361195, 365439, 371315, 377791, 383274, 387733, 391692, 394355, 394594, 392931, 390763, 388401, 385468, 382335, 379512, 376354, 371931, 366620, 361518, 357043, 353241, 350570, 349107, 347920, 346449, 345582, 346172, 347614, 349099, 351095, 354247, 357912, 361151, 364084, 367029, 369432, 370930, 372217, 373615, 374180, 373521, 372969, 373430, 373718, 372742, 371746, 372383, 374004, 374995, 375505, 376618, 377935, 378261, 377849, 377771, 377808, 377095, 376146, 376150, 376838, 376974, 376374, 375578, 374231, 371816, 369335, 368203, 367923, 366818, 364665, 362709, 361478, 360481, 359714, 359558, 359493, 358624, 357315, 356727, 357106, 357988, 359475, 361656, 363429, 363658, 362944, 362514, 362071, 360705, 359124, 358711, 358883, 357832, 355728, 354734, 355731, 357394, 358898, 361359, 365967, 372609, 381094, 392198, 406785, 425246, 448368]
57670D48368K9299L6733M4952N4425O5335P5397Q0076P4878N7584K9749k960l3099
57658I60737n5327o8069p2035o9022o2186n5020m8767m2278l5003k8343k3385
57647D01302j9374j5407j1906r346p279n502m546m220l492k354j873j764m14J903
57633C15728K486K28k416k987k175j676j288k44N47j10j574k494k786k943k812
57618B95484k483k793l616l290j237O78Q55J78qj39r39j559j171o70r30j124n46
57601B76690l51j388k222j470m37j033k612l307l118l224l405k662j517j288j811
57586B46845j978j746j686j421m73K76j22q28o38k50j026k417k842k372k311k754
57570B24257k655j946j531j571j556j617k090k301j529n84p55j682j987j418p67
$$ y = [448368, 477667, 514400, 559352, 613777, 679112, 754509, 834585, 909463, 967047, 996796, 993836, 960737, 905410, 837341, 765306, 696284, 634098, 579078, 530311, 488033, 453030, 424687, 401302, 381928, 366521, 354615, 345269, 337990, 332488, 327942, 323722, 320230, 317876, 316003, 314239, 313825, 315728, 318214, 318442, 316026, 313039, 310864, 309188, 307900, 307656, 308203, 308093, 306519, 304025, 301239, 298296, 295484, 293001, 290208, 286592, 283302, 282065, 282743, 283598, 283776, 283768, 283629, 282690, 281131, 279960, 279290, 278360, 277236, 276690, 276339, 274951, 272729, 271259, 270822, 269789, 267177, 263870, 260752, 257528, 254123, 251461, 249944, 248656, 246845, 244867, 243121, 241435, 240014, 239541, 239817, 239695, 238867, 238229, 237979, 236953, 234536, 231694, 229322, 227011, 224257, 221602, 219656, 218125, 216554, 214998, 213381, 211291, 208990, 207461, 206877, 206122, 204440, 202453, 201035, 200268]
57555B00268k16M48O66j26j057q58J73P73P56Q15R48P36O10J193J940J982J807
57538B10858K479L721M394M223L650K593J031N1O02J798K161J886K143K784K619
57523B46993J553N87J54NL44J370K189J825Q96O89J133J274J092J119R07k24j427
57506B60479j264j3P04L38l29r38j795k616k775k584k774l025k510j554j129j195
57490B37020j039p82r09r49l29J59m57j326r63J60L50n06j037r37j101j446q67
57473B25041N66J475J392J164J120O68j66o30p22j119j654j574j130j154j346
57458B21931q08%j13p15k59J143J748R90J26j29m13r02q45l00k39n39O1J590K432
57439B24759J858J031Q95R43O76N30P15P34N94R45J600J556P84L48M29M7r40j410
$$ y = [200268, 200052, 200500, 201166, 201040, 199983, 199125, 199298, 200071, 200827, 201642, 202590, 203326, 203936, 205129, 207069, 209051, 210858, 213337, 217058, 221452, 225675, 229325, 231918, 232949, 233000, 233602, 235400, 237561, 239447, 241590, 244374, 246993, 248546, 249133, 249287, 249292, 249636, 251006, 253195, 255020, 255916, 256605, 257738, 259012, 260104, 261223, 262130, 261906, 260479, 259215, 259202, 259906, 260244, 259915, 258977, 257182, 254566, 251791, 249207, 246433, 243408, 240898, 239344, 238215, 237020, 235981, 235199, 234290, 233341, 233012, 233171, 232714, 231388, 230425, 230585, 230935, 230429, 229392, 228455, 227354, 225908, 225041, 225607, 227082, 228474, 229638, 230758, 231426, 231260, 230630, 229908, 228789, 227135, 225561, 224431, 223277, 221931, 221123, 221123, 221010, 220295, 220036, 221179, 222927, 223917, 224043, 223914, 223501, 222599, 221754, 221454, 221215, 220676, 220737, 222327, 224759, 226617, 227648, 228543, 229486, 230162, 230692, 231407, 232141, 232735, 233680, 235280, 236836, 237620, 237968, 238397, 238444, 237504, 236094]
57421B36094j037p89r22m17R16J715J273O44P56J009P21L03K54L21M52J109K002
57404B44404J939O94m75p46o94p78m81K64M50k91p90j28R46J329J076Q26P64Q94
57386B49203J326J696J372O72P08J659K459K523K415K397J879Q37K76O18J070
57371B71110J146J414K028K062J121K32K97Q31R55N93M5n17o90m5R31J256R82
57354B83751J012J370J213O68Q46J773K221J985K274L291L525K258P57J47l6k38
57338C06817J17R89J124K06k42O57J622J454R91J363K105K380K477K627J950J95
57322C26832j047m64R13J373R26N75M64L72Q06K016K907K474J417J008J276J544
57306C43392J716J902J782J482J865K887L035J648L10N95J875K787L382M195M612
$$ y = [236094, 235057, 234268, 233346, 232929, 233845, 235560, 236833, 237477, 238233, 239242, 239963, 240266, 240520, 240841, 241293, 242402, 244404, 246343, 247037, 246562, 245816, 245122, 244344, 243863, 244127, 244577, 244286, 243496, 243368, 244314, 245643, 246719, 247545, 248309, 249203, 250529, 252225, 253597, 254269, 254977, 256636, 259095, 261618, 264033, 266430, 268309, 269146, 269422, 270040, 271110, 272256, 273670, 275698, 277760, 278881, 279113, 279410, 280241, 281196, 281789, 281834, 281317, 280627, 280582, 281513, 282769, 283751, 284763, 286133, 287346, 288014, 288860, 290633, 292854, 294839, 297113, 300404, 303929, 306187, 306944, 307091, 307055, 306817, 306934, 307923, 309047, 309253, 309011, 309668, 311290, 312744, 313735, 315098, 317203, 319583, 322060, 324687, 326637, 326832, 325785, 325321, 326234, 327607, 328533, 329108, 329572, 329944, 330750, 332766, 335673, 338147, 339564, 340572, 341848, 343392, 345108, 347010, 348792, 350274, 352139, 355026, 358061, 359709, 360019, 360614, 362489, 365276, 368658, 372853, 377465]
57291C77465L999L246L419M008M127M268N061N607N033M450N284O664O759N866
57277D45256N838P023Q010Q122P951P581O367M522L156K565K027J333J052J236
57263E12039J201P36L92O00J342K541L898M722M832N086O149P325P625P338P412
57248E73238P923Q341Q587Q827Q802Q506Q743R882J0845J0600R812R756J0345
57235F94207J0645J0615J0866J1440J2091J3148J4787J6127J6377J6096J6072
57224H42471J5932J5193J4703J5419J6690J7346J7602J8303J9223J9796K0548
57213A033226K2027K3343K3670K4079K5751K7384K6860K4692K3292K3351K3465
57202A301140K3009K2775K2856K2337K1262K0673K0592K0082J9263J9265K0082
$$ y = [377465, 381464, 384710, 388129, 392137, 396264, 400532, 405593, 411200, 416233, 420683, 425967, 432631, 439390, 445256, 451094, 458117, 466127, 474249, 482200, 489781, 496148, 500670, 503826, 506391, 508418, 509751, 510803, 512039, 513240, 513976, 514368, 514968, 516310, 518851, 522749, 527471, 532303, 537389, 543538, 550863, 558488, 565826, 573238, 581161, 589502, 598089, 606916, 615718, 624224, 632967, 642849, 653694, 664294, 674106, 683862, 694207, 704852, 715467, 726333, 737773, 749864, 763012, 777799, 793926, 810303, 826399, 842471, 858403, 873596, 888299, 903718, 920408, 937754, 955356, 973659, 992882, 1012678, 1033226, 1055253, 1078596, 1102266, 1126345, 1152096, 1179480, 1206340, 1231032, 1254324, 1277675, 1301140, 1324149, 1346924, 1369780, 1392117, 1413379, 1434052, 1454644, 1474726, 1493989, 1513254, 1533336]
57191A533336K0658K1073K2415K4461K5698K5836K6049K6577K6423K5705K5878
57180A804109K7121K7831K7388K7174K8131K9422L0362L1560L3228L4317L4386
57169B135029L4512L5346L5988L5771L5479L5752L5860L5198L4552L4753L5384
57158B523624L5834L6361L7193L7735L7641L7561L8020L8553L8707L8717L8627
57147B938573L7920L6685L5914L5944L5874L5242L4882L5388L5996L5976L5819
57136C334213L6136L6548L6697L7194L8511L9915M0574M0833M1478M2530M3765
57125C768394M5580M8356N1609N4649N7545O0687O4053O7612P1888P7497Q4653
57114D452523R3586J04759J18182J33226J49485J67078J85863K05351K26020K49843
$$ y = [1533336, 1553994, 1575067, 1597482, 1621943, 1647641, 1673477, 1699526, 1726103, 1752526, 1778231, 1804109, 1831230, 1859061, 1886449, 1913623, 1941754, 1971176, 2001538, 2033098, 2066326, 2100643, 2135029, 2169541, 2204887, 2240875, 2276646, 2312125, 2347877, 2383737, 2418935, 2453487, 2488240, 2523624, 2559458, 2595819, 2633012, 2670747, 2708388, 2745949, 2783969, 2822522, 2861229, 2899946, 2938573, 2976493, 3013178, 3049092, 3085036, 3120910, 3156152, 3191034, 3226422, 3262418, 3298394, 3334213, 3370349, 3406897, 3443594, 3480788, 3519299, 3559214, 3599788, 3640621, 3682099, 3724629, 3768394, 3813974, 3862330, 3913939, 3968588, 4026133, 4086820, 4150873, 4218485, 4290373, 4367870, 4452523, 4546109, 4650868, 4769050, 4902276, 5051761, 5218839, 5404702, 5610053, 5836073, 6085916]
57104F085916K79055L15366L60939M19056M93094N85732O99955Q39895J009710
57095A1088718J211786J445949J708961J993717K289921K586887K875653L148031
57087B8349623L394148L601381L754922L838871L837659L737397L525975L192531
57079E7232507K729707K139605J439196O60035j57308r69554j734891k415962
57071E8923335k983747l421939l728799l913564l988993l965978l854291l666627
57063B9399397l420071l133794k826465k515115k213859j932222j675209j445238
57055A0237424j243271j068430r18300p90370o82420n91477n13964m47386l90663
57046C591143l42508l00755k63932k32076k05279j82521j62582j44919j28971
$$ y = [6085916, 6364971, 6680337, 7041276, 7460332, 7953426, 8539158, 9239113, 10079008, 11088718, 12300504, 13746453, 15455414, 17449131, 19739052, 22325939, 25201592, 28349623, 31743771, 35345152, 39100074, 42938945, 46776604, 50514001, 54039976, 57232507, 59962214, 62101819, 63541015, 64201050, 64043742, 63074188, 61339297, 58923335, 55939588, 52517649, 48788850, 44875286, 40886293, 36920315, 33066024, 29399397, 25979326, 22845532, 20019067, 17503952, 15290093, 13357871, 11682662, 10237424, 8994153, 7925723, 7007423, 6217053, 5534633, 4943156, 4429192, 3981806, 3591143, 3248635, 2947880, 2683948, 2451872, 2246593, 2064072, 1901490, 1756571, 1627600]
57037A627600j13728r8866q5242p3392o2428n1148l9398k7381j4325J160J9276
57026A082128L7514N0284N0764L5103O135k7644n7451p8453q9746r2446q8835
57015H27353q1869p3843o5654n7648n0424m4338l9092l4340l0092k6270k2615
57004C01168j9240j6451j4057j1736j0008r556r744r185p823o898o700o115m690
56991A68965l332k502j432L35K280M383P411J1190J4302J6090J6972J6191J1603
56978B62456K999o452j3442j7475j9432j9398j7533j5293j3748j2058r189n849
56966A15586l190j009J270L272M879P287J1189J5422J9049K3091K8028L1070K8449
56953B84393J9742P890m106j4414k1381k4052k3621k2356k1026j8849j5550j1898
$$ y = [1627600, 1513872, 1415006, 1329764, 1256372, 1193944, 1142796, 1103398, 1076017, 1061692, 1062852, 1082128, 1119642, 1169926, 1220690, 1255793, 1261928, 1234284, 1176833, 1098380, 1008634, 916188, 827353, 745484, 671641, 605987, 548339, 497915, 453577, 414485, 380145, 350053, 323783, 301168, 281928, 265477, 251420, 239684, 229676, 220120, 210376, 201191, 193368, 186470, 179770, 173655, 168965, 165633, 163131, 161699, 162034, 164314, 168697, 176108, 187298, 201600, 217690, 234662, 250853, 262456, 265455, 259003, 245561, 228086, 208654, 189256, 171723, 156430, 142682, 130624, 121435, 115586, 112396, 111387, 112657, 115929, 120808, 128095, 139284, 154706, 173755, 196846, 224874, 255944, 284393, 304135, 312025, 307919, 293505, 272124, 248072, 224451, 202095, 181069, 162220, 146670, 134772]
56941A34772q456n284k597l63K239N804R777J3658J8220K4132L0313L5071L7650
56928B94936L6993L0524J6817j053j7270k8245l4103l6037l4779l1624k8340k5378
56916A42441k1883j7743j4082j1522r606q088p252o769n813m524l904m005l668
56903B3582k341q35P5O03J138J658K221L169M530O018P637R603J1724J3677J5734
56888I8193J8390K1581K4960K8445L1412L1905K7983J9781R372j054r872j5685
56876B85411j7855j7269j5394j2732r240n644k935p64K187O353J1053J5982K1631
56863B60784K8209L5375M3182N2154O1903P0066P2580O5292M6591J9701q310l0875
56851G16652m5309n1993n2101m7345m0359l3201k5935j7983r910k434N169J3855
$$ y = [134772, 126316, 121032, 118435, 118072, 120311, 126115, 135892, 149550, 167770, 191902, 222215, 257286, 294936, 331929, 362453, 379270, 378217, 360947, 332702, 298599, 262562, 227783, 196159, 167819, 142441, 120558, 102815, 88733, 77211, 67605, 59517, 52265, 45496, 39683, 35159, 31255, 27250, 23582, 21241, 20406, 20481, 21084, 22222, 23880, 26101, 29270, 33800, 39818, 47455, 57058, 68782, 82459, 98193, 116583, 138164, 163124, 191569, 222981, 254886, 282869, 302650, 312022, 310968, 301096, 285411, 267556, 250287, 234893, 222161, 212921, 207277, 204342, 203578, 205765, 212118, 223171, 239153, 260784, 288993, 324368, 367550, 419704, 481607, 551673, 624253, 689545, 736136, 755837, 747527, 716652, 671343, 619350, 567249, 519904, 479545, 446344, 420409, 402426, 392516, 390082, 395251, 409106]
56839D09106K2986L1571M0552N1784O5576Q1073R7706J13198J20679J11475Q2333
56828A228039L8738q908n0738q0126r4813r7250r2460q4362p4462o3492n2408
56817E67758m1571l0673j9910r991q38Q392J7939K7519L7697M9692O3404P6420
56805G45838Q4461Q2144O5029L3718m145l8210o2234p5790q0760p8958p2754o4841
56793E33498n6369m7139l7776k9684k2790j5701q274j813L586R500J6616K4006
56781C67660L1262L8662M4364M4137L5340J9514L39j8856l4879m4729m7834m6705
56769C88275m4063m0499l5752l0531k5776k1596j8024j5520j3806j1659q820o745
56757A15484o487p120p216o617n861n036m136l470k986k202j291j054j462j482
$$ y = [409106, 432092, 463663, 504215, 555999, 621575, 702648, 800354, 913552, 1034231, 1145706, 1228039, 1266777, 1257869, 1207131, 1127005, 1032192, 934942, 842482, 758120, 683658, 620166, 567758, 526187, 495514, 475604, 465613, 464775, 473167, 491106, 518625, 556322, 606014, 669418, 745838, 830299, 912443, 977472, 1011190, 1007045, 968835, 906601, 830811, 750051, 671093, 598339, 533498, 477129, 429990, 392214, 362530, 339740, 324039, 315765, 313952, 317538, 327038, 343654, 367660, 398922, 437584, 481948, 526085, 561425, 580939, 581278, 562422, 527543, 482814, 434980, 388275, 344212, 303713, 267961, 237430, 211654, 190058, 172034, 156514, 142708, 131049, 122229, 115484, 108997, 101877, 94661, 88044, 82183, 77147, 73011, 69541, 66555, 64353, 63062, 62008, 60546, 59064]
56743E9064p95k80l99n28l42l18m60p5P17R15L83M1oo32j567j297L16J470J297
56724E7504J116J839K315J553N16L36N25L79M19R86J151M48J43J190K411K245
56708G5076J063J98p5j71Q1Q51J430J232P49M84j0r29j292l70R79J601J634J736
56690H4267J757J298P75P62J048J160J067P71J74k25L61J485J611L69q16q89m60
56673I4515k64k1L78K03n76p57J96J219J520J755K388K604J912J093O16j67j248
56656A05366j367k59M17k37q44k75M26K18J01J010J698Q68l12l4J194J745J710
56639A11425K239L076K969J941J101P30K82k78n70o72p03l02M12M15n85j327j014
56622A19139p54j583k529k296j497j416j730j314l23K82L86L67k3r45j575j379
$$ y = [59064, 58269, 57989, 57590, 57062, 56720, 56402, 55942, 55867, 56584, 57499, 57882, 57923, 57917, 57285, 55718, 54421, 54737, 56207, 57504, 58620, 60459, 62774, 64327, 64843, 65179, 65704, 66083, 66502, 67488, 68639, 69087, 69230, 70420, 72831, 75076, 76139, 76337, 76262, 76091, 76172, 77023, 78453, 79685, 80434, 80918, 80908, 79979, 78687, 78317, 79296, 80897, 82531, 84267, 86024, 87322, 88097, 88859, 89907, 91067, 92134, 92905, 93079, 92854, 93215, 94700, 96311, 96680, 95864, 94975, 94515, 94251, 94230, 94608, 94811, 94235, 93478, 93674, 94893, 96413, 98168, 100556, 103160, 105072, 106165, 106781, 106614, 105366, 103999, 103740, 104157, 103920, 103076, 102801, 103227, 103445, 103546, 104556, 106254, 107122, 106810, 106776, 107970, 109715, 111425, 113664, 116740, 119709, 121650, 122751, 123481, 123763, 123485, 122915, 122243, 121540, 121238, 121650, 122065, 121480, 120153, 119139, 118385, 116802, 114273, 111977, 110480, 109064, 107334, 106020, 105697, 105979, 106365, 106732, 106709, 105764, 104189, 102810]
56606A02810j194j686j941j073OK0n70n73q7J23K29P74J416J654J822K083J676
56589A05489M61j96M90J259Q96K21M08R20R07R96J755J990O38j039j255l48L63
56572A13955R40J906K428J694Q18J166K041K198K257L361M773N216N342O306P168
56557A61569O307M387L296L071K435J452J073R40J74n02O9J018P61j42n0O93M74
56540A87025m80m98N16J070O97J58m70j546k340k081j774k643l575k775j054p00
56524A69530j751k273j733j286j184o70r7m20j057q95p37j956l421k873q66j09
56508A48202j135j947j797j954k673k680j992k128l093l104j786p74o87k98P75
56493A22929J277Q49P24J330J598J148R04J077Q56L76P44J822K287J997K018K242
$$ y = [102810, 101616, 99930, 97989, 96916, 96922, 96942, 96372, 95799, 95712, 95835, 96064, 96838, 98254, 99908, 101730, 103813, 105489, 105950, 105754, 106244, 107503, 108399, 108620, 109028, 109948, 110855, 111851, 113606, 115596, 116234, 115195, 113940, 113592, 113955, 114895, 116801, 119229, 120923, 121741, 122907, 124948, 127146, 129403, 132764, 137537, 142753, 148095, 154401, 161569, 167876, 172263, 175559, 178630, 181065, 182517, 183590, 184530, 184704, 184202, 184271, 185289, 186050, 185908, 185858, 186551, 187025, 186545, 186047, 186563, 187633, 188330, 188488, 188018, 186472, 184132, 182051, 180277, 177634, 174059, 171284, 170230, 169530, 167779, 165506, 163773, 162487, 161303, 160633, 160536, 160116, 159059, 158164, 157427, 155471, 152050, 149177, 148311, 148202, 147067, 145120, 143323, 141369, 138696, 136016, 134024, 131896, 128803, 125699, 123913, 123139, 122452, 122154, 122929, 124206, 125055, 125779, 127109, 128707, 129855, 130759, 131836, 132692, 133068, 133812, 135634, 137921, 139918, 141936, 144178]
56477A44178J477k5o67k67j16k34O74K311K686J384K50K96M44m7l93j46N4J19
56459A51978P52J692J831J292J246J596J162J12k44Ql77j129p58M92Q58L39P57
56442A61607K271K847J672K44m06q30j102m33O95P86P0K73J333J353J05m77J78
56425A70186L69n46j067m47J75L46J007J952J534k45j227n08M77Q46J370K037
56409A76259J597K81q3N95L53j104j615l76P80Q86J299K571L187K727K944M399
56393A94700N130M180L245L449L439K285J285J356J446R20Q00J322J108k2l48
56378B24295M71N10q35j603r39o76j716k174q62N37O07M15Q29P25k91m26J166
56361B20033K575K317J464J005J02j370j619j76Q20K93J10J374K163J077j98l4
$$ y = [144178, 145655, 145630, 144963, 144696, 144580, 144346, 145020, 147331, 150017, 151401, 151651, 151947, 152391, 152344, 151951, 151805, 151859, 151978, 152730, 154422, 156253, 157545, 158791, 160387, 161549, 161661, 161417, 161425, 161048, 159919, 159161, 159653, 160511, 160850, 161607, 163878, 166725, 168397, 168641, 168235, 167405, 166303, 165870, 166565, 167351, 167421, 167694, 169027, 170380, 170485, 170008, 170186, 170555, 170009, 168942, 168495, 168670, 169016, 170023, 171975, 173509, 173264, 172037, 171529, 172006, 172852, 174222, 176259, 177856, 178137, 178054, 178649, 179002, 177898, 176283, 175907, 176687, 177573, 178872, 181443, 184630, 187357, 190301, 194700, 199830, 204010, 207255, 210704, 214143, 216428, 217713, 219069, 220515, 221435, 222235, 223557, 224665, 224643, 224295, 224766, 225276, 224441, 222838, 221899, 221223, 219507, 217333, 216471, 217008, 217615, 218030, 218859, 219584, 219293, 218867, 220033, 222608, 224925, 226389, 227394, 227496, 226126, 224507, 224331, 225151, 225444, 225554, 226928, 229091, 230168, 229970, 229936]
56345B29936M44J00J03J231J826Q60J18R12J567N74m22N32K446L424L568L647
56329B50866L260K457K703M223M869L581K263K399K684J931J327J709J679N82
56315B86533K23J463K271J406P09J414J654K27o17R56L011L344L088L864M473
56300C14019L639K975M030N279N086M746N546N844M346L160M232N756N581N220
56286C79459O726Q508Q128O673O521P154O974P015Q913J1264J1723J0887J0734
56273D90679J1047J0763J0839J2497J4539J5437J6160J7996J9866K0661K1840
56262F62324K4665K7470K8792L0573L4976M0679M5658N0930N8068O5777P2559
56251A142471Q0087R0202J01176J10639J19580J29659J39186J45738J50196J54250
$$ y = [229936, 230380, 230480, 230583, 231814, 233640, 234500, 234618, 235530, 237097, 237671, 237249, 237781, 240227, 243651, 247219, 250866, 254126, 256583, 259286, 263509, 268378, 271959, 274222, 276621, 279305, 281236, 282563, 284272, 285951, 286533, 286756, 288219, 290490, 291896, 292605, 294019, 295673, 295900, 295283, 296239, 299250, 302594, 305682, 309546, 314019, 317658, 320633, 324663, 329942, 335028, 339774, 345320, 351164, 355510, 358670, 362902, 368658, 374239, 379459, 386185, 394693, 402821, 409494, 416015, 423169, 430143, 437158, 446071, 457335, 469058, 479945, 490679, 501726, 512489, 523328, 535825, 550364, 565801, 581961, 599957, 619823, 640484, 662324, 686989, 714459, 743251, 773824, 808800, 849479, 895137, 946067, 1004135, 1069912, 1142471, 1222558, 1312760, 1413936, 1524575, 1644155, 1773814, 1913000, 2058738, 2208934, 2363184]
56241B363184J56288J53738J47126J38016J25379J07863Q7167O5307M1169J3696
56231C398933j4163l8865o0816q1493r8961j10858j19089j26700j32619j34211
56221B481158j32708j31170j29156j24302j17292j10610j04229r6885q9671q4031
56211A361104p8344p0800o3401n8707n5108m9831m4110m0598l8204l4349k9935
56200G97717k7191k5050k1545j8237j7245j6551j3466r983r383j0177r118p416
56188F12355q065r504q166n135m080m621l825k318k689l737k528l73n50j946j195
56173E53623P17L99j242o57J603K317K089L802O235N950M086M554O840P385O627
56158F04328P810J0114J0111Q782J0038J3239J4402J3861J5555J9540K2424K4440
$$ y = [2363184, 2519472, 2673210, 2820336, 2958352, 3083731, 3191594, 3278761, 3344068, 3385237, 3398933, 3384770, 3345905, 3285089, 3203596, 3104635, 2993777, 2874688, 2747988, 2615369, 2481158, 2348450, 2217280, 2088124, 1963822, 1846530, 1735920, 1631691, 1534806, 1445135, 1361104, 1282760, 1211960, 1148559, 1089852, 1034744, 984913, 940803, 900205, 862001, 827652, 797717, 770526, 745476, 723931, 705694, 688449, 671898, 658432, 648449, 639066, 628889, 619771, 612355, 604290, 594786, 586620, 581485, 577405, 572784, 568959, 566641, 563952, 560215, 557687, 557314, 556764, 554818, 553623, 554340, 554739, 553497, 552840, 554443, 556760, 558849, 562651, 568886, 574836, 578922, 583476, 590316, 597701, 604328, 612138, 622252, 632363, 641145, 651183, 664422, 678824, 692685, 708240, 727780, 750204, 774644]
56146G74644K8946L5563M1050M6272N5052O6817P7622Q7765J00709J14804J23663
56135A552907J24690J20187J10703R4995P6424O1679N2743M6786M3118M2768M1957
56124B368957L4336K0036N256o815j7284k4902k6779k5764k8927l8313n0517o4611
56112B144673q2009r9036j08648j10041j08265j04485r5418q2287p1035o2971
56102A220478n4053m3872l6466l1745k5330j7553j3461j3120j1105o403l595l489
56090I60286k002J000J258o19O97N012O393M140L939O960Q127O513P007J0142
56076A018853J0753Q425Q712J2222J3179J0772J1024J5272J7632J6258J6262J9007
56064A178371J9430J6524J5714J8259J8969J6715J6388J8361J7288J3265J2586
$$ y = [774644, 803590, 839153, 880203, 926475, 981527, 1048344, 1125966, 1213731, 1314440, 1429244, 1552907, 1677597, 1797784, 1908487, 2003482, 2079906, 2141585, 2194328, 2241114, 2284232, 2327000, 2368957, 2403293, 2423329, 2428585, 2421770, 2404486, 2379584, 2352805, 2327041, 2298114, 2259801, 2209284, 2144673, 2062664, 1963628, 1854980, 1744939, 1636674, 1532189, 1436771, 1354484, 1283449, 1220478, 1166425, 1122553, 1086087, 1054342, 1029012, 1011459, 997998, 984878, 973773, 967370, 963775, 960286, 958284, 959284, 960542, 959923, 960620, 965632, 972025, 976165, 980104, 987064, 995191, 1001704, 1008711, 1018853, 1029606, 1038031, 1046743, 1058965, 1072144, 1082916, 1093940, 1109212, 1126844, 1143102, 1159364, 1178371, 1197801, 1214325, 1230039, 1248298, 1267267, 1283982, 1300370, 1318731, 1336019, 1349284, 1361870]
56053A361870J5482J5199J1271J1075J5840J8157J5990J5991J9947K1383J8864
56042A541069J9025K3051K3911K0579K0846K6352K9256K7546K8876L5046L7994
56031A833551L5618L6117M1769M4161M0757M0118M5229M7818M4937M4705M9665
56020B304445N1327M7486M7724N5053N9636N7568N8181O5513P0620O9740P1657
56009B958950P9566Q4406Q3786Q7964R9333J06257J05327J08544J20054J27818
55999C962005J27499J31478J44440J53800J54797J60466J75595J86429J88084
55990E384593J95697K15589K32778K40642K54387K80613L03283L15508L34514
55981G757604L68466M00449M22779M53769N01951N48987N87715O39848P14917
$$ y = [1361870, 1377352, 1392551, 1403822, 1414897, 1430737, 1448894, 1464884, 1480875, 1500822, 1522205, 1541069, 1560094, 1583145, 1607056, 1627635, 1648481, 1674833, 1704089, 1731635, 1760511, 1795557, 1833551, 1869169, 1905286, 1947055, 1991216, 2031973, 2072091, 2117320, 2165138, 2210075, 2254780, 2304445, 2355772, 2403258, 2450982, 2506035, 2565671, 2623239, 2681420, 2746933, 2817553, 2887293, 2958950, 3038516, 3122922, 3206708, 3294672, 3394005, 3500262, 3605589, 3714133, 3834187, 3962005, 4089504, 4220982, 4365422, 4519222, 4674019, 4834485, 5010080, 5196509, 5384593, 5580290, 5795879, 6028657, 6269299, 6523686, 6804299, 7107582, 7423090, 7757604, 8126070, 8526519, 8949298, 9403067, 9905018, 10454005, 11041720, 11681568, 12396485]
55972A2396485P91430Q61296R50420J070824J198224J324254J482021J690444
55964B1765398J926660K186737K516532K947156L464420M083329M881881N913878
55956D9685991P164475Q638728J0399389J2463438J4786210J7432330K0629380
55949A41199941K4565604K9311373L4980913M1438191M7213729M8931730M2881291
55942D10522772K8033343P553049j2964129k8868118l8393441m2180239m1826733
55935B81876504l8954734l4888270l0505394k6231419k2251088j8703474j5666442
55928I4675683j3100643j0929032r124407p665261o476837n481841m658701l998698
55920C3240263l455046k981973k579458k255224j982204j732654j516276j346947
$$ y = [12396485, 13187915, 14049211, 14999631, 16070455, 17268679, 18592933, 20074954, 21765398, 23692058, 25878795, 28395327, 31342483, 34806903, 38890232, 43772113, 49685991, 56850466, 65489194, 75888583, 88352021, 103138231, 120570561, 141199941, 165765545, 195076918, 230057831, 271496022, 318709751, 367641481, 410522772, 438556115, 446109164, 433145035, 404276917, 365883476, 323703237, 281876504, 242921770, 208033500, 177528106, 151296687, 129045599, 110342125, 94675683, 81575040, 70646008, 61521601, 53856340, 47379503, 41897662, 37238961, 33240263, 29785217, 26803244, 24223786, 21968562, 19986358, 18253704, 16737428, 15390481]
55912A5390481j205713j070771r51582q60919p83393p02254o28977n77198n33786
55903H075888m83248m35570m03624l76768l42124l09445k90602k75641k52354
55894D906512k29294k17191k06988j87876j68463j59298j52192j37024j21669
55885C326517j15598j10486r6531q2246p8959q0676p7572p4830p9855q4870q0374
55874B364520p2997p2709p4714p0714o5882o7938p0965o6457n9581n8625n8848
55863A625090n2426m4332m3030m4759m1880l7751l8833m0788l6562l0156k8763
55852A185810k9171k5109k0228k0907k3726k2615k0962k4399k8860k7884k4704
55841I17245k5330k6679k3214j8415j8169j9359j6379j2401j3024j5086j2820
$$ y = [15390481, 14184768, 13113997, 12162415, 11301496, 10518103, 9815849, 9186872, 8609674, 8075888, 7592640, 7157070, 6753446, 6376678, 6034554, 5725109, 5434507, 5158866, 4906512, 4677218, 4460027, 4253039, 4065163, 3896700, 3737402, 3585210, 3448186, 3326517, 3210919, 3100433, 3003902, 2921656, 2842697, 2762021, 2684449, 2609619, 2529764, 2444894, 2364520, 2291523, 2218814, 2144100, 2073386, 2007504, 1939566, 1868601, 1802144, 1742563, 1683938, 1625090, 1572664, 1528332, 1485302, 1440543, 1398663, 1360912, 1322079, 1281291, 1244729, 1214573, 1185810, 1156639, 1131530, 1111302, 1090395, 1066669, 1044054, 1023092, 998693, 969833, 941949, 917245, 891915, 865236, 842022, 823607, 805438, 786079, 769700, 757299, 744275, 729189, 716369]
55830G16369q967r039j0595q753o270p684r548o915l602n533r684j0000q584j0549
55816F00646j3336j1732q301q412r814p401l526l415n009l348n19j174k594O95
55802E22760O423Q605Q180R941J2545J1248P247M929L096j948p841r768r390j1399
55788E54628j4265j3296r714q119p871n716l796o288j0808j1826r998r585r442
55775D33904n309J353N611Q142J3533K0985K4732K2392J5819N683p467j8900k3791
55762D96687k4004k4238k4187k1202j7481j6863j7324j4532j0211r090j0083q675
55750B98797n724n560p308o517l714l194m602l868j264n49j270K07K963K692k30
55735B60859j568j222k756n632n686k950j501j843q94P54p92m936o614m609k924
$$ y = [716369, 707402, 698363, 687768, 679015, 672745, 665061, 655513, 648598, 644996, 639463, 629779, 619779, 611195, 600646, 587310, 575578, 567277, 558865, 549051, 541650, 538124, 534709, 529700, 526352, 525833, 524659, 522065, 522760, 529183, 537788, 545968, 555909, 568454, 579702, 586949, 591878, 594974, 593026, 585185, 575417, 566027, 554628, 540363, 527067, 517353, 509234, 501363, 495647, 491851, 485563, 474755, 462929, 452931, 443346, 433904, 428595, 429948, 435559, 443701, 457234, 478219, 502951, 525343, 541162, 546845, 539378, 520478, 496687, 472683, 448445, 424258, 403056, 385575, 368712, 351388, 336856, 326645, 317555, 307472, 298797, 293073, 287513, 280205, 273688, 269974, 266780, 262178, 258310, 257046, 256497, 255227, 255434, 258397, 261089, 260859, 259291, 258069, 255313, 249681, 243995, 241045, 239544, 237701, 236807, 237561, 236769, 231833, 225219, 220610, 217686]
55720B17686l323l221j637p57q58K88K409K890K185L416O442P890P033O023M708
55705B51174J080l354m738l312k930m342m925m667o164q683q636o189n234o317
55691A82763n881l030j019j098p76P85J323L70L79J948K974L150M339O078N820
55676A98125L964L482M263L182J31j527r94r95k138j918j22L10j142j467K25J246
55660B04625N43L33J337J425K32K37J939K764J955J910L414M073K798J366M52
55645B29403j490m311n603n114n380o960p416o085n365o199o633n926n780o449
55631A50692n991m322l732m336l540r79M64l29j136r16j379k801k878j148k60
55616A17409j304k144j691j626k491k335p49o7j063j523n38j30j154j701j020
$$ y = [217686, 214363, 211142, 209505, 208748, 207890, 208178, 210587, 213477, 215662, 219078, 225520, 233410, 240443, 246466, 251174, 252254, 248900, 244162, 240850, 237920, 233578, 228653, 223986, 217822, 209139, 200503, 194314, 189080, 182763, 176882, 173852, 172833, 171735, 170959, 171744, 173067, 173437, 173816, 175764, 178738, 181888, 186227, 192305, 198125, 202089, 205571, 209834, 213016, 213147, 211620, 210626, 209631, 207493, 205575, 205453, 205763, 204621, 203154, 203379, 204625, 205168, 205501, 206838, 208263, 208495, 208732, 210671, 213435, 215390, 217300, 220714, 224787, 227585, 228951, 229403, 227913, 223602, 217999, 212885, 207505, 200545, 193129, 187044, 181679, 175480, 168847, 162921, 157141, 150692, 144701, 140379, 136647, 132311, 128771, 127792, 128256, 127927, 126791, 125875, 124496, 121695, 118817, 117669, 117409, 116105, 113961, 112270, 110644, 108153, 105818, 105069, 105002, 103939, 102416, 101878, 101748, 100594, 98893, 97873]
55601I7873r62k071k286j026n55j719k400j618j111j446p22J289J955M69n51J87
55585H5306N45n78j004L98J355M33l61M19R69p9j002m37O6o48r67K30J256R02
55567H6803P37J806K334J038l42j55N72O81J001J898J831M18k26P60J204j41j200
55550I9019l73O69L60J06J207K079J252J72M12Q68L52J37J317K336J736P77Q14
55533A13240P32m52j123oJ001j85k231k723j975j764k087j962j794k369k964k721
55517I0617k468l116l765l308k402k092k062j840k029k786k976k239j933k677
55503E4924l068k317j718k012j759j45J076M04q86r72o6J050K738M893N867M910
55487F2919L596L102K419R53K46J138J743N37r84r98l21l82n34J53O10j97r90
$$ y = [97873, 96911, 94840, 92554, 91528, 90973, 89254, 86854, 85236, 84125, 82679, 81957, 83246, 85201, 85670, 85119, 85306, 85851, 85273, 84269, 84667, 86022, 86455, 86094, 86513, 87482, 87403, 86401, 85964, 86030, 85382, 84415, 84645, 85901, 86803, 87540, 89346, 91680, 92718, 92376, 92221, 92793, 93474, 94475, 96373, 98204, 98622, 98396, 99156, 100360, 100219, 99019, 98646, 99315, 99675, 99781, 100988, 103067, 104319, 104491, 104903, 105771, 106123, 106260, 107577, 109913, 111649, 112426, 113240, 113972, 113520, 112397, 112391, 113392, 113207, 110976, 108253, 106278, 104514, 102427, 100465, 98671, 96302, 93338, 90617, 88149, 85033, 81268, 77960, 75558, 73466, 71404, 69564, 67535, 64749, 61773, 59534, 57601, 54924, 51856, 49539, 47821, 45809, 44050, 43905, 44981, 45385, 44499, 43527, 43461, 44511, 47249, 52142, 58009, 62919, 66515, 69617, 72036, 72989, 73235, 74373, 76116, 76653, 75669, 74671, 74350, 73968, 73434, 73587, 74197, 74000, 73010]
55470G3010l97M65R6o19j85P03N90j44l80m21q56q55K19J109P06J15O23J250N70
55451G5599o29p24J7K64j10m83j007j858k238j634p92k10P44K042K274J013k08
55434G2060m97r28j834j513N64K048J255j21p9M95J30l13L47J046O22L12J369
55417G4963K346J603M36Q07J922J924J198R84N58j096k514j815j30Q8j043j661
55401G8570j520j599j538l96R19Q36j42l90J01L28M40R06P62p46k048j347L69
55384G3505J009P25R24J245M79o34m91L90L45l09K6J144J411P12L19L83J6o12
55366H0587o12k97n82j126j058p48q92q91j64K24n61j116l7J320R79k22k37N59
55348G5126L94m40l54K60k07j308j188K1N11L5j19J12k44p84l67L35j07r41l24
$$ y = [73010, 72613, 73078, 73174, 72555, 72370, 73073, 73663, 73519, 73139, 72718, 71862, 71007, 71226, 72335, 73041, 73156, 73779, 75029, 75599, 74970, 74246, 74263, 74527, 74417, 73934, 72927, 71069, 68831, 67197, 66405, 66195, 66939, 68981, 71255, 72268, 72060, 71563, 70635, 68801, 67288, 67852, 69900, 71155, 71034, 70955, 71450, 71580, 71267, 71614, 72660, 73282, 73594, 74963, 77309, 78912, 79348, 80155, 82077, 84001, 85199, 86183, 86741, 85645, 83131, 81316, 81186, 81274, 80231, 78570, 77050, 75451, 73913, 73517, 74436, 75272, 75130, 74740, 74841, 75169, 75609, 76515, 77277, 76531, 74483, 73136, 73505, 74514, 75239, 76163, 77408, 77887, 77253, 76762, 77152, 77497, 77188, 77214, 78358, 79769, 80481, 80800, 81183, 81199, 80587, 79975, 79678, 79096, 77970, 76912, 76164, 75272, 74381, 74217, 74441, 73880, 72764, 72727, 74047, 75026, 74804, 74567, 75126, 75520, 75080, 74726, 74986, 74779, 73471, 72283, 72304, 72815, 72850, 72731, 72843, 72599, 71815, 71448, 71783, 71676, 70735, 70411]
55329G0411J113J054n10j291o40k63q51j134n82k42m88n06k39m47o95K37J841
55312F6768K282J330N17L86P1m69l45J27k17r49n56O19O76n19j024j32P69R31
55294G0265J230J908J868Q83J90L27N06N05J069K009K096J178L50j77j236k579
55278H0392k856j952j178r12k97N45M19n82r23k32K31K9J76R08J142O64N57J018
55260G7149R54K56J24O98O70j86m74J63K52p87j413n65O25Q55N32N41P41P21O07
55241H1463L17o01j739j870p49M08P17N13J98l25p54n04P3O5l07L5J006J340O92
55222G9978j8m25j014j591j414q58j002j487r65K86N25m44p81L48J600J880J727
55205G6345J643J131J98k41r9m04j276j561r52m35k35N12J553J324l38j575j329
$$ y = [70411, 71524, 72578, 72068, 70777, 70137, 69874, 69023, 67889, 67307, 67065, 66577, 66071, 65832, 65385, 64690, 64927, 66768, 69050, 70380, 70897, 71283, 71354, 70885, 70540, 70667, 70450, 69501, 68945, 69564, 70240, 69721, 68697, 68565, 69334, 70265, 71495, 73403, 75271, 76154, 76344, 76671, 77177, 77682, 78751, 80760, 82856, 84034, 84384, 84207, 82971, 80392, 77536, 75584, 74406, 73494, 73197, 73742, 74161, 73579, 72656, 72424, 72655, 72684, 72860, 73768, 74910, 75574, 76131, 77149, 78103, 78359, 78483, 79181, 79851, 79665, 79191, 79354, 79606, 78819, 77406, 76841, 77466, 78321, 78853, 79394, 80135, 80856, 81463, 81780, 81179, 79440, 77570, 76821, 77229, 77946, 78459, 78657, 78332, 77578, 77074, 77147, 77212, 76905, 76940, 77946, 79286, 79978, 79960, 79535, 78521, 76930, 75516, 74658, 73656, 72169, 71204, 71490, 72015, 71571, 70790, 71138, 72738, 74618, 76345, 77988, 79119, 79317, 79076, 78977, 78573, 77297, 75736, 74784, 74349, 74114, 74626, 76179, 77503, 77165, 75590, 74261]
55188G4261n81r5P13J811J869O74j15K31K53q95j620m65J500K450K275J743Q12
55171H4821o08j598j455q63o38m81K1M13L97N58J097J122J84p07n68K12P34P19
55153H3360J71p72j196n5J994K919J946L54p29j482j926j388k00J07p28j030K4
55136H1369J001P49K58O31J082N82j85q8N56Q35P56N74j11j388k245j948j121
55119H1307n62j43K93L01n8M1N49K66r51j490m65Q34J158J072J350J388P48M58
55101H6096J113J338q3j935k247j028L50J338K080K186J411O65Q00J071L18j089
55085I2384j832j525p41J34R55J335J125P98O35L49K9L13R92R01j21o42O8P75
55067I5932M24j98k31m51j574k482j870m69J72J7qJ55N7QM44Q20N88K95M28K11
$$ y = [74261, 73680, 73585, 74298, 76109, 77978, 78652, 78537, 78768, 79021, 78126, 76506, 76041, 77541, 79991, 82266, 84009, 84821, 84213, 82615, 81160, 80297, 79659, 79178, 79199, 79612, 80009, 80567, 81664, 82786, 82970, 82263, 81695, 81907, 82641, 83360, 83531, 82759, 81563, 81508, 83502, 86421, 88367, 88721, 87992, 86510, 84584, 83196, 82996, 83103, 82375, 81345, 81369, 82370, 83119, 83377, 84008, 85090, 85672, 85487, 85399, 85955, 86790, 87546, 88120, 88009, 86621, 84376, 82428, 81307, 80745, 80602, 80895, 81196, 81138, 81179, 81728, 81994, 81043, 79553, 79088, 79922, 81080, 82152, 83502, 84890, 85638, 86096, 87209, 88547, 88464, 86529, 84282, 83254, 83604, 84942, 87022, 89208, 90619, 91284, 92084, 93155, 93473, 92384, 90552, 89027, 88286, 88420, 89375, 90710, 91835, 92633, 93268, 93617, 93646, 93959, 94951, 95852, 95731, 95089, 95157, 95932, 96356, 96158, 95927, 95476, 93902, 91420, 89550, 89081, 89253, 89270, 89262, 89417, 89474, 89482, 89926, 90746, 91334, 91629, 92057, 92268]
55047I2268r19j822j257L8N63M10O29J080Q14m1n00m22m19m55o1N13O28M48N65
55028I2060R18J146J399J764J594N46n16p94q33j310j563p94K23K62k48K9J049
55011I4932J528J087N79M86L98J9m58r10j271j187n00K43N51O68Q65P75K47j0
54993I8042M40Q76O35K59L92N03q6q82j132j102j233r40K87J529J633J023Q56
54976A01100J119R95M66P2k89q61r80qJ209J299L59l92m49k40N8N60R40Q89Q94
54957A06741J467K087J952J216M33m49j491j960j383o02m96n43J14J042J316J137
54941A10581J106Q82l9r64j025o44n08j8J473K847K594J319Q52J487K061K245
54925A24249K744L585M146M663N853P295P919P768P575P007N216K686O12j249
$$ y = [92268, 91349, 89527, 88270, 88308, 88871, 89281, 89910, 90990, 91804, 91763, 91263, 90841, 90422, 89967, 89906, 90419, 91047, 91495, 92060, 92978, 94124, 95523, 97287, 98881, 99427, 98911, 98117, 97284, 95974, 94411, 93617, 93840, 94102, 93854, 93883, 94932, 96460, 97547, 98126, 98612, 99010, 99029, 98571, 97661, 96390, 95203, 94703, 94946, 95497, 96165, 97030, 97805, 98052, 98042, 98482, 99358, 99993, 100252, 100644, 101147, 101061, 100179, 99047, 97945, 96712, 95772, 96059, 97588, 99221, 100244, 101100, 102219, 103214, 103680, 103752, 103463, 102602, 101622, 101614, 102823, 104122, 104481, 104089, 103640, 103400, 103458, 104018, 104958, 105847, 106741, 108208, 110295, 112247, 113463, 113896, 113447, 111956, 109996, 108613, 108011, 107515, 106972, 107086, 108128, 109444, 110581, 111687, 112569, 112530, 111566, 110541, 109897, 109389, 109371, 110844, 113691, 116285, 117604, 118456, 119943, 122004, 124249, 126993, 130578, 134724, 139387, 145240, 152535, 160454, 168222, 175797, 182804, 188020, 190706, 191318, 190069]
54911A90069m012p178q845q469p337o277m900l318k584k941l327l111k759k566
54897A22445k173j649j574j794j532q70o71q65l52J242L001M072M276L538K155
54882A29249J442K502M377N166M859N194O633P591P012N710M526L129J362L9n73
54867A88218j532l521n647o849p312p655p697o975n647m210k958k144j958k091
54853A22022k052k006k414k842k323j033k93o59j250j340j321j531j348k93R57
54838A02274J381Q61J17j60K22Q58R79K89n14n92j69p2l83m56j19J70K34K37J0
54819A05167o32j105o84J94M53M9j21J78K79Mn2K63M13K31J27J74J9k89m58o85
54799A03525j125r95L83K009K283J361P71Q11L65o85r78j1R77J086R34J096J104
$$ y = [190069, 186057, 178879, 170034, 161565, 154228, 147951, 143051, 139733, 137149, 134208, 130881, 127770, 125011, 122445, 120272, 118623, 117049, 115255, 113723, 112853, 112182, 111317, 110965, 112207, 115208, 119280, 123556, 127094, 129249, 130691, 133193, 137570, 142736, 147595, 152789, 159422, 167013, 174025, 179735, 184261, 187390, 188752, 188791, 188218, 186686, 183165, 177518, 170669, 163357, 155702, 148005, 141030, 135383, 131173, 128215, 126071, 124113, 122022, 119970, 117964, 115550, 112708, 110385, 109352, 109059, 108400, 107150, 105810, 104489, 102958, 101610, 101317, 102274, 103655, 104516, 104633, 104473, 104695, 105553, 106532, 106821, 106307, 105715, 105546, 105474, 105091, 104635, 104516, 104686, 104920, 105157, 105167, 104535, 103430, 102746, 102940, 103393, 103442, 103321, 103499, 103778, 103782, 103730, 103993, 104406, 104637, 104764, 104938, 104957, 104668, 104210, 103525, 102400, 101405, 101788, 103797, 106080, 107441, 108212, 109023, 109388, 108703, 107725, 107714, 108691, 109777, 110711, 111807, 112911]
54782A12911P11N75Q94Q53L00M31J857L328L506K818K533K881L252L494M052N140
54766A49536O475P539P805P109N851M466K882J047n32j667l175n442o984o242
54752A68668m298l645m510m696l312k129k487l278l114k499k463k703k435j806
54738A25293j260o72o2K8k91M8J314K292K228K036K603L339L548L854M960O172
54722A55430O533O377O427O296N201L377J546k89k386m278n367n929o502o868
54708A59568o524n625m635l591k445j603j436j767k294k832k910k076q89m65o38
54693A19838p4J239J379n74k690k749j249k17j36M1O22P86K79j72j30P7J39J12
54675A16521j8l14o56j013j591k198k066r46K56O49N22O04Q23O43J08l18m73m16
$$ y = [112911, 113622, 114197, 115091, 115944, 116244, 116675, 118532, 121860, 125366, 128184, 130717, 133598, 136850, 140344, 144396, 149536, 156011, 163550, 171355, 178464, 184315, 188781, 191663, 192710, 192178, 190511, 187336, 181894, 174910, 168668, 164370, 160725, 156215, 151519, 148207, 146078, 143591, 140313, 137199, 134700, 132237, 129534, 127099, 125293, 124033, 123361, 123299, 123327, 123036, 123084, 124398, 126690, 128918, 130954, 133557, 136896, 140444, 144298, 149258, 155430, 161963, 168340, 174767, 181063, 186264, 189641, 191187, 190898, 188512, 184234, 178867, 172938, 166436, 159568, 153044, 147419, 142784, 139193, 136748, 135145, 133709, 131942, 129648, 126816, 123906, 121830, 120941, 120476, 119838, 119764, 121003, 122382, 121808, 119118, 116369, 115120, 114903, 114767, 114808, 115430, 116216, 116495, 116323, 116193, 116270, 116409, 116521, 116503, 116189, 115533, 114520, 112929, 110731, 108665, 107719, 107975, 108624, 109146, 109750, 110573, 111216, 111324, 111006, 110533, 110117]
54657A10117j30J67O3k03J30R02P71o60j742r83O79J231M34k35N2P31J175J356
54639A13855J169L95n68r50p18n62p61q60n55j95k44p01j152j086l58N07P34K46
54621A08196k44l22m20q67j176p80N9P07R75R44N47r8m76k87J74O47J201J598
54603A10378J228K26k58L56J142J081N03K37J71k87r63j183q22k37M61J207J599
54586A14839J448J161R55L19r34j862j607p73n14q20p84j52M77P29P76P53O71
54569A14682P02Q93Q97N61L43N62P59M83J45L14P47Q77P35O11L79m9j33M54R58
54550A24920M48p22j286o25P45J984K507K149J305P02N42L56n0j99L2J2m98p76
54532A31546m61l64j011j502r38nJ62j96j69O0l66j282j704j406j002p40l88P
$$ y = [110117, 109987, 110154, 110217, 110014, 110144, 111046, 111817, 111157, 109415, 108432, 109111, 110342, 110776, 110541, 110593, 111324, 112499, 113855, 115024, 115419, 114851, 113901, 113183, 112621, 111860, 111000, 110445, 110250, 110006, 109305, 108153, 107067, 106709, 107216, 107950, 108196, 107952, 107630, 107210, 106343, 105167, 104387, 104446, 105153, 106128, 107072, 107619, 107521, 107045, 106758, 106932, 107579, 108780, 110378, 111606, 111832, 111574, 111930, 113072, 114153, 114656, 114893, 115064, 114777, 113814, 112631, 111809, 111572, 112033, 113240, 114839, 116287, 117448, 118403, 118722, 117788, 115926, 114319, 113546, 113032, 112212, 111428, 111276, 111753, 112482, 113258, 114011, 114682, 115384, 116277, 117174, 117735, 118078, 118640, 119399, 119882, 120027, 120341, 121088, 121965, 122700, 123311, 123690, 123641, 123508, 123962, 124920, 125368, 124646, 123360, 122735, 123480, 125464, 127971, 130120, 131425, 132127, 132669, 133025, 132975, 132776, 132808, 132820, 132322, 131546, 131085, 130721, 129710, 128208, 127270, 127265, 127427, 127231, 127062, 127122, 126756, 125474, 123770, 122364, 121362, 120622, 120234, 120241]
54514A20241K84P24J420J581O34n60p56j45J72K7Q2K96l0q14j129o17K11R40J436
54495A23997J319M06m93m74O9P3l75k65N20J027Q76O75O98M86j7j87J21K56p9
54476A28633k97Q2P39J169J246J090R35J170J837K238J709O31o1j60q7J13O99
54459A41686J342J362Q23M35L85K15k66p68j137j373j212n16J43J35l01n94q85
54442A39474j436j561m26J267J874R27m58j233j269p25J26M75k60j259j145k3
54426A34348O90N29N47J390K198K002J004j12j033j566j389o83j74k34n12o63
54410A36342o95n55j33K10l7o47r16p08l99J14J287K763L426K874J881J266J099
54393A47172J069Q66K20o27p37L24J444J264J08o64q27j246j882j668n01M25N72
$$ y = [120241, 120525, 121249, 122669, 124250, 124884, 124324, 123568, 123423, 123595, 123622, 123704, 124000, 123970, 123156, 122027, 121410, 121621, 122561, 123997, 125316, 125722, 125229, 124755, 124824, 124897, 124522, 124257, 124777, 125804, 126680, 127355, 128053, 128539, 128522, 128335, 128456, 128712, 128633, 128336, 128418, 129157, 130326, 131572, 132662, 133597, 134767, 136604, 138842, 140551, 141182, 141121, 140961, 140874, 140987, 141686, 143028, 144390, 145213, 145648, 146033, 146248, 145982, 145214, 144077, 142704, 141492, 140976, 141119, 141254, 140953, 140359, 139474, 138038, 136477, 136051, 137318, 139192, 140119, 139661, 138428, 137159, 136434, 136560, 137035, 136775, 135516, 134371, 134348, 135038, 135567, 136114, 137504, 139702, 141704, 142708, 142596, 141563, 139997, 138608, 137925, 137751, 137517, 137005, 136342, 135647, 135092, 134959, 135169, 135132, 134485, 133569, 132861, 132462, 132576, 133863, 136626, 140052, 142926, 144807, 146073, 147172, 148241, 149107, 149327, 148700, 147963, 148287, 149731, 150995, 151103, 150439, 149612, 148366, 146484, 144816, 144315, 144740, 145312]
54376A45312O81J089J178R92J584K992L610K617J424J552K464K833K766L234M094
54361A78422M188L068J458J19q05j470j966k336k526k485k379k373k179j461o37
54346A66638n77j373k148k293k015j601j015m46l63o74q10p98j231j920j792n48
54330A47034O18N91l53j323j955k170j741p83OK44K75L47J84j84r9O25J166Q94
54312A43376K91J7o6l13m59j42L46M67J60l19p82r58n76Q3L20J0k67k56l01m10
54292A40221m8P64J211J000Q57J203J422J049O03N61M78m9n53n97n52o43k53R49
54274A47623K008J902J004M24M67O41O07L19k27o15j03J187J923J212q1n71j25
54257A57595M67Q62J170J228R28P52R70Q34l69j921k442j764r70q18j087j319
$$ y = [145312, 145993, 147082, 148260, 149252, 150836, 153828, 157438, 160055, 161479, 163031, 165495, 168328, 171094, 174328, 178422, 182610, 185678, 187136, 187255, 186450, 184980, 183014, 180678, 178152, 175667, 173288, 170915, 168736, 167275, 166638, 166061, 164688, 162540, 160247, 158232, 156631, 155616, 155170, 154807, 154133, 153323, 152525, 151294, 149374, 147582, 147034, 147652, 148243, 147890, 146567, 144612, 142442, 140701, 139918, 139924, 140168, 140443, 140790, 140974, 140790, 140691, 141316, 142482, 143376, 143667, 143684, 143618, 143305, 142846, 142704, 143050, 143517, 143677, 143358, 142576, 141618, 141042, 141125, 141445, 141455, 141188, 140932, 140631, 140221, 140173, 140937, 142148, 143148, 144005, 145208, 146630, 147679, 148282, 148843, 149321, 149272, 148719, 148122, 147570, 146927, 146674, 147623, 149631, 151533, 152537, 152961, 153428, 154069, 154676, 154995, 154768, 154153, 154050, 155237, 157160, 158372, 158291, 157720, 157595, 158062, 158924, 160094, 161322, 162250, 163002, 163972, 164806, 164437, 162516, 160074, 158310, 157340, 156522, 155435, 154116]
54241A54116j304q80o9O74R28Q88R23R37P07M16K45j43r09j334o98M69R07K76
54223A56149n83q79o66l79k82l69m04j06L97N97L52J60L51N51M40L44N00M16k55
54204A56334q65p27l20n43j218j402q96l22Q6O45J207J118L31l95o31p45j023
54187A50634j119q04n43q37j429j612j057l1J003J680J793J352O58J43K7J31J90
54170A50179K97O82R93L60j307k614k153l88R08R80P24Q86R85N09n1j05j1l26
54152A50548p62o60j5O75J034Q21pp96n47O08J152J94j218j578q78q8M76J075
54134A50034J436J085L55onj34k83l7L39K49l8L20J381K337K720K767K637K248
54116A67405J855J938K437K860L071L337L619L712L923M792O174P334P892P959
$$ y = [154116, 152812, 151932, 151863, 152537, 153465, 154353, 155276, 156213, 156920, 157336, 157581, 157438, 156529, 155195, 154497, 154966, 155873, 156149, 155566, 154687, 154021, 153642, 153360, 152991, 152587, 152481, 152878, 153475, 153827, 153987, 154338, 154889, 155329, 155673, 156173, 156589, 156334, 155469, 154742, 154422, 153879, 152661, 151259, 150363, 150041, 150127, 150772, 151979, 153097, 153428, 153033, 152402, 151657, 150634, 149515, 148711, 148168, 147331, 145902, 144290, 143233, 143202, 144205, 145885, 147678, 149030, 149688, 149831, 149858, 149989, 150179, 150476, 151158, 152151, 152511, 151204, 148590, 146437, 146049, 146957, 147937, 148661, 149547, 150532, 151041, 150990, 150885, 150874, 150548, 149786, 149126, 149111, 149786, 150820, 151641, 151634, 150838, 150291, 150899, 152051, 152245, 151027, 149449, 148571, 148483, 148959, 150034, 151470, 152555, 152910, 152904, 152899, 152765, 152482, 152445, 152784, 153033, 152995, 153315, 154696, 157033, 159753, 162520, 165157, 167405, 169260, 171198, 173635, 176495, 179566, 182903, 186522, 190234, 194157, 198949, 205123, 212457, 220349, 228308]
54102B28308P402N821L282M10k221m225n109m712l850l671m346n035n178n029
54088B01847m958m918m771m452l797k724j615r70p26n41n31j009j601j534q30
54073A66870l06l00k42K72P85P19K37j27j98j24J0K35N53R25J233J213O38k96
54055A72097j019r86o8J391K641K995K503J954J962K320K465K287K028J823J785
54040A96178K276L475M923N935O288O149N661N092M977N518O056N746M599L366
54026B66239K604K386K601L007L118K615J757R91M05j29o13j140j964k934l360
54011B75583l073k929l624m579m873m701m858n215m934l981l253l156l137k779
53997B20491k414k373k386k079j492r41o72p81j111j265j064q15q18r08q46q06
$$ y = [228308, 235710, 241531, 244813, 245223, 243002, 238777, 233668, 228956, 225106, 221435, 217089, 212054, 206876, 201847, 196889, 191971, 187200, 182748, 178951, 176227, 174612, 173642, 172916, 172375, 171844, 170835, 169234, 167700, 166870, 166564, 166264, 166022, 166294, 167079, 167798, 168035, 167908, 167710, 167586, 167596, 167831, 168384, 169309, 170542, 171755, 172393, 172097, 171078, 170092, 170024, 171415, 174056, 177051, 179554, 181508, 183470, 185790, 188255, 190542, 192570, 194393, 196178, 198454, 201929, 206852, 212787, 219075, 225224, 230885, 235977, 240954, 246472, 252528, 258274, 262873, 266239, 268843, 271229, 273830, 276837, 279955, 282570, 284327, 285318, 285723, 285594, 284981, 283841, 281877, 278943, 275583, 272510, 269581, 265957, 261378, 256505, 251804, 246946, 241731, 236797, 232816, 229563, 226407, 223270, 220491, 218077, 215704, 213318, 211239, 209747, 208806, 208134, 207353, 206242, 204977, 203913, 203098, 202280, 201372, 200526, 199720]
53981A99720r38q69k21O76J219J391J615K098K833L887N204O528P878R470J0709
53966B51200J0141P251L342j30l177o181q301q488p353o386n837m952l748k924
53952B14457k319j290k96l43r60n91Q80J908J826J696K271K876K956L073L599
53937B29743L955L878L997M433M271L256K586L065L737L474K699K500K956L532
53923B78082M204N065N534N085M291M125M693N475O327P351Q234Q523Q324P990
53909C63303P464O483N181L908K702J410O2j222k340k970k709j782j110j269j918
53894C75193k592l439m745o206p293p919q337q664q846q789q329p436o559o244
53880B79795o289n927m948l938l274k673k033j831k252k746k850k766k708k519
$$ y = [199720, 198782, 197913, 197692, 198368, 199587, 200978, 202593, 204691, 207524, 211411, 216615, 223143, 231021, 240491, 251200, 261341, 268592, 271934, 271804, 268627, 262446, 254145, 245657, 238304, 231918, 226081, 221129, 217381, 214457, 212138, 210848, 210552, 210209, 209249, 208658, 209538, 211446, 213272, 214968, 217239, 220115, 223071, 226144, 229743, 233698, 237576, 241573, 246006, 250277, 253533, 256119, 259184, 262921, 266395, 269094, 271594, 274550, 278082, 282286, 287351, 292885, 297970, 302261, 306386, 311079, 316554, 322881, 330232, 338466, 346989, 355313, 363303, 370767, 377250, 382431, 386339, 389041, 390451, 390513, 389291, 386951, 383981, 381272, 379490, 378380, 377111, 375193, 372601, 369162, 364417, 358211, 350918, 342999, 334662, 325998, 317152, 308363, 300034, 292598, 286039, 279795, 273506, 267579, 262631, 258693, 255419, 252746, 250713, 248882, 246630, 243884, 241034, 238268, 235560, 233041]
53866B33041k289k545l261l600l167k680k698k571j559k21K43m18j457k222k444
53851B02152j875n83O32R34M74R6K04M72N55M23Q5m60j027j343j342j115p39l70
53833A97173k37l07k11K70Q72J188J095P01K75K10O48J044P33J4j01O65J423J449
53815B06904J125J072J187J198J430K235L175L501L190K823K754K923L235L669
53801B40421M174M804N618O285O250N510M756M402M146L810L838M451M873M150
53787C07488K306J65j526k393k355j849j718k373l391m230m854n327n467n347
53773B69129n449n754n479m286l077k791l111l156k890k838k920k566j772j150
53759B21890j048j335j819k195j905q06K58K45p69j787k156k032j730j274o18
$$ y = [233041, 230752, 228207, 224946, 221346, 218179, 215499, 212801, 210230, 208671, 208450, 208693, 208275, 206818, 204596, 202152, 200277, 199694, 200326, 201260, 201734, 201830, 202034, 202506, 203061, 203484, 203569, 203109, 202082, 200739, 199397, 198282, 197543, 197173, 196936, 196629, 196418, 196688, 197560, 198748, 199843, 200544, 200819, 201029, 201677, 202721, 203454, 203468, 203367, 204032, 205455, 206904, 208029, 209101, 210288, 211486, 212916, 215151, 218326, 221827, 225017, 227840, 230594, 233517, 236752, 240421, 244595, 249399, 255017, 261302, 267552, 273062, 277818, 282220, 286366, 290176, 294014, 298465, 303338, 307488, 309794, 309959, 308433, 306040, 303685, 301836, 300118, 297745, 294354, 290124, 285270, 279943, 274476, 269129, 263680, 257926, 252447, 248161, 245084, 242293, 239182, 236026, 233136, 230298, 227378, 224812, 223040, 221890, 220842, 219507, 217688, 215493, 213588, 212782, 213040, 213285, 212516, 210729, 208573, 206541, 204811, 203537, 202919]
53744B02919K33J221K051K230J669R23M38j9o67j031o12J89N74M62L22K59O1j11
53726B11111J13N43O72N60P19J191J477J408J376J604J847J906J903J897J733
53711B30060J400J161J244J669K322K933L136K867K503K367K300K128K142K619
53697B60851L227L531L770M398N028M677L106J346O18J135K042K261J384L4p65
53682B96643p15m93p10j037q63l39j32l91o45o07m18k18k8K8o5R8P91J449J170
53663B93518j5j058j216q25m84j62M42J050J006K61l73k15L91O10L71M51J069
53646B94821J216R5j378j525j63J281J918K349L099L497K889J959J747K149K347
53631C16301K187K149K417K869L596M539N006M428L319K615K376J954J215O90
$$ y = [202919, 203152, 204373, 206424, 208654, 210323, 211246, 211684, 211665, 210998, 209967, 209355, 209544, 210118, 210580, 210902, 211161, 211222, 211111, 211224, 211767, 212439, 212999, 213718, 214909, 216386, 217794, 219170, 220774, 222621, 224527, 226430, 228327, 230060, 231460, 232621, 233865, 235534, 237856, 240789, 243925, 246792, 249295, 251662, 253962, 256090, 258232, 260851, 264078, 267609, 271379, 275777, 280805, 285482, 288588, 289934, 290552, 291687, 293729, 295990, 297374, 297408, 296643, 295928, 295435, 294725, 293688, 292825, 292486, 292354, 291963, 291318, 290711, 290293, 290075, 290047, 290075, 290010, 290108, 290899, 292348, 293518, 293503, 292445, 291229, 290404, 289920, 289758, 290200, 291250, 292256, 292517, 292144, 291929, 292320, 292930, 293301, 293752, 294821, 296037, 296132, 294754, 293229, 293066, 294347, 296265, 298614, 301713, 305210, 308099, 310058, 311805, 313954, 316301, 318488, 320637, 323054, 325923, 329519, 334058, 339064, 343492, 346811, 349426, 351802, 353756, 354971, 355661]
53617C55661O21P37Q65J103J394J560J683J897K104K268K677L348L668L300K932
53602C85818L354M226M596M259L681L086K486K233K453K311J060n28j015l71R9
53587D17748j96n85o96j111k029k686k640k524k818k930k269j385j184j616j948
53572C91131j925j930k125k086j380j93P12P33J23k46j1J85l14j042r84j3R61
53555C81596J192P67J36l00j83N07J192J353J320J689K159J865Q29K4n4J78M79
53538C94749J189K234K831K760K909L969N427O479P103P554P609P134O813P354
53524D66114Q374Q965R140R740J1011J2201J2738J3097J3991J5239J5973J5891
53512F12474J5764J6539J8301K0381K2239K3721K4611K4618K4024K3720K4072
$$ y = [355661, 356282, 357019, 357884, 358987, 360381, 361941, 363624, 365521, 367625, 369893, 372570, 375918, 379586, 382886, 385818, 389172, 393398, 397994, 402253, 405934, 409020, 411506, 413739, 416192, 418503, 419563, 419035, 418020, 417649, 417748, 417552, 416967, 416271, 415160, 413131, 410445, 407805, 405281, 402463, 399533, 397264, 395879, 394695, 393079, 391131, 389206, 387276, 385151, 383065, 381685, 381492, 382204, 382937, 383060, 382814, 382803, 382988, 382674, 381632, 380648, 380635, 381596, 382788, 383555, 383691, 383391, 383208, 383715, 384907, 386260, 387580, 389269, 391428, 393293, 394122, 394146, 394092, 394270, 394749, 395938, 398172, 401003, 403763, 406672, 410641, 416068, 422547, 429650, 437204, 444813, 451947, 458760, 466114, 474488, 483453, 492593, 502333, 513344, 525545, 538283, 551380, 565371, 580610, 596583, 612474, 628238, 644777, 663078, 683459, 705698, 729419, 754030, 778648, 802672, 826392, 850464]
53501H50464K4335K3718K2596K1933K1944K2024K1796K1394K0895K0213J9581
53490A090893J9312J9159J8602J7807J7558J8084J8679J8640J8074J7561J7562
53479A291931J8179J9035J9362J8671J7298J5875J4403J2510J0333Q410O752M888
53467A457647K795R46o42k562n082p828j0447j2760j4223j4222j3252j2820j3762
53454A353788j5336j6409j6819j7140j7746j8629j9604k0241k0004j8887j7598
53443A155375j6899j7002j7616j8103j7612j5674j2827j0117p954n982m041k501
53431A009047j545r01m15j60J50J099K684M230N371O420P612Q808J0047J1587
53417A064034J3198J4343J5217J6690J8897K0867K1987K2765K3714K4548K5120
$$ y = [850464, 874799, 898517, 921113, 943046, 964990, 987014, 1008810, 1030204, 1051099, 1071312, 1090893, 1110205, 1129364, 1147966, 1165773, 1183331, 1201415, 1220094, 1238734, 1256808, 1274369, 1291931, 1310110, 1329145, 1348507, 1367178, 1384476, 1400351, 1414754, 1427264, 1437597, 1446007, 1452759, 1457647, 1460442, 1461388, 1460746, 1458184, 1453102, 1445274, 1434827, 1422067, 1407844, 1393622, 1380370, 1367550, 1353788, 1338452, 1322043, 1305224, 1288084, 1270338, 1251709, 1232105, 1211864, 1191860, 1172973, 1155375, 1138476, 1121474, 1103858, 1085755, 1068143, 1052469, 1039642, 1029525, 1021571, 1015589, 1011548, 1009047, 1007502, 1006601, 1006186, 1006026, 1006176, 1007275, 1009959, 1014189, 1019560, 1025980, 1033592, 1042400, 1052447, 1064034, 1077232, 1091575, 1106792, 1123482, 1142379, 1163246, 1185233, 1207998, 1231712, 1256260, 1281380]
53406A281380K6049K7649K9141K9873L0509L2105L4543L6923L8964M1078M3341
53395A651555M5382M7176M9085N1171N2996N4259N5136N5896N6432N6263N5085
53384B230436N3363N2093N1563N0730M8528M5517M3159M1539L9082L4915L0225
53373B721150K6502K3554K0171J5976J1543P216K726k335q293j5350k3118l0543
53361B749199l6753m1688m5523m8109m9421n0039n0597n1165n1511n1449n0598
53350B222346m8560m5806m3533m2224m1166l9925l9250l9669m0239l9826l8739
53339A763409l7894l7100l5556l3490l1815l0446k8401k5549k2891k0858j8666
53328A440743j5675j2496j0214r295r570j0711j2276j3779j4963j5804j6192j5961
$$ y = [1281380, 1307429, 1335078, 1364219, 1394092, 1424601, 1456706, 1491249, 1528172, 1567136, 1608214, 1651555, 1696937, 1744113, 1793198, 1844369, 1897365, 1951624, 2006760, 2062656, 2119088, 2175351, 2230436, 2283799, 2335892, 2387455, 2438185, 2486713, 2532230, 2575389, 2616928, 2656010, 2690925, 2721150, 2747652, 2771206, 2791377, 2807353, 2818896, 2826112, 2828838, 2826503, 2818210, 2802860, 2779742, 2749199, 2712446, 2670758, 2625235, 2577126, 2527705, 2477666, 2427069, 2375904, 2324393, 2272944, 2222346, 2173786, 2127980, 2084447, 2042223, 2001057, 1961132, 1921882, 1882213, 1841974, 1802148, 1763409, 1725515, 1688415, 1652859, 1619369, 1587554, 1557108, 1528707, 1503158, 1480267, 1459409, 1440743, 1425068, 1412572, 1402358, 1393063, 1383493, 1372782, 1360506, 1346727, 1331764, 1315960, 1299768, 1283807]
53316A283807j5267j4466j3649j2627j1346j0014q792p688o582n218l392j434
53304A173332j51J37J67R34K606M704O885Q988J0722J1988J3342J5372J7838J9974
53290A286838K1527K2845K4044K4836K5163K5253K5033K4056K2221K0129J8504
53279A540449J7473J6549J5097J2868J0150P373M574J526j664m584p224j0012
53267A602575j2951j5391j7069j8633k0596k2549k4014k5348k6918k8112k8191
53256A362803k7657k7664k8388k8997k9028k8701k8036k6748k5088k3817k3208
53245A065471k2833k2458k2293k2318k2159k1816k1706k1851k1693k0917j9787
53234H25640j8534j7073j5512j4276j3456j2610j1459j0289r437q839q247p559
$$ y = [1283807, 1268540, 1254074, 1240425, 1227798, 1216452, 1206438, 1197646, 1189958, 1183376, 1178158, 1174766, 1173332, 1173181, 1173318, 1173485, 1174419, 1177025, 1181729, 1188614, 1197602, 1208324, 1220312, 1233654, 1249026, 1266864, 1286838, 1308365, 1331210, 1355254, 1380090, 1405253, 1430506, 1455539, 1479595, 1501816, 1521945, 1540449, 1557922, 1574471, 1589568, 1602436, 1612586, 1619959, 1624533, 1626059, 1624395, 1619811, 1612587, 1602575, 1589624, 1574233, 1557164, 1538531, 1517935, 1495386, 1471372, 1446024, 1419106, 1390994, 1362803, 1335146, 1307482, 1279094, 1250097, 1221069, 1192368, 1164332, 1137584, 1112496, 1088679, 1065471, 1042638, 1020180, 997887, 975569, 953410, 931594, 909888, 888037, 866344, 845427, 825640, 807106, 790033, 774521, 760245, 746789, 734179, 722720, 712431, 702994, 694155, 685908, 678349]
53222F78349o801o247o506p978j0094j1728j2480j3035j4020j5109j5554j5169
53210E43628j4379j3562j2710j1624j0219q704p509o949o946p175p477p921q581
53197D19872r370j0056j0253r689q644p860p731p773p263o181n157m661m655m893
53183C15686n134n130m844m597m738n180n450n119l996k264o05J11l49j360k191
53168B64840k654k783k469j821j376j410j502j260r36p97n12J49O12L36j86j05
53152B48126L98M98M8m27p94j310j730j504q27n33q54j185j098p23j30P26J396
53135B40077J187K65l93k66K19N89R25J334J621J727J862K039K037J910J842J562
53119B58537O94k97m31L26Q98O59K45M40J033J321J090N95R7k66m75q19j603k516
$$ y = [678349, 671548, 665301, 658795, 650817, 640723, 628995, 616515, 603480, 589460, 574351, 558797, 543628, 529249, 515687, 502977, 491353, 481134, 472430, 464921, 457972, 451026, 443851, 436374, 428453, 419872, 410502, 400446, 390193, 380504, 371860, 364000, 356269, 348496, 341233, 335052, 329895, 325234, 320579, 315686, 310552, 305422, 300578, 295981, 291243, 286063, 280613, 275494, 271498, 269234, 268629, 268740, 268391, 267031, 264840, 262186, 259403, 256934, 255113, 253737, 252327, 250825, 249565, 248629, 247832, 247320, 247469, 248081, 248417, 248231, 248126, 248524, 249022, 249070, 248643, 247849, 246539, 244809, 243305, 242478, 241945, 241091, 239906, 238808, 238085, 237955, 238681, 240077, 241264, 241529, 241136, 240870, 241089, 241678, 242603, 243937, 245558, 247285, 249147, 251186, 253223, 255133, 256975, 258537, 259231, 258934, 258503, 258829, 259727, 260386, 260631, 261071, 262104, 263425, 264515, 265110, 265207, 264941, 264466, 263647, 262044, 259528]
53101B59528k825k363j719j337j022o07m09o36r68j047r83r98j051j023r59q34
53085B40747m90QL04J96j37m32n02j49N69J119J019N41L05K71j40r75j624j806
53067B38824j914k188k266j818j025k37L37M78J05l88n09l16j36J38P03J048N00
53050B31336n19q57k85L84Q00J430K218K331J663J238J523J640R70K40J91L29
53034B44632r7q27j307j688k081j804m62R44J231O91L87M51L36K37P58J440J086
53017B43927k94j206p13L23N60l2l97J00J001J477J248O95K60L7k1J28L70K95
52999B47758k07m38K78J398J635P32k31m92n65j045j482j135j59P59J372J811
52983B49989K020J937J802J719J410Q55N76Q01R29N22J00K86P53Q03N36N49R36
$$ y = [259528, 256703, 254340, 252621, 251284, 250262, 249655, 249246, 248610, 247642, 246595, 245612, 244614, 243563, 242540, 241581, 240747, 240257, 240265, 240569, 240765, 240628, 240196, 239694, 239545, 240114, 241233, 242252, 242793, 243098, 243369, 243229, 242254, 240630, 238824, 236910, 234722, 232456, 230638, 229613, 229376, 229713, 230191, 230296, 229908, 229399, 229083, 228947, 229085, 229788, 230836, 231336, 230817, 229960, 229675, 230059, 230859, 232289, 234507, 236838, 238501, 239739, 241262, 242902, 243872, 244112, 244303, 244632, 244535, 243708, 242401, 240713, 238632, 236828, 236366, 237310, 238541, 239232, 239619, 240070, 240406, 240643, 241401, 242841, 243927, 243633, 242427, 241714, 242037, 242597, 242565, 242168, 242268, 243269, 244746, 245994, 246689, 246949, 246986, 246965, 247093, 247463, 247758, 247551, 247113, 247391, 248789, 250424, 251156, 250925, 250433, 249868, 248823, 247341, 246206, 246047, 246806, 248178, 249989, 252009, 253946, 255748, 257467, 258877, 259732, 260308, 261109, 262038, 262560, 262660, 262946, 263699, 264502, 265038, 265587, 266523]
52966B66523J327J618J886J947J691J486J605J605J009J18n42j112j923k633k699
52951B71906k348k178k108j670j024p42p68n67j42Jj80k32j09k08n30o28m27l64
52933B57682n94p32n26j97p8l05p80j073o68K39O64J49m11p2O28N13l10p05m10
52914B53014l60r63j411j036k52K27K31j12o64j007p06q5L4m35o76k35M17Q16
52896B46797J091J289J034L36q5K75J030J590J824J687R57k19j133j349j143q27
52880B53154k97L11M11j00m09L4O27N85J56J52P13J352J754J911J759J417J345
52863B64875J643J639R02J54L00R12P65l45j371j635j630j977k554l018l351l489
52847B51820l140k436k155k717l466l497k791j944j173l48K69J35o20j103p63
$$ y = [266523, 267850, 269468, 271354, 273301, 274992, 276478, 278083, 279688, 280697, 280815, 280273, 279161, 277238, 274605, 271906, 269558, 267380, 265272, 263602, 262578, 261836, 261068, 260501, 260359, 260360, 260180, 259948, 259839, 259631, 259101, 258473, 258046, 257682, 257088, 256356, 255830, 255633, 255555, 255250, 254470, 253397, 252729, 252968, 253632, 253781, 253370, 253298, 253926, 254439, 254129, 253424, 253014, 252654, 251691, 250280, 249244, 248992, 249219, 249450, 249338, 248674, 247667, 246961, 246876, 246910, 246475, 245799, 245564, 245981, 246797, 247888, 249177, 250211, 250547, 250462, 250737, 251767, 253357, 255181, 256868, 257825, 257606, 256473, 255124, 253981, 253154, 252857, 253168, 253579, 253479, 253070, 253104, 253731, 254316, 254472, 254624, 255337, 256689, 258443, 260354, 262113, 263530, 264875, 266518, 268157, 269059, 269213, 269513, 270425, 271190, 270845, 269474, 267839, 266209, 264232, 261678, 258660, 255309, 251820, 248680, 246244, 244089, 241372, 237906, 234409, 231618, 229674, 228501, 228153, 228422, 228557, 227937, 226834, 226071]
52832B26071o0L26L98N56Q48J046J201J524J788J442M50m82p25m00L3L87O83P85
52814B35871N63L11N47J384K423L213L521L160J962J28j680k855l285l139k470
52799B39654j339k49J3q16k015k556k171j457r76o48j79L61P41J012J255J131
52783B31761K82q26j161l70P52J292J192R21O80L54l6l30m42l33M2M55M18k10
52765B34441q87j048q27p40q21o09P2Q40J255J305J289J377J335P24m95j547j425
52748B34239k8J608K429K371J994J660J444J445J593J455P57o9k99K47J167J969
52732B53982K249J743P80K96P70J394J058r4r23r32p26q12q85o50m77p52j145
52715B54876j097o63m27p04j145j053q8J248J912J371K93k07R7M41K55j55k55
$$ y = [226071, 226011, 226337, 226735, 227291, 228139, 229185, 230386, 231910, 233698, 235140, 235590, 235108, 234383, 233983, 234016, 234403, 235086, 235871, 236434, 236745, 237292, 238676, 241099, 244312, 247833, 250993, 252955, 253083, 251403, 248548, 245263, 242124, 239654, 238315, 238066, 238079, 237263, 235248, 232692, 230521, 229064, 228088, 227440, 227261, 227622, 228363, 229375, 230630, 231761, 232043, 231217, 230056, 229686, 230438, 231730, 232922, 233843, 234523, 234877, 234841, 234511, 234069, 233736, 233778, 234233, 234651, 234441, 233554, 232506, 231679, 230939, 230118, 229509, 229581, 230421, 231676, 232981, 234270, 235647, 236982, 237706, 237211, 235664, 234239, 234211, 235819, 238248, 240619, 242613, 244273, 245717, 247162, 248755, 250210, 250967, 250898, 250599, 250846, 252013, 253982, 256231, 257974, 258754, 259050, 259820, 261214, 262272, 262178, 261255, 260323, 259597, 258785, 257900, 257250, 256773, 256021, 254876, 253779, 253116, 252689, 251985, 250840, 249787, 249699, 250947, 252859, 254230, 254523, 254316, 254413, 254854, 255109, 254954, 254699]
52698B54699m3J46J69J15O6J23L62N99M44j87q48j061q42n41l46j92k7L2j69o10
52678B51889j005r54l36M72Q61N59r7m58k12K70K87k70n83J08J288J622P90O7
52660B54298O26J896K378J654P72P50J519K360K755K634K192J593P62l97j461
52645B74331j695j066n35q05j321j208o29l38l91k95j44m33q93o67L54J460K450
52628B68175L785N265N735M597K629Q06q14k563m262n356n441m358k485r44o94
52613B64075j207j036R6Q91N41o2O2M20K3r18j493j517j413j120k53R44J758J908
52595B61699J584Q99K4n01l97k71p93j454j087M63K005K427J769Q55M05O04J140
52578B69371J512J500J251Q49K48k28L8Q71J076Qj277j367n42k89j043j688j404
$$ y = [254699, 254656, 254802, 254971, 255086, 255152, 255275, 255637, 256236, 256680, 256493, 255645, 254584, 253742, 253201, 252855, 252663, 252636, 252668, 252499, 251889, 250884, 249930, 249594, 250066, 250927, 251486, 251389, 250931, 250719, 250989, 251276, 251006, 250423, 250531, 251819, 253441, 254231, 254298, 254924, 256820, 259198, 260852, 261624, 262374, 263893, 266253, 269008, 271642, 273834, 275427, 276189, 275792, 274331, 272636, 271570, 271035, 270230, 268909, 267701, 267072, 266734, 266343, 266048, 265904, 265471, 264578, 263911, 264265, 265725, 268175, 271960, 277225, 282960, 287557, 290186, 290992, 290178, 287615, 283353, 277997, 272556, 268198, 265713, 264769, 264075, 262868, 261832, 261928, 262819, 263360, 263298, 263360, 263780, 263803, 262885, 261392, 259875, 258462, 257342, 257089, 258033, 259791, 261699, 263283, 264182, 264206, 263705, 263308, 263037, 262244, 260790, 259703, 260166, 262171, 264598, 266367, 267222, 267627, 268231, 269371, 270883, 272383, 273634, 274483, 274731, 274503, 274541, 275412, 276488, 276496, 275219, 273852, 273310, 273021, 271978, 270290, 268886]
52561B68886p71o03o93l96J83L15k97j101j324p64oJ82k59o14m08j13m18j106
52543B60693j319q57l58k37j64J11K21j33n26l18N12J459K147K471K297J496K92
52526B67787o58p04K37J461J979J422L76l45n95o97o62j85N90J045J066J331K234
52509B75682L097L040K240J656J673J685R96l78j916l133l718l507k638j562p70
52494B72447n18p55j183j341r79m63n06j284k076k045j258n62m67n83k42N63J171
52477B59919J091O69P21J567K534K688K055J597J843K062J385L16J64J040J606
52462B81257J105N55J104K189K341J266p3j088k012k771k766k048j639k093k586
52447B72741k109q86K1O6m00p95p92l65K39O67Q08P58N14k4n94p19m74n14j026
$$ y = [268886, 268115, 267512, 266819, 266423, 266606, 266921, 266624, 265523, 264199, 263435, 263429, 263611, 263352, 262738, 262330, 262217, 261799, 260693, 259374, 258517, 258159, 257922, 257758, 257869, 258090, 257957, 257431, 257113, 257625, 259084, 261231, 263702, 265999, 267495, 267787, 267129, 266425, 266662, 268123, 270102, 271524, 271900, 271555, 270960, 270263, 269601, 269416, 270006, 271051, 272117, 273448, 275682, 278779, 281819, 284059, 285715, 287388, 289073, 290069, 289691, 287775, 284642, 280924, 277417, 274779, 273217, 272447, 271929, 271174, 269991, 268650, 267671, 267208, 266702, 265418, 263342, 261297, 260039, 259477, 259010, 258427, 258185, 258748, 259919, 261010, 261679, 262400, 263967, 266501, 269189, 271244, 272841, 274684, 276746, 278131, 278447, 278611, 279651, 281257, 282362, 282917, 284021, 286210, 288551, 289817, 289744, 288656, 286644, 283873, 281107, 279059, 277420, 275327, 272741, 270632, 269746, 269767, 269833, 269433, 268638, 267846, 267481, 267720, 268387, 269195, 269953, 270467, 270443, 269849, 269130, 268656, 268142, 267116]
52428B67116j298o91M14J142J120N67k03p77o07L64J423J882J903J977K059J881
52412B78272J793K391L430M040M119M751O839R858J2291J2953J1619Q730M925
52399C66011Q52k872n773p638q501q466p665o463n452m879m235k894j161m8jm28
52383C00387p01q52r72p04P8P88J007J222J949K648K486J718J381J821K471K956
52367C17683L393L647L226K166J216Q88R60J074J167J118O84M6k03J06M45M46
52351C38062M43Q61J547K098K442K691K789K679K579K752L109L301L104K619K265
52336C73341K579L750N303O511P172P637Q181Q785R524J0583J1747J2463J2760
52323D80336J3481J5159J7107J8221J8413J8583J9311K0211K0603K0376J9914
$$ y = [267116, 265818, 265127, 265541, 266683, 267803, 268370, 268167, 267390, 266783, 267147, 268570, 270452, 272355, 274332, 276391, 278272, 280065, 282456, 285886, 289926, 294045, 298796, 305635, 315493, 327784, 340737, 352356, 361086, 366011, 366863, 363991, 358218, 350580, 342079, 333613, 325948, 319485, 314033, 309154, 304919, 302025, 300864, 300816, 300815, 300387, 299686, 298834, 297862, 297158, 297236, 298024, 299031, 300253, 302202, 304850, 307336, 309054, 310435, 312256, 314727, 317683, 321076, 324723, 327949, 330115, 331331, 332219, 333179, 334253, 335420, 336538, 337222, 337268, 337065, 337171, 337616, 338062, 338505, 339366, 340913, 343011, 345453, 348144, 350933, 353612, 356191, 358943, 362052, 365353, 368457, 371076, 373341, 375920, 379670, 384973, 391484, 398656, 406293, 414474, 423259, 432783, 443366, 455113, 467576, 480336, 493817, 508976, 526083, 544304, 562717, 581300, 600611, 620822, 641425, 661801, 681715]
52312F81715J9608J9649K0065K0717K1335K1753K2015K2077K1591K0309J8748
52301I09582J7942J8239J8648J7796J5442J2666J0535R114P768N953L517O96j962
52288A045936l981n468o869q118q647q427q251q539q557p539n877m399l003j134
52274I57127P82J622J341J338K703M948O748P340O964O560P174R085J1369J2900
52260A038001J3720J4731J6157J7252J7593J7587J7451J6811J5764J5150J5124
52249A215341J4523J2499R814P582N574K953j24k866n314p961j0297j1273j1181
52236A219270j1585j3037j4305j4397j4026j4242j4746j4674j4221j4216j4492
52225A065329j3953j2232j0192q648p488o413n565n008m283l143k217k127k362
$$ y = [681715, 701323, 720972, 741037, 761754, 783089, 804842, 826857, 848934, 870525, 890834, 909582, 927524, 945763, 964411, 982207, 997649, 1010315, 1020850, 1029964, 1037732, 1043685, 1047202, 1047898, 1045936, 1041955, 1036487, 1029618, 1021500, 1012853, 1004426, 996175, 987636, 979079, 971540, 965663, 961264, 958261, 957127, 957909, 959531, 960872, 962210, 964913, 969861, 976609, 983949, 990913, 997473, 1004647, 1013732, 1025101, 1038001, 1051721, 1066452, 1082609, 1099861, 1117454, 1135041, 1152492, 1169303, 1185067, 1200217, 1215341, 1229864, 1242363, 1252177, 1259759, 1265333, 1268286, 1268162, 1265296, 1259982, 1252021, 1241724, 1230451, 1219270, 1207685, 1194648, 1180343, 1165946, 1151920, 1137678, 1122932, 1108258, 1094037, 1079821, 1065329, 1051376, 1039144, 1028952, 1020304, 1012816, 1006403, 1000838, 995830, 991547, 988404, 986187, 984060, 981698]
52212I81698j770r6J765L107M148N154N563M680K899J579J666K858M116M742M862
52197A026971N027N469N770N454M728M324M485M572L902K607J289K31o54j442
52183A072733k237l364m915o289o757o408o038o173o705p319p702p446o399n029
52169I89952l896k844j475k25k4p45j079k79R50J728K176K694K974K579J893J526
52153I95905J337R07N47Q41J559K003K221K815L612L658K674J518Q55L27n17j313
52137A018949j517j334j228j041k54J183K898M693O495Q010R120J0491J2995J6435
52123A085895J9641K1927K3771K5735K7445K8232K8276K8316K8528K8353K7443
52112A373562K6147K4926K3888K2977K2136K1102J9529J7632J6201J5640J5272
$$ y = [981698, 979928, 979832, 981597, 984704, 988852, 994006, 999569, 1004249, 1007148, 1008727, 1010393, 1013251, 1017367, 1022109, 1026971, 1031998, 1037467, 1043237, 1048691, 1053419, 1057743, 1062228, 1066800, 1070702, 1073309, 1074598, 1074829, 1074175, 1072733, 1070496, 1067132, 1062217, 1055928, 1049171, 1042763, 1036725, 1030552, 1023847, 1016528, 1008826, 1001380, 994981, 989952, 986056, 983212, 981737, 981512, 981488, 980743, 979664, 979385, 980335, 982063, 984239, 986933, 989907, 992486, 994379, 995905, 997242, 998149, 998696, 999537, 1001096, 1003099, 1005320, 1008135, 1011747, 1015405, 1018079, 1019597, 1020452, 1020779, 1020262, 1018949, 1017432, 1016098, 1014870, 1013829, 1013575, 1014758, 1017656, 1022349, 1028844, 1036854, 1045974, 1056465, 1069460, 1085895, 1105536, 1127463, 1151234, 1176969, 1204414, 1232646, 1260922, 1289238, 1317766, 1346119, 1373562, 1399709, 1424635, 1448523, 1471500, 1493636, 1514738, 1534267, 1551899, 1568100, 1583740, 1599012]
52101A599012J4082J1892R409P274N474L582J121k221o287j0302j3442j5657j7637
52088A586300j9746k1322k1346j9773j7798j6666j6330j5607j3724j1275r336
52077A403377q043o672m988l577k607j252J070L626N391O628Q431J0998J3357
52064A425739J4826J5734J6525J7037J7071J6978J7207J7685J8018J7908J7071
$$ y = [1599012, 1613094, 1624986, 1634395, 1641669, 1647143, 1650725, 1651846, 1649625, 1643338, 1633036, 1619594, 1603937, 1586300, 1566554, 1545232, 1523886, 1504113, 1486315, 1469649, 1453319, 1437712, 1423988, 1412713, 1403377, 1395334, 1388662, 1383674, 1380097, 1377490, 1376238, 1377308, 1380934, 1386325, 1392953, 1401384, 1412382, 1425739, 1440565, 1456299, 1472824, 1489861, 1506932, 1523910, 1541117, 1558802, 1576820, 1594728, 1611799]
$$ [...]
##END NTUPLES=NMR SPECTRUM
##END=
