
##TITLE=UV1258_M11_1332-1242_20_7409803_wlDLvFkFin
##JCAMPDX= 6.0         $$ Bruker NMR JCAMP-DX V2.0
##DATA TYPE= NMR SPECTRUM
##DATA CLASS= NTUPLES
##ORIGIN= BRUKER
##OWNER= Administrator
$$ 1.72 TOPSPIN		Version 2.1
$$ 2013-01-31 09:20:04.499 -0500  Administrator@X
$$ Compression mode = diff/dup
##.OBSERVE FREQUENCY= 400.02188249412
##.OBSERVE NUCLEUS= ^1H
##.ACQUISITION MODE= SIMULTANEOUS (DQD)
##.ACQUISITION SCHEME= undefined
##.AVERAGES= 64
##.DIGITISER RES= 22
##SPECTROMETER/DATA SYSTEM= spect
##.PULSE SEQUENCE= noesygpps1d.comp
##.SOLVENT NAME= COFFEE_meoh
##.SHIFT REFERENCE= INTERNAL, COFFEE_meoh, 1, 14.96109
##AUDIT TRAIL= $$ (NUMBER, WHEN, WHO, WHERE, PROCESS, VERSION, WHAT)
$$ ##TITLE= Audit trail, TOPSPIN		Version 2.1
$$ ##JCAMPDX= 5.01
$$ ##ORIGIN= Bruker BioSpin GmbH
$$ ##OWNER= Administrator
$$ $$ E:\/data/COFFEE/nmr/UV1258_M11_1332-1242_20_7409803_wlDLvFkFin/12/pdata/1/auditp.txt
$$ ##AUDIT TRAIL=  $$ (NUMBER, WHEN, WHO, WHERE, PROCESS, VERSION, WHAT)
(   1,<2013-01-24 23:07:54.177 -0500>,<Administrator>,<X>,<go>,<TOPSPIN 2.1>,
      <created by zg
	started at 2013-01-24 22:56:24.021 -0500,
	POWCHK enabled, PULCHK disabled,
       configuration hash MD5:
       86 BA 57 50 F2 9D 5C 9B 26 00 A9 28 5F 66 2E 89
       data hash MD5: 64K
       62 8F E6 76 89 A3 8A 7D 84 71 03 4F 50 7A 8A B8>)
(   2,<2013-01-24 23:07:57.177 -0500>,<Administrator>,<X>,<proc1d>,<TOPSPIN 2.1>,
      <Start of raw data processing
       efp LB = 0.3 FT_mod = 6 PKNL = 1 PHC0 = 0 PHC1 = 0 SI = 128K 
       data hash MD5: 128K
       23 24 44 8E 8C 35 84 46 A2 44 C4 E2 0B D5 E6 19>)
(   3,<2013-01-24 23:07:58.224 -0500>,<Administrator>,<X>,<proc1d>,<TOPSPIN 2.1>,
      <pk PHC0 = -81.78772 PHC1 = 0 
       data hash MD5: 128K
       4F 05 F5 31 93 97 1C 37 6E 08 E7 E0 E0 E4 F6 90>)
(   4,<2013-01-24 23:07:58.880 -0500>,<Administrator>,<X>,<proc1d>,<TOPSPIN 2.1>,
      <abs ABSG = 1 
       data hash MD5: 128K
       6C 0B 4B 06 56 71 4D 44 E1 43 40 7B E3 C1 ED 9B>)
(   5,<2013-01-24 23:07:59.099 -0500>,<Administrator>,<X>,<proc1d>,<TOPSPIN 2.1>,
      <abs ABSG = 2 
       data hash MD5: 128K
       36 E7 F4 0E 41 1C 67 12 77 F8 79 FE E9 93 64 FB>)
(   6,<2013-01-24 23:07:59.286 -0500>,<Administrator>,<X>,<proc1d>,<TOPSPIN 2.1>,
      <abs ABSG = 3 
       data hash MD5: 128K
       3B D2 57 90 7F F0 A5 BA 61 C6 4D 25 0C C2 54 49>)
(   7,<2013-01-24 23:07:59.474 -0500>,<Administrator>,<X>,<proc1d>,<TOPSPIN 2.1>,
      <abs ABSG = 4 
       data hash MD5: 128K
       22 F5 FE 82 F4 4F AE 98 A1 D9 D9 BC 42 BF 95 0D>)
(   8,<2013-01-24 23:07:59.646 -0500>,<Administrator>,<X>,<proc1d>,<TOPSPIN 2.1>,
      <abs ABSG = 5 
       data hash MD5: 128K
       F7 19 22 DA E4 E1 6A 2C 84 FB 00 B0 9C 00 D3 ED>)
(   9,<2013-01-24 23:08:06.099 -0500>,<Administrator>,<X>,<audit>,<TOPSPIN 2.1>,
      <user comment:
       ICON-NMR User ID: COFFEE
       data hash MD5: 128K
       F7 19 22 DA E4 E1 6A 2C 84 FB 00 B0 9C 00 D3 ED>)
$$ ##END=
$$ 
$$ $$ hash MD5
$$ [...]
##$TP07= 0
##$TPNAME0= <>
##$TPNAME1= <>
##$TPNAME2= <>
##$TPNAME3= <>
##$TPNAME4= <>
##$TPNAME5= <>
##$TPNAME6= <>
##$TPNAME7= <>
##$TPOAL= (0..7)
0.5 0.5 0.5 0.5 0.5 0.5 0.5 0.5
##$TPOFFS= (0..7)
0 0 0 0 0 0 0 0
##$TUNHIN= 0
##$TUNHOUT= 0
##$TUNXOUT= 0
##$USERA1= <user>
##$USERA2= <user>
##$USERA3= <user>
##$USERA4= <user>
##$USERA5= <user>
##$V9= 5
##$VALIST= <valist>
##$VCLIST= <CCCCCCCCCCCCCCC>
##$VD= 0
##$VDLIST= <DDDDDDDDDDDDDDD>
##$VPLIST= <PPPPPPPPPPPPPPP>
##$VTLIST= <TTTTTTTTTTTTTTT>
##$WBST= 1024
##$WBSW= 4
##$XGAIN= (0..3)
0 0 0 0
##$XL= 0
##$YL= 0
##$YMAX_a= 6270418
##$YMIN_a= -12428450
##$ZGOPTNS= <>
##$ZL1= 120
##$ZL2= 120
##$ZL3= 120
##$ZL4= 120
##$ABSF1= 14.96109
##$ABSF2= -5.597092
##$ABSG= 5
##$ABSL= 3
##$ALPHA= 0
##$AQORDER= 0
##$ASSFAC= 0
##$ASSFACI= 0
##$ASSFACX= 0
##$ASSWID= 0
##$AUNMP= <proc_prof1d_extract.lims>
##$AXLEFT= 0
##$AXNAME= <>
##$AXNUC= <1H>
##$AXRIGHT= 0
##$AXTYPE= 0
##$AXUNIT= <>
##$AZFE= 0.1
##$AZFW= 0.1
##$BCFW= 0
##$BC_mod= 0
##$BYTORDP= 0
##$COROFFS= 0
##$CY= 15
##$DATMOD= 1
##$DC= 0
##$DFILT= <>
##$DTYPP= 0
##$F1P= 0
##$F2P= 0
##$FCOR= 0.5
##$FTSIZE= 131072
##$FT_mod= 6
##$GAMMA= 0
##$GB= 0
##$INTBC= 1
##$INTSCL= 1
##$ISEN= 128
##$LB= 0.3
##$LEV0= 0
##$LPBIN= 0
##$MAXI= 10000
##$MC2= 0
##$MEAN= 0
##$ME_mod= 0
##$MI= 0
##$NCOEF= 0
##$NC_proc= -2
##$NLEV= 6
##$NOISF1= 0
##$NOISF2= 0
##$NSP= 0
##$NTH_PI= 0
##$NZP= 0
##$OFFSET= 14.96109
##$PC= 1
##$PHC0= -81.78772
##$PHC1= 0
##$PH_mod= 1
##$PKNL= yes
##$PPARMOD= 0
##$PPDIAG= 0
##$PPIPTYP= 0
##$PPMPNUM= 2147483647
##$PPRESOL= 1
##$PSCAL= 4
##$PSIGN= 0
##$PYNMP= <proc.py>
##$REVERSE= no
##$SF= 400.020009601442
##$SI= 131072
##$SIGF1= 0
##$SIGF2= 0
##$SINO= 400
##$SIOLD= 131072
##$SPECTYP= <>
##$SREGLST= <1H.CDCl3>
##$SSB= 0
##$STSI= 131072
##$STSR= 0
##$SW_p= 8223.68421052631
##$SYMM= 0
##$S_DEV= 0
##$TDeff= 65536
##$TDoff= 0
##$TI= <>
##$TILT= no
##$TM1= 0
##$TM2= 0
##$TOPLEV= 0
##$USERP1= <user>
##$USERP2= <user>
##$USERP3= <user>
##$USERP4= <user>
##$USERP5= <user>
##$WDW= 1
##$XDIM= 131072
##$YMAX_p= 457191477
##$YMIN_p= -11903
##$CURPLOT= <Network HP LaserJet P1505>
##$CURPRIN= <$Network HP LaserJet P1505>
##$DFORMAT= <normdp>
##$LAYOUT= <+/1D_H.xwp>
##$LFORMAT= <normlp>
##$PFORMAT= <normpl>
##$SURQMSG= 1
$$ End of Bruker specific parameters
$$ ---------------------------------
##NTUPLES= NMR SPECTRUM
##VAR_NAME=  FREQUENCY,     SPECTRUM/REAL,   SPECTRUM/IMAG
##SYMBOL=    X,             R,               I
##VAR_TYPE=  INDEPENDENT,   DEPENDENT,       DEPENDENT
##VAR_FORM=  AFFN,          ASDF,            ASDF
##VAR_DIM=   131072,        131072,          131072
##UNITS=     HZ,            ARBITRARY UNITS, ARBITRARY UNITS
##FACTOR=    0.0627417313425164, 1,          1
##FIRST=     8223.62146879497, 1247,         -58838
##LAST=      0,             2774,            -59621
##MIN=       0,             -11903,          0
##MAX=       8223.62146879497, 457191477,    0
$$ Real data points
##PAGE= N=1
##DATA TABLE= (X++(R..R)), XYDATA
$$ [...]
$$ plain form
63924 4687774 4658086 4593501 4495926 4367745 4211980 4032715 3835046 3624486 3406229 3184713
63914 3184713 2963565 2745948 2535112 2334550 2147350 1975185 1818005 1674843 1544978
63905 1544978 1428339 1324952 1234210 1154695 1084671 1022761 968333 921302 881442 847768 818587
63894 818587 792270 767967 745513 724750 705245 686759 669664 654386 640485 626828 612944
63883 612944 599830 588884 580262 572917 566295 561305 559233 560230 563497 568644 576141 586366 598945
63870 598945 613306 629442 647707 668182 690610 714691 739967 765586 790688 815103 839296
63859 839296 863527 887382 910168 931374 950516 966951 980185 990146 996801 999696 998350 993044
63847 993044 984716 973952 960432 943553 923256 899976 874158 846198 816718 786468 755908 725173
$$ packed form
63924D687774k9688o4585r7575j28181j55765j79265j97669k10560k18257k21516
63914C184713k21148k17617k10836k00562j87200j72165j57180j43162j29865
63905A544978j16639j03387r0742p9515p0024o1910n4428m7031l9860l3674k9181
63894H18587k6317k4303k2454k0763j9505j8486j7095j5278j3901j3657j3884
63883F12944j3114j0946q622p345o622m990k072R97L267N147P497J0225J2579
63870E98945J4361J6136J8265K0475K2428K4081K5276K5619K5102K4415K4193
63859H39296K4231K3855K2786K1206J9142J6435J3234R961O655K895j346n306
63847I93044q328j0764j3520j6879k0297k3280k5818k7960k9480l0250l0560l0735
$$ plain form
63835 725173 694479 664300 635011 606631 579035 552305 526749 502691 480332 459728 440860
63824 440860 423709 408248 394221 381029 368083 355329 343258 332325 322545 313716 305809 298956
63812 298956 293216 288451 284361 280582 276941 273662 271076 269071 267188 265365 264086 263446 262559 260550 257871
63797 257871 255831 254868 254011 252274 249790 247171 244390 241006 237151 233545 230628 228293 226511 225515 225106
63782 225106 224420 222882 221054 219958 219758 219709 219359 219084 219172 219068 218131 216803 216244 216862 217829 218228 218101 218087
63764 218087 218517 219252 220061 220719 220919 220545 219918 219417 218976 218294 217456 216892 216757 216712 216413 215915 215508 215410 215709
63745 215709 216392 217388 218772 220807 223513 226264 228254 229442 230646 232512 234704 236378 237214 237698 238489
63730 238489 239701 240803 241214 241041 241201 242663 245627 249662 254430 259872 265686 271173 275885 280058 284117
$$ packed form
63835G25173l0694l0179k9289k8380k7596k6730k5556k4058k2359k0604j8868
63824D40860j7151j5461j4027j3192j2946j2754j2071j0933r780q829p907o853
63812B98956n740m765m090l779l641l279k586k005j883j823j279o40q87k009k679
63797B57871k040r63q57j737k484k619k781l384l855l606k917k335j782r96m09
63782B25106o86j538j828j096k00m9l50k75Q8j04r37j328n59O18R67L99j27j4
63764B18087M30P35Q09O58K00l74o27n01m41o82q38n64j35m5k99m98m07r8K99
63745B15709O83R96J384K035K706K751J990J188J204J866K192J674Q36M84P91
63730B38489J212J102M11j73J60J462K964M035M768N442N814N487M712M173M059
$$ plain form
63715 284117 287987 291116 293004 293438 292431 290185 287081 283554 280026 276913 274474 272561 270768 268938
63701 268938 267255 265805 264408 263057 262157 262095 262884 264454 266902 270149 273731 277371 281420 286236 291362
63686 291362 295868 299361 302107 304281 305781 306808 307985 309548 310902 311338 310869 310018 309015 307680 306108
63671 306108 305048 305316 306856 308669 309833 310514 311707 313970 316698 318818 319898 320218 319936 318599 315581
63656 315581 310795 304912 299014 293911 289623 285541 281321 277489 274878 273538 272593 271243 269612 268502
63642 268502 268553 269788 271743 273854 275826 277799 280127 282979 286239 289748 293444 297230 300920 304481 308278
63627 308278 312981 319212 327187 336553 346586 356684 366750 377086 388089 400152 413708 429081
63615 429081 446312 465287 485980 508393 532395 557941 585361 615064 646833 679705 712460
$$ packed form
63715B84117L870L129J888M34j007k246l104l527l528l113k439j913j793j830
63701B68938j683j450j397j351r00o2P89J570K448L247L582L640M049M816N126
63686B91362M506L493K746K174J500J027J177J563J354M36m69q51j003j335j572
63671C06108j060K68J540J813J164O81J193K263K728K120J080L20k82j337l018
63656C15581m786n883n898n103m288m082m220l832k611j340r45j350j631j110
63642B68502N1J235J955K111J972J973K328K852L260L509L696L786L690L561L797
63627C08278M703O231P975R366J0033J0098J0066J0336J1003J2063J3556J5373
63615D29081J7231J8975K0693K2413K4002K5546K7420K9703L1769L2872L2755
$$ plain form
63604 712460 743834 772260 796012 813989 826134 832890 834667 832089 826330 818673 809930 800636 791455
63591 791455 782754 773884 763494 750627 735052 716617 695057 670795 645325 620293 596549 574429
63579 574429 554484 537190 522139 508298 495239 483584 474062 466628 460818 456548 454169 453906 455609
63566 455609 458930 463474 468908 475161 482456 490965 500535 510922 522072 533915 546184 558870 572764
63553 572764 588996 607996 629332 652667 678490 707799 741456 779858 822419 866699 908399
63542 908399 943041 967987 982833 988219 984923 974238 958621 941257 924742 910183 897494 886344
63530 886344 876573 867791 858857 848101 834102 816232 794653 770032 743246 715055 686030 656825
63518 656825 628356 601328 575700 551027 527372 505445 485755 468110 452090 437528 424287
$$ packed form
63604G12460L1374K8426K3752J7977J2145O756J777k578n759p657q743r294r181
63591G91455q701q870j0390j2867j5575j8435k1560k4262k5470k5032k3744k2120
63579E74429j9945j7294j5051j3841j3059j1655r522p434n810m270k379k63J703
63566D55609L321M544N434O253P295Q509R570J0387J1150J1843J2269J2686J3894
63553E72764J6232J9000K1336K3335K5823K9309L3657L8402M2561M4280M1700
63542I08399L4642K4946J4846N386l296j0685j5617j7364j6515j4559j2689j1150
63530H86344r771q782q934j0756j3999j7870k1579k4621k6786k8191k9025k9205
63518F56825k8469k7028k5628k4673k3655k1927j9690j7645j6020j4562j3241
$$ plain form
63507 424287 412066 400833 391079 383245 377122 372097 367640 363264 358479 353312 348539 344847 342030 339517
63493 339517 337356 336014 335447 335095 334740 334582 334475 333871 332746 331872 331860 332481 333271 334301 335969 338360 341266
63476 341266 344578 348329 352449 356709 360800 364328 366921 368444 368928 368216 366015 362489 358468 354785 351561
63461 351561 348414 345229 342329 339903 337585 334916 332125 330155 329684 330271 330885 331332 332640 335775 340459
63446 340459 345833 351855 359288 368395 378545 389258 400925 414166 429229 446525 467208 492456
63434 492456 522150 554576 587225 617658 643941 664939 680400 690696 696593 699449 701373 704728
63422 704728 711350 722266 737977 758700 784308 814224 847560 883394 920924 959162 996253 1029246
63410 1029246 1055018 1071787 1079769 1080483 1075684 1066887 1055380 1042279 1028646 1015460 1003114 990782
$$ packed form
63507D24287j2221j1233r754p834o123n025m457m376m785n167m773l692k817k513
63493C39517k161j342n67l52l55j58j07o04j125q74j2O21P90J030J668K391K906
63476C41266L312L751M120M260M091L528K593J523M84p12k201l526m021l683l224
63461C51561l147l185k900k426k318k669k791j970m71N87O14M47J308L135M684
63446C40459N374O022P433R107J0150J0713J1667J3241J5063J7296K0683K5248
63434D92456K9694L2426L2649L0433K6283K0998J5461J0296N897K856J924L355
63422G04728O622J0916J5711K0723K5608K9916L3336L5834L7530L8238L7091L2993
63410A029246K5772J6769P982P14m799q797j1507j3101j3633j3186j2346j2332
$$ plain form
63398 990782 976719 959474 938640 914380 886806 856189 823372 789496 755532 722387 691146
63387 691146 662584 636575 612514 590319 570576 553743 539656 527896 518236 510606 504969 501393
63375 501393 499948 500440 502467 505862 510825 517485 525597 534895 545596 558311 573451 590801 609692
63362 609692 629610 650738 673894 699868 728835 760569 795119 832763 872966 913568 951507
63351 951507 984464 1011591 1032681 1047157 1054361 1054641 1049613 1041238 1030921 1019463 1007321 994524
63339 994524 980659 965320 948411 929735 908629 884447 857264 827713 796373 763877 731456
63328 731456 700602 672043 645701 621820 601527 585981 575550 570007 568711 569920 570542 567589 559960
63315 559960 548414 534098 517733 500048 482158 465149 449659 435945 423972 413350 403572 394474
$$ packed form
63398I90782j4063j7245k0834k4260k7574l0617l2817l3876l3964l3145l1241
63387F91146k8562k6009k4061k2195j9743j6833j4087j1760r660p630n637l576
63375E01393j445M92K027L395M963O660Q112R298J0701J2715J5140J7350J8891
63362F09692J9918K1128K3156K5974K8967L1734L4550L7644M0203M0602L7939
63351I51507L2957K7127K1090J4476P204K80n028q375j0317j1458j2142j2797
63339I94524j3865j5339j6909j8676k1106k4182k7183k9551l1340l2496l2421
63328G31456l0854k8559k6342k3881k0293j5546j0431n543j296J209O22k953p629
63315E59960j1546j4316j6365j7685j7890j7009j5490j3714j1973j0622r778r098
$$ plain form
63303 394474 386243 378949 372409 366490 361142 356065 350840 345666 341496 339053 337918 336990 335641 333998
63289 333998 332201 329949 326988 323703 320903 319105 318172 317521 316525 314917 313023 311572 311021 311054 310932 310296
63273 310296 309423 308753 308523 308936 310233 312324 314615 316462 317620 318092 317898 317379 317394 318702 321239 324377
63257 324377 327761 331388 335039 338184 340536 342276 343787 345640 348686 353437 359251 364869 370018 375793
63243 375793 383152 391691 400463 409388 419197 430321 442606 455998 470829 487344 505435 524983
63231 524983 546092 568718 592201 615393 637440 658492 679550 701413 723895 746253 768149
63220 768149 789775 811141 831884 851905 871639 891469 911303 930876 949917 967737 983146
63209 983146 995106 1003047 1006355 1004220 996356 983267 965342 942365 914641 884082 853320 823848
$$ packed form
63303C94474q231p294o540n919n348n077n225n174m170k443j135r28j349j643
63289C33998j797k252k961l285k800j798r33o51r96j608j894j451n51L3j22o36
63273C10296q73o70k30M13J297K091K291J847J158M72j94n19J5J308K537L138
63257C24377L384L627L651L145K352J740J511J853L046M751N814N618N149N775
63243C75793P359Q539Q772Q925R809J1124J2285J3392J4831J6515J8091J9548
63231E24983K1109K2626K3483K3192K2047K1052K1058K1863K2482K2358K1896
63220G68149K1626K1366K0743K0021J9734J9830J9834J9573J9041J7820J5409
63209I83146J1960P941L308k135p864j3089j7925k2977k7724l0559l0762k9472
$$ plain form
63197 823848 795638 768341 742234 718135 696973 679420 665499 654588 646073 639792 635682 633586
63185 633586 633828 637373 644716 654999 666966 680345 695484 711962 728579 744610 760209 775668
63173 775668 791147 807119 824096 841709 858768 874387 888414 900775 911214 919715 926261 929962
63161 929962 929288 923582 913630 900441 884179 864691 842315 817611 790883 762586 733801 705796
63149 705796 679379 654954 632788 612770 594315 576998 561059 546917 534481 523337 513365 504699
63137 504699 497189 490342 483840 477884 472877 468845 465234 461453 457757 455337 455233 457216 460101 463004
63123 463004 465882 468956 472217 475574 479000 482398 485728 489265 493279 497489 501388 505045 508939 513044
63109 513044 516845 520342 524160 528417 532372 535534 538286 540968 543237 544908 546544 548492 550123 550906
$$ packed form
63197H23848k8210k7297k6107k4099k1162j7553j3921j0911q515o281m110k096
63185F33586K42L545P343J0283J1967J3379J5139J6478J6617J6031J5599J5459
63173G75668J5479J5972J6977J7613J7059J5619J4027J2361J0439Q501O546L701
63161I29962o74n706r952j3189j6262j9488k2376k4704k6728k8297k8785k8005
63149G05796k6417k4425k2166k0018j8455j7317j5939j4142j2436j1144r972q666
63137E04699p510o847o502n956n007m032l611l781l696k420j04J983K885K903
63123D63004K878L074L261L357L426L398L330L537M014M210L899L657L894M105
63109E13044L801L497L818M257L955L162K752K682K269J671J636J948J631P83
$$ plain form
63095 550906 551530 552903 554560 555181 554467 553401 552770 552467 552342 552729 553797 555121 556274 557348 558623 560156
63079 560156 561922 563943 566094 568153 570290 573220 577587 583315 589673 595888 601751 607774 614689 622656
63065 622656 631176 640036 650065 662421 677313 694000 712004 731686 753535 777597 803993 833406
63053 833406 866480 902986 942087 983371 1027208 1074148 1124273 1177036 1231349 1285752 1339006
63042 1339006 1390824 1441821 1492486 1542404 1590804 1637714 1684097 1730802 1777870 1825070 1872491
63031 1872491 1920033 1966584 2010272 2049450 2082842 2108759 2124942 2129523 2121782 2101870 2070333 2028249
63019 2028249 1977306 1919174 1855034 1786162 1714762 1643686 1575324 1510976 1451189 1396336 1346873
63008 1346873 1303352 1266293 1235985 1212479 1195866 1186315 1183596 1186682 1194230 1205517 1220686 1239972
$$ packed form
63095E50906O24J373J657O21p14j066o31l03j25L87J068J324J153J074J275J533
63079E60156J766K021K151K059K137K930M367N728O358O215N863O023O915P967
63065F22656Q520Q860J0029J2356J4892J6687J8004J9682K1849K4062K6396K9413
63053H33406L3074L6506L9101M1284M3837M6940N0125N2763N4313N4403N3254
63042A339006N1818N0997N0665M9918M8400M6910M6383M6705M7068M7200M7421
63031A872491M7542M6551M3688L9178L3392K5917J6183M581p741j9912l1537m2084
63019B028249n0943n8132o4140o8872p1400p1076o8362o4348n9787n4853m9463
63008A346873m3521l7059l0308k3506j6613r551k719L086P548J1287J5169J9286
$$ plain form
62996 1239972 1262797 1287803 1313786 1340482 1368236 1396949 1425706 1453680 1480995 1508226 1535216
62985 1535216 1561037 1585026 1607118 1626936 1643182 1654279 1659163 1657156 1647604 1630067 1604547 1571344
62973 1571344 1531121 1485342 1435982 1384407 1331080 1276731 1222974 1171093 1121009 1072446 1026561
62962 1026561 985197 948735 915869 885501 857701 832547 809175 786634 764923 744534 725401
62951 725401 706890 688572 670616 653591 638061 624171 611407 598985 586558 574313 562424
62940 562424 550865 539875 530027 521571 514126 507329 501374 496501 492296 488047 483639 479608 476342 473620
62926 473620 471038 468579 466556 465150 464168 463250 462263 461392 460773 460142 459024 457318 455488 454001 452667 450695
62910 450695 447476 443287 439209 436307 434851 434265 433756 432852 431404 429461 427430 426121 426145 427220 428435
$$ packed form
62996A239972K2825K5006K5983K6696K7754K8713K8757K7974K7315K7231K6990
62985A535216K5821K3989K2092J9818J6246J1097M884k007r552j7537k5520l3203
62973A571344m0223m5779m9360n1575n3327n4349n3757n1881n0084m8563m5885
62962A026561m1364l6462l2866l0368k7800k5154k3372k2541k1711k0389j9133
62951G25401j8511j8318j7956j7025j5530j3890j2764j2422j2427j2245j1889
62940E62424j1559j0990r848q456p445o797n955m873m205m249m408m031l266k722
62926D73620k582k459k023j406r82r18r87q71o19o31j118j706j830j487j334j972
62910D50695l219m189m078k902j456n86n09r04j448j943k031j309K4J075J215
$$ plain form
62895 428435 429280 430086 431285 432630 433550 434116 435178 437408 440456 443209 444732 444838 443981 442905 442291 442313
62879 442313 442369 441564 439738 437793 436740 436648 436805 436668 436187 435324 433883 431913 429806 427840 426004 424327
62863 424327 422918 421591 419974 418146 416660 415733 415026 414487 414713 416060 418017 419993 422085 424378 426085
62848 426085 426319 425454 424788 424978 425532 425781 425574 425022 424267 423594 423240 422997 422521 421924 421550 421317 420933 420592 420698
62829 420698 420997 420885 420544 420810 421735 422402 422491 423043 424978 427819 430616 433358 436496 439620 441831 443292
62813 443292 445351 448922 453499 458031 462168 466252 470555 475047 479780 485109 491415 498796 507048 515790
62799 515790 524539 532891 540875 549172 558664 569713 582095 595704 610926 628097 646989 667289
62787 667289 689321 713843 741392 772427 807867 848695 894957 945906 1001340 1062213 1129616
$$ packed form
62895D28435Q45Q06J199J345R20N66J062K230L048K753J523J06q57j076o14K2
62879D42313N6q05j826j945j053r2J57j37m81q63j441j970k107j966j836j677
62863D24327j409j327j617j828j486r27p07n39K26J347J957J976K092K293J707
62848D26085K34q65o66J90N54K49k07n52p55o73l54k43m76n97l74k33l84l41J06
62829D20698K99j12l41K66R25O67Q9N52J935K841K797K742L138L124K211J461
62813D43292K059L571M577M532M137M084M303M492M733N329O306P381Q252Q742
62799E15790Q749Q352P984Q297R492J1049J2382J3609J5222J7171J8892K0300
62787F67289K2032K4522K7549L1035L5440M0828M6262N0949N5434O0873O7403
$$ plain form
62776 1129616 1203661 1283569 1368261 1456449 1546538 1636795 1725407 1810159 1888427 1957725 2016050
62765 2016050 2061631 2092915 2109108 2110357 2097164 2069937 2029400 1977026 1914792 1844838 1769454
62754 1769454 1690797 1610205 1528251 1445874 1365006 1287637 1214619 1145874 1081351 1021219 965547
62743 965547 914385 867970 826264 788548 754022 722603 694591 669839 647954 629021 613230
62732 613230 599832 587401 575345 564338 554949 546678 538874 531938 526818 523613 521448 519685 518631
62719 518631 518894 520524 523125 526531 531001 536801 543872 552030 561241 571597 583166 596115 610872
62706 610872 627866 647081 668215 691434 717686 748013 782682 821211 863095 908231 956742
62695 956742 1008708 1064183 1123248 1185816 1251261 1318184 1384522 1447990 1506541 1558406 1601911
$$ packed form
62776A129616P4045P9908Q4692Q8188R0089R0257Q8612Q4752P8268O9298N8325
62765B016050M5581L1284J6193J249j3193k7227m0537n2374o2234o9954p5384
62754A769454p8657q0592q1954q2377q0868p7369p3018o8745o4523o0132n5672
62743I65547n1162m6415m1706l7716l4526l1419k8012k4752k1885j8933j5791
62732F13230j3398j2431j2056j1007r389q271p804o936n120l205k165j763j054
62719E18631K63J630K601L406M470N800P071Q158R211J0356J1569J2949J4757
62706F10872J6994J9215K1134K3219K6252L0327L4669L8529M1884M5136M8511
62695I56742N1966N5475N9065O2568O5445O6923O6338O3468N8551N1865M3505
$$ plain form
62684 1601911 1635478 1657842 1668075 1665460 1649846 1622340 1585211 1540689 1489919 1433387 1372108
62673 1372108 1307980 1243028 1178707 1115976 1055613 998256 944332 894136 847858 805426 766508
62662 766508 730845 698501 669630 644002 620968 600028 581344 565411 552159 540585 529458
62651 529458 518251 507201 496652 486665 477219 468439 460531 453713 448174 443858 440325 437123 434274
62638 434274 432032 430291 428706 427387 426816 426905 426777 425810 424318 422779 421064 419012 417263 416617 416758 416431
62622 416431 414994 413126 411884 411562 411734 412085 412896 414802 418181 422730 427706 432643 437607 442654 447416
62607 447416 451588 455569 460192 465949 472933 481411 491932 504834 520063 537580 557584 580286 605742
62594 605742 633923 664732 698025 733909 772867 815094 859621 904490 947824 988417 1025324
$$ packed form
62684A601911L3567K2364J0233k615j5614k7506l7129m4522n0770n6532o1279
62673A372108o4128o4952o4321o2731o0363n7357n3924n0196m6278m2432l8918
62662G66508l5663l2344k8871k5628k3034k0940j8684j5933j3252j1574j1127
62651E29458j1207j1050j0549r987r446q780p908o818n539m316l533l202k849
62638D34274k242j741j585j319n71Q9j28r67j492j539j715k052j749o46J41l27
62622D16431j437j868j242l22J72L51Q11J906L379M549M976M937M964N047M762
62607D47416M172L981M623N757O984Q478J0521J2902J5229J7517K0004K2702K5456
62594F05742K8181L0809L3293L5884L8958M2227M4527M4869M3334M0593L6907
$$ plain form
62583 1025324 1057389 1083338 1102010 1112466 1114340 1108275 1095570 1077122 1053009 1023311 989000 951709
62571 951709 912925 873671 834715 796677 759942 724769 691463 660356 631662 605461 581725
62560 581725 560264 540783 523147 507486 493903 482157 471794 462533 454393 447431 441433 435925
62548 435925 430524 425337 420969 418000 416417 415601 414893 414109 413519 413449 413919 414626 415197 415414 415146 414151 412288
62531 412288 410064 408647 409010 411160 414512 418781 424102 430416 437354 444895 453601 463926 475706 488715
62517 488715 503458 520973 541917 566133 593089 622427 653999 687601 722835 759193 796186
62506 796186 833368 870230 906032 939668 969640 994299 1012383 1023530 1028179 1026861 1019719 1006968
62494 1006968 989692 969816 949114 928380 907694 887438 868942 854010 843737 837799 835124 835282
$$ packed form
62583A025324L2065K5949J8672J0456J874o065j2705j8448k4113k9698l4311l7291
62571I51709l8784l9254l8956l8038l6735l5173l3306l1107k8694k6201k3736
62560E81725k1461j9481j7636j5661j3583j1746j0363r261q140o962n998n508
62548D35925n401n187m368k969j583q16p08p84n90p0M70P07N71K17k68r95j863
62531D12288k224j417L63K150L352M269N321O314O938P541Q706J0325J1780J3009
62517D88715J4743J7515K0944K4216K6956K9338L1572L3602L5234L6358L6993
62506G96186L7182L6862L5802L3636K9972K4659J8084J1147M649j318p142j2751
62494A006968j7276j9876k0702k0734k0686k0256j8496j4932j0273n938k675J58
$$ plain form
62482 835282 838888 846524 857769 871695 887796 905608 923554 939168 950819 958634 963435 965375
62470 965375 963890 958298 947754 931233 908439 880641 849885 817420 783503 748712 714565 682455
62458 682455 652575 624398 597899 573822 552898 535252 520546 508303 497955 488883 480721 473688
62446 473688 468468 465597 464806 464989 465028 464752 464979 466552 469519 473391 477917 483139 488712 493641 496920 498188
62430 498188 497571 495245 491493 486927 482109 476927 470781 463536 455874 448532 441472 434154 426479 419125
62416 419125 412903 407958 403665 399314 394842 390871 387923 385765 383720 381525 379500 377867 376373 374796
62402 374796 373401 372595 372453 372939 374257 376528 379330 382042 384534 387061 389654 392152 394748 397879 401470
62387 401470 404900 407908 410986 414570 418403 422173 426374 431921 439038 447009 455043 462993 471165 479802
$$ packed form
62482H35282L606P636J1245J3926J6101J7812J7946J5614J1651P815M801J940
62470I65375j485n592j0544j6521k2794k7798l0756l2465l3917l4791l4147l2110
62458F82455k9880k8177k6499k4077k0924j7646j4706j2243j0348r072q162p033
62446D73688n220k871p91J83L9k76K27J573K967L872M526N222N573M929L279J268
62430D98188o17k326l752m566m818n182o146p245p662p342p060p318p675p354
62416D19125o222m945m293m351m472l971k948k158k045k195k025j633j494j577
62402C74796j395q06j42M86J318K271K802K712K492K527K593K498K596L131L591
62387D01470L430L008L078L584L833L770M201N547P117P971Q034P950Q172Q637
$$ plain form
62373 479802 488876 498172 507436 516600 526016 536333 548077 561383 576207 592680 611182 632168
62361 632168 656100 683506 714885 750377 789703 832682 879814 931997 989331 1050178 1111587
62350 1111587 1170660 1225465 1274782 1317372 1351842 1377183 1393206 1400371 1399345 1390890 1375984 1355626
62338 1355626 1330314 1299984 1264768 1225726 1184593 1142837 1101308 1060660 1021670 985037 951265
62327 951265 920821 893914 869865 847200 824880 803147 782793 763875 745599 727185 708276
62316 708276 688690 668485 648365 629405 612043 595667 579395 563065 547407 533431 521708
62305 521708 512002 503522 495682 488551 482477 477476 473332 470070 467847 466432 465344 464556 464542 465510 467091
62290 467091 468979 471424 474803 479048 483759 488591 493310 497766 502099 506706 511793 517125 522380 527536
$$ packed form
62373D79802R074R296R264R164R416J0317J1744J3306J4824J6473J8502K0986
62361F32168K3932K7406L1379L5492L9326M2979M7132N2183N7334O0847O1409
62350A111587N9073N4805M9317M2590L4470K5341J6023P165j026q455j4906k0358
62338A355626k5312l0330l5216l9042m1133m1756m1529m0648l8990l6633l3772
62327I51265l0444k6907k4049k2665k2320k1733k0354j8918j8276j8414j8909
62316G08276j9586k0205k0120j8960j7362j6376j6272j6330j5658j3976j1723
62305E21708r706q480p840p131o074n001m144l262k223j415j088p88j4R68J581
62290D67091J888K445L379M245M711M832M719M456M333M607N087N332N255N156
$$ plain form
62276 527536 532721 538009 543551 549668 556580 564262 572778 582558 594145 607880 623971 642564 663538
62263 663538 686511 711398 738796 769660 804720 844360 888667 937312 989645 1045255 1104195
62252 1104195 1166262 1230148 1293531 1353737 1408073 1453998 1489708 1514704 1529449 1534550 1530533 1518131
62240 1518131 1498113 1470814 1436375 1395505 1349441 1299013 1244412 1186300 1126623 1067763 1011172
62229 1011172 957414 907275 861967 821973 786315 753550 723281 696310 673398 654309 638060
62218 638060 623689 610548 598249 586710 576200 567055 559322 552817 547386 542802 538495 533796 528631
62205 528631 523731 519963 517565 516174 515413 515264 515905 517349 519361 521765 524826 529182 535220 542577 550414
62190 550414 558157 565806 573616 581793 590563 600161 610576 621488 632571 643637 654376 664263 672960
$$ packed form
62276E27536N185N288N542O117O912P682Q516R780J1587J3735J6091J8593K0974
62263F63538K2973K4887K7398L0864L5060L9640M4307M8645N2333N5610N8940
62252A104195O2067O3886O3383O0206N4336M5925L5710K4996J4745N101m017j2402
62240A518131k0018k7299l4439m0870m6064n0428n4601n8112n9677n8860n6591
62229A011172n3758n0139m5308l9994l5658l2765l0269k6971k2912j9089j6249
62218F38060j4371j3141j2299j1539j0510r145p733o505n431m584m307m699n165
62205E28631m900l768k398j391p61j49O41J444K012K404L061M356O038P357P837
62190E50414P743P649P810Q177Q770R598J0415J0912J1083J1066J0739R887Q697
$$ plain form
62177 672960 680616 687506 693604 698853 703785 709511 717008 726663 738589 753217 771444 794266 822379
62164 822379 855972 894656 937436 982857 1029394 1075691 1120247 1160951 1195417 1222172 1241334
62153 1241334 1253819 1260057 1259870 1253364 1241223 1224053 1202059 1175611 1145644 1113159 1078812 1043378
62141 1043378 1008251 974890 943959 915446 889492 866617 847119 830723 816936 805438 795946
62130 795946 787946 780816 774233 768429 763965 761116 759450 758183 757132 757174 759601 765040 773094 782737 792695
62115 792695 801581 808161 811855 812937 812145 810151 807453 804538 801794 799133 795830 790953 783990 774973
62101 774973 764123 751733 738478 725468 713655 703370 694740 688257 684420 682949 682938 683852 685861
62088 685861 689091 693151 697683 702853 708926 715681 722693 729969 737981 747207 757900 770075 783476
$$ packed form
62177F72960P656O890O098N249M932N726P497R655J1926J4628J8227K2822K8113
62164H22379L3593L8684M2780M5421M6537M6297M4556M0704L4466K6755J9162
62153A241334J2485O238j87o506j2141j7170k1994k6448k9967l2485l4347l5434
62141A043378l5127l3361l0931k8513k5954k2875j9498j6396j3787j1498r492
62130G95946q000p130o583n804m464k849j666j267j051M2K427N439Q054R643R958
62115G92695Q886O580L694J082p92j994k698k915k744k661l303m877o963r017
62101G74973j0850j2390j3255j3010j1813j0285q630o483l837j471j1R14K009
62088F85861L230M060M532N170O073O755P012P276Q012R226J0693J2175J3401
$$ plain form
62075 783476 797735 812828 829169 847092 866466 887014 908641 931169 954149 977422 1001622
62064 1001622 1027685 1055984 1086316 1118472 1152136 1186180 1218594 1247399 1271423 1290172 1303317
62053 1303317 1310653 1312457 1309634 1303259 1293720 1280317 1261878 1237881 1208849 1175744 1139362 1100444
62041 1100444 1059879 1018462 976750 935413 895372 857174 820588 785280 751669 720641 692604
62030 692604 667370 644834 625224 608576 594348 581672 569811 558538 548260 539531 532091 524694
62018 524694 516296 507145 498195 489771 481515 473384 465795 458812 452121 446089 441967 440579 441403 443392
62004 443392 446129 449660 453736 457972 462527 467987 474469 481226 487174 491654 494781 497308 500052 503162
61990 503162 505823 506776 505185 501158 495610 489669 483912 478052 471471 464081 456418 448881 441307 433486
$$ packed form
62075G83476J4259J5093J6341J7923J9374K0548K1627K2528K2980K3273K4200
62064A001622K6063K8299L0332L2156L3664L4044L2414K8805K4024J8749J3145
62053A303317P336J804k823o375r539j3403j8439k3997k9032l3105l6382l8918
62041A100444m0565m1417m1712m1337m0041l8198l6586l5308l3611l1028k8037
62030F92604k5234k2536j9610j6648j4228j2676j1861j1273j0278q729p440p397
62018E24694q398r151q950q424q256q131p589o983o691o032m122j388Q24J989
62004D43392K737L531M076M236M555N460O482O757N948M480L127K527K744L110
61990E03162K661R53j591m027n548n941n757n860o581p390p663p537p574p821
$$ plain form
61976 433486 425733 418660 412619 407698 404015 401563 399857 398229 396518 395128 394284 393561 392388 390766 389195
61961 389195 388077 387506 387608 388601 390359 392266 393862 395434 397533 400072 402434 404572 407366 411597 416983
61946 416983 422719 428618 435254 443191 452676 463989 477420 492725 509065 525713 542557 559828
61934 559828 577699 596278 615625 635483 655200 674126 691888 708164 722472 734456 744178 751801
61922 751801 757097 759533 758917 755709 750648 744202 736581 728311 720652 715142 712611 712730 714761 718653 725202
61907 725202 735145 748309 763675 779994 796231 811610 825486 837247 846254 851891 853690 851486
61895 851486 845529 836415 824744 810778 794601 776678 757997 739473 721383 703684 686632 670750
61883 670750 656225 642688 629602 616668 603892 591495 579710 568484 557524 546884 537289 529430
$$ packed form
61976D33486p753p073o041m921l683k452j706j628j711j390q44p23j173j622j571
61961C89195j118n71J02R93J758J907J596J572K099K539K362K138K794M231N386
61946D16983N736N899O636P937R485J1313J3431J5305J6340J6648J6844J7271
61934E59828J7871J8579J9347J9858J9717J8926J7762J6276J4308J1984R722P623
61922G51801N296K436o16l208n061o446p621q270p659n510k531J19K031L892O549
61907G25202R943J3164J5366J6319J6237J5379J3876J1761R007N637J799k204
61895H51486n957r114j1671j3966j6177j7923j8681j8524j8090j7699j7052j5882
61883F70750j4525j3537j3086j2934j2776j2397j1785j1226j0960j0640r595p859
$$ plain form
61871 529430 523041 517206 511607 506970 504140 503156 503478 504683 506662 509412 513039 517849 524209 532356 542415
61856 542415 554456 568412 584153 601796 621782 644500 669954 697898 728103 760275 793789
61845 793789 827753 861420 894387 926265 956124 982420 1003605 1018850 1028053 1031313 1028822 1021400
61833 1021400 1010664 998255 985141 972010 960029 950649 944811 942825 944903 951144 960947 973047
61821 973047 986308 1000037 1013377 1024926 1033203 1037151 1035957 1028851 1015447 996075 971584 943030
61809 943030 911680 878948 846020 813648 782336 752449 724072 697145 671966 649235 629439
61798 629439 612451 597841 585231 574210 564331 555478 547888 541524 535773 530098 524670 520019 516289
61785 516289 513171 510344 507611 504814 501960 499311 497074 495095 493148 491365 490037 489112 488188 486977 485487
$$ packed form
61871E29430o389n835n599m637k830r84L22J205J979K750L627M810O360Q147J0059
61856E42415J2041J3956J5741J7643J9986K2718K5454K7944L0205L2172L3514
61845G93789L3964L3667L2967L1878K9859K6296K1185J5245R203L260k491p422
61833A021400j0736j2409j3114j3131j1981r380n838j986K078O241R803J2100
61821I73047J3261J3729J3340J1549Q277L948j194p106j3404j9372k4491k8554
61809I43030l1350l2732l2928l2372l1312k9887k8377k6927k5179k2731j9796
61798F29439j6988j4610j2610j1021r879q853p590o364n751n675n428m651l730
61785E16289l118k827k733k797k854k649k237j979j947j783j328r25r24j211j490
$$ plain form
61770 485487 483832 482128 480557 479259 478141 477015 475977 475466 475872 477168 478996 481070 483427 486237 489357
61755 489357 492227 494297 495428 495746 495325 494299 493113 492200 491393 490091 488130 486047 484335 482791 480817
61740 480817 478046 474554 470822 467689 465955 465650 465932 465958 465730 465932 467165 469470 472355 475101 477263 478994
61724 478994 480698 482420 483975 485616 487920 490835 493518 495432 497012 498795 500571 501960 503209 504580
61710 504580 505386 504606 502350 499866 498048 496628 494906 492516 489246 484821 479332 473573 468552 464767 462053
61695 462053 459887 457703 455111 452037 448604 444860 440748 436306 431788 427538 423791 420536 417539 414610
61681 414610 411906 409742 408045 406320 404320 402370 400703 398917 396541 393897 391779 390392 389143 387499
61667 387499 385606 384003 383107 382968 383233 383373 383317 383697 385023 386725 387606 387321 386752 386777 387284 387764 388308 389460
$$ packed form
61770D85487j655j704j571j298j118j126j038n11M06J296J828K074K357K810L120
61755D89357K870K070J131L18m21j026j186r13q07j302j961k083j712j544j974
61740D80817k771l492l732l133j734l05K82K6k28K02J233K305K885K746K162J731
61724D78994J704J722J555J641K304K915K683J914J580J783J776J389J249J371
61710E04580Q06p80k256k484j818j420j722k390l270m425n489n759n021l785k714
61695D62053k166k184k592l074l433l744m112m442m518m250l747l255k997k929
61681D14610k704k164j697j725k000j950j667j786k376k644k118j387j249j644
61667C87499j893j603q96j39K65J40n6L80J326J702Q81k85n69K5N07M80N44J152
$$ plain form
61649 389460 391374 393651 395861 397835 399561 401236 403441 406816 411360 416232 420436 423674 426378 428964
61635 428964 431128 431970 430813 427905 424260 420767 417458 413685 409046 404053 399784 396835 394807 392946
61621 392946 391120 389849 389440 389432 389072 388084 386812 385766 385181 384827 384100 382451 379894 376945 373932 370536
61605 370536 366210 360921 355271 349979 345409 341466 337819 334265 330943 328024 325243 322094 318599 315490
61591 315490 313283 311532 309433 306960 304914 303881 303562 303192 302343 301211 300307 299954 300018 300129 300118 299999 299535
61574 299535 298199 295883 293383 291815 291643 292478 293628 294571 295071 295220 295323 295541 295735 295843 296083 296531 296818
61557 296818 296703 296711 297598 299251 300684 301241 301357 301989 303583 305742 307628 308624 308784 308743 309055 309659 310149 310419
61539 310419 310808 311701 313281 315557 318293 320928 322886 324108 325088 326351 328003 329699 330919 331366 331244
$$ packed form
61649C89460J914K277K210J974J726J675K205L375M544M872M204L238K704K586
61635D28964K164Q42j157k908l645l493l309l773m639m993m269k949k028j861
61621C92946j826j271m09ql60r88j272j046n85l54p27j649k557k949l013l396
61605C70536m326n289n650n292m570l943l647l554l322k919k781l149l495l109
61591C15490k207j751k099k473k046j033l19l70q49j132r04l53O4J11j1j19m64
61574B99535j336k316k500j568j72Q35J150R43N00J49J03K18J94J08K40M48K87
61557B96818j15QQ87J653J433N57J16O32J594K159J886R96J60m1L12O04M90K70
61539C10419L89Q93J580K276K736K635J958J222R80J263J652J696J220M47j22
$$ plain form
61524 331244 331005 330725 329931 328240 325885 323387 321048 319049 317676 316952 316361 315497 314729 314652 315029 314990 314294
61507 314294 313704 313964 314884 315681 315851 315541 315308 315554 316029 315959 314954 313594 312766 312653 312876 313369 314407 315824
61489 315824 316931 317374 317481 317634 317862 318187 318749 319359 319473 318903 318092 317502 317210 317326 318209 319885 321719 323097
61471 323097 324064 324948 325711 326106 326210 326319 326458 326392 326111 326055 326755 328311 330148 331340 331363 330597 329944 329994 330707
61452 330707 331754 332774 333452 333753 334103 334885 335802 336305 336680 338006 340757 344085 346812 348654 350082 351492
61436 351492 353009 354780 356876 359111 361368 363979 367369 371333 374917 377086 377466 376550 375225 374007 372854
61421 372854 371944 372309 374924 379127 382746 384243 384190 384223 385163 386678 388233 389494 390015 389334 387532 385199
61405 385199 382771 380244 377559 374916 372621 370864 369652 368796 367967 366957 365883 365041 364624 364614 364806 364818
$$ packed form
61524C31244k39k80p94j691k355k498k339j999j373p24n91q64p68p7L77l9o96
61507C14294n90K60R20P97J70l10k33K46M75p0j005j360q28j13K23M93J038J417
61489C15824J107M43J07J53K28L25N62O10J14n70q11n90k92J16Q83J676J834J378
61471C23097R67Q84P63L95J04J09J39o6k81n6P00J556J837J192K3p66o53N0P13
61452C30707J047J020O78L01L50P82R17N03L75J326K751L328K727J842J428J410
61436C51492J517J771K096K235K257K611L390L964L584K169L80r16j325j218j153
61421C72854r10L65K615M203L619J497n3L3R40J515J555J261N21o81j802k333
61405C85199k428k527k685k643k295j757j212q56q29j010j074q42m17j0J92J2
$$ plain form
61389 364818 364330 363447 362588 361934 361324 360851 361114 362514 364624 366701 368541 370390 372248 373840 375154 376476
61373 376476 377848 378982 379839 380855 382424 384464 386648 388814 390966 393070 395046 396856 398510 400092
61359 400092 401861 404238 407568 411845 416742 421927 427405 433578 440921 449562 459156 469105 478789 487664
61345 487664 495350 501773 507166 511859 516118 520090 523786 527043 529683 531753 533462 534853 535653 535560 534593
61330 534593 533131 531598 530029 527909 524656 520450 516400 513533 511748 510136 508216 506293 504643 503033
61316 503033 501365 500195 500078 500681 501122 501104 501373 503041 506778 512674 520585 530409 542021 555019 568667
61301 568667 582122 594641 605404 613394 617863 619029 618007 615927 613285 610110 606398 602181 597423
61288 597423 592093 586342 580494 574875 569507 563943 557668 550945 544969 540718 537931 535793 534392 534657
$$ packed form
61389C64818m88q83q59o54o10m73K63J400K110K077J840J849J858J592J314J322
61373C76476J372J134Q57J016J569K040K184K166K152K104J976J810J654J582
61359D00092J769K377L330M277M897N185N478O173P343Q641R594R949R684Q875
61345D87664P686O423N393M693M259L972L696L257K640K070J709J391Q00r3r67
61330E34593j462j533j569k120l253m206m050k867j785j612j920j923j650j610
61316E03033j668j170j17O03M41j8K69J668L737N896P911R824J1612J2998J3648
61301E68667J3455J2519J0763P990M469J166j022k080k642l175l712m217m758
61288E97423n330n751n848n619n368n564o275o723n976m251k787k138j401K65
$$ plain form
61274 534657 536814 539802 542611 545417 548888 552939 556808 560039 562784 565322 567778 570314 573339 577537
61260 577537 583709 592274 602734 613866 624595 634461 643294 650946 657488 663102 667486 669870 669965 668440
61246 668440 666035 662714 658212 653011 648099 643885 639944 635793 631436 627047 622509 617477 611819 605888
61232 605888 600259 595183 590479 586218 583217 582374 583593 585903 588528 591226 593680 595474 596939 599125
61218 599125 602527 606505 610347 614211 618561 623407 628609 634212 639892 644752 648321 651149 653752 655711
61204 655711 656650 657409 659198 662065 665300 669027 674249 681427 690076 699873 711327 725131 741452 759783
61190 759783 778834 796651 811589 823264 832130 838336 841781 843128 843828 844927 846478 848125 849501
61177 849501 849916 848423 844573 838702 831358 822866 813543 803814 793922 783863 773683 763436 752896
$$ packed form
61274E34657K157K988K809K806L471M051L869L231K745K538K456K536L025M198
61260E77537O172Q565J0460J1132J0729R866Q833P652O542N614M384K384R5j525
61246F68440k405l321m502n201m912m214l941m151m357m389m538n032n658n931
61232F05888n629n076m704m261l001q43J219K310K625K698K454J794J465K186
61218E99125L402L978L842L864M350M846N202N603N680M860L569K828K603J959
61204F55711R39P59J789K867L235L727N222P178Q649R797J1454J3804J6321J8331
61190G59783J9051J7817J4938J1675Q866O206L445J347P00J099J551J647J376
61177H49501M15j493l850n871p344q492r323r729r892j0059j0180j0247j0540
$$ plain form
61164 752896 741756 730188 718756 707757 697007 686217 675156 663515 651184 638770 627439
61153 627439 618126 611107 606245 603275 602005 602559 605164 609293 613298 615429 615015 612150 606753 598856 589560
61138 589560 580652 573049 566406 560296 554956 550714 547497 545274 544349 544924 546915 550409 555713 562718 570770
61123 570770 579528 589410 600929 614012 628318 643853 660878 679415 699067 719262 739638 760317
61111 760317 781680 803685 825670 847118 868228 889187 909275 927484 943812 959075 973371
61100 973371 985536 994198 998688 998909 995150 988202 978966 967688 954155 938675 922108 904781 886257
61087 886257 866426 846048 825854 805893 786224 767605 750975 736663 724409 713741 704054 694913
61075 694913 686587 679922 675421 672864 671852 672130 673228 674475 675693 677339 679801 683124 687458 692923
$$ packed form
61164G52896j1140j1568j1432j0999j0750j0790j1061j1641j2331j2414j1331
61153F27439r313p019m862k970j270N54K605M129M005K131m14k865n397p897r296
61138E89560q908p603o643o110n340m242l217k223r25N75J991L494N304P005Q052
61123E70770Q758R882J1519J3083J4306J5535J7025J8537J9652K0195K0376K0679
61111G60317K1363K2005K1985K1448K1110K0959K0088J8209J6328J5263J4296
61100I73371J2165Q662M490K21l759o948r236j1278j3533j5480j6567j7327j8524
61087H86257j9831k0378k0194j9961j9669j8619j6630j4312j2254j0668r687r141
61075F94913q326o665m501k557j012K78J098J247J218J646K462L323M334N465
$$ plain form
61061 692923 698888 704387 709689 716484 725876 737053 748600 760327 772964 786783 801611 817787
61049 817787 836077 856640 878865 902239 926805 952744 980074 1008797 1039006 1070668 1103513
61038 1103513 1137164 1171403 1206446 1242920 1281324 1321627 1363767 1408438 1456761 1509073 1564491
61027 1564491 1621675 1679521 1737265 1794782 1852934 1912981 1975668 2041718 2113123 2192714 2282027
61016 2282027 2380578 2487512 2602873 2727144 2861278 3008210 3173388 3363244 3584490 3845681
61006 3845681 4158198 4535505 4994306 5558760 6262626 7147563 8263563 9670101 11418186
60997 11418186 13499987 15794845 18069957 20059088 21569756 22542292 23036636 23188983
60989 23188983 23180626 23208213 23422585 23849681 24357933 24714965 24698681 24183593 23158576 21696426
$$ packed form
61061F92923N965N499N302O795R392J1177J1547J1727J2637J3819J4828J6176
61049H17787J8290K0563K2225K3374K4566K5939K7330K8723L0209L1662L2845
61038A103513L3651L4239L5043L6474L8404M0303M2140M4671M8323N2312N5418
61027A564491N7184N7846N7744N7517N8152O0047O2687O6050P1405P9591Q9313
61016B282027R8551J06934J15361J24271J34134J46932J65178J89856K21246K61191
61006C845681L12517L77307M58801N64454P03866Q84937J116000J406538J748085
60997A1418186K081801K294858K275112J989131J510668R72536M94344J52347
60989B3188983q357K7587K14372M27096N08252L57032j6284n15088j025017j462150
$$ plain form
60979 21696426 19916856 17959170 15958441 14024130 12229944 10617138 9202627 7985114
60971 7985114 6950693 6079584 5351049 4744517 4239688 3817994 3463846 3164207 2908007
60962 2908007 2686595 2493758 2324476 2174237 2039935 1920428 1815353 1723769 1644292 1575638
60952 1575638 1516231 1463798 1416096 1371753 1329908 1289563 1249965 1211262 1174041 1138376 1103894
60941 1103894 1070721 1039703 1011495 985673 960859 935653 909560 883237 857796 833796 811008
60930 811008 789109 768252 748803 730852 714302 699244 685888 674127 663455 653418 644051 635813
60918 635813 629114 623857 619436 615180 610841 606710 603368 601285 600488 600514 600798 601213 602111 603757 605927 608164
60902 608164 610157 611727 612762 613432 614192 615143 615595 614617 611949 608061 603453 598304 592759 587172 581987
$$ packed form
60979B1696426j779570j957686k000729j934311j794186j612806j414511j217513
60971G985114j034421q71109p28535o06532n04829m21694l54148k99639k56200
60962B908007k21412j92837j69282j50239j34302j19507j05075r1584p9477o8654
60952A575638n9407n2433m7702m4343m1845m0345l9598l8703l7221l5665l4482
60941A103894l3173l1018k8208k5822k4814k5206k6093k6323k5441k4000k2788
60930H11008k1899k0857j9449j7951j6550j5058j3356j1761j0672j0037r367q238
60918F35813o699n257m421m256m339m131l342k083p97K6K84M15Q98J646K170K237
60902F08164J993J570J035O70P60R51M52r78k668l888m608n149n545n587n185
$$ plain form
60887 581987 577496 573638 569830 565208 559312 552376 544763 536405 527187 517576 508374 499921 491994 484444
60873 484444 477531 471652 467050 463669 460986 458194 454917 451609 448961 447209 446424 446970 448928 451363 453081
60858 453081 454089 455489 457839 460444 462474 463953 465333 466793 468468 470743 473761 476975 479699 481876
60844 481876 483896 485898 487633 488876 489580 489614 488684 486584 483482 479856 476058 471955 467181 461888 457016
60829 457016 453483 451250 449517 447755 446106 444824 443782 442612 441003 438811 436214 433786 432002 430573
60815 430573 428628 425664 422064 418630 415888 413845 412035 409753 406580 402779 398946 395290 391628 387969
60801 387969 384614 381631 378792 376135 374056 372576 371025 368778 365964 363132 360591 358420 356885 356380
60787 356380 356955 358103 359057 359335 359134 359233 360262 362049 363832 365102 365908 366390 366455 366126 365899 366432 367948
$$ packed form
60887E81987m491l858l808m622n896o936p613q358r218r611r202q453p927p550
60873D84444o913n879m602l381k683k792l277l308k648j752p85N46J958K435J718
60858D53081J008J400K350K605K030J479J380J460J675K275L018L214K724K177
60844D81876K020K002J735J243P04L4r30k100l102l626l798m103m774n293m872
60829D57016l533k233j733j762j649j282j042j170j609k192k597k428j784j429
60815D30573j945k964l600l434k742k043j810k282l173l801l833l656l662l659
60801C87969l355k983k839k657k079j480j551k247k814k832k541k171j535n05
60787C56380N75J148R54K78k01R9J029J787J783J270Q06M82O5l29k27N33J516
$$ plain form
60770 367948 370090 372306 374346 376425 378863 381512 383740 385154 386090 387110 388313 389540 390916 392493
60756 392493 393593 393274 391555 389460 387749 386277 384820 383776 383637 384347 385606 387327 389354 391148 392253
60741 392253 392762 392861 392143 389874 385816 380463 374614 369018 364208 360249 356626 352691 348341 344161 340907
60726 340907 338871 337676 336604 335189 333464 331651 329783 327844 326144 325215 325332 326325 327762 329065 329676
60711 329676 329544 329358 329894 331199 332835 334682 336934 339404 341631 343653 345924 348327 350136 351186 352327
60696 352327 354319 356989 359883 363000 366317 369249 371269 372664 374091 375774 377655 379841 382266 384280
60682 384280 385240 385346 385390 385911 387013 388608 390259 391141 390863 390150 390067 390773 391594 392034 391995 391175 389130 385991
60664 385991 382402 378665 374583 370250 366319 363259 360950 359252 358400 358444 358807 358864 358668 358753 359426 360580 362030
$$ packed form
60770C67948K142K216K040K079K438K649K228J414R36J020J203J227J376J577
60756C92493J100l19j719k095j711j472j457j044j39P10J259J721K027J794J105
60741C92253N09R9p18k269m058n353n849n596m810l959l623l935m350m180l254
60726C40907k036j195j072j415j725j813j868j939j700r29J17R93J437J303O11
60711C29676j32j86N36J305J636J847K252K470K227K022K271K403J809J050J141
60696C52327J992K670K894L117L317K932K020J395J427J683J881K186K425K014
60682C84280R60J06M4N21J102J595J651Q82k78p13q3P06Q21M40l9q20k045l139
60664C85991l589l737m082m333l931l060k309j698q52M4L63N7j96Q5O73J154J450
$$ plain form
60647 362030 363738 365827 368540 371972 375619 378397 379434 378746 376908 374277 370881 366991 363231 359933
60633 359933 356742 353211 349583 346672 345082 344839 345663 347141 348593 349341 349475 350015 351832 354551 356916
60618 356916 358187 358754 359392 360332 361229 361738 361908 362111 362721 363802 365114 366464 367855 369183 370086 370422 370616
60601 370616 371057 371348 370756 369326 367931 367244 367313 368168 370013 372511 374663 375871 376584 377461 378488 379410 380421
60584 380421 381671 382567 382398 381498 381026 381636 383029 384791 386962 389606 392385 394930 397324 400001 403390
60569 403390 407848 413749 421420 431007 442391 455143 468628 482300 495962 509586 522756 534342
60557 534342 542803 546987 546857 543491 538295 532168 525496 518771 512797 508200 505061 503232 502793 503996 506962
60542 506962 511664 518067 526163 536018 547984 562725 580835 602417 627010 653690 681146 707788
$$ packed form
60647C62030J708K089K713L432L647K778J037o88j838k631l396l890l760l298
60633C59933l191l531l628k911j590k43Q24J478J452P48J34N40J817K719K365
60618C56916J271N67O38R40Q97N09J70K03O10J081J312J350J391J328R03L36J94
60601C70616M41K91n92j430j395o87O9Q55J845K498K152J208P13Q77J027R22J011
60584C80421J250Q96j69r00m72O10J393J762K171K644K779K545K394K677L389
60569D03390M458N901P671R587J1384J2752J3485J3672J3662J3624J3170J1586
60557E34342Q461M184j30l366n196o127o672o725n974m597l139j829m39J203K966
60542E06962M702O403Q096R855J1966J4741J8110K1582K4593K6680K7456K6642
$$ plain form
60530 707788 731930 751938 766483 775020 777969 776087 769819 759676 747102 734155 722028 710440
60518 710440 698733 687000 675833 665563 656305 648353 642023 637369 634449 633571 634827 637645 641281
60505 641281 645624 651258 659015 669778 684332 703008 725711 752695 784983 823538 868225 917974
60493 917974 971620 1028084 1086052 1144077 1200860 1254943 1304280 1346688 1380619 1405025 1418611
60482 1418611 1419875 1407988 1383262 1346790 1300032 1244803 1183300 1118106 1052223 988647 929294
60471 929294 874370 823210 775692 732479 694108 660432 630910 604940 581904 561361 543275
60460 543275 527793 514802 504009 495173 487819 480965 473823 466733 460774 456269 452280 447743 442632
60447 442632 437757 433831 430980 428886 427091 425222 423077 420575 417815 415329 413955 414018 414799 415241 415037
$$ packed form
60530G07788K4142K0008J4545Q537K949j882o268j0143j2574j2947j2127j1588
60518G10440j1707j1733j1167j0270r258p952o330m654k920q78J256K818L636
60505F41281M343N634P757J0763J4554J8676K2703K6984L2288L8555M4687M9749
60493I17974N3646N6464N7968N8025N6783N4083M9337M2408L3931K4406J3586
60482A418611J264j1887k4726l6472m6758n5229o1503o5194o5883o3576n9353
60471I29294n4924n1160m7518m3213l8371l3676k9522k5970k3036k0543j8086
60460E43275j5482j2991j0793q836p354o854p142p090n959m505l989m537n111
60447D42632m875l926k851k094j795j869k145k502k760k486j374O3P81M42k04
$$ plain form
60432 415037 414607 414195 413596 412703 411660 410429 408903 407575 407342 408189 408663 407325 404447 401739 400494 400440
60416 400440 400460 400058 399918 401094 403795 407066 409631 410951 411386 411546 411769 412080 412391 412663 413114 414188 416066
60399 416066 418300 420248 421849 423602 425739 427812 429330 430452 431804 433691 435734 437255 437956 438258 439046
60384 439046 440987 443965 447205 449940 451990 453700 455372 456828 457743 458401 459744 462323 465385 467593 468594
60369 468594 469265 470376 471757 473051 474525 476529 478718 480492 481860 483222 484630 485978 487673 490396
60355 490396 494265 498829 503825 509429 515915 523548 532586 542699 552575 560883 567584 573489 578456 580958
60341 580958 579719 575134 568704 561718 554882 548649 543235 538417 533769 529139 524785 521067 518021 515169
60327 515169 511850 507919 503908 500308 496896 493227 489530 486582 484741 483648 482863 482339 482272 483030 485248
$$ packed form
60432D15037m30m12n99q93j043j231j526j328k33Q47M74j338k878k708j245n4
60416D00440K0m02j40J176K701L271K565J320M35J60K23L11L11K72M51J074J878
60399D16066K234J948J601J753K137K073J518J122J352J887K043J521P01L02P88
60384D39046J941K978L240K735K050J710J672J456R15O58J343K579L062K208J001
60369D68594O71J111J381J294J474K004K189J774J368J362J408J348J695K723
60355D90396L869M564M996N604O486P633R038J0113R876Q308O701N905M967K502
60341E80958j239m585o430o986o836o233n414m818m648m630m354l718l046k852
60327E15169l319l931m011l600l412l669l697k948j841j093p85n24o7P58K218
$$ plain form
60312 485248 489494 495705 503316 511978 521775 532821 545103 558658 573418 588955 604921 621580
60300 621580 639135 656517 671634 683045 690603 694238 692932 685558 672268 654582 634471 613694
60288 613694 593680 575420 559433 545935 534881 525797 517898 510602 503850 497945 493242 489852 487290
60275 487290 484557 480963 476792 472750 469043 465542 462523 460424 458985 457582 456397 456265 457172 457924 457693
60260 457693 456939 456368 455931 455441 455269 455623 455821 455143 453989 453453 454114 455833 458297 461055 463379 464820 465757
60243 465757 466790 467821 468313 468252 468211 468522 468917 468979 468527 467587 466376 465301 464746 464879 465766 467447 469698 472043
60225 472043 474256 476600 479287 481964 484007 485108 485446 485638 486664 489301 493324 497693 501862 506342 511626
60210 511626 517174 522113 526448 530810 535352 539638 543479 547168 550965 554947 559290 564091 568923 573082
$$ packed form
60312D85248M246O211P611Q662R797J1046J2282J3555J4760J5537J5966J6659
60300F21580J7555J7382J5117J1411P558L635j306p374j3290j7686k0111k0777
60288F13694k0014j8260j5987j3498j1054r084p899p296o752n905m703l390k562
60275D87290k733l594m171m042l707l501l019k099j439j403j185j32R07P52k31
60260D57693p54n71m37m90j72L54J98o78j154n36O61J719K464K758K324J441R37
60243D65757J033J031M92o1m1L11L95O2m52r40j211j075n55J33Q87J681K251K345
60225D72043K213K344K687K677K043J101L38J92J026K637M023M369M169M480N284
60210E11626N548M939M335M362M542M286L841L689L797L982M343M801M832M159
$$ plain form
60196 573082 576366 579194 581937 584527 586705 588264 589008 588844 587934 586532 584695 582392 579812 577213 574553
60181 574553 571585 568295 564948 561671 558271 554553 550731 547465 545388 544441 543750 542487 540829 539723 539693
60166 539693 540384 541286 542180 542644 541923 539856 537328 535249 533613 532161 531357 531865 533439 535201 536757 538250
60150 538250 539542 540236 540489 540976 541937 542927 543568 543929 544222 544756 546199 549137 553223 557440 561309 565231
60134 565231 569518 573883 578184 582928 588492 594298 599250 602674 604521 604989 604449 603525 602855 602781 603391 604678
60118 604678 606410 608136 609619 611193 613370 616124 618783 620687 621804 622592 623322 623663 623066 621501 619580
60103 619580 617825 616065 613765 610796 607597 604607 601798 598759 595097 590874 586869 584281 583812 585051
60089 585051 586987 589103 591670 595015 598880 602592 605603 607680 608799 609040 608492 607164 605023 602152 598782
$$ packed form
60196E73082L284K828K743K590K178J559P44j64r10j402j837k303k580k599k660
60181E74553k968l290l347l277l400l718l822l266k077r47o91j263j658j106l0
60166E39693O91R02Q94M64p21k067k528k079j636j452q04N08J574J762J556J493
60150E38250J292O94K53M87R61R90O41L61K93N34J443K938M086M217L869L922
60134E65231M287M365M301M744N564N806M952L424J847M68n40r24o70p4O10J287
60118F04678J732J726J483J574K177K754K659J904J117P88P30L41n97j565j921
60103F19580j755j760k300k969l199k990k809l039l662m223m005k588m69J239
60089E85051J936K116K567L345L865L712L011K077J119K41n48j328k141k871l370
$$ plain form
60074 598782 595087 591000 586315 581060 575747 571036 566923 562426 556444 549017 541383 534721 529211 524426
60060 524426 520069 515949 511686 507057 502446 498445 495100 492000 489026 486546 484865 483949 483765 484508 486283
60045 486283 488783 491497 494185 497037 500337 503978 507420 510262 512738 515298 517800 519577 520361 520572 520530
60030 520530 520038 519067 518163 517555 516440 513965 510541 507357 504783 502103 498755 494936 490830 486048 480224
60015 480224 473612 466764 459918 453018 446077 439356 433327 428466 424891 422265 420286 419051 418583 418258 417336
60000 417336 416025 415334 415770 416772 417697 418747 420471 422744 424771 426019 426815 427995 430131 433119 436446
59985 436446 439777 443130 446361 448775 449623 448960 447691 446693 446107 445467 444222 442105 439312 436506 434457
59970 434457 433506 433390 433561 433647 433643 433781 434194 434725 435234 436042 437733 440411 443503 446468 449292 452016 454228
$$ packed form
60074E98782l695m087m685n255n313m711m113m497n982p427p634o662n510m785
60060E24426m357m120m263m629m611m001l345l100k974k480j681r16j84P43J775
60045D86283K500K714K688K852L300L641L442K842K476K560K502J777P84K11m2
60030E20530m92r71r04o08j115k475l424l184k574k680l348l819m106m782n824
60015D80224o612o848o846o900o941o721o029m861l575k626j979j235m68l25r22
60000D17336j311o91M36J002R25J050J724K273K027J248P96J180K136K988L327
59985D36446L331L353L231K414Q48o63j269r98n86o40j245k117k793k806k049
59970D34457r51j16J71Q6mJ38M13N31N09Q08J691K678L092K965K824K724K212
$$ plain form
59953 454228 455490 455944 455984 455565 454289 452050 449232 446459 444449 443725 444033 444371 444048 443353 442723 441797 440067
59936 440067 437983 436468 435570 434611 433543 433097 433533 434322 435250 436852 439396 442310 445183 448605 453504 460079
59920 460079 467657 475048 480846 484071 485057 485169 485334 485307 484718 484108 484404 485857 488071 490731 493762 496989
59904 496989 500095 502799 504878 506301 507553 509399 512002 514634 516595 518075 519762 521964 524477 527054
59890 527054 529569 531975 534484 537547 541384 545725 550320 555370 561119 567296 573402 579286 585022 590407
59876 590407 595113 599290 603496 607922 611980 614718 615494 614261 611468 607798 603790 599595 595121 590437
59862 590437 585975 582258 579429 577167 575179 573665 573044 573253 573760 574414 575812 578434 581970 586086 591486
59847 591486 599266 609227 619630 628722 635847 640957 643923 644807 644299 643458 643275 644497 647198 650193 651531
$$ packed form
59953D54228J262M54M0m19j276k239k818k773k010p24L08L38l23o95o30r26j730
59936D40067k084j515q98r59j068m46M36P89R28J602K544K914K873L422M899O575
59920D60079P578P391N798L225R86J12J65k7n89o10K96J453K214K660L031L227
59904D96989L106K704K079J423J252J846K603K632J961J480J687K202K513K577
59890E27054K515K406K509L063L837M341M595N050N749O177O106N884N736N385
59876E90407M706M177M206M426M058K738P76j233k793l670m008m195m474m684
59862E90437m462l717k829k262j988j514o21K09N07O54J398K622L536M116N400
59847E91486P780R961J0403R092P125N110K966Q84n08q41j83J222K701K995J338
$$ plain form
59832 651531 650037 646052 640534 634067 627084 620270 614078 608299 602706 597676 593511 589575 584889 579380
59818 579380 573840 568737 563741 558465 553001 547616 542410 537472 532979 528956 525199 521581 518180 515049
59804 515049 512104 509386 507221 505921 505404 505222 504910 504211 503023 501312 499256 497377 496283 496124 496481 496894
59788 496894 497326 497934 498609 499108 499473 499918 500365 500468 500107 499525 498981 498589 498447 498549 498611 498407 498269 498775 499903
59769 499903 500977 501573 502097 503283 505451 508304 511137 513284 514742 516325 518775 521835 524700 527234 530130
59754 530130 533956 538738 544395 550705 556816 561748 565652 569732 574656 579899 584926 590086 595891 602311
59740 602311 609242 616702 624071 630134 634573 638436 642329 645165 645747 644687 643551 642755 641650 640154 638884
59725 638884 637868 636460 634531 632628 630906 628962 626767 624678 622412 619100 614678 610293 606954 604548
$$ packed form
59832F51531j494l985n518o467o983o814o192n779n593n030m165l936m686n509
59818E79380n540n103m996n276n464n385n206m938m493m023l757l618l401l131
59804E15049k945k718k165j300n17j82l12o99j188j711k056j879j094j59L57M13
59788D96894M32O08O75M99L65M45M47J03l61n82n44l92j42J02O2k04j38N06J128
59769D99903J074N96N24J186K168K853K833K147J458J583K450L060K865K534K896
59754E30130L826M782N657O310O111M932L904M080M924N243N027N160N805O420
59740F02311O931P460P369O063M439L863L893K836N82j060j136p96j105j496j270
59725F38884j016j408j929j903j722j944k195k089k266l312m422m385l339k406
$$ plain form
59711 604548 602511 600659 598901 596891 594547 592435 591090 590267 589293 587958 586704 586080 586287 587125 588209
59696 588209 589276 590253 590987 591190 590972 591166 592539 594686 596289 596546 595829 594814 593583 591928 590051 588458
59680 588458 587282 586061 584217 581587 578547 575649 573069 570404 567046 562757 557762 552462 547233 542380
59666 542380 538011 533965 530108 526673 524121 522707 522325 522669 523376 524178 525168 526781 529216 531998 534362
59651 534362 536036 537379 538965 541250 544393 547930 550744 551819 551062 549093 546380 542990 539053 534924
59637 534924 530803 526687 522814 519716 517656 516342 515340 514478 513698 512817 511674 510304 508793 507055 504907
59622 504907 502251 499130 495670 492050 488459 485008 481689 478430 475207 472197 469788 468259 467419 466780 466176
59607 466176 465944 466394 467388 468687 470412 472800 475622 478179 479894 480754 481277 482202 484052 486778 489856 492793
$$ packed form
59711F04548k037j852j758k010k344k112j345q23r74j335j254o24K07Q38J084
59696E88209J067R77P34K03k18J94J373K147J603K57p17j015j231j655j877j593
59680E88458j176j221j844k630l040k898k580k665l358m289m995n300n229m853
59666E42380m369m046l857l435k552j414l82L44P07Q02R90J613K435K782K364
59651E34362J674J343J586K285L143L537K814J075p57j969k713l390l937m129
59637E34924m121m116l873l098k060j314j002q62p80q81j143j370j511j738k148
59622E04907k656l121l460l620l591l451l319l259l223l010k409j529q40o39o04
59607D66176k32M50R94J299J725K388K822K557J715Q60N23R25J850K726L078K937
$$ plain form
59591 492793 495410 497641 499363 500548 501328 501730 501652 501159 500462 499562 498341 497098 496370 495981 494922 492583
59575 492583 489521 486593 483927 481339 479081 477421 475978 474328 472893 472349 472379 471933 470684 469397 468825
59560 468825 468902 469077 468911 468354 467898 468338 469831 471449 472236 472456 473034 474086 474981 475706 477117 479668 482890
59543 482890 486401 490591 495938 502525 510770 522051 537936 558819 583193 607730 628169 641149
59531 641149 645933 644232 638296 629635 619465 609341 600699 594218 590025 588084 587991 588874 590003 591238
59517 591238 592561 593471 593232 591438 587996 582836 575998 567899 559261 550868 543378 536978 531044 524544 517079
59502 517079 509323 502277 496424 491805 488438 486210 484612 483085 481599 480568 480171 480037 479700 479167 478889
59487 478889 479143 479593 479679 479397 479399 480195 481633 483395 485603 488457 491676 494939 498676 503645 509660 515453
$$ packed form
59591D92793K617K231J722J185P80M02p8m93o97r00j221j243p28l89j059k339
59575D92583l062k928k666k588k258j660j443j650j435n44L0m46j249j287n72
59560D68825P7J75j66n57m56M40J493J618P87K20N78J052Q95P25J411K551L222
59543D82890L511M190N347O587Q245J1281J5885K0883K4374K4537K0439J2980
59531F41149M784j701n936q661j0170j0124q642o481m193j941r3Q83J129J235
59517E91238J323R10k39j794l442n160o838q099q638q393p490o400n934o500p465
59502E17079p756p046n853m619l367k228j598j527j486j031l97j34l37n33k78
59487D78889K54M50Q6k82KP96J438J762K208K854L219L263L737M969O015N793
$$ plain form
59471 515453 520000 523398 526251 528740 530639 531833 532497 533058 534118 536094 538675 540974 542448 543496 545063
59456 545063 547917 552294 557873 563921 569816 575592 581767 588548 595546 602258 608443 613894 618231 621108
59442 621108 622323 621621 618703 613672 607222 600297 593665 587781 582677 577968 573263 568709 564893 562200
59428 562200 560554 559756 559796 560830 563161 567186 573080 580549 589204 599092 610566 623830 639019 656570
59414 656570 677134 701191 729029 760457 793680 824557 847981 860489 861604 853242 838633 821448
59402 821448 804788 790692 780983 778079 783572 795725 809418 819084 821336 815213 801449 782166 760155
59389 760155 737502 715231 694387 676513 662522 651903 643635 637203 632304 628410 625299 623327 622608
59376 622608 622517 622553 622985 624027 625106 625625 625871 626411 627189 627943 628945 630549 632437 634124 635800 637999 640826
$$ packed form
59471E15453M547L398K853K489J899J194O64N61J060J976K581K299J474J048J567
59456E45063K854M377N579O048N895N776O175O781O998O712O185N451M337K877
59442F21108J215p02k918n031o450o925o632n884n104m709m705m554l816k693
59428E62200j646p98M0J034K331M025N894P469Q655R888J1474J3264J5189J7551
59414F56570K0564K4057K7838L1428L3223L0877K3424J2508J115q362j4609j7185
59402H21448j6660j4096r709k904N493J2153J3693R666K252o123j3764j9283k2011
59389G60155k2653k2271k0844j7874j3991j0619q268o432m899l894l111j972p19
59376F22608r1L6M32J042J079N19K46N40P78P54J002J604J888J687J676K199K827
$$ plain form
59359 640826 644194 648377 653515 659008 664222 669514 675768 683207 691488 700702 711373 723513 736399
59346 736399 749318 761945 774163 786195 798709 812043 825316 836998 846336 853555 858754 861419
59334 861419 861244 858724 854542 848723 840643 829755 816285 801452 786859 773311 760284 746860 733013
59321 733013 719606 707311 696116 685820 676492 668270 661100 654753 648847 642873 636487 629806 623282
59308 623282 617396 612710 609895 609301 610613 613388 617950 625353 636379 650647 666504 681484 693037
59295 693037 699292 699436 693579 682620 668301 652771 637545 623049 609368 597040 586706 578427
59283 578427 571899 566999 563577 561050 559032 558199 559722 563805 569486 576009 583691 593217 604636 617367
59269 617367 630729 644149 657218 669881 682323 694347 705067 713526 719557 723781 726792 728521
$$ packed form
59359F40826L368M183N138N493N214N292O254P439Q281R214J0671J2140J2886
59346G36399J2919J2627J2218J2032J2514J3334J3273J1682R338P219N199K665
59334H61419j75k520m182n819q080j0888j3470j4833j4593j3548j3027j3424j3847
59321G33013j3407j2295j1195j0296r328q222p170o347n906n974o386o681o524
59308F23282n886m686k815n94J312K775M562P403J1026J4268J5857J4980J1553
59295F93037O255J44n857j0959j4319j5530j5226j4496j3681j2328j0334q279
59283E78427o528m900l422k527k018q33J523M083N681O523P682R526J1419J2731
59269F17367J3362J3420J3069J2663J2442J2024J0720Q459O031M224L011J729
$$ plain form
59257 728521 728458 726314 722294 716796 710075 702398 694384 686859 680335 674769 669883 665494 661649 658687 657178
59242 657178 657423 658951 660918 663072 665919 669812 674398 679147 683949 688833 693545 697845 701859 705665
59228 705665 708694 709940 708656 704721 698674 691540 684180 676417 667212 656181 644590 634272 625796
59215 625796 618303 611053 604472 599430 595912 592790 588950 584442 580281 577042 574055 570356 566129 562559
59201 562559 560381 559357 559158 559867 561284 562674 563737 565045 567006 569097 570771 572408 574599 577094 579343
59186 579343 581631 584709 588539 592218 595089 597276 599280 601688 605016 609140 613011 615653 617411 619600
59172 619600 622947 626905 630470 633151 635175 637257 640177 644144 648530 652473 655621 658075 659911 661029
59158 661029 661125 659491 655383 649077 642075 635591 629251 621975 613762 605709 598517 591929 585626 579753 574341
$$ packed form
59257G28521o3k144m020n498o721p677q014p525o524n566m886m389l845k962j509
59242F57178K45J528J967K154K847L893M586M749M802M884M712M300M014L806
59228G05665L029J246j284l935o047p134p360p763r205j1031j1591j0318q476
59215F25796p493p250o581n042l518l122l840m508m161l239k987l699m227l570
59201E62559k178j024j99P09J417J390J063J308J961K091J674J637K191K495K249
59186E79343K288L078L830L679K871K187K004K408L328M124L871K642J758K189
59172F19600L347L958L565K681K024K082K920L967M386L943L148K454J836J118
59158F61029R6j634m108o306p002o484o340p276q213q053p192o588o303n873n412
$$ plain form
59143 574341 568929 563166 557317 551874 546883 541930 536695 531416 526782 523230 520406 517573 514539 511755
59129 511755 509588 508086 507536 508502 511034 514569 518887 524339 530791 537306 543432 549889 557351 565652 574914
59114 574914 586196 599746 613648 625706 636004 646134 656527 666207 674804 683021 691108 698375
59102 698375 704392 709335 713007 714833 715014 714553 713901 712566 710167 706801 702377 696849 691231 687176 685177
59087 685177 684194 683189 681968 680385 678044 675123 672290 669364 665223 659575 653659 648569 643881 638630
59073 638630 632755 626841 621139 615594 610315 605441 600943 596880 593354 590032 586384 582665 579867 578292
59059 578292 576885 574443 570912 567107 563723 561102 559425 558628 558347 558157 557652 556470 554724 553268 552788
59044 552788 552759 552114 550829 549840 549448 548979 548164 547648 547739 547822 547534 547496 548258 549459 550620 551973 553922 556482
$$ packed form
59143E74341n412n763n849n443m991m953n235n279m634l552k824k833l034k784
59129E11755k167j502n50R66K532L535M318N452O452O515O126O457P462Q301R262
59114E74914J1282J3550J3902J2058J0298J0130J0393R680Q597Q217Q087P267
59102F98375O017M943L672J826J81m61o52j335k399l366m424n528n618m055j999
59087F85177r83j005j221j583k341k921k833k926m141n648n916n090m688n251
59073F38630n875n914n702n545n279m874m498m063l526l322l648l719k798j575
59059E78292j407k442l531l805l384k621j677p97k81j90n05j182j746j456m80
59044E52788k9o45j285r89l92m69q15n16R1Q3k88l8P62J201J161J353J949K560
$$ plain form
59026 556482 559861 564816 571842 580586 590542 601646 613776 626400 639185 652131 664615 675173
59014 675173 682809 687818 690792 691717 690600 688004 684199 678727 671761 665064 660445 657858 656164 655342 656689
58999 656689 660853 666737 672604 677566 681711 685287 688177 690188 691631 693218 695085 696170 695283 692655
58985 692655 689683 687118 684451 681283 678189 675765 673759 671848 670521 670496 671847 674313 677912 682670 688330
58970 688330 694874 702778 712208 722494 732949 743659 754971 766832 779115 791910 804871 816929
58958 816929 827248 835873 842775 847018 847663 844952 839727 832123 821727 808749 794252 779285 764395
58945 764395 749783 735459 721382 707830 695400 684430 674814 666554 659926 654836 650694 647275 644955
58932 644955 643689 642488 640541 638179 636214 634937 634224 633922 633598 632619 630969 629211 627253 624213 620118
$$ packed form
59026E56482L379M955P026Q744R956J1104J2130J2624J2785J2946J2484J0558
59014F75173P636N009K974R25j117k596l805n472o966o697m619k587j694q22J347
58999F56689M164N884N867M962M145L576K890K011J443J587J867J085q87k628
58985F92655k972k565k667l168l094k424k006j911j327k5J351K466L599M758N660
58970F88330O544P904R430J0286J0455J0710J1312J1861J2283J2795J2961J2058
58958H16929J0319Q625O902M243O45k711n225p604j0396j2978j4497j4967j4890
58945G64395j4612j4324j4077j3552j2430j0970r616q260o628n090m142l419k320
58932F44955j266j201j947k362j965j277p13l02l24r79j650j758j958l040m095
$$ plain form
58917 620118 616599 614943 614461 613777 612746 611933 611169 610040 609143 609442 610851 612801 615719 620581 627307 635016
58901 635016 643702 654283 666983 680884 695112 709369 723315 736607 749680 763407 777808 792116
58889 792116 806315 821691 839527 859906 881935 904346 925686 944709 960999 974844 986317
58878 986317 994848 999678 1000399 997181 990804 982245 971764 958792 943297 926825 911387 897610 884826
58865 884826 872772 862233 853963 847757 842671 837543 831273 823274 813779 803291 791918 779682 767214
58852 767214 755426 744613 734478 724871 715881 707402 699324 692018 685955 680890 675957 670454 664028
58839 664028 656459 647997 639688 632568 626533 620595 614124 607289 600587 594617 590034 586952 584590 582214
58825 582214 580165 579205 579138 579081 578965 579742 582029 585395 589114 592819 596316 599466 602451 605592 608833 611850
$$ packed form
58917F20118l519j656m82o84j031q13p64j129q97K99J409J950K918M862O726P709
58901F35016Q686J0581J2700J3901J4228J4257J3946J3292J3073J3727J4401J4308
58889G92116J4199J5376J7836K0379K2029K2411K1340J9023J6290J3845J1473
58878I86317Q531M830P21l218o377q559j0481j2972j5495j6472j5438j3777j2784
58865H84826j2054j0539q270o206n086n128o270p999r495j0488j1373j2236j2468
58852G67214j1788j0813j0135r607q990q479q078p306o063n065m933n503o426
58839F64028p569q462q309p120o035n938o471o835o702n970m583l082k362k376
58825E82214k049r60o7n7j16P77K287L366L719L705L497L150K985L141L241L017
$$ plain form
58809 611850 614596 617177 619336 620686 621338 621679 621608 620679 618930 616928 615012 613047 610877 608450 605558
58794 605558 601915 597417 592008 585622 578729 572486 567729 564208 561402 559497 558789 558749 558745 559324 561605 565604
58778 565604 570156 574395 578329 582130 585816 589516 593079 595539 595911 594346 591613 587732 582245 575638
58764 575638 569181 563362 557632 551787 546416 541905 538143 535417 534448 535270 537076 539358 542219 545395 548101
58749 548101 550182 552410 555275 558387 561346 564295 567306 570182 573200 577171 582304 587828 593090 598303
58735 598303 603925 610087 616899 624560 632863 641322 649978 659306 669105 678329 686232 692885 698427 702804
58721 702804 706530 710671 715569 720437 724695 728942 734165 740765 748764 758113 768136 777308 784304 788958
58707 788958 791773 792878 791785 787865 780841 771131 759736 747328 733566 717831 700465 682537 664517
$$ packed form
58809F11850K746K581K159J350O52L41p1r29j749k002j916j965k170k427k892
58794F05558l643m498n409o386o893o243m757l521k806j905p08m0mN79K281L999
58778E65604M552M239L934L801L686L700L563K460L72j565k733l881n487o607
58764E75638o457n819n730n845n371m511l762k726r69Q22J806K282K861L176K706
58749E48101K081K228K865L112K959K949L011K876L018L971N133N524N262N213
58735E98303N622O162O812P661Q303Q459Q656R328R799R224P903O653N542M377
58721G02804L726M141M898M868M258M247N223O600P999R349J0023R172O996M654
58707G88958K815J105j093l920p024r710j1395j2408j3762j5735j7366j7928j8020
$$ plain form
58694 664517 646161 627733 610246 594309 579704 566407 555037 545900 538415 531918 526240 521106
58682 521106 515795 509958 504174 499254 495500 492876 491261 490232 489238 488291 487943 488426 489475 491174 494221
58667 494221 499149 505972 514793 525934 539182 553587 568249 582537 595336 605002 610568 612428 611563
58654 611563 608717 604568 599860 594913 589489 583434 576971 570276 563408 556777 551042 546369 542483 539510
58640 539510 538069 538368 539866 541913 544130 546208 548008 549751 551427 552296 551848 550886 550477 550144 548446 545274
58624 545274 542150 540157 539022 538431 538792 540273 542372 544838 547925 551502 555110 559037 564007 569677 574860
58609 574860 579365 583960 588322 590884 591218 590680 590036 588450 585716 583480 582952 583082 582371 580895 579152 576509
58593 576509 572603 569004 567642 568374 569753 571428 574198 578290 583266 589299 597104 606648 617008 627372
$$ packed form
58694F64517j8356j8428j7487j5937j4605j3297j1370r137p485o497n678n134
58682E21106n311n837n784m920l754k624j615j029r94r47l48M83J049J699L047
58667D94221M928O823Q821J1141J3248J4405J4662J4288J2799R666N566J860q65
58654F11563k846m149m708m947n424o055o463o695o868o631n735m673l886k973
58640E39510j441K99J498K047K217K078J800J743J676Q69m48r62m09l33j698l172
58624E45274l124j993j135n91L61J481K099K466L087L577L608L927M970N670N183
58609E74860M505M595M362K562L34n38o44j586k734k236n28J30p11j476j743k643
58593E76509l906l599j362P32J379J675K770M092M976O033P805R544J0360J0364
$$ plain form
58579 627372 637411 646963 656096 665118 673876 681578 687832 693215 698282 702974 707701 714023 723239 735036
58565 735036 748478 763544 780809 800399 822206 846347 872368 898604 923304 945813 965872
58554 965872 982547 994782 1002381 1005615 1004686 1000458 994808 989085 982854 975175 966350 957397 948483 938974
58540 938974 928435 916528 902550 886178 868245 849883 831469 813165 795714 779745 765064
58529 765064 751629 740404 732058 725583 719491 713811 709661 707374 706302 706051 706648 707686 708416 708546 708093
58514 708093 706760 704252 700897 697283 693690 690427 688050 686507 684821 682397 679913 678162 676902 675693
58500 675693 674894 674763 674464 673213 671593 670534 669707 668206 666167 664455 663324 662601 662661 664032 666483 669609
58484 669609 673827 679749 687104 695283 704370 714731 726224 738759 752814 768262 783488 796753
$$ packed form
58579F27372J0039R552R133R022Q758P702O254N383N067M692M727O322R216J1797
58565G35036J3442J5066J7265J9590K1807K4141K6021K6236K4700K2509K0059
58554I65872J6675J2235P599L234r29m228n650n723o231p679q825q953q914r509
58540I38974j0539j1907j3978j6372j7933j8362j8414j8304j7451j5969j4681
58529G65064j3435j1225q346o475o092n680m150k287j072k51N97J038P30J30m53
58514G08093j333k508l355l614l593l263k377j543j686k424k484j751j260j209
58500F75693p99j31k99j251j620j059q27j501k039j712j131p23O0J371K451L126
58484F69609M218N922P355Q179R087J0361J1493J2535J4055J5448J5226J3265
$$ plain form
58472 796753 807683 816394 822174 824357 823518 820400 814556 805555 794772 784387 775323 767597 761816 758573
58458 758573 757035 755939 755591 757271 761206 766774 774149 783833 794785 804802 812693 818594 822376 823419
58444 823419 821935 818957 814932 809608 803267 796889 791196 786602 783854 783543 785179 787734 790752 794055
58430 794055 797075 799635 802786 807580 813652 820135 827171 835201 843639 851657 859369 866696 872060 874008
58416 874008 873335 871780 869470 865530 860365 855139 849663 843002 835675 829028 822847 815923 808760 803337
58402 803337 800244 798274 796929 797093 798977 801462 803944 807085 811315 816108 820954 825731 830210 834415
58388 834415 839128 844602 849403 852219 854123 857031 860574 862790 863404 863932 864783 864901 864380 864886 867046 869750
58372 869750 872570 876728 883068 890922 899488 908626 917967 926954 936024 946154 957152 968020 978930
$$ packed form
58472G96753J0930Q711N780K183q39l118n844r001j0783j0385r064p726n781l243
58458G58573j538j096l48J680L935N568P375R684J0952J0017P891N901L782J043
58444H23419j484k978m025n324o341o378n693m594k748l11J636K555L018L303
58430G94055L020K560L151M794O072O483P036Q030Q438Q018P712P327N364J948
58416H74008o73j555k310l940n165n226n476o661p327o647o181o924p163n423
58402H03337l093j970j345J64J884K485K482L141M230M793M846M777M479M205
58388H34415M713N474M801K816J904K908L543K216O14N28Q51J18n21N06K160K704
58372H69750K820M158O340P854Q566R138R341Q987R070J0130J0998J0868J0910
$$ plain form
58359 978930 991001 1004140 1016960 1028821 1040106 1050587 1059483 1067084 1074307 1080814 1085633 1089499 1094330
58346 1094330 1100410 1106308 1111567 1117224 1123667 1130322 1137528 1146391 1156698 1167305 1178647 1192461 1208856
58333 1208856 1226117 1243539 1261936 1281104 1299406 1316322 1332917 1349305 1363925 1375775 1385227
58322 1385227 1392481 1397530 1401750 1407005 1412983 1417901 1421907 1427170 1434522 1442814 1451841 1462925 1476140
58309 1476140 1489836 1503436 1518067 1533952 1549917 1565848 1582904 1600966 1618668 1636227 1655278
58298 1655278 1675615 1695192 1713691 1732948 1753448 1773717 1793643 1815056 1838414 1862267 1886631
58287 1886631 1913405 1942715 1972234 2000995 2030522 2061435 2092316 2122758 2154148 2186746 2219364
58276 2219364 2252506 2288294 2326751 2365865 2405766 2448890 2495543 2543508 2592607 2645290 2702027
$$ packed form
58359I78930J2071J3139J2820J1861J1285J0481Q896P601P223O507M819L866M831
58346A094330O080N898N259N657O443O655P206Q863J0307J0607J1342J3814J6395
58333A208856J7261J7422J8397J9168J8302J6916J6595J6388J4620J1850R452
58322A385227P254N049M220N255N978M918M006N263P352Q292R027J1084J3215
58309A476140J3696J3600J4631J5885J5965J5931J7056J8062J7702J7559J9051
58298A655278K0337J9577J8499J9257K0500K0269J9926K1413K3358K3853K4364
58287A886631K6774K9310K9519K8761K9527L0913L0881L0442L1390L2598L2618
58276B219364L3142L5788L8457L9114L9901M3124M6653M7965M9099N2683N6737
$$ plain form
58265 2702027 2760654 2821003 2885426 2953898 3023621 3094472 3169567 3249117 3329105 3407626 3487184
58254 3487184 3569015 3650758 3731767 3815206 3902583 3991595 4081632 4176051 4276777 4382129 4492193
58243 4492193 4610565 4738426 4872758 5012803 5162215 5322347 5489886 5663916 5848719
58234 5848719 6046616 6254849 6472737 6704938 6954206 7217974 7495624 7791848 8109235
58225 8109235 8445119 8799691 9179542 9589400 10028616 10499738 11011758 11570577 12175390
58216 12175390 12828808 13540725 14317881 15160733 16075996 17080793 18189127 19407252 20748962
58207 20748962 22241810 23911358 25774488 27856875 30201857 32855019 35860793 39287959
58199 39287959 43242678 47850047 53252526 59649369 67323966 76633639 88025047 102101547
$$ packed form
58265B702027N8627O0349O4423O8472O9723P0851P5095P9550P9988P8521P9558
58254C487184Q1831Q1743Q1009Q3439Q7377Q9012R0037R4419J00726J05352J10064
58243D492193J18372J27861J34332J40045J49412J60132J67539J74030J84803
58234E848719J97897K08233K17888K32201K49268K63768K77650K96224L17387
58225H109235L35884L54572L79851M09858M39216M71122N12020N58819O04813
58216A2175390O53418P11917P77156Q42852R15263J004797J108334J218125J341710
58207B0748962J492848J669548J863130K082387K344982K653162L005774L427166
58199C9287959L954719M607369N402479O396843P674597R309673J1391408J4076500
$$ plain form
58191 102101547 119658518 141645125 169124712 203170415 244367905 291793344 342067239
58184 342067239 389477363 427498616 450895052 457191477 446941162 423040475 389624630
58177 389624630 350965185 310670698 271360168 234726530 201730919 172763173 147790650
58170 147790650 126531148 108592873 93538113 80917525 70319173 61402171 53885801
58163 53885801 47528499 42130560 37537970 33623640 30270441 27378777 24875567 22702101
58155 22702101 20800935 19122691 17634661 16311820 15126632 14055508 13086637 12212346
58147 12212346 11419986 10697365 10039988 9445294 8905458 8412210 7962636 7553728 7176723
58138 7176723 6823041 6490842 6180332 5887787 5609592 5347077 5101891 4871121 4651931
$$ packed form
58191A02101547J7556971K1986607K7479587L4045703M1197490M7425439N0273895
58184C42067239M7410124L8021253K3396436O296425j0250315k3900687l3415845
58177C89624630l8659445m0294487l9310530l6633638l2995611k8967746k4972523
58170A47790650k1259502j7938275j5054760j2620588j0598352q917002p516370
58163E3885801o357302n397939m592590l914330l353199k891664k503210k173466
58155B2702101j901166j678244j488030j322841j185188j071124r68871q74291
58147A2212346p92360p22621o57377n94694n39836m93248m49574m08908l77005
58138G176723l53682l32199l10510k92545k78195k62515k45186k30770k19190
$$ plain form
58129 4651931 4446445 4257067 4081232 3915448 3760280 3616727 3481846 3352633 3230451
58120 3230451 3117125 3010275 2906823 2807647 2714623 2626422 2541247 2460460 2385543 2314647 2245865
58109 2245865 2180734 2120696 2063297 2005803 1949731 1897964 1850018 1803760 1759258 1717393 1677102
58098 1677102 1637363 1599533 1564601 1530540 1495458 1460884 1428875 1398443 1367940 1338514 1311985
58087 1311985 1287682 1264443 1243297 1224892 1206592 1185557 1162755 1140783 1119677 1097966 1075869
58076 1075869 1054259 1032226 1008786 985373 963699 942807 921175 900029 881611 865602 850157
58065 850157 835056 821126 807979 795071 783606 774696 766985 758560 749791 741735 733364 723153 711971
58052 711971 701561 691455 680220 668573 658437 649917 641883 634508 628597 623290 617060 610157 603670
$$ packed form
58129D651931k05486j89378j75835j65784j55168j43553j34881j29213j22182
58120C230451j13326j06850j03452r9176r3024q8201q5175q0787p4917p0896o8782
58109B245865o5131o0038n7399n7494n6072n1767m7946m6258m4502m1865m0291
58098A677102l9739l7830l4932l4061l5082l4574l2009l0432l0503k9426k6529
58087A311985k4303k3239k1146j8405j8300k1035k2802k1972k1106k1711k2097
58076A075869k1610k2033k3440k3413k1674k0892k1632k1146j8418j6009j5445
58065H50157j5101j3930j3147j2908j1465q910p711q425q769q056q371j0211j1182
58052G11971j0410j0106j1235j1647j0136q520q034p375n911n307o230o903o487
$$ plain form
58039 603670 597094 589304 581010 573694 566975 559531 551878 545729 541141 536606 531352 525376 517955 508472
58025 508472 498118 488566 479554 469889 460104 451829 445191 439138 433830 430359 428448 426624 424394 422306
58011 422306 420281 417886 415843 415244 415566 415317 414267 413260 412375 411145 410022 409727 409702 409138 408911 410392
57995 410392 412876 414319 414246 413758 413010 410903 407239 403157 399379 395848 392940 391212 389987 387874 384656
57980 384656 381095 377307 372990 368753 365301 361731 356666 350808 346240 343382 340823 338044 336093 335375
57966 335375 334993 334602 334914 335891 336389 336113 336178 337220 338534 339553 340571 341523 341513 340123 337889 335108 331510
57949 331510 327419 323847 321043 318239 315233 312882 311689 311152 310937 311501 313161 315731 319414 324994 332723
57934 332723 342008 352417 363969 376270 388393 399768 410142 418598 423758 425167 423472 419281 413027
$$ packed form
58039F03670o576p790q294p316o719p444p653o149m588m535n254n976p421r483
58025E08472j0354r552r012r665r785q275o638o053n308l471j911j824k230k088
58011D22306k025k395k043n99L22k49j050j007q85j230j123k95k5n64k27J481
57995D10392K484J443p3m88p48k107l664m082l778l531k908j728j225k113l218
57980C84656l561l788m317m237l452l570n065n858m568k858k559k779j951p18
57966C35375l82l91L12R77M98k76O5J042J314J019J018R52j0j390k234k781l598
57949C31510m091l572k804k804l006k351j193n37k15N64J660K570L683N580P729
57934C32723R285J0409J1552J2301J2123J1375J0374Q456N160J409j695m191o254
$$ plain form
57921 413027 405865 399216 393065 385937 376910 366570 355887 345431 335904 328105 321921 316461 311566
57908 311566 308114 306563 306304 306705 307707 309123 310526 312123 314534 317378 319332 320065 320848 322679 324969
57893 324969 326767 328207 329948 332053 334218 336470 338984 341717 344696 348103 351634 354379 355734 355969
57879 355969 355652 355001 353954 352245 349299 344683 338787 332439 325846 318698 311316 304723 299387 294758 290267
57864 290267 286029 282375 279589 278289 279140 281823 285136 288520 292754 298764 306396 314714 322927 330704
57850 330704 338111 345420 352563 358757 363207 366065 368077 369470 370018 369965 369798 369145 367011 363292 359015
57835 359015 354907 350777 346481 342409 338739 335210 331935 329359 327107 324016 319836 315825 313082 311226
57821 311226 309368 307460 305953 304901 304171 303992 304611 305736 306702 306805 305223 301250 294974 287255 278849
$$ packed form
57921D13027p162o649o151p128r027j0340j0683j0456r527p799o184n460m895
57908C11566l452j551k59M01J002J416J403J597K411K844J954P33P83J831K290
57893C24969J798J440J741K105K165K252K514K733K979L407L531K745J355K35
57879C55969l17o51j047j709k946m616n896o348o593p148p382o593n336m629m491
57864B90267m238l654k786j300Q51K683L313L384M234O010P632Q318Q213P777
57850C30704P407P309P143O194M450K858K012J393N48n3j67o53k134l719m277
57835C59015m108m130m296m072l670l529l275k576k252l091m180m011k743j856
57821C11226j858j908j507j052p30j79O19J125R66J03j582l973o276p719q406
$$ plain form
57806 278849 270065 261290 253020 245170 237325 229922 224234 220657 217891 214428 210190 206221 203443 202285
57792 202285 202805 204492 206349 207745 208902 210297 212082 214339 217356 221225 225641 230372 235445 240674
57778 240674 245602 250237 255307 261500 268854 277021 285504 293524 300301 305711 310138 313623 315832 316894
57764 316894 317385 317316 315950 312907 308679 303934 299140 294899 291615 288632 284735 279812 274927 270573 266137
57749 266137 261506 257757 255506 253930 252328 251387 251790 252674 252769 252203 251763 251028 248675 244478 239762 235893
57733 235893 233236 231552 230609 230314 230798 232276 234475 236567 238129 239768 242279 245569 248963 252138 255166
57718 255166 257987 260430 262425 263756 264025 263353 262603 262345 262090 261106 259426 257359 254531 250343 245092 239841
57702 239841 235309 231504 228191 225063 221635 217610 213325 209375 206001 203141 200755 198630 196259 193406
$$ packed form
57806B78849q784q775q270p850p845p403n688l577k766l463m238l969k778j158
57792B02285N20J687J857J396J157J395J785K257L017L869M416M731N073N229
57778B40674M928M635N070O193P354Q167Q483Q020O777N410M427L485K209J062
57764C16894M91o9j366l043m228m745m794m241l284k983l897m923m885m354m436
57749B66137m631l749k251j576j602r41M03Q84R5n66m40p35k353m197m716l869
57733B35893k657j684r43k95M84J478K199K092J562J639K511L290L394L175L028
57718B55166K821K443J995J331K69o72p50k58k55r84j680k067k828m188n251n251
57702B39841m532l805l313l128l428m025m285l950l374k860k386k125k371k853
$$ plain form
57688 193406 190491 187987 185820 183811 182294 181702 181922 182618 183854 185894 188744 192504 197869 205704 216364
57673 216364 229916 246761 267688 293807 326999 369933 424807 491762 568149 648188 722821
57662 722821 781367 815407 822048 803653 765294 713006 653195 591646 532326 477502 428697 386746
57650 386746 351209 320845 294897 273370 256122 242342 231002 221308 212776 205352 199330 194738
57638 194738 191057 187926 185671 184505 183736 182600 181457 181152 181447 181155 179744 177841 176079 174460 172943
57623 172943 171669 170377 168465 166000 163907 162801 162288 161711 160991 160336 159710 158995 158299 157677 156909 155841
57607 155841 154660 153607 152639 151573 150292 148691 146692 144530 142776 141826 141424 140837 139529 137651 135813
57592 135813 134293 132558 129914 126592 123701 121914 120748 119504 118330 117784 117783 117619 116764 115066 112495 109326
$$ packed form
57688A93406k915k504k167k009j517n92K20O96J236K040K850L760N365P835J0660
57673B16364J3552J6845K0927K6119L3192M2934N4874O6955P6387Q0039P4633
57662G22821N8546L4040O641j8395l8359n2288n9811o1549n9320n4824m8805m1951
57650C86746l5537l0364k5948k1527j7248j3780j1340r694q532p424o022m592
57638A94738l681l131k255j166p69j136j143l05K95k92j411j903j762j619j517
57623A72943j274j292j912k465k093j106n13n77p20o55o26p15o96o22p68j068
57607A55841j181j053r68j066j281j601j999k162j754r50m02n87j308j878j838
57592A35813j520j735k644l322k891j787j166j244j174n46jj64q55j698k571l169
$$ plain form
57576 109326 106307 103899 101601 98757 95814 93831 92802 91482 89100 86422 84685 84175 84287 84469 84582
57561 84582 84596 84408 83921 83151 82271 81498 80842 80103 79326 79051 79760 81164 82439 83097 83294 83432 83853 84799 86229
57542 86229 87710 88899 90107 92065 95196 99471 104708 110492 115920 120076 122870 125009 127160 129490
57528 129490 131948 134428 136562 137772 137748 136748 135494 134859 135357 136602 137564 137756 137786 138361 139123 139136 138116
57511 138116 136411 134058 130767 126885 123515 121438 120449 119820 118935 117476 115588 113877 112809 112148 111402
57496 111402 110558 109770 108637 106630 104057 101661 99373 96505 93249 90817 89721 88913 87208 84770 82565
57481 82565 80996 79767 78659 77780 77261 77116 77272 77483 77423 77066 76784 76992 77858 79311 80982 82241 82722
57464 82722 82766 82911 83026 82549 81429 80189 79095 77990 76983 76463 76293 75775 74650 73482 72894 73123 74422
$$ packed form
57576A09326l019k408k298k844k943j983j029j320k382k678j737n10J12J82J13
57561H4582J4j88m87p70q80p73o56p39p77k75P09J404J275O58J97J38M21R46J430
57542H6229J481J189J208J958L131M275N237N784N428M156K794K139K151K330
57528A29490K458K480K134J210k4j000j254o35M98J245R62J92L0N75P62J3j020
57511A38116j705k353l291l882l370k077r89o29q85j459j888j711j068o61p46
57496A11402q44p88j133k007k573k396k288k868l256k432j096q08j705k438k205
57481H2565j569j229j108q79n19j45J56K11o0l57k82K08Q66J453J671J259M81
57464H2722M4J45J15m77j120j240j094j105j007n20j70n18j125j168n88K29J299
$$ plain form
57447 74422 76932 79871 81777 82098 81809 81975 82511 82902 83296 84038 84735 84678 83867 82895 82086 81401 80989 81183
57429 81183 82026 83236 84528 85620 86157 86031 85624 85425 85539 85788 86025 86116 85913 85531 85415 85861 86680 87511
57411 87511 88162 88531 88588 88615 89044 89799 90218 89872 89088 88448 88198 88351 88829 89243 89017 88132 87306 87185 87806 89047
57391 89047 90951 93231 95170 96474 97660 99128 100481 101328 102054 103069 103912 103995 103754 104128 105169 106037
57375 106037 106208 105907 105526 105490 106514 109039 112286 114728 115707 115879 115954 115806 115207 114688 115021 116167 117389
57358 117389 118286 119264 120813 122653 123927 124237 124212 124715 125681 126252 126134 126259 127721 130467 133534 136246 138649
57341 138649 140927 142979 144704 146280 147983 149893 151859 153658 155221 156719 158311 159792 160766 161221 161617
57326 161617 162246 162940 163649 164891 167192 170323 173503 176156 178146 179517 180468 181508 183214 185794 189072
$$ packed form
57447G4422K510K939J906L21k89J66N36L91L94P42O97n7q11r72q09o85m12J94
57429H1183Q43J210J292J092N37j26m07j99J14K49K37R1k03l82j16M46Q19Q31
57411H7511O51L69N7K7M29P55M19l46p84o40k50J53M78M14k26q85q26j21O21J241
57391H9047J904K280J939J304J186J468J353Q47P26J015Q43Q3k41L74J041Q68
57375A06037J71l01l81l6J024K525L247K442R79J72P5j48n99n19L33J146J222
57358A17389Q97R78J549J840J274L10k5N03R66N71j18J25J462K746L067K712K403
57341A38649K278K052J725J576J703J910J966J799J563J498J592J481R74M55L96
57326A61617O29O94P09J242K301L131L180K653J990J371R51J040J706K580L278
$$ plain form
57311 189072 192805 196788 200755 204440 207690 210491 213053 215839 219177 222784 226113 229265 232995 237543
57297 237543 242108 246005 249816 254739 261098 268110 274962 281533 288195 295394 303405 312134 321181 330336
57283 330336 339777 349578 359415 369158 379404 390925 403827 417652 431991 446529 460842 474765
57271 474765 488782 503472 518715 533910 548747 563266 577332 590659 603245 615264 626637
57260 626637 637187 647098 656751 666267 675672 685333 695616 706270 716700 726827 737175 748254
57248 748254 760335 773613 788030 803013 818014 833170 848919 865072 880922 896114 910709
57237 910709 924499 937085 948723 960328 972399 984500 995995 1006730 1016914 1026908 1037407 1049304
57225 1049304 1063137 1078884 1096318 1115100 1134508 1153704 1172453 1191167 1210184 1229448 1248915
$$ packed form
57311A89072L733L983L967L685L250K801K562K786L338L607L329L152L730M548
57297B37543M565L897L811M923O359P012O852O571O662P199Q011Q729R047R155
57283C30336R441R801R837R743J0246J1521J2902J3825J4339J4538J4313J3923
57271D74765J4017J4690J5243J5195J4837J4519J4066J3327J2586J2019J1373
57260F26637J0550R911R653R516R405R661J0283J0654J0430J0127J0348J1079
57248G48254J2081J3278J4417J4983J5001J5156J5749J6153J5850J5192J4595
57237I10709J3790J2586J1638J1605J2071J2101J1495J0735J0184R994J0499J1897
57225A049304J3833J5747J7434J8782J9408J9196J8749J8714J9017J9264J9467
$$ plain form
57214 1248915 1268644 1288359 1307551 1326244 1345198 1365077 1385873 1407341 1429574 1452799 1476994
57203 1476994 1501952 1527496 1553477 1579802 1606601 1634056 1662012 1690104 1718369 1747417 1777795
57192 1777795 1809389 1841503 1873348 1904595 1935720 1967685 2000947 2035003 2069297 2104157 2140117
57181 2140117 2176588 2212278 2247032 2282243 2319004 2356661 2393699 2429338 2463699 2496942 2528966
57170 2528966 2559736 2589339 2617826 2645371 2672474 2699789 2727854 2757023 2787292 2818045 2848386
57159 2848386 2877970 2907187 2936413 2965516 2994402 3023487 3053112 3082748 3111342 3138391 3164375
57148 3164375 3190157 3216191 3242265 3267806 3292466 3316412 3339898 3362624 3383896 3403576 3422483
57137 3422483 3441651 3461521 3482206 3504277 3528775 3556368 3586824 3619513 3654272 3691503 3731270
$$ packed form
57214A248915J9729J9715J9192J8693J8954J9879K0796K1468K2233K3225K4195
57203A476994K4958K5544K5981K6325K6799K7455K7956K8092K8265K9048L0378
57192A777795L1594L2114L1845L1247L1125L1965L3262L4056L4294L4860L5960
57181B140117L6471L5690L4754L5211L6761L7657L7038L5639L4361L3243L2024
57170B528966L0770K9603K8487K7545K7103K7315K8065K9169L0269L0753L0341
57159B848386K9584K9217K9226K9103K8886K9085K9625K9636K8594K7049K5984
57148C164375K5782K6034K6074K5541K4660K3946K3486K2726K1272J9680J8907
57137C422483J9168J9870K0685K2071K4498K7593L0456L2689L4759L7231L9767
$$ plain form
57126 3731270 3772435 3813033 3851602 3887864 3921988 3953688 3982647 4009791 4037728 4069937 4109669
57115 4109669 4159262 4219828 4291267 4372712 4462927 4560408 4663813 4773046 4890024 5018182
57105 5018182 5161683 5325452 5515398 5737827 5999125 6307136 6673040 7111341 7638574
57096 7638574 8273398 9038413 9961204 11073328 12408429 14000124 15878724 18066849 20575424
57087 20575424 23400446 26519721 29890270 33448232 37111432 40783628 44360827 47738932
57079 47738932 50816873 53489813 55638741 57132630 57851422 57718794 56725227 54931713
57071 54931713 52457486 49458874 46104812 42554910 38945815 35386756 31960402 28725463
57063 28725463 25720177 22966157 20471360 18232298 16237021 14469103 12910828 11544285
$$ packed form
57126C731270M1165M0598L8569L6262L4124L1700K8959K7144K7937L2209L9732
57115D109669M9593O0566P1439Q1445R0215R7481J03405J09233J16978J28158
57105E018182J43501J63769J89946K22429K61298L08011L65904M38301N27233
57096G638574O34824P65015R22791J112124J335101J591695J878600K188125K508575
57087B0575424K825022L119275L370549L557962L663200L672196L577199L378105
57079D7738932L077941K672940K148928J493889P18792j32628r93567j793514
57071E4931713k474227k998612l354062l549902l609095l559059l426354l234939
57063B8725463l005286k754020k494797k239062j995277j767918j558275j366543
$$ plain form
57055 11544285 10351146 9312555 8409744 7625110 6943025 6349668 5832197 5378529 4978120
57046 4978120 4622575 4305224 4020514 3764105 3532968 3324658 3136525 2965931 2810921
57037 2810921 2670260 2542975 2428177 2325162 2233501 2153255 2085235 2030776 1991332 1968678
57027 1968678 1964734 1979008 2005023 2030469 2042570 2033702 2002018 1948614 1876078 1789218 1694736 1598956
57015 1598956 1506120 1418677 1338086 1265002 1199481 1141421 1090474 1045619 1005486 969211 936524
57004 936524 907193 880982 857967 838094 820466 803850 787952 773473 760866 749799 739863 731034
56992 731034 723202 716000 709374 703720 699279 696072 694716 696577 702588 712223 723822 735413 744838 749702
56978 749702 748053 739380 724884 706791 687306 667822 648800 630337 612798 596808 582805 570865
$$ packed form
57055A1544285j193139j038591r02811p84634o82085n93357n17471m53668m00409
57046D978120l55545l17351k84710k56409k31137k08310j88133j70594j55010
57037B810921j40661j27285j14798j03015r1661q0246o8020n4459l9444k2654
57027A968678l944J4274K6015K5446J2101q868l1684n3404p2536q6860r4482r5780
57015A598956r2836q7443q0591p3084o5521n8060n0947m4855m0133l6275l2687
57004I36524k9331k6211k3015j9873j7628j6616j5898j4479j2607j1067r936q829
56992G31034p832p202o626n654m441l207j356J861O011R635J1599J1591R425M864
56978G49702j649q673j4496j8093j9485j9484j9022j8463j7539j5990j4003j1940
$$ plain form
56966 570865 560888 552766 546484 542409 541375 544195 551101 561857 576190 593740 613595 634045 652605
56953 652605 666229 672128 669048 657701 639734 616835 591189 565925 543757 525200 509022 494479
56941 494479 482241 473160 467186 463923 463434 465969 471566 480501 493828 512847 538000 568192 600677
56928 600677 631220 654850 667324 666600 653311 630068 600210 566896 532893 500587 471487 445678
56916 445678 422365 401245 382889 367590 354574 342891 332467 323604 316054 309396 303835 299682
56904 299682 296392 293059 289563 286312 283188 279831 276695 274587 273207 271487 269523 268886 270736 274851
56890 274851 280994 289988 302749 319294 339401 363186 389887 416602 439310 455150 463326 464385
56878 464385 459498 450368 439056 427505 417131 408664 402224 397792 395704 396499 400355 407101 416861 430297
$$ packed form
56966E70865r977q122o282m075j034K820O906J0756J4333J7550J9855K0450J8560
56953F52605J3624N899l080j1347j7967k2899k5646k5264k2168j8557j6178j4543
56941D94479j2238r081n974l263m89K535N597Q935J3327J9019K5153L0192L2485
56928F00677L0543K3630J2474p24j3289k3243k9858l3314l4003l2306k9100k5809
56916D45678k3313k1120j8356j5299j3016j1683j0424q863p550o658n561m153
56904B99682l290l333l496l251l124l357l136k108j380j720j964o37J850M115
56890B74851O143Q994J2761J6545K0107K3785K6701K6715K2708J5840Q176J059
56878D64385m887r130j1312j1551j0374q467o440m432k088P95L856O746R760J3436
$$ plain form
56864 430297 448255 471683 501969 540703 588651 644792 705765 765558 816220 850492 864809
56853 864809 859916 839067 806450 766888 725224 684914 647709 614995 588478 569121 556424 549623
56841 549623 549075 555885 570898 594882 629223 675747 736027 811030 900213 999394 1099340 1187305
56829 1187305 1250973 1282175 1278747 1244434 1186953 1115048 1036314 956801 881329 813278 754284
56818 754284 704680 664270 632672 609502 594731 588776 592080 604995 628252 663083 710415 769785
56806 769785 838408 910249 975933 1025025 1049930 1048348 1022652 977913 920447 856614 791481 728436
56794 728436 670046 618473 574745 538513 509179 486583 470237 458993 452392 451618 458235 472582
56782 472582 494189 522824 557658 595514 630997 658561 674135 675515 662548 637222 602954 563454
$$ packed form
56864D30297J7958K3428L0286L8734M7948N6141O0973N9793N0662L4272J4317
56853H64809m893k0849l2617l9562m1664m0310l7205l2714k6517j9357j2697o801
56841E49623n48O810J5013K3984L4341M6524O0280P5003Q9183R9181R9946Q7965
56829A187305O3668L1202l428l4313n7481p1905p8734p9513p5472o8051n8994
56818G54284m9604m0410l1598k3170j4771n955L304J2915K3257L4831M7332N9370
56806G69785O8623P1841O5684M9092K4905j582k5696m4739n7466o3833o5133o3045
56794G28436n8390n1573m3728l6232k9334k2596j6346j1244o601p74O617J4347
56782D72582K1607K8635L4834L7856L5483K7564J5574J380j2967k5326l4268l9500
$$ plain form
56770 563454 522149 481914 444545 410624 380323 354029 331811 312942 296605 282686 271269
56759 271269 261883 253884 247026 241019 235170 229270 224194 220674 218018 215052 211775 208983 206676 204076
56745 204076 200976 197859 194854 191763 189049 187623 187519 187817 187932 187963 187756 186757 185013 183357 182280 181484
56729 181484 180728 180255 180141 180050 179892 179955 180213 180257 180147 180468 181313 182019 182224 182430 183181 184386 185754 187256 188828
56710 188828 190268 191662 193223 194509 194629 193588 192629 192729 193472 193913 193910 193936 194081 193992 193558 193138 193190 193987 195419
56691 195419 196820 197321 196690 195581 194749 194371 194364 194892 196100 197641 198874 199377 199042 197915 196313 194941 194523
56674 194523 195271 196746 198128 198669 198204 197355 196996 197357 197859 197885 197469 197122 197223 197678 197985 197638 196750 196241
56656 196241 197079 199297 202069 204690 207047 209122 210637 211476 212021 212744 213766 215097 216931 219278 221483
$$ packed form
56770E63454m1305m0235l7369l3921l0301k6294k2218j8869j6337j3919j1417
56759B71269r386p999o858o007n849n900n076l520k656k966l277k792k307k600
56745B04076l100l117l005l091k714j426j04K98J15L1k07r99j744j656j077p96
56729A81484p56m73j14r1j58O3K58M4j10L21Q45P06K05K06P51J205J368J502J572
56710A88828J440J394J561J286J20j041r59J00P43M41lK6J45q9m34m20N2P97J432
56691A95419J401N01o31j109q32l78pN28J208J541J233N03l35j127j602j372m18
56674A94523P48J475J382N41m65q49l59L61N02K6m16l47J01M55L07l47q88n09
56656A96241Q38K218K772K621K357K075J515Q39N45P23J022J331J834K347K205
$$ plain form
56641 221483 222653 222661 222460 223202 225100 227352 229149 230528 231969 233370 233928 233140 231430 229524 227597 225409
56625 225409 222932 220392 217911 215509 213264 211135 208858 206363 204043 202260 200872 199588 198380 197182
56611 197182 195661 193915 192886 193322 194665 195716 196083 196223 196396 196521 196850 197725 198701 198846 197983 196843 195957
56594 195957 195299 194983 195330 196066 196445 196398 196702 197750 198984 199791 200148 200129 199599 198728 198027 197594 197112 196799 197409
56575 197409 198926 200265 200796 201244 202454 204129 205520 206580 207580 208250 208248 208085 208771 210807 214201 219098
56559 219098 225578 233003 240259 246620 251856 255679 257801 258558 258935 259775 261209 262850 264231 265021 265087 264555
56543 264555 263802 263293 263307 263667 263869 263629 263140 262551 261492 259552 257039 254664 252630 250678 248958 248021 247750
56526 247750 247084 245191 242357 239397 236658 233922 230881 227493 224273 222266 222168 223283 223949 223224 221644
$$ packed form
56641B21483J170Qk01P42J898K252J797J379J441J401N58p88j710j906j927k188
56625B25409k477k540k481k402k245k129k277k495k320j783j388j284j208j198
56611A97182j521j746j029M36J343J051L67J40J73J25L29Q75R76J45q63j140q86
56594A95957o58l16L47P36L79m7L04J048J234Q07L57j9n30q71p01m33m82l13O10
56575A97409J517J339N31M48J210J675J391J060J000O70kj63O86K036L394M897
56559B19098O480P425P256O361N236L823K122P57L77Q40J434J641J381P90O6n32
56543B64555p53n09J4L60K02k40m89n89j059j940k513k375k034j952j720r37k71
56526B47750o66j893k834k960k739k736l041l388l220k007r8J115O66p25j580
$$ plain form
56511 221644 220134 218892 217654 216409 215334 214456 213799 213542 213729 214095 214339 214277 213753 212914 212525 213321 214976
56494 214976 216412 217171 217699 218160 218038 217237 216599 216757 217302 217687 218197 219356 221027 222714 224213 225440 226183
56477 226183 226541 226999 227542 227364 226073 224554 223947 224302 224929 225535 226322 227327 228364 229312 229972 230070 229922 230506
56459 230506 232222 234050 234672 234056 233248 232912 232840 232725 232756 233395 234922 237121 239283 240751 241603 242370 243027
56442 243027 242935 241964 240895 240326 239920 239216 238459 238142 238384 239224 240750 242463 243379 243372 243523 244523 245693 246380
56424 246380 247227 248963 250875 251798 251954 252499 253741 255060 256143 256991 257066 255823 254005 253117 253581 254472 255095
56407 255095 255731 256743 257933 258959 259601 259553 258722 257751 257474 257884 258340 258714 259449 260528 261248 261172 260593 259951
56389 259951 259419 259117 259135 259310 259513 260061 261303 262946 264406 265669 267149 268809 270141 270918 271384 271829 272540
$$ packed form
56511B21644j510j242j238j245j075q78o57k57J87L66K44o2n24q39l89P96J655
56494B14976J436P59N28M61j22q01o38J58N45L85N10J159J671J687J499J227P43
56477B26183L58M58N43j78j291j519o07L55O27O06P87J005J037R48O60R8j48N84
56459B30506J716J828O22o16q08l36p2j15L1O39J527K199K162J468Q52P67O57
56442B43027r2r71j069n69m06p04p57l17K42Q40J526J713R16pJ51J000J170O87
56424B46380Q47J736J912R23J56N45J242J319J083Q48P5j243j818q88M64Q91O23
56407B55095O36J012J190J026O42m8q31r71k77M10M56L74P35J079P20p6n79o42
56389B59951n32l02J8J75K03N48J242J643J460J263J480J660J332P77M66M45P11
$$ plain form
56372 272540 273943 276092 278263 279753 280846 282224 283718 284579 284843 285396 286655 288042 288919 289277 289450 289808
56356 289808 290752 292261 293484 293518 292650 292101 292490 293308 293936 294418 295022 295776 296640 297594 298393 298739 298844 299292
56338 299292 300346 301785 303404 305118 306664 307791 308770 310220 312413 315154 318184 321197 323672 325275
56324 325275 326320 327345 328460 329661 331408 334061 336996 339123 340242 341117 342279 343548 344758 346183
56310 346183 348086 350303 352377 353776 354290 354647 356276 359805 364179 367970 371092 374357 377845 380874 383355
56295 383355 385999 389236 392968 397318 402493 407862 412331 415878 419709 424647 430246 435788 441274 447018
56281 447018 452948 458721 464133 469328 474899 481638 489675 498137 506319 514853 524915 536530 548623
56268 548623 560541 572587 585165 598481 613049 629485 647681 667079 687734 710232 734670
$$ packed form
56372B72540J403K149K171J490J093J378J494Q61K64N53J259J387Q77L58J73L58
56356B89808R44J509J223L4q68n49L89Q18O28M82O04P54Q64R54P99L46J05M48
56338B99292J054J439J619J714J546J127R79J450K193K741L030L013K475J603
56324C25275J045J025J115J201J747K653K935K127J119Q75J162J269J210J425
56310C46183J903K217K074J399N14L57J629L529M374L791L122L265L488L029K481
56295C83355K644L237L732M350N175N369M469L547L831M938N599N542N486N744
56281D47018N930N773N412N195N571O739Q037Q462Q182Q534J0062J1615J2093
56268E48623J1918J2046J2578J3316J4568J6436J8196J9398K0655K2498K4438
$$ plain form
56257 734670 760841 789480 822223 860108 903069 951089 1004970 1065680 1133756 1209455 1292817
56246 1292817 1383539 1481471 1587051 1700312 1819608 1942267 2066311 2190308 2311616 2426122
56236 2426122 2530024 2620855 2696595 2754984 2794126 2812997 2811288 2789656 2750103 2695047 2625977
56225 2625977 2544067 2452014 2353847 2252643 2149592 2045525 1942048 1840796 1742785 1649005
56215 1649005 1560584 1477882 1400309 1327392 1259209 1195676 1136494 1082000 1032943 989164 949537
56204 949537 913393 880834 851466 824186 798614 775506 755287 737345 721204 707162 695228
56193 695228 684522 674354 664912 656436 648731 641886 636440 632385 629006 626036 623911 622611 621488 620588
56179 620588 620797 622163 623385 623644 623724 624581 625925 627011 627844 628811 629922 631191 633093 636058 640003 644669
$$ packed form
56257G34670K6171K8639L2743L7885M2961M8020N3881O0710O8076P5699Q3362
56246A292817R0722R7932J05580J13261J19296J22659J24044J23997J21308J14506
56236B426122J03902R0831P5740N8389L9142J8871j709k1632l9553n5056o9070
56225B625977q1910r2053r8167j01204j03051j04067j03477j01252r8011r3780
56215A649005q8421q2702p7573p2917o8183o3533n9182n4494m9057m3779l9627
56204I49537l6144l2559k9368k7280k5572k3108k0219j7942j6141j4042j1934
56193F95228j0706j0168r442q476p705o845n446m055l379k970k125j300j123r00
56179F20588K09J366J222K59Q0Q57J344J086Q33R67J111J269J902K965L945M666
$$ plain form
56163 644669 649828 655114 660425 666434 673754 681770 689411 696872 705251 714727 724791 736181 750559
56150 750559 767956 786510 805287 825530 848518 874179 902774 936128 976115 1023477 1079101
56139 1079101 1144902 1222284 1310894 1409562 1516686 1628567 1739000 1842101 1934859 2016445
56129 2016445 2086888 2147766 2202598 2254531 2303840 2348339 2385237 2411931 2426517 2429146 2422399 2409475
56117 2409475 2392410 2371985 2347751 2317171 2276011 2220765 2150455 2066303 1971174 1869728 1767355
56106 1767355 1667969 1573695 1486697 1409473 1342875 1285696 1236814 1196051 1162538 1134462 1111313
56095 1111313 1094241 1083184 1075632 1069361 1064479 1061714 1060670 1060878 1062638 1065667 1068841 1072252 1077439 1084561
56081 1084561 1091682 1098064 1105702 1116120 1128047 1139894 1152131 1165414 1178693 1191188 1204119 1218520
$$ packed form
56163F44669N159N286N311O009P320Q016P641P461Q379R476J0064J1390J4378
56150G50559J7397J8554J8777K0243K2988K5661K8595L3354L9987M7362N5624
56139A079101O5801P7382Q8610R8668J07124J11881J10433J03101R2758Q1586
56129B016445P0443O0878N4832N1933M9309M4499L6898K6694J4586K629o747j2924
56117B409475j7065k0425k4234l0580m1160n5246p0310q4152r5129j01446j02373
56106A767355r9386r4274q6998p7224o6598n7179m8882m0763l3513k8076k3149
56095A111313j7072j1057p552o271m882k765j044K08J760L029L174L411N187P122
56081A084561P121O382P638J0418J1927J1847J2237J3283J3279J2495J2931J4401
$$ plain form
56069 1218520 1233326 1247542 1262231 1278440 1295229 1311730 1329050 1348083 1367470 1385814 1403884
56058 1403884 1422562 1440761 1457537 1474111 1491560 1508637 1524211 1539724 1556811 1574629 1592045
56047 1592045 1610349 1631145 1653591 1676267 1699763 1724799 1749911 1773787 1797894 1824016 1851182
56036 1851182 1877907 1905492 1936127 1969552 2004376 2040899 2079926 2120726 2162922 2208368 2258398
56025 2258398 2311263 2364832 2419564 2476210 2533403 2590468 2649801 2713136 2778285 2842992 2909147
56014 2909147 2979577 3053593 3129480 3208437 3292019 3378652 3466881 3559069 3657670 3760987 3867120
56003 3867120 3978733 4098998 4226116 4357185 4494344 4641493 4797937 4960945 5131654
55994 5131654 5312683 5502934 5700845 5909805 6134095 6372366 6621453 6883578 7163287
$$ packed form
56069A218520J4806J4216J4689J6209J6789J6501J7320J9033J9387J8344J8070
56058A403884J8678J8199J6776J6574J7449J7077J5574J5513J7087J7818J7416
56047A592045J8304K0796K2446K2676K3496K5036K5112K3876K4107K6122K7166
56036A851182K6725K7585L0635L3425L4824L6523L9027M0800M2196M5446N0030
56025B258398N2865N3569N4732N6646N7193N7065N9333O3335O5149O4707O6155
56014B909147P0430P4016P5887P8957Q3582Q6633Q8229R2188R8601J03317J06133
56003C867120J11613J20265J27118J31069J37159J47149J56444J63008J70709
55994E131654J81029J90251J97911K08960K24290K38271K49087K62125K79709
$$ plain form
55985 7163287 7460661 7774611 8109608 8471912 8862459 9280875 9732819 10225444 10759532
55976 10759532 11334539 11957401 12637573 13377947 14180442 15056124 16019748 17079554 18243933
55967 18243933 19533200 20973101 22582937 24383976 26414179 28721308 31350251 34355924
55959 34355924 37824192 41866107 46606270 52205984 58898737 66993711 76876058 89053664
55951 89053664 104207422 123176707 146916812 176436179 212467547 254614208 300304115
55944 300304115 344514092 380937831 404115156 411217759 402552691 380870348 350169763
55937 350169763 314586144 277620969 241792442 208658218 179027558 153174582 131002842
55930 131002842 112197824 96359409 83072990 71933204 62569168 54672751 47998120
$$ packed form
55985G163287K97374L13950L34997L62304L90547M18416M51944M92625N34088
55976A0759532N75007O22862O80172P40374Q02495Q75682R63624J059806J164379
55967A8243933J289267J439901J609836J801039K030203K307129K628943L005673
55959C4355924L468268M041915M740163N599714O692753Q094974R882347J2177606
55951H9053664J5153758J8969285K3740105K9519367L6031368M2146661M5689907
55944C00304115M4209977L6423739K3177325P102603q665068k1682343l0700585
55937C50169763l5583619l6965175l5828527l3134224k9630660k5852976k2171740
55930A31002842j8805018j5838415j3286419j1139786r364036p896417o674631
$$ plain form
55923 47998120 42339627 37523142 33410944 29894193 26876336 24271569 22013886 20053274
55915 20053274 18342888 16839122 15510829 14336800 13294791 12361789 11522739 10768956
55907 10768956 10088715 9467841 8898315 8377751 7900950 7459536 7049123 6669538 6318453
55898 6318453 5991332 5686874 5406155 5147099 4905605 4681053 4474944 4285241 4107894
55889 4107894 3942737 3792121 3654845 3527295 3409598 3304686 3211821 3126572 3046670 2972465
55879 2972465 2902107 2831858 2761235 2692768 2626513 2559472 2490345 2420203 2348448 2272818 2193773
55868 2193773 2114777 2037889 1962858 1890426 1822538 1759143 1698571 1641166 1588959 1541778 1497300
55857 1497300 1454849 1415586 1379039 1343178 1308018 1275530 1245796 1216671 1187493 1159695 1133464
$$ packed form
55923D7998120n658493m816485m112198l516751l017857k604767k257683j960612
55915B0053274j710386j503766j328293j174029j042009r33002q39050p53783
55907A0768956o80241o20874n69526n20564m76801m41414m10413l79585l51085
55898F318453l27121l04458k80719k59056k41494k24552k06109j89703j77347
55889D107894j65157j50616j37276j27550j17697j04912r2865q5249p9902p4205
55879B972465p0358p0249p0623o8467o6255o7041o9127p0142p1755p5630p9045
55868B193773p8996p6888p5031p2432o7888o3395o0572n7405n2207m7181m4478
55857A497300m2451l9263l6547l5861l5160l2488k9734k9125k9178k7798k6231
$$ plain form
55846 1133464 1107033 1079704 1052555 1025856 998759 971806 946857 924232 902577 881671 862682
55835 862682 845614 829204 813330 798887 785384 771440 757535 745415 734888 724158 713258
55824 713258 704061 696733 689208 680458 671333 661854 650790 638479 627168 617712 608564 598705 589032
55811 589032 580188 571565 563221 556395 551307 546678 542163 539164 538600 539959 543112 548882 557101 566168
55797 566168 575161 584441 593625 600985 605473 607431 606791 602614 595028 585751 576088 566167 556534 548408
55783 548408 541666 534485 525693 515712 504715 491918 477504 463490 451768 442831 437031 435406 438473
55770 438473 445516 455473 466988 477336 483200 483355 479133 471879 461694 449144 436168 424289 413496
55757 413496 403654 395415 388830 382593 375603 368080 360350 351826 342047 331573 321157 311011 301411
$$ packed form
55846A133464k6431k7329k7149k6699k7097k6953k4949k2625k1655k0906j8989
55835H62682j7068j6410j5874j4443j3503j3944j3905j2120j0527j0730j0900
55824G13258r197p328p525q750r125r479j1064j2311j1311r456r148r859r673
55811E89032q844q623q344o826n088m629m515k999n64J359L153N770Q219R067
55797E66168Q993R280R184P360M488J958o40m177p586r277r663r921r633q126
55783E48408o742p181q792r981j0997j2797j4414j4014j1722q937n800j625L067
55770D38473P043R957J1515J0348N864J55m222p254j0185j2550j2976j1879j0793
55757D13496r842q239o585o237o990p523p730q524r779j0474j0416j0146r600
$$ plain form
55744 301411 292935 285659 279255 274064 270850 269221 267777 266082 264980 264640 263969 262468 261009 260114 259083
55729 259083 257547 256276 255570 254323 251556 247604 243022 237767 232279 227940 225361 223408 220894 218227
55715 218227 216465 215874 216354 218298 221942 226583 231211 235324 238657 240971 242648 244555 246755 248244 248354
55700 248354 247411 245533 241951 236203 229044 221579 214430 208179 203528 200350 197569 194513 191454 188506
55686 188506 185270 182172 180760 181806 184212 186661 189324 193043 197733 202549 206875 210380 212731 213950
55672 213950 214457 214357 213406 211973 211013 210649 209846 208013 205911 204447 203650 203368 203747 204366 204134 202923 202205
55655 202205 203129 205056 206885 208777 211464 214809 218177 221442 224474 226330 226113 224238 221834 219303 216296
55640 216296 212676 208640 204150 199030 193375 187332 180803 173834 166935 160667 155334 151261 148735 147378
$$ packed form
55744C01411q476p276o404n191l214j629j444j695j102l40o71j501j459q95j031
55729B59083j536j271p06j247k767l952m582n255n488m339k579j953k514k667
55715B18227j762n91M80J944L644M641M628M113L333K314J677J907K200J489J10
55700B48354r43j878l582n748p159p465p149o251m651l178k781l056l059k948
55686A88506l236l098j412J046K406K449K663L719M690M816M326L505K351J219
55672B13950N07j00r51j433r60l64q03j833k102j464p97k82L79O19k32j211p18
55655B02205R24J927J829J892K687L345L368L265L032J856k17j875k404k531l007
55640B16296l620m036m490n120n655o043o529o969o899o268n333m073k526j357
$$ plain form
55626 147378 146366 145523 145409 146008 146347 145867 145171 144865 144648 144147 143549 142686 140572 136854 132825 129958 128133
55609 128133 126256 123957 121692 119713 117898 116217 114574 112622 110418 108809 108435 108759 108731 108003 106921
55594 106921 105777 104721 104030 103930 104400 105366 106679 107816 108285 108441 109018 109755 109592 108440 107485 107286 107016
55577 107016 106238 105962 106920 108149 108493 108352 108703 109488 110320 111833 114732 118165 120519 121438 121761 121930 121762
55560 121762 121435 121387 121420 120983 120147 119336 118418 117042 115514 114344 113313 111956 110593 109849 109575 109307 109354 110251
55542 110251 111465 111910 111623 111738 112871 114574 116316 117991 119498 120839 122539 124956 127199 127832 126702
55527 126702 125135 124193 123670 122943 121882 120580 118950 116957 114787 112593 110404 108314 106361 104363 102245
55512 102245 100319 98833 97564 96361 95626 95557 95392 94282 92635 91650 91679 91963 91906 91656 91274 90247 88147
$$ packed form
55626A47378j012q43j14N99L39m80o96l06k17n01n98q63k114l718m029k867j825
55609A28133j877k299k265j979j815j681j643j952k204j609l74L24k8p28j082
55594A06921j144j056o91j00M70R66J313J137M69J56N77P37j63j152r55j99k70
55577A07016p78k76R58J229L44j41L51P85Q32J513K899L433K354R19L23J69j68
55560A21762l27m8L3m37q36q11r18j376j528j170j031j357j363p44k74k68M7Q97
55542A10251J214M45k87J15J133J703J742J675J507J341J700K417K243O33j130
55527A26702j567r42n23p27j061j302j630j993k170k194k189k090j953j998k118
55512A02245j926j486j269j203p35o9j65j110j647r85K9K84n7k50l82j027k100
$$ plain form
55495 88147 85209 82052 79129 76576 74347 72550 71790 72785 75315 78073 79989 81185 82064 82252 81332 80031
55479 80031 79489 79666 79607 79169 79345 80802 83022 85040 86271 86570 86281 86288 87307 89007 90435 91218 91673 91902
55461 91902 91635 91003 90664 91013 91859 92905 93918 94486 94296 93665 93190 92880 92303 91468 90839 90485 89925 88845
55443 88845 87363 85668 84088 83352 83978 85353 86206 86055 85518 85257 85386 85895 86785 87632 87787 87277 86872 87122
55425 87122 87917 89001 90194 91020 90903 90012 89309 89466 90226 90917 91106 90710 90037 89801 90544 91962 93270 94118
55407 94118 94593 94513 93580 92205 91288 91038 90792 90149 89479 89061 88540 87630 86719 86371 86741 87724 89168 90686
55389 90686 91752 92236 92445 92550 92439 92152 91819 91128 89588 87571 86345 86713 88146 89519 90184 90076 89422
55372 89422 88783 88872 89831 90964 91476 91270 90848 90763 91262 92145 92789 92610 91584 90117 88503 86923 85740 85180
$$ packed form
55495H8147k938l157k923k553k229j797p60R95K530K758J916J196Q79J88r20j301
55479H0031n42J77n9m38J76J457K220K018J231K99k89PJ019J700J428P83M55K29
55461I1902k67o32l39L49Q46J046J013N68j90o31m75l10n77q35o29l54n60j080
55443H8845j482j695j580p36O26J375Q53j51n37k61J29N09Q90Q47J55n10m05K50
55425H7122P95J084J193Q26j17q91p03J57P60O91J89l96o73k36P43J418J308Q48
55407I4118M75q0r33j375r17k50k46o43o70m18n21r10r11l48L70R83J444J518
55389I0686J066M84K09J05j11k87l33o91j540k017j226L68J433J373O65j08o54
55372H9422o39Q9R59J133N12k06m22q5M99Q83O44j79j026j467j614j580j183n60
$$ plain form
55354 85180 84788 83918 82769 82193 82369 82511 82136 81824 82302 83467 84766 85971 87018 87544 87220 86386 85864
55337 85864 86167 87068 87891 88155 88093 88509 89831 91395 92019 91307 89928 88649 87575 86407 84962 83303 81726
55320 81726 80722 80602 81129 81854 82713 83857 84991 85498 85241 84706 84330 84189 84321 84777 85288 85507 85593 86019
55302 86019 86827 87671 88499 89449 90089 89641 88152 86699 86193 86562 87267 87868 87993 87440 86597 86097 85967 85810
55284 85810 85803 86546 87812 88538 88461 88649 89863 91355 92014 91910 91912 92406 93139 93765 93910 93193 91790 90521 89873
55265 89873 89446 88826 88370 88473 88688 88332 87489 86705 86099 85529 85252 85615 86353 86913 87334 88123 89389 90715
55247 90715 91803 92639 93045 92643 91414 89998 89261 89522 90095 89702 87741 85185 83688 83722 84241 84387 84633
55230 84633 85744 87415 88747 89524 90165 90791 91159 91333 91656 92126 92415 92473 92613 93064 93858 94967 96067 96353
$$ packed form
55354H5180l92q70j149n76J76J42l75l12M78J165J299J205J047N26l24q34n22
55337H5864L03R01Q23K64o2M16J322J564O24p12j379j279j074j168j445j659j577
55320H1726j004j20N27P25Q59J144J134N07k57n35l76j41J32M56N11K19Q6M26
55302H6019Q08Q44Q28R50O40m48j489j453n06L69P05O01J25n53q43n00j30j57
55284H5810pP43J266P26p7J88J214J492O59j04KM94P33O26J45p17j403j269o48
55265H9873m27o20m56J03K15l56q43p84o06n70k77L63P38N60M21P89J266J326
55247I0715J088Q36M06m02j229j416p37K61N73l93j961k556j497L4N19J46K46
55230H4633J111J671J332P77O41O26L68J74L23M70K89N8J40M51P94J109J100K86
$$ plain form
55212 96353 95225 93168 91533 91360 92606 94385 95705 96125 95962 95752 95422 94380 92571 90907 90271 90571
55196 90571 91198 91866 92446 92502 91743 90623 89833 89427 89110 89113 89989 91692 93574 95181 96407 96948 96463 95328
55178 95328 94490 94291 94093 93336 92424 92161 92683 93311 93310 92535 91441 90703 90757 91587 92837 94080 94987 95407 95437
55159 95437 95313 95228 95365 96003 97259 98668 99404 99097 98103 96882 95565 94272 93301 92691 92138 91726 92170 93758
55141 93758 95548 96309 95968 95479 95483 95762 95863 95630 95145 94633 94442 94743 95291 95778 96197 96558 96578 96102 95532 95266
55121 95266 95071 94590 94208 94661 95901 97052 97454 97127 96329 95334 94653 94697 95088 94902 93802 92412 91465 91163
55103 91163 91469 92413 93754 94865 95324 95378 95557 96061 96668 97029 96976 96726 96788 97480 98585 99743 101008 102611
55085 102611 104273 105299 105423 105117 105021 105477 106560 108008 108967 108439 106362 103910 102473 102581 103889 105717
$$ packed form
55212I6353j128k057j635j73J246J779J320M20j63k10l30j042j809j664o36L00
55196I0571O27O68N80N6p59j120p90m06l17LQ76J703J882J607J226N41m85j135
55178I5328q38j99j98p57r12k63N22O28jp75j094p38N4Q30J250J243R07M20L0
55159I5437j24q5J37O38J256J409P36l07r94j221j317j293r71o10n53m12M44J588
55141I3758J790P61l41m89MK79J01k33m85n12j91L01N48M87M19L61K0m76n70k66
55121I5266j95m81l82M53J240J151M02l27p98r95o81M4L91j86j100j390r47l02
55103I1163L06R44J341J111M59N4J79N04O07L61n3k50O2O92J105J158J265J603
55085A02611J662J026J24l06r6M56J083J448R59n28k077k452j437J08J308J828
$$ plain form
55069 105717 107332 108138 108071 107626 107205 106586 105273 103220 100973 99160 98077 97641 97586 97717 98086 98909 100273
55052 100273 101945 103529 104703 105327 105424 105171 104835 104669 104761 104962 105006 104888 105055 105916 107071 107435 106426 104801
55034 104801 103913 104298 105317 106036 106103 105757 105388 105179 105031 104829 104875 105772 107590 109371 109914 109026 107600 106474
55016 106474 105641 104651 103349 102028 101057 100646 100799 101401 102305 103350 104265 104728 104694 104601 105064 106325 108053 109585
54998 109585 110353 110270 109789 109391 109040 108447 107845 107927 108816 109718 109993 109996 110286 110574 110264 109647 109668 110624 111851 112685
54978 112685 112978 112719 111952 111189 111126 111756 112390 112779 113526 115152 117322 119279 120493 120644 119629 118104 117451
54961 117451 118594 121039 123535 125433 126940 128222 128834 128225 126556 124793 123948 124191 124780 124954 124754 124739
54945 124739 125090 125395 125385 125394 125901 126863 127742 128012 127524 126526 125522 125040 125435 126793 128789 130579 131201 130522
$$ packed form
55069A05717J615Q06o7m45m21o19j313k053k247j813j083m36n5J31L69Q23J364
55052A00273J672J584J174O24R7k53l36j66R2K01M4j18J67Q61J155L64j009j625
55034A04801q88L85J019P19O7l46l69k09j48k02M6Q97J818J781N43q88j426j126
55016A06474q33r90j302j321r71m11J53O02R04J045R15M63l4r3M63J261J728J532
54998A09585P68q3m81l98l51n93o02Q2Q89R02K75LK90K88l10o17K1R56J227Q34
54978A12685K93k59p67p63o3O30O34L89P47J626K170J957J214J51j015j525o53
54961A17451J143K445K496J898J507J282O12o09j669j763q45K43N89J74k00j5
54945A24739L51L05j0RN07R62Q79K70m88r98j004m82L95J358J996J790O22o79
$$ plain form
54927 130522 129608 129750 131173 133106 134985 137140 140310 144986 151228 158643 166369 173483 179563 184556 188219
54912 188219 190135 190287 189065 186670 183014 178330 173286 168299 163274 158201 153466 149266 145284 141311
54898 141311 137741 135046 133147 131746 130891 130769 131203 131800 132340 132638 132250 130855 128889 127387 127119 128075
54882 128075 129705 131454 133141 135073 137829 141878 147376 154253 162198 170522 178301 184905 190204 194150
54868 194150 196405 196613 194839 191517 187106 181967 176433 170796 165249 159840 154433 148820 143164 138272
54854 138272 134939 132894 130827 127733 123941 120575 118356 117228 116772 116521 116074 115393 114957 115238 116025 116559
54838 116559 116328 115453 114284 112986 111646 110543 110039 110237 110916 111832 112936 114177 115194 115485 115008 114364
54822 114364 114157 114269 114042 113099 111730 110478 109632 109124 108722 108300 108121 108763 110532 112999 115355 117174 118521
$$ packed form
54927A30522r14J42J423J933J879K155L170M676O242P415P726P114O080M993L663
54912A88219J916J52j222k395l656m684n044m987n025n073m735m200l982l973
54898A41311l570k695j899j401q55j22M34N97N40K98l88j395j966j502k68R56
54882A28075J630J749J687J932K756M049N498O877P945Q324P779O604N299L946
54868A94150K255K08j774l322m411n139n534n637n547n409n407n613n656m892
54854A38272l333k045k067l094l792l366k219j128m56k51m47o81m36K81P87N34
54838A16559k31q75j169j298j340j103n04J98O79R16J104J241J017K91m77o44
54822A14364k07J12k27r43j369j252q46n08m02m22j79O42J769K467K356J819J347
$$ plain form
54805 118521 119485 120008 120152 120066 119670 118811 117769 117147 117137 117354 117537 117896 118541 119036 118927 118415 118167 118642 119805
54786 119805 121217 122218 122296 121561 120699 120333 120656 121755 123832 126791 129947 132561 134558 136445 138614 140985
54770 140985 143231 145247 147490 150861 155984 162503 169371 175953 182467 189149 195339 199814 201898 201948 200821
54755 200821 199056 196511 192663 187274 180775 173939 167344 161336 156266 152299 149042 145936 143093 141204
54741 141204 140488 140242 139648 138576 137353 136262 135541 135453 136013 136953 138131 139558 140891 141547 141678 142409 144566
54724 144566 147703 150942 154343 158728 164453 171000 177651 183883 189140 192780 194432 194125 192076 188622
54710 188622 184276 179566 174780 169978 165110 160069 154898 150077 146283 143634 141501 139282 137037 135132
54696 135132 133672 132605 131994 131819 131844 131942 132172 132240 131504 129954 128654 128520 129114 129279 128636 127674 126748 125844
$$ packed form
54805A18521R64N23J44q6l96q59j042o22j0K17J83L59O45M95j09n12k48M75J163
54786A19805J412J001P8p35q62l66L23J099K077K959L156K614J997J887K169K371
54770A40985K246K016K243L371N123O519O868O582O514O682O190M475K084N0j127
54755B00821j765k545l848n389o499o836o595o008n070l967l257l106k843j889
54741A41204p16k46n94j072j223j091p21q8N60R40J178J427J333O56J31P31K157
54724A44566L137L239L401M385N725O547O651O232N257L640J652l07k049l454
54710A88622m346m710m786m802m868n041n171m821l794k649k133k219k245j905
54696A35132j460j067o11j75K5R8K30O8p36j550j300j34N94J65o43r62r26r04
$$ plain form
54678 125844 125282 125759 127452 129594 131068 131168 129941 128206 127024 126658 126223 124847 122944 121698 121507 121680
54662 121680 121613 121480 121653 122134 122748 123345 123636 123337 122637 122035 121678 121368 121249 121856 123287 124919 126224 127296
54644 127296 128258 128733 128421 127795 127599 127813 127677 126745 125459 124437 123619 122513 121164 120292 120203 120059 118907
54627 118907 117212 116538 117563 119269 120451 121127 121789 122125 121588 120724 120699 121536 122005 121419 120513 120216 120502 120931
54609 120931 121499 122267 122727 122359 121599 121527 122523 123702 123911 123072 122275 122534 123646 124506 124420 123698 122926 122215 121557
54590 121557 121359 121986 123102 124052 124729 125406 125986 126142 126084 126421 127254 128141 128950 129962 131018 131403 130822 129832
54572 129832 129081 128709 128724 129235 129979 130299 129961 129480 129303 129232 128995 128797 128888 129085 129145 129173 129296 129451 129821 130880
54552 130880 132476 133470 133012 131802 131374 132317 133874 135161 136141 137308 138877 140502 141599 141938 142006 142618
$$ packed form
54678A25844n62M77J693K142J474J00j227j735j182l66m35j376j903j246j91J73
54662A21680o7j33J73M81O14N97K91k99p00o02l57l10j19O07J431J632J305J072
54644A27296R62M75l12o26j96K14j36r32j286j022q18j106j349q72q9j44j152
54627A18907j695o74J025J706J182O76O62L36n37q64k5Q37M69n86r06k97K86M29
54609A20931N68P68M60l68p60p2R96J179K09q39p97K59J112Q60q6p22p72p11o58
54590A21557j98O27J116R50O77O77N80J56n8L37Q33Q87Q09J012J056L85n81r90
54572A29832p51l72J5N11P44L20l38m81j77p1k37j98R1J97O0K8J23J55L70J059
54552A30880J596R94m58j210m28R43J557J287R80J167J569J625J097L39O8O12
$$ plain form
54536 142618 144025 145586 146497 146536 145872 144550 142638 140711 139600 139566 140034 140282 140181 140130 140410 140766 140707 140105
54518 140105 139324 138724 138374 138319 138709 139296 139307 138425 137549 137745 138629 138812 137948 137233 137489 137881 137248 135833 134812
54499 134812 134622 134695 134539 134228 133924 133595 133243 132925 132609 132360 132535 133395 134635 135669 136305 136864 137708 138891
54481 138891 140145 141049 141412 141563 142003 142748 143457 144208 145474 147105 148166 148291 148426 149564 151359 152802
54465 152802 153681 154452 155100 155181 154853 154855 155415 155989 156175 156135 156007 155618 154943 154319 153988 153861 153778 153638 153290 152713
54445 152713 152226 152107 152132 151943 151670 151629 151617 151183 150440 149873 149434 148656 147650 147092 147121 147068 146553 146051 146093 146620
54425 146620 147468 148746 150327 151586 152074 151906 151217 149866 148133 146968 146922 147324 147180 146446 145816 145621 145713
54408 145713 146194 147476 149571 151899 153925 155588 157011 158134 158784 158907 158668 158380 158354 158726 159450 160413 161456
$$ packed form
54536A42618J407J561R11L9o64j322j912j927j111l4M68K48j01n1K80L56n9o02
54518A40105p81o00l50n5L90N87J1q82q76J96Q84J83q64p15K56L92o33j415j021
54499A34812j90P3j56l11l04l29l52l18l16k49J75Q60J240J034O36N59Q44J183
54481A38891J254R04L63J51M40P45P09P51J266J631J061J25J35J138J795J443
54465A52802Q79P71O48Q1l28KN60N74J86m0j28l89o75o24l31j27q3j40l48n77
54445A52713m87j19K5j89k73m1j2m34p43n67m39p78j006n58K9n3n15n02M2N27
54425A46620Q48J278J581J259M88j68o89j351j733j165m6M02j44p34o30j95R2
54408A45713M81J282K095K328K026J663J423J123O50J23k39k88k6L72P24R63J043
$$ plain form
54391 161456 162373 163116 163871 164583 164568 163240 161217 159974 160108 160694 160768 160652 161111 161835 161816 160998 160497 161082 162270
54372 162270 163176 163632 164045 164623 165187 165595 166031 166905 168493 170644 172866 174850 176837 179312 182425 185862
54356 185862 189131 191700 193074 193125 192297 191090 189434 186997 184034 181371 179401 177607 175372 172869 170768
54341 170768 169322 168105 166565 164520 162225 160207 159039 159006 159865 160974 161682 161652 160935 159849 158756 157916
54325 157916 157577 158073 159618 161835 163722 164349 163688 162642 162140 162216 162083 161157 159818 158898 158529 157938 156571
54308 156571 154983 154145 154172 154346 154296 154406 154881 155040 154086 152220 150536 149956 150580 151844 152965 153303 152705 151570
54290 151570 150430 149540 149022 149149 150104 151487 152486 152629 152156 151635 151425 151558 151838 151975 151789 151348 150797 150146
54272 150146 149448 149028 149173 149546 149436 148755 148383 149206 151071 153019 154384 155333 156426 157903 159415 160366 160584
$$ packed form
54391A61456R17P43P55P12j5j328k023j243J34N86P4j16M59P24j9q18n01N85J188
54372A62270R06M56M13N78N64M08M36Q74J588K151K222J984J987K475L113L437
54356A85862L269K569J374N1q28j207j656k437k963k663j970j794k235k503k101
54341A70768j446j217j540k045k295k018j168l3Q59J109P08l0p17j086j093q40
54325A57916l39M96J545K217J887O27o61j046n02P6j33r26j339r20l69n91j367
54308A56571j588q38K7J74n0J10M75J59r54j866j684n80O24J264J121L38n98j135
54290A51570j140q90n18J27R55J383R99J43m73n21k10J33K80J37j86m41n51o51
54272A50146o98m20J45L73j10o81l72Q23J865J948J365R49J093J477J512R51K18
$$ plain form
54255 160584 160674 161468 163004 164348 164667 164150 163551 163165 162785 162431 162460 162892 163223 163091 162689 162263 161638 160584
54237 160584 159369 158607 158643 159269 159910 160010 159434 158658 158329 158533 158736 158637 158681 159400 160519 161213 161137 160750 160637
54218 160637 160883 161189 161279 161047 160585 160132 159834 159528 158965 158280 157907 157933 157800 156885 155205 153375 151962 151094
54200 151094 150577 150228 150057 150240 150928 152004 153048 153630 153655 153376 153112 153002 153002 153045 153126 153188 153006 152345 151373 150750
54180 150750 151099 152358 153847 155004 155826 156536 157117 157440 157652 158123 159000 160074 161090 161929 162389 162079 160778
54163 160778 158846 157065 156067 155995 156591 157391 157858 157627 156793 155861 155256 154997 154869 154801 154860 155051 155361 155890 156661
54144 156661 157389 157815 158267 159446 161445 163456 164762 165647 166850 168425 169711 170273 170254 169777 168747 167480
54128 167480 166881 167479 168633 169211 168841 168098 167620 167527 167633 167726 167565 167015 166355 166199 166919 168279 169652 170470
$$ packed form
54255A60584R0P94J536J344L19n17n99l86l80l54K9M32L31j32m02m26o25j054
54237A60584j215p62L6O26O41J00n76p76l29K04K03r9M4P19J119O94p6l87j13
54218A60637K46L06R0k32m62m53k98l06n63o85l73K6j33r15j680j830j413q68
54200A51094n17l49j71J83O88J076J044N82K5k79k64j10%M3Q1O2j82o61r72o23
54180A50750L49J259J489J157Q22P10N81L23K12M71Q77J074J016Q39M60l10j301
54163A60778j932j781r98p2N96Q00M67k31q34r32o05k59j28o8N9J91L10N29P71
54144A56661P28M26M52J179J999K011J306Q85J203J575J286N62j9m77j030j267
54128A67480n99N98J154N78l70p43m78r3J06R3j61n50o60j56P20J360J373Q18
$$ plain form
54110 170470 170494 169897 169170 168743 168673 168814 169210 170003 171008 171803 172347 173167 174720 176838 179015 180975 182824
54093 182824 184993 188201 193126 199743 207190 214525 221256 226882 230439 231157 229352 226046 221872 216905
54079 216905 211387 205865 200652 195882 192184 190348 190071 189831 188570 186865 185872 185738 185782 185727 185878 186258 186488
54062 186488 186562 187061 188424 190483 192882 195482 198260 201180 204330 207791 211177 213630 214506 213929 212636
54047 212636 211396 210619 210232 209913 209632 209937 211475 214225 217459 220432 222880 224957 227118 230039 234146
54032 234146 239032 243731 247765 251560 255661 259884 263590 266502 268896 271133 273321 275411 277351 279063
54018 279063 280328 280799 280287 279181 278363 278302 278302 277065 274100 270164 266166 262151 257658 252605 247296 241875
54002 241875 236361 231168 226976 223921 221283 218202 214591 211155 208662 207289 206625 206123 205499 204751 203971
$$ packed form
54110A70470K4n97p27m27p0J41L96P93J005P95N44Q20J553K118K177J960J849
54093A82824K169L208M925O617P447P335O731N626L557P18j805l306m174m967
54079B16905n518n522n213m770l698j836k77k40j261j705r93j34M4n5J51L80K30
54062A86488P4M99J363K059K399K600K778K920L150L461L386K453Q76n77j293
54047B12636j240p77l87l19k81L05J538K750L234K973K448K077K161K921M107
54032B34146M886M699M034L795M101M223L706K912K394K237K188K090J940J712
54018B79063J265M71n12j106q18o1%j237k965l936l998m015m493n053n309n421
54002B41875n514n193m192l055k638l081l611l436k493j373o64n02o24p48p80
$$ plain form
53987 203971 203163 202196 200912 199395 198138 197655 197848 198029 197818 197672 198083 198600 198286 197050 195772 195078 194736
53970 194736 194466 194527 195057 195522 195440 195214 195590 196616 197756 198792 199981 201433 202993 204776 207285 210835
53954 210835 215305 220600 227100 235413 245723 257361 268872 278612 285611 289941 292224 292792 291444 288006
53940 288006 283027 277844 273798 271214 269294 267278 265574 265301 266796 269197 271590 273851 276022 277667
53926 277667 278509 279265 281070 284250 288157 292081 295833 299593 303637 308078 312607 316749 320652 325182 330801
53911 330801 336875 342661 348439 354832 361429 367031 371093 373966 375798 376254 375472 374309 373284 372062 370344
53896 370344 368504 366856 364814 361378 356190 349736 342708 335467 328037 320475 313225 306931 301678 296682
53882 296682 291138 285116 279192 273528 268058 263297 259963 257768 255529 252685 249832 247500 245316 242800
$$ packed form
53987B03971q08r67j284j517j257m83J93J81k11j46M11N17l14j236j278o94l42
53970A94736k70O1N30M65q2k26L76J026J140J036J189J452J560J783K509L550
53954B10835M470N295O500Q313J0310J1638J1511R740O999M330K283N68j348l438
53940B88006m979n183m046k584j920k016j704k73J495K401K393K261K171J645
53926B77667Q42P56J805L180L907L924L752L760M044M441M529M142L903M530N619
53911C30801O074N786N778O393O597N602M062K873J832M56p82j163j025j222j718
53896C70344j840j648k042l436n188o454p028p241p430p562p250o294n253m996
53882B96682n544o022n924n664n470m761l334k195k239k844k853k332k184k516
$$ plain form
53868 242800 240207 237970 235960 233811 231507 229184 226843 224662 223070 222081 221007 219282 217092 214839
53854 214839 212552 210315 208683 208052 207963 207587 206627 205303 203854 202548 201773 201641 201826 202197 203154 204815 206369
53837 206369 206930 206625 206178 205752 204952 203761 202737 202349 202666 203537 204502 204750 203855 202535 202071 202956 204539
53820 204539 205895 206564 206581 206378 206634 207691 209192 210671 212277 214313 216389 217817 218895 220909 224626
53805 224626 229384 233917 237578 240514 243187 246106 249673 253958 258622 263175 267176 270381 272942 275416
53791 275416 278236 281296 284343 287499 290891 293982 295962 296806 297295 297860 297984 296941 294638 291494 287896
53776 287896 283941 279433 274084 267995 261893 256492 251752 247268 243228 240210 238107 236071 233730 231590
53762 231590 229890 227948 225191 222146 219752 218157 216830 215440 214022 212570 211110 209962 209420 209327 209405
$$ packed form
53868B42800k593k237k010k149k304k323k341k181j592r89j074j725k190k253
53854B14839k287k237j632o31q9l76r60j324j449j306p75j32J85L71R57J661J554
53837B06369N61l05m47m26q00j191j024l88L17Q71R65K48q95j320m64Q85J583
53820B04539J356O69J7k03K56J057J501J479J606K036K076J428J078K014L717
53805B24626M758M533L661K936K673K919L567M285M664M553M001L205K561K474
53791B75416K820L060L047L156L392L091J980Q44M89N65J24j043k303l144l598
53776B87896l955m508n349o089o102n401m740m484m040l018k103k036k341k140
53762B31590j700j942k757l045k394j595j327j390j418j452j460j148n42r3P8
$$ plain form
53747 209405 209710 210302 210713 210366 209396 208475 207894 207399 206942 206985 207868 209252 210483 211216 211528 211617 211619 211662 211934 212574
53727 212574 213424 213980 213892 213553 213877 215302 217289 219096 220715 222653 225054 227489 229490 230809 231267 230923
53711 230923 230450 230790 232201 234073 235838 237692 240174 243408 247052 250726 254126 256987 259305 261557 264281
53696 264281 267476 270677 273657 276708 280128 283727 287058 289919 292342 294135 294848 294356 293285 292536 292402
53681 292402 292362 291832 290873 289984 289338 288557 287247 285528 283874 282606 281690 280901 279992 278791 277344 276032 275287
53664 275287 275151 275264 275382 275694 276491 277722 279097 280410 281466 281825 281149 279895 279182 279677 280883 281835 282241
53647 282241 282528 282960 283245 283111 282883 283203 284316 285879 287451 289037 291001 293382 295467 296324 295852 295014
53631 295014 294838 295425 296204 296947 298106 300186 303253 307057 311318 315743 320054 324175 328242 332423 336848
$$ packed form
53747B09405L05N92M11l47r70r21n81m95m57M3Q83J384J231P33L12Q9KM3K72O40
53727B12574Q50N56q8l39L24J425J987J807J619J938K401K435K001J319M58l44
53711B30923m73L40J411J872J765J854K482L234L644L674L400K861K318K252K724
53696B64281L195L201K980L051L420L599L331K861K423J793P13m92j071p49j34
53681B92402m0n30r59q89o46p81j310j719j654j268r16p89r09j201j447j312p45
53664B75287j36J13J18L12P97J231J375J313J056L59o76j254p13M95J206R52M06
53647B82241K87M32K85j34k28L20J113J563J572J586J964K381K085Q57m72q38
53631B95014j76N87P79P43J159K080L067L804M261M425M311M121M067M181M425
$$ plain form
53616 336848 341624 346633 351390 355450 358921 362182 365152 367375 368941 370648 372940 375258 376940 378319
53602 378319 380289 383097 386191 389101 391796 394169 395849 396725 397172 397561 397935 398318 398935 399799 400441 400338
53586 400338 399452 398107 396573 395046 393784 392889 392066 390900 389317 387500 385513 383431 381755 381144 381485
53571 381485 381683 380752 378852 376850 375102 373191 370883 368774 367711 367869 368659 369379 369728 369859 370192 371070
53555 371070 372376 373533 374111 374384 375020 376250 377604 378544 379097 379754 380939 382806 385389 388640 392192 395338
53539 395338 397518 398891 400288 402467 405494 408995 412882 417535 423220 429627 436173 442595 449088 456059
53525 456059 463903 472822 482640 492954 503682 515219 527822 541145 554768 568888 583903 599527
53513 599527 615096 630796 647820 666905 687352 707963 728498 749643 771863 794885 818242
$$ packed form
53616C36848M776N009M757M060L471L261K970K223J566J707K292K318J682J379
53602C78319J970K808L094K910K695K373J680Q76M47L89L74L83O17Q64O42j03
53586D00338q86j345j534j527j262q95q23j166j583j817j987k082j676o11L41
53571C81485J98r31j900k002j748j911k308k109j063J58P90P20L49J31L33Q78
53555C71070J306J157N78K73O36J230J354R40N53O57J185J867K583L251L552L146
53539C95338K180J373J397K179L027L501L887M653N685O407O546O422O493O971
53525D56059P844Q919R818J0314J0728J1537J2603J3323J3623J4120J5015J5624
53513E99527J5569J5700J7024J9085K0447K0611K0535K1145K2220K3022K3357
$$ plain form
53502 818242 841749 865320 888684 911467 933386 954299 974214 993332 1011994 1030508 1048968
53491 1048968 1067194 1084897 1102062 1119111 1136534 1154354 1172213 1189856 1207157 1223723 1239142
53480 1239142 1253918 1269483 1286625 1304257 1320462 1334597 1347647 1360472 1372538 1382698 1390584
53469 1390584 1396576 1400659 1401983 1399710 1393974 1385711 1375740 1364300 1351576 1338294 1325397 1313122 1300757
53456 1300757 1287449 1272971 1257519 1241158 1223837 1205745 1187199 1168299 1149090 1129992 1111595
53445 1111595 1093966 1076574 1058963 1041221 1023780 1007214 992288 979687 969383 960643 953002 946910
53433 946910 943023 941089 940094 939430 939486 940947 943863 947657 951855 956536 962103 968813 976648 985561 995657
53418 995657 1007134 1020208 1035219 1052522 1071982 1092646 1113424 1134264 1156281 1180458 1206522
$$ packed form
53502H18242K3507K3571K3364K2783K1919K0913J9915J9118J8662J8514J8460
53491A048968J8226J7703J7165J7049J7423J7820J7859J7643J7301J6566J5419
53480A239142J4776J5565J7142J7632J6205J4135J3050J2825J2066J0160P886
53469A390584N992M083J324k273n736q263r971j1440j2724j3282j2897j2275j2365
53456A300757j3308j4478j5452j6361j7321j8092j8546j8900j9209j9098j8397
53445A111595j7629j7392j7611j7742j7441j6566j4926j2601j0304q740p641o092
53433I46910l887j934r95o64N6J461K916L794M198M681N567O710P835Q913J0096
53418I95657J1477J3074J5011J7303J9460K0664K0778K0840K2017K4177K6064
$$ plain form
53407 1206522 1233416 1260601 1288453 1317528 1348009 1379943 1413504 1448799 1485809 1524812 1566475
53396 1566475 1611054 1657662 1704874 1752142 1800323 1850627 1903239 1957061 2010663 2063373 2115530
53385 2115530 2167741 2219884 2270872 2319549 2365737 2410126 2453078 2493856 2531231 2564546 2593954
53374 2593954 2619802 2642242 2661344 2677175 2689513 2697739 2701089 2698885 2690470 2675229 2652976 2624260
53362 2624260 2590107 2551454 2508903 2463028 2414720 2365109 2315014 2264568 2213545 2162128 2111186
53351 2111186 2061607 2013613 1967037 1922086 1879307 1838675 1799199 1759710 1719811 1679833 1640246
53340 1640246 1601468 1564058 1528594 1495270 1463858 1434119 1406110 1380121 1356510 1335595 1317516
53329 1317516 1302082 1288792 1277033 1266238 1255992 1246031 1236042 1225471 1213772 1201022 1188098 1176008
$$ packed form
53407A206522K6894K7185K7852K9075L0481L1934L3561L5295L7010L9003M1663
53396A566475M4579M6608M7212M7268M8181N0304N2612N3822N3602N2710N2157
53385B115530N2211N2143N0988M8677M6188M4389M2952M0778L7375L3315K9408
53374B593954K5848K2440J9102J5831J2338Q226L350k204q415j5241k2253k8716
53362B624260l4153l8653m2551m5875m8308m9611n0095n0446n1023n1417n0942
53351B111186m9579m7994m6576m4951m2779m0632l9476l9489l9899l9978l9587
53340A640246l8778l7410l5464l3324l1412k9739k8009k5989k3611k0915j8079
53329A317516j5434j3290j1759j0795j0246r961r989j0571j1699j2750j2924j2090
$$ plain form
53317 1176008 1165154 1155326 1146115 1137064 1127756 1118338 1109891 1103767 1100403 1099121 1099099 1100067 1101910 1104138
53303 1104138 1106305 1108768 1112577 1118551 1126646 1136190 1146600 1157862 1170579 1185584 1203391 1223889
53291 1223889 1246507 1270616 1295743 1321522 1347543 1373289 1398191 1421774 1443789 1464237 1483229
53280 1483229 1500792 1516701 1530446 1541478 1549618 1555169 1558489 1559516 1557919 1553720 1547526 1539924 1530771
53267 1530771 1519237 1504536 1486578 1465981 1443620 1420178 1396003 1371180 1345585 1318932 1291010
53256 1291010 1262044 1232667 1203406 1174293 1145140 1116080 1087562 1059913 1033245 1007698 983377
53245 983377 959979 936946 914155 892054 870851 850003 828955 808028 787999 768927 750111
53234 750111 731282 713264 697112 682980 670252 658499 647900 638770 631052 624340 618134 611973
$$ packed form
53317A176008j0854r828r211r051r308r418q447o124l364j282k2R68J843K228
53303A104138K167K463L809N974Q095R544J0410J1262J2717J5005J7807K0498
53291A223889K2618K4109K5127K5779K6021K5746K4902K3583K2015K0448J8992
53280A483229J7563J5909J3745J1032Q140N551L320J027j597m199o194p602r153
53267A530771j1534j4701j7958k0597k2361k3442k4175k4823k5595k6653k7922
53256A291010k8966k9377k9261k9113k9153k9060k8518k7649k6668k5547k4321
53245I83377k3398k3033k2791k2101k1203k0848k1048k0927k0029j9072j8816
53234G50111j8829j8018j6152j4132j2728j1753j0599r130p718o712o206o161
$$ plain form
53222 611973 605508 598570 591128 583102 574265 564370 553308 541082 527755 513582 499188 485437 472942
53209 472942 461708 451356 441664 432758 424751 417482 410761 404718 399557 394980 390207 384683 378489 371892
53195 371892 364787 356955 348677 340672 333404 326782 320561 314665 309047 303619 298535 294208 290774 287769
53181 287769 284648 281435 278577 276271 274257 272158 269718 266825 263675 260886 259077 258211 257641 256873 256008
53166 256008 255349 254888 254399 253827 253380 253256 253366 253356 252958 252369 252040 251949 251327 249510 246906 244591 243073 242035
53148 242035 241276 241104 241570 242007 241793 240977 239783 238125 236252 235232 235909 237670 239133 239923 240916 242685
53132 242685 244610 245812 246225 246354 246525 246819 247379 248252 249075 249269 248586 247401 246517 246679 248047 250088 252105
53115 252105 253816 255275 256405 257003 257076 256729 255771 253959 251702 249941 249127 248818 248535 248451 248840 249290 249004
$$ packed form
53222F11973o465o938p442q026q837r895j1062j2226j3327j4173j4394j3751j2495
53209D72942j1234j0352r692q906q007p269o721o043n161m577m773n524o194o597
53195C71892p105p832q278q005p268o622o221n896n618n428n084m327l434l005
53181B87769l121l213k858k306k014k099k440k893l150k789j809q66n70p68q65
53166B56008o59m61m89n72m47j24J10j0l98n89l29r1o22j817k604k315j518j038
53148B42035p59j72M66M37k14q16j194j658j873j020O77J761J463P90R93J769
53132B42685J925J202M13J29J71K94N60Q73Q23J94o83j185q84J62J368K041K017
53115B52105J711J459J130N98P3l47r58j812k257j761q14l09k83q4L89M50k86
$$ plain form
53098 249004 247713 245900 244236 243041 242139 241034 239483 237991 237390 237662 237663 236417 234351 232710 232173 232596
53082 232596 233748 235413 236850 237110 236196 235229 235120 235620 236026 236250 236654 237207 237423 237027 236162 235000 233592
53065 233592 232127 230956 230193 229594 228931 228247 227654 227130 226678 226443 226458 226442 226153 225779 225701 225916 226042 225889 225703
53046 225703 225758 226025 226400 226946 227732 228674 229813 231454 233676 235894 237305 237706 237523 237113 236419 235327 233984
53029 233984 232652 231533 230739 230235 229840 229586 229929 231168 232704 233461 233140 232530 232455 232978 233846 235013 236261
53012 236261 236933 236679 236107 236097 236732 237481 238168 239067 240152 240904 240923 240259 239163 237921 236928 236373 235915 235130
52994 235130 234258 233904 234024 233914 233386 233229 234086 235485 236522 237057 237648 238568 239530 240265 240791 241112 241176 241305
52976 241305 242149 243943 246042 247574 248403 249166 250394 251910 253256 254439 255947 258040 260291 261988 262833
$$ packed form
53098B49004j291j813j664j195r02j105j551j492o01K72Jj246k066j641n37M23
53082B32596J152J665J437K60r14r67j09N00M06K24M04N53K16l96q65j162j408
53065B33592j465j171p63n99o63o84n93n24m52k35J5j6k89l74p8K15J26j53j86
53046B25703N5K67L75N46P86R42J139J641K222K218J411M01j83m10o94j092j343
53029B33984j332j119p94n04l95k54L43J239J536P57l21o10p5N23Q68J167J248
53012B36261O72k54n72j0O35P49O87Q99J085P52J9o64j096j242r93n55m58p85
52994B35130q72l54J20j10n28j57Q57J399J037N35N91R20R62P35N26L21O4J29
52976B41305Q44J794K099J532Q29P63J228J516J346J183J508K093K251J697Q45
$$ plain form
52961 262833 263069 263020 262711 261965 260775 259494 258607 258241 257909 256913 255098 253065 251496 250429 249378 248033
52945 248033 246639 245750 245761 246579 247565 247945 247498 246737 246236 245943 245390 244305 242697 240581 238204 236348 235706
52928 235706 235858 235483 233882 231803 230466 230198 230400 230489 230453 230662 231490 232993 234724 235954 236305 236075 235905
52911 235905 236289 237375 238872 240089 240472 240255 240129 240105 239336 237411 235161 233596 232624 231640 230930 231445 233219
52894 233219 235026 235845 235906 236052 236844 238571 241371 244705 247207 247822 246914 245826 245472 245748 246063 245918 245015
52877 245015 243361 241488 240272 240264 241227 242420 243330 244084 245156 246712 248346 249629 250753 252279 254256 255966
52861 255966 256775 256820 256561 255967 254646 252621 250440 248473 246532 244337 241993 239727 237412 234687 231537
52846 231537 228526 226353 225237 224789 224484 224160 223970 223894 223594 222864 221992 221421 221186 220994 220749 220649 220794 221103
$$ packed form
52961B62833K36m9l09p46j190j281q87l66l32r96j815k033j569j067j051j345
52945B48033j394q89J1Q18R86L80m47p61n01k93n53j085j608k116k377j856o42
52928B35706J52l75j601k079j337k68K02Q9l6K09Q28J503J731J230L51k30j70
52911B35905L84J086J497J217L83k17j26k4p69j925k250j565r72r84p10N15J774
52894B33219J807Q19O1J46P92J727K800L334K502O15r08j088l54K76L15j45r03
52877B45015j654j873j216qR63J193R10P54J072J556J634J283J124J526J977J710
52861B55966Q09M5k59n94j321k025k181j967j941k195k344k266k315k725l150
52846B31537l011k173j116m48l05l24j90p6l00p30q72n71k35j92k45j00J45L09
$$ plain form
52828 221103 221665 222731 224139 225197 225471 225393 225642 226175 226342 225917 225439 225460 225925 226510 227173 228029 229034 230168
52810 230168 231782 234282 237475 240556 242788 243891 243805 242482 240136 237382 234821 232622 230728 229227 228162
52795 228162 227113 225398 222850 220105 218031 217021 216863 217028 216922 216143 214797 213564 213239 214155 215993 218056
52779 218056 219688 220667 221312 222092 223024 223703 223967 224233 224869 225615 226011 226188 226602 227052 226651 224979 222772 221086
52761 221086 220204 219723 219414 219447 219879 220447 220964 221566 222394 223222 223587 223268 222584 222212 222645 223792 225108 226149
52743 226149 226891 227567 228370 229411 230755 232285 233741 235044 236431 238085 239822 241412 243021 245007 247374
52728 247374 249742 251761 253170 253512 252312 249746 246779 244365 242668 241240 239827 238772 238652 239568 240777
52713 240777 241127 240045 238100 236410 235562 235279 235015 234453 233525 232442 231833 232335 233784 235233 236040 236577 237524
$$ packed form
52828B21103N62J066J408J058K74p8K49N33J67m25m78K1M65N85O63Q56J005J134
52810B30168J614K500L193L081K232J103q6j323k346k754k561k199j894j501j065
52795B28162j049j715k548k745k074j010j58J65j06p79j346j233l25R16J838K063
52779B18056J632R79O45P80R32O79K64K66O36P46L96J77M14M50m01j672k207j686
52761B21086q82m81l09L3M32N68N17O02Q28Q28L65l19o84l72M33J147J316J041
52743B26149P42O76Q03J041J344J530J456J303J387J654J737J590J609J986K367
52728B47374K368K019J409L42j200k566k967k414j697j428j413j055j20R16J209
52713B40777L50j082j945j690q48k83k64n62r28j083o09N02J449J449Q07N37R47
$$ plain form
52696 237524 238840 239894 240318 240257 239946 239555 239380 239663 240181 240369 239933 239056 238054 237170 236655 236646 236861 236823 236444
52677 236444 236129 236160 236310 236160 235528 234505 233407 232796 233174 234427 235868 237078 238390 240247 242332 243748
52661 243748 243939 243136 242005 241220 241343 242709 245250 248611 252483 256640 260644 263717 265078 264410 262035
52646 262035 258798 255733 253562 252301 251419 250433 249292 248165 247070 245878 244601 243482 242815 242829 243714 245589
52630 245589 248335 251577 254935 258224 261306 263858 265504 266206 266304 266010 265028 262882 259626 256024 252987
52615 252987 250967 249891 249424 249123 248587 247788 247254 247602 248735 249741 249777 248929 248026 247704 247894 248149 248199 248092
52597 248092 248030 248201 248639 249107 249269 249114 249042 249397 250028 250508 250668 250663 250657 250735 251088 251907 253023 253925 254254 254097 253799
52576 253799 253784 254547 256362 258791 260863 262010 262530 262856 262804 261959 260478 258900 257334 255528 253706 252648
$$ packed form
52696B37524J316J054M24o1l11l91j75K83N18J88m36q77j002q84n15rK15l8l79
52677B36444l15L1J50j50o32j023j098o11L78J253J441J210J312J857K085J416
52661B43748J91q03j131p85J23J366K541L361L872M157M004L073J361o68k375
52646B62035l237l065k171j261q82r86j141j127j095j192j277j119o67J4Q85J875
52630B45589K746L242L358L289L082K552J646P02R8k94r82k146l256l602l037
52615B52987k020j076m67l01n36p99n34L48J133J006L6q48r03l22J90K55N0j07
52597B48092o2J71M38M68J62j55p2L55O31M80J60noP8L53Q19J116R02L29j57k98
52576B53799j5P63J815K429K072J147N20L26n2q45j481j578j566j806j822j058
$$ plain form
52560 252648 252696 253217 253347 252879 252088 251105 249933 248889 248475 248778 249268 249281 248577 247471 246579 246375 246754 247047
52542 247047 246703 246002 245886 246966 248854 250589 251530 251688 251330 250691 250146 250290 251482 253359 255135 256354
52526 256354 257059 257272 256765 255576 254344 253765 253889 254290 254709 255147 255547 255875 256415 257420 258440 258615 257858
52509 257858 257286 258141 260605 263889 267063 269484 270745 270741 269740 268087 265946 263503 261216 259503 258325
52494 258325 257402 256699 256332 256098 255534 254511 253454 252859 252789 252918 252849 252387 251707 251295 251551 252371 253284 254006 254681
52475 254681 255560 256677 257927 259279 260729 262119 263108 263387 263032 262658 263012 264270 265893 267417 269138 271583
52459 271583 274449 276676 277676 277964 278276 278551 278177 276842 274654 271731 268274 264928 262416 260729 259166
52444 259166 257333 255599 254360 253384 252259 251053 250072 249289 248578 248330 249167 250991 252881 254068 254543 254615
$$ packed form
52560B52648M8N21J30m68p91r83j172j044m14L03M90J3p04j106q92k04L79K93
52542B47047l44p01j16J080J888J735R41J58l58o39n45J44J192J877J776J219
52526B56354P05K13n07j189j232n79J24M01M19M38M00L28N40J005J020J75p57
52509B57858n72Q55K464L284L174K421J261mj001j653k141k443k287j713j178
52494B58325r23p03l67k34n64j023j057n95p0J29o9m62o80m12K56Q20R13P22O75
52475B54681Q79J117J250J352J450J390R89K79l55l74L54J258J623J524J721K445
52459B71583K866K227J000K88L12K75l74j335k188k923l457l346k512j687j563
52444B59166j833j734j239r76j125j206r81p83p11k48Q37J824J890J187M75P2
$$ plain form
52428 254615 254428 254269 254754 256147 257778 258680 258680 258374 258176 257957 257666 257711 258532 260171 262431 265137 268053 270859
52410 270859 273464 276159 279373 283519 289149 296839 306611 317567 328274 337316 343482 345920 344513 339976
52396 339976 333375 325697 317934 311082 305609 301142 297106 293481 290616 288554 287000 285790 284928 284255 283596
52381 283596 283165 283320 283927 284518 285142 286479 288834 291515 293547 294745 295798 297516 300245 303809 307714
52366 307714 311447 314753 317649 320158 322236 323900 325209 326056 326322 326305 326639 327543 328426 328563 327993 327548 328093
52349 328093 329932 332686 335520 337616 338788 339614 340787 342380 343983 345441 347177 349710 353116 357111
52335 357111 361541 366619 372624 379466 386692 393995 401619 410123 419838 430734 442719 455704 469338
52322 469338 483095 496867 511162 526439 542470 558688 574947 591508 608362 625040 641204
$$ packed form
52428B54615j87j59M85J393J631R02%l06j98k19k91M5Q21J639K260K706K916K806
52410B70859K605K695L214M146N630P690R772J0956J0707R042O166K438j407m537
52396C39976o601p678p763o852n473m467m036l625k865k062j554j210q62o73o59
52381B83596m31J55O07N91O24J337K355K681K032J198J053J718K729L564L905
52366C07714L733L306K896K509K078J664J309Q47K66j7L34R04Q83J37n70m45N45
52349C28093J839K754K834K096J172Q26J173J593J603J458J736K533L406L995
52335C57111M430N078O005O842P226P303P624Q504R715J0896J1985J2985J3634
52322D69338J3757J3772J4295J5277J6031J6218J6259J6561J6854J6678J6164
$$ plain form
52311 641204 657105 673257 689880 706796 723746 740611 757316 773653 789258 803869 817636
52300 817636 831052 844428 857485 869586 880329 889713 897730 904079 908491 911168 912633 913022 911728
52287 911728 907976 901826 894446 887256 880881 875028 869233 863475 858124 853614 850224 847959 846553 845881
52273 845881 846409 848838 853116 858188 863088 868004 873901 881272 889756 898803 908210 917976 928131 938863
52259 938863 950387 962520 974737 986867 999397 1012755 1026526 1039790 1052144 1063948 1075431
52248 1075431 1085940 1094351 1100121 1103574 1105133 1104600 1101519 1096024 1088936 1081001 1072410 1063145 1053387 1043297
52234 1043297 1032785 1021820 1010788 1000197 990212 980766 971878 963441 954909 945730 936127 926982 918968
52221 918968 912146 906345 901446 897293 893780 891142 889695 889270 889417 890212 892260 895706 899867 904076 908250
$$ packed form
52311F41204J5901J6152J6623J6916J6950J6865J6705J6337J5605J4611J3767
52300H17636J3416J3376J3057J2101J0743R384Q017O349M412K677J465L89j294
52287I11728l752o150p380p190o375n853n795n758n351m510l390k265j406o72
52273H45881N28K429M278N072M900M916N897P371Q484R047R407R766J0155J0732
52259I38863J1524J2133J2217J2130J2530J3358J3771J3264J2354J1804J1483
52248A075431J0509Q411N770L453J559n33l081n495p088p935q591r265r758j0090
52234A043297j0512j0965j1032j0591r985r446q888q437q532r179r603r145q014
52221I18968o822n801m899m153l513k638j447m25J47P95K048L446M161M209M174
$$ plain form
52206 908250 912247 915343 916946 917427 917685 918336 919829 922812 927580 933360 938871 943507 947416 950734 953596
52191 953596 956760 961197 966821 972392 976937 980522 983274 984410 982919 978848 973293 967311 961282 955181
52177 955181 948960 942653 936398 930394 924706 919221 913877 908781 904008 899550 895623 892730 891159 890638
52163 890638 890766 891527 892999 894821 896446 897888 899714 902223 905008 907470 909368 910689 911312 911230 910920 911143
52147 911143 912332 914427 917261 920814 924910 928936 932183 934455 936061 937188 937600 937152 936290 935731 935738 936102
52131 936102 936837 938515 941807 947037 954334 963939 976091 990813 1007995 1027538 1049137 1072088 1095603
52118 1095603 1119300 1143199 1167355 1191703 1216139 1240436 1264047 1286280 1306736 1325419 1342452
52107 1342452 1357904 1371920 1384727 1396409 1406876 1416192 1424712 1432730 1440098 1446389 1451368 1455160 1457927
$$ packed form
52206I08250L997L096J603M81K58O51J493K983M768N780N511M636L909L318K862
52191I53596L164M437N624N571M545L585K752J136j491m071n555n982o029o101
52177I55181o221o307o255o004n688n485n344n096m773m458l927k893j571n21
52163H90638J28P61J472J822J625J442J826K509K785K462J898J321O23q2l10K23
52147I11143J189K095K834L553M096M026L247K272J606J127M12m48q62n59PL64
52131I36102P35J678L292N230P297R605J2152J4722J7182J9543K1599K2951K3515
52118A095603K3697K3899K4156K4348K4436K4297K3611K2233K0456J8683J7033
52107A342452J5452J4016J2807J1682J0467R316Q520Q018P368O291M979L792K767
$$ plain form
52094 1457927 1459429 1458912 1455345 1447956 1436704 1422379 1406152 1388930 1371097 1352877 1334872 1318069
52082 1318069 1303200 1290167 1278292 1267158 1257103 1248839 1242791 1238854 1236604 1235588 1235598 1236869 1239933
52069 1239933 1245076 1252039 1260350 1269829 1280494 1292176 1304578 1317614 1331293 1345218 1358655 1371259
52057 1371259 1383384 1395507 1407582 1419154 1429791 1439170 1446959 1452927 1456970 1458829 1458007 1454298 1448147
52044 1448147 1440134 1430288 1418397 1404920 1391015 1377447 1363854 1349318 1333434 1316727 1300294 1285111
$$ packed form
52094A457927J502n17l567p389j1252j4325j6227j7222j7833j8220j8005j6803
52082A318069j4869j3033j1875j1134j0055q264o048l937k250j016J0J271L064
52069A239933N143O963Q311R479J0665J1682J2402J3036J3679J3925J3437J2604
52057A371259J2125J2123J2075J1572J0637R379P789N968M043J859q22l709o151
52044A448147q013r846j1891j3477j3905j3568j3593j4536j5884j6707j6433j5183
$$ [...]
##END NTUPLES=NMR SPECTRUM
##END=
