
##TITLE=UV1259_M11_1332-1242_30_7409759_IwiPTVSk5W
##JCAMPDX= 6.0         $$ Bruker NMR JCAMP-DX V2.0
##DATA TYPE= NMR SPECTRUM
##DATA CLASS= NTUPLES
##ORIGIN= BRUKER
##OWNER= Administrator
$$ 1.72 TOPSPIN		Version 2.1
$$ 2013-01-25 00:55:48.181 -0500  Administrator@X
$$ Compression mode = diff/dup
##.OBSERVE FREQUENCY= 400.02188249412
##.OBSERVE NUCLEUS= ^1H
##.ACQUISITION MODE= SIMULTANEOUS (DQD)
##.ACQUISITION SCHEME= undefined
##.AVERAGES= 64
##.DIGITISER RES= 22
##SPECTROMETER/DATA SYSTEM= spect
##.PULSE SEQUENCE= noesygpps1d.comp
##.SOLVENT NAME= COFFEE_meoh
##.SHIFT REFERENCE= INTERNAL, COFFEE_meoh, 1, 14.96119
##AUDIT TRAIL= $$ (NUMBER, WHEN, WHO, WHERE, PROCESS, VERSION, WHAT)
$$ ##TITLE= Audit trail, TOPSPIN		Version 2.1
$$ ##JCAMPDX= 5.01
$$ ##ORIGIN= Bruker BioSpin GmbH
$$ ##OWNER= Administrator
$$ $$ E:\/data/COFFEE/nmr/UV1259_M11_1332-1242_30_7409759_IwiPTVSk5W/12/pdata/1/auditp.txt
$$ ##AUDIT TRAIL=  $$ (NUMBER, WHEN, WHO, WHERE, PROCESS, VERSION, WHAT)
(   1,<2013-01-25 00:55:42.415 -0500>,<Administrator>,<X>,<go>,<TOPSPIN 2.1>,
      <created by zg
	started at 2013-01-25 00:44:12.227 -0500,
	POWCHK enabled, PULCHK disabled,
       configuration hash MD5:
       86 BA 57 50 F2 9D 5C 9B 26 00 A9 28 5F 66 2E 89
       data hash MD5: 64K
       D1 2F B4 16 9F BF A7 20 03 3C D5 16 A4 D5 F5 32>)
(   2,<2013-01-25 00:55:45.431 -0500>,<Administrator>,<X>,<proc1d>,<TOPSPIN 2.1>,
      <Start of raw data processing
       efp LB = 0.3 FT_mod = 6 PKNL = 1 PHC0 = 0 PHC1 = 0 SI = 128K 
       data hash MD5: 128K
       66 2A CA D0 12 4B 12 C1 40 6A B7 0C FC B8 47 C2>)
(   3,<2013-01-25 00:55:46.477 -0500>,<Administrator>,<X>,<proc1d>,<TOPSPIN 2.1>,
      <pk PHC0 = -80.06836 PHC1 = 0 
       data hash MD5: 128K
       85 9E FF 07 F0 C3 06 F7 53 2F E0 F9 99 D7 81 AE>)
(   4,<2013-01-25 00:55:47.134 -0500>,<Administrator>,<X>,<proc1d>,<TOPSPIN 2.1>,
      <abs ABSG = 1 
       data hash MD5: 128K
       BF C4 FC F3 64 6C BD CA 72 EC 72 D1 FD 6C 3E 1A>)
(   5,<2013-01-25 00:55:47.321 -0500>,<Administrator>,<X>,<proc1d>,<TOPSPIN 2.1>,
      <abs ABSG = 2 
       data hash MD5: 128K
       C3 80 30 2F 34 02 FC 30 6C 72 B9 40 F0 93 21 83>)
(   6,<2013-01-25 00:55:47.493 -0500>,<Administrator>,<X>,<proc1d>,<TOPSPIN 2.1>,
      <abs ABSG = 3 
       data hash MD5: 128K
       2A A5 EB A2 E9 95 CA DA 86 42 FF 62 AA 28 3B FC>)
(   7,<2013-01-25 00:55:47.665 -0500>,<Administrator>,<X>,<proc1d>,<TOPSPIN 2.1>,
      <abs ABSG = 4 
       data hash MD5: 128K
       96 B7 32 75 77 83 E5 4B E9 3E 47 1B 51 D5 42 02>)
(   8,<2013-01-25 00:55:47.837 -0500>,<Administrator>,<X>,<proc1d>,<TOPSPIN 2.1>,
      <abs ABSG = 5 
       data hash MD5: 128K
       6A 3B AA 5A A1 0B B4 DE 11 AE A9 5C 3D 24 DD 32>)
$$ ##END=
$$ 
$$ $$ hash MD5
$$ $$ 2C 3F 08 31 7F F0 05 3C ED 95 53 62 18 83 F5 92
##$RELAX= 
##$RELAX= 
##$RELAX= 
##$RELAX= 
##$RELAX= 
##$RELAX= 
##$RELAX= 
##$RELAX= 
$$ Bruker specific parameters
$$ --------------------------
##$DU= <E:\>
##$EXPNO= 12
$$ [...]
##$TP07= 0
##$TPNAME0= <>
##$TPNAME1= <>
##$TPNAME2= <>
##$TPNAME3= <>
##$TPNAME4= <>
##$TPNAME5= <>
##$TPNAME6= <>
##$TPNAME7= <>
##$TPOAL= (0..7)
0.5 0.5 0.5 0.5 0.5 0.5 0.5 0.5
##$TPOFFS= (0..7)
0 0 0 0 0 0 0 0
##$TUNHIN= 0
##$TUNHOUT= 0
##$TUNXOUT= 0
##$USERA1= <user>
##$USERA2= <user>
##$USERA3= <user>
##$USERA4= <user>
##$USERA5= <user>
##$V9= 5
##$VALIST= <valist>
##$VCLIST= <CCCCCCCCCCCCCCC>
##$VD= 0
##$VDLIST= <DDDDDDDDDDDDDDD>
##$VPLIST= <PPPPPPPPPPPPPPP>
##$VTLIST= <TTTTTTTTTTTTTTT>
##$WBST= 1024
##$WBSW= 4
##$XGAIN= (0..3)
0 0 0 0
##$XL= 0
##$YL= 0
##$YMAX_a= 6085751
##$YMIN_a= -13294566
##$ZGOPTNS= <>
##$ZL1= 120
##$ZL2= 120
##$ZL3= 120
##$ZL4= 120
##$ABSF1= 14.96119
##$ABSF2= -5.596992
##$ABSG= 5
##$ABSL= 3
##$ALPHA= 0
##$AQORDER= 0
##$ASSFAC= 0
##$ASSFACI= 0
##$ASSFACX= 0
##$ASSWID= 0
##$AUNMP= <proc_prof1d_extract.lims>
##$AXLEFT= 0
##$AXNAME= <>
##$AXNUC= <1H>
##$AXRIGHT= 0
##$AXTYPE= 0
##$AXUNIT= <>
##$AZFE= 0.1
##$AZFW= 0.1
##$BCFW= 0
##$BC_mod= 0
##$BYTORDP= 0
##$COROFFS= 0
##$CY= 15
##$DATMOD= 1
##$DC= 0
##$DFILT= <>
##$DTYPP= 0
##$F1P= 0
##$F2P= 0
##$FCOR= 0.5
##$FTSIZE= 131072
##$FT_mod= 6
##$GAMMA= 0
##$GB= 0
##$INTBC= 1
##$INTSCL= 1
##$ISEN= 128
##$LB= 0.3
##$LEV0= 0
##$LPBIN= 0
##$MAXI= 10000
##$MC2= 0
##$MEAN= 0
##$ME_mod= 0
##$MI= 0
##$NCOEF= 0
##$NC_proc= -2
##$NLEV= 6
##$NOISF1= 0
##$NOISF2= 0
##$NSP= 0
##$NTH_PI= 0
##$NZP= 0
##$OFFSET= 14.96119
##$PC= 1
##$PHC0= -80.06836
##$PHC1= 0
##$PH_mod= 1
##$PKNL= yes
##$PPARMOD= 0
##$PPDIAG= 0
##$PPIPTYP= 0
##$PPMPNUM= 2147483647
##$PPRESOL= 1
##$PSCAL= 4
##$PSIGN= 0
##$PYNMP= <proc.py>
##$REVERSE= no
##$SF= 400.020009559777
##$SI= 131072
##$SIGF1= 0
##$SIGF2= 0
##$SINO= 400
##$SIOLD= 131072
##$SPECTYP= <>
##$SREGLST= <1H.CDCl3>
##$SSB= 0
##$STSI= 131072
##$STSR= 0
##$SW_p= 8223.68421052631
##$SYMM= 0
##$S_DEV= 0
##$TDeff= 65536
##$TDoff= 0
##$TI= <>
##$TILT= no
##$TM1= 0
##$TM2= 0
##$TOPLEV= 0
##$USERP1= <user>
##$USERP2= <user>
##$USERP3= <user>
##$USERP4= <user>
##$USERP5= <user>
##$WDW= 1
##$XDIM= 131072
##$YMAX_p= 444505029
##$YMIN_p= -10962
##$CURPLOT= <Network HP LaserJet P1505>
##$CURPRIN= <$Network HP LaserJet P1505>
##$DFORMAT= <normdp>
##$LAYOUT= <+/1D_H.xwp>
##$LFORMAT= <normlp>
##$PFORMAT= <normpl>
##$SURQMSG= 1
$$ End of Bruker specific parameters
$$ ---------------------------------
##NTUPLES= NMR SPECTRUM
##VAR_NAME=  FREQUENCY,     SPECTRUM/REAL,   SPECTRUM/IMAG
##SYMBOL=    X,             R,               I
##VAR_TYPE=  INDEPENDENT,   DEPENDENT,       DEPENDENT
##VAR_FORM=  AFFN,          ASDF,            ASDF
##VAR_DIM=   131072,        131072,          131072
##UNITS=     HZ,            ARBITRARY UNITS, ARBITRARY UNITS
##FACTOR=    0.0627417313425164, 1,          1
##FIRST=     8223.62146879497, 3839,         -61899
##LAST=      0,             5326,            -61713
##MIN=       0,             -10962,          0
##MAX=       8223.62146879497, 444505029,    0
$$ Real data points
##PAGE= N=1
##DATA TABLE= (X++(R..R)), XYDATA
$$ [...]
65191 140859 142039 143390 144962 146329 146936 146679 145873 144931 144363 144672 145834 147159 148035 148525 148948 149315 149602
65174 149602 150074 150800 151256 151072 150790 151167 152040 152701 153156 154042 155388 156490 157140 158007 159527 161302 162959
65157 162959 164728 166642 168015 168433 168672 169873 172282 175555 179833 185465 191875 197795 202896 208336 215274
65142 215274 223555 232401 241779 252230 263529 274398 283854 292274 300676 309328 317580 324972 331808
65129 331808 338370 344016 347583 348618 347832 346359 344916 343726 342748 341532 339056 334255 326962 318136 308996
65114 308996 300011 290837 281045 270698 260332 250604 241937 234170 226522 218291 209813 202396 196944 192851
65100 192851 188654 183621 178241 173269 168922 165147 162109 160039 158899 158479 158594 159010 159464 159957 160729 161712
65084 161712 162322 162106 161305 160487 159859 159295 158751 158285 157865 157600 157951 159240 161059 162641 163826 165138 166855
65067 166855 168485 169388 169551 169509 169690 170067 170338 170326 170242 170579 171653 173235 174709 175518 175410 174467 173147 172183
65049 172183 172051 172445 172517 171725 170315 168957 168052 167440 166664 165488 164172 163141 162335 161095 158891 156027
65033 156027 153368 151441 150068 148755 147215 145512 143978 142967 142502 142164 141495 140455 139356 138509 138205
65018 138205 138816 140457 142547 144123 144729 144726 144712 144955 145502 146539 148368 151112 154467 157746 160245 161773
65002 161773 162810 164000 165596 167573 169993 172811 175456 177156 177777 177905 177971 177792 177224 176801 177277 178830
64986 178830 181132 184000 187511 191496 195354 198492 200725 202161 202982 203440 203753 203717 202605 199899 196140
64971 196140 192610 189999 187723 184894 181657 179020 177478 176438 175071 173199 171108 169059 167332 166246
64957 166246 165603 164493 162255 159470 157407 156541 156148 155388 154309 153653 154030 155430 157280 158852 159733 159906
64941 159906 159416 158215 156564 155198 154705 154936 155445 156248 157602 159217 160371 160798 160868 160806 160402 159665 159142
64924 159142 159219 159544 159493 158957 158373 158164 158365 158610 158371 157469 156428 156077 156730 158041 159636 161457 163353 164900
64906 164900 166011 167330 169585 172721 176039 179073 182033 185431 189560 194421 199903 205857 211996 217852
64892 217852 223074 227838 232771 238257 243982 249341 254082 258254 261739 264264 265741 266145 265169 262490 258353
64877 258353 253382 247850 241691 235259 229382 224465 220151 216145 212815 210603 209353 208569 207971 207432 206764
64862 206764 205930 205154 204452 203432 201843 199938 197877 195176 191318 186697 182408 179186 176973 175392 174172
64847 174172 173036 171611 169624 167108 164452 162355 161529 162180 163788 165513 166773 167377 167385 167090 166933 167127
64831 167127 167365 167112 166176 164957 164203 164514 165917 167869 169859 172013 174820 178260 181610 184247 186264
64816 186264 188099 189969 191988 194483 197816 202112 207437 213949 221469 229106 235664 240414 243267 244452
64802 244452 244332 243350 241779 239514 236294 232049 226969 221470 216233 211955 208794 206275 203945 201801 199873
64787 199873 197856 195631 193786 193042 193336 193942 194397 194831 195453 196194 196962 197863 199076 200757 203034 205839
64771 205839 208800 211594 214433 217949 222582 228226 234331 240192 245294 249740 254213 259208 264343 268792
64757 268792 272423 276126 280844 286475 291958 296430 300157 304111 308557 312324 313841 312759 309999 306236
64743 306236 301133 294418 286902 279675 272760 265430 257696 250640 245216 241367 238449 235973 233740 231783
64729 231783 230449 230201 231103 232692 234397 235871 236904 237356 237369 237410 237986 239481 242245 246499 251926 257637
64713 257637 262743 266965 270556 273674 275944 276655 275392 272369 268098 262849 256641 249697 242479 235235
64699 235235 227937 220886 214906 210524 207266 204169 200814 197533 194877 193306 193150 194333 196122 197625
64685 197625 198578 199394 200557 202247 204485 207289 210715 214965 220314 226681 233446 239975 246137 252079 257794
64670 257794 263251 268523 273320 276709 277896 277064 274855 271268 265812 258631 250781 243342 236882 231769
64656 231769 228280 226292 225406 225499 226609 228257 229572 230253 230821 231796 233187 234900 236998 239345 241657 244213
64640 244213 247868 253048 259233 265832 272978 281026 289716 298321 306298 313356 319170 323421 326003 326963
64626 326963 326489 325016 322919 319878 315055 308293 300650 293350 286606 280048 273814 268461 263901 259255
64612 259255 253990 248678 244366 241478 239670 238561 238183 238579 239280 239648 239776 240625 242941 246353 249911 253186
64596 253186 256260 258899 260549 261248 261767 262602 263462 264064 264799 266207 268300 270811 273634 276649 279637 282828
64580 282828 287002 292428 298089 302645 305907 308710 311541 313972 315397 315666 314914 313192 310441 306523 301271
64565 301271 294785 287628 280461 273529 266756 260166 253916 248065 242680 238033 234304 231173 228115 225088
64551 225088 222562 220948 220317 220586 221532 222637 223401 223894 224654 225910 227224 228046 228362 228705 229718 231605
64535 231605 233704 234583 233052 229355 225083 221706 219399 217461 215541 213991 213131 212659 212050 211329 211124 211903
64519 211903 213326 214507 214824 214342 213553 212953 212879 213462 214533 215745 216943 218330 220168 222458 225025 227797
64503 227797 230896 234642 239532 245921 253471 261099 267736 273085 277490 281192 283921 285116 284364 281754
64489 281754 277972 273927 270205 267013 264637 263466 263367 263544 263510 263845 265399 267938 270152 270900 269900 267389
64473 267389 263805 259899 256484 253794 251505 249498 248087 247367 246972 246833 247592 249754 252818 255793 258325
64458 258325 260722 263059 264852 265706 265781 265440 264756 263597 262024 260406 259231 258882 259472 260780 262353 263797
64442 263797 265041 266350 268094 270546 273853 278136 283514 290003 297518 306053 315751 326676 338631 351438
64428 351438 365377 381121 399285 420334 444920 473916 507869 546755 590665 640645 698550
64417 698550 765967 843315 929643 1022745 1119240 1214918 1305743 1389144 1464692 1533392 1595830
64406 1595830 1650559 1694142 1722864 1734534 1729060 1707979 1673814 1629291 1576109 1514055 1441706
64395 1441706 1358458 1265995 1167896 1068294 970990 879261 795605 721354 656637 600786 552788
64384 552788 511597 476441 446914 422593 402585 385727 371244 358965 348778 340161 332491 325621
64372 325621 319776 314869 310224 305146 299599 294015 288448 282266 275005 267287 260454 255187 250930 246849
64358 246849 242862 239358 236372 233741 231866 231563 233026 235562 238561 242164 246655 251685 256464 260371
64344 260371 263040 264229 264022 262906 261249 258972 255994 252706 249589 246655 243710 240914 238627 236925
64330 236925 235744 235263 235639 236530 237474 238630 240582 243500 246998 250666 254134 256777 258113 258579 259194 260326
64314 260326 261456 262274 263171 264316 264972 264250 261997 258517 253981 248692 243458 239042 235347 231605 227258
64299 227258 222354 217336 212802 209301 206912 205131 203446 201895 200876 200581 200909 201708 202814 204062 205530
64284 205530 207623 210672 214553 218845 223118 227049 230627 234485 239558 246057 253102 259703 265683 271215
64270 271215 275914 279032 280362 280304 279160 276942 273914 270835 268561 267659 268266 269952 271811 273085 273668
64255 273668 273711 272963 270930 267556 263259 258385 253102 247735 242669 237895 233193 228794 225338 223072 221574
64240 221574 220409 219626 219401 219614 220024 220530 221079 221590 222175 223178 224891 227419 230804 234870 238818 241474
64224 241474 242256 241704 240876 240500 240850 241986 243681 245306 246204 246284 246053 246132 246802 247852 248699 248786 248100 247262
64206 247262 246973 247428 248336 249372 250410 251402 252195 252546 252227 251148 249452 247506 245825 245003 245605 247911
64190 247911 251735 256602 262186 268544 275969 284626 294239 303886 312179 317920 320701 320753 318297 313346 306250
64175 306250 298040 289902 282399 275350 268424 261631 255276 249578 244381 239246 233880 228509 223756 220137
64161 220137 217758 216432 215859 215617 215254 214669 214256 214456 215202 216053 216840 217904 219620 221921 224487 227202
64145 227202 230156 233234 236035 238258 239977 241346 242274 242548 242144 241126 239364 236704 233433 230283 227847
64130 227847 226267 225545 225743 226730 228040 229345 230831 232807 235172 237660 240395 243728 247512 251085 254122
64115 254122 257148 260944 265769 271390 277581 284197 290891 297200 302958 308315 313218 317178 319832 321542
64101 321542 323166 325279 327935 331164 335254 340356 346061 351602 356351 359978 362417 363899 364710 364608 362831
64086 362831 359121 354387 349725 345052 339506 333100 326982 321838 316984 311491 305495 299798 294819 290542
64072 290542 286977 283999 281165 278312 275989 274647 273796 272675 271425 270830 271082 271646 272241 273141 274461 275908
64056 275908 277358 279027 280909 282684 284328 286241 288658 291549 295240 300411 307106 314389 321450 328630
64042 328630 336881 346533 357103 368116 379572 391494 403248 413494 420979 425475 427870 429140 429328
64029 429328 427801 424304 419341 413629 407755 402409 398302 395527 393405 391279 389093 386964 384505 380956
64015 380956 375843 369331 362056 354771 347966 341768 336256 331790 328658 326475 324415 322128 319995 318314
64001 318314 316754 314857 312688 310696 309299 308917 309989 312541 315957 319492 322856 326121 329404 332923
63987 332923 337015 341655 346240 350268 354064 358463 364009 370806 378868 388004 397429 406116 413685 420626
63973 420626 427621 435020 443015 451829 461526 472001 483413 496282 510854 526744 543545 561521
63961 561521 581125 602003 623259 644956 668693 696192 727763 762802 801435 844895 894375
63950 894375 950528 1014409 1087997 1173177 1270717 1380919 1504793 1643819 1798690 1968888
63940 1968888 2153330 2350767 2559607 2777947 3003743 3234392 3466008 3693509 3911380
63931 3911380 4114042 4295905 4452021 4579058 4675237 4739289 4769910 4766110 4727385 4653535 4545189
63920 4545189 4404914 4237321 4047844 3841791 3624506 3401427 3177265 2955498 2738987
63911 2738987 2530579 2332690 2146843 1974145 1815881 1673048 1545487 1431942 1330925
63902 1330925 1241333 1162480 1093928 1035190 985328 942846 905996 873161 843154 815607 790951
63891 790951 769463 750274 731858 713535 695843 679322 663778 649029 635499 623522 612796
63880 612796 603168 595298 589799 586299 584206 583972 586672 592518 600678 610552 622457 636900 653819 672685
63866 672685 692963 714308 736649 760222 785379 812350 841156 871384 901918 931302 958725
63855 958725 984319 1008167 1029500 1047338 1061488 1072322 1079907 1083991 1084573 1081784 1075337 1064712 1049798
63842 1049798 1030805 1007783 980931 951235 920034 887908 854695 820552 786250 752300 718642
63831 718642 685502 653826 624350 596782 570476 545569 522828 502475 483716 465630 448220
63820 448220 432348 418658 406763 395616 384602 374004 364394 355893 348234 341283 335192 330152 326154
63807 326154 322846 319455 315171 309892 304422 299682 295903 292766 289981 287415 284932 282525 280338 278289
63793 278289 275972 273279 270714 268632 266585 264012 261190 258822 257024 255490 254408 254243 254622 254415 253133
63778 253133 251490 250296 249494 248670 247865 247452 247581 248099 248706 248928 248285 246774 244925 243228 241776 240580
63762 240580 239819 239472 239061 238141 236954 236308 236766 238116 239637 240887 242130 243799 245560 246327 245531 243994
63746 243994 243068 243141 243588 244002 244741 246144 247886 249453 250839 252476 254696 257438 260348 263112 265796 268713
63730 268713 271786 274345 275954 277146 278764 280806 282615 284071 285852 288515 292056 296416 301563 306871
63716 306871 311317 314641 317551 320317 321978 321539 319368 316670 314023 311121 307673 303917 300376 297660
63702 297660 296287 296190 296486 296291 295686 295522 296325 297851 299730 302064 305235 309405 314290 319261 323598 326840
63686 326840 329006 330406 331239 331481 331078 330131 328824 327351 325969 325061 324920 325356 325722 325617 325546 326519 328848
63669 328848 331716 334163 336114 338092 340303 342609 345078 347851 350454 351920 351704 349983 347030 342921
63655 342921 338022 333139 328866 325177 321850 318866 316136 313291 310073 306689 303626 301337 300162 300148 300870
63640 300870 301754 302673 303816 305067 306126 307308 309451 312815 316798 321049 326054 332101 338438 344229 349802
63625 349802 356156 363655 372012 381283 391911 403841 416426 429385 443231 458561 475498 494046
63613 494046 514496 537131 561829 588338 616788 647497 680192 713618 746161 776692 804522
63602 804522 828513 846826 858077 862555 861800 857084 848957 838227 826473 815101 804398 793927
63590 793927 783336 772261 759883 745213 727768 707663 685392 661936 638721 616813 596245
63579 596245 576585 558039 541481 527530 516134 507082 500433 496244 494254 493996 495110 497470 501177
63566 501177 506439 513294 521390 530079 538711 546928 554878 563171 572367 582418 592906 603916 616314
63553 616314 630988 648186 667880 690389 716287 746013 779943 818498 861452 906982 951492
63542 951492 990360 1019081 1034652 1036895 1028489 1013222 994031 972745 951123 931262 914799 902112
63530 902112 892380 884072 875400 864862 851695 835698 816598 793890 767503 738421 708382 678839
63518 678839 650268 622522 595757 570731 548113 527863 509669 493698 480220 468614 457554
63507 457554 446510 436353 428131 421768 416391 411328 406237 400870 395380 390504 386757 383762 380966 378589
63493 378589 377106 376085 374494 372113 369818 368387 367751 367523 367571 367869 368374 369279 370957 373427 376270 379227
63477 379227 382550 386607 391425 396613 401405 404847 406417 406518 405998 405127 403470 400696 397030 392774 387955
63462 387955 382687 377531 373227 370225 368494 367578 366833 365919 365082 364725 364886 365546 367241 370723 375979 382132
63446 382132 388441 394862 401596 408759 416788 426595 438873 453573 470315 489005 509930 533692 561245
63433 561245 593303 629016 665330 698135 724202 742207 752575 756979 757857 757792 758922 762710 770031
63420 770031 781409 797384 818775 846293 879700 917439 957156 996330 1032407 1062856 1085700
63409 1085700 1100024 1105891 1103963 1095488 1082452 1067244 1051833 1037160 1023216 1009569 995776 981307
63397 981307 965163 945868 922211 894143 862875 830118 797269 765108 733932 703933 675640
63386 675640 649936 627424 607858 590563 575383 562828 553253 546315 541423 538344 537122 537632 539516
63373 539516 542440 546314 551378 558128 566941 577692 589878 603166 617690 633843 652031 672610
63361 672610 695680 720907 747842 776572 807740 841797 878443 916747 955365 992422 1025562
63350 1025562 1052505 1071631 1082215 1084552 1079998 1070491 1057718 1042897 1027286 1012305 998799 986390
63338 986390 973809 959631 942672 922198 898229 871388 842265 811199 778930 747039 717240
63327 717240 690438 666809 646486 629731 616688 607512 602652 602475 606315 611963 616016 614822 605885
63314 605885 589262 567728 545070 523909 505119 488801 474959 463223 452697 442644 433097 424518
63302 424518 417131 410887 405786 401805 398515 395151 391177 386704 382332 378679 376019 374132 372417 370268
63288 370268 367533 364569 361767 359056 356060 352708 349416 346557 344065 341837 340290 340043 341031 342350 343140
63273 343140 343274 343012 342373 341205 339687 338378 337731 337783 338301 339030 339804 340602 341538 342742 344254 346070 348209
63256 348209 350660 353305 356009 358704 361359 363978 366702 369828 373603 378088 383268 389176 395765 402771
63242 402771 409910 417204 425031 433815 443733 454663 466424 479099 493169 509233 527515 547668
63230 547668 568988 590765 612535 634241 656154 678380 700377 721266 740742 759449 778281
63219 778281 797512 816753 835491 853462 870803 888114 906118 924789 942883 958753 971598
63208 971598 981558 988566 991574 989195 980858 967081 948758 926487 900700 872268 842774 814006
63196 814006 787111 762336 739606 719192 701652 687252 675766 666891 660624 657131 656468 658529 663157
63183 663157 670131 679120 689800 701966 715444 729968 745270 761292 778087 795453 812775 829411
63171 829411 845211 860503 875597 890421 904685 918209 930833 942034 950859 956377 958180 956359
63159 956359 950974 941604 927493 908235 884431 857627 829540 801231 772976 744817 717096 690475
63147 690475 665619 642930 622518 604315 588216 574148 562028 551670 542729 534775 527406 520428
63135 520428 513981 508470 504240 501237 498982 496925 494893 493251 492663 493617 496113 499756 504065 508686 513366
63120 513366 517906 522199 526276 530354 534874 540311 546693 553308 559187 563921 567760 570951 573392 575082
63106 575082 576483 578122 580081 582135 584083 585701 586718 587241 587930 589284 590970 592368 593560 595211 597541
63091 597541 600010 602095 603851 605609 607543 609630 611622 612966 613214 612657 612098 611844 611406 610408 609339 609084
63075 609084 610051 612101 615019 618693 623039 628046 633768 640030 646353 652455 658706 665868 674472 684650
63061 684650 696433 709992 725624 743632 764193 787234 812586 840277 870579 903731 939830
63050 939830 978992 1021322 1066519 1113744 1162104 1211159 1260842 1311070 1361560 1411844 1461269
63039 1461269 1509139 1555068 1599244 1642251 1684631 1726566 1767827 1808051 1847114 1885118 1921829
63028 1921829 1956238 1986877 2012339 2031143 2041380 2041198 2029816 2007668 1975511 1933937 1883855 1826870
63016 1826870 1764921 1699941 1634021 1569314 1507376 1449024 1395085 1346716 1304625 1268548 1238139
63005 1238139 1213997 1197154 1187777 1184982 1187726 1195309 1207115 1222513 1241136 1262814 1287108 1313192
62993 1313192 1340257 1367814 1395646 1423685 1451883 1479992 1507522 1534091 1559648 1584159 1607256
62982 1607256 1628399 1647041 1662272 1672512 1676045 1671860 1659731 1639738 1612148 1577580 1536858 1490775
62970 1490775 1440415 1387522 1333977 1280880 1228658 1178044 1130278 1086069 1044900 1005803 968566
62959 968566 933872 902416 874181 848504 824595 801978 780589 760480 741487 723230 705453
62948 705453 688206 671693 656098 641583 628284 616118 604645 593273 581747 570444 560156
62937 560156 551475 544336 538087 532005 525764 519610 514162 509867 506467 503217 499850 497087 495739 495450
62923 495450 494915 493385 491324 489467 487889 486353 484942 483738 482296 480105 477405 475015 473457 472608 472076
62908 472076 471450 470372 468813 467243 466158 465483 464780 463885 462984 462202 461615 461515 462217 463583 465203 467020
62892 467020 469277 471782 473711 474415 474112 473573 473369 473569 473987 474473 475011 475621 476209 476571 476563 476190 475413 474027
62874 474027 471828 468811 465145 461186 457575 454939 453193 451486 449162 446506 444178 442258 440389 438627
62860 438627 437416 436779 436161 435264 434541 434598 435472 436679 437666 438033 437674 437026 436992 438272 440672 443208 445018
62843 445018 446120 447129 448187 448491 447236 444841 442605 441135 439762 437804 435684 434276 433730 433636 433925
62828 433925 434806 436053 437179 438253 439763 441641 443164 443971 444604 445851 448107 451508 456086 461442 466722
62813 466722 471291 475224 478937 482597 486084 489346 492612 496280 500605 505429 510342 515251 520615 526996
62799 526996 534605 543456 553513 564318 574950 584967 595064 606180 618264 630778 644241 660332
62787 660332 680320 704122 731094 761047 794325 831455 872928 918858 968850 1022748 1081404
62776 1081404 1145897 1215955 1290010 1366847 1446191 1527259 1607798 1685212 1757923 1824940 1884644
62765 1884644 1934779 1973247 1998370 2008840 2004172 1985115 1953143 1909701 1856273 1794757 1727163
62754 1727163 1654973 1579183 1500937 1421930 1344279 1270002 1200222 1134735 1072773 1014398 960637
62743 960637 912111 868227 828151 791911 759858 731559 705998 682668 661775 643506 627676
62732 627676 614021 602269 591924 582487 573875 566328 559923 554526 550112 546786 544538 543306 543216 544506
62718 544506 547202 551055 555654 560526 565420 570743 577379 585793 595606 606385 618500 632713 649231
62705 649231 667730 688198 711167 737156 766283 798477 833647 871666 912569 956814 1005050
62694 1005050 1057606 1114329 1174685 1237631 1301562 1364876 1426581 1485927 1541379 1590327 1629961
62683 1629961 1658257 1674256 1677848 1669458 1649690 1619125 1578548 1529298 1473210 1412228 1348215 1283043
62671 1283043 1218468 1155852 1096100 1039804 987221 938237 892571 850079 810701 774284 740710
62660 740710 710124 682734 658406 636706 617298 600019 584669 570984 558807 547956 537939
62649 537939 528118 518282 508780 500003 491938 484343 477185 470813 465757 462367 460493 459550 458998 458720 458800
62634 458800 459062 459089 458606 457581 455963 453709 451153 449028 447849 447421 447127 446539 445577 444254 442685 441381
62618 441381 441164 442461 444800 447358 449958 453135 457028 460725 463202 464744 466790 470317 474939 479817
62604 479817 484949 491102 498862 508301 519438 532420 547182 563404 581152 601305 625042 652844
62592 652844 684183 718105 753930 791329 830026 869707 910013 950104 988099 1021561 1048906
62581 1048906 1070020 1085062 1093132 1092867 1084141 1068374 1047110 1021130 991122 958308 923871 888415
62569 888415 852478 816977 782548 748945 715872 684158 655320 630027 607641 587264 568743
62558 568743 552463 538635 526956 516770 507440 498690 490622 483388 477002 471464 466786 462716 458807
62545 458807 455007 451862 449761 448319 446919 445583 444800 444641 444584 444120 443134 441737 440210 439079 438798 439309
62529 439309 440293 441807 444342 448221 453331 459461 466545 474594 483701 494155 506208 519762 534642
62516 534642 551135 569853 591003 614294 639676 667712 698932 733108 769437 807161 845676
62505 845676 884200 921662 956964 989225 1017715 1041618 1059883 1071449 1075836 1073503 1065519 1052914
62493 1052914 1036605 1017938 998925 981561 966952 955220 946180 939905 936686 936762 940272 947310 957775
62480 957775 971150 986631 1003326 1020003 1034617 1044770 1049211 1048714 1044955 1038474 1027978 1011476
62468 1011476 987759 957138 921469 883485 845390 807832 770603 734204 700012 668902 640631
62457 640631 614904 592164 572781 556212 541691 529160 518832 510300 502852 496357 491217 487699
62445 487699 485866 485755 487016 488719 490292 492301 495556 499786 504023 508047 512495 517544 522376 526065
62431 526065 528228 528657 527059 523432 518132 511404 503323 494268 484943 475911 467617 460752 455851 452418
62417 452418 449101 444963 440042 434705 429166 423861 419461 416123 413252 410375 407718 405659 404128 402885
62403 402885 401911 401163 400456 399956 400343 402072 404767 407736 410714 413760 416783 419628 422356 425045 427549
62388 427549 429864 432565 436450 441756 447996 454509 461007 467690 475015 483244 492080 500811 508950 516648
62374 516648 524500 533108 542788 553431 564581 575908 587632 600230 613810 628255 644017 662217
62362 662217 683682 708360 736031 767190 802866 843810 890186 941732 997745 1057012 1118057
62351 1118057 1179345 1238965 1294334 1342660 1381813 1410724 1429284 1438256 1439151 1433605 1422588 1406273
62339 1406273 1384618 1357827 1326300 1290506 1251252 1209943 1168318 1127789 1089074 1052376 1017788
62328 1017788 985471 955588 928211 903211 880109 858133 836647 815442 794421 773161 751271
62317 751271 729188 708055 688513 670064 651989 634480 618402 604234 591690 580249 569541
62306 569541 559378 549789 541032 533333 526767 521572 518172 516501 515651 514701 513602 512822 512518 512629 513315
62291 513315 514586 515899 517014 518874 522557 527551 532198 535864 539404 543304 546723 548980 550852 553592
62277 553592 557391 561618 565918 570347 574911 579671 584986 591167 598251 606559 616935 629869 644902
62264 644902 661518 680280 702426 728611 758749 792884 831633 875730 925558 981024 1041524
62253 1041524 1106109 1173923 1244207 1315523 1385190 1449842 1506447 1552705 1587094 1609221 1620062
62242 1620062 1621292 1614185 1599204 1576304 1545301 1506117 1459164 1405539 1346815 1284831 1221707 1159581
62230 1159581 1099929 1043309 989963 940358 894937 853825 817137 785177 757873 734355 713587
62219 713587 695138 678938 664630 651759 640300 630320 621267 612276 603208 594815 587736 581821 576600
62206 576600 571983 568224 565454 563470 561983 560949 560678 561558 563641 566607 570208 574575 579933 586147 592732
62191 592732 599251 605663 612393 620048 628871 638530 648663 659506 671487 684238 696656 708096 718865
62178 718865 729230 738640 746462 752990 759115 765380 772006 779566 789022 801181 816585 835809 859417
62165 859417 887695 920765 958710 1001131 1046712 1093613 1140034 1183970 1222754 1253660 1275253
62154 1275253 1287904 1293090 1292400 1286911 1276910 1262139 1242585 1218909 1191836 1161458 1127711 1091358
62142 1091358 1053950 1016835 980795 946618 915398 887967 864412 844393 827686 814285 804147
62131 804147 796909 791714 787360 782853 777909 772870 768253 764503 761972 760853 761247 763442 767910 774792
62117 774792 783640 793961 805726 818995 833246 847484 860792 872290 880747 884932 884560 880659 874976
62104 874976 869220 864600 861477 859261 856824 853017 846833 837588 825577 812331 799701 788696 779658
62091 779658 773211 770120 770120 771751 773854 776647 780860 786252 791716 796735 802136 809142 818100 828399 839508
62076 839508 851654 865457 881246 899021 918759 940230 962572 984673 1006209 1027897 1050497
62065 1050497 1074053 1098461 1124291 1152426 1182958 1214826 1246377 1275881 1301616 1321930 1335549
62054 1335549 1341907 1341406 1335380 1325472 1312704 1297183 1278619 1256775 1231400 1202342 1169970 1135064
62042 1135064 1098139 1059479 1020061 981575 944954 909617 874903 841634 811389 784746 761170
62031 761170 740212 721711 705050 689407 674897 662494 652574 644335 636840 629848 623351 616938 610045
62018 610045 602424 594160 585506 576843 568422 560108 551732 543592 536214 529670 523623 517982 513061 509203
62004 509203 506687 505839 506688 508664 511218 514542 519003 524034 528397 531465 533430 534397 534197 533174 532115
61989 532115 531051 529042 525477 520856 515908 510668 504912 498800 492626 486495 480649 475601 471498 467814
61975 467814 464075 460461 457396 455058 453628 453463 454477 455711 456012 455003 453184 451403 450337 450054 449838
61960 449838 448888 447346 446159 445745 445423 444455 443029 441879 441590 442723 445914 451128 457323 463548 470113
61945 470113 478072 487906 499340 512231 526814 543128 560830 579669 599654 620654 642183 663723
61933 663723 685009 705984 726638 746861 766300 784380 800610 814790 826812 836394 843156 846830
61921 846830 847339 844774 839404 831614 821913 811151 800590 791380 784025 778733 776187 777382 782619 791307
61907 791307 802980 817822 835777 855694 875823 894780 911535 924903 933741 937646 937040 932647
61895 932647 925095 914831 902074 887027 870362 853269 836709 820758 804942 789009 773145 757711
61883 757711 743118 729705 717314 705168 692551 679555 666873 654972 643821 633363 623846 615532
61871 615532 608284 601645 595295 589372 584326 580524 578169 577591 579268 583292 589126 596292 605031 615731
61857 615731 628050 641403 656275 674070 695412 719460 745306 773190 803725 836637 871062
61846 871062 906569 943020 979621 1014935 1047840 1077860 1104507 1126724 1143123 1152607 1154863 1150538
61834 1150538 1140903 1127275 1110890 1093316 1076511 1062169 1051310 1044654 1042897 1046212 1053905 1065018
61822 1065018 1078928 1094952 1111651 1126992 1138975 1145807 1145993 1138957 1125373 1106330 1082340 1053645
61810 1053645 1021225 986764 951669 916670 882339 849390 818369 789516 763069 739347 718423
61799 718423 700012 683741 669276 656235 644257 633219 623155 613986 605533 597711 590569 584237
61787 584237 578970 575027 572227 569863 567318 564588 561948 559401 556819 554349 552187 550129 547814 545311
61773 545311 542982 540825 538441 535734 533215 531498 530758 530731 531004 531284 531576 532186 533437 535463 538255 541606
61757 541606 544868 547199 548399 549160 550105 550981 551280 551261 551560 551979 551517 549705 547221 544977 543216 541726
61741 541726 540321 538713 536391 533138 529465 526160 523541 521451 519835 518939 518905 519537 520619 522275 524745
61726 524745 527799 530677 532774 534239 535641 537230 538869 540623 542849 545574 548350 551005 554070 557948
61712 557948 561994 564956 566224 566190 565457 564062 561524 557418 551927 545927 540333 535232 529993 524417 519307
61697 519307 515441 512437 509233 505460 501687 498452 495632 492718 489267 485184 481048 477931 476242 474925
61683 474925 472572 469212 466111 463767 461203 457593 453574 450178 447311 444219 441023 438746 437896 437878 437889
61668 437889 437708 437391 436820 435905 434872 433994 433310 432816 432634 432719 432678 432331 432237 433123 434835 436408 437370 438409
61650 438409 440392 443137 445684 447595 449506 452337 456346 460975 465376 469137 472657 476604 480757 483696
61636 483696 484166 482517 480166 477858 475244 472075 468752 465360 461153 455683 449788 444789 441068 438033
61622 438033 435105 432204 429571 427601 426618 426395 426163 425484 424759 424474 424352 423745 422474 420708 418305 414926
61606 414926 410573 405525 399930 394012 388376 383503 379145 374798 370514 366645 363038 359296 355649 352732
61592 352732 350457 348011 345155 342775 341731 341709 341607 340685 339036 337223 335732 334627 333530 332052 330282
61577 330282 328777 328085 328380 329374 330389 330706 330146 329245 328627 328492 328894 330091 332016 333733 334134 333186 331990
61560 331990 331585 332222 333722 335891 338338 340319 341150 340717 339570 338619 338520 339144 339830 340349 341267 343025 345081
61543 345081 346543 347361 348190 349332 350529 351743 353374 355558 357881 359927 361730 363602 365906 368902 372314
61528 372314 375118 376296 375847 374609 373203 371688 370135 368763 367448 365736 363603 361699 360672 360609 361144
61513 361144 361701 361684 360918 359927 359295 358890 358265 357652 357755 358527 358951 358235 356571 354604 352785 351436 350760 350551
61495 350551 350420 350446 351007 351905 352392 352243 352092 352481 353308 354458 356180 358423 360518 361987 363045 363925 364433
61478 364433 364658 365353 366847 368215 368390 367736 367635 368672 370039 370709 370507 369882 369235 368726 368327 367745 366501
61461 366501 364441 362176 360799 360932 362083 363159 363609 363850 364525 365763 367377 369328 371508 373452 374838
61446 374838 376026 377519 379175 380632 382239 384718 388030 391437 394681 398137 401809 405197 408436 412451
61432 412451 417484 422368 425876 428046 429638 430977 432013 432877 433648 434033 433950 434111 435381 437758 440477 442862
61416 442862 444673 445927 446860 447852 448944 449555 449010 447181 444413 441074 437408 433615 429861 426434 423893
61401 423893 422643 422260 421757 420669 419389 418285 417154 415815 414589 413739 412985 412012 410986 410174 409506 408945
61385 408945 408795 409209 409873 410633 411935 414059 416262 417343 416979 416129 416230 418163 421699 425665 428907 431227
61369 431227 433183 435093 436857 438740 441379 444697 447688 449755 451463 453446 455382 456830 458388 461177
61355 461177 465600 471319 477941 485044 492006 498689 505971 514870 525351 536571 547830 558614 568173
61342 568173 575995 582478 588379 593788 598347 602183 605808 609203 611719 612832 612475 610828 608381 605863
61328 605863 603399 599978 594583 587712 580996 575408 570676 566412 562930 560662 559431 558604 557643 556372 555060
61313 555060 554316 554640 556133 558817 562916 568511 575285 583107 592522 604047 617266 631181 645172 658877
61299 658877 671367 681244 687607 690432 690154 687463 683234 677983 671517 663740 655541 648106 641543 635064
61285 635064 628395 622021 616045 609887 603448 597699 593638 591288 590091 589757 590330 591894 594591 598627 604019
61270 604019 610536 617899 625712 633233 639744 645228 650247 655165 660065 665454 672414 681736 693292 706393
61256 706393 720301 734253 747437 759176 768857 775686 779039 779179 777132 773661 768767 762304 754591
61243 754591 746182 737436 728565 719800 711248 702866 694708 687044 680182 674377 669790 666169 662717 658899
61229 658899 655433 653858 654882 657598 660575 663287 666166 669712 673955 678554 683074 687217 690968 694468
61215 694468 697803 701092 704750 709243 714486 719740 724196 727490 729668 731022 732005 732951 733746 734150 734604
61200 734604 736391 740721 747795 756907 767308 778897 792306 808392 827461 848772 870747 891549
61188 891549 909471 923176 932195 937344 940326 942662 944972 947113 948693 949343 948733 946529 942446 936528
61174 936528 929375 921767 913843 904927 894433 882690 870517 858284 845817 832955 819654 805696
61162 805696 790902 775693 760951 747245 734550 722732 711899 702209 693722 686565 680972 677052
61150 677052 674749 673989 674714 676799 680057 684085 687891 689977 689254 685748 680078 672552 663311 653176 643669
61135 643669 636051 630620 626984 624657 623475 623749 625927 629923 635042 640903 648099 657443 668907 681895
61121 681895 696262 712313 729982 748753 768394 789103 810901 833508 856832 880928 905389
61110 905389 929311 951974 973124 992713 1010910 1028232 1044986 1060588 1074089 1085309 1094614 1101565
61098 1101565 1104624 1102509 1095214 1083505 1068138 1049851 1029420 1007315 983764 959407 935355 912286
61086 912286 890031 868342 847545 828075 809842 792458 775801 760113 745848 733665 724160 717293
61074 717293 712298 708388 705301 703035 701437 700305 699707 699974 701486 704478 708879 714232 719970 725788 731706
61059 731706 737930 744800 752627 761354 770685 780815 792592 806537 822173 838919 857145 877482
61047 877482 899438 921707 943795 966446 990465 1016007 1043145 1072189 1103137 1135454 1168627
61036 1168627 1202405 1236442 1270416 1304626 1339833 1376344 1413826 1452134 1491743 1533304 1577377
61025 1577377 1624621 1675499 1729570 1785599 1842546 1900147 1958764 2019380 2083828 2154512 2233911
61014 2233911 2324470 2428271 2546000 2676778 2819910 2976604 3149558 3342261 3560321 3812809
61004 3812809 4110733 4464874 4886922 5392138 5999295 6729601 7608941 8671042 9956701
60995 9956701 11512444 13390640 15632576 18211940 20961721 23561259 25638553 26940764
60987 26940764 27449976 27365438 26991382 26627928 26508948 26754387 27310926 27925888 28222163
60978 28222163 27864702 26714251 24864929 22560489 20072064 17617159 15336453 13302242
60970 13302242 11535993 10028149 8755306 7689212 6799537 6056946 5436940 4919940 4488023
60961 4488023 4123723 3812146 3542304 3305963 3096671 2910030 2743185 2593364 2457765
60952 2457765 2334776 2223978 2124730 2035839 1956498 1886034 1822449 1762488 1703647 1645164 1586916
60941 1586916 1528645 1470698 1414298 1360327 1308602 1258856 1211626 1167567 1126470 1087565 1050407
60930 1050407 1015152 982309 952455 925772 901610 878913 857242 837055 818918 802841 788482
60919 788482 775579 764046 753878 745017 737175 730013 723678 718744 715271 712474 709902 708337 708671 710328
60905 710328 711835 712664 713443 714464 715168 715150 714541 713174 710450 706417 702015 697807 693283 687897 681981 676059
60889 676059 669920 663095 655836 648998 643199 638492 634588 630909 626606 620991 613982 606022 597653 589318
60875 589318 581379 574056 567311 560835 554209 547219 540102 533353 527221 521574 516410 512139 509088 506997
60861 506997 505332 503881 502798 502326 502815 504591 507400 510309 512576 514280 515701 516586 516710 516752 517809 520218
60845 520218 523466 527052 530678 533790 535734 536364 535914 534386 531656 528014 523927 519379 514180 508770 504011
60830 504011 500274 497407 495476 494764 495115 496027 497289 498740 499625 499144 497653 496316 495497 494433 492597 490361
60814 490361 488031 485241 481767 478127 474889 472027 469342 466856 464420 461555 458104 454515 451153 447900
60800 447900 444700 441870 439435 436744 433233 429169 425242 421758 418575 415500 412477 409660 407413 405862
60786 405862 404408 402263 399588 397509 396704 396575 396168 395396 394960 395431 396744 398306 399312 399338 398912 399190 400834
60769 400834 403424 406063 408274 410223 412479 415670 419975 424834 429431 433476 437086 440034 441794 442428
60755 442428 442781 443531 444549 445362 445719 445540 444857 444072 443754 443932 444071 443915 443793 443884 443691 442488 439755 435075
60737 435075 428365 420592 413585 408513 404908 401536 397804 393972 390492 387603 385204 382751 379606 375855
60723 375855 372433 370088 368618 367435 366482 366123 366458 367200 367986 368437 368185 367255 366312 366142 366967 368442 370136
60706 370136 371766 373126 374084 374662 375023 375399 376009 376931 378126 379716 381987 384885 387834 390518 393564 397728
60690 397728 402585 406784 409672 411856 414053 416224 418142 420064 422364 425038 427934 431023 434161 437061
60676 437061 439757 442592 445546 448052 449693 450521 450508 449387 447307 444937 442523 439468 435283 430342 425260
60661 425260 420211 415332 411139 407894 405184 402756 401212 401089 401715 401857 401255 400708 400777 401223 401786 402826
60645 402826 404869 407807 410740 412521 412541 411142 409204 407296 405361 403211 400904 398549 396184 394013 392379
60630 392379 391284 390354 389536 389331 390015 391062 391706 391775 391682 391938 392918 394691 396773 398427 399494 400539 401941
60613 401941 403300 404097 404416 404667 405008 405459 406095 406762 407022 406777 406493 406446 406250 405594 404969 405082 405930 406968
60595 406968 407811 408305 408344 408196 408670 410317 412734 415136 417329 419597 421939 424026 425674 426859 427472 427581
60579 427581 427683 428207 429044 430042 431599 434129 437245 440174 442925 446364 451225 457653 465674 475532 487375
60564 487375 501025 516105 532093 548296 564158 579560 594409 607895 618450 624560 625619 622249
60552 622249 615974 608379 600312 592048 584191 577898 573869 571647 570481 570540 572658 577118 583313 590648 599317
60537 599317 610149 624022 641409 662223 686061 712645 741670 771976 801227 826871 847338
60526 847338 862157 871259 874607 872321 864814 852947 838237 822520 807029 791990 777439 764070
60514 764070 752905 744388 738170 733547 729820 726653 724533 724535 727162 731702 737165 743517 751500 761696
60500 761696 774501 790740 811527 837545 869065 906620 950974 1002281 1059754 1122201 1188297
60489 1188297 1256137 1322953 1385720 1442047 1490448 1529881 1559187 1577084 1582725 1576042 1557212 1526006
60477 1526006 1482287 1427302 1363917 1295318 1223919 1151706 1080913 1013766 951822 895874 846119
60466 846119 802119 763079 728616 698876 673579 651491 631367 612963 596591 582107 568919
60455 568919 556714 545608 535752 527134 519553 512554 505763 499529 494686 491402 488828 486205 483568 480971
60441 480971 477986 474650 472045 470964 470662 469842 468300 466695 465270 463886 462848 462565 462684 462605 462576 463263
60425 463263 464485 465310 465224 464235 462172 459013 455741 453704 453123 453201 453566 454506 455802 456609 456749 457074 458201
60408 458201 459766 461220 462572 464075 465810 467742 469582 470622 470444 469742 469666 470406 471235 471865 472736 473994
60392 473994 475280 476702 478969 482218 485685 488789 491624 494114 495760 496700 498048 500534 503591 506351
60378 506351 508862 511671 514798 517737 520119 521884 523140 524230 525588 527240 528771 529934 530905 531872 532855
60363 532855 534006 535478 536883 537589 537715 538181 539549 541499 543703 546464 550134 554597 559745 565918 573361
60348 573361 581731 590470 599219 607541 614711 620217 624035 626252 626856 626108 624512 622079 618141 612296 605096
60333 605096 597490 590058 583135 577195 572631 569371 566957 564772 562091 558448 554189 550317 547535 545731
60319 545731 544394 543118 541678 540252 539642 540627 542909 545361 547554 550419 555132 562037 570984 582040
60305 582040 595312 610578 627525 646029 665991 687279 709914 733532 756335 775342 788224
60294 788224 794417 794154 787257 773601 754234 731264 706782 682391 659408 638853 621223 606529
60282 606529 594458 584421 575853 568688 563125 558766 554527 549712 544669 540040 535901 532053 528609 525744
60268 525744 523249 520847 518676 517049 516028 515605 515941 516974 518047 518393 517807 516628 515340 514480 514538 515515
60252 515515 516763 517581 517860 518029 518578 519715 521156 522197 522335 521820 521194 520412 519109 517694 517199 517830 518550
60235 518550 518560 518279 518377 518680 518755 518829 519359 520281 521491 523472 526591 530177 533180 535498 537825 540408 542812
60218 542812 544866 547162 550438 554886 560059 565232 570036 574967 580897 587856 594786 600920 606731 612959
60204 612959 619275 624755 629222 633228 636963 640114 642663 644899 646637 647320 647081 646902 647362 647762 646819 643930
60188 643930 639567 634795 630554 627117 624053 620790 617240 613773 610720 608153 605967 603901 601582 598874
60174 598874 596136 593887 592298 591185 590338 589664 589187 589096 589530 590118 590100 589255 588333 588099 588297 588107 587398 586872
60156 586872 587063 587821 588800 589858 590859 591647 592481 594063 596794 600242 603640 606714 609746 612915 615927
60141 615927 618460 620758 623480 626921 630724 634544 638706 643814 649857 656184 662297 668212 673983 679427
60127 679427 684394 688796 692203 694014 694325 694087 694034 693907 693206 692273 692048 692983 694676 696452 697915 698957
60111 698957 699611 699978 700158 700170 699870 698875 696754 693555 689885 686046 681422 675443 668942 663563 659704 656124
60095 656124 651953 648045 645665 644780 644526 644704 645860 648308 651873 656289 661094 665422 668668 671175 673666
60080 673666 676203 678247 679448 679687 678627 675972 672025 667315 661740 654663 645836 635729 625075 614563
60066 614563 604856 596328 588797 581915 575753 570695 566928 564361 562698 561180 558683 554765 550463 547389
60052 547389 546129 545984 546112 546342 546964 548285 550425 553083 555626 557780 560086 563238 567160 571171 574802
60037 574802 577916 580255 581567 582108 582346 582188 581057 578753 575654 572066 567947 563433 559081 555342 552054
60022 552054 548591 544292 538790 532261 525410 518976 513197 507867 502793 497952 493369 489094 485222 481752
60008 481752 478549 475634 473245 471422 469817 468171 466707 465780 465433 465534 466041 466803 467476 467917 468393 469147
59992 469147 470211 471825 474419 477790 480922 483184 485111 487428 489910 491885 493329 494626 495783 496657
59978 496657 497490 498298 498219 496536 494038 492254 491442 490421 488372 485798 483634 482393 482331 483502 485366 487157
59962 487157 488943 491606 495535 500000 504078 507545 510542 512946 514466 515000 514627 513477 511756 509684 507483
59947 507483 505670 505039 505827 507054 507247 505782 503030 499532 495736 492337 489930 488229 486416 484371 482799
59932 482799 482107 481985 482375 483963 487208 491422 495333 498296 500716 503614 507934 513936 521038 528456 535868
59917 535868 543164 549818 555224 559596 563764 568008 571811 574986 578262 582363 587084 591740 596080 600293
59903 600293 604410 608142 611183 613373 614645 614997 614496 613317 611839 610553 609698 609084 608538 608340 608904 610218
59887 610218 611991 614172 616879 619952 623079 626299 629924 634023 638386 642887 647384 651430 654649 657403
59873 657403 660443 663804 666532 667682 667217 665796 663989 661814 658907 655199 651405 648480 646438 644278
59859 644278 641473 638932 637783 637756 637656 637130 637004 637945 639714 641814 644115 646728 649910 654211 660201 668019
59843 668019 677553 688744 700967 712277 720154 723275 722228 718701 714541 711326 710027 710823 713482 717516
59829 717516 721564 723320 721139 715474 707887 699060 688827 677752 667273 658226 650356 643346 637191
59816 637191 631537 625859 620438 616029 612367 608212 603090 597846 593186 588987 585427 583455 583356 583962 584110
59801 584110 584007 584357 584932 584903 584047 582843 581663 580422 578761 576263 572880 569332 566596 564768 562946 560375
59785 560375 557069 553256 549008 544767 541441 539566 538826 538633 538635 538554 538246 538057 538408 539001 539246 539452 540544
59768 540544 542517 544308 545515 547010 549437 552289 555122 558547 563243 568944 575157 581998 589475 596794
59754 596794 603251 609257 615677 622662 629758 636566 642757 648004 652580 657422 662998 668563 673044 676107
59740 676107 677942 678706 678766 678797 679010 678811 677680 675837 673566 670656 667013 663123 659340 655442 651492 648380
59724 648380 646780 646223 645810 645174 644147 642267 639427 636354 633715 631359 629086 627403 626675 626244 625343 624317
59708 624317 624040 624564 625268 625969 627037 628701 630919 633597 636298 638249 639258 640180 641826 643934 645894
59693 645894 647863 650318 653020 655338 657136 658469 658820 657622 655300 652929 650966 649054 646872 644479
59679 644479 641939 639247 636523 633815 630908 627640 624069 620007 614995 609172 603478 598469 593604 588424
59665 588424 583656 580327 578430 577330 576867 577081 577421 577354 577429 578623 580865 583165 585086 587136 589795 593033
59649 593033 596729 600739 604500 607150 608105 607173 604439 600538 596610 593318 590153 586304 581823 577404 573509
59634 573509 570395 568440 567592 566903 565496 563649 562132 560828 558965 556370 553546 550724 547734 544684 541896
59619 541896 539301 536640 534150 532183 530340 527827 524638 521631 519454 518048 517152 516690 516714 517482 519416
59604 519416 522483 525847 528628 530697 532255 533144 533302 533450 534519 536586 538980 541091 542520 542909 542394
59589 542394 541826 541906 542495 543298 544520 546100 547089 546802 545891 545236 544492 542928 541027 539768 538759 536670 533314
59572 533314 529885 527153 524845 522780 521242 520118 518921 517866 517720 518368 518692 518109 517198 516583 516117 515453
59556 515453 514575 513619 512938 513277 515010 517299 518977 520113 521646 523662 525375 526799 528963 532283 536175
59541 536175 540711 547215 556571 568256 581989 599183 621386 647487 673114 692801 702829 702911 695930
59528 695930 685865 675556 666226 658518 653025 649870 648648 648990 650571 652542 653730 653525 651942 648921
59514 648921 644366 638827 633083 626969 619571 610758 601564 592855 584565 576496 568897 561957 555637 550262
59500 550262 546358 543582 540793 537551 534611 532581 531093 529811 529176 529409 529672 529099 528061 527616 528162 529369
59484 529369 531007 533141 535638 538099 540275 542319 544708 547983 552309 557230 562225 567425 573263 579477
59470 579477 585119 589669 593466 596887 599766 601864 603255 603970 603888 603316 603176 604238 606561 609876 614129
59455 614129 619503 626282 634745 644685 654922 663891 670975 676952 683047 689845 696964 703177 706871 706993
59441 706993 703717 697890 690037 680459 670061 660265 652076 645730 641053 637509 634161 630510 627291 625683
59427 625683 625896 627293 629654 633273 638057 643736 650969 660998 674059 689192 705712 723712 742937
59414 742937 762458 782004 802638 825656 851313 878282 903005 919698 923048 912258 891889 868371
59402 868371 846440 828705 816728 811360 812938 821699 836662 853351 864231 863290 850091 828812
59390 828812 804266 779703 757146 737803 721897 709074 699177 692102 687188 683485 680600 678744 678053
59377 678053 678260 678917 679631 680194 680733 681596 682983 684901 687367 690187 692570 693642 693525 693370 694213 696273
59361 696273 699424 703607 708624 714165 720229 727025 734411 742082 750282 759602 770087 781295 793225
59348 793225 806308 820485 835199 850240 865589 880528 894164 906835 919567 931856 941513 947169
59336 947169 949546 949660 947249 941821 933925 924291 912706 898749 882803 865553 847379 829105 812381
59323 812381 798256 785991 774195 762528 751595 741824 733244 725745 718789 711481 703596 695921 689030
59310 689030 682387 675354 668289 661934 656429 651675 647997 645705 644594 644546 646046 649496 654738 661925 672123
59295 672123 686257 703944 723769 743810 761224 772414 774949 769121 757125 741279 723594 706162
59283 706162 690759 678215 668678 662051 657812 655132 653776 654348 657309 662507 669939 679879 691759 704139
59269 704139 716475 729656 743875 757292 768056 776509 783963 790248 794102 795377 795166 793899 790797
59256 790797 785335 778130 770140 761796 753059 743935 734904 727070 721464 717948 715389 713202 711921 711895 712507
59241 712507 713424 715595 720000 726153 732850 739659 746694 753517 759362 764056 767795 770397 771585 771667 771205
59226 771205 770309 768700 766044 761898 756056 749273 742714 736291 728637 719267 709489 700469 691820 683084
59212 683084 675145 668819 663291 657439 651672 646980 643131 639372 636044 633868 632350 630489 628501 627304
59198 627304 626830 626383 626158 626891 628447 630234 632572 636137 640471 644540 648433 652955 657844 661957 665084
59183 665084 668056 671202 674147 677088 680786 685181 689279 692535 695291 697875 700362 703146 706683 710673
59169 710673 714449 718045 722015 726467 731134 735985 740852 744895 747505 749166 750403 750401 747900 742913 736338
59154 736338 728490 719362 709737 700540 691484 681740 671492 661450 651479 641353 632242 625551 620597
59141 620597 615332 609152 603148 597788 592446 587344 583904 582671 582542 582493 582568 582849 582990 583230 584450 586823
59125 586823 589665 592879 597261 603110 609826 617104 625251 634130 643067 652038 661655 671851 681918 692009
59111 692009 703146 715438 727678 738958 749332 758653 766252 772182 777382 782163 785822 788159 789956
59098 789956 791417 791461 789304 785596 781398 777019 772469 768102 764247 760940 758401 757002 756586 756574 756800 757252
59082 757252 756968 754354 748856 741332 732683 723186 713254 703629 694628 686219 678923 673446 669352 665319
59068 665319 660866 656591 652609 648197 643320 639147 636505 634851 633133 630775 627691 624347 621789 620575
59054 620575 619712 617864 615376 613637 612650 611065 608705 607168 607429 608559 609392 609900 610296 610304 610001 610023 610369
59037 610369 610257 609711 609881 611209 612619 613157 613236 613688 614848 617125 621240 627303 634785 643790 655102 668626
59021 668626 683117 697786 712759 727579 740840 751831 760979 768101 771866 771686 768684 764067 758050
59008 758050 751076 744492 739121 734617 731031 729481 730374 732540 735122 738879 744540 751253 757798 764003
58994 764003 769826 774365 777048 778709 780312 781549 781687 780757 778930 775828 771456 766838 762722 758644 754154
58979 754154 749921 746745 744529 743196 743515 746103 750578 756581 764480 774239 784757 795292 806396 818530
58965 818530 830974 843114 855521 868582 881282 892619 903084 913326 922245 927826 929252 927036
58953 927036 921683 913297 902090 888448 872960 856713 840660 824379 806721 788247 771524 758209
58941 758209 747335 737467 728991 722993 719284 716926 715526 714715 713498 711454 709492 708207 706705 704302
58927 704302 701995 700717 699417 696615 692797 689482 686825 683915 680681 677735 674909 671714 668796 667366
58913 667366 667476 668225 669278 670943 673156 675640 678604 682278 686353 690952 697361 706564 717812 729872
58899 729872 742873 757517 773291 789037 804615 820461 836111 850922 865833 882732 902210
58888 902210 923395 945792 969767 995144 1020623 1044703 1066179 1083777 1096337 1103580 1106129 1104944
58876 1104944 1100996 1094863 1086047 1073377 1056797 1037998 1018714 999430 980569 963622 949778 938390
58864 938390 928131 918826 910819 903414 895410 886575 877274 867314 856397 844928 833169 820470 806721
58851 806721 793616 782827 773832 765223 757331 751488 747192 742140 735057 726725 718161 709434 700446 691451
58837 691451 682555 673791 665699 658865 652991 647372 642066 637653 634216 631495 629614 628592 627668 626223
58823 626223 624918 624815 625930 627712 630283 633948 638129 642139 646397 651462 656415 659684 661089 661693 662096
58808 662096 662268 662565 663365 664021 663587 662288 660909 659190 656302 652606 649417 647200 645331 643341 641007
58793 641007 637556 632296 625986 620255 615770 612110 609184 607416 606759 606807 607759 610199 614044 618678 623688
58778 623688 628611 632617 635596 638866 643503 648567 652257 654072 654462 653221 649961 645550 641330 637263
58764 637263 632422 626825 621174 615354 608970 603043 599379 598432 599286 601353 604450 607618 609688 610838 612061
58749 612061 613410 614383 615560 618000 621316 624251 627015 631173 637246 644145 651003 657856 664578 670844
58735 670844 677282 685122 694521 704492 714295 723672 732098 739342 746409 754389 762707 769972 776012 781458
58721 781458 785983 788973 791507 795626 801808 809057 817103 826426 836254 844699 850965 855589 858615 859451
58707 859451 858400 856301 852652 845989 836058 823731 808971 790989 770355 748849 727225 705202
58695 705202 683630 664382 647883 632853 618741 606373 596011 586894 578937 572878 568407 564077
58683 564077 559293 554608 550023 545020 540251 537034 535116 533097 531188 531188 533505 536559 539412 542684 546556
58668 546556 550373 554759 561736 571983 584096 597078 611339 626606 641030 653052 662160 667460
58656 667460 667833 664125 658922 653491 647039 639386 631821 624664 616630 607624 599715 594190 589891 585631
58642 585631 582084 580048 578880 577911 577606 578232 579153 580347 582781 586382 589478 591094 591913 592243 591192 588766
58626 588766 586600 585494 584290 582270 580601 580300 580780 581648 583877 587910 592482 596747 601834 608958 617469
58611 617469 625887 633328 638975 641886 642384 642100 641737 640451 638057 635869 634436 632496 629254 625819 623270
58596 623270 621099 618577 615882 613008 609491 606146 605095 607057 610550 614640 620353 628417 637827 647812
58582 647812 659051 671693 684287 695887 707191 718453 728390 736344 743404 750210 755892 760439 765799
58569 765799 773294 782199 792209 804879 821094 839546 859410 882087 908438 936517 963959 990434
58557 990434 1015788 1037936 1054842 1066817 1074841 1078382 1076830 1071400 1063640 1053618 1041385 1028628
58545 1028628 1017037 1006434 996050 986013 976085 964706 950878 935347 918551 899474 878098
58534 878098 856892 838046 821115 805088 790758 779194 769852 762094 756715 754099 752806 751781 752060
58521 752060 754458 757565 759901 762036 764589 766190 765528 763498 761367 758730 755208 752020 749800 746942
58507 746942 742295 737429 734077 731461 728429 726021 725446 725463 724279 722162 719847 716365 710969 705365 701529
58492 701529 699072 697049 696349 697854 700288 702486 705814 711718 718934 725840 733543 743783 755776 768055
58478 768055 781506 797458 814493 830161 844182 856947 866619 870970 870614 867383 861030 850638 837816
58465 837816 825297 813669 802454 792921 786725 783125 780633 780096 783088 788706 795084 802681 812817
58452 812817 824264 834547 843382 851614 858045 860688 860076 858082 854562 848402 840769 833974 828150 822300
58438 822300 817562 815975 816864 817788 818412 820267 823422 826547 829604 833484 837765 841736 846814 854948 865409
58423 865409 875899 885796 895495 903749 908791 911118 912229 911685 908349 903344 898667 893928 887462 879568
58409 879568 871769 864086 855912 848129 841455 834365 825781 818068 813993 812487 810952 809920 811569 815296
58395 815296 818817 822291 827412 833598 838908 843465 848287 852164 853550 854056 856126 858743 859439 858944 859721
58380 859721 861546 862834 864646 868863 874030 877703 881323 887874 896269 903154 908903 916443 925338 932614
58366 932614 938687 946930 957803 968670 979073 990922 1003763 1015016 1024804 1035634 1047489 1057959
58354 1057959 1066767 1075396 1082865 1086904 1088760 1091807 1095976 1098655 1100353 1104108 1109923 1115255 1120501 1128400
58340 1128400 1138530 1148032 1157397 1169749 1184805 1199433 1213878 1231375 1251609 1270624 1287287 1303868
58328 1303868 1320134 1332970 1342133 1350478 1358283 1363225 1365993 1369783 1374137 1375534 1374345 1374910 1378476 1382383
58314 1382383 1386510 1394007 1405145 1416797 1428559 1443092 1460040 1476000 1490813 1507447 1525540 1541786
58302 1541786 1556743 1574242 1593954 1611791 1627839 1646326 1667393 1686661 1703495 1721817 1742029
58291 1742029 1760229 1776411 1795291 1817862 1840138 1861321 1885059 1911498 1936540 1960248 1987492
58280 1987492 2018844 2049388 2077962 2108911 2143261 2177166 2210649 2248715 2292024 2335690 2379055
58269 2379055 2427171 2480685 2534025 2585777 2641138 2701809 2763268 2824291 2889158 2958200 3026332
58258 3026332 3093103 3163700 3237884 3308986 3376158 3446180 3520720 3593796 3664619 3740588 3824398
58247 3824398 3910650 3998568 4095126 4201966 4312378 4425011 4547127 4680422 4817627 4957335
58237 4957335 5107726 5271296 5440801 5615019 5803061 6008154 6223115 6446967 6689376
58228 6689376 6953254 7230460 7520525 7835443 8179782 8545184 8931221 9351592 9812506
58219 9812506 10306069 10832996 11409769 12044855 12731242 13471919 14288357 15193888 16184825
58210 16184825 17268977 18475743 19826672 21325826 22992346 24871591 27001367 29402943
58202 29402943 32122423 35246106 38861368 43046906 47923654 53674268 60498524 68609018
58194 68609018 78300799 89971619 104053873 121002518 141382198 165881621 195198521
58187 195198521 229929468 270291768 315168750 360690580 399889156 424821962 430302442
58180 430302442 416432297 388026976 351802107 313661528 277435136 244830769 215959714
58173 215959714 190139794 166703942 145397641 126257309 109332792 94585246 81911610
58166 81911610 71140254 62027326 54320380 47814571 42329988 37680944 33706044 30298353
58158 30298353 27375785 24848829 22641564 20714603 19038941 17568340 16258557 15090543
58150 15090543 14052339 13117488 12260586 11475487 10759894 10099190 9481893 8913964 8401481
58141 8401481 7934332 7501285 7105477 6750692 6427309 6125870 5850395 5604339 5376519
58132 5376519 5154289 4938630 4734062 4535900 4339763 4152207 3979754 3817762 3661041
58123 3661041 3514741 3383774 3261914 3142348 3029217 2927948 2833686 2740119 2650863 2571468
58113 2571468 2498290 2425563 2355824 2293407 2234824 2175114 2116978 2064638 2015133 1964149 1914096
58102 1914096 1868363 1823975 1777686 1732874 1692908 1654229 1613494 1574864 1542576 1512838 1480800
58091 1480800 1449152 1422037 1396657 1368946 1341760 1319480 1299859 1278964 1258946 1243084 1228042
58080 1228042 1208789 1186781 1165976 1145135 1121329 1096823 1075267 1054890 1032353 1009535 989861
58069 989861 971721 952146 933323 918831 906898 893818 880758 870889 862962 853916 844802 838119
58057 838119 832210 824091 814926 807171 799231 788467 776511 766279 756755 745992 736057 729475 723901
58044 723901 715911 707075 700685 695398 687807 678597 670519 662869 653611 644542 638708 634839 629729 623973
58030 623973 619977 616369 609779 600434 590953 581482 570906 560853 553530 547446 540190 533472 530418 529690
58016 529690 527377 523085 519254 516046 511839 507382 504609 502617 499331 495820 494477 494366 492781 490034
58002 490034 488306 487325 485620 484444 485851 488338 488988 488422 488974 489470 486848 481835 478005 476048 473799
57987 473799 471170 470196 470544 469690 467349 465469 464083 461338 457317 453771 450385 445360 439382 434995 432262
57972 432262 428936 424773 421844 420709 419895 419030 418917 418811 417186 414967 414557 415880 416788 416953 417903 419603
57956 419603 420495 420613 421208 421608 419930 416596 413768 411611 408549 404853 402453 401466 400419 399624 400798 403535
57940 403535 405802 407815 411874 418357 425413 432635 441430 451589 461050 469403 478220 487577 495585 501786
57926 501786 507612 512936 515429 514083 510393 505437 498685 490329 481961 474166 465973 457242 449177 442081
57912 442081 435067 428336 423358 420517 418960 418850 421309 426012 431279 436540 442183 447113 449346 449122 448647
57897 448647 448595 447665 445731 444454 444288 443727 442049 440167 438288 435399 431713 429051 428121 427690 426991 426676
57881 426676 426921 426852 426229 425575 424397 421527 417326 413215 408975 403059 395665 388883 383550 378640 374087
57866 374087 371366 370711 370492 370118 371013 373942 377759 381582 385982 391343 397217 403822 411947 420859 428662
57851 428662 435228 442410 450813 458752 465041 470318 474806 477169 476616 474053 470307 465179 458976 452924
57837 452924 447316 441135 434086 427077 420363 413384 406794 402238 399462 396113 391228 386614 383854 382227
57823 382227 380668 379641 379878 381004 382439 384070 385324 385245 384106 383280 383118 382764 382253 382606 383420 382653 379359
57806 379359 374421 368147 359687 349616 340501 333783 328371 323392 319965 318998 319393 319830 320403 321260 321495
57791 321495 320690 319951 320305 321590 323746 327370 332204 336880 341064 345950 351900 357654 362778 368774 376692
57776 376692 385684 394928 404823 415066 423751 429798 434392 438659 441839 443115 443272 442992 441290 437212
57762 437212 431439 424809 416921 407698 398700 391258 384770 378251 372137 367088 362482 357623 353199 350095
57748 350095 347969 346270 345439 345871 346908 347999 349610 351902 353827 354650 355039 355620 355935 355877 356506 358207
57732 358207 359596 359596 359149 359588 360779 362192 364320 367597 371202 374275 377047 379619 381072 381035 380623 380516
57716 380516 379680 377340 374553 372260 369438 365003 360021 356070 352683 348428 343449 338943 334870 330103
57702 330103 324377 318512 313186 308727 305538 303530 301766 299661 297744 296420 295025 293038 291055 289622
57688 289622 288374 287327 287473 288929 290052 289850 289756 291526 294858 298762 303754 310820 319512 329058 340373
57673 340373 355086 373583 395854 423364 458208 501263 552922 614601 687036 766872 845938
57662 845938 913334 957741 970306 948911 900164 835553 765219 695509 630412 572535 522744
57651 522744 480657 445734 417075 393052 372533 355880 343450 333954 325640 318235 312264 307361
57639 307361 302837 299062 296647 295051 293528 292536 292534 292331 290548 287949 286417 286273 286454 286566 286766 286292 284316
57622 284316 281838 280621 280496 279770 278032 276516 275738 274846 273394 271896 270417 268330 265719 263575 262380
57607 262380 261742 261385 261293 261112 260722 261045 262867 265228 266483 266544 266501 266479 265703 264365 263448 262774 261143 258541
57589 258541 256370 255262 254315 252756 250811 248655 246069 243433 241685 240920 240295 239447 238846 238613 238266 237721
57573 237721 237317 236806 235551 233746 232259 231325 230567 230113 230300 230447 229476 227710 226548 226260 225667 224153 222523
57556 222523 221535 221022 220787 221138 222121 223298 224539 226085 227727 228963 229984 231422 233196 234655 235773
57541 235773 237081 238545 239761 241098 243354 246276 248697 250123 251025 251661 251782 251388 250615 249134 246884
57526 246884 244994 244547 244861 244494 243549 243232 243499 243167 242258 242138 243187 244358 245328 247090 249880 252424 253871
57509 253871 254829 255826 256419 256496 256956 258261 259574 260030 259746 259122 258245 257327 256607 255570 253530 251084 249592
57492 249592 249078 248204 246476 244820 243693 242397 240723 239510 238941 238041 236610 235994 237021 238632 239428 239293
57476 239293 238752 238036 237506 237705 238301 238192 237197 236351 236125 235882 235619 236472 238633 240525 241045 241075 241677 242349
57458 242349 242310 242081 242425 242883 242697 242197 242042 242006 241652 241393 241781 242551 243290 244228 245515 246621 247350 248527
57440 248527 250727 253216 255028 256170 256907 256852 255811 254642 254248 254459 254793 255516 257007 258828 260320 261442
57424 261442 262277 262546 262403 262874 264662 267213 269628 271660 273204 273872 273869 274190 275091 275439 274522 273381 273302 274064
57406 274064 274839 275760 277219 278507 278579 277601 276546 275851 275558 276114 277733 279490 280255 280168 280209 280802 281787 283216
57388 283216 285063 286629 287370 287917 289265 291255 292904 293897 294797 295952 297112 298032 298794 299665 301034 303130
57372 303130 305448 307063 307888 308870 310469 311857 312264 312157 312286 312472 312272 312016 312243 312860 313737 315413 318300
57355 318300 321976 326082 330941 336295 340454 342078 342063 342431 343966 346144 348658 351582 354510 356864 358767
57340 358767 360560 361931 362632 363489 365425 367919 369732 370764 371960 373670 375392 376945 378671 380559 382201
57325 382201 383524 384769 385991 387313 389202 391611 393496 394195 394699 396412 399213 401969 404347 406748 408958
57310 408958 410432 411661 413712 416518 418983 420807 422862 425733 429088 432581 436256 440025 443745 447725
57296 447725 452162 456288 459206 461359 463956 467155 470123 472710 475575 478695 481306 483521 486542 490783
57282 490783 495077 498213 500123 501146 501306 500870 500560 500557 500112 498756 497190 496447 496783 497934 499973 503407
57266 503407 508665 515672 523712 531793 539605 547970 557800 568796 579863 590600 601508 612711 623363
57253 623363 632584 640384 647519 654966 663485 673117 683026 692320 700967 709523 718290 727351 737067 747726
57239 747726 758909 769957 780892 792096 803373 814208 824739 835580 846845 858256 870009
57228 870009 882606 895942 909521 923415 938004 952895 967292 981446 996589 1013241 1030655
57217 1030655 1048232 1066464 1086023 1106736 1127894 1149078 1170350 1192036 1214428 1237347 1260101
57206 1260101 1282273 1304283 1326691 1349418 1372291 1395853 1420726 1446614 1472858 1499545 1527047
57195 1527047 1554927 1582496 1610020 1638082 1666089 1692820 1718217 1743115 1767426 1790291 1812021
57184 1812021 1834116 1857063 1879836 1902028 1924784 1948859 1973326 1997090 2020434 2044113 2068029
57173 2068029 2091816 2115906 2141045 2167317 2194367 2222060 2250396 2279290 2308840 2339269 2370340
57162 2370340 2401510 2432861 2465049 2498057 2530847 2562615 2593562 2624156 2654537 2685020 2716197
57151 2716197 2748065 2779891 2811397 2843228 2875813 2908677 2941399 2974438 3008356 3042959 3077798
57140 3077798 3112910 3148527 3184613 3221103 3258086 3295474 3333119 3371489 3411473 3453194 3495869
57129 3495869 3539242 3584422 3632817 3684962 3740772 3800284 3863672 3931148 4003249 4080713 4163840
57118 4163840 4252613 4347673 4450540 4562646 4684934 4818648 4965697 5127977 5307141 5505334
57108 5505334 5725423 5970325 6243171 6548781 6894624 7290408 7747915 8281802 8909961
57099 8909961 9653173 10535859 11588163 12846888 14354144 16155726 18300429 20838569
57091 20838569 23818318 27281059 31257019 35760767 40786589 46304762 52258481 58559876
57083 58559876 65085731 71675125 78129776 84217762 89685448 94282166 97791865 100056589
57075 100056589 100982589 100534857 98732067 95647050 91409811 86207490 80275630 73877260
57067 73877260 67273723 60698443 54342139 48348225 42813014 37789361 33294541 29319874
57059 29319874 25838375 22810394 20189259 17926409 15974370 14288501 12829034 11562343
57051 11562343 10459987 9497137 8652666 7909798 7255220 6677408 6166203 5713112 5310830
57042 5310830 4952538 4632233 4345207 4087417 3854785 3643699 3451746 3277391 3119386
57033 3119386 2976803 2848886 2734475 2632411 2542938 2467619 2407476 2362506 2333663 2323953 2337030
57022 2337030 2376239 2444775 2542080 2655547 2757055 2812994 2801534 2721989 2590301 2428327
57012 2428327 2255839 2087064 1930122 1788686 1664378 1557533 1466578 1388525 1320812 1261987
57002 1261987 1210736 1165468 1125145 1089559 1058501 1031363 1007592 986660 967513 948961 930859
56991 930859 914122 899426 886564 875194 865608 858618 855220 856298 861985 871076 881291 889972 894237
56978 894237 891145 878840 857854 830909 801414 772168 744855 720059 697870 678784 663616 652330
56966 652330 643775 637149 632994 632104 634316 639274 647618 660406 677992 700417 727924 759415 790584
56953 790584 814893 826719 823374 805299 775911 740858 705577 672868 643215 616881 594604 576701
56941 576701 562881 553003 546999 544220 544028 546991 554453 567045 584648 607759 637647 674750 717197
56928 717197 760343 796905 818590 819818 800908 767213 725305 680467 636714 597008 562668 533504
56916 533504 508922 488355 470920 455721 442554 431452 421758 412585 404024 396841 391139 386359 382396
56903 382396 379577 377671 376149 375328 376047 378165 380564 382684 384975 387872 391573 396856 404801 415511
56889 415511 428185 442604 459566 479782 503286 529545 556633 580217 594975 597796 589084 571320
56877 571320 547759 522266 498413 477808 460304 446107 436422 431839 431540 434744 441724 453033 468982
56864 468982 490476 519064 555576 599878 652543 715202 787630 864546 935740 989267 1015493
56853 1015493 1010622 978321 927792 869227 810369 756136 709484 671748 643061 623261 612173
56842 612173 609174 613584 625817 647274 678956 721183 774850 841814 923654 1020834 1132300 1252981
56830 1252981 1370006 1463338 1513551 1511176 1459990 1373129 1266745 1155247 1049015 954089 873047
56819 873047 806081 751931 709098 676903 655363 644278 643108 651719 670536 699947 740277 792404
56807 792404 857497 935324 1022101 1108722 1180654 1221817 1222152 1183065 1115242 1031501 942178 855183
56795 855183 776423 708559 651162 603346 565263 536778 516429 502662 494876 492704 495724 504577
56783 504577 520929 545436 576946 614136 655990 699290 736921 760360 763771 745856 709562 661191
56771 661191 608244 556207 507248 462120 422064 388152 360101 336882 317676 301481 286942
56760 286942 273530 262007 252910 245567 239320 234471 231032 227748 223496 218723 214462 210896 207815 205423
56746 205423 203670 201750 199320 197216 196029 195002 193399 191766 190721 189680 188067 186653 186247 186093 185092
56731 185092 183751 183336 183807 184130 184017 183884 183653 183103 182991 184346 186896 189424 191352 192880 193988 194574
56715 194574 195179 196435 198044 199281 200057 200582 200612 200114 199988 200891 201937 201925 201321 201630 203151 204767 205726
56698 205726 206255 206531 206305 205672 205137 204866 204641 204412 204202 203821 203382 203625 204850 206066 206180 205533 205216 205324
56680 205324 205044 204127 203170 202624 202509 202894 203742 204485 204580 204262 204100 204226 204674 205832 207778 209732 210980 211743
56662 211743 212408 212741 212741 213301 214892 216452 216828 216496 216584 217026 217085 216987 217547 218834 220618 223383 227266 230701
56644 230701 231987 231838 232518 234687 236860 237888 238232 238678 239345 240131 240779 240415 238251 234746 230959 227014
56628 227014 222487 217932 214447 211864 208933 205333 201969 199298 196868 194616 193141 192438 191735 190783 190037
56613 190037 189468 188507 187281 186598 186553 186433 186102 186129 186438 186242 185584 185552 186565 187744 188395 188894 189677 190472 191053
56594 191053 191794 193008 194463 195870 197191 198342 199240 200081 200881 201018 200122 199046 198899 199407 199464 198942 198640
56577 198640 198751 198851 199246 200647 202496 203278 202765 202410 203255 204869 206647 208587 210351 211129 211159 212092 215155
56560 215155 219975 225751 232458 240237 248501 256249 262600 266818 268704 269240 269948 271334 272773 273944 275347
56545 275347 277203 278901 279833 279901 279081 277424 275555 274211 273176 271688 269826 268365 267278 265674 263313
56530 263313 260939 258958 256991 254925 253149 251562 249625 247535 246077 245060 243310 240532 237854 236072
56516 236072 234675 233130 231903 231553 231751 231729 230977 229276 226916 224962 224303 224367 223904 222982 222866 223768 224246
56499 224246 223275 221599 220513 220369 220747 221093 220865 219987 219317 219709 220585 220620 219785 219387 220043 221055 221907 222863
56481 222863 223799 223920 223053 221939 220986 220001 219297 219567 220483 220930 220895 221504 222913 223905 223992 224217 225232 226190
56463 226190 226174 225300 223907 222145 220831 221093 222608 223742 223952 224344 225358 225829 225206 224778 225577 226715 226960
56446 226960 226516 226107 225697 225258 225540 226899 228435 229271 229685 230172 230539 230772 231585 233259 235011 236301 237594
56429 237594 239112 240126 240279 240445 241342 242452 243096 243548 244256 245022 245629 246327 247140 247733 248351 249699 251539
56412 251539 252761 253216 254012 255646 257431 259186 261633 264503 266102 265632 264260 263139 262049 260775 259990
56397 259990 259865 259554 258957 259248 260815 262530 263908 265912 268575 270014 269196 267639 266917 266485 265545 265096
56381 265096 266185 267878 268904 269883 272009 274777 276790 277667 277575 276164 273674 271963 272621 274862 276699
56366 276699 277338 277222 276872 276929 278223 280510 282215 282563 282735 283887 285424 286399 287100 287948 288291 287670 286923
56349 286923 286795 286843 286826 287572 289197 290276 290137 290209 291606 293230 293857 294242 295388 296541 296834 297211 298767
56332 298767 300788 302407 304512 307944 311394 313293 314398 316445 319561 322978 326821 331083 334323 335548
56318 335548 336106 337663 339731 341275 343123 346368 349802 351460 351588 351713 351988 351788 351803 353078 354986 356434
56302 356434 358081 361140 365092 368805 372761 377868 383285 387765 391981 397125 402426 406504 410045 414574
56288 414574 419699 424149 428447 433916 440054 445607 451242 458403 466412 473475 479807 487053 495307 503377
56274 503377 511334 520181 529643 538861 548552 559980 572558 585078 598421 614276 631942 649283
56262 649283 666258 684737 705415 727719 752245 780548 812967 849212 890414 937921 990820
56251 990820 1047600 1109669 1180243 1260182 1347785 1442184 1543923 1652426 1765805 1883013 2003540
56240 2003540 2125270 2245135 2361345 2472232 2573571 2660030 2728906 2779707 2810822 2819919
56230 2819919 2807384 2776233 2728703 2665761 2589636 2503793 2410451 2310836 2207519 2103701 2000605
56219 2000605 1898336 1798729 1704289 1614963 1529209 1447727 1372771 1304199 1239675 1178497 1121893
56208 1121893 1069790 1020856 975610 935962 901613 870253 841298 816074 794381 774363 755810
56197 755810 740055 726589 713305 700230 689470 681280 673631 665883 659389 654296 649294 644738 642495
56184 642495 642337 641925 640556 639552 638874 636959 634162 632686 632854 632909 632589 633220 634271 633749 632204 632352 634506
56167 634506 636407 637840 641171 646886 652864 658645 666150 675461 684215 691989 701046 711939 722644 732976
56153 732976 745437 760536 775636 789823 805819 825693 848577 873844 902633 935101 970172
56142 970172 1009240 1056221 1112855 1177924 1252018 1338756 1439961 1553630 1677435 1809528 1944452
56131 1944452 2072867 2187450 2285859 2367562 2432707 2485482 2533480 2581148 2626988 2667778 2700963
56120 2700963 2722193 2726331 2713558 2690383 2662776 2632118 2598494 2562228 2519934 2464149 2389800
56109 2389800 2297655 2190540 2071283 1946035 1824044 1711321 1608480 1516198 1437529 1372902
56099 1372902 1318243 1270658 1231267 1200376 1175063 1153783 1138234 1128324 1120472 1113253 1109356 1109601
56087 1109601 1110479 1110130 1111181 1114991 1118828 1121570 1126341 1134393 1142188 1147896 1155002 1165958 1177883 1188180
56073 1188180 1198868 1211688 1224403 1235667 1248239 1263691 1279344 1293927 1310692 1331276 1352099
56062 1352099 1370560 1389124 1409622 1429359 1446612 1464053 1482873 1499684 1513116 1527207 1544222
56051 1544222 1560640 1574474 1589803 1609378 1629546 1647434 1666458 1689469 1713092 1734320 1756333
56040 1756333 1782309 1809692 1835951 1863811 1895489 1928115 1960029 1995061 2035434 2077167 2117543
56029 2117543 2160006 2206603 2253348 2298489 2347210 2402235 2458065 2510747 2564872 2624359 2685082
56018 2685082 2743723 2805012 2872732 2942429 3010792 3083280 3164244 3248562 3331506 3417818 3512302
56007 3512302 3610702 3708926 3811967 3924395 4041552 4159668 4284840 4422159 4566042 4711555
55997 4711555 4864857 5031840 5207213 5385999 5574747 5779802 5995908 6218552 6455774
55988 6455774 6715089 6990869 7277870 7584620 7919745 8278427 8656838 9065922 9515605
55979 9515605 10000161 10515587 11076008 11695589 12370575 13097841 13894175 14777534 15747589
55970 15747589 16806451 17979793 19294983 20759144 22383821 24209795 26281668 28623324
55962 28623324 31269725 34299175 37804998 41868104 46598043 52174192 58811914 66730958
55954 66730958 76209489 87633291 101444665 118097860 138130611 162223091 191113983
55947 191113983 225484819 265770608 311389113 359251413 402822168 433534235 444505029
55940 444505029 433941435 405551666 366012083 321894960 278046958 237441436 201555156
55933 201555156 170772933 144828380 123200836 105301196 90510240 78244756 68038308
55926 68038308 59528117 52392639 46353565 41212841 36830336 33072036 29814427 26978143
55918 26978143 24513348 22361011 20460018 18777388 17297176 15989030 14815894 13761279
55910 13761279 12820768 11975922 11202092 10492779 9851860 9269787 8729923 8230244 7776919
55901 7776919 7363439 6976357 6614830 6285147 5982364 5695753 5426306 5181205 4956573
55892 4956573 4742402 4539068 4353009 4181402 4016568 3860461 3719956 3592651 3471587
55883 3471587 3359181 3262563 3179829 3104571 3039413 2991379 2957585 2928234 2899865 2873228 2842012
55872 2842012 2796531 2735911 2665408 2585161 2492862 2393988 2297824 2205966 2115130 2027922 1950067
55861 1950067 1880038 1812117 1747002 1689217 1636919 1584588 1533324 1488495 1449577 1411972 1376363
55850 1376363 1346441 1319618 1289715 1257047 1226689 1198677 1168994 1138281 1110512 1084758 1057114
55839 1057114 1029134 1005573 985342 963365 939966 919860 903116 885562 867099 851334 837883
55828 837883 823029 807295 794661 785068 775058 764829 757222 750760 741113 728642 717294 707058
55816 707058 694776 681348 670709 662488 653082 643293 637486 635693 633747 630882 630095 631376 631768 632009
55802 632009 636148 644510 653655 663110 675248 688532 697747 701355 702184 700658 693869 681734 667701
55789 667701 652879 635606 617155 601608 589571 578127 567476 561226 559152 555802 547674 536420
55777 536420 524128 510979 498601 490280 486510 485097 486557 494467 509560 527957 545633 560005
55765 560005 567145 563128 549184 530806 511105 489654 467862 449747 436384 424733 413169 403342
55753 403342 395648 387803 379063 371208 364294 356017 346319 338008 331811 325334 317913 311900 308037 304155
55739 304155 299690 297044 297083 297491 296843 296171 295445 292765 288342 285153 284284 283556 281791 280313 279097 275718
55723 275718 269652 263636 259314 255294 250842 247601 246236 245148 243941 244544 247453 250490 252679 255874
55709 255874 261223 267374 273295 279344 284507 286352 285058 283845 283989 282999 279024 273391 267301 259685 250181
55694 250181 240924 233518 227200 221439 217411 215499 214299 213288 213579 214994 215612 215252 216171 219171 222399
55679 222399 225077 228865 234140 238506 240599 242044 244004 245035 244008 242095 240233 237612 234149 231495
55665 231495 230141 228541 226363 225437 226198 226617 226143 227192 230972 235243 238208 241315 246097 251307 255398
55650 255398 258978 262699 265379 266252 266440 266341 264153 258858 252034 245057 237253 228560 221025 215618 210373
55635 210373 203786 197332 192539 188302 183314 178617 175477 173119 170676 168969 168252 166678 163250 159970
55621 159970 158757 158439 157013 154745 152862 151205 149340 148000 147418 146196 143751 141810 141642 141908 141154
55606 141154 140210 140099 139817 138251 136204 134506 132321 129341 127354 127382 127502 125847 123536 122249 121103 118669
55590 118669 116118 115490 116388 116999 117074 117461 118041 118425 119397 121380 122804 122117 120216 118886 118236 117622 117637 118996
55572 118996 120803 121948 122961 124653 126361 127388 128623 130792 132721 133347 133789 135286 136803 136913 136433
55557 136433 136771 137221 136429 135184 135099 135642 135083 133489 132380 132134 132011 132006 132572 133183 133108 132848 133074 133080 132069
55538 132069 130924 130937 131841 132860 134405 136766 138496 138213 136880 136172 135741 134290 132213 130832 129951 128485
55522 128485 126665 125432 124418 122663 120521 118778 116775 113610 110302 108494 107765 106529 104884 104215 104581
55507 104581 104795 104659 104855 105018 104153 102705 102114 102475 102551 101831 100794 99495 97712 96103 95344 94616 92817
55490 92817 90793 90348 91372 91992 91340 90254 89401 88629 88184 88693 89801 90456 90641 91440 93333 95670 97713
55473 97713 99069 99401 98866 98483 98899 99297 98585 97024 95503 94081 92546 91541 91570 91729 91019 90129 90322
55456 90322 91338 92095 92653 93666 94576 94280 93111 92397 92416 92419 92179 91956 91506 90714 90548 91782 93463 94274
55438 94274 94583 95366 96073 95610 94666 94802 95815 96246 96062 96588 97993 99118 99720 100812 102714 104681 106429
55421 106429 108276 109835 110356 110255 110611 111318 111511 111496 112408 114090 115272 115768 116651 118221 119543 120020 119749
55404 119749 118440 115705 112295 109412 106967 104183 101575 100413 100463 100229 99332 98742 98735 98617 98444 98951 99696
55387 99696 99324 97888 96963 97186 97574 97492 97393 97280 96330 94508 92895 92017 91448 91291 92329 94360 96020 96631
55369 96631 96707 96399 95068 92733 90369 88386 86326 84345 83455 83997 85302 87033 89361 91671 92777 92718
55353 92718 92808 93612 94413 94892 95715 97073 98210 98792 99344 99958 99959 99087 97732 95906 93449 91259 90628 91226
55335 91226 91385 90604 90113 90715 91783 92688 93583 94401 94704 94812 95552 96674 97192 97363 98431 100159 100699 99403
55317 99403 97788 97064 96640 95851 95267 95351 95433 94968 94341 93670 92317 90368 89115 89234 89837 90060 90211 90598
55299 90598 90686 90198 89830 90119 90794 91756 93375 95323 96514 96725 96837 97078 96651 95633 95404 96478 97618
55282 97618 98004 98560 100094 101761 102488 102482 102227 101402 99888 98525 97762 96860 95448 94518 94772 95237 94737 93568
55264 93568 92621 91973 91411 91226 91360 90959 89888 89548 90991 93289 94995 96161 97606 99123 99808 99472 98482
55247 98482 96829 94519 92311 91011 90546 90605 91497 93383 95262 95842 95028 93750 92719 92054 91700 91500 91248
55230 91248 91065 91270 91602 91383 90755 90824 92125 93859 95126 95917 96422 96472 96266 96512 97162 97077 95731 94159
55212 94159 93451 93412 93511 94053 95406 97023 98236 99209 100273 101155 101656 102191 102879 103024 102304 101516 101343 101332 100989
55193 100989 100769 101046 101127 100431 99705 99906 100690 101115 101173 101468 102022 102476 102962 103779 104649 105136 105278 105156 104475
55174 104475 103278 102331 102097 102044 101647 101183 100851 100136 98956 98428 99419 101148 102231 102320 101750 100564 99080
55157 99080 98616 100216 103084 105341 106017 105459 104399 103525 103414 103950 104262 103921 103557 103653 103653 103083 102589 102821 103182
55138 103182 102821 102086 101857 102172 102638 103454 104811 105947 106061 105610 105514 105662 105414 105056 105426 106451 107288 107627
55120 107627 107821 107950 107821 107610 107625 107756 107895 108436 109526 110413 110427 110013 109905 109941 109717 109642 110196 110809 110730 110438
55100 110438 110896 111901 112449 112337 112108 111784 111026 110290 110508 111666 112861 113727 114753 116206 117680 118659 118793
55083 118793 117826 115991 114162 112936 112009 111152 111044 112219 113930 115171 116132 117410 118481 118419 117622 117287
55067 117287 117503 117377 116805 116575 116745 116446 115433 114509 114228 114335 114629 115256 116003 116372 116448 116745 117135 116947 116162
55048 116162 115487 115205 114912 114476 114240 114149 113624 112445 110981 109491 108020 106972 106882 107564 108284 108789 109436 110331
55030 110331 111106 111531 111628 111277 110450 109707 109715 110382 111077 111476 111536 111101 110293 109831 110047 110084 109089 107649 106953 107077
55010 107077 107415 108251 110281 112842 114370 114675 115164 116562 117973 118549 118673 118949 119281 119489 119761 119981 119562
54993 119562 118453 117455 117189 117540 118362 119792 121594 123138 124357 125835 127595 128756 128834 128534 128749 129434
54977 129434 129925 129830 129272 128697 128607 128978 129017 128083 126732 126019 125936 125592 124890 124792 125670 126582 126719 126592 127167 128554
54957 128554 130117 131318 131993 132306 132696 133398 133891 133393 132015 130712 129994 129420 128504 127309 125937 124300
54941 124300 122722 122031 122666 124257 126297 128541 130552 131701 132001 132301 133262 134722 136321 138112 140237
54926 140237 142627 145390 148962 153536 158751 164218 169941 176111 182866 190252 197830 204388 208675 210476
54912 210476 210305 208157 203529 196814 189625 183292 177762 172383 167010 161834 156812 151946 147710 144708
54898 144708 143064 142360 141922 141118 139795 138537 138059 138319 138698 139058 139979 141808 144109 146305 148332 150425
54882 150425 152720 155356 158663 163034 168699 175550 182948 189914 195904 201146 205836 209363 210840 210010
54868 210010 206980 201624 194185 186077 178939 172957 167144 161135 155629 151067 147119 143722 141507 140753
54854 140753 140789 140779 140394 139527 138092 136326 134582 132714 130411 128080 126509 125633 124694 123699 123560 124488 125350
54837 125350 125057 123636 121578 119183 117093 116420 117530 119365 120642 121264 122023 123411 125091 126175 125777
54822 125777 123781 121219 119402 118635 118343 118329 119013 120397 121786 122736 123417 123883 123948 123953 124617 125801 126487 126333
54804 126333 126254 127009 128203 129198 129995 130691 130995 130907 130990 131405 131563 131330 131623 133060 134829 135702 135528 134995 134560
54785 134560 134362 134576 135116 135435 135245 135009 135158 135405 135447 135901 137745 141066 144937 148444 151533 154992 159787
54768 159787 166259 173907 182109 190755 199696 208043 214863 220254 224664 227339 226794 222902 217189 210765
54754 210765 203344 194745 185980 178178 171548 166055 161979 159104 156433 153478 150858 148990 147275 145306
54740 145306 143760 143240 143273 143341 143859 145169 146557 147327 147974 149287 151165 153344 156371 160721 165704 170470
54724 170470 175378 181190 187539 193377 198428 203034 207036 209944 211810 212773 212115 208825 202933 195463 187431
54709 187431 179673 173064 167863 163295 158728 154799 152387 151017 149477 147606 146268 145727 145289 144486 143564
54694 143564 142791 142129 141558 141014 140164 138936 137984 137801 137760 136962 135700 135108 135585 136496 137240 137679 137632 136938 135952
54675 135952 135189 134562 133720 132888 132511 132341 131804 131076 130863 131237 131635 131821 131847 131249 129431 126933 125223 124992
54657 124992 125561 126103 126523 126930 127219 127534 128373 129802 131146 131834 132071 132394 133005 133706 134146 133986 133181 132148
54639 132148 131389 131003 130922 131393 132719 134580 136134 136822 136753 136421 136364 136911 137820 138395 138249 137706 137168 136592 136016
54620 136016 135965 136681 137510 137813 137948 138553 139397 139899 140240 140796 140976 139994 138568 138311 139300 139683 138190 135777
54602 135777 134187 133856 134023 134137 134309 134743 135392 136114 136847 137575 138183 138312 137592 136338 135653 136298 137737 138871
54584 138871 139473 140134 141033 141666 141766 141612 141253 140315 138869 137748 137583 138043 138379 138315 138169 138427 139362 140740
54566 140740 141792 141797 140761 139296 137995 137208 137175 137799 138456 138593 138429 138578 139154 139879 140889 142647 145022
54549 145022 147166 148393 148690 148329 147650 147261 147798 149278 151071 152594 153658 154315 154907 156127 158334 160820
54533 160820 162356 162496 161780 160744 159472 158154 157326 157313 157869 158453 158446 157288 155040 152771 151694 151908 152552
54516 152552 152996 153153 152757 151416 149505 148060 147464 147085 146512 146303 146952 147915 148352 148413 149072 150784 152737
54499 152737 153513 152402 150136 148306 147911 148607 149478 150157 150800 151430 151979 152660 153560 154088 153723 153136 153561 155039
54481 155039 156292 156547 156454 156882 157795 158845 160219 162208 164488 166508 168193 169735 171046 171912 172459 173022
54465 173022 173682 174211 174275 173589 172151 170565 169833 170531 172247 173952 174795 174566 173650 172620 171780 171099 170542
54448 170542 170170 169785 168910 167494 166148 165260 164326 162819 161237 160463 160363 159978 159004 158135 157895 158005 158028 157905
54430 157905 157692 157449 157496 158164 159221 160165 161022 162164 163423 164236 164661 165328 166280 166845 166844 167005 167790 168647 168819
54411 168819 168245 167261 166078 164936 164226 164110 164417 165050 166022 167094 167997 168966 170331 171625 171989 171537 171348
54394 171348 171924 172637 172973 173303 174011 174799 175319 175594 175384 174118 172053 170558 170504 171129 171267 171006 171324 172578
54376 172578 174111 175084 175152 174633 174377 175056 176292 177011 176917 176907 177745 179101 180355 181524 182813 184101 185574
54359 185574 188036 191700 195360 197711 198983 200334 202067 203441 203927 203611 202528 200583 198164 195933 193855
54344 193855 191193 187689 184162 181626 180188 179097 177606 175605 173510 171730 170283 168954 167681 166599
54330 166599 165828 165551 166100 167458 168706 168689 167438 166289 166273 166988 167455 167481 167594 168120 168955 170029 171319 172411
54312 172411 172503 171064 168423 165673 163858 163076 162478 161434 160391 160143 160561 160826 160780 161114 162112 163164 163777
54295 163777 164153 164458 164423 164122 164242 164972 165468 165098 164504 164685 165572 166240 166067 165092 163684 162521 162376 163264
54277 163264 164166 164225 163838 163975 164787 165565 165793 165651 165600 165880 166286 166216 165304 164170 163993 165073 166469 167430 168402
54258 168402 170123 172414 174525 176082 177024 177206 176782 176415 176486 176541 176210 175973 176242 176342 175390 173705 172301
54241 172301 171365 170258 168826 167650 167049 166787 166792 167361 168537 169927 171158 171964 171985 171120 169980 169336 169143
54224 169143 168793 168219 168075 168785 170065 171465 172799 173949 174730 175171 175601 176388 177695 179337 180620 180655 179252
54207 179252 177242 175507 173949 171917 169404 167202 165927 165380 164902 164020 162769 161621 161022 160935 161101 161706
54191 161706 163150 164979 165858 165177 163985 163627 164064 164371 164389 164862 166143 167671 168726 169062 168868 168674 169124
54174 169124 170235 171083 170782 169580 168422 167674 166947 165969 164948 164211 164050 164743 166157 167560 168387 168935 169687
54157 169687 170303 170046 168979 167874 167053 166117 164840 163633 163025 163267 164416 166296 168382 170149 171455 172260
54141 172260 172262 171265 169593 167721 165898 164610 164692 166260 168087 169007 169429 170453 171999 173027 173285 173511 173932
54124 173932 173966 173551 173518 174256 175029 175056 174437 173694 173204 173366 174501 176207 177543 178208 178957 180496 182524 184133
54106 184133 184675 184090 182946 182267 182752 184010 185039 185473 185761 186246 186896 187969 190037 193013 195974 198305
54090 198305 200410 202989 206201 209889 214015 218533 223379 228950 236106 245172 255124 263950 269722 271391
54076 271391 269043 263657 256429 248333 240302 233348 227920 223472 219298 215565 212860 210963 208982 206612
54062 206612 204427 202926 202064 201707 201707 201517 200670 199705 199717 200870 202266 203392 204713 206573 208526 210194 211963
54045 211963 214364 217422 220916 224560 227765 230131 232524 236699 243366 251386 259263 266536 273230 278958
54031 278958 283427 287132 290710 294058 296756 298892 300821 302525 303798 304729 305445 305753 305487 304894 304273 303599
54015 303599 302827 302105 301275 299732 297166 293974 290509 286494 281694 276602 271854 267436 263051 258829 255001
54000 255001 251300 247413 243716 240878 238944 237471 236364 235846 235661 234990 233348 231083 228844 226910 225167
53985 225167 223485 221956 220766 219873 218936 217708 216441 215626 215292 214946 214274 213508 212949 212568 212287 212268 212638
53968 212638 213191 213610 213748 213577 213142 212674 212385 212087 211399 210493 210140 210758 211872 212769 213383 214218 215735 218037
53950 218037 220897 223904 226776 229606 232564 235517 238442 242148 247822 255667 264694 274155 284554 296719
53936 296719 310323 323753 335099 342972 346805 346938 344380 340335 335937 332172 329499 327539 325710 324188
53922 324188 323717 324584 326518 329545 333904 338939 343173 346069 348805 352705 357684 362868 368034 373638 379909
53907 379909 386561 392971 398198 401379 402665 403195 403641 403432 401974 399826 397884 396056 393662 390667 387630
53892 387630 384779 381938 378983 375581 370897 364496 357260 350510 344417 338138 331324 324521 318108 311835
53878 311835 305589 299854 295086 291192 287800 284625 281481 278301 275285 272665 270334 267982 265511 263012
53864 263012 260424 257575 254477 251278 248027 244743 241527 238352 235025 231636 228718 226625 225062 223568
53850 223568 222027 220357 218266 215940 214452 214680 216114 217517 218493 219567 220853 221614 221252 220008 218463
53835 218463 216939 215549 214349 213294 212467 212361 213476 215557 217681 219164 219967 220241 219969 219215 218307 217542
53819 217542 216983 216680 216857 217781 219512 221752 223877 225335 226276 227584 230026 233532 237491 241423 245003
53804 245003 247860 249951 252049 255260 260005 265767 271731 277300 282173 286455 290717 295516 300762 305801
53790 305801 310048 313310 315583 316940 317637 318061 318531 319215 320097 320841 320870 319772 317495 314093 309613 304355
53774 304355 298852 293426 288165 283439 279767 276808 273232 268276 262928 258903 256799 255852 255055 253790 251709
53759 251709 248861 245850 243266 241120 239313 238265 238314 238769 238370 236649 234207 231794 229807 228474 227794
53744 227794 227309 226568 225751 225289 225103 224907 224951 225636 226571 226980 227036 227814 229756 231988 233397 233675 233159 232313
53726 232313 231605 231316 231353 231667 232733 234914 237500 239265 240042 240800 242004 242943 243026 242856 243408 244825 246562
53709 246562 248193 249566 250643 251647 253054 255105 257599 260300 263136 265875 268204 270321 272870 276044
53695 276044 279351 282550 286110 290258 294288 297409 299835 302304 304800 306473 306770 306072 305130 304281 303395
53680 303395 302381 301478 300915 300407 299352 297774 296703 297104 298655 300147 300927 301226 301181 300476 299211 298219 298028
53663 298028 298159 297975 297585 297345 297039 296250 295225 294653 294756 295201 295728 296308 296690 296432 295506 294491 293978 294059
53645 294059 294453 294845 294947 294463 293333 292067 291572 292426 294339 296485 298304 299735 300762 301307 301781 303106
53629 303106 305669 308658 310991 312565 313943 315199 316000 316627 317896 319981 322313 324825 328245 332755 337356
53614 337356 341226 344909 349412 354784 360418 366218 372523 379136 385360 390931 396150 401050 405097 407938
53600 407938 409954 411818 413838 415799 417231 417723 417254 416336 415663 415537 415689 415653 415217 414497 413673 412653 411039
53583 411039 408545 405477 402654 400784 399989 399904 400014 399839 399035 397487 395304 392766 390394 388912 388747 389503
53567 389503 390271 390591 390797 391306 391908 391971 391098 389429 387547 386226 385982 386621 387407 387834 388033 388322 388717 389156
53549 389156 389932 391513 393953 396693 398918 400079 400288 400367 401335 403585 406600 409622 412468 415612 419558
53534 419558 424284 429252 433899 438211 442834 448490 455300 462833 470809 479422 488892 499036 509554 520501
53520 520501 532146 544417 556802 568930 581095 594041 608255 623596 639730 656774 675268
53509 675268 695531 717269 739931 763178 786900 811049 835630 860558 885327 909153 931708
53498 931708 953397 974589 994969 1014098 1032267 1050265 1068591 1087419 1107034 1127519 1148183
53487 1148183 1168045 1186912 1205362 1223705 1241676 1259144 1276365 1293369 1309855 1325937 1342310
53476 1342310 1359289 1376179 1391918 1405943 1418197 1428716 1437540 1444709 1450178 1453882 1455823 1455693 1452637
53463 1452637 1446006 1436336 1424837 1411943 1397217 1380894 1364523 1349550 1335895 1322386 1307953 1291917
53451 1291917 1273819 1253795 1232852 1212173 1192236 1172884 1153927 1135278 1116825 1098552 1080659
53440 1080659 1063365 1046821 1031349 1017468 1005590 996026 989197 985173 982911 980709 977818 975003 973368
53427 973368 973285 974764 977919 982474 987578 992923 999456 1008282 1019322 1031741 1045211 1060010 1076277
53414 1076277 1093992 1113359 1134432 1156607 1179239 1202550 1227180 1253038 1279479 1306583 1335407
53403 1335407 1366691 1399957 1434174 1468969 1504952 1543125 1584167 1628136 1674759 1723847 1775217
53392 1775217 1828223 1881861 1935548 1989389 2043429 2097213 2150553 2204176 2258840 2313994 2367927
53381 2367927 2419141 2467130 2512011 2554001 2593212 2629469 2662306 2691429 2717087 2739736 2759484
53370 2759484 2776075 2789058 2797642 2800835 2798178 2789970 2776263 2756098 2728463 2693691 2653164 2607911
53358 2607911 2558382 2505491 2450901 2396017 2341308 2286799 2232692 2179332 2127102 2076565 2028257
53347 2028257 1982262 1938401 1896850 1857897 1820868 1783894 1745196 1704410 1662482 1620746 1580419
53336 1580419 1542563 1507820 1476110 1446879 1419766 1394882 1372462 1352477 1334834 1319747 1307517
53325 1307517 1297756 1289109 1280119 1270197 1259449 1247790 1234894 1221053 1207390 1194895 1183675 1173448
53313 1173448 1164223 1156170 1149289 1143616 1139380 1136568 1134787 1133958 1134655 1137207 1140926 1144928 1149448 1155584
53299 1155584 1163911 1174020 1185410 1198152 1212553 1228603 1245975 1264398 1283968 1305204 1328605
53288 1328605 1353958 1380336 1406900 1433320 1459223 1483834 1506657 1528090 1548728 1568370 1586184
53277 1586184 1601464 1613710 1622486 1627984 1631301 1633258 1633135 1629438 1621870 1611722 1600290 1587700 1573282
53264 1573282 1556306 1536212 1512896 1487125 1460158 1432742 1404794 1376129 1346964 1317610 1288084
53253 1288084 1258221 1227927 1197358 1167108 1138019 1110388 1083568 1056824 1030370 1005007 980950
53242 980950 957660 934634 911641 888325 864387 840289 817103 795496 775321 756173 737821
53231 737821 720257 703955 689932 678791 669783 661576 653846 647203 641610 635928 629224 621472 612725
53218 612725 602630 591242 579365 567492 555195 542123 528801 515828 503058 490351 478524
53207 478524 468595 460467 453122 445918 438936 432207 425385 418263 411076 404126 397456 390967 384583 378207
53193 378207 371694 364949 358042 351248 344904 339058 333379 327654 322316 318110 315222 313086 311024 308644
53179 308644 305654 301906 297884 294637 292861 292271 291990 291257 289675 287280 284598 282286 280509 278985 277661
53164 277661 276829 276383 275565 273833 271572 269561 268076 266882 265802 264865 264081 263397 262821 262428 262355 262768 263597
53147 263597 264350 264544 264341 264287 264402 264070 262941 261357 259717 258040 256428 255331 254956 254960 255131 255801 257102
53130 257102 258397 259051 259369 260125 261524 263240 265137 267218 269032 269941 270034 270184 271061 272524 274073 275447
53114 275447 276566 277262 277360 276921 276214 275447 274572 273352 271656 269624 267479 265200 262652 260016 257821 256393
53098 256393 255474 254444 252821 250611 248420 247208 247556 249120 251082 253031 254884 256091 255752 253853 251704
53083 251704 250621 250620 250801 250522 249712 248513 247341 246966 247823 249330 250433 250814 251053 251694 252610 253317 253424 252703
53065 252703 251080 248789 246399 244632 244094 244893 246300 247065 246477 244994 243546 242430 241332 240255 239777
53050 239777 240217 241068 241586 241693 242002 243097 244988 247258 249473 251340 252634 253215 253194 252957 252874 253004 253182
53033 253182 253263 253068 252235 250456 247952 245482 243823 243329 243947 245361 247096 248723 250057 250968 251135 250340
53017 250340 249021 248120 248249 249233 250525 251670 252307 252136 251186 249920 248894 248440 248659 249436 250422 251324 252230
53000 252230 253320 254362 254938 255175 255673 256582 257290 257219 256455 255420 254472 254023 254448 255497 256334 256571 256816 257795
52982 257795 259349 260751 261616 262085 262418 262862 263624 264617 265447 265999 266728 268040 269666 270925 271345 270812 269565
52965 269565 268328 267982 268670 269606 270128 270496 271269 272418 273571 274564 275143 274568 272395 269388 266896 265398
52949 265398 264294 263000 261613 260530 259984 260004 260332 260413 259879 259073 258666 258836 259155 259209 258934 258472 258056 257905
52931 257905 257853 257264 255726 253679 251930 250768 249986 249535 249546 249805 249845 249607 249510 249804 250266 250617 250882 251292 252077
52912 252077 253264 254426 254793 253972 252471 251193 250529 250248 250052 249816 249505 249287 249588 250602 251864 252716 253014
52895 253014 253026 252898 252769 253118 254384 256317 258298 260169 262178 264207 265666 266162 265742 264535 262703 260708
52879 260708 259030 257629 256224 255039 254591 254753 254714 254051 253258 253074 253773 255219 257099 258990 260743 262882
52863 262882 266063 269973 273287 274967 275122 274499 273631 272683 271656 270440 268925 267175 265254 263043 260604
52848 260604 258524 257203 255960 253703 250550 247859 246413 245476 244057 242189 240470 239103 238072 237554 237448
52833 237448 237037 235933 234899 234967 236097 237534 239172 241586 244719 247460 248757 248528 247318 245714 244281
52818 244281 243486 243228 242829 241842 240667 240090 240501 241844 244103 247441 251828 256765 261346 264476 265205 263317
52802 263317 259688 255769 252471 249673 246917 244318 242496 241754 241673 241531 240817 239322 237113 234598 232404
52787 232404 231009 230525 230776 231344 231631 231303 230761 230778 231597 232853 234394 236474 238858 240582 241168 241388 242068
52770 242068 242800 242770 242315 242435 242966 242600 240910 239115 238387 238433 238386 238181 238248 238478 238360 237874 237459 237244 236937
52751 236937 236413 235937 235801 236164 237225 239126 241595 243969 245737 246911 247829 248707 249507 250156 250807 251740 252989
52734 252989 254217 255108 255762 256530 257541 258619 259640 260701 261908 263143 264033 264071 262989 261249 259909 259591
52718 259591 259770 259485 258579 257700 257160 256520 255385 253961 252556 251081 249416 247846 246798 246408 246611 247363
52702 247363 248498 249627 250446 250969 251350 251742 252406 253578 255047 256209 256778 257069 257337 257263 256470 255290 254547
52685 254547 254689 255456 256338 257072 257660 258153 258514 258661 258643 258681 258852 258809 258065 256578 254799 253159 251788 250725
52667 250725 250027 249620 249407 249594 250476 251807 252859 253248 253299 253408 253578 253867 254686 256220 258012 259703 261830
52650 261830 265208 269621 273672 275958 276075 274530 272170 269768 267772 266214 264855 263439 261825 260115
52636 260115 258833 258757 260204 262557 264762 266259 267244 268150 269235 270738 273060 276469 280549 284017 285306
52621 285306 283628 279652 275012 271026 267944 265400 263262 261681 260500 259150 257381 255811 255383 256300 257774
52606 257774 258944 259701 260353 260749 260380 259377 258774 259402 260979 262707 264342 266027 267434 267858 267224 266280
52590 266280 265659 265361 265270 265577 266322 267029 267232 267061 267014 267372 268100 269102 270300 271514 272400 272515 271610 270118
52572 270118 269074 269106 269602 269394 268213 266819 265757 264792 263804 263327 263644 264059 263751 262893 262298 262292 262609 263079
52554 263079 263715 264203 264006 263060 261833 260611 259238 257771 256958 257557 259251 260629 260553 259432 258812 259651 261310
52537 261310 262508 262810 262692 262505 262157 261853 262242 263521 265008 266048 266865 268101 269827 271385 272064 271733
52521 271733 271033 270993 272093 273676 274658 274880 275146 275908 276656 276980 277438 278862 281325 284299 287373 290267 292584
52504 292584 294067 294791 294709 293463 291138 288652 286822 285421 283753 281760 279939 278521 277415 276689 276445
52489 276445 276363 275985 275284 274420 273209 271400 269334 267745 267030 267219 268349 270235 272123 273299 273986 274963
52473 274963 276372 277569 278201 278670 279460 280556 281708 282812 283913 285269 287466 290990 295508 299909 303169
52458 303169 304985 305619 305437 304615 303055 300609 297459 294017 290333 286121 281732 278450 277053 276519 275128
52443 275128 272705 270858 270889 272325 273744 274309 274145 273783 273626 273674 273506 272736 271525 270421 269720 269353 269250
52426 269250 269370 269468 269331 269213 269534 270214 270866 271561 272790 274543 276108 276954 277298 277639 278254 279309 280979
52409 280979 283264 286186 290199 295843 302884 310506 318593 328033 339180 350614 359999 365921 368356 367756
52395 367756 364341 358324 350330 341430 332920 325919 320881 317390 314575 311792 308988 306501 304586 303099
52381 303099 301717 300446 299657 299464 299389 299088 299170 300723 304004 308108 311963 315211 318072 320882 323970 327493
52365 327493 331099 334080 336071 337268 337812 337409 335909 333956 332610 332387 332962 333775 334702 336045 337918 339824
52349 339824 341023 341395 341726 342900 344972 347243 349064 350316 351321 352601 354542 356956 359234 361229 363659
52334 363659 367124 371171 375073 379229 384817 392147 400315 408577 417050 425862 434651 443428 453003 463920
52320 463920 475628 487357 499161 511384 523628 535130 545893 556752 568440 581216 595196
52309 595196 610352 626170 641925 657489 673526 690710 708936 727348 745040 761788 778175
52298 778175 794880 811821 828221 843581 858156 872183 884990 895296 902286 906133 907619 907609 906809
52285 906809 905671 904378 902949 901259 898956 895664 891503 887201 883478 880423 877667 875054 872965 872013
52271 872013 872495 874065 875980 877797 879845 882714 886375 890203 893970 898290 903820 910447 917703 925704
52257 925704 935161 946445 958987 971759 984283 997108 1011212 1026843 1042986 1058134 1071410 1082706
52245 1082706 1091966 1098913 1103531 1106297 1107759 1108317 1108471 1108692 1108781 1107882 1105434 1101650 1096764 1090452 1082574
52230 1082574 1073988 1065888 1058462 1050857 1042417 1033404 1024469 1015938 1007821 1000169 993134 986700 980510 974091
52216 974091 967379 961015 955935 952644 950981 950514 950890 951890 953540 956139 959730 963521 966331 967773 968540
52201 968540 969461 970876 973065 976441 980890 985606 990166 995184 1001257 1007801 1013648 1018391 1022406 1025821
52187 1025821 1028310 1029728 1030165 1029466 1027395 1024253 1020626 1016559 1011709 1006335 1001333 996989 992387 986503
52173 986503 979494 972529 966644 962030 958211 954594 950941 947474 944550 942323 940895 940642 941918 944369
52159 944369 946905 948600 949452 950159 951331 952978 954613 955744 956339 956815 957535 958442 959365 960544 962521 965523
52143 965523 969198 972952 976292 978821 980213 980339 979371 977707 975818 974117 972794 971890 971596 972327 974337
52128 974337 977455 981498 986840 994255 1004200 1016552 1031016 1047439 1065546 1084656 1103907 1122809
52116 1122809 1141451 1160118 1178735 1196819 1214081 1230923 1247994 1265324 1282267 1298401 1314032
52105 1314032 1329594 1345018 1360053 1374821 1389608 1404437 1419300 1434460 1449858 1464329 1476096
52094 1476096 1484154 1488679 1490099 1488352 1483284 1475274 1465118 1453533 1441009 1428015 1415168 1403162
52082 1403162 1392438 1382737 1373142 1362879 1352106 1341639 1331983 1322972 1314359 1306369 1299567 1294458 1291249
52069 1291249 1289712 1289225 1289272 1290035 1292269 1296475 1302371 1309198 1316362 1323803 1332012 1341753 1353484 1366918
52055 1366918 1381275 1395918 1410461 1424303 1436482 1446217 1453369 1458275 1461334 1462800 1462700 1460856 1457183
52042 1457183 1452121 1446551 1441159 1435986 1430595 1424447 1417061 1408166 1397971 1387158 1376433 1366089 1356007
52029 1356007 1345862 1335265 1323867 1311445 1297886 1283149 1267439 1251372 1235669 1220626 1206110
52018 1206110 1192108 1178931 1166727 1155127 1143747 1132874 1123274 1115268 1108294 1101459 1094326 1086930
52006 1086930 1079122 1070181 1059245 1045984 1030668 1013674 995222 975711 956060 937481 920847 906266
51994 906266 893095 880413 867763 855445 843729 831802 818151 802377 786078 771250 758129
51983 758129 745286 731593 717245 702836 688395 673728 659086 644938 631440 618577 606575
51972 606575 595847 586692 579345 574194 571642 571767 574236 578456 583796 589891 596784 604498 612356 619061
51958 619061 623637 625932 625983 623407 617975 610604 603071 596607 591157 586160 581547 577765 575187 574038 574777
51943 574777 578042 584028 592195 601790 612437 623994 636113 648342 660577 672897 684890 695623
51931 695623 704508 711778 717761 722147 724487 725157 725213 725392 725877 726981 729339 733253 738503 745042 753026
51916 753026 761407 766980 765820 755979 738522 716139 691399 666362 642897 622504 605800 592616
51904 592616 582605 575457 570633 567372 565165 563841 562845 560750 555946 547829 537065 524806 511989
51891 511989 499325 487405 476577 467023 459058 453005 448703 445698 444145 444969 448688 454511 461174 468336
51877 468336 476540 486047 496458 507359 518608 529746 539703 547329 551894 553039 550800 545927 539721
51864 539721 533180 526457 519324 511912 504866 498989 494881 492709 492108 492452 493286 494383 495431 495902 495263
51849 495263 493144 489396 484284 478534 472807 467082 460937 454447 448366 443348 439421 436333 433905 431817
51835 431817 429588 427201 425441 425264 426965 430186 434383 438935 442998 445735 446739 446123 444293 441783 439092
51820 439092 436561 434504 433447 433827 435290 436788 437766 438912 441224 444563 447672 449470 449771 448788 446646
51805 446646 443711 440887 439025 438117 437397 436290 435005 434139 433892 433876 433664 433258 432910 432615 431991 430643 428491
51788 428491 425792 423036 420853 419733 419661 420079 420272 419794 418641 417240 416229 415981 416238 416434 416513 417265 419747
51771 419747 424455 431078 438873 447262 456278 466442 477986 490070 500933 508907 513223 514003 511867
51758 511867 507603 501825 494739 486466 477623 469150 461409 453906 446195 438632 431851 425937 420695 416442
51744 416442 413865 413071 413393 414310 416044 418962 422791 426863 430967 435557 441087 447410 453943 460119 465455
51729 465455 469375 471366 471466 470390 469075 468342 469012 471783 476423 481279 484206 484156 481570 477426 472546
51714 472546 467903 464729 463659 464048 464534 464143 462612 460060 456875 453857 452053 452279 454782 459000 463467
51699 463467 466340 466582 464592 461480 457986 454530 452081 452184 455738 461913 468448 472883 473686 470669 464745
51684 464745 457325 449710 442798 437072 432647 429369 427041 425663 425469 426745 429421 432670 435063 435645 434973
51669 434973 434723 436063 438792 442320 446934 453512 462281 472453 482923 492693 500613 505396 506321 503725
51655 503725 498724 492684 486975 482813 481040 482078 485996 492324 499809 506715 511526 513253 511209 505052
51641 505052 495276 483275 470610 458299 446890 436851 428564 422117 417406 414370 412928 412748 413279
51628 413279 414020 414633 414980 415204 415669 416579 417659 418416 418680 418699 418638 418212 416870 414258 410459 406028 401936
51611 401936 399189 398099 397854 397116 395308 393148 391685 390949 389986 388248 386530 386174 387585 390007 392735
51596 392735 396093 401052 408264 417777 429368 442533 455977 467465 474664 476353 473006 466447 458978
51583 458978 452467 447819 445056 443917 444458 447148 452587 461194 472994 487400 503203 519067 534288
51570 534288 549117 564439 581131 599398 618212 635438 649124 659214 667886 678052 691735 709997
51558 709997 733806 764076 800700 841896 884540 924877 959183 984628 1000138 1006334 1004398 994974
51546 994974 978130 954027 923494 888073 849636 809810 769720 730323 692872 658714 628555
51535 628555 602181 579055 559005 542262 529027 519075 511660 505797 500913 497228 495299 495168 496223
51522 496223 497792 499416 500479 500210 498401 495737 492990 490122 486545 482055 477094 472237 467787 463802
51508 463802 460120 456307 451867 446672 441062 435553 430541 426196 422447 419071 415922 413000 410207 407274
51494 407274 404150 401322 399351 398097 396775 394991 393407 393124 394447 396480 397883 397835 396362 394135 392112
51479 392112 391035 390863 390792 390169 389283 388897 389137 389422 389498 389753 390187 389899 388229 385852 383937 382633 381229
51462 381229 379511 378025 377118 376691 376909 378163 380133 381804 382710 383331 384033 384553 384898 385784 387571 389693
51446 389693 391895 395273 401182 409751 420352 432888 447336 462250 474979 483695 488524 490762 491802
51433 491802 492918 495058 498104 500614 500700 497177 489967 479915 468436 457030 446741 437980 430841 425458
51419 425458 422081 420799 421202 422314 423156 423406 423350 423204 422874 422428 422208 422243 422100 421677 421629 422461 423649 424224
51401 424224 423965 423507 423613 424849 427561 431504 435702 439337 442596 446155 450199 454674 460185 467656 477088
51386 477088 487523 498416 510375 524471 541558 562411 587788 617953 652568 691273 734019
51375 734019 780769 831234 884754 939643 992511 1039002 1075717 1101198 1115171 1117663 1109172 1090839
51363 1090839 1063770 1028520 985835 937629 886747 835874 786915 741092 699075 660990 626626
51352 626626 595801 568498 544792 524671 507814 493429 480499 468288 456551 445246 434279
51341 434279 423660 413762 405301 399006 395108 392991 391504 389818 387891 385915 383697 381006 378302 376425
51327 376425 375578 375191 374859 374858 375579 376935 378613 380462 382411 384341 386268 388384 390736 393140 395547 398117
51311 398117 400712 402636 403193 402367 400802 399208 397856 396469 394554 392002 389354 387278 385805 384389 382592
51296 382592 380351 377651 374466 371122 368231 366055 364267 362523 360886 359559 358563 357900 357720 358117 359121
51281 359121 361057 364571 369972 376703 383630 389702 394266 397154 398770 399912 401182 402551 403575 403982
51267 403982 404071 404599 406228 408920 411906 414345 415882 416467 416063 414909 413720 413007 412393 411192 409527 408155
51251 408155 407272 406242 404643 402757 400810 398509 395725 392977 390771 389019 387501 386409 385919 385663 385068
51236 385068 383963 382457 380562 378343 376168 374437 373262 372619 372549 373000 373836 375205 377401 380084 382151
51221 382151 382915 383044 383798 385619 387981 390409 393038 396163 399707 403211 406108 407984 408814 408923 408645 408147
51205 408147 407672 407767 409012 411577 415102 418853 422002 424024 424981 425225 424854 423701 421844 419712 417590 415434
51189 415434 413295 411518 410367 409843 409956 410740 411900 413004 414168 415946 418301 420328 421402 421971 422670
51174 422670 423229 422889 421533 419735 417992 416472 415331 414578 413699 412044 409761 407969 407816 409486 412170
51159 412170 414919 417523 420486 424034 427370 429325 429635 429055 428199 426956 425218 423403 421816 420077 417681
51144 417681 414708 411545 408320 405000 401665 398337 394958 391848 389666 388577 388020 387726 388251 389966 392204
51129 392204 394130 395906 398198 401017 403891 406775 409970 413388 416708 420027 423595 427111 430047 432537
51115 432537 435178 438054 440631 442501 443598 443933 443814 444141 445624 447745 449292 449906 450385 451443 452908
51100 452908 454211 454935 454821 453871 452590 451521 450501 448942 446849 444896 443450 442223 441019 440116 439711
51085 439711 439576 439566 439937 440882 442122 443173 443763 443955 444197 445193 447291 449973 452365 454154 455599 456805
51069 456805 457658 458394 459605 461607 464376 468087 473041 479079 485759 493232 502289 513420 526427 540917
51055 540917 556348 571443 584560 595100 603984 612597 622060 633625 648428 665891 683111 696923
51043 696923 706343 712347 715727 716061 712551 704990 693798 679918 665023 651330 640667 633515 628793
51030 628793 624413 618302 609447 598421 586995 577177 570326 566769 565943 566884 568665 570550 571987 572807
51016 572807 573418 574600 576985 580794 585928 592080 598838 605968 613656 622373 632528 644357 657877 672646
51002 672646 687704 702105 715485 727935 739494 750032 759370 767214 773255 777640 780934 783135 783242
50989 783242 780576 776182 771989 768762 765885 763087 761282 761471 763908 768806 776917 788662 803268 819293
50975 819293 835589 851472 866633 881531 897442 915645 936831 961527 990432 1023874 1061483
50964 1061483 1102947 1148585 1198538 1251859 1307197 1364168 1423261 1484320 1545699 1605060 1660650
50953 1660650 1711717 1757997 1799002 1833867 1861980 1883675 1900049 1911981 1919683 1923292 1923617 1922110
50941 1922110 1920466 1920304 1922551 1926462 1929365 1927968 1920259 1906413 1888255 1867973 1846900 1825080 1801909
50928 1801909 1777082 1750642 1722283 1691214 1656862 1619208 1578230 1533630 1485588 1435307 1384436
50917 1384436 1334241 1285621 1239425 1196210 1156060 1119025 1085480 1055540 1028482 1003333 979892
50906 979892 958685 939977 923229 907558 892434 877934 864522 852559 841981 832626 824787 818967
50894 818967 814918 811546 808143 805259 803800 803680 803944 804018 804148 804710 805678 806881 808351 810290 812978 816815
50878 816815 822183 829171 837502 846755 856567 866761 877361 888507 900320 912944 926605 941447
50866 941447 957407 974542 993347 1014345 1037496 1062588 1090159 1121312 1156532 1195393 1237686
50855 1237686 1284096 1335482 1392292 1455112 1524951 1602323 1686766 1777926 1876430 1982902 2096748
50844 2096748 2216789 2342536 2473760 2609152 2746380 2883130 3017016 3144623 3261848
50835 3261848 3365346 3452806 3522004 3570991 3599711 3610395 3605707 3587180 3556086 3515190 3468838
50824 3468838 3421434 3376290 3335731 3301700 3275910 3259296 3251212 3249260 3250080 3250271 3246488 3235205 3213244
50811 3213244 3178853 3131915 3073011 3002543 2920705 2827886 2725100 2614443 2499156 2382810
50801 2382810 2268287 2157780 2053431 1957151 1869708 1790765 1720153 1658505 1606227 1562502 1525980
50790 1525980 1496120 1473224 1457211 1446907 1440636 1437156 1435943 1436788 1439235 1442337 1444871 1445893 1445082
50777 1445082 1442630 1438818 1433745 1427380 1419770 1411085 1401335 1390087 1376713 1361072 1343626 1324694 1303878
50764 1303878 1280737 1255843 1230654 1206243 1182626 1159517 1137303 1116892 1098809 1082859 1068696
50753 1068696 1056469 1046736 1039801 1035393 1033136 1033195 1036146 1042186 1050898 1062029 1076154 1094158 1116321
50740 1116321 1142385 1172379 1206871 1246304 1290528 1339136 1391882 1448583 1508866 1572222 1638226
50729 1638226 1706524 1776626 1847778 1919063 1989748 2059581 2128552 2196180 2261074 2321306 2375024
50718 2375024 2420608 2456483 2481161 2493414 2492339 2477643 2450284 2412745 2368338 2320363 2272065
50707 2272065 2226874 2187786 2156402 2132921 2117042 2108381 2106057 2108520 2114001 2120800 2127011 2130383 2128584
50694 2128584 2119431 2101033 2072322 2033703 1986945 1934335 1878191 1820957 1765010 1711998 1662735
50683 1662735 1617862 1578160 1544048 1515268 1491474 1472765 1459383 1451301 1448568 1451824 1461946 1479269
50671 1479269 1503370 1533484 1568712 1607885 1649497 1691909 1733483 1772650 1808139 1839270 1866034
50660 1866034 1888946 1908850 1926713 1943326 1959037 1973766 1987241 1999233 2009642 2018486 2025901 2032174
50648 2032174 2037777 2043295 2049388 2056943 2067227 2081629 2101112 2125954 2156027 2190968 2229936 2271565
50636 2271565 2314613 2358539 2403114 2447536 2490236 2529602 2564782 2595956 2624068 2650256 2675365
50625 2675365 2699985 2724486 2747881 2765914 2771097 2756356 2719671 2665355 2601231 2534983 2472420
50614 2472420 2417331 2371664 2335986 2310253 2294217 2287150 2287719 2294404 2305642 2319315 2332494 2342014
50602 2342014 2345194 2339896 2324392 2297676 2259854 2212032 2155909 2093508 2027016 1958533 1889918 1822768
50590 1822768 1758302 1697210 1639789 1586217 1536492 1490223 1446900 1406388 1368797 1333883 1301097
50579 1301097 1270429 1242734 1218989 1199487 1183947 1172052 1163622 1158545 1156767 1158214 1162577 1169343
50567 1169343 1178071 1188395 1199856 1212145 1225555 1240740 1257871 1276467 1296256 1317801 1342032
50556 1342032 1369490 1400219 1433929 1469996 1507642 1546451 1586432 1627249 1667719 1706444 1742850
50545 1742850 1777441 1811160 1844627 1877807 1910384 1942671 1976160 2012853 2054028 2099977 2150764
50534 2150764 2206536 2267039 2331606 2400089 2473250 2551966 2636690 2728047 2827177 2934699 3049689
50523 3049689 3170269 3294863 3422317 3551152 3679360 3804706 3924652 4036114 4135788 4220548
50513 4220548 4287262 4332794 4355009 4353654 4329688 4283949 4217100 4130634 4027261 3910388 3783950
50502 3783950 3652690 3521775 3395892 3279078 3175269 3088165 3020245 2972381 2944570 2936546
50492 2936546 2947568 2976161 3020207 3076691 3140905 3206209 3264950 3309662 3333858 3332755 3304064
50481 3304064 3248039 3166699 3063342 2942835 2811453 2675424 2539389 2406297 2278334 2157339
50471 2157339 2044473 1940148 1844481 1757588 1679417 1609679 1548134 1494643 1448749 1409327 1374829
50460 1374829 1343847 1315447 1289229 1265328 1244223 1226193 1210890 1197685 1186487 1177974 1172852 1171143
50448 1171143 1172334 1175906 1181339 1187936 1195256 1203790 1214673 1228498 1244716 1262241 1280115 1297394
50436 1297394 1312973 1326170 1337323 1347393 1357073 1366553 1375917 1385289 1394609 1403736 1412831 1422364 1432646
50423 1432646 1443628 1455216 1467588 1481054 1495823 1512117 1530465 1551759 1576965 1606795 1641761
50412 1641761 1682471 1729543 1782988 1841834 1904789 1971177 2040773 2112679 2185002 2255913 2324495
50401 2324495 2390102 2451380 2506574 2554603 2595070 2627079 2648457 2656445 2649026 2625643 2586944 2534198
50389 2534198 2469067 2393891 2311859 2226495 2140937 2057964 1980531 1911486 1852426 1803377 1764051
50378 1764051 1734984 1717023 1710196 1713673 1726373 1746754 1772191 1799301 1824992 1846706 1861815 1867568
50366 1867568 1861861 1843806 1813699 1772924 1723751 1668569 1609225 1547523 1486006 1427364 1372954
50355 1372954 1322558 1275690 1232379 1192562 1155663 1121310 1089917 1062133 1038216 1018418 1003468
50344 1003468 994182 990741 992573 998443 1006268 1013279 1016810 1014890 1006273 990885 970752 949641 930708
50331 930708 914571 900225 887400 877122 870149 865932 863433 862257 862571 864376 867358 871251 876059
50318 876059 881913 888766 896158 903322 909690 915236 920119 924153 927072 929328 932170 936662 942810 949786
50304 949786 956700 962921 967960 971561 974041 976363 979610 984197 989554 994678 999157 1003566 1008598 1013880
50290 1013880 1018069 1020411 1021848 1024157 1028009 1032159 1034486 1033504 1028943 1021486 1012465 1003592 996418 991828
50276 991828 990126 991422 995601 1001888 1008993 1016010 1023027 1030605 1038881 1047432 1055758 1063428 1069906 1074812
50262 1074812 1078523 1082049 1086112 1090710 1095884 1102471 1111548 1123292 1136925 1151782 1167971 1185890 1205648
50249 1205648 1227265 1251023 1277022 1304370 1331229 1355836 1377451 1396434 1413754 1430476 1447401
50238 1447401 1464823 1482580 1500218 1516841 1530674 1539138 1539878 1531922 1515815 1492867 1464532 1432484
50226 1432484 1398770 1365528 1334471 1306698 1282822 1263115 1247405 1234656 1222572 1207879 1187653
50215 1187653 1160890 1128942 1094370 1059438 1025491 993345 963779 937501 914723 894973 877530
50204 877530 862098 848845 837613 827422 817199 806939 797615 789863 783246 776968 770799 764987 759670
50191 759670 754816 750475 746703 743399 740487 738020 735843 733426 730435 727246 724541 722614 721429 721067
50177 721067 721524 722281 722662 722663 722943 723995 725798 728244 731322 734718 737764 740112 742207 744871 748597 753313
50161 753313 758604 764038 769433 774868 780408 786038 792079 799367 808548 819359 831041 843319 856288
50148 856288 869425 881476 891589 900020 907556 914885 922764 932143 943688 957616 974428 995365
50136 995365 1021820 1054713 1094732 1142461 1197535 1257991 1321095 1384652 1447151 1507137 1563333
50125 1563333 1615346 1663697 1709262 1753184 1796905 1841102 1884152 1922213 1951165 1968216 1971813
50114 1971813 1961029 1935804 1897455 1848338 1790997 1727810 1661169 1593474 1526835 1462857 1402697
50103 1402697 1347180 1296869 1252025 1212363 1176881 1144240 1113493 1084345 1056640 1029968 1004080
50092 1004080 979525 957435 938579 922839 909671 898853 890543 884669 880506 877096 874017 871467
50080 871467 869522 867698 865621 863832 863291 864038 865006 865451 865988 867686 870589 873821 876857 879907 883072
50065 883072 885966 888459 891049 894076 897112 899592 901555 903181 903912 902813 899738 895558 891215 887115
50051 887115 883456 880476 878088 875775 873262 870975 869504 868867 868663 868790 869681 871931 876050 882489 891497
50036 891497 902771 915450 928689 942197 956201 970946 986392 1002375 1018888 1035968 1053237
50025 1053237 1069719 1084280 1096304 1106068 1114698 1123779 1134516 1146895 1159930 1173119 1187442 1204451
50013 1204451 1224627 1247332 1272172 1299464 1328970 1358971 1387105 1411739 1432281 1448942 1462884
50002 1462884 1476180 1490770 1507397 1525637 1544317 1561192 1572620 1574570 1564322 1541219 1506328
49991 1506328 1462094 1411987 1359407 1306500 1254157 1202918 1153299 1105519 1059737 1016713 977571
49980 977571 942826 912174 885304 862131 842092 823998 807069 791632 778472 767887 759625 753199
49968 753199 747847 742625 737073 731602 726927 723353 720910 719795 720175 721689 723622 725672 728350 732602
49954 732602 739101 747802 758056 769154 780672 792170 802742 811227 817039 820545 822710 824503 826422
49941 826422 827993 827733 824162 817142 807872 797538 786450 774463 761524 747503 732221 716131 700479
49928 700479 686307 673712 662468 652868 645360 639796 635673 632838 631310 630742 630756 631659 634054 637812
49914 637812 642127 646607 651596 657237 662959 668265 673529 679549 686697 694875 704057 714342 725504 736951
49900 736951 748246 759402 770450 780857 789640 796113 800292 802520 802848 801028 797024 791115 783442
49887 783442 773750 761853 748220 733955 720196 707581 696149 685594 675621 666075 656750 647355
49875 647355 637909 629061 621607 615641 610551 605916 602011 599289 597817 597442 598140 599866 602371 605524 609704
49860 609704 615552 623452 633340 644779 657106 669758 682683 696143 709902 722931 734138 743091
49848 743091 749844 754600 757952 760903 763880 765782 764612 759107 749550 737258 723815 710670 698843
49835 698843 688691 680135 673080 667480 663127 659713 657052 655049 653554 652482 651924 651945 652571 654245 657946
49820 657946 664384 673249 683624 694826 706366 717457 727348 736133 744567 752961 760810 767549 773154
49807 773154 777811 781455 783739 784138 782094 777458 770820 762985 754210 744478 734428 725191 717134 709473
49793 709473 701467 693295 685330 677266 668732 660417 653768 649549 647227 645790 644773 644435 645223 647163 649571
49778 649571 651351 651802 651236 650747 651443 653931 658353 664609 672457 681508 691163 700519 708500 714330 718001
49763 718001 720148 721405 721910 721524 720391 718959 717307 714702 710152 703354 694764 684872 673897 662325
49749 662325 651138 641085 632167 624238 617666 612743 608812 604850 600932 598297 597722 598455 599058 598770 597753
49734 597753 596511 595577 595465 596458 598513 601549 605641 610757 616556 622676 629080 635977 643647 652497 662903
49719 662903 674682 686908 698535 708971 717889 724853 729618 732568 734326 734897 733657 730189 724757
49706 724757 717875 709856 701043 692140 683944 676794 670549 665092 660613 657312 655010 653249 651782 650870
49692 650870 651056 652693 655751 660015 665344 671632 678535 685423 691849 698077 704876 712621 720815 728864
49678 728864 737171 746910 758655 771818 785725 800604 816714 832740 845852 853632 855619 853048
49666 853048 847694 841220 835070 830258 827098 825279 824276 823714 823386 822778 820512 814539 803502 788131
49652 788131 771043 754959 741122 729293 718757 709060 700118 692135 685554 680910 678536 678234 679221
49639 679221 680559 681856 683396 685366 687163 687850 687208 685848 684257 682232 679400 675794 671612 666865 661631
49624 661631 656385 651675 647643 644149 641176 638809 636985 635573 634605 634142 634095 634467 635590 637683 640188
49609 640188 641992 642475 642078 641744 642032 642889 644016 645192 646358 647659 649387 651648 654067 655996 657205
49594 657205 658161 659404 660746 661478 661479 661660 662914 664862 666148 666011 665087 664526 664766 665471 666327 667433 668948
49577 668948 670699 672315 673624 674881 676592 679068 682162 685477 688949 693113 698788 706437 715791 726008
49563 726008 736254 746286 756429 766871 777006 785615 791633 794606 794541 791766 787061 781538 776081
49550 776081 770956 766077 761504 757517 754348 752017 750427 749504 749249 749624 750391 751108 751406 751230 750668 749699
49534 749699 748464 747742 748716 752015 757231 763632 771104 780118 790930 803271 816957 832585 851257
49521 851257 873395 897798 921839 942645 958149 967398 970553 968945 964797 960249 956556 954330 954166
49508 954166 956406 960322 964238 966626 966680 963788 957233 946903 933831 919487 904726 889831 875299
49495 875299 862036 850797 841770 834672 828939 823868 818935 814132 809881 806574 804320 803074 802853 803793
49481 803793 806016 809381 813373 817335 820842 823734 825884 827226 828066 828978 830256 831729 833257 835078 837384
49466 837384 839847 841875 843215 844078 844909 846247 848509 851456 853971 854834 853749 851440 848731 845854 842621
49451 842621 838916 834805 830325 825417 820125 814754 809662 804851 799986 795036 790736 788091 787428 788258 790034
49436 790034 792622 796031 800235 805489 812278 820620 829853 839513 850025 862069 875516 889441 903000
49423 903000 915983 928872 942753 958596 975687 990862 1000140 1001552 996235 987053 976759 967223
49411 967223 959271 952651 946634 941207 937528 937010 940237 946915 956426 968052 981011 994723 1008996
49398 1008996 1023683 1038367 1052692 1066827 1081190 1095739 1109810 1122688 1133978 1143429 1150708 1155606
49386 1155606 1158320 1159254 1158511 1155640 1149962 1141246 1130153 1118021 1106084 1094841 1084219 1074331 1065869
49373 1065869 1059608 1055669 1053503 1052552 1052707 1054148 1057023 1061377 1067070 1073494 1079564 1084257 1087082 1087884 1086474
49358 1086474 1082879 1077736 1071865 1065306 1057306 1047526 1036987 1027471 1020086 1014555 1009782 1005007 1000571 997699
49344 997699 997376 999323 1002124 1004383 1005653 1006279 1006602 1006424 1005099 1002103 997652 992681 988065 983962 980187
49329 980187 976972 974802 973596 972791 972410 973353 976259 980721 986088 992460 1000314 1009552 1019721 1030995
49315 1030995 1044228 1059954 1077843 1097193 1117419 1137785 1156798 1172103 1181104 1182069 1175074 1162027
49303 1162027 1145655 1128372 1111707 1096217 1081605 1067347 1053574 1041231 1031254 1023908 1019009 1016250
49291 1016250 1014967 1014181 1013429 1013125 1013432 1013118 1010262 1004039 995276 985460 975823 967204 959981 954003 949071
49276 949071 945534 943942 944232 945903 948937 953868 960797 968999 977689 986604 995573 1003998 1011052 1016130
49262 1016130 1019035 1020078 1020050 1019669 1019036 1018231 1018461 1021865 1029777 1041695 1056256 1072591 1090093 1107220
49248 1107220 1121275 1129505 1130341 1123843 1111324 1094521 1074917 1053904 1033376 1015442 1001097 989476
49236 989476 978977 969056 960660 955110 952945 953755 956646 960730 965495 970969 977491 985277 994263 1004277
49222 1004277 1015134 1026442 1037453 1047371 1055906 1063425 1070414 1076801 1081961 1085337 1086871 1086853 1085790 1084660
49208 1084660 1084960 1087972 1093972 1102323 1112289 1123498 1135879 1149553 1164748 1181377 1198626 1215342
49196 1215342 1230946 1245740 1260293 1274766 1288856 1302119 1314252 1325270 1335410 1344678 1352611 1358818
49184 1358818 1363741 1368529 1374138 1380865 1388771 1398163 1409530 1423346 1440119 1460428 1484737 1513266
49172 1513266 1546186 1583883 1626887 1675132 1726488 1775725 1815735 1841012 1850553 1847492 1836538 1822201
49160 1822201 1808427 1797995 1791397 1787040 1783077 1778661 1773508 1767317 1760310 1753652 1748579 1745509 1744482
49147 1744482 1745911 1750109 1756408 1763596 1771284 1780307 1791695 1805590 1821165 1837279 1853175 1868825
49135 1868825 1884678 1901060 1917901 1934981 1952130 1969003 1985067 2000058 2014254 2028048 2041535
49124 2041535 2054740 2067986 2081706 2096143 2111469 2128010 2146096 2165847 2187229 2210013 2233634
49113 2233634 2257695 2283032 2311894 2346651 2388820 2439940 2502792 2580071 2670673 2767309 2859005
49102 2859005 2937989 3005948 3073400 3150257 3234100 3307205 3347017 3342011 3299146 3237151 3172820
49091 3172820 3111933 3050052 2979887 2898477 2809615 2721169 2640389 2570962 2513242 2466194 2428773
49080 2428773 2400020 2378652 2363019 2351496 2342794 2335834 2329417 2322247 2313488 2303283 2292653 2282815
49068 2282815 2274488 2267618 2261635 2256017 2250680 2245716 2240846 2235410 2229043 2222150 2215522 2209622 2204438 2199876
49054 2199876 2196031 2193072 2191029 2189737 2189020 2189004 2190176 2192877 2196745 2201007 2205487 2211050 2218881 2229469
49040 2229469 2242245 2255672 2267465 2275328 2278262 2277267 2274569 2272180 2271233 2272153 2274922 2279268 2284990 2291976
49026 2291976 2299665 2306790 2312180 2315667 2317806 2318893 2318887 2318213 2317946 2318895 2320945 2323547 2326532 2330246 2335166
49011 2335166 2341670 2349872 2359420 2369488 2379253 2388472 2397644 2407662 2419235 2432381 2446330 2459976
48999 2459976 2472445 2483379 2492863 2501255 2508915 2515849 2521683 2526141 2529488 2532276 2534738 2536599 2537428 2536918
48985 2536918 2534936 2531661 2527701 2523816 2520370 2517160 2513783 2509966 2505567 2500488 2494661 2488041 2480582 2472340
48971 2472340 2463543 2454382 2444791 2434616 2423934 2413075 2402431 2392487 2383914 2377310 2372777 2369979 2368607
48958 2368607 2368660 2370422 2374403 2381142 2390623 2401927 2413937 2426419 2439973 2454886 2470604 2486595 2503100
48945 2503100 2520478 2538241 2555449 2571996 2588883 2607168 2627164 2648911 2672892 2699775 2729561
48934 2729561 2761491 2794910 2829963 2867255 2906999 2948715 2991771 3035972 3081529 3128607 3177102
48923 3177102 3226865 3278027 3331044 3386469 3444531 3504764 3566016 3627033 3687147 3746312 3804465
48912 3804465 3861184 3916199 3969992 4023424 4076702 4129112 4179853 4228733 4275841 4321022 4364164
48901 4364164 4405655 4445885 4484448 4520628 4554764 4588367 4622450 4656289 4688170 4716698 4740905
48890 4740905 4759864 4773274 4782206 4788226 4791694 4791691 4787702 4780582 4771582 4761057 4748455 4733021 4714250
48877 4714250 4692070 4666912 4639183 4608494 4573880 4535065 4492937 4448443 4401521 4351595 4298719
48866 4298719 4243738 4187705 4131648 4076616 4023340 3971851 3921799 3873096 3825974 3780604 3736986
48855 3736986 3695101 3654906 3616328 3579462 3544594 3511825 3481014 3452333 3426566 3404472 3386102
48844 3386102 3371095 3359348 3350971 3345802 3343449 3343654 3346262 3350993 3357599 3366100 3376566 3388840 3402757
48831 3402757 3418316 3435259 3452843 3470554 3488752 3508057 3528350 3549025 3570001 3591798 3614603
48820 3614603 3637927 3661243 3684359 3707134 3729441 3751575 3774088 3796995 3819633 3841546 3863112
48809 3863112 3885017 3907420 3929830 3951592 3972440 3992912 4014305 4037807 4063415 4090013 4116649
48798 4116649 4143429 4170969 4199300 4227614 4254850 4280206 4303242 4323888 4342576 4360226 4377843
48787 4377843 4395925 4414195 4431921 4448391 4462828 4473950 4480144 4480457 4475237 4465556 4452241 4435730
48775 4435730 4416454 4394825 4370936 4344682 4316132 4285420 4252415 4216859 4178749 4138269 4095515
48764 4095515 4050741 4004698 3958221 3911488 3864146 3816115 3767838 3719815 3672400 3626080 3581377
48753 3581377 3538365 3496735 3456436 3417832 3381105 3345916 3311807 3278640 3246539 3215803 3186991
48742 3186991 3160786 3137669 3117879 3101542 3088399 3077423 3067259 3057214 3047490 3038386 3029728 3021188
48730 3021188 3012834 3005260 2999406 2996248 2996184 2998617 3002486 3007197 3012654 3018499 3023954 3028598 3032782 3036972
48716 3036972 3041075 3044613 3047191 3048705 3049445 3050139 3051468 3053376 3055256 3056894 3058763 3061286 3064375 3067936
48702 3067936 3072235 3077405 3083055 3088804 3094747 3100985 3107066 3112523 3117755 3123769 3131012 3138792 3145882 3151422
48688 3151422 3155248 3157666 3159177 3160433 3162269 3165453 3170167 3175922 3182204 3189034 3196517 3204075 3210635 3215592
48674 3215592 3219014 3220918 3221007 3219334 3216593 3213351 3209437 3204442 3198371 3191322 3182807 3171969 3158463 3142793
48660 3142793 3125721 3107447 3087300 3064103 3036988 3005935 2971529 2934398 2895306 2855762 2817978
48649 2817978 2783743 2753446 2726312 2701434 2678413 2657165 2637230 2617326 2595861 2572180 2547146
48638 2547146 2522148 2497771 2473954 2451124 2430211 2411346 2393363 2374999 2355946 2336357 2316021
48627 2316021 2294658 2272625 2250690 2229315 2208655 2189050 2171063 2155087 2141190 2129269 2119094
48616 2119094 2110481 2103699 2099583 2098891 2101508 2106355 2111976 2117123 2121027 2123318 2123704 2121858 2117837 2112532
48602 2112532 2107335 2103271 2100718 2099812 2100650 2102952 2105931 2108630 2110153 2109696 2106859 2101922 2095331 2086969 2076556
48587 2076556 2064776 2053150 2042606 2032838 2023220 2013578 2003761 1993378 1982540 1972230 1963302 1955603
48575 1955603 1948585 1942276 1937131 1933390 1931197 1930909 1932761 1936515 1941851 1948667 1956561 1964468 1971236 1976109
48561 1976109 1978210 1976238 1969441 1958511 1944835 1929225 1912079 1894359 1877536 1862641 1849923 1839168
48549 1839168 1829632 1819863 1808438 1794997 1780100 1764212 1747467 1730288 1713415 1697139 1681101 1665165
48537 1665165 1650014 1636519 1624750 1613956 1603503 1593696 1585482 1579362 1574820 1571143 1568591 1568285 1570974
48524 1570974 1576626 1585372 1598162 1615956 1638502 1663808 1688044 1705810 1711865 1704076 1684817 1659162
48512 1659162 1631911 1606339 1584526 1567556 1555548 1548311 1545938 1548271 1554169 1562088 1571236 1581620
48500 1581620 1593264 1606164 1620869 1638351 1659010 1681823 1703955 1720860 1727678 1721915 1705072 1681160
48488 1681160 1653724 1624659 1595146 1566440 1539493 1514647 1492018 1471810 1454175 1439186 1426896
48477 1426896 1417074 1408980 1401853 1395463 1389892 1385088 1381047 1378012 1375880 1373876 1371465 1369249 1368195 1368305
48463 1368305 1368907 1369948 1372016 1375223 1379067 1383393 1388481 1393986 1398645 1401294 1401572 1399552 1395408 1389615
48449 1389615 1382799 1375191 1366817 1358275 1350618 1344233 1338391 1332013 1324308 1314669 1302842 1289568 1276384
48436 1276384 1264315 1253149 1242264 1231667 1221852 1213049 1205097 1197901 1191630 1186491 1182424 1178982 1175475
48423 1175475 1171317 1166254 1160265 1153429 1146035 1138598 1131532 1124914 1118692 1112801 1106947 1100640 1093706 1086449
48409 1086449 1079110 1071644 1064299 1057767 1052302 1047221 1041873 1036560 1031875 1027612 1023112 1018321 1013802 1009936
48395 1009936 1006771 1004353 1002532 1000659 998080 994775 991068 987058 982813 978660 974738 970772 966837 963794
48381 963794 962293 961834 961463 960815 959911 958661 957301 956555 956513 956098 954547 952535 950907 949305 947272 945732
48365 945732 945809 946952 947763 948101 948858 950294 952246 955452 960831 967681 974245 979894 985453 991749 999353
48350 999353 1009241 1022097 1037338 1054284 1073503 1095113 1116384 1133272 1144142 1150139 1152587 1152383
48338 1152383 1151606 1153019 1157568 1164426 1173514 1185904 1201804 1220379 1241640 1266460 1294852 1326374
48326 1326374 1361964 1403111 1449565 1500308 1556243 1619212 1688919 1763815 1844618 1933960 2033284
48315 2033284 2143585 2268502 2413038 2580207 2773299 3000572 3273340 3601161 3994879
48306 3994879 4473375 5061517 5784074 6669712 7758948 9100511 10746863 12762931 15207228
48297 15207228 18027152 20919684 23328294 24670152 24647615 23383206 21286381 18809140
48289 18809140 16290997 13937740 11854773 10075651 8587563 7359080 6355732 5540752
48281 5540752 4876650 4332500 3886092 3518722 3213036 2956382 2741201 2560869 2408474
48272 2408474 2279475 2171497 2080889 2002715 1934242 1875260 1824722 1780083 1740156 1705647 1676439
48261 1676439 1650888 1628185 1608924 1592957 1578879 1566025 1554795 1544657 1533975 1522414 1511622
48250 1511622 1502901 1495847 1489882 1485519 1483344 1483048 1484239 1487321 1492851 1500388 1508076 1512923 1511924 1503978
48236 1503978 1490860 1475662 1460466 1445989 1432733 1421168 1411000 1401324 1391519 1381352 1370613 1359501
48224 1359501 1348898 1339240 1329506 1318302 1305505 1291839 1277396 1261821 1245482 1229089 1212369 1194412
48212 1194412 1175200 1155511 1135390 1113999 1091006 1067030 1042737 1018627 995683 974958 956302
48201 956302 938546 921153 904801 890173 877136 865180 853870 842788 831908 822067 814142 807711
48189 807711 801434 794757 788227 782032 775393 767886 760489 754708 751093 748864 746605 743242 738800 734254
48175 734254 730353 726846 723319 720263 718440 717535 716472 714938 713561 712668 711914 711129 710468 709675 708266 706615
48159 706615 705712 705677 705598 705181 705331 706536 707785 707888 707099 706635 707146 708337 709699 710985 712201 713519 715036
48142 715036 716514 717769 719290 721751 724761 726892 727315 726720 726222 726093 726095 726386 727371 729058 731182 733720
48126 733720 736745 740003 743057 745719 748111 750510 753354 756993 761146 764934 767795 770102 772695 776078
48112 776078 780213 784704 788980 792716 796352 800831 806551 812968 819438 826047 833327 841560 850656 860312
48098 860312 870016 879348 888627 898784 910224 922275 934251 946523 959839 973878 987259 999061
48086 999061 1009806 1020809 1032825 1045408 1057455 1068376 1078724 1089507 1100875 1111965 1122179
48075 1122179 1131989 1142015 1151833 1160394 1167448 1173861 1180575 1187801 1195385 1203473 1212547 1222973 1234568
48062 1234568 1246576 1258088 1268526 1277522 1284354 1288123 1288982 1288740 1289429 1291224 1292284 1290627 1285610 1277633
48048 1277633 1267316 1255494 1243481 1232512 1222806 1213495 1203457 1192066 1179216 1164992 1149501 1132936
48036 1132936 1115699 1098379 1081511 1065275 1049463 1033760 1018001 1002130 986076 969881 953844
48025 953844 938303 923194 908093 892878 878145 864667 852487 840884 829222 817520 805999
48014 805999 794554 783058 772024 762420 754736 748517 742960 737739 733089 729256 726048 722970 719780
48001 719780 716836 714721 713395 711931 709396 705931 702650 700480 699412 698914 698613 698356 697935 697127 695922
47986 695922 694441 692757 690987 689472 688532 688020 687380 686282 685039 684185 683746 683125 681775 679800 677752 675944
47970 675944 674230 672376 670397 668393 666323 664108 661784 659386 656814 654068 651464 649442 648221 647755
47956 647755 647787 647844 647497 646937 646981 648038 649393 650087 650386 651656 654746 659183 664172 669656 675977 682985 690074
47939 690074 696879 703536 710416 717910 726317 735646 745573 755725 765763 775105 782996 789267 794752 800506
47925 800506 806723 812723 817804 821630 823930 824397 823075 820458 817037 812990 808449 803689 798752 793097
47911 793097 786024 777597 768902 761242 755069 749757 744300 738119 731269 724214 717591 712037 707908 705130
47897 705130 703457 702869 703547 705479 708321 711622 714992 718078 720705 723142 725982 729664 734247 739632 745630
47882 745630 751756 757472 762945 769175 776913 785617 793879 800823 806749 812518 818624 824858 830447 834465
47868 834465 836422 836640 835867 834436 831968 827996 822705 816824 810845 804577 797565 789711 781228 772077 761939
47853 761939 750971 740174 730479 721585 712389 702590 693238 685397 678896 672937 667461 663170 660403 658703
47839 658703 657611 657237 657835 659242 661018 662921 665011 667454 670395 673866 677723 681781 686099 690947 696417
47824 696417 702177 707705 712729 717430 722296 727825 734234 741457 749483 758565 768959 780568 793182
47811 793182 807090 823097 841684 862381 884156 906335 928888 951861 974775 996676 1016621
47800 1016621 1033926 1048024 1058456 1065224 1069019 1070635 1070031 1066278 1058685 1047724 1034642 1020446 1005684
47787 1005684 991004 977295 965149 954573 945393 937566 930963 925255 920286 916307 913460 911252 908825
47774 908825 905732 902256 899087 896859 895820 895626 895407 894300 892004 888784 884976 880626 875568 869685 863055
47759 863055 855927 848543 840941 833036 824905 816946 809616 803138 797542 792885 789268 786695 785038 784145
47745 784145 783904 784301 785498 787712 790935 794921 799579 805122 811591 818545 825633 833343 842642 853842
47731 853842 866284 879199 892459 906322 920854 935821 950793 965103 978084 989643 1000240
47720 1000240 1009964 1017953 1023202 1025679 1026178 1025311 1023192 1019946 1015753 1010295 1002843 993214 982098 970136
47706 970136 957156 942879 927999 913943 901533 890337 879420 868357 857410 847026 837510 829173
47694 829173 822525 818072 815813 815128 815351 816435 818840 822775 827902 833903 840972 849425 859138 869823
47680 869823 881715 895389 910783 926797 942194 956682 970905 985489 1000297 1014555 1027468
47669 1027468 1038647 1048063 1055742 1061584 1065458 1067391 1067570 1066150 1063098 1058233 1051427 1042812 1032803 1021884
47655 1021884 1010355 998361 986176 974251 962840 951700 940437 929145 918514 909224 901357 894533
47643 894533 888552 883740 880559 879010 878586 878903 880136 882673 886523 891429 897503 905363 915533 928068
47629 928068 942869 959951 979144 999984 1022304 1046568 1073101 1101184 1129377 1156652 1182678
47618 1182678 1207153 1229397 1248621 1264027 1274580 1279258 1277715 1270262 1257116 1238163 1213653 1184551
47606 1184551 1151909 1116378 1078713 1040212 1002116 964943 928907 894694 863208 834786 809246
47595 809246 786619 767212 750876 736759 723981 712197 701393 691493 682342 673820 665847 658481
47583 658481 651997 646557 641749 636844 631650 626758 622721 619364 616242 613484 611652 610811 610201 608989 607031
47568 607031 604719 602333 599893 597526 595598 594309 593355 592183 590507 588406 585998 583260 580173 576840
47554 576840 573389 569977 566888 564400 562410 560488 558437 556487 554683 552461 549406 546206 544194 543807
47540 543807 544031 543630 542477 541420 541271 542283 544300 546799 548824 549411 548393 546625 545296 545055 545698 546477
47524 546477 546708 546218 545327 544403 543585 543033 543170 544326 546170 547874 548902 549392 549693 549867 549873 549906 550294 551188
47506 551188 552597 554581 557130 559891 562223 563562 563702 562907 561898 561483 561874 562489 562693 562534 562398 562093
47490 562093 560884 558501 555588 552959 550864 549205 548003 547263 546723 546176 545852 546129 547016 548275 549883 552036
47474 552036 554808 558105 561834 565784 569520 572793 575948 579505 583403 587079 590240 593144 596061 598911
47460 598911 601510 603792 605690 607146 608340 609557 610775 611748 612600 613863 615785 618060 620488 623494 627701
47445 627701 633288 640096 648079 657310 667758 679357 692166 706299 721855 738973 757597 777114
47433 777114 796611 815658 834299 852056 867700 880570 891424 901152 909067 913481 913864 911438 907599
47420 907599 902670 896508 889424 881947 874243 866262 858123 849868 841195 831832 821987 812065 802153 792111
47406 792111 781992 772072 762609 753801 745784 738337 730785 722607 714075 705962 698698 692182 686368 681576
47392 681576 678004 675268 672753 670344 668550 667948 668669 670478 673199 676869 681441 686517 691561 696388 701331
47377 701331 706866 713213 720316 727999 735956 743651 750446 755909 759976 762816 764625 765489 765313 763804 760625
47362 760625 755670 749251 741951 734215 726091 717383 708044 698286 688314 678133 667735 657321 647127
47349 647127 637149 627361 618102 609884 602725 596100 589740 584048 579407 575406 571244 566760 562520 558947
47335 558947 555916 553298 551320 550058 549016 547673 546211 545283 545163 545550 546187 547239 548940 551177 553594
47320 553594 555864 557741 559085 560043 561039 562392 564034 565708 567287 568739 569929 570707 571056 570911 569885
47305 569885 567578 564327 561415 560154 560680 561801 562184 561717 561536 562638 564665 566328 566970 567326 568612 571291
47289 571291 574999 579297 584029 589155 594773 601215 608599 616276 623299 629566 635988 643383 651792 661038
47275 661038 671264 682346 693336 703280 712424 721982 732777 744665 757216 770344 784190 798907
47263 798907 814588 830711 845330 855402 858574 854707 845557 833224 819145 804159 788960 774304
47251 774304 760955 749414 739550 730643 722034 713728 706207 699747 694162 689130 684470 680073 675946 672462
47237 672462 670228 669410 669363 669257 668962 668978 669572 670490 671620 673454 676544 680791 685715 691186 697429 704345
47221 704345 711361 718145 725082 732891 741956 752065 762466 772108 780219 786885 792689 797634 800920 802069
47207 802069 801794 801165 800286 798348 794795 789823 783834 777155 770327 764016 758353 752798 746889 740824 735210
47192 735210 730670 727808 726991 727825 729275 730717 732609 735767 740307 745664 751427 757680 764653 772472 781258
47177 781258 791091 801881 813518 826121 839862 854587 869938 885844 902537 919970 937501 954305
47165 954305 969861 983941 996350 1006890 1015486 1022132 1026788 1029443 1030172 1029038 1026003 1021165 1015005
47152 1015005 1008224 1001281 994226 986972 979564 972154 964899 957970 951498 945324 938954 932008 924710 917781
47138 917781 911836 907063 903472 901188 900372 901010 902887 905653 908902 912439 916582 921930 928584 935747 942367
47123 942367 948063 953209 958199 962885 966662 968830 968932 967004 963495 958717 952421 944155 934024 922747
47109 922747 911009 899113 887356 876274 866199 856754 847095 836647 825531 814382 803876 794269
47097 794269 785277 776445 767660 759194 751258 743764 736559 729668 723188 717223 712067 708227 706017 705266
47083 705266 705587 706779 708769 711340 714236 717432 721037 724889 728550 731802 734957 738555 742816 747466
47069 747466 751997 756012 759394 762232 764655 766662 768077 768771 768981 769333 770307 771674 772685 772915 772691 772579
47053 772579 772766 773171 773896 775181 777118 779756 783298 787734 792489 796964 801356 806331 811957 817657 823293
47038 823293 829462 836391 843289 849309 854590 859839 865424 871479 878358 886203 894335 901827 908581 915256
47024 915256 922307 929658 937157 944639 951616 957621 962909 968216 973756 979070 983882 988371 992371 994959
47010 994959 995288 993415 990080 986064 981946 977991 973925 969222 963903 958636 953845 949230 944556 940311
46996 940311 937031 934440 931961 929748 928500 928420 929106 930394 932502 935277 938030 940467 943155 946767 951391
46981 951391 956954 963719 971801 980602 989416 998432 1008533 1020139 1032808 1045909 1059092 1071955 1083930
46968 1083930 1094829 1105111 1115258 1125237 1134847 1144166 1153194 1161409 1168281 1173986 1179034 1183280 1186008
46955 1186008 1187093 1187435 1188011 1189040 1190323 1191780 1193158 1193711 1192855 1191050 1189593 1189553 1191212 1194306 1198358
46940 1198358 1202764 1206995 1210915 1214818 1219194 1224519 1230999 1238300 1245749 1253079 1260685 1268821 1276953 1284544
46926 1284544 1292203 1301184 1311693 1322483 1332370 1341438 1350283 1358675 1365533 1369914 1371503 1370378 1366848
46913 1366848 1361451 1354705 1346813 1337800 1327791 1316869 1304784 1291283 1276735 1262172 1248623 1236605
46901 1236605 1226297 1217964 1212061 1208970 1208670 1210683 1214463 1219862 1227144 1236447 1247452 1259743 1273334
46888 1273334 1288602 1305807 1324874 1345496 1367088 1388676 1409211 1428164 1445649 1461912 1476922
46877 1476922 1490469 1502368 1512386 1520268 1526138 1530677 1534630 1538183 1541139 1543624 1546250 1549534 1553514
46864 1553514 1558151 1563773 1570746 1578902 1587698 1596919 1606806 1617527 1628999 1641374 1655126 1670244 1685675
46851 1685675 1700078 1713013 1724929 1736096 1746007 1753876 1759265 1762153 1762783 1761629 1759196 1755627 1750713
46838 1750713 1744333 1736666 1727935 1718363 1708533 1699400 1691611 1685064 1679373 1674509 1670685 1667921 1666130 1665579
46824 1665579 1666870 1670490 1676586 1685052 1695532 1707397 1720083 1733532 1748083 1763852 1780336 1796625
46812 1796625 1811908 1825808 1838332 1849469 1858786 1865542 1869306 1870228 1868602 1864506 1858191 1850442 1842016
46799 1842016 1832820 1822191 1810024 1797116 1784301 1771713 1759107 1746485 1734158 1722480 1711780
46788 1711780 1702240 1693629 1685463 1677725 1671184 1666575 1663681 1661656 1660116 1659301 1659144 1658800 1657582 1656014 1655432
46773 1655432 1656474 1658414 1660112 1661281 1662454 1663969 1665523 1666882 1668572 1671452 1675779 1681068 1686816 1692949
46759 1692949 1699494 1706238 1713081 1720533 1729428 1740108 1752091 1764612 1777312 1790288 1803608 1817011
46747 1817011 1830117 1842780 1855073 1866939 1878032 1887998 1896835 1904805 1911970 1917930 1922115 1924374 1925281
46734 1925281 1925831 1926797 1928339 1930197 1932140 1934148 1936252 1938489 1941049 1944232 1948114 1952493 1957363 1963180
46720 1963180 1970360 1978595 1987040 1995105 2002801 2010271 2017293 2023308 2027693 2029970 2030021 2028168 2024877 2020258
46706 2020258 2013967 2005582 1994861 1981716 1966270 1949071 1930910 1912265 1893036 1872857 1851414 1828502
46694 1828502 1804233 1779387 1755139 1732110 1709943 1688070 1666523 1645651 1625400 1605498 1586218
46683 1586218 1568353 1552338 1537848 1524377 1511793 1500140 1489264 1478979 1469367 1460622 1452662 1445141
46671 1445141 1437885 1431130 1425328 1420836 1417817 1416312 1416194 1417102 1418660 1420959 1424734 1430802 1439239 1449293
46657 1449293 1460119 1471406 1483206 1495432 1507742 1519765 1531193 1541738 1551146 1559190 1565581 1570043
46645 1570043 1572674 1574046 1574745 1574864 1574150 1572509 1570204 1567765 1565946 1565556 1566959 1569783 1573520 1578408 1585410
46630 1585410 1595311 1608175 1623669 1641609 1661925 1684249 1707624 1730625 1752024 1771602 1790123
46619 1790123 1808085 1824531 1837531 1845873 1849908 1850695 1848803 1844074 1836054 1824395 1809213 1791369 1772091
46606 1772091 1752013 1730900 1708538 1685579 1663097 1641568 1620713 1600220 1580263 1561393 1544203
46595 1544203 1529067 1515838 1503822 1492356 1481442 1471599 1463080 1455470 1448062 1440425 1432527 1424526 1416620
46582 1416620 1409029 1401930 1395249 1388543 1381265 1373306 1365218 1357737 1351125 1345148 1339584 1334406 1329539 1324842
46568 1324842 1320443 1316767 1314058 1312219 1311190 1311034 1311452 1311715 1311413 1310929 1310784 1310975 1311333 1312100 1313491 1315065
46552 1315065 1316269 1317417 1319356 1322215 1325279 1328211 1331604 1336072 1341524 1347722 1354919 1363311 1372329 1381108
46538 1381108 1389527 1398229 1407763 1418179 1429405 1441507 1454475 1468195 1482852 1498975 1516830 1535999
46526 1535999 1555940 1576802 1599237 1623419 1648704 1674489 1700893 1728113 1755488 1781941 1807304
46515 1807304 1832356 1857336 1881140 1902450 1921043 1937359 1951390 1962827 1971953 1979454 1985359 1989053
46503 1989053 1990479 1990524 1989949 1988597 1986006 1982253 1977827 1973113 1968394 1963907 1959460 1954323 1947970 1940724 1933356
46488 1933356 1926184 1918862 1910757 1901220 1889723 1876204 1861174 1845175 1828147 1809593 1789231 1767160
46476 1767160 1743448 1717963 1690706 1662156 1633135 1604412 1576410 1549250 1523050 1498179 1475103
46465 1475103 1453985 1434626 1416901 1401095 1387666 1376831 1368517 1362609 1359054 1357863 1359132 1363043
46453 1363043 1369730 1379100 1390778 1404110 1418321 1432833 1447458 1462118 1476476 1490086 1502766 1514477
46441 1514477 1524915 1533708 1541102 1547816 1553967 1558639 1560888 1560800 1559143 1556387 1552618 1548140 1543524 1539075
$$ [...]
##END NTUPLES=NMR SPECTRUM
##END=
