
##TITLE=UV1260_M11_1332-1242_50_7409847_uzryWZN9Gb
##JCAMPDX= 6.0         $$ Bruker NMR JCAMP-DX V2.0
##DATA TYPE= NMR SPECTRUM
##DATA CLASS= NTUPLES
##ORIGIN= BRUKER
##OWNER= Administrator
$$ 1.72 TOPSPIN		Version 2.1
$$ 2013-01-25 00:19:48.398 -0500  Administrator@X
$$ Compression mode = diff/dup
##.OBSERVE FREQUENCY= 400.02188249412
##.OBSERVE NUCLEUS= ^1H
##.ACQUISITION MODE= SIMULTANEOUS (DQD)
##.ACQUISITION SCHEME= undefined
##.AVERAGES= 64
##.DIGITISER RES= 22
##SPECTROMETER/DATA SYSTEM= spect
##.PULSE SEQUENCE= noesygpps1d.comp
##.SOLVENT NAME= COFFEE_meoh
##.SHIFT REFERENCE= INTERNAL, COFFEE_meoh, 1, 14.96109
##AUDIT TRAIL= $$ (NUMBER, WHEN, WHO, WHERE, PROCESS, VERSION, WHAT)
$$ ##TITLE= Audit trail, TOPSPIN		Version 2.1
$$ ##JCAMPDX= 5.01
$$ ##ORIGIN= Bruker BioSpin GmbH
$$ ##OWNER= Administrator
$$ $$ E:\/data/COFFEE/nmr/UV1260_M11_1332-1242_50_7409847_uzryWZN9Gb/12/pdata/1/auditp.txt
$$ ##AUDIT TRAIL=  $$ (NUMBER, WHEN, WHO, WHERE, PROCESS, VERSION, WHAT)
(   1,<2013-01-25 00:19:42.632 -0500>,<Administrator>,<X>,<go>,<TOPSPIN 2.1>,
      <created by zg
	started at 2013-01-25 00:08:12.398 -0500,
	POWCHK enabled, PULCHK disabled,
       configuration hash MD5:
       86 BA 57 50 F2 9D 5C 9B 26 00 A9 28 5F 66 2E 89
       data hash MD5: 64K
       A4 CC E7 3E E2 6A EB 97 AC F6 47 F5 34 C9 3D A3>)
(   2,<2013-01-25 00:19:45.632 -0500>,<Administrator>,<X>,<proc1d>,<TOPSPIN 2.1>,
      <Start of raw data processing
       efp LB = 0.3 FT_mod = 6 PKNL = 1 PHC0 = 0 PHC1 = 0 SI = 128K 
       data hash MD5: 128K
       12 34 DD 42 44 35 A2 A5 72 AD B7 56 52 E0 14 04>)
(   3,<2013-01-25 00:19:46.694 -0500>,<Administrator>,<X>,<proc1d>,<TOPSPIN 2.1>,
      <pk PHC0 = -77.08557 PHC1 = 0 
       data hash MD5: 128K
       C8 3B 61 33 9A 9C 9C 7A C6 DF F5 E6 A6 64 44 3D>)
(   4,<2013-01-25 00:19:47.382 -0500>,<Administrator>,<X>,<proc1d>,<TOPSPIN 2.1>,
      <abs ABSG = 1 
       data hash MD5: 128K
       EF F1 48 C0 87 7F F1 9D 5A 00 58 5F 07 75 E6 B8>)
(   5,<2013-01-25 00:19:47.538 -0500>,<Administrator>,<X>,<proc1d>,<TOPSPIN 2.1>,
      <abs ABSG = 2 
       data hash MD5: 128K
       F6 EC 2F 0C DB BE 00 AF A4 71 D8 29 48 C3 71 86>)
(   6,<2013-01-25 00:19:47.726 -0500>,<Administrator>,<X>,<proc1d>,<TOPSPIN 2.1>,
      <abs ABSG = 3 
       data hash MD5: 128K
       BD 7C AE DC 87 FF F2 F4 02 92 27 65 34 28 EE 0A>)
(   7,<2013-01-25 00:19:47.882 -0500>,<Administrator>,<X>,<proc1d>,<TOPSPIN 2.1>,
      <abs ABSG = 4 
       data hash MD5: 128K
       94 C8 9E 29 BD 8D AC BD 98 20 D2 80 10 BE 54 D7>)
(   8,<2013-01-25 00:19:48.054 -0500>,<Administrator>,<X>,<proc1d>,<TOPSPIN 2.1>,
      <abs ABSG = 5 
       data hash MD5: 128K
       EB 00 26 04 2F CD F3 A8 97 7F C0 DD 79 7D 99 FE>)
$$ ##END=
$$ 
$$ $$ hash MD5
$$ $$ 29 0A C6 B7 02 F3 78 CB F5 2A CA 63 95 D7 B7 00
##$RELAX= 
##$RELAX= 
##$RELAX= 
##$RELAX= 
##$RELAX= 
##$RELAX= 
##$RELAX= 
##$RELAX= 
$$ Bruker specific parameters
$$ --------------------------
##$DU= <E:\>
##$EXPNO= 12
$$ [...]
##$TP07= 0
##$TPNAME0= <>
##$TPNAME1= <>
##$TPNAME2= <>
##$TPNAME3= <>
##$TPNAME4= <>
##$TPNAME5= <>
##$TPNAME6= <>
##$TPNAME7= <>
##$TPOAL= (0..7)
0.5 0.5 0.5 0.5 0.5 0.5 0.5 0.5
##$TPOFFS= (0..7)
0 0 0 0 0 0 0 0
##$TUNHIN= 0
##$TUNHOUT= 0
##$TUNXOUT= 0
##$USERA1= <user>
##$USERA2= <user>
##$USERA3= <user>
##$USERA4= <user>
##$USERA5= <user>
##$V9= 5
##$VALIST= <valist>
##$VCLIST= <CCCCCCCCCCCCCCC>
##$VD= 0
##$VDLIST= <DDDDDDDDDDDDDDD>
##$VPLIST= <PPPPPPPPPPPPPPP>
##$VTLIST= <TTTTTTTTTTTTTTT>
##$WBST= 1024
##$WBSW= 4
##$XGAIN= (0..3)
0 0 0 0
##$XL= 0
##$YL= 0
##$YMAX_a= 6064699
##$YMIN_a= -12546195
##$ZGOPTNS= <>
##$ZL1= 120
##$ZL2= 120
##$ZL3= 120
##$ZL4= 120
##$ABSF1= 14.96109
##$ABSF2= -5.597092
##$ABSG= 5
##$ABSL= 3
##$ALPHA= 0
##$AQORDER= 0
##$ASSFAC= 0
##$ASSFACI= 0
##$ASSFACX= 0
##$ASSWID= 0
##$AUNMP= <proc_prof1d_extract.lims>
##$AXLEFT= 0
##$AXNAME= <>
##$AXNUC= <1H>
##$AXRIGHT= 0
##$AXTYPE= 0
##$AXUNIT= <>
##$AZFE= 0.1
##$AZFW= 0.1
##$BCFW= 0
##$BC_mod= 0
##$BYTORDP= 0
##$COROFFS= 0
##$CY= 15
##$DATMOD= 1
##$DC= 0
##$DFILT= <>
##$DTYPP= 0
##$F1P= 0
##$F2P= 0
##$FCOR= 0.5
##$FTSIZE= 131072
##$FT_mod= 6
##$GAMMA= 0
##$GB= 0
##$INTBC= 1
##$INTSCL= 1
##$ISEN= 128
##$LB= 0.3
##$LEV0= 0
##$LPBIN= 0
##$MAXI= 10000
##$MC2= 0
##$MEAN= 0
##$ME_mod= 0
##$MI= 0
##$NCOEF= 0
##$NC_proc= -2
##$NLEV= 6
##$NOISF1= 0
##$NOISF2= 0
##$NSP= 0
##$NTH_PI= 0
##$NZP= 0
##$OFFSET= 14.96109
##$PC= 1
##$PHC0= -77.08557
##$PHC1= 0
##$PH_mod= 1
##$PKNL= yes
##$PPARMOD= 0
##$PPDIAG= 0
##$PPIPTYP= 0
##$PPMPNUM= 2147483647
##$PPRESOL= 1
##$PSCAL= 4
##$PSIGN= 0
##$PYNMP= <proc.py>
##$REVERSE= no
##$SF= 400.020009600952
##$SI= 131072
##$SIGF1= 0
##$SIGF2= 0
##$SINO= 400
##$SIOLD= 131072
##$SPECTYP= <>
##$SREGLST= <1H.CDCl3>
##$SSB= 0
##$STSI= 131072
##$STSR= 0
##$SW_p= 8223.68421052631
##$SYMM= 0
##$S_DEV= 0
##$TDeff= 65536
##$TDoff= 0
##$TI= <>
##$TILT= no
##$TM1= 0
##$TM2= 0
##$TOPLEV= 0
##$USERP1= <user>
##$USERP2= <user>
##$USERP3= <user>
##$USERP4= <user>
##$USERP5= <user>
##$WDW= 1
##$XDIM= 131072
##$YMAX_p= 453036121
##$YMIN_p= -11884
##$CURPLOT= <Network HP LaserJet P1505>
##$CURPRIN= <$Network HP LaserJet P1505>
##$DFORMAT= <normdp>
##$LAYOUT= <+/1D_H.xwp>
##$LFORMAT= <normlp>
##$PFORMAT= <normpl>
##$SURQMSG= 1
$$ End of Bruker specific parameters
$$ ---------------------------------
##NTUPLES= NMR SPECTRUM
##VAR_NAME=  FREQUENCY,     SPECTRUM/REAL,   SPECTRUM/IMAG
##SYMBOL=    X,             R,               I
##VAR_TYPE=  INDEPENDENT,   DEPENDENT,       DEPENDENT
##VAR_FORM=  AFFN,          ASDF,            ASDF
##VAR_DIM=   131072,        131072,          131072
##UNITS=     HZ,            ARBITRARY UNITS, ARBITRARY UNITS
##FACTOR=    0.0627417313425164, 1,          1
##FIRST=     8223.62146879497, -36,          -56056
##LAST=      0,             2389,            -56260
##MIN=       0,             -11884,          0
##MAX=       8223.62146879497, 453036121,    0
$$ Real data points
##PAGE= N=1
##DATA TABLE= (X++(R..R)), XYDATA
$$ [...]
$$ plain form
61668 449526 448734 447858 446817 445526 443873 442111 440914 440589 440593 440297 439851 439711 439601 438743 437127 435803 435613
61651 435613 436186 436552 436370 436104 436193 436577 437146 438234 440335 443424 446984 450754 455103 460351 465984 470945
61635 470945 474639 477264 479107 479955 479345 477171 473877 470221 466863 463983 461235 458239 455032 451817 448446
61620 448446 444691 441015 438425 437284 436757 435803 434337 433020 432189 431536 430643 429334 427405 424413 419974
61605 419974 414225 407868 401695 395968 390263 384085 377657 371822 367076 362938 358488 353384 348162 343609
61591 343609 340109 337540 335616 334145 332966 331754 330106 327966 325777 323972 322428 320732 318908 317481
61577 317481 316718 316204 315396 314280 313170 312134 310985 309797 308977 308703 308530 307780 306244 304287 302284 300215
61561 300215 298011 296091 295176 295581 296980 298853 300784 302302 303039 303282 303869 305087 306182 306438 306237 306393
$$ packed form
61668D49526p92q76j041j291j653j762j197l25Mk96m46j40j10q58j616j324j90
61651D35613N73L66j82k66Q9L84N69J088K101L089L560L770M349N248N633M961
61635D70945L694K625J843Q48o10k174l294l656l358k880k748k996l207l215l371
61620D48446l755l676k590j141n27r54j466j317q31o53q93j309j929k992m439
61605D19974n749o357o173n727n705o178o428n835m746m138m450n104n222m553
61591C43609l500k569j924j471j179j212j648k140k189j805j544j696j824j427
61577C17481p63n14q08j116j110j036j149j188q20k74j73p50j536j957k003k069
61561C00215k204j920r15M05J399J873J931J518P37K43N87J218J095K56k01J56
$$ plain form
61545 306393 306854 306961 306747 307020 308138 309611 311082 312792 314764 316346 317037 317257 317797 318980 320651 322489
61529 322489 324020 324809 325047 325506 326540 327603 328154 328506 329235 330144 330490 330006 329063 327921 326394 324323 321959
61512 321959 319728 317819 316090 314352 312758 311881 312160 313230 314115 314153 313454 312404 311193 310017 309177 308579
61496 308579 307625 306078 304749 304738 306180 308148 309678 310438 310584 310447 310416 310738 311377 312194 313194 314384 315573
61479 315573 316525 317208 317640 317715 317487 317407 317903 318781 319417 319542 319518 319805 320370 320744 320574 320084 319944 320563 321578
61460 321578 322299 322593 322956 323658 324364 324754 324972 325132 324970 324485 324410 325343 326795 327846 328483 329493 331128 332753
61442 332753 333891 334838 335993 337302 338738 340708 343493 346655 349506 351882 354090 356358 358722 361273
61428 361273 364088 366975 369640 372002 374067 375637 376625 377652 379750 383223 387167 390458 392920 395147
$$ packed form
61545C06393M61J07k14K73J118J473J471J710J972J582O91K20N40J183J671J838
61529C22489J531P89K38M59J034J063N51L52P29R09L46m84r43j142j527k071k364
61512C21959k231j909j729j738j594q77K79J070Q85L8o99j050j211j176q40n98
61496C08579r54j547j329j1J442J968J530P60J46j37l1L22O39Q17J000J190J189
61479C15573R52O83M32P5k28q0M96Q78O36J25k4K87N65L74j70m90j40O19J015
61460C21578P21K94L63P02P06L90K18J60j62m85p5R33J452J051O37J010J635J625
61442C32753J138R47J155J309J436J970K785L162K851K376K208K268K364K551
61428C61273K815K887K665K362K065J570R88J027K098L473L944L291K462K227
$$ plain form
61414 395147 397425 399456 401100 402709 404421 405620 405607 404561 403345 402530 401997 401324 400080 397857 394578
61399 394578 390880 387668 385242 383318 381978 381805 382771 383670 383328 381981 380785 380213 379694 378823 378184 378621
61383 378621 380173 382131 383898 385412 386738 387680 387991 387784 387453 387170 386728 386048 385572 385888 387120 388998
61367 388998 391377 394207 397013 398968 399772 400084 400829 402350 404432 406785 409206 411536 413882 416693 420312
61352 420312 424555 429042 433786 439188 445613 453209 461965 471586 481427 490927 499995 508677 516581 523109
61338 523109 528251 532632 536660 540107 542733 544860 546865 548402 548696 547620 545917 544168 541956 538471
61324 538471 533700 528579 523981 520045 516556 513511 511047 509153 507818 507249 507624 508768 510350 512233 514328
61309 514328 516339 518065 519816 522197 525649 530522 537380 546650 558040 570747 584117 597549 609881
$$ packed form
61414C95147K278K031J644J609J712J199j3j046j216q15n33o73j244k223l279
61399C94578l698l212k426j924j340j73R66Q99l42j347j196n72n19q71o39M37
61383C78621J552J958J767J514J326R42L11k07l31k83m42o80m76L16J232J878
61367C88998K379K830K806J955Q04L12P45J521K082K353K421K330K346K811L619
61352D20312M243M487M744N402O425P596Q756R621R841R500R068Q682P904O528
61338E23109N142M381M028L447K626K127K005J537K94j076j703j749k212l485
61324E38471m771n121m598l936l489l045k464j894j335n69L75J144J582J883K095
61309E14328K011J726J751K381L452M873O858R270J1390J2707J3370J3432J2332
$$ plain form
61296 609881 619628 626000 629194 629670 627753 624025 619363 614257 608571 602209 595546 588985 582612 576462
61282 576462 570623 564833 558660 552351 546915 542982 540195 538063 536806 536845 538057 540136 543209 547472 552607
61267 552607 558084 563638 568939 573295 576379 578983 582384 587204 593390 600942 609968 620243 631394 643339
61253 643339 655948 668435 679708 689177 696641 701575 703371 702298 699542 696096 692062 687094 681068
61240 681068 674173 666781 659323 652119 645320 639215 634329 630917 628604 626941 625990 625844 625884 625321 624425 624567
61224 624567 626913 631477 637324 643163 647820 650844 652810 654586 656350 657834 659300 661440 664324 667299
61210 667299 670094 673118 676311 678601 679117 678252 676844 674915 672042 668653 665995 664813 664818 665658 667794 672071
61194 672071 678805 687748 698812 712429 729038 748353 769159 789764 808571 824371 836436 844641
$$ packed form
61296F09881R747O372L194M76j917l728m662n106n686o362o663o561o373o150
61282E76462n839n790o173o309n436l933k787k132j257L9J212K079L073M263N135
61267E52607N477N554N301M356L084K604L401M820O186P552R026J0275J1151J1945
61253F43339J2609J2487J1273R469P464M934J796j073k756l446m034m968o026
61240F81068o895p392p458p204o799o105m886l412k313j663r51j46M0n63q96J42
61224F24567K346M564N847N839M657L024J966J776J764J484J466K140K884K975
61210F67299K795L024L193K290N16q65j408j929k873l389k658j182NQ40K136M277
61194F72071O734Q943J1064J3617J6609J9315K0806K0605J8807J5800J2065Q205
$$ plain form
61182 844641 849511 852058 853404 854443 855653 857101 858562 859597 859572 857839 854200 849137 843344 837049 830093
61167 830093 822573 814840 806713 797290 785973 773276 760194 747127 733879 720426 707079 694041
61155 694041 681428 669638 659159 649995 641812 634670 629117 625468 623543 623283 625065 628980 634124 638949
61141 638949 642091 642653 640027 634029 625350 615521 606083 597688 590024 582639 575842 570684 568091 568146 570283
61126 570283 573937 578845 584832 591644 599078 607219 616568 627912 641798 657925 675231 692879 711041
61113 711041 730420 751115 772403 793675 815135 837289 859973 882225 903065 922156 939711
61102 939711 956006 971148 985162 998038 1009494 1018761 1024719 1026409 1023553 1016629 1006389 993246
61090 993246 977224 958561 938073 916601 894423 871774 849795 830018 812624 796072 779055
$$ packed form
61182H44641M870K547J346J039J210J448J461J035k5j733l639n063n793o295o956
61167H30093p520p733q127r423j1317j2697j3082j3067j3248j3453j3347j3038
61155F94041j2613j1790j0479r164q183p142n553l649j925k60J782L915N144M825
61141F38949L142N62k626n998q679r829r438q395p664p385o797n158k593N5K137
61126E70283L654M908N987O812P434Q141R349J1344J3886J6127J7306J7648J8162
61113G11041J9379K0695K1288K1272K1460K2154K2684K2252K0840J9091J7555
61102I39711J6295J5142J4014J2876J1456R267N958J690k856o924j0240j3143
61090I93246j6022j8663k0488k1472k2178k2649k1979j9777j7394j6552j7017
$$ plain form
61079 779055 762037 746119 731154 716217 701559 688741 678672 670660 663653 657439 652192 647722
61067 647722 643765 640503 638343 637486 637889 639255 641065 643153 646211 651011 657158 663445 669536 676342 684519
61052 684519 693622 703199 713733 725866 739417 753762 768696 784427 801320 819930 840693 863244
61040 863244 886748 911182 937522 966339 997046 1028874 1061718 1095669 1130698 1167301 1206534
61029 1206534 1248811 1293508 1340263 1389760 1442637 1498398 1555866 1613953 1671772 1729162 1787602
61018 1787602 1849686 1917468 1992399 2076792 2173530 2283803 2406675 2541178 2687371 2845962
61008 2845962 3020245 3219286 3456353 3743456 4090594 4510747 5021143 5639366 6386088
60999 6386088 7296324 8422620 9825016 11568555 13730658 16369029 19414659 22564704
$$ packed form
61079G79055j7018j5918j4965j4937j4658j2818j0069q012p007o214n247m470
61067F47722l957l262k160q57M03J366J810K088L058M800O147O287O091O806Q177
61052F84519R103R577J0534J2133J3551J4345J4934J5731J6893J8610K0763K2551
61040H63244K3504K4434K6340K8817L0707L1828L2844L3951L5029L6603L9233
61029A206534M2277M4697M6755M9497N2877N5761N7468N8087N7819N7390N8440
61018A787602O2084O7782P4931Q4393R6738J10273J22872J34503J46193J58591
61008B845962J74283J99041K37067K87103L47138M20153N10396O18223P46722
60999F386088R10236J126296J402396J743539K162103K638371L045630L150045
$$ plain form
60991 22564704 25321310 27216688 28065782 28036471 27505379 26866559 26444664 26480501 27066942
60982 27066942 28034526 28936359 29233112 28571286 26937520 24591968 21884093 19111592 16478677
60973 16478677 14105943 12044181 10291381 8819357 7595064 6584786 5752365 5064247
60965 5064247 4495445 4026949 3639856 3315628 3039920 2802491 2594726 2410035 2245258
60956 2245258 2098815 1968114 1850586 1745822 1654437 1575684 1508022 1450787 1403280 1362988
60946 1362988 1326476 1291331 1256004 1219088 1180570 1142725 1107940 1076336 1046814 1019215 993721
60935 993721 969287 944652 920181 897012 875126 853944 833980 816101 799813 784060 769047
60924 769047 755541 743000 730284 717780 706947 698011 689836 681839 674343 667299 660325 653945 649158
$$ packed form
60991B2564704K756606J895378Q49094k9311n31092o38820m21895L5837N86441
60982B7066942R67584R01833K96753o61826j633766k345552k707875k772501k632915
60973A6478677k372734k061762j752800j472024j224293j010278q32421o88118
60965E064247n68802m68496l87093l24228k75708k37429k07765j84691j64777
60956B245258j46443j30701j17528j04764r1385p8753o7662n7235m7507m0292
60946A362988l6512l5145l5327l6916l8518l7845l4785l1604k9522k7599k5494
60935I93721k4434k4635k4471k3169k1886k1182j9964j7879j6288j5753j5013
60924G69047j3506j2541j2716j2504j0833q936q175p997p496p044o974o380m787
$$ plain form
60911 649158 645805 642831 640168 638937 639802 642421 646499 652004 658369 664872 671850 680312 690199 700313
60897 700313 710103 720377 731994 744855 758337 771848 784890 797452 810382 824540 839639 854706
60885 854706 869540 884820 900891 917300 933455 948971 963537 977267 990844 1004401 1016536
60874 1016536 1025444 1030857 1033956 1035614 1035658 1033627 1029198 1021963 1011757 999180 985076 969764 953491
60861 953491 937158 921618 906662 891639 876572 861578 845835 828494 810186 792247 774811
60850 774811 757204 739860 724092 709977 696202 682241 669053 657172 645659 633544 621043
60839 621043 608680 596308 583651 570971 558550 546196 533709 521269 509146 497592 487114
60828 487114 478160 470501 463616 457593 452869 449244 446096 443442 441652 440232 438149 435517 433764 433777 434918
$$ packed form
60911F49158l353k974k663j231Q65K619M078N505O365O503O978Q462R887J0114
60897G00313R790J0274J1617J2861J3482J3511J3042J2562J2930J4158J5099J5067
60885H54706J4834J5280J6071J6409J6155J5516J4566J3730J3577J3557J2135
60874A016536Q908N413L099J658M4k031m429p235j0206j2577j4104j5312j6273
60861I53491j6333j5540j4956j5023j5067j4994j5743j7341j8308j7939j7436
60850G74811j7607j7344j5768j4115j3775j3961j3188j1881j1513j2115j2501
60839F21043j2363j2372j2657j2680j2421j2354j2487j2440j2123j1554j0478
60828D87114q954p659o885o023m724l625l148k654j790j420k083k632j753J3J141
$$ plain form
60813 434918 436097 436783 436714 435783 434699 434764 436435 438780 440676 441893 442858 444177 446483 449853 453190 455067
60797 455067 455355 455099 454767 453798 452093 450669 450299 450517 450465 449795 448334 445924 443123 441089 440146 439279 437563
60780 437563 435153 432330 428629 423774 418643 414363 410956 407639 403994 400096 395942 391528 387262 383701
60766 383701 380993 378936 377368 376133 374967 373762 372743 372163 371991 372018 372064 372038 372076 372601 373910 375771 377763
60749 377763 379818 382029 384245 386490 389412 393546 398382 403001 407268 411391 414653 415976 415681 415195 414848
60734 414848 413452 410527 407398 405287 403544 400822 397065 393300 390104 387229 384325 381218 377777 374036
60720 374036 370238 366415 362308 357996 354095 351036 348637 346603 344903 343426 341840 340032 338124 335938
60706 335938 333153 330079 327498 325601 323920 322442 321721 321652 321265 320213 319348 319231 319190 318658 318389 319393 321421
$$ packed form
60813D34918J179O86o9r31j084O5J671K345J896J217R65J319K306L370L337J877
60797D55067K88k56l32r69j705j424l70K18n2o70j461k410k801k034r43q67j716
60780D37563k410k823l701m855n131m280l407l317l645l898m154m414m266l561
60766C83701k708k057j568j235j166j205j019n80j72K7M6k6L8N25J309J861J992
60749C77763K055K211K216K245K922M134M836M619M267M123L262J323k95m86l47
60734D14848j396k925l129k111j743k722l757l765l196k875k904l107l441l741
60720C74036l798l823m107m312l901l059k399k034j700j477j586j808j908k186
60706C35938k785l074k581j897j681j478p21o9l87j052q65j17m1n32k69J004K028
$$ plain form
60689 321421 323457 325144 326810 328576 330258 331795 333175 334303 335523 337755 341484 346023 350283 353879
60675 353879 357066 360189 363715 368233 373818 379826 385721 391528 397028 401300 403801 405230 406584 407893
60661 407893 408582 408584 408272 407720 406846 405986 405622 405718 405884 405983 406144 406471 407157 408451 410120 411403 411989 412507 413499
60642 413499 414337 413765 411126 406605 400738 394301 388264 383160 378682 374293 369913 365684 361653 358150 355960
60627 355960 355444 355870 356158 355893 355236 354311 353259 352418 351922 351575 351495 352222 353676 354732 354602 353984 354003 354638
60609 354638 355167 355646 356810 358672 360363 361440 362487 364151 366234 367993 368974 369412 369960 370928 371815 371947
60593 371947 371663 372158 373818 375430 375705 374953 374522 375048 376044 376912 377547 378110 378853 380026 381500 382773 383782
60576 383782 385255 387691 390511 392962 395431 398992 403897 409464 415390 422375 431342 442644 456131 471481
$$ packed form
60689C21421K036J687J666J766J682J537J380J128J220K232L729M539M260L596
60675C53879L187L123L526M518N585O008N895N807N500M272K501J429J354J309
60661D07893O89Kl12n52q74q60l64R6J66R9J61L27O86J294J669J283N86N18R92
60642D13499Q38n72k639m521n867o437o037n104m478m389m380m229m031l503k190
60627C55960n16M26K88k65o57r25j052q41m96l47q0P27J454J056j30o18J9O35
60609C54638N29M79J164J862J691J077J047J664K083J759R81M38N48R68Q87J32
60593C71947k84M95J660J612K75p52m31N26R96Q68O35N63P43J173J474J273J009
60576C83782J473K436K820K451K469L561M905N567N926O985Q967J1302J3487J5350
$$ plain form
60562 471481 488331 506306 524829 542726 558391 570645 579073 583289 582525 576640 567065 556010 544983
60549 544983 534665 525763 519098 514921 512877 512717 514616 518900 525834 535497 547575 561673 578201
60536 578201 598424 623008 650891 680071 708955 736302 760416 779413 792152 798262 797634 790752
60524 790752 779284 765468 750911 736475 722920 710779 699843 689669 680488 672842 666497 660723
60512 660723 655622 652248 651186 651810 653256 655462 658957 664106 670872 679059 688686 700351 715220 734401
60498 734401 758480 787946 823677 866477 916355 972752 1035190 1103022 1174683 1247823 1320117
60487 1320117 1389325 1452597 1506355 1547077 1572018 1579460 1568876 1540885 1496795 1438412 1368612
60476 1368612 1291604 1211783 1132313 1055218 982435 915888 856588 804394 758771 719216 684958
$$ packed form
60562D71481J6850J7975J8523J7897J5665J2254Q428M216p64n885r575j1055j1027
60549E44983j0318q902o665m177k044j60J899M284O934R663J2078J4098J6528
60536E78201K0223K4584K7883K9180K8884K7347K4114J8997J2739O110o28o882
60524G90752j1468j3816j4557j4436j3555j2141j0936j0174r181p646o345n774
60512F60723n101l374j062O24J446K206L495N149O766Q187R627J1665J4869J9181
60498G34401K4079K9466L5731M2800M9878N6397O2438O7832P1661P3140P2294
60487A320117O9208O3272N3758M0722K4941P442j0584k7991m4090n8383o9800
60476A368612p7008p9821p9470p7095p2783o6547n9300n2194m5623l9555l4258
$$ plain form
60465 684958 654949 628459 605280 585197 567614 551848 537588 524984 514293 505350 497366 489592
60453 489592 482216 476094 471419 467264 462756 458001 453430 448957 444492 440560 437573 434993 432083 429123
60439 429123 427014 426006 425690 425907 426741 427800 428396 428365 427945 427012 425223 422761 420211 417801 415484 413475
60423 413475 411887 410127 407520 404432 401938 400487 399804 399867 400948 402691 404199 405191 406222 407582 408851
60408 408851 409719 410477 411453 412579 413697 414749 415576 416057 416454 417054 417611 417751 417802 418439 419627 420667 421292
60391 421292 421955 423058 424607 426577 428829 430730 431682 432111 433172 435474 438671 442164 445354 447469 448224
60376 448224 448642 450146 452727 455023 456319 457338 458776 460214 461000 461297 461696 462523 463968 466151 468601
60361 468601 470313 470802 470606 470439 470499 470882 471949 473764 475802 477703 479880 482940 486949 491722 497413 504298
$$ packed form
60465F84958l0009k6490k3179k0083j7583j5766j4260j2604j0691q943p984p774
60453D89592p376o122m675m155m508m755m571m473m465l932k987k580k910k960
60439D29123k109j008l16K17Q34J059N96l1m20r33j789k462k550k410k317k009
60423D13475j588j760k607l088k494j451o83O3J081J743J508R92J031J360J269
60408D08851Q68P58R76J126J118J052Q27M81L97O00N57J40N1O37J188J040O25
60391D21292O63J103J549J970K252J901R52M29J061K302L197L493L190K115P55
60376D48224M18J504K581K296J296J019J438J438P86K97L99Q27J445K183K450
60361D68601J712M89j96j67O0L83J067J815K038J901K177L060M009M773N691O885
$$ plain form
60345 504298 512109 519919 526697 531959 536041 539647 542883 544861 544601 542100 538127 533345 528282 523776
60331 523776 520482 518007 515373 512386 509744 507822 506268 504864 503854 503167 502208 500695 498963 497208 495204
60316 495204 493001 491119 489771 488720 488179 489056 491807 495772 500131 505006 511222 519490 530197 543572
60302 543572 559840 579615 604071 633754 666837 699253 727105 748517 762905 769263 765955 752118
60290 752118 728978 699995 669652 641464 616693 595017 576190 560475 547711 536972 527525 519403
60278 519403 512763 507334 502819 499218 496313 493355 489732 485608 481569 477887 474392 470880 467479 464687
60264 464687 462953 462115 461528 461022 461168 462211 463363 463932 464459 465669 466907 466978 466258 466364 467735 469046 469290
60247 469290 468932 468572 467924 466818 465941 465777 465827 465686 466006 467544 469931 472079 473271 473319 472319 470814 469618
$$ packed form
60345E04298P811P810O778N262M082L606L236J978k60k501l973m782n063m506
60331E23776l294k475k634k987k642j922j554j404j010o87r59j513j732j755k004
60316D95204k203j882j348j051n41Q77K751L965M359M875O216Q268J0707J3375
60302E43572J6268J9775K4456K9683L3083L2416K7852K1412J4388O358l308j3837
60290G52118k3140k8983l0343k8188k4771k1676j8827j5715j2764j0739r447q122
60278E19403o640n429m515l601k905k958l623m124m039l682l495l512l401k792
60264D64687j734q38n87n06J46J043J152N69N27J210J238P1p20J06J371J311K44
60247D69290l58l60o48j106q77j64N0j41L20J538K387K148J192M8j000j505j196
$$ plain form
60230 469618 469001 468605 468446 469305 471729 475308 479289 483146 486236 487741 487525 486465 485558 485270 485916 487813
60214 487813 490715 493905 497113 500599 504196 507368 510490 514815 520607 526435 530973 534532 538117 542005
60200 542005 545986 550070 554133 557662 560523 563233 565853 567597 568204 568672 569833 571121 571627 571425 570897
60185 570897 569640 567145 563859 560573 557378 554143 551300 549102 546784 543515 539696 536317 533568 531084
60171 531084 529107 528294 528609 529268 529589 529260 528180 526702 525559 524853 523705 521609 519497 518586 518765 519042
60155 519042 519070 519247 519752 520491 521708 523769 526538 529670 533121 536702 539616 541253 542061 542942 544307 546391
60139 546391 549766 554574 559874 564822 570010 576560 584341 592198 599594 606854 614004 620444 625632 629133
60125 629133 630219 628464 624742 620708 617302 614510 612329 611058 610703 610918 611485 612216 612644 612566 612645 613630 615288
$$ packed form
60230D69618o17l96j59Q59K424L579L981L857L090J505k16j060r07k88O46J897
60214D87813K902L190L208L486L597L172L122M325N792N828M538L559L585L888
60200E42005L981M084M063L529K861K710K620J744O07M68J161J288N06k02n28
60185E70897j257k495l286l286l195l235k843k198k318l269l819l379k749k484
60171E31084j977q13L15O59L21l29j080j478j143p06j148k096k112r11J79K77
60155E19042K8J77N05P39J217K061K769L132L451L581K914J637Q08Q81J365K084
60139E46391L375M808N300M948N188O550P781P857P396P260P150O440N188L501
60125F29133J086j755l722m034l406k792k181j271l55K15N67P31M28p8P9R85J658
$$ plain form
60108 615288 616867 618259 619715 620681 620105 617917 615245 613021 611171 609131 606397 602561 597643 592503 588300
60093 588300 585475 583735 582851 582869 583754 585478 588246 591953 595755 598958 602100 606224 611236 615860 619163
60078 619163 621246 622468 622870 622427 621064 618260 613369 606581 599023 591796 585270 579262 573429 567449 561183
60063 561183 554593 547404 539300 530805 523351 517831 513582 509452 505244 501372 497685 493739 489847 486735
60049 486735 484371 482129 479977 478514 477924 477873 478432 480125 483000 486511 490332 494507 498733 502341 505123
60034 505123 507510 509847 512050 513988 515607 516717 517173 517113 516502 514736 511380 507012 502559 498003 492549
60019 492549 485951 478894 472128 465933 460379 455446 450974 446955 443731 441443 439701 438219 437226 436627 435537
60004 435537 433509 431499 430513 430015 428918 427600 427420 428512 429563 429754 429558 429588 429901 430532 431536 432439 432788
$$ packed form
60108F15288J579J392J456R66n76k188k672k224j850k040k734l836m918n140m203
60093E88300k825j740q84J8Q85J724K768L707L802L203L142M124N012M624L303
60078F19163K083J222M02m43j363k804m891o788p558p227o526o008n833n980o266
60063E61183o590p189q104q495p454n520m249m130m208l872l687l946l892l112
60049D86735k364k242k152j463n90n1N59J693K875L511L821M175M226L608K782
60034E05123K387K337K203J938J619J110M56o0o11j766l356m368m453m556n454
60019D92549o598p057o766o195n554m933m472m019l224k288j742j482r93n99j090
60004D35537k028k010r86m98j097j318j80J092J051J91j96L0L13O31J004R03L49
$$ plain form
59987 432788 433234 434907 437709 440452 442678 445009 447562 449487 450475 451415 453043 454969 456516 457548 458028
59972 458028 457684 456584 455269 453974 452471 450908 449975 449958 450403 450976 451947 453616 455945 458804 461920 464693
59956 464693 466869 469199 472439 475892 478121 478996 479651 480497 480768 480269 480016 480645 481574 482264 483006 483832 483969
59939 483969 483165 482460 482775 483675 484282 484523 484710 484712 484345 483928 483783 483772 483861 484420 485446 486203 486211 485945 486061 486623
59919 486623 487634 489583 492816 496851 500865 504453 507685 510951 514939 520082 525792 530922 535127 538993
59905 538993 542731 545765 547860 549505 550837 551283 550739 549978 549277 547910 545684 543869 543542 543982 543745 542654
59889 542654 541752 541856 543016 544939 547190 549448 552109 556054 561262 566418 570598 574522 579283 584600 589383
59874 589383 593426 597344 601149 603994 605240 604878 602942 599322 594264 588433 582416 576565 571265 566853
$$ packed form
59987D32788M46J673K802K743K226K331K553J925R88R40J628J926J547J032M80
59972D58028l44j100j315j295j503j563r33j7M45N73R71J669K329K859L116K773
59956D64693K176K330L240L453K229Q75O55Q46K71m99k53O29R29O90P42Q26J37
59939D83969q04p05L15R00O07K41J87Kl67m17j45j1Q9N59J026P57Qk66J16N62
59919D86623J011J949L233M035M014L588L232L266L988N143N710N130M205L866
59905E38993L738L034K095J645J332M46n44p61p01j367k226j815l27M40k37j091
59889E42654r02J04J160J923K251K258K661L945N208N156M180L924M761N317M783
59874E89383M043L918L805K845J246l62j936l620n058n831o017n851n300m412
$$ plain form
59860 566853 563246 559986 556751 553651 551069 549277 548135 547249 546631 547005 549057 552629 557257 563375 572148
59845 572148 584103 598595 614487 630323 643884 652936 657048 657817 657018 655500 654196 654812 658435 664161
59831 664161 669828 673523 673889 670033 662175 651862 640764 629565 618484 608120 599038 591078 583726
59818 583726 576713 569782 562529 555110 548497 543411 539527 536262 533675 531983 530830 529726 528646 527667
59804 527667 526600 525511 524821 524304 522814 519758 516074 512908 510157 507271 504658 503105 502346 501435 500256
59789 500256 499545 499633 500126 500685 501233 501514 501270 500774 500500 500454 500420 500507 500700 500198 498183 495157 492654 491586 491467
59770 491467 491237 490202 488184 485442 482614 480410 479214 479090 479857 480966 481706 481957 482417 483732 485769 488049
59754 488049 490357 492489 494015 494924 496109 498512 502099 506210 510515 515061 519721 524224 528452 532203
$$ packed form
59860E66853l607l260l235l100k582j792j142q86o18L74K052L572M628O118Q773
59845E72148J1955J4492J5892J5836J3561R052M112P69p99j518j304O16L623N726
59831F64161N667L695L66l856p858j0313j1098j1199j1081j0364r082p960p352
59818E83726p013o931p253p419o613n086l884l265k587j692j153j104j080r79
59804E27667j067j089o90n17j490l056l684l166k751k886k613j553p59r11j179
59789E00256p11Q8M93N59N48K81k44m96k74m6l4Q7J93n02k015l026k503j068j19
59770D91467k30j035k018k742k828k204j196j24P67J109P40K51M60J315K037K280
59754D88049K308K132J526R09J185K403L587M111M305M546M660M503M228L751
$$ plain form
59740 532203 535084 537179 539382 542362 545562 547895 549152 550020 550939 551679 551941 551765 551326 550781 550294 549907
59724 549907 549553 549346 549534 549986 550178 549939 549672 549521 549034 548104 547524 547903 548658 548799 548213 547363 546217 544400
59706 544400 542191 540459 539681 539704 540381 541789 543784 545867 547597 548858 549814 550776 551943 553132 554057 554988
59690 554988 556627 559122 561724 563629 564676 565014 564791 564430 564490 564852 564729 563833 562726 561644 559920 557224
59674 557224 554435 552450 550852 548605 545407 541571 537163 532148 526976 522248 518198 514997 512969 511923
59660 511923 510962 509657 508714 508799 509464 510075 510968 512740 515021 517016 518803 521131 524238 527564 530282 531629
59644 531629 531346 530283 529717 529492 527945 524441 520666 518280 516567 513932 510641 508226 506943 505688 504139
59629 504139 503152 503104 503390 503541 503495 502890 501416 499743 498749 497939 496028 493029 490359 488807 487721 486343 484669
$$ packed form
59740E32203K881K095K203K980L200K333J257Q68R19P40K62j76m39n45m87l87
59724E49907l54k07J88M52J92k39k67j51m87r30n80L79P55J41n86q50j146j817
59706E44400k209j732p78K3O77J408J995K083J730J261R56R62J167J189R25R31
59690E54988J639K495K602J905J047L38k23l61O0L62j23q96j107j082j724k696
59674E57224k789j985j598k247l198l836m408n015n172m728m050l201k028j046
59660E11923r61j305r43Q5O65O11Q93J772K281J995J787K328L107L326K718J347
59644E31629k83j063n66k25j547l504l775k386j713k635l291k415j283j255j549
59629E04139r87m8K86J51m6o05j474j673r94q10j911k999k670j552j086j378j674
$$ plain form
59612 484669 482764 480413 477740 475254 473155 471518 471086 472776 476250 479973 482758 484377 484796 484035 482891
59597 482891 482608 483455 484485 484878 484753 484596 484697 485177 485777 485685 484459 482977 482508 482961 483093 482374 481462 480786
59579 480786 479875 478323 476400 474409 472361 470509 469265 468301 466567 463509 459661 455932 452987 451325 451189
59564 451189 452178 453521 454756 455700 456103 456030 456217 457148 458131 458247 457889 458252 459535 460843 461738 462676 463926
59547 463926 465254 466796 469100 472194 475608 479367 484045 489874 496800 505349 516434 530566 548255
59534 548255 570500 596877 622979 641765 648527 643914 632170 617876 604523 594159 586963 581832
59522 581832 578178 576630 577665 580491 583755 586610 588679 589677 589473 587971 584813 579792 573501 566788 559695
59507 559695 551840 543683 536294 529957 524176 518960 514776 511148 506804 501473 496203 491619 487306 483276
$$ packed form
59612D84669j905k351k673k486k099j637m32J690L474L723K785J619M19p61j144
59597D82891k83Q47J030L93j25j57J01M80O00r2j226j482m69M53J32p19r12o76
59579D80786r11j552j923j991k048j852j244r64j734l058l848l729k945j662j36
59564D51189R89J343J235R44M03p3J87R31R83J16l58L63J283J308Q95R38J250
59547D63926J328J542K304L094L414L759M678N829O926Q549J1085J4132J7689
59534E48255K2245K6377K6102J8786O762m613j1744j4294j3353j0364p196n131
59522E81832l654j548J035K826L264K855K069R98k04j502l158n021o291o713p093
59507E59695p855q157p389o337n781n216m184l628m344n331n270m584m313m030
$$ plain form
59493 483276 480496 479274 478482 477157 475730 474942 474613 474239 473871 473698 473624 473854 475030 477276 479938 482710
59477 482710 486110 490400 495078 499944 505585 512180 518800 524541 529432 533613 536548 537846 538086 538097 538072
59462 538072 537941 537955 538345 539016 540019 541732 544331 547748 552342 558682 566461 574654 583007 592271 602582
59447 602582 612784 621888 630093 637764 644477 649702 653317 654718 652459 645762 635750 624507 613508
59434 613508 603413 594483 586569 579303 572818 567623 563598 560021 556812 554713 553963 554023 554968 557809 562887
59419 562887 569287 576583 585848 598162 613314 630712 650304 671953 695423 721791 752830 787130
59407 787130 818044 837451 841346 831130 811091 786404 762308 742518 728193 719776 719290 728713
59395 728713 745695 762552 770468 764590 745709 718538 688707 660166 634245 610867 590327 573547
$$ packed form
59493D83276k780j222p92j325j427p88l29l74l68j73p4K30J176K246K662K772
59477D82710L400M290M678M866N641O595O620N741M891M181K935J298K40J1k5
59462E38072j31J4L90O71J003J713K599L417M594O340P779Q193Q353R264J0311
59447F02582J0202R104Q205P671O713N225L615J401k259o697j0012j1243j0999
59434F13508j0095q930p914p266o485n195m025l577l209k099p50O0R45K841N078
59419E62887O400P296R265J2314J5152J7398J9592K1649K3470K6368L1039L4300
59407G87130L0914J9407L895j0216k0039k4687k4096j9790j4325q417m86R423
59395G28713J6982J6857P916n878j8881k7171k9831k8541k5921k3378k0540j6780
$$ plain form
59383 573547 561001 552088 545599 540475 536281 533254 531713 531320 531304 531509 532585 534851 537741 540746 544097
59368 544097 547941 551678 554900 558355 563120 569274 576086 583049 590031 596759 602916 608552 613916 619218
59354 619218 624876 631518 639328 647848 656879 666990 678664 691494 704719 718035 731408 744689
59342 744689 757903 771377 785064 798216 810136 820728 829937 837217 841951 843834 842553 837822 830036
59329 830036 820134 808512 794997 780181 765662 752303 739273 725598 711790 699135 688127 678468
59317 678468 669916 662332 655427 649184 644031 640061 636682 633463 630626 628293 626152 624448 624370 626687 630737
59302 630737 635442 640709 647242 655802 667254 682612 702321 725818 751665 776997 796830 805796
59290 805796 801840 787468 766987 743683 719931 697954 678947 662594 648552 637364 629042 622230
$$ packed form
59383E73547j2546q913o489n124m194l027j541l93j6K05J076K266K890L005L351
59368E44097L844L737L222L455M765O154O812O963O982O728O157N636N364N302
59354F19218N658O642P810Q520R031J0111J1674J2830J3225J3316J3373J3281
59342G44689J3214J3474J3687J3152J1920J0592R209P280M734J883j281m731p786
59329H30036r902j1622j3515j4816j4519j3359j3030j3675j3808j2655j1008r659
59317F78468q552p584o905o243n153l970l379l219k837k333k141j704p8K317M050
59302F30737M705N267O533Q560J1452J5358J9709K3497K5847K5332J9833Q966
59290H05796l956j4372k0481k3304k3752k1977j9007j6353j4042j1188q322o812
$$ plain form
59278 622230 616041 611404 609269 608758 608620 609317 612028 616531 621800 627896 635632 644947 655106 665907
59264 665907 677240 687993 696781 703338 708018 710551 710487 708183 704107 697894 689348 679578 669747 659533
59250 659533 648311 637034 627276 619036 611203 603670 597305 592260 587981 584678 583232 583830 585948 589318
59236 589318 593612 597680 600632 603277 607037 611791 616264 620063 623717 627024 629071 629758 629723 628802 626122
59221 626122 621740 616870 612460 608654 605451 602626 599317 595011 590730 587943 586624 585622 584601 584138
59207 584138 584314 584700 585399 586610 587531 587319 586806 587466 588977 589651 589174 588966 589793 590932 591974 593555 595863
59190 595863 598113 599969 601917 603835 604772 604738 605167 606927 609147 610655 611336 611505 611156 610561 610563 611508 612665
59173 612665 613273 613511 614043 615224 617131 619768 623014 626841 631588 637534 644399 651875 660269 669743 679204
$$ packed form
59278F22230o189m637k135n11j38O97K711M503N269O096P736R315J0159J0801
59264F65907J1333J0753Q788O557M680K533o4k304m076o213q546r770r831j0214
59250F59533j1222j1277r758q240p833p533o365n045m279l303j446N98K118L370
59236E89318M294M068K952K645L760M754M473L799L654L307K047O87l5r21k680
59221F26122m382m870m410l806l203k825l309m306m281k787j319j002j021m63
59207E84138J76L86O99J211R21k12n13O60J511O74m77k08Q27J139J042J581K308
59190E95863K250J856J948J918R37l4M29J760K220J508O81J69l49n95KR45J157
59173F12665O08K38N32J181J907K637L246L827M747N946O865P476Q394R474R461
$$ plain form
59158 679204 686973 692398 695982 698201 699177 699173 698322 696135 692305 687645 683171 678664 673296 667290 661654
59143 661654 656644 651817 647279 643467 639923 635665 630568 625133 619249 612614 605971 600377 595524 590323
59129 590323 584831 579969 575661 571090 566675 563964 563596 565041 568179 573280 579516 585466 591173 597818
59115 597818 605377 612663 619793 628337 638600 648928 658329 667703 677760 687645 696461 704417 711642
59102 711642 717549 722155 726415 730434 732891 733059 731886 730281 727822 724011 719423 714772 710102 705667
59088 705667 702350 700454 699210 698035 697074 696078 694128 690949 687131 682572 676251 668079 659396 651021 642390
59073 642390 633291 624812 617740 611497 605524 600283 596050 592127 588078 584442 581472 578566 575661 573721
59059 573721 573080 572700 571845 570987 570385 569400 568028 567359 567552 567080 565083 562834 561679 561147 560364 559690 559522
$$ packed form
59158F79204P769N425L584K219R76mq51k187l830m660m474m507n368o006n636
59143F61654n010m827m538l812l544m258n097n435n884o635o643n594m853n201
59129E90323n492m862m308m571m415k711l68J445L138N101O236N950N707O645
59115E97818P559P286P130Q544J0263J0328R401R374J0057R885Q816P956P225
59102G11642N907M606M260M019K457J68j173j605k459l811m588m651m670m435
59088G05667l317j896j244j175r61r96j950l179l818m559o321q172q683q375q631
59073F42390r099q479p072o243n973n241m233l923m049l636k970k906k905j940
59059E73721o41l80q55q58o02r85j372o69J93m72j997k249j155n32p83o74j68
$$ plain form
59042 559522 559022 557666 556647 557040 557772 557158 555505 554485 554726 555619 556813 558335 559761 560691 561709 563683
59026 563683 566569 569951 574233 580242 588082 597318 607811 619456 631592 643543 655296 666942 677890
59013 677890 687170 693970 697528 697458 694720 691331 688495 685850 683011 680617 679183 678198 677301 677252 678769 681388
58997 681388 684415 688040 692576 697516 702282 706985 711623 715430 717856 719195 719545 718291 715418 712032
58983 712032 708542 703660 696469 688354 681491 676342 671979 668055 665064 663257 662546 663099 665138 668647 673931
58968 673931 681581 691150 700876 709657 718269 727741 737696 747501 757888 769883 782797 794686 804298
58955 804298 811458 816099 818092 817634 814833 809275 800734 789766 777076 763015 748260 733999 720741
58942 720741 707935 695445 684337 675400 668107 661860 656966 653340 649597 644760 639764 635958 633166
$$ packed form
59042E59522n00j356j019L93P32o14j653j020K41Q93J194J522J426R30J018J974
59026E63683K886L382M282O009P840R236J0493J1645J2136J1951J1753J1646J0948
59013F77890R280O800L558p0k738l389k836k645k839k394j434r85q97m9J517K619
58997F81388L027L625M536M940M766M703M638L807K426J339L50j254k873l386
58983G12032l490m882p191q115o863n149m363l924k991j807p11N53K039L509N284
58968F73931P650R569R726Q781Q612R472R955R805J0387J1995J2914J1889R612
58955H04298P160M641J993m58k801n558q541j0968j2690j4061j4755j4261j3258
58942G20741j2806j2490j1108q937p293o247m894l626l743m837m996l806k792
$$ plain form
58929 633166 630478 627897 625806 623721 621026 618139 615688 613323 610563 607948 606102 604496 602388 600172
58915 600172 598583 597486 596640 596649 597768 598757 598470 597805 598611 601368 605380 610442 616817 624235 632413 642022
58899 642022 653772 667010 680470 693759 706910 719279 730343 740911 752114 763839 775601
58888 775601 788351 803828 822498 843402 865642 888722 911820 933929 954362 972204 985977
58877 985977 994980 1000300 1003320 1003848 1000708 993355 981862 966287 947424 927343 907869 889302 871749
58864 871749 856583 845047 836346 828718 821569 814972 807980 799240 788715 777267 765153 752389 739757
58851 739757 727852 715855 702894 689957 678815 669752 661917 655178 649878 645428 640848 636135 631520
58838 631520 626190 619474 612478 606659 601496 595529 588941 583055 577921 572582 567265 563036 559612 555805
$$ packed form
58929F33166k688k581k091k085k695k887k451k365k760k615j846j606k108k216
58915F00172j589j097q46RJ119R89k87o65Q06K757M012N062O375P418Q178R609
58899F42022J1750J3238J3460J3289J3151J2369J1064J0568J1203J1725J1762
58888G75601J2750J5477J8670K0904K2240K3080K3098K2109K0433J7842J3773
58877I85977R003N320L020N28l140p353j1493j5575j8863k0081j9474j8567j7553
58864H71749j5166j1536q701p628p149o597o992q740j0525j1448j2114j2764j2632
58851G39757j1905j1997j2961j2937j1142r063p835o739n300m450m580m713m615
58838F31520n330o716o996n819n163n967o588n886n134n339n317m229l424l807
$$ plain form
58824 555805 551948 549652 549106 548773 547901 547375 547836 548783 549812 551185 553040 555454 559175 564641 570470 574572
58808 574572 576714 578375 580260 581714 582458 583036 583384 582702 580951 579022 577354 575786 574627 574293 573960 572200
58792 572200 568948 565360 561924 558305 554846 552448 550945 549282 547402 546340 546517 547502 549465 553216 558680
58777 558680 564822 571124 577759 584391 590231 595105 599067 601285 600866 598433 595270 591372 586171 580697
58763 580697 576854 574673 572412 569393 566623 564498 562138 559377 557475 557251 558158 559608 561694 564240 566602
58748 566602 568613 570508 571983 572785 573905 576506 579945 582708 585113 589022 594950 601571 608163 615347
58734 615347 623164 630586 637389 644539 652289 659783 666985 675082 684340 693307 700768 706982 712528 717475
58720 717475 722112 727048 732255 737310 742664 749241 756899 764892 773612 784010 795407 805892 814815
$$ packed form
58824E55805l857k296n46l33q72n26M61R47J029J373J855K414L721N466N829M102
58808E74572K142J661J885J454P44N78L48o82j751j929j668j568j159l34l33j760
58792E72200l252l588l436l619l459k398j503j663j880j062J77R85J963L751N464
58777E58680O142O302O635O632N840M874L962K218m19k433l163l898n201n474
58763E80697l843k181k261l019k770k125k360k761j902k24R07J450K086K546K362
58748E66602K011J895J475Q02J120K601L439K763K405L909N928O621O592P184
58734F15347P817P422O803P150P750P494P202Q097R258Q967P461O214N546M947
58720G17475M637M936N207N055N354O577P658P993Q720J0398J1397J0485Q923
$$ plain form
58707 814815 822831 829474 833051 833192 831211 827493 820681 809951 795991 779243 759321 736804 713502
58694 713502 690334 666961 644092 623932 607484 593389 580342 568722 558983 550329 542046 534510
58682 534510 527937 521631 515288 509608 504948 500797 497158 494894 494180 494104 494268 495215 496913 498529 500249
58667 500249 503606 509450 517077 525769 535582 546277 557146 568226 579879 590855 598642 602225 602815
58654 602815 601621 598789 594748 590493 586074 580774 575129 570690 567411 563490 558255 553017 548619 544464
58640 544464 540535 537899 536388 534172 530591 527264 525494 524760 524622 525808 528328 530670 532013 533232 534752
58625 534752 535475 534842 533995 533841 533951 534271 535887 539090 542679 546141 550569 556514 562977 569436 576727 584930
58609 584930 592496 598420 603224 606859 607971 606322 603715 601355 598451 594542 590879 588213 585412 581627
$$ packed form
58707H14815Q016O643L577J41j981l718o812j0730j3960j6748j9922k2517k3302
58694G13502k3168k3373k2869k0160j6448j4095j3047j1620r739q654q283p536
58682E34510o573o306o343n680m660m151l639k264p14p6J64R47J698J616J720
58667E00249L357N844P627Q692R813J0695J0869J1080J1653J0976P787L583N90
58654F02815j194k832m041m255m419n300n645m439l279l921n235n238m398m155
58640E44464l929k636j511k216l581l327j770p34j38J186K520K342J343J219J520
58625E34752P23o33q47j54J10L20J616L203L589L462M428N945O463O459P291Q203
58609E84930P566N924M804L635J112j649k607k360k904l909l663k666k801l785
$$ plain form
58595 581627 577801 574773 571903 568809 566395 564985 563515 561796 561474 563543 566970 570961 576414 583996
58581 583996 592914 602692 613866 625794 636207 644227 651487 659045 665714 670799 675831 682017 688508
58568 688508 694874 702788 713418 725520 737950 751826 768458 787370 808056 831402 857545 884456
58556 884456 910279 934905 957751 976492 989700 998358 1003251 1003507 999401 993648 987876 980550 970522
58543 970522 959744 950139 940561 929386 917428 905600 892294 875987 858030 840073 821081 799969
58531 799969 778994 761319 747040 734547 724014 716492 711227 706956 704399 704593 706114 706788 706960 708413
58517 708413 711226 714171 716993 719899 722027 722692 722921 723716 724140 723011 720826 718119 713889 707846 702198
58502 702198 698786 696247 692404 687638 683486 679793 675763 672065 669410 666791 663496 660998 660502 660575 659716
$$ packed form
58595E81627l826l028k870l094k414j410j470j719l22K069L427L991N453P582
58581E83996Q918R778J1174J1928J0413Q020P260P558O669N085N032O186O491
58568F88508O366P914J0630J2102J2430J3876J6632J8912K0686K3346K6143K6911
58556H84456K5823K4626K2846J8741J3208Q658M893K56m106n753n772p326j0028
58543I70522j0778r605r578j1175j1958j1828j3306j6307j7957j7957j8992k1112
58531G99969k0975j7675j4279j2493j0533p522n265m271k557J94J521O74J72J453
58517G08413K813K945K822K906K128O65K29P95M24j129k185k707m230o043n648
58502G02198l412k539l843m766m152l693m030l698k655k619l295k498m96P3q59
$$ plain form
58487 659716 659210 660794 663498 665531 667459 670845 675605 681266 688862 699026 710236 721470 734292
58474 734292 749537 764426 776043 785296 794162 801313 804056 802626 799054 793528 785376 775954 767197
58461 767197 758844 750207 742908 738766 736806 735503 735901 739329 744245 748833 754475 762992 772636 780610
58447 780610 787375 794373 799666 800202 796657 791831 785980 778116 770187 765295 762993 760689 758546 758671 760614
58432 760614 762057 762993 765106 768056 770554 773950 780485 788928 796169 802200 809494 818512 827968 838305
58418 838305 850475 862165 869640 872715 873960 874026 871887 868537 865939 863103 857551 849902 842900 836869
58404 836869 830318 823923 819507 816112 811545 806825 804665 804639 804352 804219 806380 810014 812626 814939 819531
58389 819531 825553 829850 832459 835917 839948 842099 842921 845195 848528 849992 849654 850201 851598 851518 850687 852364
$$ packed form
58487F59716n06J584K704K033J928L386M760N661P596J0164J1210J1234J2822
58474G34292J5245J4889J1617R253Q866P151K743j430l572n526q152r422q757
58461G67197q353q637p299m142j960j303L98L428M916M588N642Q517R644P974
58447G80610O765O998N293N36l545m826n851p864p929m892k302k304k143J25J943
58432G60614J443R36K113K950K498L396O535Q443P241O031P294R018R456J0337
58418H38305J2170J1690P475L075J245O6k139l350k598k836n552p649p002o031
58404H36869o551o395m416l395m567m720k160k6k87j33K161L634K612K313M592
58389H19531O022M297K609L458M031K151Q22K274L333J464l38N47J397q0q31J677
$$ plain form
58373 852364 856636 860637 864252 870259 878824 887161 894703 903453 913260 921945 930089 940567 953371 965874
58359 965874 977908 991419 1005571 1017521 1027700 1038860 1050347 1058889 1064594 1070469 1076496 1080092
58347 1080092 1081955 1085400 1090232 1093463 1095777 1100937 1109029 1116759 1124199 1134594 1147585 1159472 1170290
58334 1170290 1183700 1199728 1214634 1228257 1244291 1262778 1279593 1294011 1309525 1326375 1340542
58323 1340542 1351069 1361152 1371142 1377902 1382035 1388191 1397038 1404444 1409728 1416991 1427028 1435847 1442781
58310 1442781 1452188 1465390 1478747 1491456 1507361 1527093 1546258 1563462 1582389 1603970 1624339
58299 1624339 1642475 1662019 1683606 1703404 1721047 1740810 1763139 1783460 1801262 1821587 1845549
58288 1845549 1868466 1889534 1913991 1943109 1971473 1997062 2024635 2056181 2087503 2117351 2150316
$$ packed form
58373H52364M272M001L615O007Q565Q337P542Q750R807Q685Q144J0478J2804J2503
58359I65874J2034J3511J4152J1950J0179J1160J1487Q542N705N875O027L596
58347A080092J863L445M832L231K314N160Q092P730P440J0395J2991J1887J0818
58334A170290J3410J6028J4906J3623J6034J8487J6815J4418J5514J6850J4167
58323A340542J0527J0083R990O760M133O156Q847P406N284P263J0037Q819O934
58310A442781R407J3202J3357J2709J5905J9732J9165J7204J8927K1581K0369
58299A624339J8136J9544K1587J9798J7643J9763K2329K0321J7802K0325K3962
58288A845549K2917K1068K4457K9118K8364K5589K7573L1546L1322K9848L2965
$$ plain form
58277 2150316 2187473 2223856 2258541 2297320 2341921 2386620 2429175 2474916 2526146 2577858 2628063
58266 2628063 2682054 2742172 2803672 2864815 2930562 3002186 3074126 3145255 3221918 3305437 3388235
58255 3388235 3466994 3547800 3633566 3718733 3801450 3888318 3981661 4074991 4166649 4264720 4372705
58244 4372705 4484014 4596543 4718340 4852440 4991033 5131618 5283708 5452007 5628546
58235 5628546 5809367 6002959 6213822 6434245 6661338 6905358 7171759 7452319 7743640
58226 7743640 8056454 8396588 8755767 9132086 9539828 9987409 10466103 10972924 11523300
58217 11523300 12128222 12781476 13483567 14254759 15109537 16043055 17058763 18183420 19438433
58208 19438433 20825320 22358343 24081722 26035742 28240277 30735028 33601311 36921838
$$ packed form
58277B150316L7157L6383L4685L8779M4601M4699M2555M5741N1230N1712N0205
58266B628063N3991O0118O1500O1143O5747P1624P1940P1129P6663Q3519Q2798
58255C388235P8759Q0806Q5766Q5167Q2717Q6868R3343R3330R1658R8071J07985
58244D372705J11309J12529J21797J34100J38593J40585J52090J68299J76539
58235E628546J80821J93592K10863K20423K27093K44020K66401K80560K91321
58226G743640L12814L40134L59179L76319M07742M47581M78694N06821N50376
58217A1523300O04922O53254P02091P71192Q54778R33518J015708J124657J255013
58208A9438433J386887J533023J723379J954020K204535K494751K866283L320527
$$ plain form
58200 36921838 40761388 45217627 50450985 56639277 63959058 72653433 83070738 95613191
58192 95613191 110737306 129067004 151420352 178651481 211527053 250644046 295826237
58185 295826237 344748080 391895604 429546196 450869624 453036121 438031424 410938926
58178 410938926 377346175 341534708 305955728 271651399 239054751 208604483 180842221
58171 180842221 156156690 134619974 116083466 100316173 87019982 75827576 66382497
58164 66382497 58405308 51663018 45928942 41012069 36786321 33154479 30011731 27268712
58156 27268712 24875497 22792099 20960089 19326477 17869117 16573865 15408931 14343385
58148 14343385 13369473 12485427 11675293 10924802 10238353 9621185 9061045 8544274 8073574
$$ packed form
58200C6921838L839550M456239N233358O188292P319781Q694375J0417305J2542453
58192I5613191J5124115J8329698K2353348K7231129L2875572L9116993M5182191
58185B95826237M8921843M7147524L7650592K1323428K166497j5004697k7092498
58178D10938926l3592751l5811467l5578980l4304329l2596648l0450268k7762262
58171A80842221k4685531k1536716j8536508j5767293j3296191j1192406r445079
58164F6382497p977189o742290n734076m916873m225748l631842l142748k743019
58156B7268712k393215k083398j832010j633612j457360j295252j164934j065546
58148A4343385r73912q84046q10134p50491o86449o17168n60140n16771m70700
$$ plain form
58139 8073574 7653406 7273404 6921950 6601077 6312484 6043125 5779910 5525654 5286560
58130 5286560 5057142 4831599 4617262 4422370 4241773 4067952 3904885 3757836 3620369
58121 3620369 3484809 3355658 3239886 3133284 3028749 2929102 2839538 2755873 2672051 2591333
58111 2591333 2518702 2449856 2378852 2309313 2247254 2189819 2131523 2074854 2024385 1976859 1927223
58100 1927223 1878328 1834921 1794021 1750778 1708021 1670628 1636071 1599701 1563899 1532883 1503771
58089 1503771 1471853 1439768 1412590 1388595 1363512 1339151 1319134 1300534 1278450 1254823 1234380
58078 1234380 1215666 1194315 1171505 1151077 1131582 1109082 1084843 1062813 1042387 1020693 999053
58067 999053 980359 963133 944827 927813 915405 905205 893080 880558 871532 864649 855808 845398
$$ packed form
58139H073574m20168l80002l51454l20873k88593k69359k63215k54256k39094
58130E286560k29418k25543k14337j94892j80597j73821j63067j47049j37467
58121C620369j35560j29151j15772j06602j04535r9647q9564q3665q3822q0718
58111B591333p2631o8846p1004o9539o2059n7435n8296n6669n0469m7526m9636
58100A927223m8895m3407m0900m3243m2757l7393l4557l6370l5802l1016k9112
58089A503771l1918l2085k7178k3995k5083k4361k0017j8600k2084k3627k0443
58078A234380j8714k1351k2810k0428j9495k2500k4239k2030k0426k1694k1640
58067I99053j8694j7226j8306j7014j2408j0200j2125j2522r026o883q841j0410
$$ plain form
58055 845398 836368 827729 816583 804165 793594 783965 772743 761555 753493 747090 739001 730291 724138
58042 724138 719652 713861 707436 702535 697366 689032 679563 672984 668365 661809 653465 646532 640908 633802
58028 633802 625242 617243 608835 597553 584777 574210 566085 557868 549464 542701 536978 530421 524140
58015 524140 520445 518124 514271 509379 505830 502866 498120 492740 489842 488975 487150 484380 483223 483687 483410
58000 483410 482141 481477 480967 478926 476223 474919 474239 472235 470215 470892 473288 474165 473431 473444 473994 472890
57984 472890 470669 469786 469766 467964 464603 462255 460745 457390 452063 447270 443375 438427 432729 428928 427311
57969 427311 425414 422612 420883 420674 420035 418277 416713 415469 413267 410529 409151 409050 408454 407510 408001 409530
57953 409530 409712 408179 406788 405849 403814 400757 398555 397487 396159 394851 395447 397971 400663 403540 408451
$$ packed form
58055H45398r030q639j1146j2418j0571r629j1222j1188q062o403q089q710o153
58042G24138m486n791o425m901n169q334r469o579m619o556q344o933n624p106
58028F33802q560p999q408j1282j2776j0567q125q217q404o763n723o557o281
58015E24140l695k321l853m892l549k964m746n380k898q67j825k770j157M64k77
58000D83410j269o64n10k041k703j304o80k004k020O77K396Q77p34J3N50j104
57984D72890k221q83k0j802l361k348j510l355n327m793l895m948n698l801j617
57969D27311j897k802j729k09o39j758j564j244k202k738j378j01n96r44M91J529
57953D09530J82j533j391r39k035l057k202j068j328j308N96K524K692K877M911
$$ plain form
57938 408451 415558 423149 430785 439285 447867 455065 462301 472629 485762 498143 508110 517206 526157
57925 526157 533578 539154 544260 548681 550349 549053 546845 544074 538601 529787 519846 510256 500161 489187
57911 489187 478615 468818 458663 448370 439922 433788 428194 422401 417660 414136 410035 404716 399643
57898 399643 395275 390074 383696 378196 374784 372153 369210 366913 366231 366627 367655 369799 372886 375883 378923
57883 378923 383231 388576 393346 397584 403221 410625 417680 422985 427204 430448 431182 428768 424493 419181
57869 419181 412353 404581 397923 392985 388132 382519 377284 372796 367553 361003 354846 350313 346707 343797
57855 343797 342981 344692 347171 349275 352134 356641 361630 365988 370329 375107 379232 381993 384272 386491
57841 386491 387460 386617 385268 384140 381889 377602 372822 369372 366883 364044 360679 357127 353172 349044 346042
$$ packed form
57938D08451P107P591P636Q500Q582P198P236J0328J3133J2381R967R096Q951
57925E26157P421N576N106M421J668j296k208k771n473q814r941r590j0095j0974
57911D89187j0572r797j0155j0293q448o134n594n793m741l524m101n319n073
57898C99643m368n201o378n500l412k631k943k297o82L96J028K144L087K997L040
57883C78923M308N345M770M238N637P404P055N305M219L244P34k414m275n312
57869D19181o828p772o658m938m853n613n235m488n243o550o157m533l606k910
57855C43797q16J711K479K104K859M507M989M358M341M778M125K761K279K219
57841C86491R69q43j349j128k251m287m780l450k489k839l365l552l955m128l002
$$ plain form
57826 346042 344820 344370 343754 343401 343808 344592 345763 348159 351629 354603 356505 358760 362372 366387 369912
57811 369912 373652 378047 381683 383048 382261 379813 375312 368908 362353 357056 352431 347467 342548 338494
57797 338494 335181 332399 330769 330566 330871 330978 331306 331935 331714 329941 327572 325729 324336 323132 322474 322163
57781 322163 321035 318864 317128 316868 317437 318417 321007 326095 332567 338974 345452 352568 359649 365735 370969
57766 370969 375715 379409 381558 382752 383561 383572 382517 381088 379618 377289 373647 369536 365560 361117 356001
57751 356001 351348 347872 344762 341591 339595 339675 340684 341184 341366 341758 341607 340220 338442 337089 335245 331923
57735 331923 328092 325221 322875 319675 315731 312311 309825 307819 306271 305318 304306 302579 300638 299257
57721 299257 298103 296464 294622 293346 292755 292672 293206 293927 293531 291506 289030 287072 284808 281297 277461 274794
$$ packed form
57826C46042j222m50o16l53M07P84J171K396L470K974J902K255L612M015L525
57811C69912L740M395L636J365p87k448m501o404o555n297m625m964m919m054
57797C38494l313k782j630k03L05J07L28O29k21j773k369j843j393j204o58l11
57781C22163j128k171j736k60N69R80K590N088O472O407O478P116P081O086N234
57766C70969M746L694K149J194Q09J1j055j429j470k329l642m111l976m443n116
57751C56001m653l476l110l171j996Q0J009N00J82L92j51j387j778j353j844l322
57735C31923l831k871k346l200l944l420k486k006j548r53j012j727j941j381
57721B99257j154j639j842j276n91q3N34P21l96k025k476j958k264l511l836k667
$$ plain form
57705 274794 273140 271374 269460 268164 267451 266743 266141 266047 266131 265911 265647 265517 264789 263083 261567 261513 262454 263080
57687 263080 263135 263119 263042 262906 263571 265599 267968 269438 270546 272876 276998 282489 289334 297956 308451 321105
57671 321105 337168 358056 384587 417957 460406 513606 577105 648800 724704 796317 850429
57660 850429 875277 867691 833279 780837 718488 653625 592591 538926 493260 455250 424496 399877
57648 399877 379792 363329 350142 339446 330358 322895 317395 313322 309885 307270 305852 304802 303092
57635 303092 301289 300667 300983 300954 300601 301147 302665 303698 303428 302571 301903 301390 300935 300638 300092 298723 296940
57618 296940 295773 295320 294683 293365 291612 289520 287072 284836 283399 282217 280341 278062 276566 276176 276279
57603 276279 276721 277762 278870 279209 279279 280442 282754 284795 285773 286220 286482 286109 285111 284294 283913 283310 282261
$$ packed form
57705B74794j654j766j914j296p13p08o02r4Q4k20k64j30p28j706j516n4R41O26
57687B63080N5j6p7j36O65K028K369J470J108K330M122N491O845Q622J0495J2654
57671C21105J6063K0888K6531L3370M2449N3200O3499P1695P5904P1613N4112
57660H50429K4848p586l4412n2442o2349o4863o1034n3665m5666l8010l0754k4619
57648C99877k0085j6463j3187j0696r088p463n500m073l437k615j418j050j710
57635C03092j803o22L16k9l53N46J518J033k70q57o68n13m55k97n46j369j783
57618B96940j167m53o37j318j753k092k448k236j437j182j876k279j496l90J03
57603B76279M42J041J108L39P0J163K312K041R78M47K62l73r98q17l81o03j049
$$ plain form
57586 282261 281409 280985 280299 278901 277128 275186 272853 270396 268643 267809 267331 267061 267479 268402 268735 267980 266917
57569 266917 266326 266002 265507 264920 264371 263608 262514 261407 260590 260147 260207 260647 260615 259319 257368 256361 257032 258697
57551 258697 260570 262493 264267 265437 266153 267241 268959 270503 271122 271042 270964 271357 272413 274051 275808 277355
57535 277355 279082 281497 284131 285882 286378 286111 285377 284148 282966 282769 283606 284611 285434 286694 288744 291051
57519 291051 293158 295405 298286 301863 306094 310960 315944 320110 322962 324735 325858 326809 328375 331136
57505 331136 334562 337404 339061 339828 339994 339702 339600 340432 341772 342217 341172 339521 338299 337620 337191 336984
57489 336984 337028 337211 337559 338088 338399 338121 337754 338207 339491 340730 341471 342048 342660 343073 343339 343860 344650 345413
57471 345413 346358 347972 350012 351769 353290 355186 357202 358292 358289 358263 358943 359989 361140 362848 365358 368284
$$ packed form
57586B82261q52m24o86j398j773j942k333k457j753q34m78k70M18R23L33p55j063
57569B66917n91l24m95n87n49p63j094j107q17m43O0M40l2j296j951j007O71J665
57551B58697J873J923J774J170P16J088J718J544O19q0p8L93J056J638J757J547
57535B77355J727K415K634J751M96k67p34j229j182j97Q37J005Q23J260K050K307
57519B91051K107K247K881L577M231M866M984M166K852J773J123R51J566K761
57505C31136L426K842J657P67J66k92j02Q32J340M45j045j651j222o79m29k07
57489C36984M4J83L48N29L11k78l67M53J284J239P41N77O12M13K66N21P90P63
57471C45413R45J614K040J757J521J896K016J090lk6O80J046J151J708K510K926
$$ plain form
57455 368284 371502 375345 379450 382569 384127 385021 386360 388332 390718 393505 396394 398641 400049 401409
57441 401409 403446 406050 408891 412042 415563 419222 422940 426831 430567 433566 436017 438815 442231 445571
57427 445571 448407 451152 454057 456674 458768 460860 463437 466412 469634 473049 476115 478140 479544 481747
57413 481747 485331 489331 492721 495547 498182 500655 503340 507181 512428 518005 522847 527113 531476 536056
57399 536056 540695 545542 550686 555782 560491 564797 568624 571813 574703 577979 581812 585944 590590 596144
57385 596144 601956 606772 610621 614933 620402 626148 631474 636919 642926 648977 654856 661325 668554 675257
57371 675257 680480 685034 690057 695358 700402 705807 712433 719812 726803 733238 739752 746529 753282 760032
57357 760032 766983 774029 781144 788664 796568 804140 811029 817877 825249 832793 840141 847673 855564 863106
$$ packed form
57455C68284L218L843M105L119J558Q94J339J972K386K787K889K247J408J360
57441D01409K037K604K841L151L521L659L718L891L736K999K451K798L416L340
57427D45571K836K745K905K617K094K092K577K975L222L415L066K025J404K203
57413D81747L584M000L390K826K635K473K685L841N247N577M842M266M363M580
57399E36056M639M847N144N096M709M306L827L189K890L276L833M132M646N554
57385E96144N812M816L849M312N469N746N326N445O007O051N879O469P229O703
57371F75257N223M554N023N301N044N405O626P379O991O435O514O777O753O750
57357G60032O951P046P115P520P904P572O889O848P372P544P348P532P891P542
$$ plain form
57343 863106 869885 876700 884276 892027 899197 906346 914496 923539 932700 941959 951796 962063 972171 981928
57329 981928 991214 999408 1006200 1012496 1019568 1027730 1036598 1045965 1055609 1064973 1073950 1083237 1093078 1102561
57315 1102561 1111208 1120180 1130654 1141949 1152722 1163171 1174470 1186655 1198716 1210386 1222271 1234541
57303 1234541 1246906 1259703 1273489 1287734 1301313 1314209 1327442 1341346 1355223 1368681 1382101
57292 1382101 1395707 1409271 1422785 1436443 1449967 1462925 1475696 1489197 1503673 1518533 1533244
57281 1533244 1547643 1561675 1575749 1591053 1608543 1627778 1647574 1667472 1687708 1708212 1728747
57270 1728747 1749697 1771645 1794409 1817495 1841072 1865490 1890286 1914816 1939429 1964773 1990354
57259 1990354 2015101 2038964 2062563 2085672 2107600 2128881 2150935 2174038 2197198 2220053 2243379
$$ packed form
57343H63106O779O815P576P751P170P149Q150R043R161R259R837J0267J0108R757
57329I81928R286Q194O792O296P072Q162Q868R367R644R364Q977R287R841R483
57315A102561Q647Q972J0474J1295J0773J0449J1299J2185J2061J1670J1885J2270
57303A234541J2365J2797J3786J4245J3579J2896J3233J3904J3877J3458J3420
57292A382101J3606J3564J3514J3658J3524J2958J2771J3501J4476J4860J4711
57281A533244J4399J4032J4074J5304J7490J9235J9796J9898K0236K0504K0535
57270A728747K0950K1948K2764K3086K3577K4418K4796K4530K4613K5344K5581
57259A990354K4747K3863K3599K3109K1928K1281K2054K3103K3160K2855K3326
$$ plain form
57248 2243379 2267535 2291880 2316043 2340368 2364866 2389040 2413064 2437842 2463612 2489694 2515817
57237 2515817 2542380 2569197 2595480 2621456 2648524 2677176 2706139 2734265 2762033 2790356 2819099
57226 2819099 2847793 2876962 2907711 2940459 2974758 3009929 3045364 3080631 3115676 3150598 3185178
57215 3185178 3219216 3253265 3288162 3323721 3358846 3393123 3427336 3462122 3497118 3531839 3566414
57204 3566414 3600972 3635206 3669107 3703352 3738391 3773793 3808956 3843832 3878574 3913126 3947523
57193 3947523 3981903 4015897 4048779 4080610 4112459 4145050 4177890 4210153 4241608 4272124 4301004
57182 4301004 4327577 4352000 4374906 4396626 4417194 4436726 4455411 4473461 4491343 4509673 4528658
57171 4528658 4548103 4568144 4589368 4611975 4635261 4658223 4680288 4701358 4721716 4742015 4762739
$$ packed form
57248B243379K4156K4345K4163K4325K4498K4174K4024K4778K5770K6082K6123
57237B515817K6563K6817K6283K5976K7068K8652K8963K8126K7768K8323K8743
57226B819099K8694K9169L0749L2748L4299L5171L5435L5267L5045L4922L4580
57215C185178L4038L4049L4897L5559L5125L4277L4213L4786L4996L4721L4575
57204C566414L4558L4234L3901L4245L5039L5402L5163L4876L4742L4552L4397
57193C947523L4380L3994L2882L1831L1849L2591L2840L2263L1455L0516K8880
57182D301004K6573K4423K2906K1720K0568J9532J8685J8050J7882J8330J8985
57171D528658J9445K0041K1224K2607K3286K2962K2065K1070K0358K0299K0724
$$ plain form
57160 4762739 4783500 4803422 4822400 4841369 4861170 4881689 4902202 4921942 4940222 4956731 4971912
57149 4971912 4986393 4999895 5011355 5020165 5026524 5030529 5031865 5030710 5028039 5024604 5020395 5015399 5010156
57136 5010156 5005192 5000691 4997120 4995387 4995970 4998573 5002950 5009265 5017211 5025665 5033856 5042207 5051424 5061364
57122 5061364 5071433 5081571 5092290 5104266 5118520 5136643 5160392 5191268 5230650 5279640 5338402
57111 5338402 5406317 5483535 5572116 5675374 5796690 5939551 6108292 6308113 6544532 6823606
57101 6823606 7153110 7543667 8009071 8565888 9232884 10030926 10983340 12115744 13454426
57092 13454426 15023874 16844556 18930940 21288874 23912381 26780498 29854529 33076191
57084 33076191 36367361 39631086 42753606 45610879 48084396 50082667 51554077 52480646
$$ packed form
57160D762739K0761J9922J8978J8969J9801K0519K0513J9740J8280J6509J5181
57149D971912J4481J3502J1460Q810O359M005J336j155k671l435m209m996n243
57136E010156m964m501l571j733N83K603M377O315P946Q454Q191Q351R217R940
57122E061364J0069J0138J0719J1976J4254J8123K3749L0876L9382M8990N8762
57111E338402O7915P7218Q8581J03258J21316J42861J68741J99821K36419K79074
57101F823606L29504L90557M65404N56817O66996P98042R52414J132404J338682
57092A3454426J569448J820682K086384K357934K623507K868117L074031L221662
57084C3076191L291170L263725L122520K857273K473517J998271J471410R26569
$$ plain form
57076 52480646 52860475 52696519 51998357 50788137 49102048 46989088 44511447 41744774
57068 41744774 38774721 35690818 32580457 29523083 26584598 23814579 21247294 18903366
57060 18903366 16789882 14901473 13224725 11743273 10440032 9297254 8297030 7422164
57052 7422164 6656314 5984217 5392711 4871069 4409868 4000372 3635570 3310700 3021818
57043 3021818 2764629 2535301 2331213 2149833 1987745 1841865 1710798 1593981 1490173
57034 1490173 1397919 1316862 1247497 1189958 1143940 1109503 1087282 1078315 1084400 1108763 1156406 1233215
57022 1233215 1341579 1472333 1599986 1690243 1717515 1677525 1584509 1459157 1319946 1181037
57012 1181037 1051778 936075 834126 745647 670656 607957 555075 510060 472010 439831 411972
$$ packed form
57076E2480646L79829j63956o98162j210220j686089k112960k477641k766673
57068D1744774k970053l083903l110361l057374k938485k770019k567285k343928
57060A8903366k113484j888409j676748j481452j303241j142778j000224q74866
57052G422164p65850o72097n91506n21642m61201m09496l64802l24870k88882
57043C021818k57189k29328k04088j81380j62088j45880j31067j16817j03808
57034A490173r2254q1057o9365n7539m6018l4437k2221q967O085K4363M7643P6809
57022A233215J08364J30754J27653R0257K7272l9990r3016j25352j39211j38909
57012A181037j29259j15703j01949q8479p4991o2699n2882m5015l8050l2179k7859
$$ plain form
57001 411972 387522 366353 348100 332035 317820 305269 293522 281558 269416 257932 247547
56990 247547 238467 231633 228237 228421 231527 237441 246570 258729 273056 288491 303024 313002 314989
56977 314989 308603 296417 281146 264117 246185 228473 211861 196933 184606 175774 170271 167240
56965 167240 166459 168254 172317 177992 185732 196974 212468 232043 255892 284286 315290 344005 364947
56952 364947 374770 372852 360655 341098 317630 293040 269200 247546 228944 213272 200222 190481
56940 190481 185087 183709 184814 187673 193121 202294 215857 234667 259795 291297 327646 366271 403393
56927 403393 433319 449817 449563 433912 407142 373811 337772 302069 268571 238110 211378 189003
56915 189003 170633 154993 141355 130124 121531 114614 108066 101430 95048 89456 85142 82207 79951
$$ packed form
57001D11972k4450k1169j8253j6065j4215j2551j1747j1964j2142j1484j0385
56990B47547r080o834l396J84L106N914R129J2159J4327J5435J4533R978J987
56977C14989o386j2186j5271j7029j7932j7712j6612j4928j2327q832n503l031
56965A67240p81J795M063N675P740J1242J5494J9575K3849K8394L1004K8715K0942
56952C64947R823j918j2197j9557k3468k4590k3840k1654j8602j5672j3050r741
56940A90481n394j378J105K859N448R173J3563J8810K5128L1502L6349L8625L7122
56927D03393K9926J6498k54j5651k6770l3331l6039l5703l3498l0461k6732k2375
56915A89003j8370j5640j3638j1231q593o917o548o636o382n592m314k935k256
$$ plain form
56902 79951 77457 74811 73050 72746 73472 74866 77288 81123 86308 92930 101437 111880 123754 137028
56888 137028 152573 171222 193150 218316 246295 274936 300063 317543 325585 324946 317666 306129
56876 306129 292612 278867 266072 255199 246998 241582 238718 238753 242651 250945 263322 279566 300386
56863 300386 327055 360758 402401 452485 510547 574372 639068 696553 737250 754358 747397 721337
56851 721337 682695 637113 589604 544722 505550 473430 448931 432183 422429 418744 421576 432470
56839 432470 452232 480795 519058 569186 632628 709336 799022 900398 1006953 1104678 1176413
56828 1176413 1209622 1201015 1155980 1085255 1000954 913106 828239 750252 681507 622884 574109
56817 574109 535027 506047 487030 476807 474568 480867 496608 522000 557365 604063 663291 733775
$$ packed form
56902G9951k494k646j761l04P26J394K422L835N185O622Q507J0443J1874J3274
56888A37028J5545J8649K1928K5166K7979K8641K5127J7480Q042o39p280j1537
56876C06129j3517j3745j2795j0873q201n416k864L5L898Q294J2377J6244K0820
56863C00386K6669L3703M1643N0084N8062O3825O4696N7485M0697J7108o961k6060
56851G21337l8642m5582m7509m4882l9172l2120k4499j6748r754l685K832J0894
56839D32470J9762K8563L8263N0128O3442P6708Q9686J01376J06555R7725P1735
56828A176413L3209q607m5035p0725q4301q7848q4867p7987o8745n8623m8775
56817E74109l9082k8980j9017j0223k239O299J5741K5392L5365M6698N9228P0484
$$ plain form
56805 733775 810313 883456 940598 969906 965905 931863 876494 808815 736062 664196 597832 539399
56793 539399 489424 447729 413904 387193 366881 352663 344217 340975 342926 351068 366373 388760
56781 388760 417586 452181 490701 528619 559258 576180 575510 557235 525179 485103 441900 398430
56769 398430 356705 318816 286019 257925 233550 212495 194480 178677 164542 152560 143244 135990
56757 135990 129800 124402 119694 114816 108963 102723 97485 93776 91013 88589 86367 84433 83120 82863
56743 82863 83310 83033 80996 77916 75366 73946 73116 72417 71896 71587 71443 71693 72545 73677 74563 75073 75293
56726 75293 75077 74310 73229 72104 71036 70411 70881 72401 73979 74933 75734 77036 78690 80388 82439 85031
56710 85031 87407 88708 89108 89375 89823 90394 91128 91805 91846 91276 91102 91954 93049 93281 92531 91154 89125 86668
$$ packed form
56805G33775P6538P3143N7142K9308m001l4042n5369o7679p2753p1866o6364n8433
56793E39399m9975m1695l3825k6711k0312j4218q446l242J951Q142J5305K2387
56781C88760K8826L4595L8520L7918L0639J6922o70j8275l2056m0076m3203m3470
56769C98430m1725l7889l2797k8094k4375k1055j8015j5803j4135j1982r316p254
56757A35990o190n398m708m878n853o240n238l709k763k424k222j934j313k57
56743H2863M47k77k037l080k550j420q30o99n21l09j44K50Q52J132Q86N10K20
56726G5293k16p67j081j125j068o25M70J520J578R54Q01J302J654J698K051K592
56710H5031K376J301M00K67M48N71P34O77M1n70j74Q52J095K32p50j377k029k457
$$ plain form
56692 86668 84822 84256 84238 83817 83271 83291 83549 83260 82497 81810 81266 80998 81871 84260 86885 88231 88484 88699
56674 88699 88764 87791 86030 84762 84538 84947 85811 87255 88826 89952 91019 92737 94786 96374 97752 99722
56658 99722 101990 103574 104613 106234 108737 111331 113557 115507 116810 116997 116853 117788 119737 121185 121478
56643 121478 121625 122516 123764 124704 125330 125807 126077 126305 126788 127237 127063 126433 126165 126565 127260 127982 128512 128112
56625 128112 126261 123813 122144 121304 120324 119208 119069 120100 120951 120515 119121 117637 116524 116119 116729 118078
56609 118078 119460 120583 121444 121589 120589 119115 118288 118052 117454 116414 115782 115650 115149 114160 113717 114415 115729
56592 115729 117240 119131 121146 122420 122778 122991 123364 123367 122978 123032 123753 124272 124175 124289 125288 126658 127681 128497
56574 128497 129562 130911 132458 134268 136136 137618 138662 139483 139929 139956 140550 142818 146183 148992 151163
$$ packed form
56692H6668j846n66j8m21n46K0K58k89p63o87n44k68Q73K389K625J346K53K15
56674H8699O5r73j761j268k24M09Q64J444J571J126J067J718K049J588J378J970
56658I9722K268J584J039J621K503K594K226J950J303J87j44R35J949J448K93
56643A21478J47Q91J248R40O26M77K70K28M83M49j74o30k68M00O95P22N30m00
56625A28112j851k448j669q40r80j116j39J031Q51m36j394j484j113m05O10J349
56609A18078J382J123Q61J45j000j474q27k36n98j040o32j32n01r89m43O98J314
56592A15729J511J891K015J274L58K13L73Ll89N4P21N19r7J14R99J370J023Q16
56574A28497J065J349J547J810J868J482J044Q21M46K7N94K268L365K809K171
$$ plain form
56559 151163 154681 160999 169360 178176 186634 194282 200409 204727 207740 209809 210749 210798 210903 211544 212232 212568
56543 212568 212772 212802 212118 210784 209678 209155 208596 207681 206971 206764 206523 205985 205667 205724 205385 204099 202288 200537
56525 200537 199096 198458 199236 200975 202315 202748 203020 203432 203171 201898 200562 199831 198980 197152 194586 191882
56509 191882 189206 186923 185823 185924 186049 185379 184420 183847 183500 183183 183292 183887 184185 183718 183002 182488 181938 181320
56491 181320 181074 180888 179549 176760 173784 171540 169449 167035 165208 164782 164992 164712 164096 163811 163653 163148
56475 163148 162743 163133 164033 164575 164432 163790 162895 162255 162539 163640 164574 164848 165005 165411 165587 165301 165164 165503
56457 165503 165842 166152 167301 169472 171424 172248 172594 173267 173900 174067 174439 175682 177215 178193 178749 179305 179682
56440 179682 179823 180323 181306 181862 181576 181450 182307 183467 184103 184740 186207 188179 189934 191539 193153 194160
$$ packed form
56559A51163L518O318Q361Q816Q458P648O127M318L013K069R40M9J05O41O88L36
56543B12568K04L0o84j334j106n23n59r15p10k07k41n38l18N7l39j286j811j751
56525B00537j441o38P78J739J340M33K72M12k61j273j336p31q51j828k566k704
56509A91882k676k283j100J01J25o70r59n73l47l17J09N95K98m67p16n14n50o18
56491A81320k46j86j339k789k976k244k091k414j827m26K10k80o16k85j58n05
56475A63148m05L90R00N42j43o42q95o40K84J101R34K74J57M06J76k86j37L39
56457A65503L39L10J149K171J952Q24L46O73O33J67L72J243J533R78N56N56L77
56440A79682J41N00R83N56k86j26Q57J160O36O37J467J972J755J605J614J007
$$ plain form
56424 194160 194179 194045 194696 195966 197294 198542 199299 198721 197116 196312 197291 198824 199622 200287 201705 203059 203253
56407 203253 203015 203667 204800 204974 203980 202691 201405 199984 198925 198758 198980 198970 199232 200367 201708 202437 203125
56390 203125 204535 205787 205533 204270 203738 204490 205697 206950 208585 210512 212241 213921 216077 218552 220784
56375 220784 222775 224763 226414 227351 227893 228306 228056 226833 225554 225225 225552 225782 226118 227218 229035 231194
56359 231194 233662 236111 237607 237886 237805 237632 236344 233772 231804 231948 233240 234203 235318 237569 240020 241045
56343 241045 240888 240888 241149 241106 241407 243033 245273 246687 247393 248417 249562 250057 250634 252783 256437 260347 264127
56326 264127 267970 271033 272311 272641 273766 275777 277475 278747 280530 282787 284585 285872 287313 288769
56312 288769 289752 290866 292875 294908 295627 295607 296432 297993 298884 299138 300245 302617 305254 307877 311342 315825
$$ packed form
56424A94160J9j34O51J270J328J248P57n78j605q04R79J533P98O65J418J354J94
56407B03253k38O52J133J74r94j289j286j421j059j67K22j0K62J135J341P29O88
56390B03125J410J252k54j263n32P52J207J253J635J927J729J680K156K475K232
56375B20784J991J988J651R37N42M13k50j223j279l29L27K30L36J100J817K159
56359B31194K468K449J496K79q1j73j288k572j968J44J292R63J115K251K451J025
56343B41045j57%K61m3L01J626K240J414P06J024J145M95N77K149L654L910L780
56326B64127L843L063J278L30J125K011J698J272J783K257J798J287J441J456
56312B88769R83J114K009K033P19k0Q25J561Q91K54J107K372K637K623L465M483
$$ plain form
56296 315825 320425 324580 328311 331332 333529 335898 339297 342736 344629 345263 346231 348020 350010 352244 355243
56281 355243 358627 361782 365296 369859 374547 378224 381784 386873 393283 399852 406891 415199 423656 430613
56267 430613 436896 444514 453117 460831 468091 477309 488870 500717 512069 524458 538830 554604 572097
56254 572097 592941 617446 644148 672626 704483 741041 782278 828349 879914 936668 997693
56243 997693 1063390 1134890 1211511 1290997 1372146 1454880 1537856 1618430 1694833 1765860 1828615
56232 1828615 1879289 1916212 1939741 1949573 1944991 1927424 1899593 1862202 1814562 1758344 1697357 1633465
56220 1633465 1566162 1496410 1427283 1360143 1293702 1227789 1164856 1106810 1053372 1004407 960713
56209 960713 921553 884444 848529 815435 785951 758689 732890 709659 689397 670807 653366
$$ packed form
56296C15825M600M155L731L021K197K369L399L439J893O34R68J789J990K234K999
56281C55243L384L155L514M563M688L677L560N089O410O569P039Q308Q457O957
56267D30613O283P618Q603P714P260R218J1561J1847J1352J2389J4372J5774J7493
56254E72097K0844K4505K6702K8478L1857L6558M1237M6071N1565N6754O1025
56243I97693O5697P1500P6621P9486Q1149Q2734Q2976Q0574P6403P1027O2755
56232A828615N0674L6923K3529R832m582j7567k7831l7391m7640n6218o0987o3892
56220A633465o7303o9752o9127o7140o6441o5913o2933n8046n3438m8965m3694
56209I60713l9160l7109l5915l3094k9484k7262k5799k3231k0262j8590j7441
$$ plain form
56198 653366 638090 625042 612902 601792 593555 588385 584051 579361 575474 572921 570361 567341 565296
56185 565296 564650 563798 562058 560872 561027 561425 561548 562335 563694 563998 562959 562288 562756 563480 564650 567744 572339
56168 572339 576068 578570 582066 587175 591782 595111 599237 605235 611459 617011 623398 631283 639077 646207
56154 646207 654311 663829 673027 681840 692951 707442 723045 738392 755287 775099 796810 820499
56142 820499 848870 883186 921477 962969 1010565 1066826 1131413 1204959 1291499 1393942 1510023
56131 1510023 1634825 1763696 1890328 2006037 2104662 2186050 2253006 2308197 2355967 2402659
56121 2402659 2451115 2497173 2534064 2557761 2566576 2559871 2540571 2515780 2491510 2468453 2444003 2414620
56109 2414620 2374283 2315214 2234022 2134790 2024167 1906908 1788164 1675423 1574298 1485262
$$ packed form
56198F53366j5276j3048j2140j1110q237n170m334m690l887k553k560l020k045
56185E65296o46q52j740j186J55L98J23P87J359L04j039o71M68P24J170L094M595
56168E72339L729K502L496N109M607L329M126N998O224N552O387P885P794P130
56154F46207Q104R518R198Q813J1111J4491J5603J5347J6895J9812K1711K3689
56142H20499K8371L4316L8291M1492M7596N6261O4587P3546Q6540J02443J16081
56131A510023J24802J28871J26632J15709R8625Q1388O6956N5191M7770M6692
56121B402659M8456M6058L6891K3697Q815o705j9300k4791k4270k3057k4450k9383
56109B414620m0337n9069q1192r9232j10623j17259j18744j12741j01125q9036
$$ plain form
56099 1485262 1407253 1341228 1287637 1244025 1208118 1180068 1159224 1142415 1127952 1117575 1111952
56088 1111952 1108270 1104866 1103882 1106453 1109719 1111712 1114736 1120616 1127116 1132477 1139000 1148418 1158223 1166357
56074 1166357 1175116 1186490 1198121 1207890 1218125 1231110 1244810 1257270 1270857 1287833 1306004 1323086
56062 1323086 1341073 1361991 1383675 1404099 1425437 1449506 1473745 1496052 1518808 1543581 1566881
56051 1566881 1586002 1604080 1624366 1644650 1662520 1680934 1702970 1726068 1747151 1768592 1793536
56040 1793536 1820247 1846624 1875113 1907502 1940222 1970690 2002746 2039844 2078712 2116084 2155552
56029 2155552 2200871 2248566 2294514 2341948 2395403 2452494 2509281 2567867 2630864 2694318 2754321
56018 2754321 2814841 2880886 2949871 3018015 3088889 3166923 3248838 3330544 3415964 3509649 3607433
$$ packed form
56099A485262p8009o6025n3591m3612l5907k8050k0844j6809j4463j0377n623
56088A111952l682l404r84K571L266J993L024N880O500N361O523R418R805Q134
56074A166357Q759J1374J1631R769J0235J2985J3700J2460J3587J6976J8171J7082
56062A323086J7987K0918K1684K0424K1338K4069K4239K2307K2756K4773K3300
56051A566881J9121J8078K0286K0284J7870J8414K2036K3098K1083K1441K4944
56040A793536K6711K6377K8489L2389L2720L0468L2056L7098L8868L7372L9468
56029B155552M5319M7695M5948M7434N3455N7091N6787N8586O2997O3454O0003
56018B754321O0520O6045O8985O8144P0874P8034Q1915Q1706Q5420R3685R7784
$$ plain form
56007 3607433 3704296 3804739 3915073 4032146 4150330 4272845 4405247 4544654 4686718 4836267
55997 4836267 4999441 5172449 5349970 5537066 5740406 5955726 6177110 6410400 6663622
55988 6663622 6932678 7211129 7505416 7825049 8166769 8524642 8906655 9324266 9774921
55979 9774921 10252895 10767736 11333305 11948886 12611086 13333623 14134195 15013301 15968803
55970 15968803 17019590 18190999 19490330 20923594 22523304 24332313 26376343 28684722
55962 28684722 31323669 34377705 37919531 42039098 46885420 52641706 59487506 67638103
55954 67638103 77400685 89150872 103310363 120432797 141271277 166669700 197416757
55947 197416757 234176129 277060313 324398361 371435133 410699418 434726833 439433048
$$ packed form
56007C607433R6863J00443J10334J17073J18184J22515J32402J39407J42064J49549
55997D836267J63174J73008J77521J87096K03340K15320K21384K33290K53222
55988F663622K69056K78451K94287L19633L41720L57873L82013M17611M50655
55979I774921M77974N14841N65569O15581O62200P22537Q00572Q79106R55502
55970A5968803J050787J171409J299331J433264J599710J809009K044030K308379
55962B8684722K638947L054036L541826M119567M846322N756286O845800Q150597
55954F7638103R762582J1750187J4159491J7122434K0838480K5398423L0747057
55947A97416757L6759372M2884184M7338048M7036772L9264285K4027415M706215
$$ plain form
55940 439433048 425562480 397446334 360602589 319998331 279411679 241350137 207154774
55933 207154774 177285900 151694417 130065869 111922776 96727534 83996557 73326374
55926 73326374 64351926 56746809 50262698 44720652 39962726 35844926 32265574 29157458
55918 29157458 26450489 24070630 21968693 20117780 18484177 17027305 15723930 14565515
55910 14565515 13533596 12601029 11754338 10992168 10304189 9672504 9091050 8563340 8083230
55901 8083230 7636721 7220229 6838933 6489369 6161054 5853059 5572097 5316056 5075410
55892 5075410 4849037 4643133 4456205 4280072 4114146 3964359 3829567 3703123 3586451
55883 3586451 3487302 3405780 3335461 3277129 3237823 3216436 3202604 3189549 3176213 3157393 3123973
$$ packed form
55940D39433048j3870568k8116146l6843745m0604258m0586652l8061542l4195363
55933B07154774k9868874k5591483k1628548j8143093j5195242j2730977j0670183
55926G3326374q974448p605117o484111n542046m757926m117800l579352l108116
55918B9157458k706969k379859k101937j850913j633603j456872j303375j158415
55910A4565515j031919r32567q46691p62170o87979o31685n81454n27710m80110
55901H083230m46509m16492l81296l49564l28315l07995k80962k56041k40646
55892E075410k26373k05904j86928j76133j65926j49787j34792j26444j16672
55883C586451r9149q1522p0319n8332l9306k1387j3832j3055j3336j8820l3420
$$ plain form
55872 3123973 3073364 3009129 2930746 2834514 2724128 2609509 2495059 2379093 2264252 2157954
55862 2157954 2062319 1973498 1891028 1818296 1753841 1691933 1632099 1578925 1532320 1487088 1442390
55851 1442390 1402423 1367250 1331822 1294809 1259903 1227632 1194223 1159396 1127258 1098537 1069664
55840 1069664 1040231 1013816 990667 967105 942969 922232 905407 888473 870205 853542 838942
55829 838942 823388 806876 793061 782492 771788 760242 750599 742482 731785 717707 704008 692265
55817 692265 680107 667041 655659 646068 635296 623361 613791 607096 599818 591214 584738 581500 578307
55804 578307 573794 570777 570875 572250 574295 579249 587459 596017 603552 611532 619613 624730 626139 626476 626624
55789 626624 624322 618993 612985 606907 598798 589184 581844 577862 573558 565765 554742 540821 523130
$$ packed form
55872C123973n0609o4235p8383r6232j10386j14619j14450j15966j14841j06298
55862B157954r5635q8821q2470p2732o4455o1908n9834n3174m6605m5232m4698
55851A442390l9967l5173l5428l7013l4906l2271l3409l4827l2138k8721k8873
55840A069664k9433k6415k3149k3562k4136k0737j6825j6934j8268j6663j4600
55829H38942j5554j6512j3815j0569j0704j1546r643q117j0697j4078j3699j1743
55817F92265j2158j3066j1382r591j0772j1935r570o695p278q604o476l238l193
55804E78307m513l017R8J375K045M954Q210Q558P535P980Q081N117J409L37J48
55789F26624k302n329o008o078q109r614p340l982m304p793j1023j3921j7691
$$ plain form
55776 523130 503146 484861 469839 456374 444645 437966 437674 441474 448127 458640 471086 479284 479169
55763 479169 472473 462380 449885 436263 424525 415784 407761 398932 390740 384108 377590 370611 364722
55750 364722 359883 353343 344011 334267 325708 316885 307041 298239 291771 286031 279979 275250 272861 271215
55736 271215 269294 268507 269396 269828 268353 266298 264760 262658 259512 256900 255344 252865 248386 243461 238980
55721 238980 233468 226495 220496 217141 214909 212259 210314 210424 211885 213907 217099 221249 224546 226730
55707 226730 230118 235744 241379 245104 247811 250312 251120 249222 246125 242918 238090 230548 222186 215193
55693 215193 209197 203133 197556 193003 188425 183338 179298 177326 176104 174546 173816 174983 177051 179175
55679 179175 182372 187114 191648 194711 197528 201068 203637 203381 201059 198265 195055 191342 188481 187253
$$ packed form
55776E23130j9984j8285j5022j3465j1729o679k92L800O653J0513J2446Q198j15
55763D79169o696j0093j2495j3622j1738q741q023q829q192o632o518o979n889
55750C64722m839o540r332r744q559q823r844q802o468n740o052m729k389j646
55736B71215j921p87Q89M32j475k055j538k102l146k612j556k479m479m925m481
55721B38980n512o973n999l355k232k650j945J10J461K022L192M150L297K184
55707B26730L388N626N635L725K707K501Q08j898l097l207m828p542q362o993
55693B15193n996o064n577m553m578n087m040j972j222j558p30J167K068K124
55679A79175L197M742M534L063K817L540K569k56k322k794l210l713k861j228
$$ plain form
55665 187253 186211 184080 181960 181220 181127 180528 179973 180238 180653 180784 181952 185097 188903 191854 194453 197739
55649 197739 201445 205277 210008 215495 219573 220819 220623 220795 220978 220148 218646 216801 213463 207864 201209
55634 201209 194656 187517 179252 171288 165000 159697 154419 149811 146363 142799 138268 134229 132166 131246
55620 131246 130185 129517 129941 130324 129539 128471 128062 127191 124784 122175 121020 120537 119159 117268 115883 114291
55604 114291 111561 108946 108160 108460 107912 106405 105003 103527 101253 98993 97977 97482 95913 93527 91914
55589 91914 91513 91675 92419 94024 95571 95831 95063 94296 93674 93064 93227 94585 95910 96050 95913 96925 98601
55572 98601 99488 99487 99402 99303 99204 100185 102852 105743 107194 107735 108702 109709 109648 109035 109095 109403 108727 107342 106332
55553 106332 105376 103440 100972 99276 98352 97451 97038 98071 99872 100884 101038 101431 102193 102589 102672 102924 102867
$$ packed form
55665A87253j042k131k120p40r3n99n55K65M15J31J168L145L806K951K599L286
55649A97739L706L832M731N487M078J246j96J72J83q30j502j845l338n599o655
55634B01209o553p139q265p964o288n303n278m608l448l564m531m039k063r20
55620A31246j061o68M24L83p85j068m09q71k407k609j155m83j378j891j385j592
55604A14291k730k615p86L00n48j507j402j476k274k260j016m95j569k386j613
55589I1914m01J62P44J605J547K60p68p67o22o10J63J358J325J40j37J012J676
55572I8601Q87jq5r9r9R81K667K891J451N41R67J007o1o13O0L08o76j385j010
55553A06332r56j936k468j696r24r01m13J033J801J012J54L93P62L96Q3K52n7
$$ plain form
55536 102867 101893 100843 100923 101763 102405 103284 105104 106639 106053 103875 102312 102053 101990 101675 101649 101586 100485 98729
55518 98729 97737 97483 96453 94171 91795 89987 88067 85586 83097 81119 79710 79115 79493 80052 79844 79257
55502 79257 79389 80207 80780 81021 81633 82497 82689 82053 81407 81305 81730 82688 83867 84214 83141 81659 80982 80653
55484 80653 79485 77652 76253 75448 74755 74577 75545 76827 76917 75819 74752 74075 73287 72651 72950 73783 73938
55467 73938 73326 72904 72876 72593 72072 72005 72383 72599 72655 72835 72670 71845 71603 73436 76672 79145 79991 80085 80081 79835
55447 79835 79460 79147 78177 75910 73427 72413 72741 73034 73135 73932 75084 75262 74583 74485 75053 74752 73145 71722
55429 71722 71496 71745 71749 71970 72836 73818 74336 74422 74208 73903 74262 75819 77770 78891 79289 79827 80383 80402 80685
55410 80685 82532 85366 87265 87718 87753 87475 85805 82819 80086 78348 76950 75794 75670 76330 76424 75752 75446
$$ packed form
55536A02867r74j050Q0Q40O42Q79J820J535n86k178j563k59o3l15k6o3j101j756
55518I8729r92k54j030k282k376j808j920k481k489j978j409n95L78N59k08n87
55502G9257J32Q18N73K41O12Q64J92o36o46j02M25R58J179L47j073j482o77l29
55484H0653j168j833j399q05o93j78R68J282R0j098j067o77p88o36K99Q33J55
55467G3938o12m22k8k83n21o7L78K16N6J80j65q25k42J833L236K473Q46R4mk46
55447G9835l75l13r70k267k483j014L28K93J01P97J152J78o79r8N68l01j607j423
55429G1722k26K49MK21Q66R82N18Q6k14l05L59J557J951J121L98N38N56J9K83
55410H0685J847K834J899M53L5k78j670k986k733j738j398j156j24O60R4o72l06
$$ plain form
55393 75446 75596 74985 73671 73404 74683 75727 75316 74454 74145 73636 72146 70430 69313 68303 66946 66012
55377 66012 66066 66210 65449 64091 62848 61743 60874 60940 62028 63021 63047 62460 61751 60789 59815 59772 60829 61878
55359 61878 62289 62878 64316 65958 67096 68071 69180 69758 69310 68439 67797 67230 66770 67227 68860 70609 71532
55342 71532 71960 72424 72603 72272 72180 72960 74053 74584 74508 74223 73943 74091 75241 77025 78129 78043 77808 78353 79230
55323 79230 79601 79350 78567 77129 75556 75069 75937 76862 76774 76139 75765 75512 75072 74866 75207 75596 75676 75911 76539
55304 76539 76979 77017 77438 78633 79778 80215 80454 80894 80839 79831 78695 78147 77543 76208 74859 74402 74387 73990
55286 73990 73583 73946 74797 75505 76440 78227 80298 81574 82065 82484 82809 82488 81648 80914 80361 79705 79088 78662
55268 78662 77926 76562 75473 75802 77234 78382 78567 78217 77763 77218 76758 76789 77400 78361 79523 80684 81428
$$ packed form
55393G5446J50o11j314k67J279J044m11q62l09n09j490j716j117j010j357r34
55377F6012N4J44p61j358j243j105q69O6J088R93K6n87p09r62r74m3J057J049
55359F1878M11N89J438J642J138R75J109N78m48q71o42n67m60M57J633J749R23
55342G1532M28M64J79l31r2P80J093N31p6k85k80J48J150J784J104q6k35N45Q77
55323G9230L71k51p83j438j573m87Q68R25q8o35l74k53m40k06L41L89Q0K35O28
55304G6539M40L8M21J195J145M37K39M40n5j008j136n48o04j335j349m57j5l97
55286G3990m07L63Q51P08R35J787K071J276M91M19L25l21q40p34n53o56o17m26
55268G8662p36j364j089L29J432J148J85l50m54n45m60L1O11R61J162J161P44
$$ plain form
55251 81428 81691 82091 83050 83978 83992 83096 82019 81294 81078 81471 82335 83127 83450 83390 82970 81883 80242 78893
55233 78893 78318 77840 76643 74992 73755 73272 73394 74079 75194 76181 76609 76700 76768 76680 76343 76063 75846 75085 73602
55214 73602 72346 72223 72891 73444 73729 74186 74991 76166 78009 80564 83084 84745 85552 85915 85882 85408 84859
55197 84859 84514 84066 83250 82491 82320 82672 83249 83953 84456 84182 83344 83145 84154 85331 85463 84691 83737 82582
55179 82582 81079 80050 80402 81688 82756 83301 83636 83468 82340 80908 80396 80855 81218 81087 81239 82250 83711
55162 83711 85093 86518 88294 90270 91905 92698 92533 91846 91277 90925 90350 89511 89079 89412 89951 90248 90753
55145 90753 91787 92535 92117 91084 90689 91011 90951 89864 88186 86547 85208 84333 83967 83735 83245 82647 82280
55128 82280 82042 81777 81896 82828 84156 85084 85538 86050 86766 87341 87612 87636 87260 86403 85626 85738 86923 88733
$$ packed form
55251H1428K63M00R59R28J4q96j077p25k16L93Q64P92L23o0m20j087j641j349
55233G8893n75m78j197j651j237m83J22O85J115R87M28R1O8q8l37k80k17p61j483
55214G3602j256j23O68N53K85M57Q05J175J843K555K520J661Q07L63l3m74n49
55197H4859l45m48q16p59j71L52N77P04N03k74q38j99J009J177J32p72r54j155
55179H2582j503j029L52J286J068N45L35j68j128j432n12M59L63j31J52J011J461
55162H3711J382J425J776J976J635P93j65o87n69l52n75q39m32L33N39K97N05
55145I0753J034P48m18j033l95L22o0j087j678j639j339q75l66k32m90n98l67
55128H2280k38k65J19R32J328R28M54N12P16N75K71K4l76q57p77J12J185J810
$$ plain form
55110 88733 90653 92148 92587 91865 90772 90081 89608 88865 88208 88462 89695 91144 92197 92737 92765 92411 92080
55093 92080 92003 91915 91714 91951 92977 94150 94705 94902 95380 95849 95519 94529 93861 93940 94272 94386 94270 93988 93652
55074 93652 93679 94246 94672 94129 92806 91594 90864 90383 90224 90735 91655 92170 91911 91191 90306 89359 88695 88756 89483
55055 89483 90424 91297 91923 91926 91252 90698 91077 92095 92839 93110 93374 93627 93316 92396 91565 91376 91806 92676 93754
55036 93754 94534 94693 94684 95159 95889 96006 95241 94116 93031 91965 91107 90902 91338 91847 92064 92121 92146 91931 91220
55017 91220 90039 88830 88441 89550 91704 93526 94354 95088 96762 98915 100222 100187 99249 97815 96193 95115
55001 95115 95182 96014 96821 97492 98240 98704 98487 98146 98427 98890 98558 97638 97278 97775 98315 98364 98073 97435 96417
54982 96417 95928 97188 99948 102548 103987 104767 105573 106374 107067 107806 108348 108142 107352 106823 106818 106846 106854 107463 108715
$$ packed form
55110H8733J920J495M39p22j093o91m73p43o57K54J233J449J053N40K8l54l31
55093I2080p7q8k01K37J026J173N55J97M78M69l30r90o68P9L32J14j16k82l36
55074I3652K7N67M26n43j323j212p30m81j59N11R20N15k59p20q85r47o64O1P27
55055H9483R41Q73O26Lo74n54L79J018P44K71K64K53l11r20q31j89M30Q70J078
55036I3754P80J59rM75P30J17p65j125j085j066q58k05M36N09K17N7K5k15p11
55017I1220j181j209l89J109K154J822Q28P34J674K153J307l5r38j434j622j078
55001I5115O7Q32Q07O71P48M64k17l41K81M63l32r20l60M97N40M9k91o38j018
54982I6417m89J260K760K600J439P80Q06Q01O93P39N42k06p90n29nK8QO09J252
$$ plain form
54963 108715 109709 109877 109642 109541 109632 109960 110600 111036 110599 109765 109888 111307 112772 113161 112726 112240 111953 111864 112107
54944 112107 112568 112872 113037 113368 113568 112936 111577 110327 109343 108068 106827 106923 108537 109880 109389 107677 106499
54927 106499 106700 108045 110148 112670 115234 117894 121160 125124 129286 133647 139049 145820 153059 159848
54913 159848 166217 172247 177216 180471 182208 182484 180431 175579 169195 163132 157811 152477 146984 142166
54899 142166 138605 136006 133770 131451 128717 125548 122462 120047 118343 117062 116190 115978 116513 117658 119131
54884 119131 120446 121211 121748 122914 124980 127313 129529 132265 136211 141014 145869 150729 156163 162326 168820
54869 168820 175287 181391 186345 189122 189236 187010 183172 178485 173515 168425 163091 157582 152272 147353
54855 147353 142661 138142 134033 130323 126614 122817 119450 116823 114517 112129 110032 108764 108083 107236 105979
$$ packed form
54963A08715R94J68k35j01R1L28O40M36m37q34J23J419J465L89m35m86k87q9K43
54944A12107M61L04J65L31K00o32j359j250r84j275j241R6J614J343m91j712j178
54927A06499K01J345K103K522K564K660L266L964M162M361N402O771P239O789
54913A59848O369O030M969L255J737K76k053m852o384o063n321n334n493m818
54899A42166l561k599k236k319k734l169l086k415j704j281q72k12N35J145J473
54884A19131J315P65N37J166K066K333K216K736L946M803M855M860N434O163O494
54869A68820O467O104M954K777J14k226l838m687m970n090n334n509n310m919
54855A47353m692m519m109l710l709l797l367k627k306k388k097j268o81q47j257
$$ plain form
54840 105979 104771 104139 104195 104627 104857 104464 103686 103187 103110 102840 102000 101169 101124 101807 102487 102595 101958 100609 98921
54821 98921 97650 97303 97578 97849 98015 98501 99552 100887 102012 102646 102918 103227 103757 104152 103928 103210 102583 102245
54803 102245 101829 101152 100584 100447 100582 100735 100904 101128 101445 102222 103946 106450 108905 110747 112003 112582 112099
54786 112099 110762 109587 109226 109242 109091 109091 109769 110904 111963 112983 114274 115597 116412 116769 117331 118649 120810
54769 120810 123662 126988 130619 134689 139586 145456 151978 158740 165501 172011 178062 183797 189354 194062
54755 194062 196681 196689 194674 191220 186272 179962 173210 166860 160886 155045 149689 145299 141780 138769 136191
54740 136191 134034 132104 130489 129651 129601 129631 129359 129278 129706 129949 129318 128277 127790 128063 128744 129806 131426 133448
54722 133448 135701 138441 141850 145671 149926 155277 161852 168441 173801 178069 181830 184491 184815 182630
$$ packed form
54840A05979j208o32N6M32K30l93p78m99p7k70q40q31m5O83O80J08o37j349j688
54821I8921j271l47K75K71J66M86J051J335J125O34K72L09N30L95k24p18o27l38
54803A02245m16o77n68j37J35J53J69K24L17P77J724K504K455J842J256N79m83
54786A12099j337j175l61J6j51%O78J135J059J020J291J323Q15L57N62J318K161
54769A20810K852L326L631M070M897N870O522O762O761O510O051N735N557M708
54755A94062K619Qk015l454m948o310o752o350n974n841n356m390l519l011k578
54740A36191k157j930j615q38n0L0k72q1M28K43o31j041m87K73O81J062J620K022
54722A33448K253K740L409L821M255N351O575O589N360M268L761K661L24k185
$$ plain form
54708 182630 178734 173479 166790 159329 152334 146198 140444 135154 131267 129226 128365 127868 127412 126694 125323
54693 125323 123507 122011 121051 119973 118392 116979 116657 117445 118424 118520 117232 115007 113043 112307 112653 113192
54677 113192 113428 113540 113706 113834 114054 114847 116441 118460 120365 121859 122823 123253 123332 123271 122983 122212 120948 119406
54659 119406 117691 115833 114096 112870 112251 112023 112015 112169 112320 112257 111994 111768 111844 112429 113570 114920 115883 116179
54641 116179 116033 115695 115196 114756 114835 115435 115940 116081 116393 117183 117787 117576 117041 116949 117006 116424 115387 114844 115032
54622 115032 115344 115569 116170 117243 118219 118835 119474 120253 120539 119747 118090 116329 115216 115202 116119 117108 117355 116931
54604 116931 116476 116162 115655 114968 114618 114888 115625 116760 118310 119789 120424 120139 119673 119488 119201 118320 116985
54587 116985 115735 115066 115384 116848 118974 120838 121916 122431 122811 123273 123996 125165 126597 127646 127711 126641
$$ packed form
54708A82630l896n255o689p461o995o136n754n290l887k041q61m97m56p18j371
54693A25323j816j496r60j078j581j413l22P88R79R6j288k225j964p36L46N39
54677A13192K36J12J66J28K20P93J594K019J905J494R64M30P9o1k88p71j264j542
54659A19406j715j858j737j226o19k28qJ54J51o3k63k26P6N85J141J350R63K96
54641A16179j46l38m99m40P9O00N05J41L12P90O04k11n35r2N7n82j037n43J88
54622A15032L12K25O01J073R76O16O39P79K86p92j657j761j113j4R17R89K47m24
54604A16931m55l14n07o87l50K70P37J135J550J479O35k85m66j85k87q81j335
54587A16985j250o69L18J464K126J864J078N15L80M62P23J169J432J049O5j070
$$ plain form
54571 126641 124714 122535 120894 120250 120336 120597 120906 121449 122141 122752 123483 124720 126183 127008 126835 126246 125934
54554 125934 125885 125618 124850 123765 122903 122766 123324 123961 124162 124115 124332 124980 125943 127213 128692 130030 131208 132885
54536 132885 135497 138430 140823 142726 144483 145520 145074 143872 143587 144415 144637 143051 140559 138750 137945
54521 137945 137417 136660 135633 134314 132778 131387 130440 129942 129954 130675 131913 133024 133661 134086 134522 134783 134818
54504 134818 135003 135531 136053 136168 135764 134733 133095 131596 131314 132243 133101 133010 132601 132827 133498 133813 133728 133907
54486 133907 134619 135477 136118 136523 136832 137274 138099 139224 140202 140894 141758 143126 144646 145943 147347 149297 151432
54469 151432 153003 153997 155064 156441 157680 158503 159257 160238 161116 161363 160967 160394 159973 159682 159524 159790 160663
54452 160663 161687 162030 161431 160540 160016 159649 158812 157482 156160 154972 153606 152154 151249 151112 151123 150662 149810
$$ packed form
54571A26641j927k179j641o44Q6K61L09N43O92O11P31J237J463Q25j73n89l12
54554A25934m9k67p68j085q62j37N58O37K01m7K17O48R63J270J479J338J178J677
54536A32885K612K933K393J903J757J037m46j202k85Q28K22j586k492j809q05
54521A37945n28p57j027j319j536j391r47m98J2P21J238J111O37M25M36K61L5
54504A34818J85N28N22J15m04j031j638j499k82R29Q58r1m09K26O71L15q5J79
54486A33907P12Q58O41M05L09M42Q25J125R78O92Q64J368J520J297J404J950K135
54469A51432J571R94J067J377J239Q23P54R81Q78K47l96n73m21k91j58K66Q73
54452A60663J024L43n99q91n24l67q37j330j322j188j366j452r05j37J1m61q52
$$ plain form
54435 149810 148900 147884 146585 145190 144144 143819 144468 146087 148146 149834 150832 151428 151755 151531 150815 150350
54419 150350 150647 151245 151430 151271 151323 151637 151707 151292 150725 150391 150292 150159 149757 149084 148408 148084 148220 148666 149333 150233
54399 150233 151169 151753 151906 152020 152446 153193 154254 155792 157728 159512 160679 161396 162205 163421 164895 166083
54383 166083 166257 165124 163444 162560 162952 163628 163288 161708 159661 157890 156673 156141 156455 157619 159365 161233
54367 161233 162690 163369 163380 163246 163434 164092 165208 166674 168113 169028 169266 169046 168504 167560 166248 164765 163182
54350 163182 161611 160649 160979 162397 163878 164758 165210 165457 165396 165332 166133 167995 169736 170020 168766 166822 164843
54333 164843 163120 161931 161232 160371 158838 156993 155490 154370 153408 152895 153249 154117 154703 154872 155181 155870 156502
54316 156502 156604 156099 155117 153914 152928 152441 152235 151957 151634 151404 151013 150173 149229 148802 148851 148735 148181 147567 147215
$$ packed form
54435A49810r10j016j299j395j046l25O49J619K059J688R98N96L27k24p16m65
54419A50350K97N98J85j59N2L14P0m15n67l34r9j33m02o73o76l24J36M46O67R00
54399A50233R36N84J53J14M26P47J061J538J936J784J167P17Q09J216J474J188
54383A66083J74j133j680q84L92O76l40j580k047j771j217n32L14J164J746J868
54367A61233J457O79J1j34J88O58J116J466J439R15K38k20n42r44j312j483j583
54350A63182j571r62L30J418J481Q80M52K47o1o4Q01J862J741K84j254j944j979
54333A64843j723j189o99q61j533j845j503j120r62n13L54Q68N86J69L09O89O32
54316A56502J02n05r82j203r86m87k06k78l23k30l91q40r44m27M9j16n54o14l52
$$ plain form
54297 147215 146965 146535 145817 144757 143372 141976 141015 140629 140626 140761 140724 140076 138762 137569 137490 138604 140075 141210
54279 141210 142008 142689 143300 143889 144527 144984 144889 144321 143780 143432 142948 142337 142360 143619 145542 146755 146414 144883
54261 144883 143217 142272 142291 143017 143967 144696 145007 145101 145494 146557 148058 149325 149911 149942 149712 149286 148686 148180
54243 148180 148018 148063 148003 147783 147529 147215 146750 146253 145829 145216 144114 142839 142179 142502 143364 144082 144255 143639 141991
54224 141991 139458 136930 135569 135867 137263 138739 139739 140452 141310 142383 143411 144264 145047 145740 146077 145921
54208 145921 145508 145164 144987 144975 145146 145305 145008 144130 143285 143314 144400 146004 147529 148718 149456 149576 149019 148013
54190 148013 146981 146324 146185 146302 146139 145290 143768 141921 140227 139147 138894 139195 139502 139577 139650 139962 140498 141305
54172 141305 142614 144307 145609 145743 144762 143378 142166 141238 140502 139882 139382 139221 139723 140820 141895 142436
$$ packed form
54297A47215k50m30p18j060j385j396r61l86lJ35l7o48j314j193p9J114J471J135
54279A41210P98O81O11N89O38M57r5n68n41l48m84o11K3J259J923J213l41j531
54261A44883j666r45J9P26R50P29L11R4L93J063J501J267N86L1k30m26o00n06
54243A48180j62M5o0k20k54l14m65m97m24o13j102j275o60L23Q62P18J73o16j648
54224A41991k533k528j361K98J396J476J000P13Q58J073J028Q53P83O93L37j56
54208A45921m13l44j77j2J71J59k97q78q45K9J086J604J525J189P38J20n57j006
54190A48013j032o57j39J17j63q49j522j847j694j080k53L01L07P5P3L12N36Q07
54172A41305J309J693J302J34r81j384j212r28p36o20n00j61N02J097J075N41
$$ plain form
54156 142436 142646 142941 143096 142424 140764 138779 137209 136274 135960 136408 137679 139356 140688 141234 141217 141237 141678
54139 141678 142437 143249 144072 144960 145591 145284 143696 141419 139695 139481 140728 142435 143491 143569 143147 142634 141870
54122 141870 140754 139920 140091 141032 141888 142462 143312 144583 145730 146636 148019 150245 152574 154142 154908 155094
54106 155094 154509 153217 152113 151956 152283 152162 151498 150733 149720 148005 146039 145041 145579 147071 148737 150300
54090 150300 151679 152691 153297 153670 153906 153959 153796 153267 152077 150322 148860 148567 149410 150718 152173 153957
54074 153957 156150 158619 161351 164257 166783 168306 168825 168762 168313 167648 167449 168412 170277 172114 173522 174786
54058 174786 176012 177091 178586 181646 186668 192775 199037 205632 213445 223018 234124 245795 256350
54045 256350 263779 266635 264678 258831 250783 242432 235128 229248 224695 221594 220125 220006 220719 222118 224197
$$ packed form
54156A42436K10K95J55o72j660j985j570r35l14M48J271J677J332N46j7K0M41
54139A41678P59Q12Q23Q88O31l07j588k277j724k14J247J707J056P8m22n13p64
54122A41870j116q34J71R41Q56N74Q50J271J147R06J383K226K329J568P66J86
54106A55094n85j292j104j57L27j21o64p65j013j715j966r98N38J492J666J563
54090A50300J379J012O06L73K36N3j63n29j190j755j462k93Q43J308J455J784
54074A53957K193K469K732K906K526J523N19o3m49o65j99R63J865J837J408J264
54058A74786J226J079J495L060N022O107O262O595P813R573J1106J1671J0555
54045B56350P429K856j957n847q048q351p304n880m553l101j469j19P13J399K079
$$ plain form
54030 224197 226489 228534 230814 234349 239232 244338 248589 251731 253815 254837 255211 255785 256937 258212 259137
54015 259137 259712 259832 259043 257340 255536 254242 253001 250978 248051 244672 241080 237243 233312 229587 226111
54000 226111 222699 219247 215727 212059 208375 205235 203245 202390 201914 200914 199032 196674 194586 193129 192028
53985 192028 190889 189759 188965 188560 188233 187661 186685 185393 184263 183900 184232 184348 183658 182738 182347 182093 181057
53968 181057 179455 178521 178769 179447 179834 179987 179980 179549 178919 179002 180233 182060 184038 186552 189944 193829 197879
53951 197879 202420 207549 212472 216517 220123 223934 227495 229762 230505 230335 229717 228812 228051 227982 228562 229330
53935 229330 230208 231588 233734 236654 240409 244904 249401 252854 254829 255801 256623 258020 260335 263221 265714
53920 265714 267229 268486 270960 275253 280452 285214 289199 293274 298567 305468 313432 321603 329529 337216
$$ packed form
54030B24197K292K045K280L535M883N106M251L142K084J022L74N74J152J275R25
54015B59137N75J20p89j703j804j294j241k023k927l379l592l837l931l725l476
54000B26111l412l452l520l668l684l140j990q55m76j000j882k358k088j457j101
53985A92028j139j130p94m05l27n72r76j292j130l63L32J16o90r20l91k54j036
53968A81057j602r34K48O78L87J53pm31o30Q3J231J827J978K514L392L885M050
53951A97879M541N129M923M045L606L811L561K267P43j70o18r05p61o9N80P68
53935B29330Q78J380K146K920L755M495M497L453J975R72Q22J397K315K886K493
53920B65714J515J257K474M293N199M762L985M075N293O901P964Q171P926P687
$$ plain form
53906 337216 344610 351382 357345 362759 368025 373318 378739 384623 391384 399063 407016 413845 417656 416862
53892 416862 411155 401693 390290 378506 367254 356689 346271 335433 324453 314343 305685 298029
53880 298029 290684 283666 277480 272368 268188 264741 261750 258719 255207 251245 247260 243708 240813 238452
53866 238452 236155 233473 230394 227170 223822 220331 217286 215598 215313 215414 215125 214768 214841 214910 214133 212441
53850 212441 210486 208690 207019 205517 204391 203565 202610 201230 199554 198024 197121 197008 197268 197240 196754 196226
53834 196226 195878 195376 194519 193750 193530 193589 193289 192424 191300 190367 190061 190573 191332 191163 189546 187353 185875 185478
53816 185478 185712 186259 187105 188106 189132 190466 192483 195038 197695 200289 202724 204527 205380 205996 207742
53801 207742 211291 216141 221435 226786 232243 237945 243847 249558 254531 258649 262358 265947 269088 271552
$$ packed form
53906C37216P394O772N963N414N266N293N421N884O761P679P953O829L811p94
53892D16862n707r462j1403j1784j1252j0565j0418j0838j0980j0110q658p656
53880B98029p345p018o186n112m180l447k991l031l512l962l985l552k895k361
53866B38452k297k682l079l224l348l491l045j688k85J01k89l57P3O9p77j692
53850B12441j955j796j671j502j126q26r55j380j676j530r03j13K60k8m86n28
53834A96226l48n02q57p69k20N9l00q65j124r33l06N12P59j69j617k193j478l97
53816A85478K34N47Q46J001J026J334K017K555K657K594K435J803Q53O16J746
53801B07742L549M850N294N351N457N702N902N711M973M118L709L589L141K464
$$ plain form
53787 271552 273961 277133 280877 284091 285914 286218 285170 282999 280170 277176 274089 270751 267240 263654
53773 263654 259668 254988 250079 245687 241705 237322 232393 227896 224772 222981 221951 221353 220994 220437 219210
53758 219210 217261 214960 212780 211038 209720 208445 206756 204534 202056 199738 197956 196909 196398 195859 194936
53743 194936 193853 193061 192774 193114 194303 196216 198017 198823 198609 198003 197425 196902 196491 196239 195840 195006 194156
53726 194156 194173 195463 197647 200056 202052 203205 203748 204659 206567 208785 210165 210699 211371 212570 213711 214479
53710 214479 215366 216671 217985 219059 220303 221939 223541 224921 226685 229216 231799 233540 234641 236066
53696 236066 238293 241134 244476 248350 252250 255150 256453 256620 256647 257141 258019 258994 260096 261565 263289 264675
53680 264675 265307 265425 265454 265389 265152 265226 266124 267328 267649 266828 265893 265613 265372 264173 262122 260253 259258 259008
$$ packed form
53787B71552K409L172L744L214J823L04j048k171k829k994l087l338l511l586
53773B63654l986m680m909m392l982m383m929m497l124j791j030n98l59n57j227
53758B19210j949k301k180j742j318j275j689k222k478k318j782j047n11n39r23
53743A94936j083p92k87L40J189J913J801Q06k14o06n78n23m11k52l99q34q50
53726A94156J7J290K184K409J996J153N43R11J908K218J380N34O72J199J141P68
53710B14479Q87J305J314J074J244J636J602J380J764K531K583J741J101J425
53696B36066K227K841L342L874L900K900J303J67K7M94Q78R75J102J469J724J386
53680B64675O32J18K9o5k37P4Q98J204L21q21r35k80k41j199k051j869r95k50
$$ plain form
53662 259008 259113 259388 259783 260197 260356 259839 258476 256802 255715 255482 255457 254995 254210 253528 252942 252115 250936 249578
53644 249578 248272 247321 247087 247672 248885 250685 253214 256126 258384 259281 259212 258959 258575 257694 256639 256425 257607
53627 257607 259765 262247 264960 268226 272208 276601 280668 283561 284961 285523 286458 288549 291613 294921 297971
53612 297971 300886 304130 307908 311825 315276 318104 320594 322778 324260 325048 326106 328529 332298 336330
53598 336330 339654 342136 344193 346315 348825 351545 353593 354090 353293 352567 352948 354130 355210 356014 357135
53583 357135 358858 360609 361560 361399 360377 358910 357276 355458 353114 349891 345962 342119 339129 337092 335559
53568 335559 334109 332539 330706 328561 326500 325278 325358 326453 327809 328786 329128 328922 328478 328124 327984 328066 328563
53551 328563 329760 331534 333271 334518 335483 336673 338355 340535 343144 345931 348526 350997 354033 358117
$$ packed form
53662B59008J05K75L95M14J59n17j363j674j087k33k5m62p85o82n86q27j179j358
53644B49578j306r51k34N85J213J800K529K912K258Q97o9k53l84q81j055k14J182
53627B57607K158K482K713L266L982M393M067K893J400N62R35K091L064L308L050
53612B97971K915L244L778L917L451K828K490K184J482P88J058K423L769M032
53598C36330L324K482K057K122K510K720K048M97p97p26L81J182J080Q04J121
53583C57135J723J751R51j61j022j467j634j818k344l223l929l843k990k037j533
53568C35559j450j570j833k145k061j222Q0J095J356R77L42k06m44l54j40Q2M97
53551C28563J197J774J737J247R65J190J682K180K609K787K595K471L036M084
$$ plain form
53537 358117 362842 367516 372178 377393 383264 389350 395525 402196 409616 417647 426280 435757 445964 456313
53523 456313 466475 476788 487714 499358 511713 524844 538560 552416 566392 581196 597563
53512 597563 615581 634906 655257 676353 697829 719626 742203 765992 790771 815770 840142
53501 840142 863212 884715 905093 925250 945625 965795 985201 1003857 1021999 1039498 1056218
53490 1056218 1072682 1089738 1107602 1125705 1143472 1160845 1177998 1194923 1211392 1227161 1242188
53479 1242188 1256764 1271344 1286072 1300598 1314435 1327259 1338612 1347628 1353569 1356593 1357601 1357257
53467 1357257 1355369 1351242 1344362 1334724 1322702 1308808 1293537 1277429 1261131 1245113 1229241 1212804
53455 1212804 1195203 1176466 1157026 1137141 1116713 1095521 1073486 1050885 1028432 1006979 986946
$$ packed form
53537C58117M725M674M662N215N871O086O175O671P420Q031Q633R477J0207J0349
53523D56313J0162J0313J0926J1644J2355J3131J3716J3856J3976J4804J6367
53512E97563J8018J9325K0351K1096K1476K1797K2577K3789K4779K4999K4372
53501H40142K3070K1503K0378K0157K0375K0170J9406J8656J8142J7499J6720
53490A056218J6464J7056J7864J8103J7767J7373J7153J6925J6469J5769J5027
53479A242188J4576J4580J4728J4526J3837J2824J1353R016N941L024J008l44
53467A357257j888m127o880r638j2022j3894j5271j6108j6298j6018j5872j6437
53455A212804j7601j8737j9440j9885k0428k1192k2035k2601k2453k1453k0033
$$ plain form
53444 986946 968181 950480 933974 918839 904873 891716 879360 868225 858843 851612 846613 843428
53432 843428 841325 839914 839468 840328 842280 844885 848313 853385 860744 870269 881317 893292 905978 919569
53418 919569 934479 950965 968922 988106 1008408 1029748 1051855 1074488 1097902 1122841 1149998
53407 1149998 1179546 1211184 1244483 1279152 1315043 1352030 1390014 1429208 1470312 1514070 1560506
53396 1560506 1608852 1658392 1709079 1761078 1814063 1867412 1920981 1975115 2029795 2084152 2137135
53385 2137135 2188463 2238549 2287473 2334334 2377927 2417916 2454946 2489512 2521265 2549733 2575107
53374 2575107 2597485 2615722 2628181 2634817 2637462 2637513 2634114 2625201 2609494 2586712 2556598 2519080 2475216
53361 2475216 2426931 2375669 2322023 2266679 2210769 2155104 2099753 2044699 1990276 1936750 1884117
$$ packed form
53444I86946j8765j7701j6506j5135j3966j3157j2356j1135r382p231m999l185
53432H43428k103j411m46Q60J952K605L428N072P359R525J1048J1975J2686J3591
53418I19569J4910J6486J7957J9184K0302K1340K2107K2633K3414K4939K7157
53407A149998K9548L1638L3299L4669L5891L6987L7984L9194M1104M3758M6436
53396A560506M8346M9540N0687N1999N2985N3349N3569N4134N4680N4357N2983
53385B137135N1328N0086M8924M6861M3593L9989L7030L4566L1753K8468K5374
53374B575107K2378J8237J2459O636K645N1l399q913j5707k2782l0114l7518m3864
53361B475216m8285n1262n3646n5344n5910n5665n5351n5054n4423n3526n2633
$$ plain form
53350 1884117 1832680 1783288 1736548 1692149 1649257 1607173 1565326 1523166 1480646 1438566 1397938
53339 1397938 1359159 1322175 1287231 1254881 1225236 1197723 1171761 1147406 1125226 1105777 1089259
53328 1089259 1075444 1063736 1053435 1044021 1035146 1026372 1017193 1007471 997665 988401 979915 972152 965273
53315 965273 959739 955812 953290 951867 951475 952113 953719 956562 961418 968734 977692 986734 995175 1003815 1013832
53300 1013832 1025637 1039163 1054621 1072281 1091762 1112283 1133637 1156378 1180888 1206770 1233355
53289 1233355 1260473 1288346 1316844 1345183 1372402 1397974 1421815 1443738 1463148 1479543 1493218
53278 1493218 1505096 1515649 1524261 1529814 1531693 1529962 1524905 1516864 1506404 1494145 1480297 1464657
53266 1464657 1447108 1427833 1406977 1384428 1360127 1334424 1307998 1281431 1254790 1227410 1198203
$$ packed form
53350A884117n1437m9392m6740m4399m2892m2084m1847m2160m2520m2080m0628
53339A397938l8779l6984l4944l2350k9645k7513k5962k4355k2180j9449j6518
53328A089259j3815j1708j0301r414q875q774r179r722r806r264q486p763o879
53315I65273n534l927k522j423l92O38J606K843M856P316Q958R042Q441Q640J0017
53300A013832J1805J3526J5458J7660J9481K0521K1354K2741K4510K5882K6585
53289A233355K7118K7873K8498K8339K7219K5572K3841K1923J9410J6395J3675
53278A493218J1878J0553Q612N553J879j731n057q041j0460j2259j3848j5640
53266A464657j7549j9275k0856k2549k4301k5703k6426k6567k6641k7380k9207
$$ plain form
53255 1198203 1166536 1132979 1098999 1065922 1034387 1004702 977159 951616 927146 902627 877701
53244 877701 852849 828558 804774 781262 758165 735883 714499 693642 673004 652881 634051
53233 634051 617176 602341 589109 576945 565640 555439 546754 539647 533552 527587 521127 514095 506750
53220 506750 499315 491736 483680 474792 465065 454908 444679 434255 423315 412048 401309 391960 384225
53207 384225 377735 371956 366461 361030 355705 350671 346004 341586 337215 332571 327150 320622 313390 306452
53193 306452 300494 295394 290742 286447 282536 278786 275016 271539 268831 266849 265034 262968 260663 258292
53179 258292 256028 254132 252824 251936 250988 249735 248417 247369 246577 245759 244748 243645 242627 241643 240417
53164 240417 238791 237035 235617 234684 233990 233382 232988 232739 232132 230886 229596 229143 229537 229854 229397 228431 227600
$$ packed form
53255A198203l1667l3557l3980l3077l1535k9685k7543k5543k4470k4519k4926
53244H77701k4852k4291k3784k3512k3097k2282k1384k0857k0638k0123j8830
53233F34051j6875j4835j3232j2164j1305j0201q685p107o095n965o460p032p345
53220E06750p435p579q056q888r727j0157j0229j0424j0940j1267j0739r349p735
53207C84225o490n779n495n431n325n034m667m418m371m644n421o528p232o938
53193C06452n958n100m652m295l911l750l770l477k708j982j815k066k305k371
53179B58292k264j896j308q88r48j253j318j048p92q18j011j103j018r84j226
53164B40417j626j756j418r33o94o08l94k49o07j246j290m53L94L17m57r66q31
$$ plain form
53147 227600 227044 226460 225717 225010 224514 224262 224399 225187 226545 227823 228338 228101 227684 227323 226572 225113 223518
53130 223518 222704 222783 223027 222973 222971 223440 224169 224674 224816 224681 224274 223773 223739 224545 225802 226793 227316 227718 228325 229315
53110 229315 230942 233240 235525 236714 236297 234678 232640 230869 229899 229924 230522 230952 230870 230423 229653 228284 226260
53093 226260 224041 222109 220501 219041 217731 216671 215843 215192 214711 214279 213652 212830 212211 212197 212753 213535 214224
53076 214224 214574 214376 213724 213177 213317 214141 215149 216040 217019 218355 219856 220969 221294 220839 219881 218744 217690
53059 217690 216869 216293 215922 215775 215914 216310 216893 217635 218369 218590 217861 216523 215554 215432 215587 215412 215287 215842
53041 215842 216528 215993 213929 211579 210042 209002 207654 206053 204774 203814 202713 201481 200615 200278 200126 199899
53025 199899 199698 199691 199947 200505 201232 201797 202141 202697 203732 204766 205195 205215 205517 206237 206905 207285 207540 207662 207454
$$ packed form
53147B27600n56n84p43p07m96k52J37P88J358J278N15k37m17l61p51j459j595
53130B23518q14P9K44n4kM69P29N05J42j35m07n01l4Q06J257R91N23M02O07R90
53110B29315J627K298K285J189m17j619k038j771r70K5N98M30q2m47p70j369k024
53093B26260k219j932j608j460j310j060q28o51m81m32o27q22o19j4N56P82O89
53076B14224L50j98o52n47J40Q24J008Q91R79J336J501J113L25m55r58j137j054
53059B17690q21n76l71j47J39L96N83P42P34K21p29j338r69j22J55j75j25N55
53041B15842O86n35k064k350j537j040j348j601j279r60j101j232q66l37j52k27
53025A99899k01pK56N58P27N65L44N56J035J034M29K0L02P20O68L80K55J22k08
$$ plain form
53006 207454 207161 207334 207936 208301 208235 208450 209514 210902 211555 211081 210051 209346 209438 210107 210674 210726 210580 210786 211223
52987 211223 211143 210214 208984 208226 208297 209326 211349 213845 215642 215909 215058 214233 214110 214533 215127 215723 216285 216828
52969 216828 217514 218514 219703 220760 221609 222491 223437 223963 223659 223027 223298 225134 227773 229788 230563 230575 230339
52952 230339 229736 228583 227215 225952 224411 221966 218714 215508 213127 211764 211154 210789 210155 209168 208244 207626
52936 207626 206932 205845 204871 204728 205234 205549 205412 205309 205461 205511 205302 205135 205013 204430 203237 201976 200978 199869
52918 199869 198501 197707 198424 200452 202705 204443 205685 206587 207039 206982 206684 206525 206620 206770 206754 206601 206464 206218
52900 206218 205480 204199 202948 202293 202157 202172 202326 202691 202861 202471 202132 202921 204872 206876 208221 209303 210532
52883 210532 211465 211598 211238 210964 210823 210614 210455 210431 210126 209123 207665 206367 205566 205341 205779 206759 207844 208823
$$ packed form
53006B07454k93J73O02L65o6K15J064J388O53m74j030p05R2O69N67N2j46K06M37
52987B11223q0r29j230p58P1J029K023K496J797K67q51q25j23M23N94N96N62N43
52969B16828O86J000J189J057Q49Q82R46N26l04o32K71J836K639K015P75J2k36
52952B30339o03j153j368j263j541k445l252l206k381j363o10l65o34r87r24o18
52936B07626o94j087r74j43N06L15j37j03J52N0k09j67j22n83j193j261r98j109
52918A99869j368p94P17K028K253J738J242R02M52n7k98j59R5J50j6j53j37k46
52900B06218p38j281j251o55j36J5J54L65J70l90l39P89J951K004J345J082J229
52883B10532R33J33l60k74j41k09j59k4l05j003j458j298q01k25M38R80J085R79
$$ plain form
52865 208823 210054 211868 214000 215998 217847 219768 221721 223536 225092 225978 225438 223240 220330 218034 216795
52850 216795 216122 215431 214511 213383 212209 211145 209957 208084 205427 202629 200204 197880 195349 193161 192153
52835 192153 192383 193309 194704 196507 198054 198429 197632 196686 196499 197184 198454 199950 201120 201473 201141 200693 200283
52818 200283 199526 198318 197226 196821 197085 197674 198397 199243 200248 201602 203630 206597 210568 215328 220086 223414
52802 223414 224094 222207 219055 215911 213132 210470 207761 205069 202544 200433 199050 198494 198441 198342 197774 196659
52786 196659 195275 194022 193018 192022 190912 190115 190284 191614 193718 196049 198149 199577 200066 199841 199468 199289
52770 199289 199215 199151 199298 199869 200654 201049 200538 199134 197415 196093 195446 195186 194885 194416 193958 193813 194302 195582
52752 195582 197341 198826 199413 199101 198320 197482 196872 196698 197024 197718 198640 199684 200598 201073 201204 201547 202503 203975
$$ packed form
52865B08823J231J814K132J998J849J921J953J815J556Q86n40k198k910k296j239
52850B16795o73o91r20j128j174j064j188j873k657k798k425k324k531k188j008
52835A92153K30R26J395J803J547L75p97r46j87O85J270J496J170L53l32m48m10
52818B00283p57j208j092m05K64N89P23Q46J005J354K028K967L971M760M758L328
52802B23414O80j887l152l144k779k662k709k692k525k111j383n56n3r9n68j115
52786A96659j384j253j004r96j110p97J69J330K104K331K100J428M89k25l73j79
52770A99289p4o4J47N71P85L95n11j404j719j322o47k60l01m69m58j45M89J280
52752A95582J759J485N87l12p81q38o10j74L26O94R22J044R14M75J31L43R56J472
$$ plain form
52734 203975 205787 207968 210346 212384 213893 215468 217701 220322 222672 224594 226206 227121 226719 225079 222914
52719 222914 220653 218292 216059 214413 213258 211909 210058 208197 206848 205952 205257 204816 204787 205108 205590 206052
52703 206052 206161 205539 204243 202922 202255 202342 202706 202712 202034 200956 200189 200176 200653 201113 201521 202237 203412 204921
52685 204921 206733 208818 210779 212121 212847 213277 213357 212809 211932 211474 211524 211279 210248 209026 208439 208444 208386 207994
52667 207994 207617 207690 208320 209259 210047 210348 210276 210206 210266 210346 210649 211658 213350 214989 216095 217159 218939 221442
52649 221442 224034 226259 227999 229037 229028 227958 226229 224289 222453 221002 220093 219538 218967 218250 217562 217036
52633 217036 216584 216121 215799 215859 216374 217192 218193 219633 222158 226201 231171 235400 237212 236221 233507 230570
52617 230570 228202 226338 224678 223176 221980 221184 220816 220844 221032 220916 220210 219165 218279 217710 217295 217037 217141
$$ packed form
52734B03975J812K181K378K038J509J575K233K621K350J922J612R15m02j640k165
52719B22914k261k361k233j646j155j349j851j861j349q96o95m41k9L21M82M62
52703B06052J09o22j296j321o67Q7L64Oo78j078p67j3M77M60M08P16J175J509
52685B04921J812K085J961J342P26M30Q0n48q77m58N0k45j031j222n87Nn8l92
52667B07994l77P3O30R39P88L01p2p0O0Q0L03J009J692J639J106J064J780K503
52649B21442K592K225J740J038rj070j729j940j836j451r09n55n71p17o88n26
52633B17036m52m63l22O0N15Q18J001J440K525M043M970M229J812r91k714k937
52617B30570k368j864j660j502j196p96l68K8J88j16p06j045q86n69m15k58J04
$$ plain form
52600 217141 217504 217680 217545 217571 218200 219355 220761 222226 223354 223607 223126 222867 223312 223641 222980 221909 221708
52583 221708 222441 222966 222769 222594 223073 223872 224583 225482 226798 228007 228453 228191 227684 227159 226716 226551 226605 226408
52565 226408 225758 225157 225155 225629 226099 226353 226354 225954 225184 224426 223791 222704 220699 218281 216413 215354 214620 213938
52547 213938 213584 213842 214726 216211 218211 220272 221801 222703 223332 223721 223333 221828 219720 218043 217464 217846
52531 217846 218484 218662 218172 217448 217136 217532 218469 219677 220997 222269 223272 223848 223971 223677 223140 222775 223022
52514 223022 223889 224997 226206 227929 230522 233540 236007 237418 238168 238894 239787 240698 241551 242271 242542 242133
52498 242133 241359 240722 240068 238638 236149 233381 231367 230346 229833 229343 228673 227777 226850 226376 226677 227513 228467
52481 228467 229571 231132 233081 234920 236252 236962 236993 236476 236014 236369 237760 239791 242010 244127 245797 246766
$$ packed form
52600B17141L63J76j35K6O29J155J406J465J128K53m81k59M45L29o61j071k01
52583B21708P33N25j97j75M79P99P11Q99J316J209M46k62n07n25m43j65N4j97
52565B26408o50o01kM74M70K54Jm00p70p58o35j087k005k418j868j059p34o82
52547B13938l54K58Q84J485K000K061J529R02O29L89l88j505k108j677n79L82
52531B17846O38J78m90p24l12L96R37J208J320J272J003N76J23k94n37l65K47
52514B23022Q67J108J209J723K593L018K467J411P50P26Q93R11Q53P20K71m09
52498B42133p74o37o54j430k489k768k014j021n13m90o70q96r27m74L01Q36R54
52481B28467J104J561J949J839J332P10L1n17m62L55J391K031K219K117J670R69
$$ plain form
52465 246766 247334 248160 249445 250704 251468 251837 252242 253013 254277 255876 257243 257673 256815 254748 251685 248039
52449 248039 244601 242020 240047 237916 235565 233899 233577 234133 234552 234203 232970 231037 228961 227486 226816
52434 226816 226371 225600 224714 224279 224425 224875 225521 226580 228230 230275 232090 232913 232503 231614 231434 232417 234023
52417 234023 235662 237361 239251 240993 242207 243116 244331 246172 248493 250961 253325 255658 258524 262662
52403 262662 268388 275584 284171 293838 303082 309343 310807 307784 301956 294728 286858 279135 272513 267514
52389 267514 264012 261598 259832 258251 256539 254732 253100 251928 251482 251946 253179 254813 256672 258724 260547
52374 260547 261455 261475 261648 262934 265278 268166 271510 275336 279065 281926 283893 285535 287063 288186 288855
52359 288855 289457 290149 290496 289968 288543 286715 285143 284256 284039 284165 284397 284661 284758 284433 283891 283816 284617 286056
$$ packed form
52465B46766N68Q26J285J259P64L69M05P71J264J599J367M30q58k067l063l646
52449B48039l438k581j973k131k351j666l22N56M19l49j233j933k076j475o70
52434B26816m45p71q86m35J46M50O46J059J650K045J815Q23m10q89j80R83J606
52417B34023J639J699J890J742J214R09J215J841K321K468K364K333K866M138
52403B62662N726P196Q587R667R244O261J464l023n828p228p870p723o622m999
52389B67514l502k414j766j581j712j807j632j172m46M64J233J634J859K052J823
52374B60547R08K0J73J286K344K888L344L826L729K861J967J642J528J123O69
52359B88855O02O92L47n28j425j828j572q87k17J26K32K64R7l25n42p5Q01J439
$$ plain form
52341 286056 287901 290407 293769 297605 301479 305488 309770 313903 317487 320966 325190 330405 336282 342694
52327 342694 349709 357015 364093 370979 378268 386437 395674 406209 418151 431056 444178 457049 469328
52314 469328 480442 490155 499342 509332 520424 531806 542949 554250 566107 578146 589716 600583
52302 600583 610845 620640 630158 639565 648782 657772 667042 677186 687727 697066 703884 708169 710653
52289 710653 711803 711750 710672 708718 705783 701763 696946 691929 687280 683327 680049 677056 673966 670911 668504
52274 668504 667259 667324 668685 671133 673958 676283 678098 680572 684915 691092 697966 704557 710791 717096 723615
52259 723615 730060 736281 742783 750468 759812 770421 781495 792557 803578 814555 825224 835103 843675
52246 843675 850691 856423 861373 865547 868297 869097 868107 865721 862056 857371 852455 847868 843135 837506 831267
$$ packed form
52341B86056J845K506L362L836L874M009M282M133L584L479M224N215N877O412
52327C42694P015P306P078O886P289Q169R237J0535J1942J2905J3122J2871J2279
52314D69328J1114R713R187R990J1092J1382J1143J1301J1857J2039J1570J0867
52302F00583J0262R795R518R407R217Q990R270J0144J0541R339O818M285K484
52289G10653J150n3j078j954k935m020m817n017m649l953l278k993l090l055k407
52274F68504j245O5J361K448K825K325J815K474M343O177O874O591O234O305O519
52259G23615O445O221O502P685R344J0609J1074J1062J1021J0977J0669R879Q572
52246H43675P016N732M950M174K750Q00r90k386l665m685m916m587m733n629o239
$$ plain form
52231 831267 825412 820099 814438 807934 801259 795302 790207 785680 781556 777656 773674 769617 765925 762865
52217 762865 760216 757805 755943 755084 755479 757294 760489 764432 768256 771888 776088 781168 786408 791099 795387
52202 795387 799450 802656 804448 805579 807437 810346 813406 815890 817988 820181 822734 825952 830143 834972
52188 834972 839473 843135 846539 850446 854544 857527 858356 857097 854535 851234 847133 841940 835769 829260
52174 829260 823030 817127 811199 805149 799391 794392 790196 786620 783707 781640 780249 779013 777768 777063
52160 777063 777495 778908 780737 783010 786373 790870 795216 797751 797955 796707 795221 794135 793489 793208 793400
52145 793400 794272 795761 797385 798718 800043 802152 805265 808542 810876 811763 811169 809155 806214 803511 801999
52130 801999 801549 801612 802527 805334 810434 817272 825392 835001 846324 859195 873627 890097 908885 929524
$$ packed form
52231H31267n855n313n661o504o675n957n095m527m124l900l982m057l692l060
52217G62865k649k411j862q59L95J815L195L943L824L632M200N080N240M691M288
52202G95387M063L206J792J131J858K909L060K484K098K193K553L218M191M829
52188H34972M501L662L404L907M098K983Q29j259k562l301m101n193o171o509
52174H29260o230n903n928o050n758m999m196l576k913k067j391j236j245p05
52160G77063M32J413J829K273L363M497M346K535K04j248j486j086o46k81J92
52145G93400Q72J489J624J333J325K109L113L277K334Q87n94k014k941k703j512
52130H01999m50O3R15K807N100O838Q120R609J1323J2871J4432J6470J8788K0639
$$ plain form
52116 929524 951088 972567 992907 1011440 1028582 1045463 1062403 1078280 1091869 1103315 1113709
52105 1113709 1123624 1132658 1140236 1146302 1151226 1155540 1159858 1164782 1170656 1177299 1183889 1189284 1192799 1194695
52091 1194695 1195580 1195280 1192671 1186716 1177350 1165289 1151531 1137179 1123277 1110359 1098408 1087415 1077715
52078 1077715 1069620 1063105 1058056 1054470 1052143 1050564 1049430 1048974 1049487 1050772 1052395 1054271 1056787 1060476
52064 1060476 1065742 1072620 1080636 1089098 1097610 1106092 1114310 1121850 1128617 1134863 1140601 1145559 1149972 1154730
52050 1154730 1160219 1165432 1168835 1169919 1169424 1168213 1166277 1162768 1156803 1148321 1138283 1127797 1117121
52037 1117121 1105979 1094792 1084728 1076166 1067951 1058863 1049249 1040462 1033136 1026812 1020897 1015062 1008825
52024 1008825 1001633 993545 985163 976797 968277 959683 951524 943903 936106 927545 918814 911272 905560 900868
$$ packed form
52116I29524K1564K1479K0340J8533J7142J6881J6940J5877J3589J1446J0394
52105A113709R915R034P578O066M924M314M318M924N874O643O590N395L515J896
52091A194695Q85l00k609n955r366j2061j3758j4352j3902j2918j1951j0993r700
52078A077715q095o515n049l586k327j579j134m56N13J285J623J876K516L689
52064A060476N266O878Q016Q462Q512Q482Q218P540O767O246N738M958M413M758
52050A154730N489N213L403J084m95j211j936l509n965q482j0038j0486j0676
52037A117121j1142j1187j0064q562q215r088r614q787p326o324n915n835o237
52024A008825p192q088q382q366q520q594q159p621p797q561q731p542n712m692
$$ plain form
52010 900868 895816 889848 883537 877524 871528 864738 856932 848589 839800 829779 817837 804334 790084
51997 790084 775182 759120 741994 724915 709056 694771 681865 670317 660352 651872 644133 636177
51985 636177 627599 618746 610117 601729 593274 584710 576216 567582 558164 547634 536359 524851 513304
51972 513304 502002 491711 483234 476815 472313 469688 468936 469827 472040 475398 479665 484464 489718 495865
51958 495865 503212 511312 519259 526257 531586 534484 534686 532745 529290 524285 517638 510223 503488 498142
51944 498142 493938 490684 488764 488637 490574 495011 502409 512483 524118 536351 548994 562047 575028
51931 575028 587187 597986 606972 613449 616675 616284 612356 605264 595626 584210 571603 558087 543920
51918 543920 529561 515514 502146 489819 479001 470058 463026 457757 454174 452204 451588 452087 453956
$$ packed form
52010I00868n052n968o311o013n996o790p806q343q789j0021j1942j3503j4250
51997G90084j4902j6062j7126j7079j5859j4285j2906j1548r965q480p739p956
51985F36177q578q853q629q388q455q564q494q634r418j0530j1275j1508j1547
51972E13304j1302j0291q477o419m502k625p52Q91K213L358M267M799N254O147
51958D95865P347Q100P947O998N329K898K02j941l455n005o647p415o735n346
51944D98142m204l254j920j27J937M437P398J0074J1635J2233J2643J3053J2981
51931E75028J2159J0799Q986O477L226l91l928p092r638j1416j2607j3516j4167
51918E43920j4359j4047j3368j2327j0818q943p032n269l583j970o16M99J869
$$ plain form
51905 453956 458016 465072 475373 488871 505934 527370 553501 583370 615046 646274 674322 695466
51893 695466 705713 702777 687329 662338 631559 598566 566296 536631 510462 488384 471017 458321
51881 458321 449129 442047 436717 433650 433024 434253 436822 440957 447198 455557 465267 475206 484490 492717
51867 492717 499622 504552 506559 505155 500722 493999 485491 475585 464911 454262 444465 436502 431292 428886
51853 428886 428300 428609 429821 432098 434626 436123 436209 435457 434184 432039 428798 424702 419903 414346 408446
51838 408446 403127 398859 395235 391810 388763 386353 384326 382410 381064 381157 382985 385926 388955 391307 392826
51823 392826 393873 394801 395415 395136 393774 391873 390107 388596 387100 385675 384826 385005 386156 387861 389846
51808 389846 392285 395479 399196 402457 404149 403807 401711 398407 394378 390111 386165 383043 381107 380509 381065
$$ packed form
51905D53956M060P056J0301J3498J7063K1436K6131K9869L1676L1228K8048K1144
51893F95466J0247k936j5448k4991l0779l2993l2270k9665k6169k2078j7367j2696
51881D58321r192p082n330l067o26J229K569M135O241Q359R710R939R284Q227
51867D92717O905M930K007j404m433o723q508r906j0674j0649r797p963n210k406
51853D28886n86L09J212K277K528J497Q6p52j273k145l241m096m799n557n900
51838D08446n319m268l624l425l047k410k027j916j346R3J828K941L029K352J519
51823C92826J047R28O14k79j362j901j766j511j496j425q49J79J151J705J985
51808C89846K439L194L717L261J692l42k096l304m029m267l946l122j936n98N56
$$ plain form
51793 381065 382180 383042 382911 381331 378352 374671 371252 368556 366346 364364 362775 361661 360550 358978 357228
51778 357228 355902 355020 354141 353264 352958 353559 354757 356033 357099 358010 359358 362335 367998 376286 386091 396276
51762 396276 406275 415819 424593 432197 437989 441105 441116 438557 434228 428159 420007 410433 401200 393696 388104
51747 388104 384166 381853 380860 380218 379099 377603 376361 375774 376034 377375 379852 383208 387366 392699 399442
51732 399442 407252 415599 424108 432033 437980 440939 441453 441194 441503 442790 445060 448148 451229 452689 450997
51717 450997 445823 438301 430343 423652 419072 416567 415570 415221 414472 412442 408944 404614 400409 397079 395102
51702 395102 394877 396708 400520 405527 410173 412803 412843 411249 409409 407761 406060 404778 405257 408040 411792
51687 411792 414475 415156 414076 411437 407027 401071 394709 389196 384862 381143 377580 374602 373292 374374
$$ packed form
51793C81065J115Q62j31j580k979l681l419k696k210j982j589j114j111j572j750
51778C57228j326q82q79q77l06O01J198J276J066R11J348K977N663Q288R805J0185
51762C96276R999R544Q774P604N792L116J1k559m329o069q152r574r233p504n592
51747C88104l938k313r93o42j119j496j242n87K60J341K477L356M158N333O743
51732C99442P810Q347Q509P925N947K959N14k59L09J287K270L088L081J460j692
51717D50997n174p522p958o691m580k505r97l49p49k030l498m330m205l330j977
51702C95102k25J831L812N007M646K630M0j594j840j648j701j282M79K783L752
51687D11792K683O81j080k639m410n956o362n513m334l719l563k978j310J082
$$ plain form
51673 374374 377543 381790 386201 390300 393873 396904 399721 402908 406996 412431 419657 428709 438622 447636
51659 447636 454117 457123 456225 451484 443806 434819 426045 418408 412569 409308 409370 413182 420665 430698 440727
51644 440727 447724 450087 448247 443277 435587 425466 414150 403445 394466 387340 381908 378068 375500
51631 375500 373654 372133 370838 369714 368612 367324 365617 363449 361298 359939 359568 359401 358470 356585 354171
51616 354171 351550 348845 346364 344450 343014 341671 340381 339545 339404 339679 339875 339763 339535 339665 340631 342665
51600 342665 345816 350161 355723 362045 368269 373916 379432 385788 393798 403832 415573 427481 436958
51587 436958 441781 441511 437298 430638 422777 414964 408375 403566 400422 398837 399137 401841 407302 415612 426500
51572 426500 439202 452755 466556 480568 495024 510127 525914 542035 557562 571230 582085
$$ packed form
51673C74374L169M247M411M099L573L031K817L187M088N435P226R052R913R014
51659D47636O481L006q98m741p678q987q774p637n839l261O2L812P483J0033J0029
51644D40727O997K363j840m970p690j0121j1316j0705q979p126n432l840k568
51631C75500j846j521j295j124j102j288j707k168k151j359l71j67r31j885k414
51616C54171k621k705k481j914j436j343j290q36j41K75J96j12k28J30R66K034
51600C42665L151M345N562O322O224N647N516O356Q010J0034J1741J1908R477
51587D36958M823k70m213o660p861p813o589m809l144j585L00K704N461Q310J0888
51572D26500J2702J3553J3801J4012J4456J5103J5787J6121J5527J3668J0855
$$ plain form
51561 582085 590155 596865 604930 617439 636505 662707 695760 735023 778749 823248 863795 896808
51549 896808 920943 936264 943069 941678 932646 916523 893636 864521 830500 793507 755293 716969
51537 716969 679230 642798 608551 577339 549787 526219 506615 490524 477097 465508 455449
51526 455449 447127 440664 435721 431736 428233 424670 420305 414751 408692 403603 400483 398946 397607 395222
51512 395222 391496 387097 383147 380568 379582 379540 379304 378081 376127 374637 374739 376511 379038 381386 383416
51497 383416 385656 388584 392041 395181 396974 396884 395160 392466 389350 386168 383288 381053 379647 379200 379724
51482 379724 380488 379802 376310 370611 364894 360701 357677 354709 351416 347987 344309 340227 336304 333510 332112
51467 332112 331444 330681 329383 327383 324735 321821 319101 316707 314630 313262 313227 314572 316484 318055 319151
$$ packed form
51561E82085Q070O710Q065J2509J9066K6202L3053L9263M3726M4499M0547L3013
51549H96808K4135J5321O805j391r032j6123k2887k9115l4021l6993l8214l8324
51537G16969l7739l6432l4247l1212k7552k3568j9604j6091j3427j1589j0059
51526D55449q322o463m943l985l503l563m365n554o059n089l120j537j339k385
51512C95222l726m399l950k579r86m2k36j223j954j490J02J772K527K348K030
51497C83416K240K928L457L140J793r0j724k694l116l182k880k235j406m47N24
51482C79724P64o86l492n699n717m193l024k968l293l429l678m082l923k794j398
51467C32112o68p63j298k000k648k914k720k394k077j368l5J345J912J571J096
$$ plain form
51452 319151 320366 322291 324976 328124 331640 335782 340683 345933 351002 356101 362373 371223 383637 399804
51438 399804 418586 437298 452828 463563 469919 472940 473249 471745 470168 469677 469084 465601 457444 445158
51424 445158 430661 415900 402436 391268 382419 375112 368676 363131 358805 355787 353892 352804 352106
51411 352106 351521 351313 352098 354006 356256 357866 358717 359635 361436 364154 367414 371315 376454 382845 389338
51396 389338 394627 398609 402134 405584 408563 411017 413757 417440 421791 426333 431206 436807 443315 451202
51382 451202 461555 475114 491591 510772 533753 562059 595910 634405 677136 724468 775993
51371 775993 829528 881744 929177 968819 998781 1018789 1029485 1031135 1023414 1006236 980058 945585
51359 945585 904123 858199 810754 763363 716064 669239 624847 585312 551843 524199 501471
$$ packed form
51452C19151J215J925K685L148L516M142M901N250N069N099O272Q850J2414J6167
51438C99804J8782J8712J5530J0735O356L021L09j504j577m91n93l483q157j2286
51424D45158j4497j4761j3464j1168q849p307o436n545m326l018j895j088o98
51411C52106n85k08P85J908K250J610Q51R18J801K718L260L901N139O391O493
51396C89338N289L982L525L450K979K454K740L683M351M542M873N601O508P887
51382D51202J0353J3559J6477J9181K2981K8306L3851L8495M2731M7332N1525
51371G75993N3535N2216M7433L9642K9962K0008J0696J650p721j7178k6178l4473
51359I45585m1462m5924m7445m7391m7299m6825m4392l9535l3469k7644k2728
$$ plain form
51348 501471 482556 466376 452307 440269 430124 421166 412444 403441 394396 386112 379400 374373 370393
51335 370393 366985 364478 363189 362333 360615 357790 354715 351843 348696 345086 341769 339293 337067 334233
51321 334233 330904 327861 325517 323797 322696 322292 322415 322715 323009 323272 323510 323814 324253 324603 324506 324044 323751
51304 323751 323927 324464 325470 327476 330715 334760 339205 344106 349315 353969 357234 359152 360194 360273 358826
51289 358826 355721 351572 347208 343141 339484 336115 332978 330322 328580 327974 328486 330125 332799 335929 338690
51274 338690 340697 341994 342423 341755 340501 339711 339658 339583 339153 339251 340714 343155 345801 348616 351599 353701 353754
51257 353754 352199 350713 350158 349920 349271 348328 347412 346328 344767 342876 341105 339821 339191 339054 338851 338160
51241 338160 337364 337313 338192 339209 339605 339514 339511 339656 339448 338658 337871 337973 339102 340319 340547 339763 338898 338496 338041
$$ packed form
51348E01471j8915j6180j4069j2038j0145q958q722r003r045q284o712n027l980
51335C70393l408k507j289q56j718k825l075k872l147l610l317k476k226k834
51321C34233l329l043k344j720j101m04J23L00K94K63K38L04M39L50r7m62k93
51304C23751J76N37J006K006L239M045M445M901N209M654L265J918J042P9j447
51289C58826l105m149m364m067l657l369l137k656j742o06N12J639K674L130K761
51274C38690K007J297M29o68j254p90n3p5m30R8J463K441K646K815K983K102N3
51257C53754j555j486n55k38o49r43r16j084j561j891j771j284o30j37k03o91
51241C38160p96n1Q79J017L96r1lJ45k08p90p87J02J129J217K28p84q65m02m55
$$ plain form
51222 338041 336904 335445 334549 334356 334114 333239 331877 330399 328973 327863 327582 328362 329694 330792 331486 332450
51206 332450 334476 337573 340933 343853 346532 349662 353323 356793 359615 362333 365740 369803 373792 377173
51192 377173 379803 381407 381539 380116 377577 374478 371256 368333 366047 364379 363040 361802 360634 359635 359116
51177 359116 359426 360280 360576 359456 357403 355724 355015 354745 354253 353400 352236 350843 349776 349885 351355 353505
51161 353505 355849 358654 361967 364872 366498 367261 368216 369428 369870 368931 367126 365195 363285 361373 359786
51146 359786 358719 357688 356092 354151 352747 352364 352676 353238 354142 355768 358192 361036 363717 365633 366279
51131 366279 365457 363421 360701 357811 355118 352849 351040 349628 348710 348569 349248 350226 350855 351119 351707 353275
51115 353275 355791 358686 361448 363976 366434 368835 370823 372010 372619 373564 375611 378536 381395 383614 385572
$$ packed form
51222C38041j137j459q96j93k42q75j362j478j426j110k81P80J332J098O94R64
51206C32450K026L097L360K920K679L130L661L470K822K718L407M063L989L381
51192C77173K630J604J32j423k539l099l222k923k286j668j339j238j168r99n19
51177C59116L10Q54K96j120k053j679p09k70m92q53j164j393j067J09J470K150
51161C53505K344K805L313K905J626P63R55J212M42r39j805j931j910j912j587
51146C59786j067j031j596j941j404l83L12N62R04J626K424K844K681J916O46
51131C66279q22k036k720k890k693k269j809j412r18j41O79R78O29K64N88J568
51115C53275K516K895K762K528K458K401J988J187O09R45K047K925K859K219J958
$$ plain form
51100 385572 388132 391842 396538 401432 405549 408350 409978 410747 410540 409095 406698 404067 401519 398792 395850
51085 395850 393286 391591 390439 389073 387131 384804 382445 380470 379435 379762 381214 382807 383441 382817 381843
51070 381843 381953 383759 386468 388839 390479 391817 393180 394650 396704 400083 404849 410439 416977 425599
51056 425599 436845 449326 460669 469381 475390 479472 483027 488097 496505 508627 523174 538176 552184
51043 552184 564931 577084 588953 599237 605644 607113 604856 600856 596191 591348 586999 583138 577969
51030 577969 569146 556168 540590 524108 507596 491915 478289 467345 458706 451962 447327 444985
51018 444985 444549 445521 447662 450647 454002 457728 462351 467996 474036 480037 486462 493935 502371 511311 520682
51003 520682 530692 541314 552336 563548 574482 584281 592418 599400 606358 614075 622705 632117 642024
$$ packed form
51100C85572K560L710M696M894M117K801J628P69k07j445k397k631k548k727k942
51085C95850k564j695j152j366j942k327k359j975j035L27J452J593O34o24r74
51070C81843J10J806K709K371J640J338J363J470K054L379M766N590O538Q622
51056D25599J1246J2481J1343Q712O009M082L555N070Q408J2122J4547J5002J4008
51043E52184J2747J2153J1869J0284O407J469k257m000m665m843m349l861n169
51030E77969q823j2978j5578j6482j6512j5681j3626j0944q639o744m635k342
51018D44985m36R72K141K985L355L726M623N645O040O001O425P473Q436Q940R371
51003E20682J0010J0622J1022J1212J0934R799Q137O982O958P717Q630R412R907
$$ plain form
50990 642024 651800 660655 668087 674061 678854 682981 687092 691711 697014 702900 709082 715029 720101 723966
50976 723966 726690 728241 728291 726838 724851 723873 725183 729653 738159 751465 769536 791379 815856 842473
50962 842473 871345 902767 937031 974353 1014501 1056469 1098876 1140800 1182036 1222427 1261074
50951 1261074 1296471 1327408 1353634 1375725 1394480 1410433 1423709 1434303 1442614 1449800 1457478 1466914
50939 1466914 1478433 1491318 1503873 1513604 1518055 1516163 1508887 1498345 1486251 1473153 1458787 1442809
50927 1442809 1425194 1406136 1385533 1362590 1336230 1306147 1273249 1238837 1203540 1167270 1130008
50916 1130008 1092244 1054803 1018572 984302 952323 922522 894812 869507 846932 826841 808601
50905 808601 791850 776619 762889 750423 738987 728401 718370 708628 699291 690760 683320 677009
$$ packed form
50990F42024R776Q855P432N974M793M127M111M619N303N886O182N947N072L865
50976G23966K724J551N0j453j987r78J310M470Q506J3306J8071K1843K4477K6617
50962H42473K8872L1422L4264L7322M0148M1968M2407M1924M1236M0391L8647
50951A261074L5397L0937K6226K2091J8755J5953J3276J0594Q311P186P678R436
50939A466914J1519J2885J2555R731M451j892p276j0542j2094j3098j4366j5978
50927A442809j7615j9058k0603k2943k6360l0083l2898l4412l5297l6270l7262
50916A130008l7764l7441l6231l4270l1979k9801k7710k5305k2575k0091j8240
50905H08601j6751j5231j3730j2466j1436j0586j0031r742r337q531p440o311
$$ plain form
50893 677009 671776 667428 663560 659921 656797 654640 653393 652566 651936 651764 652284 653417 654991 656884 658921
50878 658921 661024 663515 666885 671189 676008 680990 686121 691476 697206 703792 711850 721476 732104 743165
50864 743165 754641 766973 780696 796182 813450 832264 852669 875287 900684 928695 958904
50853 958904 991705 1028286 1069635 1116225 1168624 1227536 1292909 1363600 1438299 1516406 1597917
50842 1597917 1683013 1771931 1864569 1959820 2055720 2150398 2242332 2329469 2408822 2477480 2533637
50831 2533637 2576511 2606009 2623025 2629419 2627001 2616827 2599989 2578735 2556255 2535604 2519111 2508344
50819 2508344 2503988 2505912 2513715 2526791 2543324 2559620 2571214 2574749 2568599 2552205 2525483 2488589
50807 2488589 2441518 2383957 2316064 2239351 2156320 2069396 1980712 1892655 1807770 1727928 1654051
$$ packed form
50893F77009n233m348l868l639l124k157j247q27o30j72N20J133J574J893K037
50878F58921K103K491L370M304M819M982N131N355N730O586Q058R626J0628J1061
50864G43165J1476J2332J3723J5486J7268J8814K0405K2618K5397K8011L0209
50853I58904L2801L6581M1349M6590N2399N8912O5373P0691P4699P8107Q1511
50842A597917Q5096Q8918R2638R5251R5900R4678R1934Q7137P9353O8658N6157
50831B533637M2874K9498J7016O394k418j0174j6838k1254k2480k0651j6493j0767
50819B508344m356J924P803J3076J6533J6296J1594L535o150j6394k6722l6894
50807B488589m7071n7561o7893p6713q3031q6924q8684q8057q4885p9842p3877
$$ plain form
50796 1654051 1586617 1525878 1471640 1423554 1381759 1346664 1317929 1294349 1275047 1260220 1250396
50785 1250396 1245424 1244571 1246998 1251555 1256511 1260280 1262419 1263429 1263676 1263008 1261338 1258866 1255488 1250556 1243603
50770 1243603 1234793 1224235 1211300 1195366 1176998 1157563 1137567 1116154 1092520 1067136 1041068
50759 1041068 1014776 988369 962650 938997 918223 900280 885112 873032 864068 857591 852970 850116
50747 850116 849098 849667 851538 854835 859977 867333 877169 889630 904640 922187 942841 967544 996658
50734 996658 1029732 1066454 1107228 1152322 1200958 1251861 1304357 1358222 1412701 1466496 1518803
50723 1518803 1569785 1619844 1668752 1715590 1759164 1798383 1832430 1860602 1881835 1894536 1897320
50712 1897320 1890007 1873854 1850961 1823777 1794947 1767063 1742270 1722168 1707980 1700403 1699258 1703590
$$ packed form
50796A654051o7434o0739n4238m8086m1795l5095k8735k3580j9302j4827r824
50785A250396m972q53K427M557M956L769K139J010K47o68j670k472l378m932o953
50770A243603q810j0558j2935j5934j8368j9435j9996k1413k3634k5384k6068
50759A041068k6292k6407k5719k3653k0774j7943j5168j2080q964o477m621k854
50747H50116j018N69J871L297N142P356R836J2461J5010J7547K0654K4703K9114
50734I96658L3074L6722M0774M5094M8636N0903N2496N3865N4479N3795N2307
50723A518803N0982N0059M8908M6838M3574L9219L4047K8172K1233J2701K784
50712A897320p313j6153k2893k7184k8830k7884k4793k0102j4188p577j145M332
$$ plain form
50700 1703590 1712239 1724139 1738133 1752835 1766759 1778306 1785559 1786488 1779714 1765023 1743035 1714573
50688 1714573 1680621 1642808 1603541 1565322 1529859 1497754 1468979 1443537 1421652 1403526 1389115
50677 1389115 1378220 1370719 1366723 1366670 1371350 1381776 1398873 1423060 1453965 1490349 1530354 1571933
50665 1571933 1613164 1652450 1688750 1721809 1751888 1779154 1803557 1825430 1845758 1865399 1884380
50654 1884380 1902422 1919747 1936608 1952211 1965120 1974975 1983140 1991381 2000593 2011171 2023900 2039906
50642 2039906 2060096 2085109 2115498 2151517 2192995 2239576 2290669 2344821 2399611 2452593 2502099
50631 2502099 2547033 2586500 2620157 2648379 2671624 2690261 2705523 2719531 2732714 2740977 2736623 2712941
50619 2712941 2668257 2606314 2533927 2458420 2386057 2321427 2267489 2225775 2196443 2178457 2170313
$$ packed form
50700A703590Q649J1900J3994J4702J3924J1547P253R29o774j4691k1988k8462
50688A714573l3952l7813l9267l8219l5463l2105k8775k5442k1885j8126j4411
50677A389115j0895p501l996n3M680J0426J7097K4187L0905L6384M0005M1579
50665A571933M1231L9286L6300L3059L0079K7266K4403K1873K0328J9641J8981
50654A884380J8042J7325J6861J5603J2909R855Q165Q241R212J0578J2729J6006
50642B039906K0190K5013L0389L6019M1478M6581N1093N4152N4790N2982M9506
50631B502099M4934L9467L3657K8222K3245J8637J5262J4008J3183Q263m354k3682
50619B712941m4684o1943p2387p5507p2363o4630n3938m1714k9332j7986q144
$$ plain form
50608 2170313 2170736 2178574 2192199 2209249 2226724 2241011 2248251 2245443 2231323 2205928 2169511 2122455
50596 2122455 2066024 2002465 1934174 1863143 1791294 1720803 1653759 1591547 1534483 1481889 1432843
50585 1432843 1387356 1346720 1312260 1283904 1260407 1240675 1224124 1209902 1196777 1184062 1172026
50574 1172026 1161071 1151216 1142693 1136320 1132771 1131895 1133187 1136491 1141743 1148420 1155811 1163668 1172122 1181188
50560 1181188 1190889 1201788 1214923 1231223 1251331 1275862 1305222 1338983 1375964 1415312 1457128
50549 1457128 1501570 1547494 1592597 1635071 1674619 1711698 1746460 1779148 1811169 1844678 1880930
50538 1880930 1919858 1961636 2007795 2060066 2118658 2182562 2251266 2325347 2405516 2492027 2585283
50527 2585283 2686318 2796294 2915759 3044444 3181281 3324496 3472128 3622603 3774458
$$ packed form
50608B170313M23P838J3625J7050J7475J4287P240k808j4120k5395l6417m7056
50596B122455n6431o3559o8291p1031p1849p0491o7044o2212n7064n2594m9046
50585A432843m5487m0636l4460k8356k3497j9732j6551j4222j3125j2715j2036
50574A172026j0955r855q523o373l549q76J292L304N252O677P391P857Q454R066
50560A181188R701J0899J3135J6300K0108K4531K9360L3761L6981L9348M1816
50549A457128M4442M5924M5103M2474L9548L7079L4762L2688L2021L3509L6252
50538A880930L8928M1778M6159N2271N8592O3904O8704P4081Q0169Q6511R3256
50527B585283J01035J09976J19465J28685J36837J43215J47632J50475J51855
$$ plain form
50518 3774458 3925354 4071694 4209206 4333498 4440157 4525124 4585499 4619817 4627445 4608083
50508 4608083 4561924 4489861 4393428 4275152 4139190 3991113 3836706 3681363 3530664 3390532
50498 3390532 3266003 3160203 3075113 3012818 2975033 2961590 2970298 2998427 3043531 3102418 3169862
50487 3169862 3238719 3301030 3348866 3374954 3373805 3343123 3284261 3201143 3098495 2980749 2852135
50476 2852135 2717182 2580554 2446065 2315882 2190839 2071521 1958945 1854255 1758054 1670270
50466 1670270 1590595 1518776 1454467 1397041 1345739 1299864 1258660 1221279 1187303 1157267 1132164
50455 1132164 1112210 1096438 1083778 1074218 1068461 1066613 1067640 1070089 1073076 1076607 1081206 1087180 1094080
50442 1094080 1100973 1107412 1113843 1120710 1127471 1133079 1137328 1141065 1144995 1148981 1152784 1156944 1162451 1169896
$$ packed form
50518C774458J50896J46340J37512J24292J06659Q4967O0375L4318P628j9362
50508D608083m6159p2063r6433j18276j35962j48077j54407j55343j50699j40132
50498C390532j24529j05800q5090o2295l7785j3443Q708K8129M5104N8887O7444
50487C169862O8857O2311M7836K6088j149l0682n8862q3118j02648j17746j28614
50476B852135j34953j36628j34489j30183j25043j19318j12576j04690r6201q7784
50466A670270p9675p1819o4309n7426n1302m5875m1204l7381l3976l0036k5103
50455A132164j9954j5772j2660r560n757j848J027K449K987L531M599N974O900
50442A094080O893O439O431O867O761N608M249L737L930L986L803M160N507P445
$$ plain form
50428 1169896 1179363 1190929 1204763 1220782 1238599 1257944 1279011 1302290 1328083 1356296 1386785
50417 1386785 1419947 1456739 1497887 1543242 1592217 1644777 1701637 1763451 1830174 1901292 1976187
50406 1976187 2054006 2133411 2212771 2290571 2365652 2437280 2505017 2568263 2625714 2675397 2715162
50395 2715162 2742857 2756052 2752249 2729903 2689186 2631714 2559820 2476403 2385117 2290025 2194812
50384 2194812 2102414 2015383 1936296 1867610 1811107 1767502 1736644 1718062 1711278 1715586 1729678 1751602
50372 1751602 1778940 1808809 1837790 1862170 1878405 1883534 1875652 1854492 1821452 1778594 1727625 1670157
50360 1670157 1608650 1546147 1484752 1424913 1366578 1310507 1257878 1208951 1162706 1117853 1073870
50349 1073870 1031181 990753 953636 920614 892015 867694 847071 829349 813973 801010 790777
$$ packed form
50428A169896R467J1566J3834J6019J7817J9345K1067K3279K5793K8213L0489
50417A386785L3162L6792M1148M5355M8975N2560N6860O1814O6723P1118P4895
50406A976187P7819P9405P9360P7800P5081P1628O7737O3246N7451M9683L9765
50395B715162K7695J3195l803k2346m0717n7472p1894q3417r1286r5092r5213
50384B194812r2398q7031p9087o8686n6503m3605l0858j8582o784M308J4092K1924
50372A751602K7338K9869K8981K4380J6235N129p882k1160l3040m2858n0969n7468
50360A670157o1507o2503o1395n9839n8335n6071n2629m8927m6245m4853m3983
50349A073870m2689m0428l7117l3022k8599k4321k0623j7722j5376j2963j0233
$$ plain form
50338 790777 783067 777075 772205 768622 766746 766568 767776 770343 774597 780812 789054 799379 811901 826495
50324 826495 842315 857467 869318 875651 875886 871102 862907 852759 842291 833366 826944 822270 817964
50311 817964 813841 811021 810368 811586 813928 817022 820702 824668 828795 833292 838053 842233 845068 846963
50297 846963 849142 852228 855732 859023 862210 865752 869602 873211 876162 878341 879646 880033 879912 880081 881173
50282 881173 883576 887986 895364 905673 916879 925802 930100 929361 924634 917555 909903 903265 898551 895902
50268 895902 895179 896343 899240 903279 907560 911261 913830 915010 914899 913930 912634 911389 910332 909376 908339
50253 908339 907158 905959 904797 903411 901573 899694 898730 899317 901234 903910 907289 912062 919245 929734
50239 929734 944092 962422 984384 1009450 1037201 1067343 1099394 1132388 1164867 1195202 1222021
$$ packed form
50338G90777p710n992m870l583j876j78J208K567M254O215Q242J0325J2522J4594
50324H26495J5820J5152J1851O333K35m784q195j0148j0468q925o422m674m306
50311H17964m123k820o53J218K342L094L680L966M127M497M761M180K835J895
50297H46963K179L086L504L291L187L542L850L609K951K179J305L87j21J69J092
50282H81173K403M410P378J0309J1206Q923M298p39m727p079p652o638m714k649
50268H95902p23J164K897M039M281L701K569J180j11r69j296j245j057r56j037
50253I08339j181j199j162j386j838j879r64N87J917K676L379M773P183J0489
50239I29734J4358J8330K1962K5066K7751L0142L2051L2994L2479L0335K6819
$$ plain form
50228 1222021 1244586 1263024 1278330 1291914 1304737 1316760 1327379 1336225 1343002 1346464 1344251 1334302
50216 1334302 1316099 1290278 1257635 1219314 1177627 1135653 1095843 1059413 1026923 998700 974824
50205 974824 955485 941355 932593 927153 920956 910408 894438 874073 850965 826802 803251 781465
50193 781465 761742 744088 728720 715570 703844 692819 682757 674343 667410 660911 654111 647194
50181 647194 640742 635199 630887 627934 625914 623929 621326 618202 615141 612675 611123 610695 611494 613300 615455
50166 615455 617164 618098 618689 619710 621611 624444 628193 632772 637735 642557 647378 653052 660198 668649 677933
50151 677933 687882 698439 709338 720346 731404 742085 751286 757963 761969 763769 763621 761548 757950
50138 757950 753743 749908 747206 746193 747177 750185 755210 762409 771830 783217 796349 811382 828579
$$ packed form
50228A222021K2565J8438J5306J3584J2823J2023J0619Q846O777L462k213r949
50216A334302j8203k5821l2643l8321m1687m1974l9810l6430l2490k8223k3876
50205I74824j9339j4130q762n440o197j0548j5970k0365k3108k4163k3551k1786
50193G81465j9723j7654j5368j3150j1726j1025j0062q414o933o499o800o917
50181F47194o452n543m312k953k020j985k603l124l061k466j552m28P99J806K155
50166F15455J709R34N91J021J901K833L749M579M963M822M821N674P146Q451R284
50151F77933R949J0557J0899J1008J1058J0681R201O677M006J800j48k073l598
50138G57950m207l835k702j013R84L008N025P199R421J1387J3132J5033J7197
$$ plain form
50125 828579 847957 869550 893834 921604 953582 990369 1032437 1079766 1131640 1187033 1244845
50114 1244845 1303471 1360679 1414660 1465099 1512859 1558865 1603787 1648321 1692883 1736776 1778043
50103 1778043 1814043 1841763 1857962 1859974 1846772 1819065 1778494 1727207 1667948 1603620 1536485
50092 1536485 1468224 1400809 1336583 1277159 1222826 1173408 1129303 1091273 1059471 1033138 1011102
50081 1011102 992250 975621 960364 945855 931883 918646 906452 895376 885346 876506 869116 862958
50069 862958 857261 851628 846687 843223 840874 838307 834665 830238 825673 821125 816395 811344 805834 799637
50055 799637 792720 785414 778137 771163 764859 759800 756332 754115 752386 750675 749172 748415 748779 750303 752975
50040 752975 756956 762305 768565 774993 781303 787850 794907 802257 809859 818392 828473 839486 849888
$$ packed form
50125H28579J9378K1593K4284K7770L1978L6787M2068M7329N1874N5393N7812
50114A244845N8626N7208N3981N0439M7760M6006M4922M4534M4562M3893M1267
50103A778043L6000K7720J6199K012j3202k7707m0571n1287n9259o4328o7135
50092A536485o8261o7415o4226n9424n4333m9418m4105l8030l1802k6333k2036
50081A011102j8852j6629j5257j4509j3972j3237j2194j1076j0030q840p390o158
50069H62958n697n633m941l464k349k567l642m427m565m548m730n051n510o197
50055G99637o917p306p277o974o304n059l468k217j729j711j503p57L64J524K672
50040G52975L981N349O260O428O310O547P057P350P602Q533J0081J1013J0402
$$ plain form
50027 849888 858683 866111 872874 879226 884925 889516 892519 893759 893660 892880 891524 889103 885340 880603 875336
50012 875336 869542 863095 856365 850237 845724 843578 843983 846403 850097 855109 862692 874565 891812 914575
49998 914575 942582 975686 1013783 1056180 1101079 1145759 1187502 1224520 1256246 1283137 1306415
49987 1306415 1327615 1347831 1367131 1384609 1398618 1406727 1405908 1393576 1368777 1332340 1286228 1233060
49975 1233060 1175893 1117637 1060431 1005812 955225 909723 869236 832899 800335 772107 748668
49964 748668 729353 712691 697381 682843 669327 657764 649135 643617 640507 639051 639035 640508 643424
49951 643424 647862 654191 662642 672861 684145 695893 707629 718734 728436 736011 741042 743687 744748
49938 744748 745147 745153 744221 741596 736752 729245 718615 704821 688660 671528 654730 638936 624111 609991
$$ packed form
50027H49888Q795P428O763O352N699M591L003J240r9p80j356k421l763m737n267
50012H75336n794o447o730o128m513k146M05K420L694N012P583J1873J7247K2763
49998I14575K8007L3104L8097M2397M4899M4680M1743L7018L1726K6891K3278
49987A306415K1200K0216J9300J7478J4009Q109q19j2332k4799l6437m6112n3168
49975A233060n7167n8256n7206n4619n0587m5502m0487l6337l2564k8228k3439
49964G48668j9315j6662j5310j4538j3516j1563q629n518l110j456j6J473K916
49951F43424M438O329Q451J0219J1284J1748J1736J1105R702P575N031K645J061
49938G44748L99Or32k625m844p507j0630j3794j6161j7132j6798j5794j4825j4120
$$ plain form
49924 609991 596781 585303 576284 569666 564891 561641 559827 559091 558947 559338 560428 561807 562633 562645 562441
49909 562441 562642 563499 565441 569158 574715 581337 588517 596645 606096 616511 627667 640304 655082 671078
49895 671078 686247 699183 709666 717733 723170 725964 726417 724647 720593 714613 707446 699446 690469 680614
49881 680614 670355 659611 647431 633214 617838 602916 589172 576212 563825 552764 543921 537268
49869 537268 532080 527960 525111 523605 522979 522779 523113 524291 526246 528789 532226 537117 543463 550728 558841
49854 558841 568530 580250 593248 606236 618747 631265 644010 656047 665802 672345 676150 678687
49842 678687 681207 683782 685475 685310 682854 677913 670256 660076 648434 636669 625404 614481 603902
49829 603902 594350 586590 580701 576198 572785 570719 570435 571998 574946 578588 582426 586428 591042 597006
$$ packed form
49924F09991j3210j1478r019o618m775l250j814p36j44L91J090J379Q26J2k04
49909E62441K01Q57J942L717N557O622P180Q128R451J0415J1156J2637J4778J5996
49895F71078J5169J2936J0483Q067N437K794M53j770m054n980p167q000q977r855
49881F80614j0259j0744j2180j4217j5376j4922j3744j2960j2387j1061q843o653
49869E37268n188m120k849j506o26k00L34J178J955K543L437M891O346P265Q113
49854E58841R689J1720J2998J2988J2511J2518J2745J2037R755O543L805K537
49842F78687K520K575J693j65k456m941p657j0180j1642j1765j1265j0923j0579
49829F03902r552p760n889m503l413k066k84J563K948L642L838M002M614N964
$$ plain form
49815 597006 604978 615200 627366 640820 654800 668539 681214 691955 700107 705636 709357 712501
49803 712501 715712 718352 718994 716652 711355 703629 693948 682920 671491 660400 649616 638770 627985
$$ packed form
49815E97006P972J0222J2166J3454J3980J3739J2675J0741Q152N529L721L144
49803G12501L211K640O42k342n297p726r681j1028j1429j1091j0784j0846j0785
$$ [...]
##END NTUPLES=NMR SPECTRUM
##END=
