
##TITLE=UV1261_M11_1332-1242_70_7409935_ojFLwwO5N4
##JCAMPDX= 6.0         $$ Bruker NMR JCAMP-DX V2.0
##DATA TYPE= NMR SPECTRUM
##DATA CLASS= NTUPLES
##ORIGIN= BRUKER
##OWNER= Administrator
$$ 1.72 TOPSPIN		Version 2.1
$$ 2013-01-24 23:30:45.911 -0500  Administrator@X
$$ Compression mode = diff/dup
##.OBSERVE FREQUENCY= 400.02188249412
##.OBSERVE NUCLEUS= ^1H
##.ACQUISITION MODE= SIMULTANEOUS (DQD)
##.ACQUISITION SCHEME= undefined
##.AVERAGES= 8
##.DIGITISER RES= 22
##SPECTROMETER/DATA SYSTEM= spect
##.PULSE SEQUENCE= zg30
##.SOLVENT NAME= COFFEE_meoh
##.SHIFT REFERENCE= INTERNAL, COFFEE_meoh, 1, 14.98509
##AUDIT TRAIL= $$ (NUMBER, WHEN, WHO, WHERE, PROCESS, VERSION, WHAT)
$$ ##TITLE= Audit trail, TOPSPIN		Version 2.1
$$ ##JCAMPDX= 5.01
$$ ##ORIGIN= Bruker BioSpin GmbH
$$ ##OWNER= Administrator
$$ $$ E:\/data/COFFEE/nmr/UV1261_M11_1332-1242_70_7409935_ojFLwwO5N4/10/pdata/1/auditp.txt
$$ ##AUDIT TRAIL=  $$ (NUMBER, WHEN, WHO, WHERE, PROCESS, VERSION, WHAT)
(   1,<2013-01-24 23:30:37.755 -0500>,<Administrator>,<X>,<go>,<TOPSPIN 2.1>,
      <created by zg
	started at 2013-01-24 23:29:31.349 -0500,
	POWCHK enabled, PULCHK disabled,
       configuration hash MD5:
       86 BA 57 50 F2 9D 5C 9B 26 00 A9 28 5F 66 2E 89
       data hash MD5: 64K
       89 55 C5 71 88 CF 7F 13 65 9E 4A CD 34 F3 44 8E>)
(   2,<2013-01-24 23:30:40.818 -0500>,<Administrator>,<X>,<proc1d>,<TOPSPIN 2.1>,
      <Start of raw data processing
       efp LB = 0 FT_mod = 6 PKNL = 1 PHC0 = 0 PHC1 = 0 SI = 32K 
       data hash MD5: 32K
       A6 2B 8D 8F B0 12 DF 38 A0 2C 04 0E FB 65 34 BB>)
(   3,<2013-01-24 23:30:41.271 -0500>,<Administrator>,<X>,<proc1d>,<TOPSPIN 2.1>,
      <pk PHC0 = 98.3606 PHC1 = 0 
       data hash MD5: 32K
       C9 65 FF A9 6C B3 5B A7 C4 2E F9 6F 0A 65 72 DF>)
(   4,<2013-01-24 23:30:41.505 -0500>,<Administrator>,<X>,<proc1d>,<TOPSPIN 2.1>,
      <abs ABSG = 1 
       data hash MD5: 32K
       F8 CC 15 DB 8F 2A 8A A8 CA 9F 95 A4 A5 EA A7 CD>)
(   5,<2013-01-24 23:30:41.646 -0500>,<Administrator>,<X>,<proc1d>,<TOPSPIN 2.1>,
      <abs ABSG = 2 
       data hash MD5: 32K
       9F 3C 80 39 19 28 03 8B 84 47 07 70 22 F6 D1 F1>)
(   6,<2013-01-24 23:30:41.802 -0500>,<Administrator>,<X>,<proc1d>,<TOPSPIN 2.1>,
      <abs ABSG = 3 
       data hash MD5: 32K
       A3 AF 2E 26 65 90 83 DA 5B B5 8B 87 D7 9A E9 89>)
(   7,<2013-01-24 23:30:41.927 -0500>,<Administrator>,<X>,<proc1d>,<TOPSPIN 2.1>,
      <abs ABSG = 4 
       data hash MD5: 32K
       3B 9A 0B 73 45 33 54 F9 AA 7D D3 AE 3D E6 0E 50>)
(   8,<2013-01-24 23:30:42.083 -0500>,<Administrator>,<X>,<proc1d>,<TOPSPIN 2.1>,
      <abs ABSG = 5 
       data hash MD5: 32K
       A8 64 75 A5 DF 1C 07 B5 E9 CF 80 8E E6 57 3C E1>)
$$ ##END=
$$ 
$$ $$ hash MD5
$$ $$ A6 29 98 F2 25 73 9E D7 B8 31 89 1E 74 29 6D 7F
##$RELAX= 
##$RELAX= 
##$RELAX= 
##$RELAX= 
##$RELAX= 
##$RELAX= 
##$RELAX= 
$$ Bruker specific parameters
$$ --------------------------
##$DU= <E:\>
##$EXPNO= 10
$$ [...]
##$TP= (0..7)
150 150 150 150 150 150 150 150
##$TP07= 0
##$TPNAME0= <>
##$TPNAME1= <>
##$TPNAME2= <>
##$TPNAME3= <>
##$TPNAME4= <>
##$TPNAME5= <>
##$TPNAME6= <>
##$TPNAME7= <>
##$TPOAL= (0..7)
0.5 0.5 0.5 0.5 0.5 0.5 0.5 0.5
##$TPOFFS= (0..7)
0 0 0 0 0 0 0 0
##$TUNHIN= 0
##$TUNHOUT= 0
##$TUNXOUT= 0
##$USERA1= <user>
##$USERA2= <user>
##$USERA3= <user>
##$USERA4= <user>
##$USERA5= <user>
##$V9= 5
##$VALIST= <valist>
##$VCLIST= <CCCCCCCCCCCCCCC>
##$VD= 0
##$VDLIST= <DDDDDDDDDDDDDDD>
##$VPLIST= <PPPPPPPPPPPPPPP>
##$VTLIST= <TTTTTTTTTTTTTTT>
##$WBST= 1024
##$WBSW= 4
##$XGAIN= (0..3)
0 0 0 0
##$XL= 0
##$YL= 0
##$YMAX_a= 682583
##$YMIN_a= -581009
##$ZGOPTNS= <>
##$ZL1= 120
##$ZL2= 120
##$ZL3= 120
##$ZL4= 120
##$ABSF1= 14.98509
##$ABSF2= -5.573092
##$ABSG= 5
##$ABSL= 3
##$ALPHA= 0
##$AQORDER= 0
##$ASSFAC= 0
##$ASSFACI= 0
##$ASSFACX= 0
##$ASSWID= 0
##$AUNMP= <proc_prof1d_extract_pilot.lims>
##$AXLEFT= 0
##$AXNAME= <>
##$AXNUC= <1H>
##$AXRIGHT= 0
##$AXTYPE= 0
##$AXUNIT= <>
##$AZFE= 0.1
##$AZFW= 0.1
##$BCFW= 0
##$BC_mod= 0
##$BYTORDP= 0
##$COROFFS= 0
##$CY= 15
##$DATMOD= 1
##$DC= 0
##$DFILT= <>
##$DTYPP= 0
##$F1P= 0
##$F2P= 0
##$FCOR= 0.5
##$FTSIZE= 32768
##$FT_mod= 6
##$GAMMA= 0
##$GB= 0
##$INTBC= 1
##$INTSCL= 1
##$ISEN= 128
##$LB= 0
##$LEV0= 0
##$LPBIN= 0
##$MAXI= 10000
##$MC2= 0
##$MEAN= 0
##$ME_mod= 0
##$MI= 0
##$NCOEF= 0
##$NC_proc= -8
##$NLEV= 6
##$NOISF1= 0
##$NOISF2= 0
##$NSP= 0
##$NTH_PI= 0
##$NZP= 0
##$OFFSET= 14.98509
##$PC= 1
##$PHC0= 98.3606
##$PHC1= 0
##$PH_mod= 1
##$PKNL= yes
##$PPARMOD= 0
##$PPDIAG= 0
##$PPIPTYP= 0
##$PPMPNUM= 2147483647
##$PPRESOL= 1
##$PSCAL= 4
##$PSIGN= 0
##$PYNMP= <proc.py>
##$REVERSE= no
##$SF= 400.02
##$SI= 32768
##$SIGF1= 0
##$SIGF2= 0
##$SINO= 400
##$SIOLD= 32768
##$SPECTYP= <>
##$SREGLST= <1H.CDCl3>
##$SSB= 0
##$STSI= 32768
##$STSR= 0
##$SW_p= 8223.68421052631
##$SYMM= 0
##$S_DEV= 0
##$TDeff= 65536
##$TDoff= 0
##$TI= <>
##$TILT= no
##$TM1= 0
##$TM2= 0
##$TOPLEV= 0
##$USERP1= <user>
##$USERP2= <user>
##$USERP3= <user>
##$USERP4= <user>
##$USERP5= <user>
##$WDW= 1
##$XDIM= 32768
##$YMAX_p= 473667315
##$YMIN_p= -663602
##$CURPLOT= <Network HP LaserJet P1505>
##$CURPRIN= <$Network HP LaserJet P1505>
##$DFORMAT= <normdp>
##$LAYOUT= <+/1D_H.xwp>
##$LFORMAT= <normlp>
##$PFORMAT= <normpl>
##$SURQMSG= 1
$$ End of Bruker specific parameters
$$ ---------------------------------
##NTUPLES= NMR SPECTRUM
##VAR_NAME=  FREQUENCY,     SPECTRUM/REAL,   SPECTRUM/IMAG
##SYMBOL=    X,             R,               I
##VAR_TYPE=  INDEPENDENT,   DEPENDENT,       DEPENDENT
##VAR_FORM=  AFFN,          ASDF,            ASDF
##VAR_DIM=   32768,         32768,           32768
##UNITS=     HZ,            ARBITRARY UNITS, ARBITRARY UNITS
##FACTOR=    0.250966925370066, 1,           1
##FIRST=     8223.43324360094, -98953,       -10123
##LAST=      0,             27020,           -214466
##MIN=       0,             -663602,         0
##MAX=       8223.43324360094, 473667315,    0
$$ Real data points
##PAGE= N=1
##DATA TABLE= (X++(R..R)), XYDATA
$$ [...]
23825 -39168 528955 -148135 -189626 187058 -142469 -87554 -70405 -49954 -71518 -11556 -39270
23814 -39270 -228586 -138904 189960 -62841 -431146 -109675 344572 -46057 232033 98728
23803 186449 209795 79647 99377 -164402 -97877 -514763 87878 -157064 72119 -76728 -82911
23792 -82911 31109 516278 267770 -197507 -1890 -29665 -167076 191270 286286 319228 -304413
23780 -117801 198723 -18642 136777 -32288 -39447 -64942 -299936 -126019 274757 112069
23769 -41121 71897 228858 124135 -172549 -186430 347570 84273 -12599 201688 139702 -93174
23757 -268808 89385 -136839 -51551 126368 60597 -446496 -114286 2101 141785 212648 -39587
23745 13214 255893 277171 22008 143182 -42125 -280620 162823 108407 280641 -191547
23734 -346864 202537 -399213 -103291 -155328 106634 84617 -339975 212201 -179743 309729
23723 -131221 52199 -175898 95818 16568 116680 -396965 -178070 130550 -119461 167762
23712 -164658 166833 -260947 -33163 244031 15745 156842 -501428 -61783 111464 130028
23702 130028 219038 -22629 78029 -35291 -221710 221307 -154894 124556 171936 -102563
23691 -9351 -195225 109017 -529884 92078 -13401 -64465 -52903 42526 -105211 -310542 -22093
23679 -22449 -158105 182423 49486 88494 111905 -8953 -132164 217107 123684 -168139 -141920
23668 -141920 4355 31009 -191950 74000 210511 -36513 -189629 -141560 -277049 14359 -230206
23656 -11167 -123776 119232 -46694 -205142 16220 61651 -324499 111527 -120911 97542
23645 -94596 195932 130108 56076 -52365 -162630 19164 -280333 170907 -196569 64652 -407141
23633 -27771 436550 57026 -181983 -54801 187546 92171 -57226 -37757 95390 355459 -10718
23621 151974 282257 -166353 -86852 86385 -265752 -25537 -208519 17400 121806 183634
23611 183634 155735 60157 275795 -92401 -114821 -10970 -98610 -322491 36281 -260219 47993
23599 53908 171001 -189794 321915 9502 -16043 -112179 -157689 69932 274579 -325837 17822
23587 -360436 40073 178096 129326 -55391 -130975 -51863 -59367 -108278 -86170 91850 -114871
23575 -75570 -210790 341455 -151680 118152 31904 201337 -140128 168256 137507 -353910
23564 97115 200570 54052 -77007 -49371 54464 -189499 4389 13130 224494 75632 -20435
23552 -65601 -4530 -248324 113180 312907 -98095 53591 -99530 74755 -126123 156400 218776
23541 218776 381212 -154152 -270198 -187523 -224323 31747 85811 -397292 -177393 -185007 442791
23529 -184552 -403747 -109401 98079 265947 395191 -109351 180205 126408 -183857 -205364
23519 -205364 37034 -71096 -188915 226554 145225 -36115 207174 318760 98047 54101 -125292
23507 -237448 -70917 23208 -105442 106533 -2654 269524 -63000 -7290 204924 -2177 -182684
23496 -182684 -262930 83409 -588 72920 -144030 -106261 333075 -159154 209340 -101765 -197734
23485 -197734 -133785 260713 -312757 9133 -19931 46775 217197 -14584 45030 111401 285558
23474 285558 -223854 -106538 -190404 -92822 -64268 -202879 129073 -75729 52791 51420 74155
23463 74155 -218857 -156324 236420 19099 50515 415435 189412 -36742 84968 -198462 164368
23451 53144 -29104 -148245 11077 -235879 -87400 -83171 -33039 -258725 14980 212202 22121
23439 -7103 -217046 14469 36598 -198597 -156451 -51094 324391 -266652 53725 58253 -73819
23427 -337615 -7839 116123 -32843 185075 -33577 -308701 50377 52587 110251 405157 96661
23415 164469 42929 -23116 -204517 68333 48487 173325 -86767 -370760 -28615 200838 -47384
23403 135158 -133964 -58996 -67234 39761 23938 -24962 -228074 -401259 59670 163512 184372
23392 184372 57262 230058 83003 -93873 -307379 -74180 -35990 -49094 -213258 32660 -183759
23380 76505 552487 -203178 7012 -59524 56756 -40256 -2969 184462 -226917 -33506 -353035
23369 -353035 393489 60827 138036 -19583 83402 -52365 -50482 -87284 84212 47785 -178602
23357 -160080 108264 -65331 -112216 82374 155992 189975 -152495 185434 -144358 79795 -84817
23345 -98593 144682 -85156 -179472 246559 159423 -182615 -242858 -442161 26816 204703 -258151
23333 48026 52822 150042 91804 32407 98809 122770 -84330 160415 -212130 -219614 101780
23321 47845 154232 -180063 135506 -87803 86352 -14002 -34388 275541 -96251 169339 4291
23309 161456 -98041 -202594 121798 -37068 84766 -154435 -288785 135232 127049 -302861
23298 -390883 -156119 111404 -97032 224460 398867 -4193 211490 60428 239528 233206 -94993
23286 111378 -110779 187656 89448 -163180 -226577 127662 -113679 -171753 152068 -246250
23275 252241 18972 -3553 -51866 -66053 88133 141123 63627 72009 199764 3438 236401 -396797
23262 144523 165467 -61641 49359 6634 -285199 73939 382231 -10762 -59191 -175617 67235
23250 -24310 -94673 80445 -77028 -5351 -244243 -20838 247864 -229328 267216 144334 -263991
23238 -130018 -129967 55895 12405 -459279 146553 -372379 240339 -107087 -124125 -50263 -96248
23227 -96248 159445 69934 100574 79246 -22967 8573 51007 -166857 -172426 83086 -80791 2584
23214 96928 148107 -301683 -218712 333932 27866 -71251 234590 53123 -251291 71863 -109882
23202 -69570 -70768 29890 218853 -118960 -113431 32276 172870 -41052 95476 200144 39947
23190 -253162 -286960 86454 -50530 57034 84107 -101749 -134015 -23947 77508 179543 -198200
23178 205734 140061 93791 72524 -201946 191211 -206971 252949 -13951 -204389 324887
23167 -178451 -376845 -4680 -184640 18540 -162404 -519122 -170476 -46273 -15647 -175887
23157 -175887 -191218 168181 -207480 149001 -71726 -67170 131643 66252 -28128 -268632 -96508
23145 -334070 245581 -263529 19025 -253612 -100457 -70484 14855 118075 172233 -337009
23134 -206574 17533 32271 104174 368905 -14959 -203383 -70797 78635 -432 47695 -296756
23122 29919 150819 116137 -213654 -306342 -134406 -183688 -16145 186464 24954 129876 585522
23111 585522 9736 78175 29930 -105651 -24749 -29084 -225212 677 34281 158134 249051 25096
23098 411952 182184 105660 310639 249073 -128129 -50866 113526 -227628 32933 162953
23088 162953 108461 49878 -195246 -9999 -147795 -174927 -181105 69357 -63422 -212009 70381
23076 -156319 -147677 54199 -63584 -122503 224407 62357 63404 31855 -278902 60034 183942
23065 183942 4156 92940 -30431 -45805 37444 -302618 -216216 -155222 65641 -43223 -174436
23054 -174436 -86145 166192 -24902 -270202 159109 136915 294050 -89748 -33022 -94778 19026
23042 -27433 123404 275663 -117556 184960 328244 -152446 -196151 334207 -385072 -373943
23032 -373943 -57736 323601 49724 -63350 -278406 -183697 31019 10601 -293761 -90334 61869
23020 6528 -22840 -220711 179666 -96508 -185782 -170389 17286 58132 9070 34289 169663
23009 169663 -317448 54713 -68372 361346 -8485 -180780 250862 -270464 -219469 -93770 56738
22997 140294 -450640 39242 -214367 -3113 84240 -167166 116478 -107367 -83086 -309545
22987 -309545 -240795 -396969 -1652 -14463 97592 41707 128207 1909 -54040 99729 -131009
22975 -96594 266434 13043 176190 -262984 202553 -146795 43469 53489 -25203 1484 20374
22964 20374 180382 171742 -254946 -147611 -307056 -225320 63513 -224116 -184445 -79369 -197400
22953 -197400 -24476 -136635 232987 129107 148562 53643 65577 -136660 -175268 269821
22942 121042 62685 339257 -19972 169785 -63882 68772 339897 -46079 -212116 -52154 82534
22930 248861 -21006 109794 -64311 33518 -63123 -170744 231739 419655 -17236 -70078 -131345
22919 -131345 -539 -414763 -474196 84183 66964 -78596 33157 -328700 -132233 -108712 4976
22907 19492 257398 -112118 2406 -44886 -108313 -269075 -16980 13469 137662 -138960 160379
22895 -274088 89833 76132 144503 35208 -26882 -170285 48912 -135497 63750 235608 117533
22883 -241057 67077 -219750 -82101 -128546 -105394 232938 186534 -47844 -26107 -60031 -317096
22872 -317096 -290 -84060 212979 -166812 -66369 225949 116459 105228 41780 -133072 157459
22860 -132699 -130880 166125 -202938 -1828 -360083 152849 72291 27854 -327047 115404 -106261
22848 1724 -240447 -132835 -90106 -24616 51071 -18932 -181365 112401 254678 -229841 -108921
22836 153269 177529 -60031 -225526 226306 112772 167488 60966 -75356 18675 110237 65647
22825 65647 -322524 -79983 -209424 -222885 -257915 107560 -215514 84660 268059 46311 -178751
22813 99703 -127919 -39489 -119641 196561 -33459 58473 -85918 -413814 -250030 -105386 -188015
22802 -188015 116164 -93092 5271 -107063 75113 82450 -233279 14736 -380815 -63641 -149907
22791 -149907 -154687 140435 36422 160067 -240681 69300 295133 43261 -22475 -119660 47180
22779 -185961 -13766 132563 -218414 192109 -344731 -184074 -83733 -110080 -132474 13808
22768 64370 220136 346683 -299608 -388878 18888 110869 103536 -8271 16822 -108996 -154042
22757 -154042 -137043 124593 -23269 -218264 -57145 232000 -41577 74365 -10322 -117770 34502
22745 57799 96602 70666 2645 269782 14443 -185855 -58326 -45794 -205570 -62945 15708
22733 -135004 12645 13803 171792 239275 -118267 -270696 116201 -181807 -182298 -83236 -30536
22721 -229631 -269158 -138591 -18669 -160711 -146103 36101 -71113 -134297 6987 -161185 -79648
22709 85282 -173173 68407 -66978 222943 -59855 -21063 37996 -97074 27772 32773 113248
22698 113248 181869 -133443 -107031 -193799 30890 98532 -146212 -381216 57400 -140930 119058
22686 -128962 -28069 285928 28412 -2023 30312 70115 -292751 17968 308411 59900 -257654
22674 82403 269075 -229462 -302225 14152 269641 -433081 -313337 66115 -69594 118112
22663 95640 -32430 -153668 -67128 341028 -187104 -46151 35007 -301626 171457 -15560 -197758
22652 -197758 186585 -554966 -204070 72737 143618 -205658 -202641 1630 263601 -221319 218224
22640 103533 15527 105015 -42279 -63115 -138279 327859 43084 93994 147123 -410113 105748
22628 265707 -284466 -194727 251759 41397 -285223 163168 30572 -116382 144556 209596
22618 209596 488089 298329 -87874 -136269 -180825 -119510 -50414 -257407 -54356 17781 188469
22607 188469 374176 60159 46221 70642 -70907 47360 91119 -196170 -102959 -37762 -141955
22596 -141955 11341 10354 505355 -403731 82606 52662 -62453 -111564 -203493 173842 -135948
22584 -165998 -243775 -201684 4628 29950 -56835 92937 53824 -18496 -136754 314762 -201993
22572 -126406 3832 -276758 182578 -285183 -69995 -101716 -91710 144427 46009 153777 83443
22561 83443 -104341 -293022 108061 -192425 -148797 36255 52643 23422 -39307 59944 19970
22549 -198457 -22727 -145150 -7683 290187 -421603 -94964 233706 -93117 -3960 -223059 288557
22537 219746 -35509 -264545 -107790 173746 207783 223463 -71786 -182613 104638 -222236
22526 -218248 -243791 299885 -204547 -203909 87533 -92285 -233931 -142880 -181969 53992 138756
22515 138756 -51560 -96843 177685 196758 -88689 -252697 240291 -202802 304132 -127139
22504 -66865 96622 293034 150167 -179262 -118660 -303787 -30847 125797 -119977 -227181
22494 -227181 -49002 -125207 -117400 -112687 185224 -202860 -50144 80734 30302 23743 10158 146379
22482 146379 14210 144052 -158436 -89437 -113796 24927 -200230 121961 -101903 -57370
22472 -57370 -118249 179077 -93749 57441 113429 -110917 -142727 -236874 -213783 259284 188856
22461 188856 -52437 269580 101092 -208101 158546 61397 -295347 -674 -37790 -273590 127596
22449 -95191 -139303 441962 -48991 -313604 2252 61723 174637 125820 9605 252358 199427
22438 199427 148709 2274 -142868 -86118 184494 -489240 -81659 10814 62019 269931 -362966
22426 -136300 -97223 129079 -348082 155265 78939 59338 38433 139929 -100900 37199
22415 28353 33187 -75514 -55693 123625 135705 -226361 -12350 -56102 -143202 -72934 -333862
22404 -333862 149210 20829 -198070 -170229 -129650 -131935 235267 -109459 -357016 250327
22393 -142103 -160453 -60918 73779 -246898 -18016 108880 45787 -293727 -110518 292500
22382 -221365 179390 -2477 48761 -156051 76865 270572 -150840 -294694 19283 3236 219250
22371 219250 134544 -98334 4828 522131 -242519 -149820 327895 -91127 -212292 58179 17640
22359 -114736 140702 -202518 202072 137274 -177722 -140048 48705 -291640 -290312 -63922 -512028
22348 -512028 74246 27669 -52438 -124219 -172950 113914 -126467 -78915 6929 -429245 -103162
22336 -12586 76901 -218906 -443954 32820 -161830 250545 75557 -54385 181468 -295979
22325 201385 -57721 275772 -174010 67832 39540 33159 39208 354256 211030 311340 225695
22314 225695 -233757 49401 109946 -298819 173906 117305 4482 242374 -264008 -214637 280656
22302 352287 21809 11063 -195431 -212894 -94937 238833 134728 -424487 -239497 -26367
22291 203925 61946 70942 -403391 -276181 -170805 -107189 98913 -36043 187077 259740 -253831
22279 226922 64625 -67060 25150 -190273 89737 31067 -250782 187296 191136 -93528 348245
22267 -153288 149645 -33491 -214059 -476413 75363 -106624 -289836 -248926 -73048 81834
22256 -173426 -204238 -107823 -66192 -115820 175117 -259528 -24739 65349 -26319 -7224 -107086
22245 -107086 -331370 -83995 -10669 109883 63932 52638 207468 291343 -155771 -358961
22235 -358961 172338 -161069 -5184 24035 147858 -20755 25067 -166959 -71827 380312 -94267
22223 26605 -192686 -27149 108384 57677 -159364 -240835 -195439 -37361 -9206 -283508 67895
22211 -9201 -202594 -24761 -118993 81880 117186 43516 110809 -56903 164473 -117066 -197483
22200 -197483 -296389 -133523 124090 -153784 -10413 84089 -1933 -88206 -52790 204523 106238
22189 106238 -147320 -31298 -202371 140319 -85990 -109847 -331454 -180385 -113602 -20556
22178 -260691 246379 -109665 -127121 -283628 -124344 106401 -22639 -488763 176577 -27774
22167 154844 265189 -52237 -16893 -60454 -28865 -302444 292624 129862 -194110 69455
22156 317301 -297433 71218 -29130 -257227 -61812 61374 52204 105661 -279 831 -169544 -74124
22143 -221687 308300 -47608 -200472 107315 -132885 -287402 242784 -184035 -243854 -140169
22133 -140169 -44752 -216636 38849 -169527 74522 -553711 76090 198899 -85338 -63937 -202297
22122 -202297 -73479 22961 -48246 -158592 91125 -28489 -550248 85329 40016 121519 -45320
22110 351741 -226261 39584 222357 -133005 63823 -187788 -213465 -238496 61909 -99007 42775
22098 32650 -95857 -85274 54232 17418 -125270 -38943 -56617 72987 -132069 134724 730
22086 -173127 84331 38306 87622 323610 -180957 -180840 7058 -212184 -134002 -100031 -154469
22075 -154469 62085 155087 -3117 -190291 97212 -168818 -187804 -97304 497772 -424655 -30497
22063 3071 -24985 -315694 -26866 54892 269434 103539 -171589 -55515 18840 -286590 -282773
22052 -282773 -183450 -207136 267565 122458 -36751 -976 29285 -56565 181839 -142690 51322
22040 38165 -185434 -108856 94797 -117098 -111920 -258183 -94164 11072 189103 94011 -225115
22028 -78537 85262 -474532 252457 213465 -166715 -22494 -123368 101573 58040 129776 243456
22017 243456 -173035 73717 -62571 170026 349410 -386523 120787 175822 -51192 25042
22006 -157589 -55466 105102 -337524 279688 185078 79004 -145096 -73598 -300595 326521
21995 148319 264854 83528 -79803 -223880 -62583 -256954 -119768 130748 -369381 -57077
21984 -13575 -36754 161185 233434 -17987 -270201 -396852 116783 -146994 -86644 -103674 161593
21972 -33550 225267 -133880 -106996 128178 -7719 -234455 -183352 -246668 -15828 87465 174035
21961 174035 399176 -257210 -87361 140573 62176 -66251 43453 -325552 -218919 -111481
21951 -111481 -152596 -42975 36714 27874 -280762 -158361 -202427 293705 -322446 -230833 -142290
21940 -142290 -191743 64287 -97125 194418 -166210 191140 105226 -133957 122927 244013
21930 244013 -141870 -149708 -364113 84633 385638 -135370 100476 -231471 35074 -37286
21919 -133509 280079 106095 37932 -85187 122245 129328 231 -104474 -469508 -180260 42331
21907 -180821 -370944 -75467 -96247 22901 -53808 -157165 19212 60026 -128296 22873 -256045
21895 -198592 104833 3827 1046 -46047 203084 -135390 60250 -209205 -169634 -161335 -8729
21883 -51539 -6263 -115540 -341329 -184228 -159746 -2612 14844 -175422 -118881 -263394 11402
21871 -39390 -154810 40857 -50652 280901 -16764 31139 -55929 -241548 64625 -101861 -214651
21860 -214651 -300210 -39310 -97021 -133134 -458942 211377 -212778 -74992 -156624 -104417 -265344
21849 -265344 -44373 94060 -24929 -88645 -155590 2094 -96805 91468 -232180 -41250 -18016
21837 94030 96223 45595 -261949 -27942 50308 -152472 -70966 209857 216597 -220218 36094
21825 -12363 -66383 -73716 233264 58260 -271948 24799 -103835 -54367 -54083 123137 -263407
21813 165282 -198582 195381 865 -399835 -285173 -106868 182317 -311655 -31352 -231035
21803 -231035 48211 -21631 -281886 -207564 -71793 -47970 -116631 127751 -26053 -5263 -17537
21792 -17537 63129 -192410 68052 -211538 218952 82193 -108438 -129408 58263 -15036 63388
21780 39042 348324 50405 -306205 -17704 -279611 22491 -110633 -44268 -83929 7238 297782
21769 297782 -22419 -79823 132006 -223764 -447128 -186672 -125676 196160 -219389 86918
21758 199235 77297 -121148 58639 -213896 -11117 231872 218065 72288 -32533 -325957 148623
21746 -209081 -170559 285082 322527 -82926 78762 -42743 -261366 114944 -47045 298685 -116338
21734 181207 -140032 155825 112186 -98459 -138499 31236 -11298 -368056 1797 76555 -7201
21722 -150232 5563 62605 -557317 -443300 22390 -48806 -65600 -379789 -191239 -127877 -97500
21711 -97500 -286451 95579 62625 -53289 -79041 61881 -74915 -325708 127734 -118635 23093
21699 -215616 138434 -47174 64162 -224005 -104675 -124524 43210 105195 -205155 -180995 114308
21687 118353 73757 186348 92537 -210589 -53049 87429 -283362 157582 99952 -42619 305813
21675 -160647 184531 -182003 37267 -70425 -14467 -20371 9651 -105215 101506 62005 -93651
21663 -9664 -228671 -156521 -315815 140514 -123989 -226045 187056 -306589 -122007 -73545
21653 -73545 10566 74084 -84861 165929 -286876 -41830 -208166 139451 -151442 34290 3172
21641 138222 -38278 -51595 68098 249181 121951 -213901 -319996 111764 -85934 299136
21630 -187425 73315 -215631 136066 -37803 -212420 158353 -123523 361799 -122677 -536662
21620 -536662 -47310 -70835 -68993 -69043 -204428 -10830 -169309 173192 75859 96748 -71680 -178464
21608 -178464 -364598 -300602 -211895 -154243 62771 -144973 -51683 25119 -125770 155026 -336314
21596 -65246 -64857 48329 -109261 190255 -211011 -133848 269338 -113429 88350 -176394 -60147
21584 -92997 -237093 -180554 13907 -235582 -88549 -23668 171608 -303970 -508 -234856 -22953
21572 -255243 -233150 84295 -68257 157025 -261448 -91149 111869 -220995 -127517 364678
21561 -258046 165562 -121970 -470374 61496 -23874 98179 504413 -156180 -88102 165441
21550 -26471 -161759 -81986 -79734 95096 -14532 49641 52371 -144205 14520 -353238 176037
21538 -197597 119491 325369 7804 76876 -61552 -101270 -198757 -106717 -107865 -70322 -261240
21527 -261240 153485 -190518 140993 55891 -4952 -215409 -230882 70054 209715 206054 280250
21516 280250 -309505 -14387 121572 -176140 -76086 -151224 -171776 -100033 -25154 84010 247103
21505 247103 2865 261668 -313434 -266007 23106 105368 -337648 -158342 117462 -91786 -185418
21494 -185418 -280627 -69325 -134880 -86391 -93130 -81627 -55891 34703 -218651 30487 -187152
21482 -141405 -99188 -12535 104683 -133380 -158592 -201736 -281267 127315 93531 41612 58281
21471 58281 21549 261745 211458 -244587 2605 261754 -95655 9404 183304 191719 136310
21460 136310 -147280 -18650 -2843 -507404 -155740 -236505 -132986 6694 56638 -35508 -237951
21449 -237951 -149831 94565 -27631 -89066 162999 -319961 -121111 58408 231908 4954 100049
21438 100049 -20896 293638 381475 570631 329493 286767 210497 434108 761316 -52703
21427 607 -91239 89012 -69928 177800 67706 16641 -126491 -73563 98587 -271973 57105
21415 -64551 -363761 -206152 71837 -284007 -44527 100342 285681 -55334 -68800 78031 234915
21404 234915 62574 57062 -483764 -57295 164443 -285053 -194808 156249 -149630 -260726
21394 -260726 137069 9936 -342579 -38479 281586 -123583 104482 -65014 -346288 12398
21383 -73949 110463 6964 -26514 212365 13562 273400 78831 -39089 132620 -108408 61991
21371 -107136 152185 -247570 -183968 40618 -45847 -222718 156902 -163608 -247097 320711
21360 -199889 179043 -239697 -252720 -293527 -227134 -89444 -101787 -348755 -170733 86383 181943
21349 181943 -160187 -262447 -41232 -105156 -265591 -154605 -78846 -170053 -117739 14655 -265550
21337 217504 -92047 5979 -131984 19983 164695 -165318 -13436 77084 -362459 241046 -7281
21325 134204 7052 -232465 208475 58787 -73420 44896 -30020 -88818 -302522 37506 -135268
21313 -86470 107939 -268545 -14362 -276219 121971 2959 -35171 9833 -360632 47000 108688
21302 108688 -171493 -264440 -198441 154069 -252414 285071 185592 -454646 -159639 112871
21291 -406126 34431 124014 133146 5575 -51279 -85796 -16328 206614 20045 31382 -87667 -290618
21279 -290618 -47438 57519 -482148 -493120 69848 188184 188222 71652 128389 34664 -230334
21267 -315515 -41085 136721 100336 -180318 174245 -221056 -475651 -52893 69996 -51879
21256 273320 -154815 -20104 -333106 76188 87428 -62646 34993 141268 -76527 -340239 -18853
21244 -198005 -381998 -102380 89929 280649 -529523 -114427 -99088 98686 -204055 -3717
21233 182858 -13872 -27536 -273193 45554 450100 -9470 -332036 -129396 -103330 -135058 -280297
21222 -280297 -108442 -214096 -84547 -3432 136874 -47128 9069 -41234 -260181 178617 250717
21211 250717 -183189 145730 -113591 -412261 -176567 -70758 83168 25490 56211 -273171
21200 58202 328560 73649 -137116 -121101 157241 -223573 -110783 3863 278909 -238117
21189 -210149 -224045 55664 49113 -225730 -44373 134291 303192 -179286 -160001 -141304 -163888
21178 -163888 -219007 -49366 -40413 -371037 -260619 -80703 -219123 -2057 -34924 -213506 287278
21166 -180928 39617 -238928 243103 -194530 144346 370731 158672 -222517 -144645 -16579
21155 -285638 -190497 158958 -278385 83754 -51525 182549 -91813 -62774 -321431 -203123
21145 -203123 14740 119145 4171 -19768 -19970 17081 146263 47185 -106308 -289190 73599
21133 132977 -66737 -279432 -71996 3668 -67278 -208369 -230326 87707 -470615 163620 -43696
21121 -49866 -172031 -53971 -116933 -261606 -450225 242485 -22220 -100239 -212681 248676
21110 200383 146321 -168348 245757 48478 -283461 -135768 -37350 -486225 142387 -3904
21099 -328448 -183804 -220364 83770 -129364 -81720 20032 -133249 -365193 172657 291331
21089 291331 -221363 74693 -259921 -98198 -3525 -70278 -33067 -38788 -275473 251028 23142
21077 -10274 -198287 -103534 -210587 -315464 214719 -208802 71594 -162044 -149543 -61821
21066 146564 -162668 143601 35742 -120827 255101 119430 92633 152390 196968 -176414
21055 -264219 94205 282627 53016 -29569 108717 -65210 -159128 -36211 -132323 -103696 -34647
21043 -61818 -109585 -72140 38419 -63662 53986 -137362 183425 -413428 325389 -241153 208178
21031 -166041 170660 -113309 -889 -235291 145037 128196 -194957 -157942 -126578 -165818 -340728
21020 -340728 -307687 193530 2307 -47006 -288070 65182 -76599 -108137 -36024 261606 22699
21008 108896 241038 222928 263194 72355 330587 206041 225826 -23364 -1136 133227 97
20996 342120 -226217 -117419 223672 387060 -256057 206190 254124 315754 109502 337279
20986 337279 -120744 -3651 123934 -285868 64075 163105 -32461 -311701 -26812 -351400 -8071
20974 -160498 164356 -29006 236742 -98280 -248220 -421892 15103 30294 -33688 -32702 204374
20962 -156749 34543 114403 142490 -187223 -35793 -300270 -174418 -229354 -220052 -362273 -153246
20950 -151343 -239828 -498417 20939 -107896 -303195 -241781 -215110 276597 -156812 -104137
20940 -104137 -292497 -225589 173948 54789 -330351 -108908 86770 -360088 -16868 -407798
20930 -407798 15429 81399 -398788 100531 -40559 -22500 -112093 -233623 340298 200556
20920 200556 -205398 -231075 238277 15117 274785 -2754 -99982 -208420 39715 150348 185815
20909 185815 -37686 479284 -170339 51588 -9854 -257268 418781 -552612 -343225 -19741
20898 -132221 -96863 157536 141863 73854 -128162 -216998 -194610 186489 -180091 85215 -409476
20886 -203484 -131969 -134808 -111304 278025 -149580 226177 -8108 256715 -27578 13065 230919
20875 230919 74759 -34573 144234 -38010 -15579 76082 87866 -293502 173265 214398 -33937
20863 131768 182032 -180818 -167264 -270532 47201 -330746 70119 162987 -11271 -138432 16085
20851 -24705 28837 151631 -115513 156919 -169949 3912 -105527 -321111 35676 -187427
20840 -183778 111008 117433 72277 -132565 -149292 -60868 -108301 -108455 90400 -261670 -7794 72777
20827 215787 -139519 125859 -307539 -96676 315482 -166859 -183721 334907 -287795 -202859
20817 -202859 6586 -72327 -225528 -385601 24040 -71651 52731 -153606 2108 -3328 -115313
20806 -115313 -54392 300074 -317710 85468 -82670 -111683 -178766 118544 102871 85568 16051
20794 -374291 -306581 -334975 -166855 111221 183943 282464 121617 -94856 -158532 -109755 -437846
20783 -437846 -78456 -86652 22363 105675 310654 -81294 -205403 -140750 168667 180758 -54678
20771 367352 -180355 -367615 18500 -178216 -244993 -129432 81482 -50183 -198903 31387
20760 -203733 -30462 79371 173650 -224605 -4204 252281 148499 -30182 -331035 -111492 -268349
20749 -268349 -220656 113560 -40806 4602 118953 18883 -209372 -26182 -87149 38996 57901
20738 57901 178220 -87377 -174645 42586 -185760 -199766 -338696 162756 -401471 -98766 -35908
20726 -67599 -156555 214899 -114410 -166885 -87129 328536 -222224 91393 58538 -147101 -213997
20715 -213997 -37205 -20444 -240250 145542 178882 -86249 -66618 -47399 -361876 234517 -2936
20703 91298 -84602 -401896 -334554 -297068 -140471 -296328 -356918 -232616 -127456 -20435 -580116
20692 -580116 -95953 -149895 163563 -231684 231078 -260822 -155148 151419 260481 45546
20681 -188020 -98869 -30458 -23378 -206932 239399 -220192 -98253 -4279 -145556 -47742 16376
20669 146967 76178 -196227 -201695 -135390 -132031 103347 -112797 138555 337546 173507 -210399
20657 -45516 196323 57584 146594 34526 -224676 4488 -23992 80255 -134332 238589 118301
20645 -120673 281774 42833 -327573 -126826 -141562 -296889 -37224 90689 -186076 399775
20634 167527 -100080 -17391 -374844 -302970 69221 203717 -319287 -42274 -111447 61560 -328586
20622 14917 231023 -40656 41593 -19179 96582 -139049 -341820 140251 -250109 -33173 314126
20610 -28047 -117510 49017 282119 153808 61775 229644 -3919 -134956 -571581 105841 -110086
20598 -174858 12512 -249757 -67129 -259450 -360407 -188567 -517549 -151269 238368 301863
20588 301863 100604 -217673 -202894 -57894 -208796 35573 -96485 13401 -181121 -73623 -607
20576 -121102 -79521 -25746 237970 -15881 34026 -13556 51035 346040 173159 -216211 288160
20564 -214113 -141435 -144372 382476 50323 259327 -76110 -232948 361827 -392091 -171859
20553 -32695 46569 253311 -623338 138877 177048 -223755 -270833 7961 -76942 -67351 -290110
20542 -290110 294356 -274047 140655 155731 -34299 -88608 -334226 -77018 -206013 -100769
20531 -320670 -11492 128335 44382 84145 -98347 -5582 -62219 -78698 422975 -10856 -11551 -47963
20519 -47963 101316 -132869 -92651 46403 -401475 -183601 -279720 -29167 -253938 83873 -62381
20507 81235 -146707 -115910 -105330 -13559 75203 -60332 154033 186518 -135217 -138170 -154388
20496 -154388 226473 -3804 -197534 -67104 -57871 103854 -85974 -159561 -90468 -30133 -120050
20485 -120050 -393272 213904 22318 -73601 -221098 -16315 58777 225540 -1852 31741 220717
20474 220717 -42293 122551 240204 115852 130335 -251159 -207853 7555 74161 -214951 145765
20462 131145 -166515 -28187 15974 -180955 190184 67664 -304150 -36426 76691 161116 56380
20450 225931 -59970 450327 55702 -239272 160258 -82807 74301 226371 65299 43349 3614
20438 112199 181080 -83226 210065 -201054 3736 87546 15207 56342 -75247 -66647 66201
20426 -224963 153972 15540 -53095 -145067 -229459 -100703 -79801 211013 131107 90789 -115046
20414 -98129 -35194 -114827 55779 -169740 115958 -374140 -10618 4647 -68387 96052 59984
20403 59984 86614 -220634 67309 -211515 -494716 165717 186097 -80957 -268917 176135
20392 -353363 -208264 -321033 -64516 -54585 -50735 81 133899 229233 258387 76512 358588 -163898
20379 30363 204379 -233394 166645 -77037 94846 202009 -173233 -240247 -127381 -120800 -160814
20368 -160814 -334325 -124160 -179371 -229747 -65754 -587554 -147664 135171 -219272 -179399
20358 -179399 -70675 237600 20053 23456 -3805 -149535 -42495 122804 -352729 -12081 -134962
20347 -134962 -117586 39989 -45322 -245585 211578 -56074 25207 88326 -139950 330933 41813
20335 -71688 -141217 -164677 105428 42672 210130 82188 -362680 -221981 -437617 -252931
20325 -252931 -250564 208254 -141157 -40878 -49891 -72522 -28115 -67091 -200185 -228423 -401956
20314 -401956 -23412 155945 -36491 11410 -152450 -80371 -364048 -34609 12692 3775 -35921
20302 -259288 -433997 -97791 -148229 -172716 80839 -42276 -3288 149988 -2916 78742 47546
20291 47546 -115861 61481 -123180 272841 124657 112654 193866 245928 65701 -136808 157296
20279 -133597 16172 3147 86148 141122 386111 -168436 -144897 170835 -173450 320214 -258678
20267 -40846 24600 218445 23304 114814 -69933 -98416 -183308 53734 -342675 -415677 -20755
20255 -30352 -217900 -274490 -222437 -166603 29360 267766 -193362 -36530 -26838 56138 208273
20244 208273 238814 53439 -244557 213286 -179032 420492 -173586 -179336 2805 52390 178145
20233 178145 -321194 -416350 198901 213160 -354285 -301898 -223362 -151786 -131505 56941 -151455
20221 76210 -135035 269615 -218947 -56888 -100365 88224 -274657 75193 7386 34162 114984
20210 114984 87568 69708 -22860 -17593 -189729 144161 -148983 -214177 111819 -209393 26596
20198 -390544 54384 -392882 -253283 42448 -406414 -54065 -232820 -184206 -110857 58286 -604996
20186 18413 -165834 182593 68501 -115221 39210 182190 -365997 106020 188844 27949
20175 -93601 117581 134111 169098 124859 -86802 -206901 -34014 -120359 -39624 145477 98043
20164 98043 -164590 -354563 -137007 49744 407046 -72275 -215182 -207061 -105385 -12593 592968
20152 -49730 -131243 193164 -228662 -280097 4061 86968 37242 1754 -62783 176454 -90034
20140 -310294 -104267 101659 90724 188197 141295 190703 130759 -6456 112306 104280 75072
20129 75072 -54053 117594 -263170 -85413 20804 10686 -161504 -102955 -177262 -2579 83754
20117 -30749 184430 -50726 -222173 -244445 66064 -72866 -28508 -109371 31029 -463951 214793
20105 75936 -77377 307579 -250688 -51316 -138548 62190 -184009 -100837 61672 79711 -131939
20093 -110809 13327 -37670 -269254 -59529 -140416 66810 87833 97970 -209522 169962 -299933
20081 -154776 54712 -102609 21001 137930 41270 -293199 -160664 57840 86493 89372 49432
20070 49432 -75540 -110707 -215812 23264 -341968 -26134 139812 156167 64461 15116 -256423
20058 -104814 37898 -234872 24361 35685 -195724 -22634 -161482 -208733 -325809 -346927 -18877
20046 -81289 73299 87586 -198552 285781 -174526 -251762 -372828 -167325 -84359 -23539 -440913
20035 -440913 25117 -60903 -233705 -279858 -45897 -194690 -32953 -104110 89210 -66014 154232
20023 -101315 216858 5304 -51173 -253295 115977 -37942 281993 -76428 72284 80785 -120587
20011 -280191 249634 -64031 -122229 66285 -177896 -300926 162943 -297848 -146999 -36025
20000 -53824 -392192 -319358 275793 135027 -232830 120343 268978 -104961 104430 -438095
19989 -40857 -243334 -46705 63614 52397 -23635 49839 22968 -75812 -10786 -155440 7629
19977 -67997 80808 -84497 146378 -205717 88751 246418 152340 41255 -162764 -223987 -104404
19965 -118858 151832 269404 114081 45732 183012 -136441 -222468 30440 16906 -155349
19954 161157 183823 39925 -387199 -128848 261018 660483 -70658 -306470 134828 -216779
19943 -92822 -37159 -68778 -130059 -209113 -33273 -19264 -99684 207001 -196211 -192932 -337075
19932 -337075 10862 25108 23464 107539 169613 -26094 240188 33437 223021 -76492 -103857
19921 -103857 -146418 344105 124355 -406677 -184266 -153273 196346 -305815 250447 -50980
19910 132852 -295903 -207699 234387 -150641 7989 79575 -43133 -122819 -189863 361135 229745
19899 229745 -305451 6484 -104403 -170844 -75724 46142 -168132 69855 256897 287846 225334
19888 225334 30237 94526 4128 229238 84377 -11183 99958 -131773 -339510 88526 26339
19876 13741 -238045 -143057 83958 -226292 -96037 -265240 108769 72552 85938 -4465 -90992
19865 -90992 -177148 -281150 -90370 166242 57387 -30336 -331662 -77323 58308 -129159 -298949
19854 -298949 -304754 191540 -171912 54307 -374367 -89824 -121745 36867 -44058 -31915 -222830
19843 -222830 -343403 197457 168301 -275320 74016 -296581 -103151 177523 99452 -385939
19832 -57812 -62959 -106284 -222407 -164291 53096 -42420 -77672 337460 -39288 -36653 -54117 -210303
19820 -210303 -222128 -345014 -15522 -243847 -182190 203634 -14094 -166941 48177 38472 -53260
19808 -20363 -393218 -284653 -117707 -156407 -345450 -60869 -163581 86587 -268313 -56097
19797 120024 -73047 162128 -115092 142286 -164072 54013 -281291 -342620 -259541 190030
19786 95274 -90745 140605 234101 74441 -11995 291300 -87173 -151512 -49833 -50555 63700 -311466
19773 -216997 37964 -131383 368155 -184174 -295424 -389490 -278411 61965 38866 -166237
19762 -147397 -166370 -197036 -525326 -148562 -38543 -164086 57588 817 -108182 -8572 223721
19750 -182345 -105160 -192999 -36093 -43250 -18158 -46901 -253389 180712 -337028 106895 44180
19738 -49924 193 83281 77579 115548 -221984 -146021 5784 16054 -174602 60486 -105491 -114175
19726 -114175 -57000 -195909 -297522 -123995 74954 -43807 43965 -156149 -237139 -245172 -109264
19714 209538 250142 -131648 -93241 146790 -336521 -203318 -77803 -130448 81822 -187308
19703 -18210 195100 395458 -29267 174171 -103365 52740 -40278 -82367 -70198 38552 -77190
19691 -98732 -8775 -216288 5027 -109104 -125721 173361 13397 -120376 -241613 -244263 -10833
19679 20118 -53957 80670 -153114 -1103 282661 -93037 47456 -14958 266361 -195565 -26596
19667 -391007 -128416 -401539 96186 -500506 -211435 -17348 -168596 -124964 -72863 -12473
19656 -156208 31205 -72672 -141333 -133460 95319 -882 -421381 -111117 -242940 -126597 13643
19644 7623 -77431 -94594 -318269 -142135 -4621 159302 -148834 31536 75241 -338397 -34055
19632 -174450 -220197 204371 83227 -7048 -179280 -277864 -239146 -229407 -175411 -192015 2223 -99198
19619 -175589 -73836 -43735 -454613 -218099 -265276 -124036 77549 13906 56063 -59327 67666
19607 -223427 -10761 52023 -2612 -79413 -111186 155761 92365 -185251 34002 -50079 194488
19595 112771 -100854 418455 -52774 -241010 -51391 -100991 -161522 276716 -67017 -224632
19585 -224632 125235 138804 -30023 233343 151405 270185 -98761 -171275 179218 35579 -129529
19573 -175236 189313 -115475 48304 233262 5870 -170516 5833 -91212 -38700 -388908 -152120
19561 335053 -177196 108012 -299996 -214589 -228220 -103238 41226 -64382 -141187 -267949
19551 -267949 -267957 -108791 378504 36145 -3953 75756 58117 -71306 -170233 269020 -67224 192674
19538 -40546 -1287 90587 -69084 501637 -166682 -39059 -205998 177702 -361093 266363 85316
19526 -41302 -361360 -459482 358357 245346 -18343 289167 -61552 15579 128036 -46120 -72966
19515 -72966 127575 -133285 -33041 -143245 -104317 -275372 81162 -138780 23338 163008
19505 163008 -83997 -120746 -25159 -168176 -285829 110746 309931 -240736 -50707 71842
19494 194535 -470970 30635 -152476 -5345 -90738 -116302 34548 -95192 -43721 56094 -25008
19482 -143449 -75772 90158 -103680 12954 -155245 -251574 -25053 -91989 72417 246698 -134733
19470 43188 -1270 -125540 -190379 -123315 -118673 -87117 58070 -305013 -28278 -4730 -60249 -400873
19458 -400873 6377 70905 236697 -225060 -5246 -239467 -433699 -87864 -184828 -466096 -103120
19446 237721 -230025 -107638 -127280 26915 -260339 -106423 -127436 220045 -150746 -186220
19436 -186220 135016 174636 143897 -7525 -228880 -152592 -184505 113860 363386 15298 -271891
19424 13746 -325344 135734 -84634 142521 -161640 -67585 -116569 -217427 -289737 -48872 -36652
19413 -36652 -34557 -166428 167344 -39227 -102688 -212126 -105300 68454 -102683 -103088 -140666
19402 -140666 -166150 -214619 -3926 -213902 -137825 -90628 -106193 -230402 -426413 -90600 -153007
19391 -153007 9275 149306 184497 350549 -437868 356903 18653 22976 138943 -106446 -183065
19380 -183065 -89059 -77280 -140056 -256702 54209 -18641 -195050 -294343 -164807 -75291 122630
19368 93808 89973 -144927 215342 274205 169163 -2382 -256036 -409916 -249399 -419903 -113526
19356 -118036 54483 -46038 -298857 -82738 -160761 139952 -287761 -356149 -250990 42008 -260587
19344 27973 36762 -79396 -87136 -75548 188507 242062 -364964 89961 -377950 -216126 -180780
19333 -180780 -195393 57771 -63096 306640 55597 56328 -51228 -77036 -323187 -14298 153130
19321 -158576 191173 -362702 -45914 -279295 31680 -66460 -22784 95765 87784 49313 -205922
19309 -345792 -67956 149300 66777 -335822 43664 -52140 -123875 140035 30499 33348 -55777
19297 -160270 -62145 166644 100321 -93098 -31639 85507 118034 -91406 -356262 -148980 -111554
19286 -111554 -308094 192101 44556 34879 -220617 238949 15245 -17343 35482 -14810 61305
19274 -312501 -19283 203945 -27018 15985 -218991 -258105 22235 -238889 53863 -51085 -47989
19263 -47989 211467 -356558 -29955 284678 48087 -103976 -199882 -38974 -194492 208911
19252 -28804 -218672 -45752 252831 -74680 71111 -175439 -251571 -243145 259124 283653 77349
19240 1896 -5216 185181 -266177 -60470 209845 -37522 -8920 -93190 -70042 -259609 125776
19228 -23490 -145698 -184603 74169 69439 90924 -47593 -276618 98878 38334 -241206 109585
19216 223479 96062 -154566 133041 -134988 -344768 -422578 80661 -114466 72581 -192574
19205 -174490 293667 -5044 -303906 187952 -104408 13009 32075 79233 -80361 -59246 37546
19193 -420154 85075 58528 -101496 90045 4645 -23243 -334549 -81957 56740 -309800 -72314
19181 -71761 -60497 -4618 173940 -123059 -77428 -60891 -150632 -111900 -260854 28686 -237731
19169 -180030 320677 -211560 107361 -83259 -315251 -185709 -38837 50482 -154444 -17462
19158 -4219 167237 8584 -62082 -23391 -32688 -28446 150569 -31643 -22808 129480 -296343 -275308
19146 -275308 -148965 -50400 94919 -126845 101501 6148 46132 198393 -350349 91417 -161871
19134 113052 -280987 -243140 143911 -92947 22708 13581 -307041 -103264 -290615 -214080 -310764
19123 -310764 -45984 -131808 -327310 5831 -79858 -138957 -132516 -183674 -74473 -332825 268835
19111 -147166 61496 587265 63919 -77617 -39596 -6040 -235060 -121497 6613 -311533 23134
19099 87104 -434100 -133261 139911 -212685 -373388 -127577 -45960 18082 -188173 30008
19088 44783 251540 127094 172325 -94299 -269017 -230267 -38243 -203071 -149854 -24410 -107502
19077 -107502 -84538 -28371 375767 -208541 26987 -48623 67681 -58407 10991 -207804 -19381
19065 -342089 -93697 -409819 -201143 -418796 -296520 -114867 -43937 -29284 -107435 -172927
19055 -172927 -424906 121051 103985 -151638 -106755 67239 -87783 -18212 -251482 -535330
19045 -535330 59728 102027 -90885 -13617 79322 -349835 107695 -157588 65934 -53249 245292
19033 -31099 -119513 -133455 -53176 -99045 296267 22379 -46150 119068 215696 61396 70789
19022 70789 210248 502204 147768 -336371 -127947 -7733 -237499 -156100 -186129 18979 62711
19011 62711 39550 49958 40603 -29155 -61493 -175768 201188 -366104 -218587 292473 42295
18999 352104 -89490 152362 85734 -61304 -107078 -119016 -23615 -57281 -162840 -34699 -11540
18987 -224101 -143265 -40717 247839 -102296 -177653 -35527 4787 239159 103676 -299635 146429
18975 -60959 6901 -75972 -59611 -69245 -19801 -88194 -326686 -94029 171641 -354839 -497411
18964 -497411 -314873 -156362 -278059 -92128 175419 -74155 173548 -35603 -32030 -98101 64525
18952 171265 -230713 -85393 -56125 -63245 -104421 -53185 -110904 205375 -87797 -157116 -5782
18940 -95650 7705 -223499 -341951 235953 -262772 140332 91832 -44268 236082 -14153 -2672
18928 -408186 68540 179016 47422 30495 -229074 -21676 -165368 -183591 -129807 -40157 -1660
18916 177847 -309879 -151080 209809 15654 -217965 1930 24750 12550 -131689 -171946 -39219
18904 -79645 -275049 52889 25764 16641 263701 -85449 225377 -193535 -220835 -60465 -13975
18892 -7009 5299 -35908 136951 -93651 -459121 -59360 19415 8484 -98365 62965 -32083 55321
18879 -99238 -410132 36169 -234349 19565 -238378 -121730 114361 -334255 -108868 132677
18868 49151 7741 110145 -291613 129291 -229827 47587 -58316 -221797 74057 109611 -26408
18856 -101316 40797 -6302 264218 -395855 -58455 31220 122972 79523 201718 -310337 -149131
18844 -164363 -83955 -401939 -48825 74910 46420 152269 -173987 -252499 -165597 -18569 114767
18832 -209037 157928 -235553 -147679 118957 -67820 -263994 -59949 -80009 151015 123509
18822 123509 -165020 108890 163314 -294463 269162 4459 -192577 129438 -67322 132439
18811 -39715 387216 253922 68328 220294 221403 104787 -101952 130012 235413 -101847
18800 212976 38381 110199 -26451 108477 -249922 118995 22978 -108253 13137 19722 96156
18789 96156 -184334 -183866 109454 -39666 -78678 193620 -173464 75350 -197048 247882 -144441
18777 -339723 -2997 -352759 -26239 -77941 9028 59860 -21735 -460999 -212966 171233 112094
18766 112094 -229623 -100570 213073 -180774 187597 51082 -363947 -329208 30142 -289556
18755 -15241 168227 -70269 -12741 -12320 -149060 -42581 212029 -256951 -195334 -129082 -439451
18744 -439451 -73446 -10404 155361 178931 61324 242342 -49513 141505 297863 75270 -152200
18732 -161151 -98268 133942 -269034 242301 2327 -34568 -108593 -37965 -353528 -85596 -39720
18720 -98199 29224 26010 223402 118996 33416 245953 -158030 -26344 54983 -335171 -92573
18708 -302795 261768 -179838 -126221 -136762 166431 54037 -218191 -428477 214576 -221325
18697 -132238 54612 77177 185533 -141734 -65843 -113017 -39164 -149271 127623 97775 -127344
18685 -190183 -75874 -84342 -247585 -129289 -300589 90051 148195 -69714 112762 -340895 -475305
18674 -475305 154969 -8190 148067 67120 -262403 -305508 47026 8724 76665 -170560 -326298
18663 -326298 -27256 -17853 -152504 -153711 136079 12642 -176224 -85744 -260524 -4746 334298
18651 50327 -256542 -67642 -95485 -152727 -153198 -346490 -20212 -164725 -123811 -13850 97998
18639 -103060 -107805 -141325 -33862 -58886 -31010 273992 -155128 -18340 31235 -118291 -240405
18628 -240405 287848 -425323 116690 -9621 76363 89771 120436 -275363 -309598 -57066 29933
18616 88689 62626 -34329 -77193 51176 133073 3944 -134041 -152870 113202 -170715 -72709
18604 -118162 29201 126656 81784 -204154 -5392 -71004 -200457 -197074 66096 18996 86152
18593 86152 -36175 -76449 -45789 221656 -147247 -105931 -33346 52678 -224156 -41940 20021
18581 -103905 -66182 48862 -30431 -255895 199385 -300184 -192225 -6716 51345 -66253 -131670
18570 -131670 -32769 -130147 -494158 -69084 404265 -44368 -107156 -145586 35978 -38983 -102157
18559 -102157 -125848 -116933 171559 -161794 55962 332641 -365066 -230475 54247 -23269 34240
18547 -67037 91319 58949 -323649 14859 -162249 -80056 -100772 -118749 142665 402277 -215843
18535 -248708 -184327 -14789 -200135 -411209 -29529 194577 89765 -303141 16677 -158883
18524 -98405 -37950 -35456 106574 -53018 14288 -105946 -187699 17920 -178070 -213308 -40051
18512 205087 -333058 98994 106680 179220 -223474 50252 -150307 -103925 -18344 119219 2634
18500 66618 -152192 -88646 131597 -253983 -152073 278769 -154359 -188086 -109614 4127 114557
18489 114557 -83191 -92934 30269 -117198 -176129 -158739 264106 187312 -266827 -80502 -195146
18478 -195146 -326726 -281590 39651 -347488 302355 14644 -351618 134503 -297733 -58377
18467 -136742 -236086 -175176 62550 234672 129340 143087 -130621 204770 -56249 58155 -136304
18455 -48059 42101 134145 -42321 -82892 -187571 -413534 46684 117187 -227040 156036 -157967
18443 -77108 160840 -1903 199404 185280 -153071 -82980 -171816 -38726 -185775 -370332 -64916
18431 -89489 -52005 -148265 139904 164857 124068 123750 -162574 -67768 15768 -23955 -149489
18420 -149489 54472 -157733 108436 126879 395825 -325539 -7209 136666 24753 13 -133133
18408 -354865 19763 -80683 120354 -282545 -88784 -210853 -71013 -313646 274749 -121542
18397 240630 253906 -4776 232016 -63805 255092 -243863 142264 -32378 -238064 -233156 -276010
18386 -276010 -108737 -239921 -88518 -184165 -124761 -157413 -348240 -106124 -12792 -125914
18376 -125914 60579 -31730 -93076 153088 -214289 -166009 -13928 223371 60171 -266610 397539
18364 -71952 -212598 134965 -68693 42264 1982 -203654 89075 195030 -27333 -93668 -127324
18353 -127324 -351739 -171384 -102165 -145908 -992 -108012 -108401 102750 132390 63971 -358544
18341 116622 -104100 -108786 -45542 19462 -6871 -86012 -167448 -28083 -315227 -51532 32156
18329 -138462 125261 23340 -113710 -253518 -78359 81474 196044 -91198 6281 63394 -147761
18317 345319 83446 -34123 -40178 -397093 -82385 171453 63538 -276566 79074 250497 5197
18305 -164314 -117415 -243719 -62234 79372 55214 188703 -201060 261565 92343 188128 184369
18294 184369 -89841 103508 205497 42155 -253773 -26765 85239 179630 -168822 -264308 -63046
18282 -23474 -253889 51703 -18866 -77751 -261977 136468 49810 -133132 -406816 -184052
18271 -20966 19671 -213854 132664 54516 180724 -182430 66364 -155779 -205133 13616 -115703
18259 83496 192879 5427 -265051 -177581 18917 -98057 31764 290929 -11254 -14358 -75111
18248 -75111 25085 -457761 103223 -17148 358863 -119767 11184 -119504 -66721 182203
18237 190042 -103460 195213 193085 234939 180602 91327 157030 -80096 -19639 -81774 95022
18225 -554883 -312989 187046 -78211 281825 90555 -128852 170039 42498 -188724 -89029
18214 -193444 -293286 -44710 -259873 -136941 -18609 117083 79768 -291902 -35710 -184331
18204 -184331 -17328 -162396 133562 93096 91237 127319 37778 50154 -123844 -225379 -193415
18193 -193415 -80636 174243 -166329 206155 220863 -150228 -218362 46806 -83897 50587 -149710
18181 484 155085 -281270 -52037 -278934 -23923 -216199 107650 217577 92073 12088 -378311
18169 -100199 -25621 73396 -35645 -264112 -166955 -182157 -108251 -195504 102101 -130093 -37047
18157 -32228 1737 -84090 1726 -305113 -179713 -29802 -2148 -138988 -39363 -121105 -53452 388126
18144 -470315 8022 -61831 -38021 32924 151590 -96067 80248 182573 -106422 141038 77558
18133 77558 87952 135732 371499 204212 -273636 -126140 -289404 -207925 -226187 154028
18122 123214 206305 39385 -58616 -72618 434376 -52757 -24543 -357009 -193430 -71705 155469
18110 28207 418474 -938 -293811 -212913 58601 -73871 20483 65031 264692 276492 97164
18098 47636 23013 -81112 199420 90119 11914 85107 119425 83739 -56772 -10166 -3384 141865
18085 56402 -85918 -432015 72046 -164394 3428 -297227 -2450 -196085 170529 -129266 -9594
18073 22046 26054 -54382 12161 -161308 159388 -1393 -133182 -243060 201584 -1488 -207156
18062 -207156 41402 -84918 375683 -95548 -57330 -179405 -6525 -253232 -128721 -76935 -6049
18050 84184 215681 67419 -415583 -197582 133483 66594 -158922 -58637 -263946 335644
18039 -218595 -93095 87095 151451 209403 124043 160758 -49362 192697 154421 -104283 5933
18027 191974 22721 -185907 18356 -254520 -154742 40677 -37303 16139 -186888 -5677 58860
18015 -115257 -106252 40945 95804 -112539 -167649 119871 74544 -159268 72119 76216 -914 -21960
18003 -21960 219509 50142 -65415 -15577 -88715 -9335 -131653 186023 -213593 -181841 111292
17991 34998 -98560 -310744 107366 -66061 426533 -35593 -302068 -71890 -32559 -257608 -100487
17979 311731 -169156 135064 337029 -118907 -111242 -196867 -201230 -165890 -88034 -88834 114661
17967 439271 5804 239607 173802 -72895 -119033 -75090 18399 -85962 -302980 -371257 43713
17955 207679 103773 -379261 -46002 -91161 20934 148881 -132833 103455 -175660 -54265
17944 98012 -48477 -181127 40813 21505 -158595 101634 253169 422056 78165 -203894
17933 133703 69284 66017 -134013 312141 134417 239517 3076 329543 -177038 404982
17922 26622 -102948 37156 -46929 142559 166802 266913 66648 177507 -77192 -27907 64041
17910 -189177 44565 9909 -285002 -43588 -95155 65338 399204 11467 -101903 258863 75439
17898 -39944 177720 -338899 -31949 -205309 -175839 -233380 413988 235355 -146691 51891
17887 78482 -170656 -125476 101792 -10170 343577 -10045 -157652 -217928 -61418 -16080 5233
17875 -203793 152426 -230 121147 -51051 43674 69493 -123171 105797 -59229 -144866 61235
17863 87967 -245967 6937 109077 210085 25971 141245 317535 83394 -61275 179392 -377192
17851 73622 25684 -234102 -48394 138974 -124567 -96589 153986 -124912 -228526 -352177
17841 -352177 278748 15546 -71835 -137600 171362 -66134 -179869 167026 104250 68746 -170306
17829 24315 248352 946 86194 14777 107332 -151203 -44631 45336 57597 76300 180163
17818 180163 260107 -322899 -116162 148838 242837 -111978 269006 -293482 88625 139162
17808 139162 219398 22964 -331789 -86052 109850 -47883 130022 202423 -149279 -81044 -119152
17797 -119152 -300827 325616 -99671 24168 -17319 -195098 -263254 87223 254179 -92201 -448119
17786 -448119 133719 157991 -60136 -114242 -77268 -139993 -138641 99465 -374276 -36658 88548
17774 312961 287003 66830 344738 187680 -357035 -86120 20978 -290813 339515 211127
17764 211127 22230 161031 213504 -99536 108251 111248 250788 -281948 116778 -29264 -182911
17753 -182911 100759 -225729 -27854 -155933 -13158 -88307 30153 -21153 -9411 19137 -192162
17741 -30999 166268 -230681 233017 -3192 84299 -139539 -274285 108934 19711 -228924
17730 230030 20417 174344 102986 86352 -219736 -94691 32655 -50495 80445 25161 197648
17719 197648 11929 -158082 -143880 -82336 -25988 132595 -60820 238711 -189227 -254612 -71472
17707 -18458 -259742 -156472 24034 59153 -172434 251634 -245809 311880 245294 -197608
17696 148012 99960 41824 -192394 -144232 -53160 -14457 -119601 -24422 359467 214768 56522
17684 -145115 -108357 -127159 77725 192 33764 129544 -80342 -100165 -205207 99508 266580
17673 266580 14068 158477 303481 -27348 73105 112950 -81431 218496 126920 344045 -21207
17661 104980 344191 -387830 166651 -72384 13762 -37664 66370 116762 -85968 -42121 -62336
17650 -62336 172780 28633 153577 -77796 207953 264004 103344 128611 210085 -76935 264136
17638 113751 -90443 -35686 -64104 -84477 189911 -140603 -23452 -200843 -99780 -39341 -40149
17627 -40149 -178662 65163 250622 82414 -21494 -115443 88916 -248230 5018 13959 40514
17616 40514 -55823 201359 268384 71589 13886 188491 -108583 135723 34859 207535 -300989
17604 159176 249477 282818 -53295 217923 26731 -29783 230596 88333 -84103 -42419 -39476
17593 -39476 233586 -87406 122345 -219537 71568 188265 91902 258269 -82064 -229839
17583 -229839 220591 198327 11355 -49532 26569 -213355 86612 372273 39748 -108788 -189553
17572 -189553 260910 -79173 -311721 111924 32133 137479 -104405 -56698 -81363 66375
17561 80076 32659 287461 -14510 146990 -93908 -74455 -99099 234948 -81151 -183196 -75821
17549 89962 134294 336870 -13326 59148 -71158 196995 27223 185413 -253632 222565 -240483
17537 294250 284219 168711 -33679 -119242 72361 96033 67276 85682 88395 197809 110238
17526 110238 -475875 -29727 176813 26979 43619 -754 239567 137250 82213 82262 156265 72028
17513 -252001 197671 196393 96735 44968 232628 -39066 -19348 -181694 225695 237043 78756
17501 -207074 338996 404363 341234 182270 269454 -34364 251069 253933 -97611 43024 308604
17490 308604 318433 5639 41285 252875 -81480 -64773 178717 414532 142290 250101 457257
17479 457257 28787 277316 -345392 196012 71920 390723 264278 67609 30578 229505
17469 229505 292909 23337 -116924 195094 41099 200956 488309 223404 -119938 103140
17458 201501 94797 297776 385114 78518 10685 98716 175334 325781 307310 221199 311430
17447 311430 264869 691688 319523 263486 13002 134896 179227 351306 -38968 316982
17436 581955 53890 261044 308664 -148270 86364 98230 118776 161124 58472 91591 132959
17425 132959 264870 254979 339877 121757 336019 143531 97178 520461 228525 552949
17415 552949 461458 379647 352381 371783 57641 363846 141476 196436 55797 61999 -223966
17403 188628 -44868 101758 211830 302026 177128 7770 496485 95031 182724 -67579 410557
17391 -136634 230730 116762 214854 189482 -91635 242230 360686 -162618 183877 306232
17381 306232 -97880 177027 302986 210050 214962 119671 -170247 -82731 -84046 118554 -55217
17369 206303 39414 157547 570731 191158 427150 166465 444207 311886 73008 88084
17359 88084 95149 346511 78065 131519 188092 -143966 15626 67905 -38195 11812 219682
17348 219682 -73427 -54209 73438 278226 53004 514091 -322971 213280 149414 -44955 -57427
17337 -57427 31918 114676 224415 292635 19032 132256 196205 248828 435529 131692 123579
17326 123579 486771 -32480 235363 154385 279641 200921 280774 116679 222036 129294
17316 129294 295891 194826 169800 353635 165331 191858 125112 200554 -26536 185218
17305 -40755 267937 265715 347321 66594 182731 478130 160972 147929 357327 -168002 260135
17293 -95726 244902 133124 136274 245186 173771 553309 165350 112091 359690 225583
17283 225583 212991 468006 508921 70884 22083 272757 515431 153585 166613 235629 210317
17272 210317 172572 169038 523482 -89432 382106 499922 -26389 417149 300525 -104572
17261 147580 204677 152154 228759 54879 212520 97764 261692 154245 290510 222237 -76118
17249 -13829 417926 344907 365549 -77126 279643 234449 11635 141387 423764 38883 236574
17238 236574 100165 82507 408698 245510 280170 278552 285169 249981 480423 236545 266079
17227 266079 241350 71252 244077 -181600 -28159 214191 479174 124685 3899 264875
17217 264875 190900 333329 155469 463929 179586 375939 134802 262443 503041 91689
17206 199840 185388 420544 311260 182619 1999 593858 143865 459505 162259 206832
17196 206832 60737 372868 604394 48102 431858 163398 264247 369328 328982 121144
17185 165240 382296 80874 342123 560523 106099 527147 245458 424604 367078 249854
17175 249854 190123 -26231 108441 180651 448493 483186 484247 403594 97102 354053 454993
17164 454993 204551 209546 466793 537520 348242 40107 149543 395627 407211 723757
17154 723757 -18367 280833 447001 68936 482532 -30064 213390 300765 -112749 258543
17143 400478 142319 -84921 422251 213696 650037 536085 240908 288771 482258 29637
17132 432289 5145 248083 411539 421340 632279 553764 149805 699236 373479 593477
17122 593477 531453 674860 428284 61081 188434 657361 399726 203984 371710 266094
17112 266094 161831 559077 549817 637757 528594 190361 391939 802770 396152 216556
17102 216556 302963 384981 418062 598457 349114 159972 444548 334369 488241 508191
17092 508191 807472 427116 613680 507697 446306 661323 652332 825760 754221 642312
17082 642312 465537 219780 724116 409874 599849 745078 280574 612970 421904 616514
17072 616514 710499 575438 419776 495668 726726 533744 627440 398071 319508 554428
17062 554428 574250 373986 619238 826207 889399 815464 657378 231668 647756 546227
17052 546227 483136 542436 513554 488936 743414 610130 737279 359659 321683 310339 435362
17041 435362 740361 721135 548218 411925 428010 524054 344836 779299 627747 647667
17031 647667 434327 634916 646797 828700 509903 829421 453657 611377 561057 662774
17021 662774 529237 677967 741533 911588 574034 728006 735133 930847 1069172 993814
17011 993814 959526 945198 613925 977330 838883 843478 948802 710252 1002689 828152
17001 828152 670255 778571 598064 969709 738492 688041 736832 717035 794260 666636
16991 666636 756818 747446 924251 1017617 830616 1145030 868031 819196 821333 894734 1244390
16980 1244390 752569 1063682 1138766 859295 1163629 963272 1025535 1384892 893400 757206
16970 757206 949603 1028279 1194133 1097290 909718 1125467 1280504 1137273 1273673 943483
16960 943483 1043675 1276609 966328 1198765 978505 1030261 854985 1025423 1264746 1096532
16950 1096532 843954 1515483 1378130 1269944 1393556 1325484 1315797 1562901 1336224 1152753
16940 1152753 1485828 1382005 1221052 1362158 1301694 1593721 1580154 1465938 1581835 1607621
16930 1607621 1565838 1548761 1611718 1384987 1346873 1457651 1765100 1424055 1549478 1602632
16920 1602632 1808125 1601313 1900426 1914572 1697879 1473222 1631827 1755664 1588560 1965791
16910 1965791 1615124 1666586 1889545 2093998 1968118 1573669 1972805 2225985 1706654 1969886
16900 1969886 1978170 1864853 2214709 1865366 1801050 2270734 1855196 1817965 1921162 2148133
16890 2148133 2085138 2235327 2236744 2341253 2040510 2153452 2198997 2339981 2056852 2431500
16880 2431500 2368528 2493086 2650899 2296803 2595454 2441341 2418938 2530459 2594955 2960704
16870 2960704 2602053 2750459 3061082 2956255 3024934 2915873 2688346 2820495 3109545 2838509
16860 2838509 3277943 3049489 3118549 3238816 3436733 3455446 3494181 3204892 3395135 3082583
16850 3082583 3434172 3711905 3877690 3729630 3881369 3975716 4058927 3778292 4026512 4110626
16840 4110626 4263181 4288583 4296762 4335584 4503339 4772354 4470243 4797945 4457606 4816033
16830 4816033 4841337 4586457 5053440 5353309 4915051 5356897 5569052 5252008 5802405 5463204
16820 5463204 5563517 5990109 6314830 6017967 6323173 6183113 6379150 7015480 6923457 6645188
16810 6645188 7297812 7167890 7786359 7639384 7925379 7737528 7953438 8147968 8409856
16801 8409856 8690552 9240181 9001430 9485018 9303053 9584492 10012453 10148301 10255674
16792 10255674 10767826 11009683 11042971 11403305 11812386 11877883 12538173 12463622 13256955 13585196
16782 13585196 14182566 14480608 14869048 15033339 16022528 16139585 16586481 17180500 17639808
16773 17639808 18578186 18816714 19796105 20138457 21368147 21807381 22772235 23430776 24353505
16764 24353505 25163117 26163450 26846405 28162151 29568339 30856358 32224138 33617449
16756 33617449 34644041 36445898 38154758 39480788 41598220 43501529 45961394 47708207
16748 47708207 50231932 52313825 55226335 58199119 61098979 64404865 67908182 71609620
16740 71609620 75695774 79601709 84013825 89049963 93833169 99370760 104786250 110923838
16732 110923838 116878801 123269202 129895494 136564590 143966189 150265067 157286520 163652912
16724 163652912 170107568 175515399 180916222 184623583 188304086 190670806 192009837 191836227
16716 191836227 191092212 188798259 185672977 181548591 176222506 170791066 164488238 158060329
16708 158060329 151257936 143951311 137006857 130379186 123442084 116987381 110594881 104532720
16700 104532720 98569328 93285876 87940852 83015353 78683988 74554442 70556809 66737951
16692 66737951 63240499 59686776 57051762 53661634 51501492 48756521 46490639 44375145
16684 44375145 41823004 40362115 38173545 36787545 34925180 33757056 32293231 30885668
16676 30885668 29737984 28145084 27497195 26105666 25229556 24207794 23624543 22746063 21667952
16667 21667952 21031549 19958097 19534686 19082051 18365440 17821960 17372444 16370057 15760301
16658 15760301 15537190 14857544 14393481 14571531 13403960 13178016 12791698 12548127 12050720
16649 12050720 11932184 11608318 11089826 11043508 10466570 10533079 10092275 9720090 9595042 9174082
16639 9174082 8951490 8607006 8646117 8264782 8405063 8168334 7826414 7529999 7862938 7436875
16629 7436875 7081381 7162081 6487011 6795628 6556242 6522166 6252242 6201920 5996126 5842168
16619 5842168 5682129 5590435 5406878 5504309 5223786 5320575 5166042 5038439 4896686 4545126
16609 4545126 4532980 4728818 4441580 4593672 4432878 4418746 4309016 4340172 4437692 4267706
16599 4267706 4148971 3947835 4244642 3704402 3945040 3648174 3682885 3572532 3377655 3277652
16589 3277652 3501902 3173381 3504074 3140712 3328424 3121337 2813004 2918817 3093128
16580 3093128 2615184 2771075 2950752 2499499 2498808 2771515 2521944 2481435 2565046 2636242
16570 2636242 2497238 2824399 2146581 2500513 2196820 2270776 2345098 2585921 2579644 2415702
16560 2415702 2317411 2088706 1929375 1787851 1964544 1902941 1896872 2271380 2018009 1925259
16550 1925259 1823188 1762128 1909889 1865089 1754887 1517634 1885884 1660210 1884440 1754508
16540 1754508 1740982 1882174 1703809 1481399 1713775 1709297 1495923 1650144 1606925 1606070 1497023
16529 1497023 1252632 1228524 1421940 1371612 1420426 1683046 1231265 1442631 1117523 1404089
16519 1404089 762418 1359101 1269851 1261024 1353435 1230912 1110314 992366 1207279 1099714
16509 1099714 1128818 1262823 1250313 1108594 1402636 987190 1058630 1193033 1200730 810251
16499 810251 1133600 1072291 1209834 901659 1289853 1096597 542827 1149273 1160139 830177
16489 830177 1117296 1012721 677288 796509 848148 1054262 1137942 681752 960911 914928
16479 914928 806983 939947 848323 885194 762696 935076 908046 988976 834420 703754
16469 703754 749879 537712 530417 659565 863814 613821 926327 696309 721899 830158
16459 830158 1011229 793553 883078 620147 850788 727056 1028630 655052 950076 319236
16448 769606 845363 732684 655777 918161 543344 448358 600614 773081 548803 587614
16438 587614 689216 531513 463188 606952 630441 565225 567983 506481 499222 362480 458893
16427 458893 189448 684992 297546 365481 595660 706509 782641 782203 454320 466152 569969
16416 569969 525892 507690 693153 597514 628675 744232 804377 523741 250024 399594
16406 399594 353947 665662 609602 435133 703845 746213 464084 376221 319028 438501
16396 438501 530298 781362 166732 474839 411774 640412 654490 447123 905009 568517
16386 568517 422234 585932 519863 190842 457125 353148 314607 171007 151896 338642
16376 338642 490752 672214 466177 455922 307488 158959 128594 411982 689666 160647
16365 30782 -203290 324921 200874 529026 241356 113130 277206 271082 259767 256832 183120
16354 183120 -43458 277428 409817 393841 233163 234083 61730 455034 550163 248588 475794
16343 475794 345296 226394 562211 393727 482576 474310 550733 376086 161603 188220
16333 188220 368757 293805 136473 635163 260859 345731 208749 3391 520301 394359
16323 394359 93119 280201 291436 -81402 63013 39626 278861 224828 490573 264723 269841
16312 269841 382245 233903 616510 236807 107970 59476 435117 658464 40890 139027
16302 139027 294370 606582 380544 370436 448865 74579 251294 100514 200711 80804
16291 42014 212186 136362 142519 9197 117062 256864 -167903 90345 -214188 -52963 60452
16279 131293 174898 450483 116975 1908 288893 403911 -237589 276425 23101 -59075
16268 94600 -109306 -79496 80795 382133 -91559 38466 201332 355850 156508 -75451 189245
16256 214647 212558 400615 48410 97615 63705 468808 -17696 198335 186211 -11389 91621
16244 216578 -25740 55332 82340 76744 50504 71631 -9356 160619 -17568 142951 220884
16233 220884 145566 405883 205889 547451 132636 221788 -10008 263306 -189095 271940
16222 306190 242908 34174 219421 247917 20083 -163337 -36026 93913 207112 -154233 -120966
16211 -120966 -132535 -49524 -18874 100534 106271 110653 170187 -200285 -83331 427014 181246
16199 12708 133456 191338 -112039 110752 209382 69571 -22409 180158 -134114 73205 375581
16188 375581 87853 -43505 176185 23257 176073 134103 321344 -97712 267999 149830
16178 149830 -58483 -87214 -188661 -167699 145960 103823 121262 207376 13456 -131989 -5688
16166 263646 531949 9477 326327 158598 -25316 -9581 -56377 -36759 321292 240893 102732
16154 -308504 126235 -52590 -137454 12026 98944 59934 124615 -102764 -135330 160638 75112
16142 212451 122041 154665 -21923 145576 -168433 163799 -164465 223419 10193 148201
16132 148201 -63260 152950 248188 -75740 50966 103805 242006 107524 -101791 -173694 11281
16120 -226265 459754 132102 54014 127202 392619 45721 198325 27944 12780 189873
16110 189873 36324 298134 105944 -41561 -132386 -110907 68962 -237252 68351 189649 413047
16099 413047 149907 14379 200880 -346278 207229 -55198 85093 223626 -13782 -186663
16089 -186663 188067 126917 159546 18082 -86130 -2576 145585 55129 -57475 269849 -108226
16077 131602 -144689 52408 -152498 90122 -120289 120462 -156672 -29967 -119867 170738
16066 -57403 292071 -40226 -208295 -310827 -331417 -119620 -141130 -101104 -114684 193792 -200918
16054 -208525 158231 -191561 15127 96407 78385 288844 89861 -254088 142482 -329641
16043 -19489 109773 -336197 -208420 18858 57076 -123331 82170 -187666 80594 -296059
16032 79409 -203007 -215903 333450 50128 -27346 83309 61090 335591 163401 140777 -59716
16020 -251063 -24996 -134929 105873 110842 145299 -15079 -258648 -51752 -292089 196578 -363673
16008 17096 275800 -73911 -312883 -201127 -64700 275191 194113 354749 -106026 26891
15997 109938 10227 -140168 -21854 -29759 10783 -171167 -72590 273032 -43052 56959 -510
15985 -36402 -61560 -421069 99948 325459 117178 497914 363894 142667 -85726 -110329
15975 -110329 51155 -146565 139123 -190619 -91764 161565 116416 -314075 -29956 -361825
15965 -361825 113973 255790 -87858 124144 -89336 44314 166163 78333 -75387 -52361 180017
15953 38264 150788 263314 41739 14531 35187 11677 -262560 -202959 -447520 -62749 -136006
15942 -136006 -128317 21113 14745 -278178 110795 -131263 -2972 -199970 -438075 41307 7714
15930 -11733 -369410 88770 225416 -253872 -95881 -118145 -172455 -72698 83454 -63154 -67143
15919 -67143 90911 64323 193451 -113530 -156962 -387111 -349329 -179228 -216991 250431 -127634
15907 -63162 66883 -182959 -55021 -7599 -52667 330126 -213070 -141521 -54181 -36831 110607
15895 -115630 -207603 167511 -134885 -79250 -132255 -120402 266703 -30467 -101517 -70219 -87631
15884 -87631 228369 68885 57956 -97117 -360331 253843 485777 2341 -316530 -194927 -39621
15872 -44337 367734 -67526 177829 99727 203843 -162986 -71170 -43409 -61845 177749 212332
15861 212332 -160768 -233719 156335 341056 284409 -153879 -71985 41437 -89353 -235194
15851 -235194 100991 -270129 107781 247199 27188 261312 125891 -317787 -34802 -127587
15841 -127587 312483 -128516 123357 175241 26569 -182654 116271 258139 107574 16830
15830 -431851 -46372 -162185 -84767 205982 146914 -76684 -213036 -102127 -54876 -208588
15820 -208588 -2652 319520 203219 -199968 -156132 119662 62824 -192627 -223153 -4287 133830
15808 -98225 -146833 264634 322708 -21 143485 118079 28075 159509 -174847 464953 90345
15796 -148655 -41080 323880 -68890 -462877 218929 243263 -31579 -82363 -325037 -124278
15785 13169 117457 -85418 185134 27683 10896 -192654 94003 -256686 -74508 -115298 -148330
15774 -148330 -139709 -292738 -97447 -328600 -189125 72214 -25307 -387639 86583 -179913 271502
15762 -45981 -44492 -68166 6086 45452 -179447 5901 72328 341099 -159992 -65850 110170
15750 -124404 -52564 -150440 79426 -85605 97777 -65617 43079 175928 128017 31505 -41037
15738 -28439 -51638 -70190 -316548 -198939 48475 -352978 57792 -426451 145861 187415 -78626
15726 -120820 -249883 -5937 -336357 -372313 312880 141409 150224 9202 -172101 -173283 136968
15714 207514 -184548 317753 104194 -232259 -104349 -133710 247689 -198358 -203008 65030
15703 -40797 -109103 -261213 -162764 243728 -245254 17369 98072 -49513 -195606 86506 15230
15691 -85536 -420297 -96956 -134336 -226058 -298922 -31272 -110510 -197721 -48504 15780 16465 -88018
15678 242438 -61807 -61201 45367 29598 -114165 -167092 -174146 314257 11708 269177 -373331
15666 91058 19910 -59048 -278424 -96012 10778 105629 46265 -519428 -138777 90339 -109028
15654 -357373 237942 -161664 23961 100680 -281640 34206 -147703 4734 -40546 164952 -352141
15642 302190 -207548 -136691 -128975 -399465 372711 172075 -341670 -29931 -134091 12340
15631 19474 -102756 67684 21776 -163814 -268433 97381 -117398 -194539 7339 -192533 -253942
15620 -253942 103130 -53926 -35205 93304 77251 -26216 168210 268011 245191 -96000 -8575
15608 66506 41620 -72465 78422 -6342 -22722 -70707 -203717 -263708 -32001 25177 69475 -152520
15595 87410 47435 109023 -92299 174620 -93803 -351368 -323301 2240 -216900 -43164 294964
15583 28779 124756 -13399 -192763 -143378 102396 372736 -241976 181953 88234 -52421 -139933
15572 -139933 -138131 -254634 -191679 -108516 -151533 -331565 2180 -166589 -149571 137269 220515
15561 220515 359703 -193695 -28309 -209147 270451 158204 -227161 135827 78701 -116798
15550 -51835 44210 -61505 -32725 -311527 -137918 56113 -205335 146908 119068 85528 39440
15538 -116169 -111351 191077 -268466 38914 -121159 24666 -7839 43209 -171095 353649 103630
15526 -368256 -53951 -137178 252854 -121877 -294840 238246 129660 67928 157193 -225390
15515 91948 374660 205109 234975 68055 88805 -65463 30368 -117571 -77808 143753 -56945
15503 -22312 821 136738 164478 -157129 25043 -168873 133645 21836 -15316 -52636 -20555
15491 51 59526 -28379 9083 -31921 29538 -137556 -53539 31584 -244296 155881 -83092 37024
15478 164942 319736 -11052 -163190 214572 81227 68845 -169896 222762 148782 -289469
15467 313381 140331 -175938 -117212 -112584 4012 -102070 205049 75438 205958 -21853 -142400
15456 -142400 130494 243556 44639 310498 331882 332632 -173519 73367 -71426 -31672 -25601
15445 -25601 60352 24876 75956 322417 33299 102071 -190726 69535 48775 132677 -295132
15433 -28772 -127377 -153741 -171608 108016 -193574 115258 -264485 65437 23220 -153549 -60299
15421 199530 -392242 -115014 -323980 113548 92792 -60113 -52258 110225 135289 -273698
15410 -172124 -88550 204474 -100475 143279 80962 121555 99140 137822 142994 -166941 160593
15398 -73196 105462 7144 -68608 -253626 -149064 13212 152719 222340 20792 121906 -310262
15386 104058 -259428 69099 113019 389 183594 -35648 201740 108423 -223601 224324 -33348
15374 -110193 -10619 -277890 148910 9593 259847 148368 -211807 87145 -99481 48731 38653
15363 38653 133537 206539 97193 -113750 232253 145340 -247981 119140 405898 -85665 307236
15351 -18441 -66279 384338 207094 -260326 140673 32536 132705 76727 -127539 28706
15340 -272444 53067 -61272 -41836 393454 192529 -208156 393474 -331118 148848 135344
15330 135344 33367 -106659 505 30053 156016 107533 75469 12061 -32281 146190 201813
15319 201813 99725 16617 135934 158819 -45442 50483 -73718 -119521 119776 204143 158602
15308 158602 -34058 -194928 128494 297270 -274026 -110241 -148583 203875 -441983 -213643
15297 92454 -8444 19086 83756 181018 47753 85511 24515 224234 -246783 124073 -170756
15285 -149307 214127 100490 107473 91347 160889 38093 17146 -20286 113626 74828 442329
15274 442329 -183751 41928 -55239 124595 -301757 -330645 145397 -298449 -124820 -66949
15264 -66949 48429 199290 41215 -27460 -17590 321819 219484 71969 97463 95948 154680
15253 154680 285073 115049 441908 -48201 195502 590001 896822 2430248 2100424 1522216
15243 1522216 2623832 1040469 471197 163617 171942 -28708 122104 97910 46089 284660
15233 284660 236438 -22092 310979 121573 249336 238021 -170945 165205 395460 43131
15222 -20546 480327 -228114 -72933 339342 36146 32053 203012 -44075 98720 -58712 -250447
15211 -250447 81936 345439 110438 43873 24575 -471156 124654 -16369 26810 178654
15201 178654 245370 213321 258880 228880 419515 252595 -336808 69770 94856 329345 -166479
15189 611861 85748 -6089 305754 -108397 53612 -115095 129622 74386 158834 206110 360349
15178 360349 -8617 178986 243307 220185 94539 212100 28423 44553 233867 -7219 -120368
15167 -120368 384706 126691 50906 -176961 -2905 -171223 167059 -9784 128164 33974 195811
15156 195811 152348 -35987 45429 227110 -57957 95736 8598 -594 269253 208669 45160 -89756
15143 154368 -36368 203955 65295 71876 9888 140379 -14679 384900 207921 334680 53788
15131 -207346 227973 190641 63103 132914 227452 181176 340597 413561 428404 127522 109375
15120 109375 281338 348405 133603 248002 190754 -8901 211920 -23516 405446 -107411
15109 135133 169066 145748 31696 378014 45177 191949 -135988 129102 412242 148652
15098 506536 30032 31912 -74911 186913 292627 124489 -128278 106553 130240 39414 111088
15087 111088 139252 -295732 222099 165498 179902 423489 302839 352827 -8266 230135 199194
15076 199194 207465 85988 188144 179323 256346 -94571 274202 12086 452017 -25473 -152901
15065 -152901 450904 -63329 214839 192799 276935 171846 378719 286820 248712 15665 311537
15054 311537 229403 27804 165730 222158 92760 434358 285918 317801 50670 199165 380818
15043 380818 364504 249595 56156 154999 308787 322211 68418 -235233 525402 74610 323060
15032 323060 82131 248666 296563 122524 96426 76371 378773 7716 189722 -121714 210685
15020 609979 508635 284473 -114375 91505 316688 217906 113562 161715 -215633 12487
15009 273175 427468 267624 162519 280531 -28470 355428 188325 209485 231408 182858
14999 182858 47919 69141 602482 212907 162096 114127 397761 215851 9686 494030 82369
14987 96107 51278 394606 103027 -30893 160006 147903 75728 191128 83184 238242 -59084
14975 75210 224071 284012 175457 283453 390701 224968 88729 370410 288439 841412
14965 841412 274520 -9030 314556 352721 218646 66945 393348 321282 428313 -72504 273917
14953 136579 135879 422567 50409 -24451 233464 182547 541812 557754 183624 81893 136747
14942 136747 350224 213528 143406 -21398 260226 264821 131765 326645 459605 335135
14932 335135 263764 491700 367027 376697 476447 -25058 338854 531566 498314 318664 53437
14920 600206 424376 581135 222193 75690 426202 258684 556183 220993 273504 335548
14910 335548 560865 624815 256830 455841 223197 200878 298264 545775 469488 439195
14900 439195 635804 139332 256011 214990 267416 300442 216471 301901 400018 348176 638883
14889 638883 232125 599862 474568 550936 586787 588508 443596 220384 276087 475061
14879 475061 588672 801595 330813 570979 443845 664920 588185 336983 306720 469285
14869 469285 497690 423081 54615 395583 244692 275928 548378 135780 388089 373496
14859 373496 316135 529204 178084 662248 362946 512852 739882 682670 299121 437563
14849 437563 536054 615152 391937 443791 726237 524473 413714 657039 272491 502510
14839 502510 628035 698759 480637 374203 338054 627646 510066 741470 589377 504540
14829 504540 303855 555579 442748 434782 738153 412043 323150 528269 683039 542803
14819 542803 502751 360801 490685 855640 679408 729363 692860 570551 650857 374774
14809 374774 527776 412944 553980 644801 696887 371451 738663 557395 633382 853480
14799 853480 473989 548998 512455 499852 551795 396198 372878 683491 386511 720700
14789 720700 578599 628877 671417 478206 731141 744447 589788 447278 832363 927957
14779 927957 1112641 463120 552074 427180 763283 1020881 623310 502558 665702 712466
14769 712466 662357 481060 860275 873618 809791 695683 416977 774663 672131 941199
14759 941199 1077061 937758 395765 740212 855809 800039 634684 788914 705463 650967
14749 650967 1029066 922398 953054 735493 1013896 749680 818427 619540 1085831 571793
14739 571793 901937 875377 555165 916506 817690 724275 905449 722543 1032310 632402
14729 632402 1026104 846188 575973 580214 790513 801288 776433 968310 1049144 928138
14719 928138 723911 848654 954183 958019 919272 693994 1024617 954324 1002064 690418
14709 690418 936489 1029858 1109972 873368 679216 787035 1381821 1022279 1122242 842942
14699 842942 988814 1002876 905742 769621 1134440 1144896 913887 1537937 1221443 707839
14689 707839 1030903 939790 1364074 776611 804247 1159850 994783 970407 1134416 1295474
14679 1295474 993774 1259701 1096606 872435 1324919 994075 980746 1265983 1054877 1337107
14669 1337107 868135 1347606 1366569 1275471 1087843 1504982 1457254 1188557 1213518 1414729
14659 1414729 1204900 1204979 1276749 1173292 1050273 1112132 1117184 888568 1570038 1687163 1393031
14648 1393031 1009263 1391109 1127626 1385225 1119794 1204526 1042935 1246194 1079251 1792901
14638 1792901 1683485 1306347 1164830 1571401 1313962 1589698 1319843 1437412 1472285 1531217
14628 1531217 1643270 1570899 1135002 1636745 1753692 1210517 1424051 1304523 1574931 1675588
14618 1675588 1567667 1489342 1812954 1340911 1860895 1581588 1373835 1557526 1413038 1752699
14608 1752699 1688560 1652800 1653525 1409112 1697277 1546776 1862012 1712211 1708415 1928707 1726190
14597 1726190 1742680 1943262 2011676 1639724 1800664 1574685 2212600 2071621 1915926 2226965
14587 2226965 1721750 2193096 2183596 2169069 1847704 2160830 2235884 1886077 1572486 1933813
14577 1933813 2270289 2110437 2361677 2530378 2463137 2300544 2577759 2261916 2462871 2316724
14567 2316724 2603172 2416838 2800556 2297137 2162927 2939898 2728655 2716087 3028870 3234849
14557 3234849 3688032 3498932 3638124 3915142 4149854 4194947 4858484 5699042 7745580
14548 7745580 11449095 19704390 39925522 51485099 22456164 9498485 7845316 7335768
14540 7335768 3720258 2602775 2430589 2091136 2288951 2395340 1948879 2357454 2428428
14531 2428428 2234966 2444663 2501783 2520934 2219290 2226847 2433963 2689784 2695629 2399142
14521 2399142 2580790 2792565 2729173 2718674 2800507 2718011 3094015 3410690 2915825 2576900
14511 2576900 3433920 3282313 3312340 3460132 3681979 3068019 3344312 3413463 3535193 3520859
14501 3520859 3452214 3499985 3551641 3712404 3442492 3987432 3654524 3750898 3583597 3655604
14491 3655604 3749681 4125491 4138311 3850478 3887386 3876424 3984152 4181736 4056036 4139311
14481 4139311 4065618 4248998 4132452 4618417 4325977 4567194 4289190 4807436 4610895 4900148
14471 4900148 5014907 4550071 4666780 5171952 4889833 4814324 4796345 4881250 5247630 4990459
14461 4990459 5233199 5379922 4828330 5241350 5571492 5493113 5594081 5748361 5650090 5570465
14451 5570465 5768406 5774834 6088290 6100608 6102418 5960390 6354132 6823009 6600842 6220908
14441 6220908 6721823 6665197 6515901 6676758 6686968 6802651 7099211 7057028 7272606 7249023
14431 7249023 7101269 7494062 7364750 7792627 7710247 8112902 7951636 8114654 8498078 8313126
14421 8313126 8365006 8519139 8574346 8813743 9053575 9206115 9215856 9322394 9323972 9841965
14411 9841965 9591821 10104356 10034191 10211451 10301682 10539199 10701159 10757740 11005505 10859719
14401 10859719 11286342 11633087 11505967 11825289 11659460 11946350 12277325 12659983 13152289
14392 13152289 12979598 12787975 13657642 13787287 13747781 13831825 14271877 14563573 14375455 14986644
14382 14986644 15068496 15653485 15925336 16189940 16379385 17165539 16978457 17413872 17557387
14373 17557387 18110943 18403488 18623770 18802388 19411526 19771217 20574296 20439850 20858524
14364 20858524 21725835 21767587 22461272 22779409 23418498 23798442 24346307 25118325 25639029
14355 25639029 26151160 26755414 27504776 28182234 28518804 29721781 30120003 31073312 31578862
14346 31578862 32232912 33539496 33907087 35387179 35757894 36671418 37534885 38624618 39833060
14337 39833060 40938523 41991780 43473965 44493146 46357462 47273411 48882283 50343250
14329 50343250 51520785 53561437 55210140 56992994 59121882 61086037 62774358 65086115
14321 65086115 67158681 69707240 72079667 74863053 77678889 80458129 83547543 86727313
14313 86727313 90299232 93934571 97693992 101571661 105652120 110240402 115060454 120181109
14305 120181109 125459882 130793074 136787026 142852648 149951176 156765329 164184239 172104823
14297 172104823 180326052 188762862 198116831 208076941 218151135 228951373 240148779
14290 240148779 252293886 264754120 278058856 291431376 305080238 319485076 334518320
14283 334518320 349206671 364351304 379173247 394057686 408635018 422046004 434531802
14276 434531802 446023091 456412826 464592705 470211130 472716035 473535945 473667315 472498467
14268 472498467 467917349 463697175 457225535 448666579 438069465 426521980 413766178
14261 413766178 399573603 384704713 369116584 353504603 338187370 322561462 307349378
14254 307349378 292732435 278819123 267286344 254617193 242093003 230344590 219040869
14247 219040869 208827118 198549928 189440494 180819972 172393902 164402617 156756753 149970927
14239 149970927 142971363 137493342 131541249 125840763 120366058 115490536 110361170 106424563
14231 106424563 102612966 98554244 94856477 90879486 87187350 84082461 81339157 78569884
14223 78569884 75527465 72895989 70003553 68085473 65924140 63424989 61325775 59658410
14215 59658410 57459040 56097061 54518462 52619208 50825585 49458115 47724210 46858801
14207 46858801 46115306 44848817 43634429 41701264 40588214 39759990 38825700 38091438 36932488
14198 36932488 35911629 34922176 34484071 33256753 32643406 31744694 30607005 30268609 29396891
14189 29396891 28390402 28042863 27399258 26864392 26068222 25627004 25011272 24183127 23831420
14180 23831420 23586652 22939768 22384280 21751553 21406530 20939966 20534405 20313285 19844869
14171 19844869 19238790 18837933 18848001 18242082 17894051 17671496 17218832 17042172 16778106
14162 16778106 16488850 16004762 15582845 15485956 15450701 14945702 14873091 14355530 14277884 14084481
14152 14084481 13505772 13814809 13184115 13300994 13221942 12797076 12406732 12307175 12035206 11865952
14142 11865952 11616393 11126723 11333114 11153160 11317423 10740007 10466770 10532627 10541182 10183028
14132 10183028 10114646 9826172 9686967 9845869 9263749 9557568 9154132 8859588 9084268
14123 9084268 8859175 9182594 8617768 8248661 8277450 8446118 8279539 8078325 7639258 7983460
14113 7983460 7848989 7609253 7530377 7469518 7296377 7274448 7465836 7101558 7170297 6860821
14103 6860821 7110465 6859337 6510238 6515063 6517282 6422633 6208013 6284476 6126798 5950663
14093 5950663 6563439 6019405 5967953 5886956 5993616 5806316 5597422 5366621 5543539 5220577
14083 5220577 5635820 5313810 5268759 5246786 5178950 5129805 4750662 4745223 5113405 5008540
14073 5008540 4818877 4853044 4694522 4708015 4975952 4578354 4838356 4618082 4866544 4091172
14063 4091172 4371428 4302531 4359221 3949135 3970113 4160344 4222803 4255612 3977976 4355137
14053 4355137 4162364 4090167 3879399 3952400 3856937 3769249 3979864 3836198 3916704 3599878
14043 3599878 3562726 3598770 3646427 3396291 3060071 3679920 3351492 3451216 3086204 3317064
14033 3317064 3505981 3551978 3548883 3208817 3041898 3087415 3334172 3121225 3181423 3134419
14023 3134419 2897629 2946123 3204319 2726456 3090570 2856811 2611490 2928965 3067237 2528067
14013 2528067 2675398 2693479 2602126 2689161 2354995 2417511 2640447 2622975 2375241 2750368
14003 2750368 2702890 2432297 2429097 2143626 2169430 2485500 2483197 2087225 2147338 2330228 1912537
13992 1912537 2474547 2402796 2484422 3589422 5593701 11962897 30581950 53527310 29822743
13983 29822743 14422456 8784816 6319015 5383111 4886657 4012798 3485992 3263428 3137963
13974 3137963 3307761 2938136 2767979 3072523 2660403 2748868 2534462 2869250 2362187 2151220
13964 2151220 2087373 2472704 2251191 2592307 2640722 2290643 2035347 2643314 1860347 2175003
13954 2175003 2406303 2103524 2345801 2016860 1964423 2189494 1922154 2248387 2078772 2091272
13944 2091272 1894278 2212961 2283105 2259694 1872724 1989393 1763386 2158184 1917516 1380458
13934 1380458 1585424 1916063 1867113 1864584 1851418 1472712 1800571 1704214 1509040 1709214
13924 1709214 1622009 1595333 1749294 1841391 1258960 1677225 1813991 1807329 1643268 1804491
13914 1804491 1565857 1569344 1531476 1702707 1236682 1328628 1373477 1591387 1823549 1554313
13904 1554313 1147792 1692543 1559107 1383293 1393687 1694706 1324988 1331681 1342318 1496442
13894 1496442 1258221 1226371 1265275 1537525 1134476 1221734 1336165 1219568 1238913 1366832
13884 1366832 1220148 1475076 1316307 1008991 1092980 1185711 1197791 1453080 1239611 998159
13874 998159 1393757 1248867 1405196 1137720 1242551 1278283 1011749 1282233 1462584 940330
13864 940330 1011842 1625034 906593 931359 1627056 1592969 1120789 1254741 1166703 1096514
13854 1096514 1348263 1340898 961898 1351420 979849 1265240 1147189 1029873 928868 1313239
13844 1313239 947296 910963 992421 912077 1039997 1090386 1066632 1305071 798930 658071
13834 658071 1103147 1211426 795196 906053 875598 1173009 1085755 1156786 1098501 670993
13824 670993 749800 849501 1285550 954633 940062 902089 696213 794688 1192587 1058987
13814 1058987 933188 838081 970471 995573 772518 1225101 792747 1070209 1106951 922541
13804 922541 834763 421214 629198 774501 681907 840783 718668 962156 735333 1048527
13794 1048527 940843 902754 1069393 1037978 746518 868874 701971 812036 619389 631495
13784 631495 733206 860665 850244 962404 526529 894482 614495 898428 677114 892059
13774 892059 852077 1026201 1010201 540539 812442 774837 558570 622003 840415 687337
13764 687337 475705 624291 939259 987006 561509 735979 1313386 850944 1008336 824882
13754 824882 374632 612231 852894 493669 610986 886340 552509 796357 697421 1021517
13744 1021517 596904 453252 651447 847042 611460 421702 727581 512210 778659
13735 778659 561763 721407 701648 699007 361724 648380 652553 679510 609340 784329 569669
13724 569669 735911 989709 693398 420493 466080 599724 760688 484335 335476 570822
13714 570822 736646 655008 615054 979640 741681 367358 624389 634239 386863 623447
13704 623447 455425 481628 479504 364619 509092 852070 750501 518947 316923 500334
13694 500334 581856 472572 649148 263516 473398 613781 470035 182527 581318 560525
13684 560525 392640 425163 628573 867656 427708 686481 383032 395431 549971 797834
13674 797834 424293 718544 760811 354725 885019 400752 481595 350083 884777 168765
13663 921908 716317 779940 410379 381152 461476 397751 502180 584816 302919 356772 379067
13652 379067 709724 354702 203231 365948 597446 234923 576854 708271 165672 682769
13642 682769 364030 409083 564400 416143 440281 147445 632054 304890 353747 502386
13632 502386 504295 232383 447780 775357 517324 891837 434327 470473 537552 467031
13622 467031 588397 380061 389735 475834 447793 242844 473965 249868 473308 391843
13612 391843 396396 465145 403429 374648 336634 453060 518475 127712 432897 239697 714828
13601 714828 543161 130446 561565 480233 315494 430511 533136 449660 294079 575319
13591 575319 78858 573205 811489 429266 227152 390620 271278 287668 258869 341707
13581 341707 712725 267252 489051 412517 357194 406257 494950 569043 463900 458927 764828
13570 764828 70988 352885 438156 437029 645223 624595 424311 373174 358765 225302 504790
13559 504790 591590 222036 -42080 169582 697488 462753 376360 130651 311870 503124
13549 503124 279479 166803 291537 360635 306182 207845 18823 338580 158929 441767
13539 441767 346096 428624 371922 258927 400053 517709 334878 -153240 268571 327813
13529 327813 423998 490809 107736 540494 245745 359479 517969 -45784 320022 385251
13519 385251 237311 523364 473355 340104 201943 119219 349384 462272 457739 304830
13509 304830 237418 650690 505412 162577 -4056 226258 140234 128260 124904 59080 234032
13498 234032 211440 119800 401870 101130 216704 64594 213088 525601 491594 305105
13488 305105 599615 326835 -16888 347452 234704 301999 -100792 517284 294391 463734
13478 463734 23138 253473 -145425 245255 238422 -43373 -20416 -46669 231540 141793 76807
13467 76807 407202 593460 445870 329403 260940 356458 83487 -87559 420708 2336 488595
13456 488595 24005 64936 358803 79752 444365 124458 148366 83462 63213 165791 150591
13445 150591 645191 291495 -194837 672502 296398 174174 7822 336827 185200 76163
13434 371083 221334 312479 332082 102748 580639 326041 135968 181299 -21031 431364
13423 356152 327854 -93634 -50580 -214603 296182 443931 159200 515642 232591 283741
13413 283741 192960 176022 228449 -22675 291427 408233 526816 295711 274680 276283 448638
13402 448638 33352 327525 163195 428990 125896 495720 -48154 326048 254558 298837
13392 298837 255380 92795 537582 61106 503300 165581 -67441 288707 -40453 84993 393078
13381 393078 124988 56272 636009 -202087 177855 129484 251146 229930 213689 137815
13371 137815 382698 170695 276018 472007 215447 420955 368810 486106 264040 282757
13361 282757 361831 -76350 -13550 230986 123528 297041 127829 353750 -11001 225297
13350 334150 322930 75357 626215 64496 183371 534712 137015 712635 167727 202820
13340 202820 68347 207965 223842 -31820 681404 108646 -31917 -222284 48677 185152
13330 185152 272319 431932 141674 447103 98644 320603 85712 -131054 289310 271473
13320 271473 218761 124316 104718 382930 355623 128869 -118819 368127 -29440 393562
13309 -120586 386380 328144 291245 20052 160370 154449 69207 206191 -68874 328611 133406
13297 246033 -52869 -23355 352005 288710 -5751 274797 231257 -67838 -158492 91323 24033
13285 388818 131781 -180419 62748 142771 258915 115996 328654 -55665 -140043 -237438
13275 -237438 81584 241548 228065 -55945 84622 442710 420777 35908 151353 295591 100279
13263 104828 221919 4167 29029 -7977 -31999 -26138 137539 -5283 115972 -130075 17858
13251 248634 -44951 464892 215012 150136 206203 -1052 104159 533639 26597 245081 18586
13239 481357 26824 148513 -294768 139254 247954 -176691 56550 66993 196884 134998
13229 134998 365646 24571 336463 463177 252957 269333 -151305 138880 274515 -44871
13218 273896 117931 87211 -111387 299956 -177119 268123 128744 25100 12541 164583
13208 164583 416171 227534 99007 280561 268360 379440 32241 105394 -10460 90958 -14820
13196 81278 197402 101150 16351 168378 210677 139686 125383 -199019 116183 71939 -116180
13184 169850 73908 7647 111878 182344 -226099 -58516 -106010 -177080 180780 -8981 305487
13172 274528 459312 403451 -40962 301618 137819 43824 113982 148854 -380276 -44311 91185
13160 -60455 79363 28506 107082 -74462 306556 158352 208434 349321 158821 -20767 15748
13148 147353 -85990 392778 292611 321682 -175916 469054 -200371 17716 150012 273118
13138 273118 407345 -207557 184750 -51480 189781 78458 -103215 280434 50847 35680
13128 35680 136045 346234 166374 60345 111522 -34257 283984 20595 -124896 -257969
13118 -257969 -166215 -100324 71679 -75511 120016 -105103 114000 172964 91100 -144419 59204
13106 83518 40220 113216 -129304 179840 -9122 1800 26489 -59244 128503 68738 204346
13095 204346 190453 896 4358 227570 89150 117540 50299 -169055 -130417 -77122 190284
13083 -12940 122478 168427 -105354 -87736 243729 105139 -27802 57759 -17768 -37441 168533
13071 -28464 157177 124521 -91684 199039 78749 53871 238045 189639 -138137 284776 573048
13060 573048 111243 -45064 133043 207717 77630 167223 287447 281154 -183228 146566 -124731
13048 97277 -36529 -258182 102923 -61028 463239 -184807 -155341 -86377 42709 -218402 118946
13036 -201535 96829 110943 264692 -163792 108898 495936 -41016 224052 221090 119735
13026 119735 176784 279785 -10404 315200 -214139 -96226 32674 -72604 -264975 86101 -17444
13014 314219 489504 210995 85727 301554 -116749 80087 263731 26436 526043 246197
13003 -33624 136971 253202 379557 232291 137324 -100618 -247618 -65074 248721 121741
12992 -123465 69110 -1185 -40741 345627 59011 58900 195325 -60335 155511 65593 -190665
12980 -39357 -120345 44495 -78783 141239 110513 75147 301845 -104345 246184 77790 179864
12969 179864 84069 119131 -105411 -20820 -183290 -171369 405637 -89181 232285 -79033 52355
12957 175715 -8092 -395953 354643 24663 -126278 180729 -6389 -34193 -136446 42300 73449
12946 73449 264370 192825 -211703 43945 104086 -11653 -270764 306276 159453 286776
12936 286776 -46226 313843 120528 99620 3196 -381694 -201135 337515 -80624 -108498 -72971
12925 -72971 -72136 37898 -232872 -129494 -118671 242806 152569 22183 196690 26932 2789
12913 48920 81120 -138834 46575 66338 310094 76622 -65077 118749 189498 486773 94912
12901 264055 -161253 -52161 -12529 170802 -188613 192351 237295 120968 -212026 -115114
12891 -115114 -28743 218082 225337 185637 85224 3145 194406 194705 34213 -30317 938 -346619
12878 228183 204172 139885 287194 -82209 -273973 -92991 -375470 -244227 -154498 184793
12867 -62005 -39448 7077 235499 18425 -39880 -101651 51486 102688 25786 400128 -136713
12855 341103 31661 174551 -221938 1606 -390529 109889 219902 -312670 186379 55125
12844 -25570 -125456 322099 131680 274473 215250 209902 -160092 274824 -134782 -98984 -6106
12832 139051 133948 -68284 163061 281387 45096 89098 264404 -20545 -273576 -7408 143023
12820 252114 -276660 -103941 35631 -40030 61350 -74771 -93648 -80565 193552 -10075 91599
12808 -118939 125461 19768 93985 171963 247995 -461699 122550 -120647 95048 -267315
12797 -46805 -36578 88494 -60561 328444 -237629 383221 -66545 82803 -48257 83245 58588
12786 58588 55654 245995 63697 2930 -29396 -174656 20351 -79612 -75916 92568 -4753 28561
12773 168316 189252 -20883 105571 431704 259766 -16660 -15677 -105555 -187853 -61200 108564
12761 37556 -43584 220616 -140094 -303902 88778 -221903 264702 -147776 -298403 35983
12750 -212031 186831 -271286 181404 -215002 -5960 37331 382314 -119507 170615 80055
12739 23103 52331 -219194 222050 212149 -12610 24161 268914 93220 -291742 126849 46437
12727 -6407 -364162 -6203 24611 -153884 -224662 -194893 -331724 72375 68206 142232 195273 -114728
12714 82834 -163955 186431 87511 173020 -31751 -52832 88433 -92489 -77192 -79122 -269580
12703 -269580 59258 192872 17499 315115 120410 -304919 313967 -64067 170720 53594
12692 220822 -18817 143072 53707 4389 -92742 3626 -108582 86339 47256 87046 222454
12681 222454 -132648 134282 9851 -84340 -59497 342174 61954 -118425 289122 18285 168561
12670 168561 76086 -49116 79473 15292 215826 294365 -150213 92097 -51988 276339 157646
12659 157646 -43657 -43392 -21994 142547 211940 98977 168252 49849 219537 183637 314736
12648 314736 311596 234499 -78848 102060 -131606 334997 -952 322501 64562 58990 -255630
12636 -96314 4261 -124908 174969 189665 269460 143770 466749 -80652 303850 186756 396410
12625 396410 346156 67795 -51669 245644 -51212 187826 -144624 -266787 280067 294643
12615 294643 105739 46600 42991 -71933 -108238 226308 -26144 105739 -34958 194868 236488
12604 236488 -186402 -16961 151735 -2783 15711 430095 112546 -179284 163236 -508560
12593 307760 261112 136207 250318 185694 185923 -117261 -7983 -73456 -18995 328793 124431
12581 113591 324980 60536 152852 -10800 -26282 -111311 33750 -67237 -52302 143224 72862
12570 72862 -207764 221738 -39988 -89042 54951 -172654 -119426 47003 88298 -161537 -129427
12559 -129427 116886 -89427 207989 22731 -301040 298905 33096 99688 91781 31839 -281621
12547 302841 -216644 -90177 -260707 155393 120626 -104721 -26655 278774 82070 78335 151552
12536 151552 -250092 -271230 90904 -14299 -423856 -31314 11915 -78493 -143463 63220 -9905
12524 -184366 122761 -152180 231723 252331 218362 141412 124796 80651 -199856 -150083 220675
12512 -25420 194616 194343 121824 113056 427010 -87732 -185068 117993 -76244 81063 -519485
12500 245489 123790 365548 16493 51124 248065 111853 225078 -36556 282652 35199
12489 142091 -236957 92449 -389835 103205 24182 13200 -90655 -167760 71687 -149611 -240766
12478 -240766 -14039 -65138 -24985 124996 -166384 -18409 -95297 -56032 -161120 298989 54526
12466 23751 -312728 -166571 35817 -51634 -39547 174324 -169360 183447 -444099 175222
12455 -42620 160488 -344940 -37653 -73242 -2261 223883 210229 105400 -24711 -48441 207317
12443 -115837 -81558 -432751 62490 -245574 29083 345816 -304083 -14995 91431 28572 -39295
12431 130414 -280256 -167440 299762 -73300 -93580 -49566 10861 -15620 -81730 175945 79327
12419 -166768 -96384 54721 -376485 -187813 272682 -181804 -56957 297025 202676 -65021
12408 190559 184526 -56058 51614 -113793 -60862 265037 -20456 383485 -112409 -42595 -248590
12397 -248590 -90775 -103276 325846 -66830 -199475 201121 30886 92297 -137901 124764
12386 186606 -336007 -114685 -36293 -42417 -87781 56800 135402 21869 -79066 176950 14806
12374 191568 319092 196254 138536 54998 132871 -75801 218841 15864 170732 218434 -224493
12362 250606 -44835 -14430 218063 -246069 185799 -108935 81278 -69450 -28881 -67476 -65515
12351 -65515 106360 100107 -92156 -371604 -35848 -143184 -262933 -115000 -233081 17280 279853
12340 279853 119818 144632 -69937 184900 65870 119771 -108704 -98093 81699 66218 266876
12329 266876 -373040 8123 225355 65846 189439 97959 -54546 106227 166346 -59250 108888
12317 270598 -108613 -182149 61335 -223099 -137482 7794 130362 67560 -352186 -71545 -116198
12306 -116198 -126092 89452 -279414 9190 79342 521142 -25228 11329 -17056 37427 243555
12295 243555 211607 82494 -63560 312474 491505 264850 103757 286133 248543 -304883
12284 -81770 125587 263896 94168 -46747 -1216 -30076 369723 -297690 411590 321191 162223
12273 162223 -87098 70992 266075 28958 13184 -74183 -47654 -168821 265382 183509 -131324
12261 -60851 87828 -143293 -172668 91692 -104418 131990 -54986 240010 237102 -40474 -50831
12250 -50831 171620 -22550 178074 21570 174350 205156 -136015 318924 115189 -206304
12239 -40499 -78219 -8629 -340853 -52939 33093 85795 -78034 -32566 211437 89652 182849
12228 182849 102843 332125 429918 -199590 49711 167013 437074 18779 83509 -258054
12217 30167 367290 222741 -103037 -227753 128346 341786 144932 -47730 123237 83773
12207 83773 122890 74681 605584 -30557 -7612 70714 273631 -219487 206351 56803 -47451
12195 217697 163566 3158 108186 346046 -105712 328366 237956 93939 -15516 -131919 37171
12183 115218 -54957 27366 249490 107617 -10730 182501 -171923 24149 310835 266427
12173 266427 300142 -155259 -39322 266802 6731 131560 -85839 -155548 111556 119143 54006
12161 125619 -48907 241350 231035 -61136 205654 227061 51727 162585 340337 456829
12151 456829 118225 92437 193685 131049 -77973 -44901 108871 -76070 -67994 -221442 -230436
12140 -230436 34343 203237 -17429 105843 -191110 345128 -77811 -161258 219621 -24046
12129 63214 -188816 129240 278022 -162439 -26605 38840 -193305 195421 89118 -27858
12118 -138771 38530 -3272 54578 36779 40504 -153418 1574 -72311 -44102 -210131 26071 161782
12106 161782 124793 -74546 260386 151460 -218123 87966 74169 -185035 196686 56171
12095 -175976 166808 -168983 326965 149266 17368 -119916 -221335 -1346 -270817 44519
12084 301197 -32906 50478 -175498 59402 411886 184157 -119902 226242 90615 -455754
12073 229340 -116347 16255 -82770 271933 -210121 89154 -110756 466509 1844753 1233396
12063 1233396 425563 20761 -49114 49188 52679 -103642 -84436 183909 -46269 -152936 -116342
12052 -116342 6872 117704 -27479 32203 -295893 -286006 1099 86395 -46703 -54132 -12957 206978
12039 228874 41634 -94258 -77351 -196549 -145993 -49668 155474 -55396 -89822 -1975 238949
12027 125868 6940 -144735 -129867 226715 -70125 -238708 -47614 233291 -243359 -17453 -287611
12016 -287611 307855 145468 113112 12958 424527 -57650 -117021 66720 -450405 -3859 -127538
12005 -127538 258491 331419 -94396 161632 -280369 -228621 -41312 -13299 -245174 -105641
11994 -18138 127334 252704 -147786 140094 -174457 -48749 121869 45273 135893 76786
11984 76786 -93930 -207499 -251540 -141331 -111377 229714 -122073 175699 -300644 235455
11973 171140 -141621 408888 -67110 161057 -317818 138530 160551 294944 71505 -152746
11962 -135344 -222432 -132789 -109582 -55005 -133571 98948 -126717 30690 53439 146360 10416
11950 -95372 116206 209863 321590 -293153 -185153 60650 218083 -41649 114143 -479622
11939 -87746 75270 -8754 151686 104875 491863 232774 158313 -16752 251537 -130335 189649
11927 74012 -135491 207442 -44507 1279 100458 4346 -201296 -3253 67331 -349027 -58964
11915 86147 85598 -167048 258184 80187 -61769 -71658 23489 -158837 -152351 -51418 363517 -17601
11902 1913 75401 78301 -130645 113582 495085 -233622 -112561 -72701 398560 -182088 222989
11890 185667 32440 -358165 109455 -473516 -84198 388337 207606 -62040 5981 151816
11880 151816 65844 -85510 203104 -240120 106717 31270 99429 -16868 -48270 -164608 104970
11868 -8024 -85846 -156044 -403788 -346156 -136333 379404 42272 -197494 179655 -107588 -228792
11857 -228792 36489 -143187 -63859 -77040 -64762 -111355 53890 -234822 77965 95108 -38945
11845 74908 194833 -50274 236087 102025 124990 -50052 -245906 20601 169895 -66478 -240811
11834 -240811 168392 30478 557598 1658 -164238 72204 -338296 -223734 174812 -32544
11823 -183225 138856 -93292 -285843 84263 -13130 -357503 102435 486760 13698 -243521
11812 -26466 -303092 -24547 -49417 208638 -39233 -174839 -97027 271000 -76540 155029 21552
11800 -238553 -170553 -133163 15740 -290385 -189704 -92357 -152761 172154 -101048 -190337 411179
11788 99245 -35969 -344481 73 125549 -98624 1415 -119695 -177826 -2101 -37039 -251510 93123
11775 -106904 -176643 -39732 60838 -152331 -236825 -55507 -308684 127735 279359 195943 -214664
11763 -25388 110687 -25344 -266053 279256 256471 -21357 49157 24372 62142 3536 131564
11752 131564 -36187 -101345 67747 60032 -28966 111639 34419 5714 47731 -361103 316810
11740 -19787 25784 14981 -91005 201891 -202814 22703 -130014 94873 -86762 -424444 215149
11728 -216916 -65721 -135636 -270619 -24152 302191 -8750 -141027 -321658 22603 414958 -35065
11716 -15849 144955 36172 285002 -51984 175155 166837 -200382 -108364 -279972 -116252 -283860
11705 -283860 -211563 -250368 -143394 64867 -102203 -9176 26620 124320 87649 292501 95913
11693 -460104 -297550 -191234 -76343 165020 147842 -453877 279926 14527 157840 154584
11683 154584 -77578 145576 338078 -90242 -8323 70364 -50744 37352 101528 -28197 26997
11671 210199 -228713 -108288 -125245 -32526 94213 -31708 228270 -244347 -284268 393234
11660 104229 -276906 116202 -62644 -103337 -91931 85625 -139828 -224743 68416 116234 -188803
11648 -79193 -64002 -123695 -176366 -144560 -537047 114988 -72142 -186561 -179003 -221441 323406
11636 136579 41859 19994 -33664 151061 236219 -135254 -199722 -31067 192677 12108 179448
11625 179448 67607 114460 70809 -1935 114705 130458 -99022 -137668 -389811 102772 -42072
11613 343772 278859 -201839 20555 -129596 314275 55628 -140093 -153997 -442175 -171727
11602 -64709 -135742 38696 97572 156542 148589 -75647 186898 -15186 27564 167468 -212516
11590 -200015 68478 65450 48381 -197476 623 170742 -147413 -92534 -55667 -376750 174455
11578 -116876 300963 -282494 -79513 -285610 -182655 -156094 109755 -202912 -20165 -40417
11568 -40417 42962 81281 51328 -293379 69522 71263 24583 87908 -36480 -95827 168887
11556 92584 -12146 -319481 -80046 67970 -105498 56725 43544 120055 238365 86834 132481
11545 132481 -213856 86278 17951 163701 146568 -5296 89658 55149 -100375 26124 -30422
11533 -82954 141204 62129 134146 187504 61586 -94185 273154 446987 115229 243037 -499865
11521 334884 -13096 80222 -5199 77616 96891 228285 50808 -105629 -213804 103391 -150106
11509 -16903 168917 382127 101024 -95465 80171 175519 126431 338223 -122253 329544
11498 141128 94181 100784 99139 142578 -117 151496 181789 -19120 270641 170489 -173343
11486 -188716 225289 -19033 267026 294490 199165 -46623 -196138 281018 50475 242217
11476 242217 20337 60692 -354530 354979 7382 471302 -71766 211108 268165 65084 308342
11465 308342 127301 -25969 197884 -1350 216402 274313 -184950 162132 79011 -137791
11454 38036 -126599 33594 -36164 96013 98049 186823 -162479 13627 199181 130833 198497
11443 198497 8065 334164 51586 -24517 225435 -175977 2580 -63597 -104470 36906 291489
11432 291489 184916 110687 184104 205159 -252278 -126172 44831 -259128 50223 257641
11422 257641 102110 -32907 76370 165953 46453 -85459 -57274 182097 32872 -26270 250268
11410 -35158 -114942 -9340 -54356 154202 192227 44976 -265767 -17656 143535 150056 -200341
11398 16257 -197273 15340 -187486 238613 115680 58254 -177345 -87549 17837 -172856
11387 140272 160171 239062 50820 231998 -258488 -7982 -32916 -185903 350071 27419 349992
11376 349992 -50074 -158573 167346 -149783 -48736 -256399 111763 19969 320459 -272137
11365 64930 238496 28642 28706 102028 -312349 103114 -46131 -117205 -39078 232862 -53124
11353 -209396 -370515 147305 -200699 71688 314782 23281 120891 296652 -77046 -94434
11343 -94434 -176458 -157144 -83228 46289 -301295 188613 -218052 -415616 -102321 -174587 44747
11331 -32849 401817 172960 -67720 -2182 -56290 -529590 83875 -60901 -46799 -31509 -189770
11320 -189770 165940 -118349 23494 -102098 -132475 -10216 -55620 132875 -92218 276729
11309 97331 115188 -365120 -20268 -401661 -235477 -301014 112547 -180153 32947 150083
11299 150083 -50087 87483 -163159 -51162 -230320 34944 -49309 -110591 73601 -293510 -7626
11287 -123801 86514 369049 -44878 56293 -229061 -117025 -106796 61893 -124698 -276820
11277 -276820 -137560 -119417 136161 202711 -206128 137285 -84162 56341 -102531 36679
11266 -257891 -74187 -22848 115934 160237 -237704 -225391 -145421 209657 80777 55172 -105612
11254 172792 356816 22007 -160137 54802 -122625 -96066 42883 -211498 221602 150502
11244 150502 104555 156968 55111 -139987 34101 -4383 5876 -221749 142174 -164315 -173011
11233 -173011 -121516 -434876 -61508 30867 -291342 -258640 -54352 -161181 55871 -256549 182689
11221 -145784 -198776 109756 -167130 34042 -58564 94519 -336302 -82267 -317378 -258729 210498
11209 -39602 -32385 363470 34452 32145 162115 -260971 -40403 189101 365363 -6408 -50189
11198 -50189 358 228627 87149 -194885 -262745 118225 -33995 -135918 -139478 182237 77863
11186 120363 -126623 -209206 152063 -246040 -68129 -68599 -63809 -247421 -81098 -18511 -63670
11175 -63670 150122 137085 -40793 -218288 -22923 -158775 233442 -75305 29759 215904 -136583
11163 169347 -115357 -99306 -78358 -98665 -133529 -41621 53059 118821 115530 -264800 -56672
11151 -183302 15365 -126432 -156067 291630 52631 81780 -49222 -274269 -75743 70022 -200878
11139 264627 185214 194554 82820 71147 -33266 -51258 -19260 175051 87386 -248999 111672
11127 -2036 -37031 94789 167621 -228491 -101331 80920 -223951 167327 -34366 194432 320039
11116 320039 235681 220851 -161416 43699 -157240 -131313 -27271 -112857 -139333 34440 97348
11105 97348 313834 210899 70139 88770 -7821 122805 179471 266685 -201156 245666 184608
11094 184608 347559 -143357 312812 173833 79803 24623 208554 330769 203182 247370
11084 247370 420318 -14343 75327 302862 378937 8630 395146 542481 38744 56094 243443
11073 243443 57075 348802 560012 195245 438852 312127 308717 340879 462777 465763 65822
11061 269544 368287 423815 33568 243509 170625 214830 224831 650840 575338 735496 681840
11050 681840 672295 555784 567762 484254 989824 408071 1133350 1018877 491525 525707
11040 525707 740616 577583 741735 380472 584792 593539 629280 729406 678703 672149 780336
11029 780336 576233 417108 989278 680195 554462 593232 666695 353548 395912 394988 758943
11018 758943 421577 391308 302218 442104 542844 612551 644044 512599 659906 703745
11008 703745 407923 646736 456309 507307 509777 506565 1172815 366617 816278 561329
10998 561329 614110 791547 976058 613831 730023 410599 546939 552472 404732 884332
10988 884332 497336 1067727 914277 1120477 782617 959505 1084542 754144 1257634 1260538
10978 1260538 1285778 1499199 1413732 1982394 1976203 2512558 2722037 2782313 2938618 2473272
10968 2473272 2167396 2183538 2140464 1452030 1654569 1621861 1134934 1317197 1171858 1443421
10958 1443421 1364989 1300541 1156031 1253874 1201925 1100629 561483 496658 207437 645857
10948 645857 446394 251112 -133789 259568 234932 343832 116429 92650 332955 219495
10938 219495 463815 -145534 -94506 230739 549339 174007 52851 266531 -13439 -335755
10928 -335755 8205 193374 -155898 130585 209806 117560 -150586 -99288 285289 155195
10918 155195 -336290 -26633 -128256 -63008 -232863 -7460 -55911 153417 -92277 -321086 -181874
10907 -181874 76547 -111434 -113014 -80180 85667 -408241 4850 8527 10214 -95873 -42970 -7027
10894 -3334 27620 -114402 -114385 20385 -163429 -305921 -102695 -153747 -93238 161815 18199
10882 -15805 -125392 -148526 -180880 37817 100867 -81301 19811 -265534 342722 -143497 7119
10870 -77641 -122385 32782 -198823 198231 -188764 1697 135024 46937 216234 -227959 -109656
10858 -31518 73764 18907 73076 152625 154968 -94477 249336 22440 -115984 -96964 -192626
10847 -192626 -51521 75430 181347 -394007 146378 -97711 -218513 238966 66919 -146307
10836 -131837 -6523 207885 251823 -163058 100519 -83733 174388 163660 -3425 -183355 -125573
10825 -125573 254206 91991 -44306 25072 113506 30980 186079 104287 -162633 -286639 -162254
10814 -162254 -603219 -111324 -404778 -203651 106791 229847 58766 313529 -188527 217997
10803 -81165 49546 -214553 5860 134428 -67320 -63073 126363 -13187 56198 76543 -239913
10791 -73082 240018 -308501 -208026 282501 -179577 172645 11439 -170752 -175977 120851
10780 -204275 61364 -264345 306228 113157 170758 -44351 -72512 -226735 -166032 -309889
10770 -309889 265322 -279841 -471267 -493247 -183830 -68440 -185559 -218759 -173111 -194444
10760 -194444 52186 76265 -174561 -216391 -161645 56492 -165949 186345 -209262 -20798 -524719
10749 -524719 98787 -279621 162221 -179252 -145768 206479 39169 -167796 -100871 -49765
10738 234304 -167461 -102872 -66141 -147753 -49589 248940 -148595 -4830 -203569 -182933 -102686
10727 -102686 -267925 165223 -127231 88825 -211273 -158385 -35154 36023 108853 -359541
10716 32064 -165958 -131431 -11909 214006 13131 -241630 -96398 -119502 -158788 -315918 12996
10704 -36722 -49407 -206256 -463548 383882 -426098 -450182 -147390 -54251 166268 -298299
10693 -94907 -29085 -120112 -19541 -136923 -53174 28083 112242 18004 53459 190831 -133443
10681 168698 -127966 375608 164690 -51313 113681 94801 -19221 88860 7607 284696 -152189
10669 69671 -222639 -269529 85761 -15145 12664 123262 -80626 -24719 -43164 238403 -73133
10657 -279033 -124425 -34267 135372 -85516 -14282 -70479 -322566 -45459 67555 -82546 165554
10645 29291 68636 404327 -139026 -301528 -104381 51721 3595 75391 -148697 67657 -263203
10633 -103965 -156023 95747 209832 -398339 -17719 -310494 353514 -480888 -167655 -257990
10623 -257990 47804 20074 -186681 -181622 -147975 110751 -277838 416007 -344124 105866
10612 254580 -4487 -88960 256716 -14018 -176840 416873 -62905 -223712 -446384 -104107
10601 110824 -430227 -39852 276207 -208833 119415 -181221 305850 -110624 32052 -205941
10590 -199443 15372 -80514 -48367 -150271 -167178 130230 155698 59613 94952 -86318 -46239
10579 -46239 62599 13510 -311254 197193 -172645 71448 25426 -233351 105477 -83420 -235599
10568 -235599 -307144 -207993 -37661 27526 60973 151994 75647 259545 -207482 283099 77297
10556 -27759 -132647 -202578 82752 412359 -75276 -101081 -211074 136901 -2264 -147081 298909
10544 -177127 -9936 -157125 26192 -214167 -10536 56497 -44314 -274909 16594 114671 -48512
10532 -180432 -211322 135161 -151556 -44996 139818 -26084 -44594 111455 -232443 -37995
10521 239394 75090 -60034 -82945 -192823 -180821 86785 139894 -74162 -102253 -400352 -155990
10509 -29330 -268720 -164536 -65413 -77273 -54299 -119407 -75288 27055 291002 71816 44116
10498 44116 162207 116132 -4551 90173 63376 -132842 -1035 70371 -35097 187377 -8345 -157416
10486 -157416 -102235 384157 -63542 -50419 188968 146915 114281 -153393 204896 -56786 331247
10474 122611 -115612 -245718 163803 142422 179789 44407 -120506 124278 -376691 -47461
10463 -62061 -120042 -72110 229807 184326 -230641 115582 76678 -61941 337839 -240006 394775
10451 -186419 20580 -228359 77217 -175979 166930 -246723 -67886 -60838 -7392 117649 336655
10440 336655 37779 203894 -148515 -17798 -137301 59566 -42211 182040 -171410 279257
10429 -108962 -150937 -145593 -4252 175287 274646 19442 -9090 333425 -141593 -146214 -317643
10418 -317643 -36481 128934 154331 10617 61553 -237384 93669 50852 12190 -236078 227266
10406 105392 -92160 -170971 -172344 -123663 -271056 -152841 -18192 -342724 -180735 -79551 -106607
10395 -106607 -98696 -88449 -213831 431629 233858 218441 50799 325094 319383 -101844 121955
10383 170381 205919 8226 134969 -117822 333702 -33024 159851 72868 64003 102438 -9588
10371 162039 36409 234102 104428 379810 314671 476295 521546 149097 333812 323146
10361 323146 436390 283568 -118782 309638 268588 482452 439466 45101 188583 185935
10351 185935 451297 638516 369251 124404 16009 309605 298091 336263 140990 476260
10341 476260 5181 211739 -86483 298327 326529 228841 -64210 -248712 308191 102765 -43739
10329 62747 295289 28117 -303235 133364 58577 -339819 228786 302221 250927 171646 235582
10318 235582 -225493 146209 -169046 429770 382693 -30503 422952 -259634 -152625 -193928
10308 -193928 -254196 -21513 -427955 -114576 357490 -325175 142991 -139503 -229815 -27025
10297 -4777 60865 -23634 -260763 -67581 30302 -54650 -4604 -187620 -108402 197017 -114680
10285 -18878 -312369 -50180 -177791 102183 -2723 -227407 38059 29995 -100364 -33574 224833
10273 -60811 -11081 -148620 139040 -268629 271421 -5779 -9781 -235738 -7819 55462 -180824
10261 -47145 -140954 180323 -25904 6313 193308 334650 190969 303205 -52475 202136 -50040
10249 159426 132092 -130011 39529 -21349 558562 -240218 -3643 -351540 -182099 158280
10238 146042 438836 164650 -91714 -58289 152525 47172 -31980 265977 66745 -227486
10227 71699 22373 281163 -260136 -252938 229250 -77015 -90038 -46999 -465152 64081 55740
10216 55740 -1416 -83796 151720 163371 -40133 67402 66213 -131531 88390 38849 2813 -60166
10203 73029 -24170 50174 -29471 -230560 30855 131788 -358956 110735 88637 -75845 -90889
10192 -90889 -283447 -305355 -34089 -237023 524784 -90145 -60690 28451 11912 -11084 -71982
10181 -71982 6270 -21562 287326 -270261 83258 92177 -45397 -99650 -76901 -91901 339117
10169 -65547 -15732 -180610 -97977 -353321 -240330 17939 -109826 -229367 -172284 -63412 -204459
10158 -204459 49526 -294569 -68098 183625 -268765 88465 -46858 -158414 -286648 -9083 -211318
10147 -211318 122355 -413477 135548 -98174 -305941 84434 -174525 -330024 381908 54667
10136 -14521 230093 259902 258487 123739 -116730 -9626 -74411 -190531 -203006 199537 147784
10125 147784 -88582 -8190 18583 -38526 328093 4967 -118252 350446 -81716 -154737 -95134
10114 -95134 75778 -118539 183559 -191160 88352 -119540 62561 -36977 123903 -79370 48212
10102 -171012 -73650 9278 -271677 -118126 -179319 -14355 -270816 78414 -155139 -110447 333329
10090 -50886 -213020 -392519 -222277 -346304 191031 -71156 88112 15575 -11974 -118212
10080 -118212 -59369 -291062 -189221 -24026 62670 -30173 -341496 266824 -212056 -218477 216222
10068 451550 2860 38429 156211 188228 -194042 65662 -118222 -122691 -272548 26120 239828
10057 239828 327683 -76650 -273696 -299959 -20328 -281027 155704 43453 -415265 -191113
10046 -141715 -56337 -179006 -267574 -158026 60033 19832 -332017 -191653 -57761 171268
10035 -76554 70729 43484 -4850 -14448 -151916 135016 -150818 31644 -165905 -73769 -318563
10024 -318563 -195419 251693 -203729 -70877 -202752 -418158 -166829 -29463 124158 -319498
10013 -11162 158018 40987 -119004 269518 125940 -42784 -179975 168206 -186026 -228120
10003 -228120 -104040 -372029 200842 -271756 -224576 25856 -290016 -285089 -103889 -37329
9992 -213378 -30201 91509 -57953 69890 -8274 -123535 97988 -281819 196662 -196442 -244932
9981 -244932 340402 148964 -201169 -300415 -288349 92714 110470 -98259 -162920 -333344 -14692
9969 -36564 170996 -47453 -97394 86897 25126 -213137 51391 -147907 -219531 -404856 269198
9957 14901 -322116 -144256 -195942 -94532 107361 -71942 -112465 -296477 -211688 -101837 162121
9945 -68324 195569 -227062 -62521 48432 -221529 -361327 -61604 -451948 28569 -173342 -445474
9934 -445474 -54004 -66409 141204 45852 -369269 -129244 -192356 126472 222244 88795 253673
9923 253673 -90425 192786 175306 -384347 -77699 -31632 32760 -611883 419692 397971 -220334
9911 -269973 73412 180161 -133641 -156134 -229917 -204433 77289 -27353 -167264 166318 15567
9899 -5647 -167873 82510 -142319 -101123 -96669 170710 175515 -281306 139876 -169143 -130543
9888 -130543 -152718 -146092 -231402 -126836 -352469 -225455 210634 313164 -238521 -100000
9877 30419 -136591 175610 46319 -299739 -18771 -8470 -57476 90034 70924 298107 27183
9865 63224 -106106 -205275 -146079 -209166 -196598 -83180 15070 -83530 -245769 45534 -115371
9853 8749 10195 73459 -203704 -119668 -59574 -117246 45924 -310924 -32805 -28190 158383 -20057
9840 -17592 -33193 -58253 -101766 -242733 -36804 92628 -183904 -93160 -119349 -78392 6821 -19060
9827 -40367 -79853 -197091 203471 60519 -141231 -50894 -84652 147019 83251 104957 191913
9816 191913 -60247 128279 133567 -315846 -39140 -291709 -26543 65998 101013 -96783 321183
9804 -105994 -490 -1729 -190249 54200 50225 63417 65339 -56706 198481 -148451 11133 214765
9792 214765 -171627 -126080 7093 -28970 -206591 -78676 -88319 -107556 111563 -97862 -73674
9781 -73674 130564 -297800 -104645 204110 -9496 -9497 -32878 -70671 189513 89379 -296417 190139
9768 -112424 -327130 -42323 -86325 -205537 238343 -31659 -336395 -316175 -29254 -35308 -266960
9757 -266960 -79972 -150073 -148665 -308498 -53618 94499 -195327 -10309 -86203 -118678 131241
9745 -318440 141596 -66286 -358432 109983 -226078 70614 105292 -355820 115937 144403
9735 144403 -401465 -62155 -280825 42834 -17767 9371 -196257 -168170 -155695 -22212 -86497
9724 -86497 -152106 -56789 123034 84614 -273125 137806 -98440 347219 -306800 -254758 133669
9712 -301869 -15616 45012 -81497 -143392 355125 181798 -140403 -138559 -321505 -231170 103004
9700 -144286 167158 -212838 -172936 -127562 -237149 16287 66330 -64956 88419 -135053 226163
9688 -283859 -473827 -16288 -26533 -158097 223021 175724 44305 85890 81702 -56115 -137235
9677 -137235 81431 -137524 84289 -218428 -428020 -123459 44866 -175126 -167971 101660 231949
9666 231949 -223186 233527 90027 -71786 4487 -78384 -236942 -218238 298829 189427 -120239
9654 44427 55901 -26811 -102779 -110559 269406 -160757 52715 -70237 -94420 -222116 -48280
9642 51419 -20580 -6210 -62256 -239423 -449235 -58270 -389621 -82976 23012 -153740 -25815
9630 21843 92227 -173764 47974 90245 -7143 -247952 -8758 222993 10651 -6398 -197474 -393293
9618 -393293 -197987 -247512 -235226 -278135 -313572 -356855 -68701 97011 -161170 241621 -325515
9606 40981 -117422 70853 30902 119617 -293466 46396 -23094 129380 -254337 -374404 53821
9594 -340 -96827 311038 -7148 229700 92674 -20634 -234811 -332266 -100576 -283783 -36552
9582 -32614 -179071 153336 80084 -210416 -73647 -161698 -170694 51178 -188877 -85506 220934
9570 -157279 -17323 -87159 -370384 -154340 -342934 -63482 -76485 -10933 293539 -66110 -436336
9559 -436336 151655 -261557 126549 97484 117372 42292 42278 -158429 27564 101600 13049
9547 -193965 -49676 64926 73744 -17551 -242927 -101450 13157 -137837 67102 178224 1623
9535 37529 -136258 -177821 -202589 147261 -381442 -107597 398469 -324480 201792 -259589
9524 91351 236072 5508 -232871 379502 -111775 31621 -123465 -147402 190687 -568262 -237252
9512 -111958 10157 -112809 54287 31892 -71529 -57884 -367490 278852 -115213 -413718 -103484
9500 -342520 -59715 121714 -131840 153474 44556 -49001 -293013 -85800 -73027 106827 115130
9489 115130 -12732 -150658 -2494 -244839 -127401 -141931 146071 -116764 -27037 93832 -51905
9477 88798 -20330 -158538 -109075 -375711 21113 -192050 193135 -118386 -321502 -21147 -365698
9466 -365698 161244 -32655 -28823 156350 328857 249065 -188076 -165878 283131 -94108 -275016
9455 -275016 49378 -254343 -90027 -33152 -239197 -295857 -33740 -400871 -27175 -15345 -189644
9444 -189644 -138327 -409274 -174763 -99950 -199178 115004 344420 -171433 -189378 -348869
9434 -348869 6834 145117 -53999 59639 -473066 -36929 61382 34506 -2397 -43436 -122738 429547
9421 164433 -79849 98454 410640 19933 -107852 -135610 -58025 55467 -444533 -180830 -161443
9410 -161443 224444 -360873 -120291 -75582 -406210 -115553 -249713 -146693 -138625 -68977
9399 -58225 107744 76767 -182000 -173530 -256106 33788 -149933 169207 -153590 67291 13331
9387 -109305 -28034 -11807 4663 -27640 -110648 271568 -242726 -172383 -70803 -70684 78290 113521
9375 113521 6859 -6859 -176169 27978 -169858 -114530 -252833 -124598 349220 268077 62093
9363 -35378 13912 -323736 -99754 -150797 110618 135632 -32103 -426395 124562 3434 -170078
9351 -174435 194070 -241413 155826 -41465 -119850 10351 72212 152665 -202699 -13635 -241293
9340 -241293 238928 113105 192489 -186858 210599 189783 -34540 71466 -319100 -152812
9329 -253116 -215316 299370 -312980 -54852 -338442 -309025 141591 144948 -272367 -252506 -284524
9318 -284524 -104357 -100821 37989 184056 65180 81800 -179373 6681 220488 -170997 -71932
9306 173637 -295152 -449956 -273351 62983 -124352 -231059 -249664 194798 -94324 855 -160956
9294 -174010 -145821 69398 -137452 -133128 -252819 60471 -210309 -101330 -231 211800 110617
9283 110617 207205 196977 126345 -154801 31247 -334957 -156773 -123455 -92635 -38071 -160618
9272 -160618 -234554 -279065 167022 186687 -12396 -40783 -54443 -45544 78494 297597 51784
9260 -85654 -88608 259237 -149567 225456 -123948 183735 -179363 135157 -29377 -280634
9250 -280634 -397367 -37886 -230806 178369 -198245 -174403 202537 -378190 -142817 -73969
9240 -73969 -64816 305061 52425 -324540 -83739 -152713 -25800 158153 -347004 164166 232067
9229 232067 -105140 -14322 -216864 158080 271238 -99977 -184744 130349 -461394 -84747
9218 -183416 74780 -73391 89763 -33133 -91704 -82657 91743 -126426 159089 64813 159304
9207 159304 -42423 -61981 -261380 153603 -303388 -298560 121644 118 114081 -442719 -182114
9195 -93307 -75704 267666 -118032 44124 -163652 174345 -75635 -142128 -40816 -209572 -165716
9184 -165716 -164304 125064 81060 -98125 252137 177383 -38129 124062 -223211 90886 37469
9172 -70734 -139803 -295412 -124795 -338083 -492730 -315664 -122939 -338235 63194 -143064
9161 -331672 -308102 -44856 -176714 -156731 87415 -275671 -115299 18959 71804 -46001 44436
9149 -107277 16194 176978 -154325 -90618 142908 66249 -6432 -305853 35119 -95786 -69826
9138 -69826 6612 -663602 -47800 110274 -49722 -248423 -498476 50042 198555 -249972 -369794
9127 -369794 -515802 178619 59894 -77062 68512 377890 -15336 118045 -236936 -72029 117974
9115 -238549 91073 -185572 -258700 -196843 -339967 -158742 -16062 -49703 -242186 -80047 2603
9103 -168595 -81208 -191401 -232066 -148492 -223538 -94842 -40249 148381 -78321 237634 -186775
9091 288381 60364 -283488 -177691 140261 153394 -197750 -84453 -335017 -86080 104964
9080 303992 262288 268681 228136 -85870 375747 -188863 355810 141634 -163241 -60234 -209344
9069 -209344 247972 -158569 -6541 52607 61339 221152 167122 -286139 -169880 -42911 10530
9057 -520199 -154137 -97152 64516 -56721 -86786 149935 -9542 141077 -273232 -306048 376420
9045 58237 103523 -224174 -171397 -120603 -200 -124779 -17918 78623 57452 35477 247670 -12773
9032 -235027 17089 -182188 120806 -249904 -39218 -57747 -212416 11894 -80595 -39446 79430
9020 -42535 2114 42758 94552 -158055 105956 -249839 -64394 55198 -133727 10554 243852
9009 243852 -56553 -62027 -260715 -162713 150374 85863 -87292 -332327 5557 -87685 216969
8997 -189232 266919 -4753 464215 170463 -65498 -135165 90035 210858 -11448 135095 -257994
8985 207971 -97266 26828 27069 -184292 -105000 102206 -309759 89716 -31561 -12240 -195122
8974 -195122 354899 -134491 -234882 10636 -192250 33005 -82076 -88122 -11694 -154518 -305468
8963 -305468 -207053 164931 -397695 -247708 81429 -147556 -301022 -252534 -237511 -241655 -298021
8952 -298021 -190436 112700 21496 12928 -243614 -86796 10839 -110435 -15038 299385 98528
8940 -99625 -150078 -24841 237873 65580 228542 124340 362187 -64923 45434 -244683 71846
8928 -200975 385534 -77591 195346 334961 504441 1581495 5000616 19928575 7607464
8918 2000796 699788 263623 360012 214539 99394 402440 57214 -483675 117541 95464
8908 95464 317091 343912 65450 319109 -347845 -464921 -290322 -49813 105364 258262
8898 258262 -38813 131463 200010 147024 -147222 -118582 282332 -20424 -70496 43399 202158
8887 202158 -23409 -34839 -168762 346843 -171856 -45848 -294391 28076 342574 243959 -96307
8875 57000 133415 202729 -142284 -22923 -84605 -84319 79025 -63926 21751 215555 -157129 39316
8862 174900 70972 -151880 -203331 122824 360684 -431041 104979 -43477 49378 -45913 29438
8850 88197 63406 129163 -189602 -397773 60231 -96103 -87089 102221 -98256 61340 -106858
8838 -269345 -10065 -212778 61842 -75595 -135334 -168336 -43230 -95825 -162467 -95648 123998
8826 -324951 -240654 -122664 -99605 -104608 -172259 -335022 122565 -146570 -304214 -282592 125966
8814 -124017 -38580 295076 -185063 -30702 123902 -140144 167779 -106571 45831 -27530
8803 -420079 -45636 37370 -394724 -106357 -197218 315497 -18487 74280 106400 -148580 -62427
8791 -276375 -17350 196725 -14895 -53879 12751 -231989 -129645 -18205 104910 231888 -153010
8779 -208185 -133573 -291967 -147003 79912 -27626 -97615 -22824 -327019 20155 34189 -302292
8767 -56308 -130364 202357 -96915 -345466 91832 -92006 -19071 105252 -51232 -79201 -188601
8756 -188601 33685 -193826 -82459 26920 13888 -466630 -402192 -71924 97007 150604 -66506
8744 -53517 -81769 -129764 -73931 89616 6131 -258684 -268952 44335 240522 -20304 -46061 -332269
8732 -332269 601 107234 -254107 -4920 13271 -35298 -6934 -18232 294155 -24044 53733 207119
8720 207119 29071 -17282 -161254 78087 8738 -290921 145478 -155038 -221637 -126674 14561
8708 143872 88258 23778 83171 105911 46638 -13925 29909 159238 202986 -79029 -485841
8697 -485841 -398722 -50265 -640422 -329229 -422582 152635 164908 -92374 -16564 -96110 -227631
8686 -227631 13090 -104944 92504 96138 44370 -60282 -369791 -247378 275737 -5349 192755
8674 154753 -46879 -305594 9691 723574 33901 41806 64012 -117686 91384 -50092 -110673
8663 -110673 134618 -275014 10025 -103748 -147813 12706 126379 -58361 -78067 -111799 -220436
8652 -220436 -251780 -100765 278907 153716 -108884 -24765 -308388 -16278 -82533 32907 -143470
8640 -67201 -136870 -433035 -90167 -174968 29704 -162845 -151548 -209700 59233 7293 -284543
8628 -90976 175561 -122652 -216769 3965 347919 44056 -150969 -328615 -226526 -95711 33052
8616 -89529 -237504 -153721 38473 75742 -47330 85597 -195199 -187752 -102799 -164315 57123 -52554
8603 -211452 -147278 169282 -232281 96235 -133318 -52751 -248223 20847 425457 -111699
8592 -25381 183980 -47069 -74828 -208330 -84191 2988 -381028 -188983 127394 -12244 -126751
8581 -126751 263014 -230740 114486 154873 -201755 187929 6623 237342 190701 -171490
8570 178057 -239943 -53236 -166730 -284702 -391025 269326 -151330 -344323 -89812 -71386
8560 -71386 -108182 -342024 180533 198827 5775 98495 57229 65997 -367799 -284842 -53859 -245466
8548 -245466 -96112 145939 -61626 -179417 -105583 62082 230195 -372325 127354 -141816
8537 -52375 -66012 -216523 -93160 109828 -113613 -75843 -164189 -6113 -93548 -99623 -240161
8526 -240161 38151 -88061 149035 -145471 10306 -334942 126692 43245 62276 100897 -271258
8514 -249176 -207057 -68145 -105815 -27003 540777 -196686 -132347 71706 200055 -57773 126567
8502 -83739 -119569 -113112 -262888 -12755 -275194 89814 5821 -38737 -32621 57421 -309302 218043
8489 18559 -38544 -32079 -272323 -214077 -66857 -253450 -105087 -99084 74286 -79483 -344820
8478 -344820 147416 -49978 181382 -116004 20672 97709 -207178 22395 315042 117823
8467 72579 -160871 232798 -382798 -157578 197724 -90308 -192561 -109066 -67085 55073 16298
8455 -115453 -168062 -23140 14734 -126711 -137362 -142747 -90594 -162915 4149 -31248 58847 222704
8443 222704 -6919 179153 -10913 32978 -92383 -31509 171128 165591 -83310 374115 121490
8431 85296 264514 254067 104606 -88950 177673 165887 22774 -235895 -95689 -114775 -62626
8420 -62626 -41300 143037 -26293 23569 273 -308276 18366 -185643 -522459 160764 178002
8409 178002 29695 88164 105574 161729 -160048 30570 -31881 -107550 195917 -278773 -115237
8397 311604 -210708 -306227 -66055 26211 -64462 -311960 -202181 46554 -81082 135480 -226477
8385 9897 -193820 -191515 -61742 -223996 277423 -100119 355781 -188656 -17681 -66448 -44460
8374 -44460 127393 -203804 136567 -170631 126480 68326 10448 -134274 -83390 -151686 -114755
8363 -114755 -46024 -307878 86292 -229357 184430 127879 -96986 103542 -421157 -38410 534002
8351 -98920 62456 -3697 -164157 79071 -312971 147742 178193 -345930 -19717 -284059 130451
8339 -37344 -395840 -195389 -179518 202953 83893 -474244 313666 -330318 -75706 347614
8328 68894 -110574 -193702 -145962 -150781 303691 -215318 -107033 346008 -41659 150875 -293769
8316 192487 -46013 27913 -21415 46861 -39800 -63581 191542 -17947 59011 -193418 -154928
8305 -154928 -93880 -272674 -127804 53019 -83057 -232141 -478100 -231534 -328366 -108271
8294 -38211 -145032 74326 47461 -249485 181291 189685 -204261 111709 -205948 -251290 161192
8282 -218717 -213829 -82681 -59500 -58459 143421 140666 4046 -176591 -2671 77354 -381761 -382280
8270 -382280 -357295 -53538 -435106 269180 -140212 -290173 7391 -6767 -176040 -217613 -176882
8259 -176882 -86933 -107850 -169912 -215101 198690 -480 80919 -287509 -220305 421924 238656
8248 238656 -8832 279546 25696 -171528 -3371 -223730 -208269 -259069 -117430 -330306 -250195
8237 -250195 120411 60576 212645 -252393 -222229 -329639 12007 52309 24600 -14581 -324758
8226 -324758 -338831 89858 -163063 -204362 198676 30344 -139708 -109735 274132 -207576 136850
8214 -3402 80248 58481 -79971 -15028 -312847 110176 90065 -223229 380212 -50640 12586
8202 219660 294138 49054 38979 16182 -214243 -45393 72432 -97371 -200046 102583 -292830
8190 172028 263394 -373900 -168182 49736 -168185 163264 98889 68340 -223023 -162881 -166794
8179 -166794 -346413 -250374 -300718 -375392 -7232 -263479 -225561 88817 -247951 256988 193946
8168 193946 -112975 283614 236058 -28860 -63522 25467 101742 -134228 86234 344270 -240484
8156 194291 -216347 -7423 -43621 275543 299611 129644 401581 -6856 71506 -151797 -263439
8145 -263439 163000 283320 -335210 -112736 132046 -72006 -206091 -165913 -71299 90836
8134 98621 26562 -380118 -199150 238218 -110974 -44951 -104016 -30046 -195092 -35420 -177746
8123 -177746 -167331 485411 368010 -404936 -143805 -323124 262856 -112341 -15283 -367092
8113 -367092 -293793 -198689 -185714 -49028 194051 -88535 -93516 173741 -165215 346560 26519
8101 88627 62094 179684 -177835 143062 -368342 -95914 15835 -309199 -216845 -190036 -24703
8089 91776 233153 101326 260020 61686 -86615 117466 222290 3901 235531 -150438 -306607
8078 -306607 -354554 -190404 203772 166993 -62923 -2313 -187456 -68261 -194286 185075 -103526
8066 -185491 30699 -381603 226693 -119369 -89805 264762 -371917 23181 141022 -334370
8055 -219701 108002 212555 174951 -202596 51912 97808 -147820 -21422 -117775 -60574 -72409
8044 -72409 52195 -251234 138606 -89750 -112707 75701 -173484 -201175 -4958 -81241 -99578
8033 -99578 -247241 -416934 -261318 93802 -74756 164642 5630 209017 135130 -438390 -4028
8021 24315 246696 316840 85275 190734 -270352 -374047 -293709 125773 -331377 343417
8010 189907 172151 -186399 -304177 90125 55084 194223 69420 129439 -157621 -143597 -22308
7998 -31260 60644 -34248 -181805 -127342 -73257 161659 77698 109361 14233 -38447 191940
7986 83584 -212576 -47088 30189 -5093 -14358 -127181 78360 153883 -494761 -108484 -92007
7975 -92007 -151629 -286092 -412351 -91414 36764 -228463 29095 -279138 267635 -124915 -159744
7964 -159744 -165322 -18106 314837 113567 -2935 -141090 52589 -421431 9567 243180 -202784
7952 -108390 16236 -22836 16208 199934 -66345 70187 -212087 -168035 -392431 180567 -292834
7940 -36633 -106750 109656 -196742 98149 -67294 -18704 -293104 -17137 76904 166941 5925
7928 -377123 64949 8544 36702 158178 468353 228850 -54902 -284667 -64601 -123834 -123874 -237707
7916 -237707 154531 29514 -297309 253134 140402 -246360 -381077 -128011 -142832 41292
7905 -222143 -96882 -261522 -87774 100193 -152544 -152293 -172660 -54112 154139 -361590 24237
7893 -7947 138841 -154055 41766 -152164 231462 50730 92753 81192 -26948 78349 -150569
7881 -297419 98564 -198093 -157521 -212552 -282138 21375 3163 51166 -155841 -231581 88939
7869 184871 -191571 -40323 -41190 58148 -240513 -252090 368774 154875 41514 -163374 -76331
7857 236097 -287662 -313647 -20986 146229 -97158 -44892 450737 -224757 -213998 127958 29342
7845 -64658 -273931 -159956 87490 -103102 -94207 117303 -188122 -68107 213963 -8051 -27268
7834 -27268 -101738 18959 15249 329030 -189986 163650 47265 384526 118019 114475 -33963
7822 -245416 -20258 -274500 102633 93167 -233689 322728 5483 -295507 197250 -103353 -9564
7810 15401 -125414 -124234 297400 3282 -219804 27913 -254985 -3695 -86852 83199 -111170
7798 122311 -58115 230042 76054 368076 -54869 22178 -161432 -23712 65202 -153037 258300
7786 4316 106387 13242 9190 -272245 176036 -120559 -92612 -200514 26965 -269207 72289
7774 -117559 31869 54348 195573 58222 -4977 -129677 -178470 -93735 62235 24694 62323
7763 62323 -148946 1596 -218909 -11833 -40785 -134557 -201003 215512 -197284 -392380 -261880
7752 -261880 158814 233516 9489 -60482 -306802 -116928 -44374 42582 -194960 -167529 -166300
7741 -166300 -233246 -39007 117853 222885 99401 425585 89880 14188 137013 -116579 -179205
7730 -179205 163644 -104086 263525 148375 -55727 230256 -127780 81317 245110 257981
7720 257981 -20050 -86024 -20272 -43940 198094 -96310 -77298 54052 -3220 243004 270769
7709 270769 -243324 -197395 101558 198803 -123425 65379 -96968 -335830 26759 -172905 -162159
7698 -162159 -71025 146886 31635 -219345 -34978 -297926 -15388 119470 -222573 -68236 -179515
7687 -179515 -142094 -46745 -74191 154840 152474 16503 -134535 -9323 -152474 -100984 -139047
7676 -139047 -144179 -91814 203716 105737 -199305 -239766 -78623 51270 -100650 -193555 172652
7664 -239089 -109429 -71884 -243533 -437523 33450 288567 -546582 83005 34885 142857
7654 142857 -307736 -10647 102026 -147530 54516 -102682 51941 201806 -4342 -9738 -200341
7643 -200341 94697 -83238 271722 -37200 -78140 46374 -146384 33471 214334 -265912 13033
7631 -532497 34700 -177767 -188956 242920 3589 122221 111777 -228667 -71336 45309 81403
7620 81403 168942 67874 -127427 -134641 36496 11468 -167866 -129412 -202167 76101 -46858 -57551
7608 -57551 49835 103653 543 -29938 75152 208264 38318 39603 24257 56032 -176283 -313743
7596 -313743 -322794 -97108 204262 -56177 -168720 535800 -388838 -26275 -106446 261161 -80210
7584 206877 -181331 -304408 -398620 -64497 94583 -178478 -16840 -56447 -259453 -309275 -207803
7573 -207803 -108711 -176932 14476 -219280 -17478 128268 -147794 73024 150213 62344 -168810
7561 -340000 -169950 -52489 -391860 -70067 -70500 125592 -197708 -216104 -32391 71053 -232867
7549 -170368 39200 -96709 -156406 59291 -263399 61419 -242501 -77945 55834 20374 -151163
7537 9154 -154366 -71723 -113140 211554 82615 -250978 -71684 -458776 -42133 148030 -335685
7525 196616 169251 45301 -15026 -102092 -4896 -142794 -6302 131068 130368 172406 8403 95471
7513 95471 130415 9562 3715 -129841 -59093 28259 245441 -106305 86171 159456 10085 -255899
7500 7064 258309 52917 197111 -226276 -256150 98703 -91290 278054 65648 -72696 -304798
7489 -304798 -16298 119345 -62874 -97828 -319681 22876 -200722 -109214 -287069 358664 35890
7477 13155 105107 119834 112238 -224848 -80217 -10971 93294 142878 83000 -146280 84541 -57578
7464 -139854 -125369 148005 156768 96077 -81097 -301975 130338 -94867 -140083 -170281 -70218
7452 -57177 -24487 -174085 172258 -94414 -58397 104199 -45245 -307572 104405 28263 184536
7441 184536 -205446 -34819 -83919 345683 132225 40054 71494 16739 -236189 176091 -170935
7429 36571 -123464 -269645 157470 236531 -145168 -233166 38394 320893 -82937 147446 -18094
7417 -160412 138012 -124016 -47149 45382 -16576 -17255 -32889 -172198 -84648 -86789 -137668 -140044
7405 -140044 -199159 -67197 -238552 -122566 -145631 -243281 168339 13407 -14802 226238 -26993
7393 -41879 -93666 -99903 -13696 82804 -142256 -236350 -96272 -52929 67694 -296461 -35920 173661
7380 170525 -179720 307972 410831 -365670 -112819 -310225 -230750 -173367 -450680 15384
7369 32385 386562 -61372 -26589 -58593 185113 119079 68240 24783 69796 117305 -183214
7357 -277752 -94786 -132714 26629 264502 -324426 295212 -129644 -244574 -196837 108165
7346 -103799 -100095 126791 125354 18500 -180484 -26286 -36301 -140682 -47868 -143082 286305
7334 -81712 74323 -93093 -53356 -175811 153312 -129830 113919 130200 194305 54878 -134669
7322 147697 239461 -73601 -237157 82489 66568 208703 -253797 -90053 121758 -399396 297685
7310 -229678 58288 464689 -274617 177499 108911 73116 121425 -160962 146437 -203126
7299 -276434 132237 -303265 -210165 384341 -168250 1173 -251359 253131 16428 70778 -155565
7287 173385 20150 -334445 -331752 -37944 -374258 -119743 -55636 -42965 -372618 7445 -23956
7275 70817 -377924 -197957 72271 -167742 106137 -11600 275826 -12507 -4132 313952 -183739
7263 447676 -161274 46157 139538 331202 -49721 115313 -103422 159525 -325432 -234404
7253 -234404 87262 -349411 271440 142313 -13453 -447250 42614 81626 131914 -142751 -24427
7241 56578 -63810 -103682 71666 -89349 -54764 11879 102081 247474 50391 -376970 -138548
7229 -10218 107662 -7247 -88950 150272 -98483 2712 91684 -26712 -295428 -75464 -333650
7218 -333650 253621 16363 33331 -178869 -83811 -96123 43871 181618 25883 -94246 -113611
7207 -113611 -136637 -102926 -330216 164314 187319 93615 138435 -21275 82467 -369494 -167599
7195 -96194 -191301 -23476 -295808 260547 -190246 -530 -352405 -14835 161707 201967 250404
7184 250404 -55335 -19195 -47911 151784 -9258 -86599 -241764 100897 147559 -72364 -114753
7173 -114753 -157530 -57580 -26573 -209233 126079 247007 -65843 220645 45797 -231316 217142
7161 33244 -72759 -61032 431123 -254328 383142 -38351 -96510 -263743 88305 134882 -74659
7149 -198189 10262 -376918 15357 61048 12117 -143334 -106002 43411 -41817 -153809 -143742
7138 -143742 -103768 -108070 -96932 -327669 76443 62037 -4600 -405562 -29698 51936 233082
7127 233082 94794 -33899 -176402 28571 -7112 140846 -1700 155849 244164 102285 -77035
7115 68731 224325 -299835 1267 191786 72255 -39157 -264449 97042 -116850 -24505 60727
7103 -100453 -189086 -314721 82223 -50064 -23832 62023 -206119 111756 -237785 -340329 211275
7091 -123173 -87504 -320552 -137029 -117580 -188597 -198659 -79116 36994 -69315 134570 304934
7080 304934 152734 75718 152515 -376709 -134628 -22619 -159601 -255164 -16497 -207763 241841
7068 67619 -84232 15373 274383 37869 125684 202698 117472 -200378 305201 -6270 -125625
7057 -125625 -461705 -67271 -172358 92933 -115080 -367449 140922 -194242 82271 141564
7047 141564 -54195 61860 339592 206564 82353 257484 -346126 63462 -89276 268828 417670
7036 417670 58976 -165049 77977 -103508 233173 48346 137282 -43105 -35332 68533 -186020
7024 69268 -22877 -276358 157886 -108337 -147673 -264845 -57181 -271707 150168 240586 -247327
7012 11481 155040 -144545 -24576 130886 -19340 17657 50442 -220177 -181520 -7088 -377380
7001 -377380 -152456 93351 -332028 -28829 -363448 129520 -361398 101270 100339 -173900 114402
6989 380606 94334 82515 -203172 158348 -131909 -68563 -381428 209626 -77747 64474 110568
6978 110568 34336 160802 -18214 213118 117867 -156953 7709 -94959 -35042 -208838 -245058
6967 -245058 -457199 3515 -40850 24987 -98347 -21960 13395 -60971 210516 -234040 -287964
6956 -287964 22664 86329 159931 -21221 72567 -99448 -6266 -77123 -126139 246252 -243079
6944 -144565 -220729 -150170 -156109 -121541 -138110 62557 220477 87278 -359997 328044 -243382
6932 -341731 69893 197248 146679 -66694 -212568 -65332 128340 28537 309174 -9854 343455
6920 -210759 21464 389096 -54897 -165863 -300881 187995 237940 -96459 93021 16366 -15345
6908 -9921 285787 134451 48335 59398 -56587 -244704 -131108 -232524 -100917 199821 -42528
6896 -242007 -186968 63584 -102246 177663 -517014 290386 -225100 37590 130517 -178661
6885 -29498 -200267 3069 -191239 -281607 -208199 -84869 27561 -75138 -59042 -77220 72120 -119797
6872 104707 -128458 132242 -267507 523994 -43887 -158773 -255073 -314422 -326212 -292184 -91108
6860 191711 93209 171453 -90887 -121123 -71864 52411 298943 -380140 56726 -182032 -189180
6849 -189180 62861 159200 58479 185264 -9877 -302932 -88079 -123454 -87833 50738 -209131
6837 182720 -21650 -69821 312705 -408639 -107341 118741 392514 93020 137475 -65640 41620
6825 -68845 -144198 532116 48528 69330 -186391 -305860 109417 -239976 68072 102232 296124
6814 296124 138467 38773 -134681 -37775 189473 -264802 33736 -18836 -57257 255002 -226017
6802 -27226 237173 221029 134270 39703 114736 -129886 -113443 98894 -402571 31897 -203054
6790 357567 265758 118405 -24342 24491 18159 -121204 -109584 233851 -120449 352251 -76120
6778 -63515 -24919 -87506 -95224 41132 -11530 208230 163259 176022 195123 64253 -125970 -79779
6766 -79779 322945 -72621 25633 20816 -89090 -123225 81462 -439232 -89674 -64395 -178950
6755 -178950 158144 -461232 -102677 62768 -342120 -178608 344010 -165217 -86761 142714
6744 -23713 87126 372033 -84536 69100 -43714 34052 -183079 -341931 -497309 -265588 49036
6732 -18739 -159976 -45704 -124297 -171968 -152212 197292 -70813 60750 -276935 239669 -305891
6720 -50862 165964 -970 -215684 -187697 -302279 -3215 -20135 -199923 -134150 -54429 -190151
6709 -190151 127978 120778 72298 -10223 -115942 65951 134919 -172106 232670 -226893 143549
6697 183493 32257 -223390 3006 115208 20266 197004 -65958 -65089 -74440 -129772 103725 -14867
6684 154592 50167 -88552 129394 -176999 122022 -292324 -135346 -235367 128789 70764
6674 70764 -73891 84189 -158209 -178107 60457 -123608 -294774 327655 57590 59077 417192
6663 417192 -71024 -102776 276504 -13898 18630 -20249 112461 -119476 155555 -168202 -173945
6652 -173945 -73900 -100146 -179199 161437 -66396 -171057 220822 -74537 336425 113466 139498
6641 139498 156001 224881 13817 43280 110755 -145566 286449 402572 -204538 45239 129998
6630 129998 198057 71474 -108330 -54107 -98427 23022 -53263 -55979 -286805 -27301 191626
6618 109421 -36413 69379 -408684 -34391 -140595 7657 -21208 178312 110870 -53569 -206877
6607 -206877 13459 264538 -309250 -25699 -119534 69362 -36738 -303687 -27823 12297 -126722
6595 267853 -71016 39829 81322 -273488 -93424 -126786 354814 33086 -144708 176426 -100556
6583 322691 146157 -91191 86178 -3064 -266713 -166312 159876 125834 146706 117492 150929
6572 150929 58032 31973 230948 -418574 -337612 29260 113141 59997 -172735 -70946 211088
6560 -153388 -103792 -131233 100058 60390 -199723 264199 -263458 227827 -90965 -161649 -282809
6549 -282809 103678 124062 130505 -80041 -58058 -70186 306485 -272925 -213797 -175047 271321
6537 133683 358380 -19819 -222911 282637 34025 135439 77230 -90924 -269298 -136053
6527 -136053 -65922 -164654 -5421 193627 -198698 -227100 191008 -153115 -150723 -257063 -97697
6515 29125 305194 -145094 -94172 -87309 -210539 76819 -209043 82461 -367221 142760 -88820
6503 -144165 -88452 -153180 384186 -245228 -287910 -281743 -147266 240592 345199 14763 182031
6492 182031 52596 -96167 64205 71855 -121550 -334847 -172687 -84216 -33519 148879 28424
6480 -15751 -173821 -248876 -374381 -99462 -159555 100276 -170963 216072 -140170 -292181
6470 -292181 -110285 220361 -359237 9568 145187 110046 101420 -89945 185520 328616 -197615
6458 -35853 221584 454063 -95977 46914 -129634 -59503 -68823 73468 -130931 50461 -146240
6446 87927 -283722 -323311 24958 111824 125813 101926 162435 -181581 9719 148916 -298421
6434 109501 -60966 -65025 56560 54326 -21271 85972 20770 87303 -143313 -162593 106567 -199676
6421 68408 -107416 -49752 -298288 -462672 192489 39997 -236494 110715 263229 -60682
6410 -33552 -213862 12707 205299 -192062 -243438 39650 19551 90413 210315 33757 -26519
6398 -15781 172304 233586 -155415 -222412 -179032 -184048 -102494 -113463 -334261 -27495 95967
6386 -194006 80892 -71298 252208 176558 -13528 -39637 -63217 -156981 -49020 259340 -159045
6374 -87456 68539 -121752 130945 122731 -148074 -304054 -335417 -88380 -105564 -70231 22459
6362 -3753 -30892 269015 60640 115394 -156213 -131974 -9136 244807 157915 122 52683 8925
6349 187062 66077 113349 -248492 64167 -106753 -223746 -171738 -43119 2252 -225605 343632
6337 -235836 -245332 552 -16668 -1616 -331613 186417 248564 236480 108230 17838 -171250 -217408
6325 -217408 182304 -168792 -209136 158928 143402 -242902 -87266 -59558 302416 -93755 204419
6313 169084 136660 -169077 -418215 68910 -239115 119048 90261 -175072 -22465 -134490
6303 -134490 126872 104759 -43251 -26499 101820 112565 -207623 390288 160723 157871 346910
6292 346910 -281959 -100671 27349 -221723 -145484 48740 -53556 143812 -63765 67158 -57597
6280 141258 18961 40983 -135104 -100651 -478414 -123366 16600 -122630 65118 85476 212486
6269 212486 -154575 -73690 419507 97540 194990 -100665 -212715 -150879 182071 -111529
6258 -150703 -116130 -94763 -126845 70924 20793 119235 115090 117664 -123500 266941 -174530
6246 297024 189381 -121706 30462 -50767 52701 -142541 -31299 -35827 50741 -332557 79072
6234 -107587 91850 58271 -89186 78699 -30201 -290204 -4320 -176948 63031 251176 -11329
6222 285661 168665 -84373 -148714 189033 7158 -63806 -7615 -256933 65271 -182008 -71074
6210 24356 228204 167977 47686 8924 -236199 -18159 151368 169628 159232 57743 -140113
6198 76955 205505 320567 91910 -238252 -279802 -1876 -2173 99626 120915 -87898 -31116 -217891
6186 -217891 -32194 -44656 9757 58965 529815 -114065 -79427 -182641 -320793 67849 171442
6175 171442 -13930 -17321 215737 -343994 -24203 -202894 -127327 -278463 11818 102606 -75005
6163 302355 275678 83174 90459 -62631 -82148 -80077 -57874 -49780 322706 -9306 -31716 -139855
6151 -139855 -34904 4381 -16137 -263664 -15079 176890 321371 57284 76971 33100 282832
6140 282832 -136102 29689 176653 168708 -182462 -57079 98916 -249222 -62504 195555 17328
6128 237071 188169 235989 95654 -115921 129904 -141633 52952 -235209 -184553 -26228 -75150
6117 -75150 73415 -1958 -54271 -274385 169404 162653 301210 164778 -16228 -205117 42595
6105 132614 164940 127439 114930 138844 6411 186837 -296145 -22839 -231179 126101 -119713
6093 85768 -18323 -188814 -271903 93130 132737 -37477 48902 293130 93061 -275808 348492
6081 3014 42540 -172033 76962 127239 -110284 -73721 98276 -34654 -27334 6408 -251248 -17559
6068 70952 -207820 -198464 203062 340029 -55622 47385 75 50046 631 -267148 -153665 372981
6055 125076 117670 -127582 181147 228573 -300784 146438 -99515 272006 -428415 238514
6044 -77746 331584 -242701 -89850 160097 -48189 15278 186909 20278 210190 -117238 -36488
6032 93146 -185199 -191454 -87248 -206745 -7332 -215927 -271745 -136942 -159398 -71217 145532
6020 -19646 -120186 -184152 78711 149166 201436 -67528 -57660 172612 219610 -172563 64201
6008 239355 83571 16701 -59745 -59090 63092 142571 -134156 228756 95987 6493 -254377 -305116
5996 -305116 -52169 -180089 -124845 -27348 98372 -238312 -340343 45417 288237 -242310 217575
5984 270472 90068 -123896 -102784 54662 307040 -192316 269282 25801 -265571 -135223
5974 -135223 -6011 9823 214995 78320 148393 210009 -45231 -24521 14134 -134331 84361 345476
5962 345476 -194328 -398770 -116217 83057 -367013 132728 -163519 108042 322650 -84318
5951 131681 96008 24623 -51345 21378 199621 -101368 -7197 -155023 -336700 63450 5747
5939 162015 -30253 42573 45514 25777 50265 -112019 -503221 -243207 -5813 68858 -166732
5927 96319 213918 -188429 -10314 20649 180716 -55696 -46615 -241499 79010 215445 65774
5915 463687 80388 93786 387014 114285 -92366 263085 203178 186062 78933 140941 127280
5904 127280 451810 -117091 -173692 -103048 92288 131603 91134 -122356 -164700 54711 86791
5893 86791 -330984 11438 72426 -250839 -299949 -120635 -62022 99038 40678 -122880 -86665
5882 -86665 -318301 77268 16488 -225652 -54227 350566 224457 387888 -15123 -986 94614
5870 -256820 202828 -110671 269209 190342 239901 -182361 -242192 -298175 -195053 -244062 381623
5858 223002 47268 2926 31496 14476 -301675 129564 74342 -46159 -39564 365260 -185081
5846 -112953 -249547 -9100 158970 109082 -103583 -56799 -177110 -156491 127995 -162024 81430
5834 -112143 -50171 154942 -19157 -267373 -403975 -94405 -370748 -110891 151841 -454748
5823 156704 13519 -267862 25649 108198 -45856 17171 -247298 176556 118752 -45676 -282518
5812 -282518 -243256 38289 -256045 114007 162402 60691 -398588 189504 -92264 151024 141409
5801 141409 -151133 165083 -318407 189472 -215418 19571 122695 145440 -155981 -99013
5791 -99013 8537 -240361 128272 -185568 -9340 18946 386444 244900 798 -52671 77262 -46279
5778 -84777 -108525 -350590 136517 38286 -54651 -52693 509135 -153586 -153940 116365 -518420
5766 -3845 157458 -349623 -102993 158732 151807 -239283 -41396 8414 -122586 -348190 -241711
5755 -241711 -194693 366709 -147797 -73351 199890 -83138 66714 -76391 -52750 -70546 -64644
5744 -64644 -83050 51114 -105500 -164329 -80348 454195 -2478 -244076 -315545 -52647 -118093
5733 -118093 188143 -103801 114682 107800 -52799 -68656 -287571 128971 -294727 9371 -219515
5721 -127722 -189500 -268651 103590 185768 173317 43548 -194377 -324112 294915 58596 -4300
5709 -35268 102783 129589 -334822 -43424 -330012 -402280 -13331 91336 -31198 -277447 -99758
5697 123457 -191278 80233 -43091 413176 186704 94219 84120 12045 -138628 187698 -88771
5685 -303659 260986 -6340 133372 -423592 72862 147950 58274 18983 -82891 396756 -194269
5673 159682 -45831 -150972 -232196 -6143 172473 -66934 -99354 81446 -537637 281182 72631
5661 -44579 -188523 130971 -44213 119908 381066 -145570 241062 -88780 150916 -53410
5650 27306 -22599 123791 -89276 336174 -45207 32450 433752 -157273 82379 -179999 -146998
5639 -146998 -197937 -44985 -130853 -113184 -28750 34354 138553 215936 -151334 -45233 68272
5627 260148 185510 90160 93610 103686 -56516 322502 61799 -108449 146607 8542 38145
5616 38145 45181 -31482 -22633 10030 -266731 201644 -155732 -52290 147524 343110 44249
5604 -68934 22917 213414 358210 -68408 24675 27989 132910 63472 -219446 -72499 -8744
5592 60374 88188 443485 -139200 178122 -212333 131567 -27608 -225898 362185 -100386
5581 -46557 -183801 -60584 158111 -334048 -578 90214 -392628 129541 -83772 290072 -138650
5569 -266153 -61284 -81133 143600 69565 -149105 211772 226598 188469 244435 -220448 62473
5557 -145084 357084 -266642 282412 49961 -5354 119316 111135 -118635 138349 -114124 77823
5545 7352 384632 113166 -33817 201689 -121043 46443 472700 77085 -294640 191113 -37796
5533 -256462 106205 456096 -67753 -52954 107574 102688 -54139 312406 272125 -450240 52728
5521 -50097 -199381 -97798 -277356 81319 -243839 72705 -87914 -328688 165614 -122203 -59668
5509 125694 30199 -54854 -227255 -46886 64794 -290350 -81446 -92760 13525 94395 -94348
5497 148995 -176010 159763 96988 -172370 -189891 -66317 3849 -308753 -126078 39844 239901
5486 239901 84214 54675 -22969 -8697 -72109 -110570 -12237 -195561 -69539 36092 63722 302013
5474 302013 217230 244522 -150643 -70475 236997 -116769 32474 61370 -7809 27622 334299
5463 334299 246799 103967 289574 152359 56515 -141404 -104508 -76530 29610 -442231 289907
5451 -79950 -52407 -150285 52630 -278533 -210411 -18665 209854 113968 -48366 -45053 -157768
5440 -157768 185455 23901 -160539 -156832 117296 84015 64666 13680 516673 1743 167988
5429 167988 47110 14139 128682 -208605 -100119 312072 -48764 80156 -81416 -59407 -95327
5418 -95327 79430 13249 332221 32561 -108761 296752 -211194 -201729 65657 -122591 58632
5406 -143015 -462244 68643 131749 255154 -219981 120880 -59271 -39749 8255 -108723 425237
5394 55366 65866 25919 -183336 179048 74638 -38577 22151 -215313 -77650 264369 -190178
5382 23164 181066 -176705 -291512 -257811 -76273 147751 335571 163793 163462 302271 -423966
5370 -83636 -63014 17207 -54118 38697 50336 -162260 93811 59624 -98903 159989 -109028
5358 -105784 -77500 239846 -99589 84411 -158281 -18704 -130539 -231851 -334458 227796
5347 234178 72231 82711 -146467 26526 -248625 144823 236282 361248 155153 -51476 28081
5335 131675 -59693 -286024 37918 89810 171881 -244047 -176336 158003 -197727 -42536 369845
5323 28474 -34764 -313083 -300634 178559 183954 71513 30690 3304 280563 -37147 43199 -76823
5310 226775 -154332 -11203 -277736 -102049 266472 -327146 46807 166242 171426 38073 115155
5299 115155 336827 76550 -39875 -89099 55563 35361 34423 215035 -283532 -221580 -69394
5287 93815 113374 -18521 -111827 95688 75654 141025 -119722 238860 344705 91807 152879
5276 152879 153211 -91008 -372403 -98914 -31411 40172 -1437 29108 -18094 177667 -216890 -213272
5264 -213272 188385 -260265 -145706 257510 36111 176470 -93712 -31570 -45243 17518 15375
5253 15375 -61532 288158 -130136 165261 226209 -112211 7698 -104984 -159009 58943 65304
5242 65304 99778 18883 339487 5309 258821 -11598 181682 -197396 -136508 -97457 255872
5230 118626 43438 117304 174138 201932 198628 123405 283197 395685 216967 -180163 79302
5218 252591 -98923 136268 74624 50774 -157561 111485 -100566 118120 270438 197154
5208 197154 -35157 27767 116635 -61091 -338381 284417 11867 190850 249820 -74437 -171479
5197 -171479 -202104 155232 76156 -183368 -18245 87824 87567 161001 54264 -99825 -82907 -60331
5185 -60331 -119551 79238 -29876 108657 147198 158178 -331429 -151551 -96181 147173 -11635
5173 10729 75165 462696 5502 56140 414579 -43795 -234709 -7825 382585 396858 31340
5161 -341060 -204971 -48213 112655 413429 196182 26031 -59396 -155090 88787 -24872 43625
5149 -80362 84380 -61509 131280 -131286 -41567 -91972 -29483 393012 -110679 139147 -7901
5137 -31047 63957 -80708 368778 -71928 29057 31587 169801 -117523 -151915 121877 357318
5126 357318 13839 -122956 -86449 240457 -11206 -26582 -45279 7912 -110609 -160048 -196325
5115 -196325 87370 63420 10798 28087 -30660 7797 86551 -203587 75660 -89198 88441 -526309
5102 -13499 -15225 279317 -266 -105934 -112442 135559 167197 432126 -116978 256770 157189
5091 157189 -249630 10050 -243435 -305056 -128941 41966 -36981 -95157 -5142 -26184 -154476
5080 -154476 -192708 106432 -235896 -112780 -59895 111188 -97203 -227549 9098 -40887 162040
5068 188769 -9967 -135189 241802 323537 100384 -17631 202150 235535 -192086 -211680 8013
5056 251393 48796 241530 19029 -59517 -308512 72412 138336 42564 117167 -95073 -140036
5045 -140036 -575638 -129063 110013 128174 -32516 301374 -129784 124580 30120 -227396
5034 -327190 260603 141104 263891 -165184 99273 160976 -33854 175465 -122190 -292995
5024 -292995 -216485 -40624 -158837 -86983 19381 36781 98563 -56531 -53005 68330 208724
5013 208724 34181 218638 -398511 -15645 -14118 191754 -255594 166623 -36492 -106218 -46744
5001 -1614 134585 -5112 -100319 210438 34015 173796 -170498 -71265 145489 -125023 -210871
4990 -210871 -72007 -113979 79997 -62496 240949 8493 -111139 -151827 -778 315010 62538 197786
4978 197786 -5429 204067 7088 -24345 107731 -281190 -125418 283601 448649 19649 -19125
4966 -2244 -81045 -301221 80544 139791 65239 96368 44645 520281 -528419 430460 -95311
4954 113614 63236 3418 -93681 -222613 -121708 134338 -96021 -204449 137011 -143535 57013
4942 143963 288017 39276 -34826 12200 34799 35096 -186226 -121117 -41770 38333 -578 -150779
4930 -150779 -237407 -104444 66667 -410799 -40715 -10064 395544 -81026 57357 -120500 126171
4918 44732 329700 -252739 -73657 254162 86269 147574 -313497 424711 -86631 -178103 303091
4906 93811 -99262 102961 -65301 -439755 -136895 -191410 -236610 -138157 -266797 121226 -5015
4894 -70039 90291 -22733 95186 3687 207295 307947 -144162 77007 -142699 -240733 169812
4882 -355786 -97635 -332873 181798 -93318 43380 29295 -70192 240675 -201341 507378 -292059
4870 -154893 98180 -54618 74059 187974 -202259 225752 296158 -103469 -75883 3595 -286159
4858 -63430 245836 -84755 450414 355266 -105528 81845 -126368 247529 163850 120335 259205
4847 259205 155668 47722 -154414 -333230 -59108 -11344 122658 291053 -19580 270135
4836 230349 145089 -255278 102384 -285691 86823 -121096 73894 -86033 -8173 306921 -50565
4824 -22270 44616 -6500 162099 126657 232268 393919 233348 -112304 26371 72535 -33434
4812 -167885 217269 -205467 -56556 -5992 -1667 -86433 62813 31442 265240 201673 -208620
4800 -155335 -35737 -265608 39763 109387 144144 4695 -167186 -25125 -15618 29755 -166584
4788 -28639 -153637 -78100 -292581 -179548 1505 -134549 -214870 197000 -59104 176158 138682
4777 138682 -288699 -149372 -132391 362005 -210149 -219524 -263492 100405 35998 86067 -42108
4765 164667 229379 121406 -20241 -252362 10532 -311738 44956 -114692 92708 35128 85934
4754 85934 52867 181297 -71718 271415 -187573 123804 406572 -161813 117519 -19008
4743 14334 149728 -162949 -10040 -323900 -206440 -465974 224520 15171 231952 191324
4733 191324 -179613 65435 165026 -100551 -99351 -64723 -75305 -243670 -234493 178216 -93880
4721 -81481 -52352 -380905 -31180 -147259 -209414 -403110 22511 -130907 160547 127541 -112944
4709 -90186 -164995 -110798 28059 -291166 38087 87867 94643 61228 -51239 -109394 64551 -86426
4696 241932 -7892 14127 311320 -293576 -129309 57779 85159 35721 169289 140433 158279
4685 158279 13563 83972 -45527 -213309 -33044 -408170 -188410 188433 40664 14538 -211315
4673 -106877 -26988 210862 -182068 -270180 29333 -294575 31430 -43081 -97190 -42506 34433
4661 98946 8386 -41704 87524 -38956 24186 -138203 48742 33533 -39581 271237 142010
4650 142010 288830 128188 233019 112196 34032 -255693 204710 -58731 -88575 -241677
4640 -241677 90980 94567 156464 149179 268890 -81360 -147441 82886 134214 -52781 2145 -93554
4627 -113584 -216237 -183087 142729 -112894 -235199 26064 279562 -31277 29458 62957 -51696
4615 90515 115259 199643 164207 -194045 25287 -138151 160574 171165 -1685 -94631 74752
4603 416783 -47865 -67741 -196380 -369689 82734 -19665 -107070 -67943 268568 138470 34162
4591 -119354 104857 -94185 111943 -93210 -38400 -75244 -52639 -218510 94696 303808 112735
4579 -184545 18908 -194131 282419 26106 147492 -297202 33271 -93469 -79859 -40973 65236
4567 -176026 -226742 128705 200269 -7806 -44966 -132802 -32739 349117 161010 -92703 48050
4555 -148843 28010 6988 37604 648 -104119 119333 -79898 -198445 -176191 -93589 121823
4543 156029 176530 86772 216125 270560 -54231 -35137 -23390 -47454 319669 72104 -165456
4531 7553 102692 145166 -74573 141113 115150 -2066 -43659 -69616 -32028 109378 34858 123430
$$ [...]
##END NTUPLES=NMR SPECTRUM
##END=
