
##TITLE=UV1261_M11_1332-1242_70_7409935_ojFLwwO5N4
##JCAMPDX= 6.0         $$ Bruker NMR JCAMP-DX V2.0
##DATA TYPE= NMR SPECTRUM
##DATA CLASS= NTUPLES
##ORIGIN= BRUKER
##OWNER= Administrator
$$ 1.72 TOPSPIN		Version 2.1
$$ 2013-01-24 23:43:48.349 -0500  Administrator@X
$$ Compression mode = diff/dup
##.OBSERVE FREQUENCY= 400.02188249412
##.OBSERVE NUCLEUS= ^1H
##.ACQUISITION MODE= SIMULTANEOUS (DQD)
##.ACQUISITION SCHEME= undefined
##.AVERAGES= 64
##.DIGITISER RES= 22
##SPECTROMETER/DATA SYSTEM= spect
##.PULSE SEQUENCE= noesygpps1d.comp
##.SOLVENT NAME= COFFEE_meoh
##.SHIFT REFERENCE= INTERNAL, COFFEE_meoh, 1, 14.96131
##AUDIT TRAIL= $$ (NUMBER, WHEN, WHO, WHERE, PROCESS, VERSION, WHAT)
$$ ##TITLE= Audit trail, TOPSPIN		Version 2.1
$$ ##JCAMPDX= 5.01
$$ ##ORIGIN= Bruker BioSpin GmbH
$$ ##OWNER= Administrator
$$ $$ E:\/data/COFFEE/nmr/UV1261_M11_1332-1242_70_7409935_ojFLwwO5N4/12/pdata/1/auditp.txt
$$ ##AUDIT TRAIL=  $$ (NUMBER, WHEN, WHO, WHERE, PROCESS, VERSION, WHAT)
(   1,<2013-01-24 23:43:42.615 -0500>,<Administrator>,<X>,<go>,<TOPSPIN 2.1>,
      <created by zg
	started at 2013-01-24 23:32:12.958 -0500,
	POWCHK enabled, PULCHK disabled,
       configuration hash MD5:
       86 BA 57 50 F2 9D 5C 9B 26 00 A9 28 5F 66 2E 89
       data hash MD5: 64K
       BE 94 6A BF 53 F0 61 40 DC 77 C0 47 70 C1 22 1B>)
(   2,<2013-01-24 23:43:45.599 -0500>,<Administrator>,<X>,<proc1d>,<TOPSPIN 2.1>,
      <Start of raw data processing
       efp LB = 0.3 FT_mod = 6 PKNL = 1 PHC0 = 0 PHC1 = 0 SI = 128K 
       data hash MD5: 128K
       59 6E 5B 46 3F DE 7F 0A BA B7 2B 86 59 D4 87 3C>)
(   3,<2013-01-24 23:43:46.646 -0500>,<Administrator>,<X>,<proc1d>,<TOPSPIN 2.1>,
      <pk PHC0 = -79.4751 PHC1 = 0 
       data hash MD5: 128K
       46 16 9B 16 8E 47 7E 8E 10 85 0C AE F4 35 E5 87>)
(   4,<2013-01-24 23:43:47.318 -0500>,<Administrator>,<X>,<proc1d>,<TOPSPIN 2.1>,
      <abs ABSG = 1 
       data hash MD5: 128K
       07 7D A3 51 3F F1 D8 9F AC 5D 60 63 FD D3 C2 C6>)
(   5,<2013-01-24 23:43:47.490 -0500>,<Administrator>,<X>,<proc1d>,<TOPSPIN 2.1>,
      <abs ABSG = 2 
       data hash MD5: 128K
       EA 12 91 7E 58 BE 46 56 70 E3 AB 2B B6 F0 64 E4>)
(   6,<2013-01-24 23:43:47.646 -0500>,<Administrator>,<X>,<proc1d>,<TOPSPIN 2.1>,
      <abs ABSG = 3 
       data hash MD5: 128K
       24 9E 60 9A 63 FD 73 C1 0F 16 AB 2C 8D 68 C8 28>)
(   7,<2013-01-24 23:43:47.818 -0500>,<Administrator>,<X>,<proc1d>,<TOPSPIN 2.1>,
      <abs ABSG = 4 
       data hash MD5: 128K
       4B 81 27 69 CE 0F 3D 58 6D F1 FB 78 15 78 CC 49>)
(   8,<2013-01-24 23:43:48.005 -0500>,<Administrator>,<X>,<proc1d>,<TOPSPIN 2.1>,
      <abs ABSG = 5 
       data hash MD5: 128K
       65 EF D9 9E 40 54 B4 6D 3F 78 AF 65 2A BE EE E6>)
$$ ##END=
$$ 
$$ $$ hash MD5
$$ $$ B4 C5 11 31 1E 2C A7 24 99 32 37 72 F6 09 68 9B
##$RELAX= 
##$RELAX= 
##$RELAX= 
##$RELAX= 
##$RELAX= 
##$RELAX= 
##$RELAX= 
##$RELAX= 
$$ Bruker specific parameters
$$ --------------------------
##$DU= <E:\>
##$EXPNO= 12
$$ [...]
150 150 150 150 150 150 150 150
##$TP07= 0
##$TPNAME0= <>
##$TPNAME1= <>
##$TPNAME2= <>
##$TPNAME3= <>
##$TPNAME4= <>
##$TPNAME5= <>
##$TPNAME6= <>
##$TPNAME7= <>
##$TPOAL= (0..7)
0.5 0.5 0.5 0.5 0.5 0.5 0.5 0.5
##$TPOFFS= (0..7)
0 0 0 0 0 0 0 0
##$TUNHIN= 0
##$TUNHOUT= 0
##$TUNXOUT= 0
##$USERA1= <user>
##$USERA2= <user>
##$USERA3= <user>
##$USERA4= <user>
##$USERA5= <user>
##$V9= 5
##$VALIST= <valist>
##$VCLIST= <CCCCCCCCCCCCCCC>
##$VD= 0
##$VDLIST= <DDDDDDDDDDDDDDD>
##$VPLIST= <PPPPPPPPPPPPPPP>
##$VTLIST= <TTTTTTTTTTTTTTT>
##$WBST= 1024
##$WBSW= 4
##$XGAIN= (0..3)
0 0 0 0
##$XL= 0
##$YL= 0
##$YMAX_a= 6087455
##$YMIN_a= -12817798
##$ZGOPTNS= <>
##$ZL1= 120
##$ZL2= 120
##$ZL3= 120
##$ZL4= 120
##$ABSF1= 14.96131
##$ABSF2= -5.596871
##$ABSG= 5
##$ABSL= 3
##$ALPHA= 0
##$AQORDER= 0
##$ASSFAC= 0
##$ASSFACI= 0
##$ASSFACX= 0
##$ASSWID= 0
##$AUNMP= <proc_prof1d_extract.lims>
##$AXLEFT= 0
##$AXNAME= <>
##$AXNUC= <1H>
##$AXRIGHT= 0
##$AXTYPE= 0
##$AXUNIT= <>
##$AZFE= 0.1
##$AZFW= 0.1
##$BCFW= 0
##$BC_mod= 0
##$BYTORDP= 0
##$COROFFS= 0
##$CY= 15
##$DATMOD= 1
##$DC= 0
##$DFILT= <>
##$DTYPP= 0
##$F1P= 0
##$F2P= 0
##$FCOR= 0.5
##$FTSIZE= 131072
##$FT_mod= 6
##$GAMMA= 0
##$GB= 0
##$INTBC= 1
##$INTSCL= 1
##$ISEN= 128
##$LB= 0.3
##$LEV0= 0
##$LPBIN= 0
##$MAXI= 10000
##$MC2= 0
##$MEAN= 0
##$ME_mod= 0
##$MI= 0
##$NCOEF= 0
##$NC_proc= -2
##$NLEV= 6
##$NOISF1= 0
##$NOISF2= 0
##$NSP= 0
##$NTH_PI= 0
##$NZP= 0
##$OFFSET= 14.96131
##$PC= 1
##$PHC0= -79.4751
##$PHC1= 0
##$PH_mod= 1
##$PKNL= yes
##$PPARMOD= 0
##$PPDIAG= 0
##$PPIPTYP= 0
##$PPMPNUM= 2147483647
##$PPRESOL= 1
##$PSCAL= 4
##$PSIGN= 0
##$PYNMP= <proc.py>
##$REVERSE= no
##$SF= 400.020009512231
##$SI= 131072
##$SIGF1= 0
##$SIGF2= 0
##$SINO= 400
##$SIOLD= 131072
##$SPECTYP= <>
##$SREGLST= <1H.CDCl3>
##$SSB= 0
##$STSI= 131072
##$STSR= 0
##$SW_p= 8223.68421052631
##$SYMM= 0
##$S_DEV= 0
##$TDeff= 65536
##$TDoff= 0
##$TI= <>
##$TILT= no
##$TM1= 0
##$TM2= 0
##$TOPLEV= 0
##$USERP1= <user>
##$USERP2= <user>
##$USERP3= <user>
##$USERP4= <user>
##$USERP5= <user>
##$WDW= 1
##$XDIM= 131072
##$YMAX_p= 446866078
##$YMIN_p= -11650
##$CURPLOT= <Network HP LaserJet P1505>
##$CURPRIN= <$Network HP LaserJet P1505>
##$DFORMAT= <normdp>
##$LAYOUT= <+/1D_H.xwp>
##$LFORMAT= <normlp>
##$PFORMAT= <normpl>
##$SURQMSG= 1
$$ End of Bruker specific parameters
$$ ---------------------------------
##NTUPLES= NMR SPECTRUM
##VAR_NAME=  FREQUENCY,     SPECTRUM/REAL,   SPECTRUM/IMAG
##SYMBOL=    X,             R,               I
##VAR_TYPE=  INDEPENDENT,   DEPENDENT,       DEPENDENT
##VAR_FORM=  AFFN,          ASDF,            ASDF
##VAR_DIM=   131072,        131072,          131072
##UNITS=     HZ,            ARBITRARY UNITS, ARBITRARY UNITS
##FACTOR=    0.0627417313425164, 1,          1
##FIRST=     8223.62146879497, -2008,        -60019
##LAST=      0,             39,              -60567
##MIN=       0,             -11650,          0
##MAX=       8223.62146879497, 446866078,    0
$$ Real data points
##PAGE= N=1
##DATA TABLE= (X++(R..R)), XYDATA
$$ [...]
61604D95894p040p064p528p667o524n031m737n361n423m729m441m979n485n373
$$ 495894 488854 481790 474262 466595 460071 455040 450303 444942 439519 434790 430349 425370 419885 414512
61590D14512n062m957m735l903k515j225q49j635k796l232k853k539k663k589
$$ 414512 409450 404493 399758 395855 393340 392115 391266 389631 386835 383603 380750 378211 375548 372959
61576C72959j986j606k109k918k971k034p05L20N66k5r13j503j881k383k529j610
$$ 372959 370973 369367 367258 364340 361369 359335 358630 358950 359516 359491 358578 357075 355194 352811 350282 348672
61560C48672k37J12o99j217p23j78l03l63K77R63J070J088J359J184K81j94O55
$$ 348672 348435 348547 347848 346631 345908 345730 345427 345064 345341 346304 347374 348462 349821 351005 351286 351092 351747
61543C51747J901K244J928J905K063J699R41M34K09R0M99J713K887L035K457K208
$$ 351747 353648 355892 357820 359725 361788 363487 364428 364862 365071 365161 365660 367373 370260 373295 375752 377960
61527C77960K571K985K986K344Q83j062k516k971l007l160l009k183j390j413
$$ 377960 380531 383516 386502 388846 389729 388667 386151 383180 380173 377013 374004 371821 370431 369018
61513C69018j848j838j418j097q03k45J94j6n35o04k14j3l55r98j491j413o66
$$ 369018 367170 365332 363914 362817 362014 361769 361963 361947 361412 360808 360594 360581 360226 359228 357737 356324 355658
61496C55658J78L93J15M9J16m43j387j333M7J224R89R7k90l56o29n90K73J066
$$ 355658 355836 356229 356344 356393 356509 356066 354679 353346 353393 354617 355606 355703 355413 355057 354428 353838 354111 355177
61478C55177P50p1m9Q01J315R98L69j07k79O9Q43J259P68j02n59o31o88n52qM83
$$ 355177 355927 355856 355807 356608 357923 358921 359290 359183 358904 358973 359816 361075 361843 361741 361182 360551 359863 359311 359303 359786
61458C59786M49J30j33n19r15n47P10J600J166K56J93Q02J055Q75R74J456J886
$$ 359786 360235 360365 360232 359713 358798 358251 358961 360561 361727 361983 362176 362978 364033 364908 365882 367338 369224
61441C69224K278K872L291L003K288J901K097K640L293L720L584L286L746M889
$$ 369224 371502 374374 377665 380668 382956 384857 386954 389594 392887 396607 400191 403477 407223 412112
61427D12112N361M395K833J588N13m10k10J428L088L496L220L216L104K369J834
$$ 412112 417473 421868 424701 426289 426802 426392 426182 427610 430698 434194 437414 440630 443734 446103 447937
61412D47937K183K300J014o94j238j098j782k999l242k610k592l335l414k424
$$ 447937 450120 452420 453434 452740 451502 450404 448622 445623 442381 439771 437179 433844 430430 428006
61398D28006j631j803k185k032j624j334r96n10r3J78L29K09l8K54J153J551Q21
$$ 428006 426375 424572 422387 420355 418731 417397 416401 415891 415798 415976 416305 416514 416476 416730 417883 419434 420255
61381D20255J66R45K480L109K721K507K776K854K719K960L262K753J663J107J264
$$ 420255 420421 421366 423846 426955 429676 432183 434959 437813 440532 443492 446754 449507 451170 452277 453541
61366D53541J342J221J612K571L302L450L354L140K731K457K574K609K328K593
$$ 453541 454883 456104 457716 460287 463589 467039 470393 473533 476264 478721 481295 483904 486232 488825
61352D88825L942N182N131M849O113Q392R634R699J0481J2584J4297J4243J3014
$$ 488825 492767 497949 503080 507929 514042 522434 532068 541767 552248 564832 579129 593372 606386
61339F06386J1542R759P508N232L139R76r96k027k202k499l334m230m945n703
$$ 606386 617928 627687 635195 640427 643566 644542 643546 641519 639317 636818 633484 629254 624309 618606
61325F18606o307o262n762n312m653l336k051j810k149j818r59p55j110o67P45
$$ 618606 612299 606037 600275 594963 590310 586974 584923 583113 580964 579146 578187 577432 576322 575655 576400
61310E76400J696J491J127J505K390L550N268P271Q688R458J0460J1946J3227
$$ 576400 578096 579587 580714 582219 584609 588159 593427 600698 609386 618844 629304 641250 654477
61297F54477J3959J4255J3433J0359N338J72l956p224r723j0938j0932j0506r852
$$ 654477 668436 682691 696124 706483 711821 711993 708037 700813 691090 680152 669220 658714 648862
61284F48862q479o622n193m249l007j501n71j52P29K199L443M369N553O592O508
$$ 648862 640383 633761 628568 624319 621312 619811 619240 619088 619817 622016 625459 629828 635381 641973 648481
61269F48481N904O473Q170R100Q596Q104Q440Q513P651O931P237P908Q404R376
$$ 648481 654385 660858 669028 678128 686724 694828 703268 711781 719432 726363 733600 741508 749912 759288
61255G59288J1142J2903J4350J6192J8060J7850J4386R084L844j013n640r246
$$ 759288 770430 783333 797683 813875 831935 849785 864171 873255 877099 876086 870446 861200
61243H61200j1245j2404j3580j4497j4801j4948j5025j4120j1948r756q536p618
$$ 861200 849955 837551 823971 809474 794673 779725 764700 750580 738632 728876 720340 712722
61231G12722o057m125k480j149k74n25j677k138r68Q44K046K750L446L829L676
$$ 712722 706665 702540 700060 698911 698637 698112 696435 694297 693329 694173 696219 698969 702415 706244 709920
61216G09920L644M016L878K672J338R00J026J059J254J955K689L103L635M345
$$ 709920 713564 717580 721458 724130 725468 726368 727394 728453 729707 731662 734351 737454 741089 745434
61202G45434M285L054J763J469J871K497L852O273Q951J1241J3675J6580J9036
$$ 745434 749719 752773 754536 756005 757876 760373 764225 770498 779449 790690 804365 820945 839981
61189H39981K0435K1753K3848K5694K5714K3885K1125J7614J3205Q771N642M097
$$ 839981 860416 882169 906017 931711 957425 981310 1002435 1020049 1033254 1042025 1047667 1051764
61177A051764L415K902K100O41j285k997m411o183q376j0060j0815j1396j2295
$$ 1051764 1055179 1058081 1060181 1060822 1059537 1056540 1052129 1045946 1037570 1027510 1016695 1005299 993004
61164I93004j2944j3110j3671j5204j7052j8591k0053k1348k1557k0512j9351
$$ 993004 980060 966950 953279 938075 921023 902432 882379 861031 839474 818962 799611
61153G99611j8591j7181j4489j1590r468p534n097k710q54J137L502N069N075
$$ 799611 781020 763839 749350 737760 728292 720758 715661 712951 712097 713234 716736 721805 726880
61140G26880M405L613J551k457o697r174j0089j0562j0359q821o683n007l389
$$ 726880 731285 734898 736449 733992 727295 718121 708032 697470 687111 678290 671607 666600 663211
61127F63211j005J643L750N799Q435J0935J2464J3697J5487J7147J7852J8514
$$ 663211 662206 663849 667599 673398 681833 692768 705232 718929 734416 751563 769415 787929
61115G87929K0373K2821K4552K5769K7298K8570K8440K7257K6174K5232K3786
$$ 787929 808302 831123 855675 881444 908742 937312 965752 993009 1019183 1044415 1068201
61104A068201K2006K0368J8564J6466J4992J4400J2969R268M461M92k842p010
$$ 1068201 1090207 1110575 1129139 1145605 1160597 1174997 1187966 1197234 1201695 1202187 1199345 1192335
61092A192335j2115j7105k1554k5300k7499k7976k8265k9372k9916k8512k6384
$$ 1192335 1180220 1163115 1141561 1116261 1088762 1060786 1032521 1003149 973233 944721 918337
61081I18337k5292k4500k2495k0107j8998j8267j5829j2158r541q326p081n789
$$ 918337 893045 868545 846050 825943 806945 788678 772849 760691 751150 742824 735743 729954
61069G29954n656o103n161k786r62m61j66N43J186J777K645L069K444K162L826
$$ 729954 724298 718195 713034 710248 709286 708825 708659 709202 710388 712165 714810 717879 720323 722485 726311
61054G26311O357P588P862R078J1020J1971J2273J3796J6239J7545J7798J9166
$$ 726311 732668 740256 748118 757196 768216 780187 792460 806256 822495 840040 857838 877004
61042H77004K1912K4024K4883K5932K7572K8692K9364L0675L1981L1738L0897
$$ 877004 898916 922940 947823 973755 1001327 1030019 1059383 1090058 1122039 1153777 1184674
61031A184674L1681L3299L2961L1077L0966L3202L4934L5325L6846M0294M3433
$$ 1184674 1216355 1249654 1282615 1313692 1344658 1377860 1412794 1448119 1484965 1525259 1568692
61020A568692M5797M9882N6019O0857O2622O3309O4232O4494O5522P1577Q3386
$$ 1568692 1614489 1664371 1720390 1781247 1843869 1907178 1971410 2035904 2101426 2173003 2256389
61009B256389R6714J09531J24902J44133J63388J80615J99561K23433K51674K87299
$$ 2256389 2353103 2462634 2587536 2731669 2895057 3075672 3275233 3498666 3750340 4037639
60999D037639L39385M12354N01077O03764P30636Q91001J082833J308633J589766
$$ 4037639 4377024 4789378 5290455 5894219 6624855 7515856 8598689 9907322 11497088
60990A1497088J943899K354830K787134L215828L587960L738970L419332K502821
$$ 11497088 13440987 15795817 18582951 21798779 25386739 29125709 32545041 35047862
60982C5047862J191801m3350p84190r28600o47275j50595M18968Q83193R53466
$$ 35047862 36239663 36196313 35412123 34483523 33836248 33685653 34104621 34987814 35941280
60973C5941280L90505p43000k052453l076497l582033l620438l369765k980640
$$ 35941280 36331785 35588785 33536332 30459835 26877802 23257364 19887599 16906959
60965A6906959k544716k123743j756033j448280j189428r73199p98787o59196
$$ 16906959 14362243 12238500 10482467 9034187 7844759 6871560 6072773 5413577
60957E413577n43250m46676l71303l15334k72417k38527k12632j91845j72312
$$ 5413577 4870327 4423651 4052348 3737014 3464597 3226070 3013438 2821593 2649281
60948B649281j54088j39455j27113j13315r8098q5217p6086o8582o2057n8815
$$ 2649281 2495193 2355738 2228625 2115310 2017212 1931995 1855909 1787327 1725270 1666455
60938A666455n9761o2532o4789o6056o5667o2386n6961n2125m8967m5890m1795
$$ 1666455 1606694 1544162 1479373 1413317 1347650 1285264 1228303 1176178 1127211 1081321 1039526
60927A039526l7605l3874k9615k4756k1124j9627j8611j6437j3802j2069j1030
$$ 1039526 1001921 968047 938432 913676 892552 872925 854314 837877 824075 812006 800976
60916H00976r875q892q697q781q261p228o258n345m289l421l052k865k534k345
$$ 800976 791101 782209 773512 764731 756470 749242 742984 737639 733350 729929 726877 724012 721478 719133
60902G19133k570l009l598m621n806o233n776n646o679q016q361p720p052o867
$$ 719133 716563 713554 709956 705335 699529 693296 687520 681874 675195 667179 658818 651098 644046 637179
60888F37179p082p598q102p805o261m074k174r18l91q15j951k803k710k175j850
$$ 637179 630097 622499 614397 606592 600331 596257 594083 593165 592774 591959 590008 587205 584495 582320 580470
60873E80470j414l52R87J976K764L681M274M107L879M542N648N922N163M338M007
$$ 580470 579056 578704 579691 581667 584431 588112 592386 596493 600372 604914 610562 616484 621647 625985 629992
60858F29992L946M146M906N858O177N882N879O514P102P001O191M859L378K611
$$ 629992 633938 638084 642990 648848 655025 660907 666786 673300 680402 687403 693594 698453 701831 704442
60844G04442L120M070M114L297K741K526J445q15k886l669l557l146k206p25M79
$$ 704442 707562 711632 715746 719043 721784 724310 725755 724940 722054 718385 714828 711682 709476 708751 709230
60829G09230J143K279M480O749Q148R404J1549J4025J5638J6596J7977J9747K0823
$$ 709230 710373 712652 717132 723881 732029 741433 752982 767007 782645 799241 817218 836965 857788
60816H57788K0890K0618K0219J9137J7289J5431J4015J2626J0732Q263N311J941
$$ 857788 878678 899296 919515 938652 955941 971372 985387 998013 1008745 1017008 1022319 1024260
60804A024260j519m582p117r393j1578j3530j4945j5473j5007j4160j4016j4920
$$ 1024260 1022741 1018159 1011042 1001649 990071 976541 961596 946123 931116 916956 902940 888020
60792H88020j5998j6360j6198j6047j5634j4335j2459j1044j0562j0571j0522
$$ 888020 872022 855662 839464 823417 807783 793448 780989 769945 759383 748812 738290
60781G38290j0266r944r930j0618j1719j2129j1184r617q642q493q602q696q825
$$ 738290 728024 718080 708150 697532 685813 673684 662500 652883 644241 635748 627146 618450 609625
60768F09625q750q260p820p918q122p725o945o508o324n773n059n028n646n873
$$ 609625 600875 592615 584795 576877 568755 561030 554085 547577 541253 535480 530421 525393 519747 513874
60754E13874n238m437m186m382m619m698m451l794k992k254j180N08J923J814
$$ 513874 508636 504199 500013 495631 491012 486314 481863 478069 475077 472823 471643 472151 474074 475888
60740D75888L29j097j654j841k151k345k320k481k738k238o73R87J698J531J159
$$ 475888 476217 475120 473466 471625 469474 467129 464809 462328 459590 457352 456679 457666 459364 460895 462054
60725D62054Q61O17N36O77Q14P63O06L58j43q91j717k695l903m846m876m298m174
$$ 462054 462915 463532 464068 464745 465559 466322 466928 467286 467143 466252 464535 461840 457937 453091 448215 443917 439743
60708D39743m849n440n172m341l646l302l291l652m112m033l273k512k242k069
$$ 439743 434894 429454 424282 419941 416295 412993 409702 406050 401938 397905 394632 392120 389878 387809
60694C87809j502q68p64j050j086o71j84J24L75O28O90M79L22O45J370J823J464
$$ 387809 386307 385439 384675 383625 382539 381868 381684 381808 382183 382811 383501 383980 384302 384947 386317 388140 389604
60677C89604O09J60N97J572K644L769M840N348N047M466M167L995L638L332L303
$$ 389604 390213 390373 390970 392542 395186 398955 403795 409143 414190 418656 422823 426818 430456 433788 437091
60662D37091L087K266J384J159J242Q83M44R79K530M003M735N001M985M487L788
$$ 437091 440178 442444 443828 444987 446229 447112 447556 448535 451065 455068 459803 464804 469789 474276 478064
60647D78064L710M546N727O572O511M823J367k426m623n025n149n888o531o338
$$ 478064 481774 486320 492047 498619 505130 509953 511320 508894 504271 499246 494097 488209 481678 475340
60633D75340n686n187m849m639m759m881m228k917k122k338k575j912q10j74n2
$$ 475340 469654 464467 459618 454979 450220 445339 441111 438194 436072 433734 431159 429247 428437 428263 428211
60618D28211q3l41r65j574j751j573j211n89J44N02L97K74K60l9n82p21l53k32
$$ 428211 428128 427787 426822 425248 423497 421924 420713 420124 420268 420770 421167 421441 421701 421662 421080 420359 420006 419774
60600D19774n92n01O42J956K247J609J011Q90J005J152J334J486J585J730J754
$$ 419774 419182 418681 419323 421279 423526 425135 426146 427036 428041 429193 430527 432013 433598 435328 437082
60585D37082J271M63J73Q08J722K128K086K094K266K357K235J930J566J478K008
$$ 437082 438353 438816 438989 439797 441519 443647 445733 447827 450093 452450 454685 456615 458181 459659 461667
60570D61667L083M376N822P442Q834R614J0334J1952J4476J7005J9112K1107K2849
$$ 461667 464750 469126 474948 482390 491224 500838 511172 523124 537600 554605 573717 594824 617673
60557F17673K3478K2531K0256J6653J1425N130q64n933j0422j4084j5701j4850
$$ 617673 641151 663682 683938 700591 712016 717146 716282 710349 699927 685843 670142 655292
60545F55292j2672j0238p410l948m57K581N551Q688J1453J3743J6556K0582K5074
$$ 655292 642620 632382 624972 621024 620567 623148 628699 637387 648840 662583 679139 699721 724795
60532G24795K8937L1908L3911L4184L2020K7525K1024J2707L513m721j0767j4778
$$ 724795 753732 785640 819551 853735 885755 913280 934304 947011 950524 945803 935036 920258
60520I20258j7064j7343j5920j4163j2919j1624r896q634q436q272p031n141l496
$$ 920258 903194 885851 869931 855768 842849 831225 821329 812695 804259 795987 788956 783815 780319
60507G80319j934j19J330K066L252N967R253J1476J2875J5157J9155K4401L0541
$$ 780319 778385 778266 779596 781662 784914 790881 800134 811610 824485 839642 858797 883198 913739
60494I13739L7628M5377N3459O2159P1475Q0067Q6366R0241R2203R1493Q6466
$$ 913739 951367 996744 1050203 1112362 1183837 1263904 1350270 1440511 1532714 1624207 1710673
60483A710673P6670O3146M6810K7871O815j5205l7025n7558p5295q8695r7075
$$ 1710673 1787343 1850489 1897299 1925170 1931985 1916780 1879755 1822197 1746902 1658207 1561132
60472A561132j00569r9558r4841q7942q0267p2299o4175n6581n0140m4518l9023
$$ 1561132 1460563 1361005 1266164 1178222 1097955 1025656 961481 904900 854760 810242 771219
60461G71219l3709k9003k4843k1025j7885j5687j3862j1827r991r045q764q468
$$ 771219 737510 708507 683664 662639 644754 629067 615205 603378 593387 584342 575578 567110
60449E67110q077p755p157o081n215n152n259m672l747l367l305k646j377l28
$$ 567110 559033 551278 544121 538040 532825 527673 522414 517742 513995 510628 507323 504677 503300 502972
60435E02972J29K05p1o69j008o58k06l57p39o44m16q55j744k252k350k602k904
$$ 502972 503101 503306 503235 502566 501558 500900 500694 500337 499598 498954 498538 497683 495939 493687 491337 488735 485831
60418D85831k663j873q87M06K021K971K313P33k29k43k17n97r41r12n11L97J653
$$ 485831 483168 481295 480408 480814 482835 485806 488119 488852 488623 488380 488163 487566 486625 485713 485202 485599 487252
60401D87252K302J707P87Q43J649K002J652J218O89k91j028l79J234K106J632
$$ 487252 489554 491261 492048 492891 494540 496542 498194 499412 500101 499810 498782 498403 499637 501743 503375
60386E03375R18R09J314J513J303O36k43m44N89J905K124J399J033J309J335Q79
$$ 503375 504293 505202 506516 508029 509332 509968 509725 509281 509870 511775 513899 515298 516331 517640 518975 519854
60370E19854P19J053J180J038J466K568L300L073K481K013J318K47n58o64m03
$$ 519854 520573 521626 522806 523844 525310 527878 531178 534251 536732 538745 540063 540310 539752 539088 538685
60355E38685k1P19J646J955J396Q52J157K063K829L213L483L907M611N574O588
$$ 538685 538664 539383 541029 542984 544380 545232 546389 548452 551281 554494 557977 561884 566495 572069 578657
60340E78657P358P584O838M845K258M01l20j042k736m669n542n329m815m085k820
$$ 578657 586015 593599 600437 605282 607540 607941 607621 606579 603843 599174 593632 588303 583488 579403 576583
60325E76583j532j044j094q03k12K9Q4N86J199R91J74j06L83P19M92L24P25J573
$$ 576583 575051 574007 572913 572110 571898 571927 572011 572597 573796 574787 574961 574855 575238 575957 576449 576773 577498 579071
60307E79071K827M563O371P797R303J1704J4887J8194K1716K6057L0962L5241
$$ 579071 581898 586461 592832 600629 609932 621636 636523 654717 676433 702490 733452 768693
60295G68693L7718L7301L2968K4980J5373N803m234j5427k5885l2596l4950l4654
$$ 768693 806411 843712 876680 901660 917033 922836 918602 903175 877290 844694 809744 775090
60283G75090l2678k8747k3640j9268j6239j3541j0913r327q842q243p163o484
$$ 775090 742412 713665 690025 670757 654518 640977 630064 620737 611895 603652 596489 590005
60271E90005o246n374l939l472m356m988m307l183k511j873r11j96M8M25Q75M94
$$ 590005 583759 578385 574446 570974 566618 561630 557323 554140 551629 549756 548845 548649 548697 549122 549997 550491
60255E50491n29o89L90J169O53k20n20p10j084p86L70R17p5j343j375n69j84l23
$$ 550491 549962 549273 549663 550832 551485 551265 550745 550035 548951 548165 548535 549452 549377 548034 546659 546090 545906 545583
60237E45583m39o39j242j776j591q56j26L96O56O93J152K742M830N867N559N206
$$ 545583 545144 544505 543263 541487 539896 539040 538914 539310 539966 540659 541811 544553 549383 555250 560809 566015
60221E66015N431N264M077K754K047J431N17J56J045K515L665M475N003M810M031
$$ 566015 571446 576710 580787 583541 585588 587019 587536 587692 588737 591252 594917 599392 604395 609205 613236
60206F13236L706M183M452L839L058K800K706K447K470K777K499J450O72O07L40
$$ 613236 616942 621125 625577 629416 632474 635274 637980 640427 642897 645674 648173 649623 650295 650902 651242
60191F51242n13r57o13p89k293l886m313m181m414m442l583k740k988l675l620
$$ 651242 650729 649772 649159 648370 646077 642191 637878 633697 629283 624841 621258 618518 615530 611855 608235
60176F08235l083k947k884k102j073q03j044p07M30J668K480K640J935P78L20
$$ 608235 605152 602205 599321 597219 596146 595343 594299 593592 594022 595690 598170 600810 602745 603523 603843
60161F03843R10J331N06r35j777j885j676j003K37J336J788K135K782L015K388
$$ 603843 604753 606084 606590 605655 603878 601993 600317 599314 599551 600887 602675 604810 607592 610607 612995
60146F12995J937K647L770M131M127M881O261P288P909Q804R883J0340R956R178
$$ 612995 614932 617579 621349 625480 629607 634488 640749 648037 655946 664750 674633 684973 694929 704107
60132G04107Q279P379O824O549N683L754J696O28J38j107l450n847p090o701n088
$$ 704107 712386 719765 726589 733138 738821 742575 744271 744899 745037 743930 740480 734633 727543 720842 715754
60117G15754l318k367k133j761j052o25n36p3P19P94j3m21K41Q64M01o34j429
$$ 715754 712436 710069 707936 706175 705123 704498 703962 703889 704608 705402 705389 704968 705209 706073 706474 705840 704411
60100G04411k188l113l587l452l658m458m485k879q63J41M76R60J217Q78R68K363
$$ 704411 702223 699110 695523 692071 688413 683955 679470 676591 675728 675869 676345 677305 678522 679400 680368 682731
60084F82731M073M748M728M959N113M518L768L651L474K185K10j521l262n558
$$ 682731 686804 691552 696280 701239 706352 710870 714638 718289 721763 723948 724158 722637 719375 713817
60070G13817p685q731r235j0019j0419r503p979p136o823o240n713n818n838n061
$$ 713817 706132 697401 688166 678147 667728 658225 650246 643110 636287 630047 624334 618516 612678 607617
60056F07617m479n166o042n541m416m390m902l972j786n90j075j510o70P07J790
$$ 607617 603138 597972 591930 586389 581973 577583 572681 568709 566923 566333 565258 563748 563078 563785 565575
60041E65575K866M141N015N114M722M012L043K391K494K575J532l53j938l020
$$ 565575 568441 572582 577597 582711 587433 591445 594488 596879 599373 601948 603480 603127 601189 598169
60027E98169m107m922m766m102m106m869n535n961o648p348p358o958p000p299
$$ 598169 594062 589140 584374 580272 576166 571297 565762 559801 553153 545805 538447 531489 524489 517190
60013E17190o955n991n139m311k889j198j35M02J141J853J783J279J344J832J774
$$ 517190 510235 504244 499105 494794 491905 490707 490572 490974 492115 493968 495751 497030 498374 500206 501980
59998E01980J204R68J081R16P78J465K545K810K255J942K131K276K529L416M356
$$ 501980 503184 504152 505233 506149 506927 508392 510937 513747 516002 517944 520075 522351 524880 528296 532652
59983E32652M382M038M576N529N209L523K078J418M84r57j554p07L45N14K85M77
$$ 532652 537034 541072 545648 551177 556386 559909 561987 563405 563889 562932 561378 560671 561016 561530 561815 562292
59967E62292J037J631K164K301J716J075J449K579L103K628K183K463K982L158
$$ 562292 563329 564960 567124 569425 571141 572216 573665 576244 579347 581975 584158 586621 589603 592761
59953E92761K969K386J361M25O5l03j463k774k967k281k124k768l207l230l744
$$ 592761 595730 598116 599477 599902 599967 599664 598201 595427 592460 590179 588055 585287 582080 578850 575106
59938E75106m842n378m863m108l669l116k210j348o55J03N56J68m52r3J200K314
$$ 575106 570264 564886 560023 555915 552246 549130 546920 545572 544917 545020 545576 545744 545292 545199 546399 548713
59922E48713K973L763M427M038K941K615L379M075M254M761N740O054N280M534
$$ 548713 551686 555449 559876 563914 566855 569470 572849 576924 581178 585939 591679 597733 603013 607547
59908F07547M628N036N285N768O504O536N385L843K663J587K06j302k766m260
$$ 607547 612175 617211 622496 628264 634768 641304 646689 650532 653195 654782 654988 653686 650920 646660
59894F46660n445n691n045m125l011j350M71J551J877K246K870L303L656M401
$$ 646660 641215 635524 630479 626354 623343 621993 622464 624015 625892 628138 631008 634311 637967 642368
59880F42368N118M897M051L914M930O223P007P095O225M345K318R76j77j846l242
$$ 642368 647486 652383 656434 660348 665278 671501 678508 685603 691828 696173 698491 699467 699290 697444 694202
59865F94202l314k959l821n422n887n088m544m414l404j717j211k208k868k346
$$ 694202 690888 687929 684108 678686 672799 667711 663167 658753 655349 653632 652421 650213 647345 644999
59851F44999j920k212k007p18L78N58R56K363L862M798O080Q346J0798J2898J5257
$$ 644999 643079 640867 638860 638142 638520 639078 640034 642397 646259 651057 657137 665483 676281 689179 704436
59836G04436J7675J8215J5571J0855N917J554j630k424m72K765N557P235P195
$$ 704436 722111 740326 755897 766752 772669 774223 772593 770169 769697 772462 778019 785254 792449
59823G92449M302j601q720j4850j8903k0532j9682j7257j4785j2861j0986r093
$$ 792449 796751 795150 786430 771580 752677 732145 712463 695206 680421 667560 656574 647481
59811F47481p670o381m426k515k318l598m131l033j854j642j421n30j43j122k476
$$ 647481 639811 633430 629004 626489 624171 620573 616442 613409 611555 609913 608492 607962 607819 606697 604221
59796F04221l264m117n597o899p372p523p468o329m301l220l805m338l509k511
$$ 604221 600957 596840 591243 584344 576972 569449 561981 555652 551351 548131 544326 539988 536479 533968
59782E33968k774l509l352k711k623k783k350j590j114o60Q1N85N96Q50J669K120
$$ 533968 531194 527685 524333 521622 518999 516216 513866 512276 511162 510502 510583 511168 511764 512614 514283 516403
59766E16403J677J211J361J485J272J669K970L711K872J521J006J041R98J413
$$ 516403 518080 519291 520652 522137 523409 525078 528048 531759 534631 536152 537158 538199 539197 540610
59752E40610K696L893M209M370N063N444M701L625L188K936K255J836K389L142
$$ 540610 543306 547199 551408 555778 560841 566285 570986 574611 577799 580735 582990 584826 587215 590357
59738E90357L043K268J351J83r64r39M26J450R73l6m60r19k074k815k003o06k48
$$ 590357 593400 595668 597019 597202 596238 595299 595725 597175 598148 598112 597652 596733 594659 591844 589841 589235 588987
59721E88987p65r68o58l13J27O59N11n35j300r60l89m73n29J67Q46Q12J000K262
$$ 588987 588222 587254 586596 586283 586410 587069 587580 587045 585745 584785 584396 583923 583394 583561 584407 585219 586219 588481
59703E88481L519L420K559K242K248J674R14R85J709K205K410K748L096L327L792
$$ 588481 592000 595420 597979 600221 602469 604143 605057 606042 607751 609956 612366 615114 618210 621537 625329
59688F25329M263L548J393o24j213r25m83N70K206K760J292n82j076q94j662l182
$$ 625329 629592 633140 634533 633909 632696 631771 631288 631858 634064 636824 638116 637534 636458 635564 633902 630720
59672F30720m231m690n042m957m246l933m659n201m365k945k227j931j364j008
$$ 630720 626489 621799 616757 611800 607554 603621 598962 593761 589396 586451 584224 582293 580929 579921
59658E79921j189p86Q21K125J848J263K065L514L958L653L759L917L275K491K344
$$ 579921 578732 577946 578767 580892 582740 584003 586068 589582 593540 597193 600952 604869 608144 610635 612979
59643F12979J744m38k893l776l824m904o590o971n909m777l786k249p46l75n02
$$ 612979 614723 614285 611392 607616 603792 598888 592298 585327 579418 574641 570855 568606 567860 567485 566983
59628E66983K68J393J241l1q77j129j843k841k802j611m30K76Q86J131M58p25
$$ 566983 567251 568644 569885 569854 568977 567848 566005 563164 560362 558751 558321 558597 559483 560614 561072 560347
59612E60347j761k976m454m783l009o98J64J78J041K335K491J891K088K649J817
$$ 560347 558586 555610 551156 546373 543364 542666 542830 543008 544049 546384 548875 550766 552854 555503 557320
59597E57320k15j506j615j904k756l098k617k070j461k13J094J301P44O06O31
$$ 557320 557105 555599 553984 552080 549324 546226 543609 541539 540078 539865 540959 542260 543004 543610 544241
59582E44241l45j948k662k260j742j321o69n72k010m020m727m032l112k091n04
$$ 544241 543896 541948 539286 537026 535284 533963 533294 532722 530712 526692 521965 517933 514821 512730 512226
59567E12226O87K06r96r29K22O82K59K11N29J97k49O18K180K329Q91k53l09j30
$$ 512226 512913 513119 512123 511194 511416 512098 512357 512568 513097 513294 513045 513663 515843 518172 519063 518810 518501 518371
59549E18371J47J260K693L005K338K147K683L138L744N157O460O641P264J0454
$$ 518371 518518 519778 522471 525476 527814 529961 532644 535782 539526 544683 551143 557784 565048 575502
59535E75502J4981J8005J9946K3309K6669K4628J5061K506p114j1836j2504r949
$$ 575502 590483 608488 628434 651743 678412 703040 718101 720607 713493 701657 689153 679204
59523F79204n448j325J103K588L844M279L549K448J354k35k171l622m956p378
$$ 679204 673756 672431 673534 676122 679966 684245 687794 690242 691596 691361 689190 685568 680612 673234
59509F73234j0372j1841j1251j0255r858r387q641q420q422p246n084l833l966
$$ 673234 662862 651021 639770 629515 619657 610270 601629 593209 584787 577541 572457 568624 564658
59496E64658l888k971k540l098l272k388j572j414j016j50Q3m40l39P44J507J561
$$ 564658 560770 557799 555259 552161 548889 546501 544929 543515 542499 542349 542432 541992 541653 542397 543904 545465
59480E45465K118L442M192M012M184N005N223M848N596P581Q407O793M346K631
$$ 545465 547583 551025 555217 559229 563413 568418 573641 578489 584085 591666 600073 606866 611212 613843
59466F13843J186l63r21j06O59O06Q50J964K834L094M134O414Q286Q860R485J1033
$$ 613843 615029 614666 613745 613639 614298 614904 615754 617718 620552 623646 627780 634194 642480 651340 660825 671858
59450F71858J2244J2288J2382J3318J3739J2513J0557Q755O328K759r01m131p947
$$ 671858 684102 696390 708772 722090 735829 748342 758899 767654 773982 776741 775840 771709 763762
59437G63762j2376j5360j5767j5139j4805j3778j1250q687p397o341m435k811
$$ 763762 751386 736026 720259 705120 690315 676537 665287 656600 649203 642862 638427 635616
59425F35616k604k580j186R20K488M033O456R089J1132J3340J6385J9218K0957
$$ 635616 633012 630432 629246 630166 632654 636687 643143 652232 663364 676704 693089 712307 733264
59412G33264K2563K4706K6074K5998K6369K7934K6596J7155K94j7114k8440l1785
$$ 733264 755827 780533 806607 832605 858974 886908 913504 930659 930953 913839 885399 853614
59400H53614k8777k2047j4304p400j079N921J2687J5062Q980n006k0962l1811
$$ 853614 824837 802790 788486 781086 780007 785928 798615 813677 822657 817651 796689 764878
59388G64878l4778l2502k8913k5148k0410j5138j1020q341n963l871l295l994
$$ 764878 730100 697598 668685 643537 623127 607989 596969 588628 582665 578794 575499 571505
59376E71505l865j973K92J656K477L177L443L605M649O187O613N839N536O139
$$ 571505 567640 565667 565959 567615 570092 573269 576712 580317 584966 591153 597766 603605 609141 615280
59362F15280O218N426N282O149O398N656N879P893R774J0218J0541J1806J2802
$$ 615280 621498 626924 632206 638355 644753 650409 656288 664181 673955 684173 694714 706520 719322
59349G19322J2809J3426J5621J7637J8051J8286J9805K1317K1219K0492K0535
$$ 719322 732131 745557 761178 778815 796866 815152 834957 856274 877493 897985 918520
59338I18520K0220J7797J3984J0535P281L049j823o118r709j2978j5498j7067
$$ 918520 938740 956537 970521 981056 988337 991386 989563 983445 973736 960758 945260 928193
59326I28193j8708k0927k2401k1901k0056j7849j5203j2375j0840j1042j1308
$$ 928193 909485 888558 866157 844256 824200 806351 791148 778773 767933 756891 745583
59315G45583j0464r525r280q522o431m382l475k611j017j53r34j511k65J343J482
$$ 745583 735119 725594 716314 707792 701361 696979 693504 690893 689876 689723 688789 687278 687013 688356 689838
59300F89838J166K008L035K746K366L912O674Q752J0549J3655J7498K0239K2139
$$ 689838 691004 693012 696047 698793 701159 705071 711745 720497 731046 744701 762199 782438 804577
59287H04577K5043K8936L1235K9079K0892P109q700k0950k6463k6795k4900k1572
$$ 804577 829620 858556 889791 918870 939762 946871 938171 917221 890758 863963 839063 817491
59275H17491j6802j2096q629n242q77K910M562N533P704R778R496P664O576O005
$$ 817491 800689 788593 779964 774722 773845 776755 781317 786850 794554 804332 813828 821492 828068 834073
59261H34073M212J597k43k008n632j0414j3680j4785j5400j6178j6148j5142j4060
$$ 834073 838285 839882 839639 837631 831999 821585 807905 793120 777720 761542 745394 730252 716192
59248G16192j2927j1118r122p849o818n129l416k589j741L54K810M093M754O071
$$ 716192 703265 692147 683025 675176 668358 663229 659813 657224 655483 655837 658647 662740 667494 673565
59234F73565P306P077O224O331O623N412L498K863K878J286j687l689m284n330
$$ 673565 680871 687948 694172 700503 707126 712538 716036 718899 721777 723063 721376 717687 713403 708073
59220G08073p414r139r921j0511j0689r248o509m280l216k509j945j950j917q83
$$ 708073 700659 691520 681599 671088 660399 651151 644642 640362 637146 634637 632692 630742 628825 627942
59206F27942M05M71k67j87P59J386J797K941M208M213L571M106N573N884M510
$$ 627942 628347 628818 628551 628364 629123 630509 632306 635247 639455 643668 647239 651345 656918 662802 667312
59191F67312L122K858L290L934M587M519L478K931M073N424M849L129K666L407
$$ 667312 670434 673292 676582 680516 685103 689622 693100 696031 700104 705528 710377 713506 716172 719579
59177G19579L202J709Q31J245J577J118P55R33J192J722L158M917N997O964Q852
$$ 719579 722781 724490 725321 726566 728143 729261 730016 730949 732141 733863 737021 741938 747935 754899 763751
59162G63751J0629J0415Q730P748P696O788M544K335O96j252l679n839p768r881
$$ 763751 774380 784795 793525 801273 808969 815757 820301 822636 823332 822080 818401 812562 804794 794913
59148G94913j1240j0716r395r112r319q151o045n070n184m491l035k820l978m345
$$ 794913 783673 772957 763562 754450 745131 736980 730935 725865 720681 716190 713155 710335 706357 702012
59134G02012l268k588l169l555k740j532n06P71J913J701M72J12J167K269K782
$$ 702012 698744 696156 692987 689432 686692 685160 684654 685425 687338 689039 689511 689623 690790 693059 695841
59119F95841L635N154O424P160Q095R218R750R903J0488J1010J0435R539R953
$$ 695841 699476 704630 711054 718214 726309 735527 745277 755180 765668 776678 787113 796652 806605
59106H06605J1085J0787Q912P385O735N502L312J607Q68j66k038l749m813n756
$$ 806605 817690 828477 837389 844774 851509 857011 860323 861930 862798 862632 860594 856845 852032 846276
59092H46276o381n872m698m113l853k689j126q62j776k172j940k686m669o491
$$ 846276 839895 834023 829325 825212 821359 818670 817544 816682 814906 812734 810794 808108 803439 796948
59078G96948p784r452j1136j1414j0565j0310j0656r983q328p526p870p592o027
$$ 796948 789164 779712 768576 757162 746597 736287 725631 715648 707320 699794 691924 684332 678305
59065F78305m446l435k292j250j441k371k333j446j412k167j876m71K6r32j636
$$ 678305 673859 670424 668132 666882 665441 663070 660737 659291 657879 655712 653836 653365 653391 652459 650823
59050F50823j342j234j724j745j210j256j744j387m83n73j257o01J154J735R20
$$ 650823 649481 648247 646523 644778 643568 642312 640568 639181 638698 638125 636868 636267 637421 639156 640076
59035F40076R89K572L589K999K223K096J701J034J642L760N754P091Q893J1141
$$ 640076 641065 643637 647226 650225 652448 654544 656245 657279 658921 662681 668435 675526 684419 695560
59021F95560J2416J2807J3878J5392J5408J3766J2182J0599P241K579o62j979
$$ 695560 707976 720783 734661 750053 765461 779227 791409 802008 809249 811828 811166 809187
59009H09187l571n881o740n657m766m499k658J011L624L960M350O227P846Q064
$$ 809187 805616 799735 792995 787338 782572 778073 775415 776426 780050 784010 788360 794587 802433 810497
58995H10497Q366R326Q929O315L621K339J364J75J68J092J01l649p239q739r931
$$ 810497 818863 828189 837118 843433 847054 849393 850757 850932 851100 852192 852293 848644 841405 832666 822735
58980H22735j2199j3571j2336j0093q657p118m413j758j89J392L657N238N634
$$ 822735 810536 796965 784629 774536 765879 758761 754348 752590 752401 753793 757450 762688 768322
58967G68322O659R096J1012J1357J1991J4105J5869J5730J4900J4513J3418J0857
$$ 768322 774981 784077 795089 806446 818437 832542 848411 864141 879041 893554 906972 917829
58955I17829Q186N943K385l057q109j1377j4372j7802j9552j8574j7278j7447
$$ 917829 926015 931958 934343 931286 923177 911800 897428 879626 860074 841500 824222 806775
58943H06775j7320j5186j2537j0960r260o377l910l015k053m9P87j031l095k956
$$ 806775 789455 774269 761732 750772 741512 735135 731225 728210 726157 726108 726895 725864 722769 719813
58929G19813k162l207n227n949n528n337n256m848n014n920n707l617j875k123
$$ 719813 717651 714444 709217 703268 697740 692403 687147 682299 677285 671365 665658 662041 660166 658043
58915F58043k714j871o83m30P4J857L330L200L001M128N240N245N894Q526J1225
$$ 658043 655329 653458 652775 652345 652419 654276 657606 660806 663807 667935 673175 678420 684314 692840 704065
58900G04065J2111J2592J4438J6440J6964J7009J7799J8124J7040J6377J7624
$$ 704065 716176 728768 743206 759646 776610 793619 811418 829542 846582 862959 880583
58889H80583J9143J9461K0424K3854K7968L0275L1202L1687L0100K5120J8933
$$ 880583 899726 919187 939611 963465 991433 1021708 1052910 1084597 1114697 1139817 1158750
58878A158750J4109R874M704j92l524p230j3343j9922k3766k4926k5190k4458
$$ 1158750 1172859 1182733 1187437 1187245 1183721 1176491 1163148 1143226 1119460 1094534 1069344 1044886
58866A044886k2158j9838j8830j7558j4579j1855j1634j2580j2531j2517j4294
$$ 1044886 1022728 1002890 984060 966502 951923 940068 928434 915854 903323 890806 876512
58855H76512j6370j6431j5441j5510j5800j4423j2338j1469j0937q998o837o610
$$ 876512 860142 843711 828270 812760 796960 782537 770199 758730 747793 738795 731958 725348
58843G25348p480p305o566p006q053q079p576p754p774o521n244n336n546m517
$$ 725348 717868 710563 703997 696991 688938 680859 673283 665529 657755 651234 645990 640654 635108 630591
58829F30591l708m567n325m087k525k817l430j905O32J653J637K272K680J473
$$ 630591 626883 622316 616991 612904 610379 607562 604132 602227 602859 604512 606149 608421 611101 612574
58815F12574L69J524L377L324K344K800L796L048J407J161J739J301O68J373J834
$$ 612574 612943 614467 617844 621168 623512 626312 630108 633156 634563 635724 637463 638764 639432 640805 642639
58800F42639p8k599k683j208j041j833j367l83j230l099l311k114j696j765m80
$$ 642639 642561 639962 637279 636071 635030 633197 631830 631447 630217 627118 623807 621693 619997 618232 617752
58785F17752J451K028J983L318N179N419M856N637O904O445N123N242N928M703
$$ 617752 619203 621231 623214 626532 631711 637130 641986 647623 654527 660972 666095 671337 677265 681968
58771F81968K192P45j89k691n775o821o290o560p329o705n447n551o011m567k240
$$ 681968 684160 684905 684716 682025 676250 669429 663139 656579 649250 642545 637098 631547 625536 620969 618729
58756F18729j496j466K26K516K734J857K721M467M051K122J955L566M195L824
$$ 618729 617233 615767 615993 618509 621243 623100 625821 630288 634339 636461 638416 641982 646177 650001
58742F50001M860P091Q117Q109R089J0318R487P608P597Q874Q666P688Q966J1786
$$ 650001 654861 661952 670069 678178 687267 697585 707072 714680 722277 731151 739817 747505 756471 768257
58728G68257J2446J0708R860J0654J0645R398Q987R308Q173O031N601O919P671
$$ 768257 780703 791411 801271 811925 822570 831968 840955 850263 858436 864467 870068 876987 884658
58715H84658Q034J0093J2839J3063J0941R541R092P019L388P87r55m497r463j2669
$$ 884658 892692 902785 915624 928687 939628 949169 958261 965280 968668 969455 968500 964003 954540 941871
58701I41871j3925j6161j9757k2210k3412k5826k9013k9561k6885k4001k2116
$$ 941871 927946 911785 892028 869818 846406 820580 791567 762006 735121 711120 689004
58690F89004j9578j6342j4337j3138j0405o800n396o143o024m651m483n527n220
$$ 689004 669426 653084 638747 625609 615204 608404 603008 596865 590841 586190 581707 576180 570960
58677E70960l565l071l578k531k64M93J11J455L983M491L538M990R025J1806J2380
$$ 570960 567395 564324 560746 558215 557951 558444 558555 560010 563993 568484 572022 577012 586037 597843 610223
58662F10223J3624J5949J6337J4267J2290J0246N362j234m723m353m462o730p919
$$ 610223 623847 639796 656133 670400 682690 692936 698298 697064 692341 687988 683526 676796 668877
58649F68877o677n920o785o508m211k824l437l476k116j804k917k671q35o67k703
$$ 668877 662200 656280 649495 642987 638776 635952 632515 629039 626923 625119 622202 619531 618696 618029 615326
58634F15326l493k047j534l015l428j694q58k289l355k763k642l546k961m63J080
$$ 615326 611833 609786 608252 605237 601809 600115 599257 596968 593613 590850 588208 584662 581701 581238 582318
58619E82318J038K230N269P301P620Q835J1199J1774J0421J0477J2124J1447P540
$$ 582318 583356 585586 590855 598156 605776 614611 625810 637584 648005 658482 670606 682053 689593
58606F89593M151K728M29l323n081m077m002n988o508m481l665n572o649n060
$$ 689593 693744 696472 696901 693578 688497 684420 680418 674430 667922 663441 659776 654204 647555 642495
58592F42495l697l858k551J122L438K828K897N786Q649R483J0368J2239J2584
$$ 642495 638798 634940 632389 633511 636949 639777 642674 648460 657109 666592 676960 689199 701783
58579G01783J0991J0761J2541J2542R581P395P556O852M292L692O419Q528Q259
$$ 701783 712774 723535 736076 748618 758199 765594 773150 780002 784294 787986 794405 802933 811192
58566H11192R365J3747J7737J9128K0987K4937K7531K7054K6995K8924K8697K3818
$$ 811192 820557 834304 852041 871169 892156 917093 944624 971678 998673 1027597 1056294 1080112
58554A080112J7966J4193J0126M022r80k813m496q125j0993j1541j2810j6157
$$ 1080112 1098078 1112271 1122397 1126419 1125439 1122626 1118130 1110005 1099012 1087471 1074661 1058504
58542A058504j7894j6139j4647j5968j7300j6890j7839k1453k3558k1635j9055
$$ 1058504 1040610 1024471 1009824 993856 976556 959666 941827 920374 896816 875181 856126
58531H56126j8251j6453j2307r636j0212r841o118l038l270l082K42L109K713
$$ 856126 837875 821422 809115 799479 789267 779426 773308 770270 767000 763918 764160 767269 769982
58518G69982K359M495N552L115J200K885M522K857J108K250K977K08k856k915
$$ 769982 772341 776836 782388 785503 786703 789588 794110 796967 798075 800325 803302 803510 800654 797739
58504G97739k483m116n097l386k390m377n725l981k887m998o390m240k449l927
$$ 797739 795256 791140 786043 782657 780267 775890 770165 766184 763297 758299 751909 747669 745220 741293
58490G41293m746j995J35j528k558Q34M450M060L282O296R835R985R966J3422
$$ 741293 736547 734552 734687 733159 730601 731435 735885 739945 743227 749523 759358 769343 779309 792731
58476G92731J6729J5760J3731J4562J4868J0440M524J744r7m453q445q640q313
$$ 792731 809460 825220 838951 853513 868381 878821 883345 885089 884992 880539 872094 863454 855141
58463H55141j1122j3498j1164p289o402o144k826Q41J375J812N550Q962Q011O103
$$ 855141 844019 830521 819357 812068 805666 799522 796696 797537 798912 800724 806274 815236 823247 829350
58449H29350P447Q815N861J486j36j535n862r299p879n402o307p197l925k85q02
$$ 829350 836797 845612 851473 852959 852823 851288 845426 836127 828248 822846 816539 809342 805417 805132 804330
58434H04330j683J840N917N200K971M536P053N687L569N647Q873Q414P443J0691
$$ 804330 802647 804487 810404 815604 818575 823111 830164 835851 839420 845067 853940 862354 869797 880488
58420H80488J4344J2745R067R002R807O112Q34l92N2k865o403n582l529n720r432
$$ 880488 894832 907577 916644 925646 935453 941565 942399 942007 942059 939194 932791 927209 923680 917960 908528
58405I08528r356p988r881j1604q260l939m612o686l885O46O56r64J866O129N449
$$ 908528 899172 891184 881303 869699 861439 857500 852888 846202 842317 842963 843619 842655 844521 850650 856099
58390H56099K379K934M603J913j783m73K433N70k670n90L573K800j42J497M889
$$ 856099 858478 861412 866015 867928 866145 865672 868105 868675 866005 865415 868988 871788 871646 873143 878032
58375H78032L348l7J817O043N464K785N156R930J0004Q057J1044J5717J4315R780
$$ 878032 881380 881343 883160 889203 894667 897452 902608 912538 922542 930599 941643 957360 971675 981455
58361I81455J0490J4672J4700J2073J3163J5174J1505O114P069J0685P836J172
$$ 981455 991945 1006617 1021317 1033390 1046553 1061727 1073232 1079346 1086415 1097100 1104936 1106108
58349A106108P7L187K264j129O74N478N410K782N305J0099R147N925R395J6208
$$ 1106108 1106185 1109372 1111636 1110507 1111181 1116659 1122069 1124851 1130156 1140255 1149402 1155327 1164722 1180930
58335A180930J6529J2744J4343J8906J6970J1357J2450J8132J7806J2586J2039
$$ 1180930 1197459 1210203 1224546 1243452 1260422 1271779 1284229 1302361 1320167 1332753 1344792
58324A344792J4454J0390K413J187N048L594j499J06O404O438J765L323R675R966
$$ 1344792 1359246 1369636 1372049 1373236 1378284 1381878 1380379 1380485 1386889 1393327 1395092 1398415 1408090 1418056
58310A418056N869Q584J6341J7213J2250J3194J9237J8984J3638J4856K1148K0141
$$ 1418056 1423925 1432509 1448850 1466063 1478313 1491507 1510744 1529728 1543366 1558222 1579370 1599511
58298A599511J2996J2555J8444J8325J2822J4365K2100K3036J7558J8496K5459
$$ 1599511 1612507 1625062 1643506 1661831 1674653 1689018 1711118 1734154 1751712 1770208 1795667
58287A795667K5840K0652K2975L1347L1646K4967K5975L3913L3758K6175K6923
$$ 1795667 1821507 1842159 1865134 1896481 1928127 1953094 1979069 2012982 2046740 2072915 2099838
58276B099838L6020L7461L0660L1581M1065M3192L7183L9297N0463N3996M8462
$$ 2099838 2135858 2173319 2203979 2235560 2276625 2319817 2357000 2396297 2446760 2500756 2549218
58265B549218N0391O1193O4325N8678O1162P2483P4683O6545O6355P5520P5439
$$ 2549218 2599609 2660802 2725127 2783805 2844967 2917450 2992133 3058678 3125033 3200553 3275992
58254C275992O4901O3500P3192P4462O5746O7456Q1261Q5806P9066Q3322J01188
$$ 3275992 3340893 3404393 3477585 3552047 3617793 3685249 3766510 3852316 3931382 4014704 4115892
58243D115892J09592J05006J10523J29679J38795J34228J40526J61659J72295
$$ 4115892 4225484 4330490 4441013 4570692 4709487 4843715 4984241 5145900 5318195
58234E318195J68278J76090K00655K15057K14482K27199K58457K78560K81300
$$ 5318195 5486473 5662563 5863218 6078275 6292757 6519956 6778413 7056973 7338273
58225G338273K97350L34031L60879L71606L98755M48890M87633N08312N48027
$$ 7338273 7635623 7969654 8330533 8702139 9100894 9549784 10037417 10545729 11093756
58216A1093756O15099O71641P10489P74309Q73910R67121J045572J158015J318099
$$ 11093756 11708855 12380496 13090985 13865294 14739204 15706325 16751897 17909912 19228011
58207A9228011J479231J633939J842079K124313K431732K762183L194807L764172
$$ 19228011 20707242 22341181 24183260 26307573 28739305 31501488 34696295 38460467
58199C8460467M423801N186880O168098P428303Q931365J0723441J2979998J5796156
$$ 38460467 42884268 48071148 54239246 61667549 70598914 81322355 94302353 110098509
58191A10098509J9134721K3055362K7677052L2709993L7345656M0870813M2927227
$$ 110098509 129233230 152288592 179965644 212675637 250021293 290892106 333819333
58184C33819333M2579550L7550692K5604235P312268j3036263k9913461m0019189
$$ 333819333 376398883 413949575 439553810 446866078 433829815 403916354 363897165
58177C63897165m3431077m2109124l8027596l2552878k6663548k1063314j6075328
$$ 363897165 320466088 278356964 240329368 207776490 181112942 160049628 143974300
58170A43974300j1713929q024708n375979m341245n147399p187892r234711j0288282
$$ 143974300 132260371 124235663 118859684 114518439 109371040 102183148 92948437 82660155
58162H2660155j0194402r410462q365526p220162o072674n069107m265468l587256
$$ 82660155 72465753 63055291 54689765 47469603 41396929 36327822 32062354 28475098
58154B8475098k987773k510732k165663j877674j602850j378518j220950j078810
$$ 28475098 25487325 22976593 20810930 18933256 17330406 15951888 14730938 13652128
58146A3652128r26407q06455p40825o85719o12820n54520n31681n10762m68588
$$ 13652128 12725721 11919266 11178441 10492722 9879902 9325382 8793701 8282939 7814351
58137G814351m31327m14982l91125l44438l04248k87645k68008k29516j98164
$$ 7814351 7383024 6968042 6576917 6232479 5928231 5640586 5372578 5143062 4944898
58128D944898j89858j80547j56446j43088j55473j67366j58745j48373j51707
$$ 4944898 4755040 4574493 4418047 4274959 4119486 3952120 3793375 3645002 3493295
58119C493295j50436j31629j15424j16190j15240r8578q4195q6082q7329p4326
$$ 3493295 3342859 3211230 3095806 2979616 2864376 2765798 2681603 2595521 2508192 2433866
58109B433866o2955o6055o8304n7616m9378n5596o0988n2941m5412n0287n4120
$$ 2433866 2370911 2304856 2236552 2178936 2129558 2073962 2012974 1960033 1914621 1864334 1810214
58098A810214m5776l8960m4962n0139m2447l4268l7356m0359l2364k4375k6712
$$ 1810214 1764438 1725478 1680516 1630377 1587930 1553662 1516306 1475947 1443583 1419208 1392496
58087A392496k8672k0793j4248j8404k1814j4990r692j6217k3300j9960j6080
$$ 1392496 1363824 1343031 1328783 1310379 1288565 1273575 1263883 1247666 1224366 1204406 1188326
58076A188326k1968k8088k4389j9925k4191k8170k2700j6979k0304k3652j7778
$$ 1188326 1166358 1138270 1113881 1093956 1069765 1041595 1018895 1001916 981612 957960 940182
58065I40182j1710j5051j9143j4032p408q815j1278o345j602n646j0858q345n070
$$ 940182 928472 913421 894278 880246 872838 864023 852745 846400 844798 839152 828294 819949 814879
58052H14879r341j3967j0650o596j0166j4182j0078m812p137j0627o866k287n338
$$ 814879 805538 791571 780921 774325 764159 749977 739899 735087 727950 717323 710457 708170 702832
58039G02832r699o766k533n624j0423q301m230o259r613o988l863p878j3378j1918
$$ 702832 693133 686367 683834 678210 667787 659486 655256 648997 639384 632396 628533 620655 607277 595359
58025E95359q018r492j2124q976m949p183j0525p292k281l453o871n212k263m566
$$ 595359 587341 577849 565725 556749 551800 544617 534092 526800 524519 521066 514195 508983 506720 502154
58011E02154p587m499p6j683m951k523J385n69m174j775K857K023j035R77M866
$$ 502154 494567 490068 489992 488309 483358 480835 482220 481651 477477 475702 478559 480582 479547 480524 485390
57996D85390L430l08O91L593J624k306j456J365m38l999k608J078L86k407j187
$$ 485390 488820 488512 489203 492796 494420 492114 490658 492023 491585 487586 484978 486056 486442 484035 482848
57981D82848J396q57n113m722j943l149o329n495k731l786o363m743j357k098
$$ 482848 484244 483387 478274 473552 471609 468460 462131 456636 453905 450119 443756 439013 437656 435558
57967D35558m610l015L50n12l394k169J430J622j15J277L760K367l12J112L899
$$ 435558 430948 427933 428283 427771 424377 422208 423638 425260 425145 426422 430182 432549 432237 433349 437248
57952D37248K190j484q92K009J223j388P0L754L647J262K400N607N216K658L479
$$ 437248 439438 437954 437062 439071 440294 438906 438976 442730 446377 447639 450039 455646 460862 463520 466999
57937D66999O219N442K846M162P806P775N192N860Q789Q204M781M016N388L835
$$ 466999 473218 478660 481506 485668 493474 501249 506441 512301 521090 529294 534075 538091 543479 547314
57923E47314J94l33J597Q62k199l177k917n636r750j0350q771r987j2667j1740
$$ 547314 547508 547175 548772 549634 547435 544258 541341 535705 525955 515605 506834 496847 484180 472440
57909D72440q539q267r614p241k588j731m154m147j856k406n273n073k061j529
$$ 472440 463901 455634 446020 438779 436191 434460 430306 426159 424303 421897 416624 411551 409490 407961
57895D07961l420k739K52L84k230k269O41J523l04n78R90M47j788j242J721K239
$$ 407961 404541 401802 402054 402438 400208 397939 398580 400103 399799 399221 400211 400658 398870 397628 399349 401588
57879D01588J39j38J505Q22j953k367p49j955n981p731o406o267p853p210m284
$$ 401588 401727 401589 403094 403916 401963 399596 398847 396892 390911 383180 376774 370507 362654 355444 351160
57864C51160l371m759m377k175k373m912n188k694j583k167m55L381M678L167
$$ 351160 347789 343030 338653 336478 334105 329193 324005 321311 319728 317561 317106 320487 325165 328332
57850C28332L614O739P958O197N568P090P126N198N209P414P291L930J718K131
$$ 328332 331946 338685 346643 352840 358408 365498 372624 377822 383031 390445 397736 401666 403384 405515
57836D05515J639p45j547p2l5k325l385k302k253l548k696K73R77j260j954L84
$$ 405515 407154 406409 404862 404790 404755 402430 399045 396743 394490 390942 388246 388519 389496 388236 386282 386666
57820C86666K017J595K448N412O676M945L712M282L475M19j232j39K98j451k437
$$ 386666 388683 390278 392726 398138 404814 409759 413471 417753 421228 421647 420415 420276 420574 419123 416686
57805D16686j424j388l653n569o080p549j0248j1051r415q715r979j0187q270
$$ 416686 415262 413874 410221 404652 398572 391023 380775 369724 360309 351594 341615 331428 323158
57792C23158o810o405m507j233l0j223j225N69P06j205j205J611L317K583K901
$$ 323158 316348 309943 305436 304203 304173 302950 301725 302294 303000 301795 300590 302201 305518 308101 311002
57777C11002N453O721N475N291P652R208Q402Q272J0073J0657Q782P570Q100P033
$$ 311002 316455 323176 328651 333942 341594 350802 359204 367476 377549 388206 396988 404558 412658 419691
57763D19691L344Q36J068L14l359o408o495o496q449r633q296p341q643r392p714
$$ 419691 423035 423871 424939 425253 421894 415486 408991 402495 394046 384413 376117 368776 360133 350741 343027
57748C43027o345p083p089m458k142k504l049j438J52n70j856j807j927l428m405
$$ 343027 336682 329599 322510 318052 315910 313406 310357 308919 309071 308501 306645 304838 302911 299483 295078
57733B95078l845m086o174p289n797m257m470m213k002k79o93r04P15J852R73
$$ 295078 291233 287147 280973 273684 267887 263630 259160 254947 252945 252666 251973 251069 251784 253636 254609
57718B54609N54K192L148J304q56p56K4n73j280p89p52k224l076k031j263k107
$$ 254609 255163 257355 260503 261807 260951 260195 260219 259646 258366 257577 256825 254601 251525 249494 248231 246124
57702B46124k393r85m56k142l132j509l2r76j887k54J738J194o08j136q51r93
$$ 246124 243731 242746 242290 240148 237016 235507 235475 234499 232612 232358 234096 235290 234682 233546 232695 231702
57686B31702o15P84J205q9m62J503L163K684K520M767P277Q042R278J3252J7944
$$ 231702 231087 231871 233076 232987 232525 234028 237191 239875 242395 247162 254439 262481 271759 285011 302955
57671C02955K0908K3928K9852L8115M6895N6449O6792P5335P9736P9369P1266
$$ 302955 323863 347791 377643 415758 462653 519102 585894 661229 740965 820334 891600
57660H91600M9747J4668k3945n4131p1836p9287p8287p0273n9371m9696m1327
$$ 891600 941347 956015 932070 877939 806103 726816 648529 578256 518885 469189 427862
57649D27862l2903k5760k1601j8829j5218j1712r910q429n576k966k661l285k633
$$ 427862 394959 369199 347598 328769 313551 301839 291929 283500 277924 274958 272297 269012 266379
57636B66379j577j758k076j040K4l75p52L83J248M4j418r86j11q28j748r08J91
$$ 266379 264802 263044 260968 259928 259952 259577 258825 259208 260456 260500 259082 258096 257985 257157 255409 254501 254692
57619B54692o19k025j811r59j335j939j289q26k056l018j582M04L46m39M88J912
$$ 254692 254073 252048 250237 249278 247943 246004 244715 243889 241833 238815 237233 237637 237983 237544 238032 239944
57603B39944J353j38o9Q61N23l32J83J035K40j075p93p2j274l425l957l253l343
$$ 239944 241297 241159 241090 241951 242474 242142 242325 243360 243600 242525 241732 241660 240386 236961 233004 229751 226408
57586B26408l749k728j113r08j497j047k43q67k202k449k141k678l193k345j354
$$ 226408 222659 219931 218818 217910 216413 215366 215123 214256 212054 209605 207464 204786 201593 199248 197894
57571A97894j748k186j078p0j158k680k195j000j476k319r87J226J304o9l5J123
$$ 197894 196146 193960 192882 192812 191654 188974 186779 185779 184303 181984 180997 182223 183527 183458 183423 184546
57555A84546R77j20J01J251J192M98J365L079L139J954K038L259L348K332K162
$$ 184546 185523 185403 185504 186755 187947 188445 189810 192889 196028 197982 200020 203279 206627 208959 211121
57540B11121K632J914N16N61J773K173J948K555K979J167j619k323j282j510l373
$$ 211121 213753 215667 216183 216744 218517 220690 222638 225193 228172 229339 227720 225397 224115 222605 219232
57525B19232m372l903l812m369l924k556k074k448k049j151j410k180j292P90
$$ 219232 214860 210957 207145 202776 198852 196296 194222 191774 189725 188574 187164 184984 183692 184482
57511A84482J579J036J395K737K844J525J009J783J906Q20J81M95L75n27j054
$$ 184482 186061 187097 188492 191229 194073 195598 196607 198390 200296 201116 201297 201792 202167 201640 200586
57496B00586j120j693k294j638m47m45j049m16P54J41j907k768j963j446j666
$$ 200586 199466 197773 195479 193841 193394 192949 191900 191484 192238 192379 190472 187704 185741 184295 182629
57481A82629j216k87o44j964j947l72N25m8o06n74q91j307m82J020J092m30j712
$$ 182629 181413 181126 180482 178518 176571 176199 176724 176676 176070 175496 174605 173298 172816 173836 174928 174498 172786
57464A72786k231k934l374k155l3Q64O91J339K580K474J339J379K487K390J023
$$ 172786 170555 167621 164247 162092 162059 162923 163614 164953 167533 170007 171346 172725 175212 177602 178625
57449A78625P13J729J742J23j025p58m75o65r3J213J641J181J509K532K286O69
$$ 178625 179338 181067 182809 182932 181907 181149 180674 180009 179916 181129 182770 183951 185460 187992 190278 190947
57433A90947k46O8Q6l75J41J347J247j01n72qm20j799j744J45J454J174Q82J075
$$ 190947 190701 190769 190855 190480 190621 191968 193215 193114 192542 192534 192114 190315 188571 188716 190170 191344 192226 193301
57415A93301K93j338j665m81r8j109j454n01q9n58R7K042K654J059l95m78q26
$$ 193301 193594 192256 190591 190110 190012 188903 187449 186948 186859 186301 186398 188440 191094 192153 191758 191280 190454
57398A90454k005j890K71K041J860J232J256O97p09p74J286K967K413J054N01
$$ 190454 188449 186559 186830 188871 190731 191963 193219 193916 193207 192433 193719 196686 199099 200153 200654
57383B00654J28m86k0J736K676J824R64J161R36l63q08N69J741J249O54J353K033
$$ 200654 200782 200296 200276 202012 204688 206512 207476 208637 209573 209210 208402 208971 210712 211961 212615 213968 216001
57366B16001J382M61L22J12n61k42J459K453J583N65P42Q70J2m33M44J202J009
$$ 216001 217383 217844 218166 218278 217717 217475 218934 221387 222970 223535 224277 225147 225159 224726 225170 226372 227381
57349B27381J366K856L415J983P53J400K206J378J73J31J97p00j059L31J611Q37
$$ 227381 228747 231603 235018 237001 237754 239154 241360 242738 242911 243042 243239 242539 241480 241811 243422 244259
57333B44259p34j063n95l99M07K481L798K436j00j211q84m61K14J597K354J323
$$ 244259 243525 242462 241867 241468 241875 244356 248154 250590 250490 249279 248395 247934 248148 249745 252099 253422
57317B53422j21k43K02k21p51j2J278J755J897K536K654J244k51%J213J597J468
$$ 253422 253301 253058 253260 253039 252288 252276 253554 255309 257206 259742 262396 263640 263389 263389 264602 266199 267667
57300B67667K107K964K673J688J455J905K092K203K850L474L452L577M486N011
$$ 267667 269774 272738 275411 277099 278554 280459 282551 284754 287604 291078 294530 298107 302593 307604
57286C07604M078K857K962L849M056L647L478L329K779K586L285L793L243K731
$$ 307604 311682 314539 317501 321350 325406 329053 332531 335860 338639 341225 344510 348303 351546 354277
57272C54277L448M562M834M655M644L956K029L56L89J347K027K949M596N498M525
$$ 354277 357725 362287 367121 371776 376420 380376 382405 382761 383150 384497 386524 389473 394069 399567 404092
57257D04092L302L790N065N100M182L916M206L947L506L933M702M655M242M556
$$ 404092 407394 411184 416249 421349 425531 429447 433653 437600 441106 445039 449741 454396 458638 463194
57243D63194N185N167M982N424N734N023M307M888N988O247O312P545R311R890
$$ 463194 468379 473546 478528 483952 489686 494709 499016 503904 509892 516139 522451 529996 539307 549197
57229E49197R172Q233P340O442O454P832R062Q738P884Q077Q645Q145P222P419
$$ 549197 558369 566602 573942 580384 586838 594670 603732 612470 620354 628431 637076 645221 652443 659862
57215F59862Q219P914O562N628N554N915P128R716J2639J4493J5591J7000J8589
$$ 659862 668081 675995 682557 688185 693739 699654 706782 716498 729137 743630 759221 776221 794810
57202G94810J9833K1320K3436K4981K5178K5539K7529K9884L0632L0264L0342
$$ 794810 814643 835963 859399 884380 909558 935097 962626 992510 1023142 1053406 1083748
57191A083748L0547K9739K8603K8461K8700K8075K7276K7462K7572K5985K3683
$$ 1083748 1114295 1144034 1172637 1201098 1229798 1257873 1285149 1312611 1340183 1366168 1389851
57180A389851K2726K2824K2374K1821K2751K4593K5402K5242K5618K6217K5329
$$ 1389851 1412577 1435401 1457775 1479596 1502347 1526940 1552342 1577584 1603202 1629419 1654748
57169A654748K2993K0821J9168J7387J6219J6957J8689J9429J9468K0727K3154
$$ 1654748 1677741 1698562 1717730 1735117 1751336 1768293 1786982 1806411 1825879 1846606 1869760
57158A869760K4824K5316K5991K7150K7789K8012K8905L0101L0112K8903K7646
$$ 1869760 1894584 1919900 1945891 1973041 2000830 2028842 2057747 2087848 2117960 2146863 2174509
57147B174509K6282K4021K1761K1279K2242K2793K2765K3711K6064K8875L1944
$$ 2174509 2200791 2224812 2246573 2267852 2290094 2312887 2335652 2359363 2385427 2414302 2446246
57136B446246L5534L8454L9284L9073M0051M2180M3796M4992M7268N0362N2661
$$ 2446246 2481780 2520234 2559518 2598591 2638642 2680822 2724618 2769610 2816878 2867240 2919901
57125B919901N4355N6950O0020O1853O2971O5580O9730P3541P7111Q2438Q9504
$$ 2919901 2974256 3031206 3091226 3153079 3216050 3281630 3351360 3424901 3502012 3584450 3673954
57114C673954R6272J02884J11988J24289J37602J51155J67247J87713K12349K41930
$$ 3673954 3770226 3873110 3985098 4109387 4246989 4398144 4565391 4753104 4965453 5207383
57104E207383K79492L27271L85408M54922N39180O41676P65493R15966J100685
$$ 5207383 5486875 5814146 6199554 6654476 7193656 7835332 8600825 9516791 10617476
57095A0617476J325313J591660J899992K249506K634969L045895L470234L896069
$$ 10617476 11942789 13534449 15434441 17683947 20318916 23364811 26835045 30731114
57087C0731114M308757M689622N018357N273569N431144N467964N369202N124874
$$ 30731114 35039871 39729493 44747850 50021419 55452563 60920527 66289729 71414603
57079G1414603M713454M095080L233862K135139Q62975m77584j776311k945291
$$ 71414603 76128057 80223137 83456999 85592138 86455113 85977529 84201218 81255927
57071H1255927l927552m692937n231218n547518n659342n593178n381043n058364
$$ 81255927 77328375 72635438 67404220 61856702 56197360 50604182 45223139 40164775
57063D0164775m662004m226308l778819l339578k923574k541947k200878j901513
$$ 40164775 35502771 31276463 27497644 24158066 21234492 18692545 16491667 14590154
57055A4590154j642154j419838j230170j067793r28140q08074p04986o16477n40859
$$ 14590154 12948000 11528162 10297992 9230199 8302059 7493985 6788999 6172522 5631663
57046E631663m76578m21206l72347l29261k92120k60031k31338k05509j82975
$$ 5631663 5155085 4733879 4361532 4032271 3740151 3480120 3248782 3043273 2860298
57037B860298j63466j46237j31503j19707j09843j00309r1015q2819p5530o8362
$$ 2860298 2696832 2550595 2419092 2299385 2189542 2089233 1998218 1915399 1839869 1771507
57027A771507o1493n5098m7807l8273k7343j6487n257P708K2928M1513O5914R6714
$$ 1771507 1710014 1654916 1607109 1568836 1541493 1525006 1519749 1527457 1550385 1591898 1657812 1754526
57015A754526J31817J70795K13016K44373K33321J55224K3655j12657k08491k52121
$$ 1754526 1886343 2057138 2270154 2514527 2747848 2903072 2926727 2814070 2605579 2353458
57005B353458k57806k41826k13704j81183j51061j25228j02427q3285o9320n8965
$$ 2353458 2095652 1853826 1640122 1458939 1307878 1182650 1080223 996938 927618 868653
56995H68653m9207l9918l2785k7359k1891j6671j3146j0855q208n111k186J150
$$ 868653 819446 779528 746743 719384 697493 680822 667676 656821 648613 643502 641316 642466
56983F42466N282Q588R382Q106N375J3q415j7033k2451k4530k4943k3898k0991
$$ 642466 647748 656336 665718 673824 679199 679212 670797 653764 631313 606783 581840 557942 536951
56970E36951j7531j5144j3310j0823q187o214l905j94L777O642R387J3428J7793
$$ 536951 519420 504276 490966 480143 471956 465742 461837 461643 465420 472062 481449 494877 512670
56957E12670K0842K3162K5781K6821K2890J3178rj3721k5283l2253l3998l2490
$$ 512670 533512 556674 582455 609276 632166 645344 645335 631614 606331 574078 540080 507590
56945E07590k9747k5746k0404j5482j2249r220m745k0L132N731R928J5434K0480
$$ 507590 477843 452097 431693 416211 403962 394742 389997 389977 393109 398840 408768 424202 444682
56932D44682K4985K9892L4505L7108L6920L2871K2369M641j5801l2198m1537m5046
$$ 444682 469667 499559 534064 571172 608092 640963 663332 667973 652172 619974 578437 533391
56920E33391m4305m0112l4240k8881k4359j9862j5825j3211j1381r192p383p235
$$ 533391 489086 448974 414734 385853 361494 341632 325807 312596 301215 292023 284640 277405
56908B77405p808p154n490m380l742k426r67q28j476j067M46J585K237L555N467
$$ 277405 269597 262443 256953 252573 248831 246405 245438 244610 243134 242067 242513 244098 246335 249890 255357
56893B55357O821P669Q993J0710J2271J4429J8018K1749K3795K4454K4592K2607
$$ 255357 262178 269847 278840 289550 301821 316250 334268 356017 379812 404266 428858 451465
56881D51465J6185O400l169j0815j7058k1294k1787j9050j5828j3295j0158n793
$$ 451465 467650 474050 470881 460066 443008 421714 399927 380877 365049 351754 341596 335803
56869C35803j310K781P290J2292J6930K1555K7674L5389M3141N0139N6784O2411
$$ 335803 334493 337274 344564 356856 373786 395341 423015 458404 501545 551684 608468 670879
56857F70879O4528O0427M8161K7072m0k6037m3789n1700n2946n0221m4053l5541
$$ 670879 735407 795834 843995 871067 871027 844990 801201 749501 696555 646334 602281 566740
56845E66740k6943j9120j1125k696N433J3601K2922L3052M2932N3459O6279Q0094
$$ 566740 539797 520677 509552 506856 512289 525890 548812 581864 624796 678255 744534 824628
56833H24628R1428R8812J02371R8874Q1681M7951L523m0775p5736r6630j03201
$$ 824628 916056 1014868 1117239 1216113 1297794 1345745 1349268 1308493 1232757 1136127 1032926
56822A032926r9173q9827p8345o5282n1476l9038k8907j9748j0321r63Q031J7542
$$ 1032926 933753 843926 765581 700299 648823 609785 580878 561130 550809 549846 557877 575419
56810E75419K8241L9571N0701O1006O9297P3726P2264O2125M0290P566k8376n7272
$$ 575419 603660 643231 693932 754938 824235 897961 970225 1032350 1072640 1080206 1051830 994558
56798I94558p4067q0484p9822p3799o4398n4590m5730l6943k8075k0591j4792
$$ 994558 920491 840007 760185 686386 621988 567398 521668 484725 456650 436059 421267
56787D21267q980k288M256J0280J6863K3916K9594L3224L5892L6960L2967K1692
$$ 421267 412287 409999 414255 424535 441398 465314 494908 528132 564024 600984 633951 655643
56775F55643N104j2850k9108m1243m7296m7681m5132m1494l6439l0179k4783k1434
$$ 655643 660747 647897 618789 577546 530250 482569 437437 395943 359504 329325 304542 283108
56763B83108j8835j5789j3112j1550j0155q256o954p008p169o193m769m013l644
$$ 283108 264273 248484 235372 223822 213667 205411 198457 191449 184280 178087 173318 169305 165661
56750A65661l055k520k234j689r95j143k089k400j640j159j638j940j368q94j107
$$ 165661 162606 160086 157852 156163 155168 154025 151936 149536 147896 146737 145099 143159 141791 140897 139790
56735A39790j023q5O29M02R3K60P1p59j009pJ171J613J746J717P25j047j978j460
$$ 139790 138767 138682 139311 139713 139806 140066 140137 139378 138369 138362 139533 141146 142892 144609 145334 144287 142309 140849
56717A40849p31m28L60J656J803L49p81l11N77P06P49J223J148K06j61O25J009
$$ 140849 140118 139690 140050 141706 143509 143858 143077 142766 143343 144049 144798 146021 147169 147375 147214 147839 148848
56700A48848J67l94K42N07p68k038j641m20K43P40J503J323l96j812j388m42p01
$$ 148848 149015 148621 148863 149370 148602 146564 144923 144503 144746 145486 146989 148312 147916 146104 144716 144274 143573
56683A43573j302o95L26Q6r14r70m4N67M40M0n35j127r65L0O02J02l07L97J439
$$ 143573 142271 141576 141902 141988 141074 140104 140060 140627 141067 141107 140572 139445 138480 138510 139112 139214 138907 139304 140743
56664A40743J826J763J440K92j277j567l55K58q18j858j447q28j288j661o83N65
$$ 140743 142569 144332 145772 146064 144787 143220 142865 143123 142305 140447 139000 138172 136884 135223 134540 135105
56648A35105P46O26J124J213P3q44k66N46K54M9J205K258J424j54l94K64K02k68
$$ 135105 135851 136477 137601 138814 138887 138043 137777 138323 138577 138626 139831 142089 143513 143359 142965 143229 143431 143163
56630A43163L7O43O42Q82K293L565L190K235K369K838K122R95R93J296K19j557
$$ 143163 143200 143843 144485 145367 147660 151225 154415 156650 159019 161857 163979 164974 165967 167263 167482 165925
56614A65925k147j751j865k334j972j079p43o08J04N84j00q24k77M74q6r02j28
$$ 165925 163778 162027 160162 157828 155856 154777 154034 153426 153530 154114 154014 153190 152913 153387 153301 152399 152271
56597A52271J487J895J172P64N70k73q58J24J644J807J083J158J729J346M05L01
$$ 152271 153758 155653 156825 157589 158159 157886 157028 157152 158796 160603 161686 162844 164573 165919 166324 166625
56581A66625O44K15l96n4K95p36j913j131Q36J617J232J498K457K668K280K500
$$ 166625 167269 167484 167088 167034 167329 166593 164680 163549 164385 166002 167234 168732 171189 173857 176137 178637
56565A78637K812J978R37J543L247M246M894O618Q439Q357P240P511Q633P791
$$ 178637 181449 183427 184364 185907 189154 193400 198294 204912 213351 221708 228948 236459 245092 252883
56551B52883M729K076J059N73K66R39J899J460J02k33K57k47j431j288r2j56j656
$$ 252883 257612 259688 260747 261320 261586 262525 264424 265884 265986 265753 266010 265763 264332 263044 262952 262796 261140
56534B61140k412j970k161l305l624k822k742l843m416l875l548l745l225k010
$$ 261140 258728 256758 254597 251292 247668 244846 242104 238261 233845 229970 226422 222677 219452 217442
56520B17442j651k182j981r36p51j665k048j482j236j446r02J22N4q24o97K43
$$ 217442 215791 213609 211628 210692 209941 208276 206228 204746 203510 202064 201162 201284 201338 200514 199817 200060
56504B00060j7j391j509M2R21P7q02o06l35n70m80k9k77r41n91M71N25l05l03
$$ 200060 200043 198652 197143 197185 198106 198183 197381 196775 196440 195870 195390 195361 195084 194143 193552 194023 194548 194243 193940
56485A93940L36k74j839j973m96J58o84r87m2M17j43l1J084J271Q6m18N37J174
$$ 193940 194276 194002 192163 190190 189694 189852 189168 188181 188139 188556 188413 188382 189466 190737 190823 190405 190942 192116
56467A92116O72N30J337J638J025R68J640J411L99Q40K871L701K233Q30J085J497
$$ 192116 192788 193318 194655 196293 197318 198286 199926 201337 201736 202576 205447 209148 211381 212211 213296 214793
56451B14793Q45L10O59O57j27j63R56J387M32j55N30J058P22P71J499J355K02
$$ 214793 215638 215948 216607 217264 217137 216974 217930 219317 219749 219594 220124 221182 221904 222675 224174 225529 225731
56434B25731J6J161J495L70m2J264K376K091J648J579M82j538k039m13P89L64
$$ 225731 225747 226908 228403 228773 228731 229995 232371 234462 236110 237689 238171 236633 234594 234181 234970 235334
56418B35334L76J936K942K068J222J789K049N86r76r51k28L3L96J036O95o38j024
$$ 235334 235710 237646 240588 242656 243878 245667 247716 248302 247326 246375 246147 246180 246576 247612 248307 247669 246645
56401B46645N0P48M23N95J322N64j630k500j550j632l533m089j822L10J49l14
$$ 246645 246695 247443 247866 248461 249783 250347 248717 246217 244667 243035 239502 235413 233591 233901 234050 233736
56385B33736O12J095r7o33J089K744K265J343J795K323J758J678K857L052J279
$$ 233736 234348 235443 235346 234713 235802 238546 240811 242154 243949 246272 248030 249708 252565 255617 256896
56370B56896K40J504K428J034k53P71J917P91p86m34M43j99j126p41n05j709k367
$$ 256896 257136 258640 261068 262102 261849 262620 264537 265328 264542 264108 264551 264352 263226 262485 261980 260271 257904
56353B57904r12M90K8j46J842L507K310L81O59J703Q37p65o17L76J62k57R12K386
$$ 257904 256992 257482 257510 257364 259206 262713 265023 265404 266063 267766 268603 267838 267221 267597 267759 267502 268414 270800
56335B70800K225J513J836J925N43l22J055K505J777P02J595K794K073J169K410
$$ 270800 273025 274538 276374 278299 278842 278520 279575 282080 283857 284559 286154 288948 291021 292190 294600
56320B94600L984L195J532J782K955K650J778K238K680J221k92N93K208J785O11
$$ 294600 298584 301779 303311 305093 308048 310698 312476 314714 317394 318615 318323 318916 321124 322909 323520
56305C23520J333K788K315Q99J121K274K255K037L549N281M665K725J922J587
$$ 323520 324853 327641 329956 330855 331976 334250 336505 338542 342091 347372 352037 354762 356684 358271
56291C58271n5j654j046M53M83J1J045K470K478K378L759M741L548K590M288O143
$$ 358271 358216 356562 355516 355969 356452 356463 357508 359978 362456 364834 368593 373334 376882 379472 383760 389903
56275C89903M980K799L067M475L997L031M545O968O906N424N781P290P266O563
$$ 389903 394883 397682 400749 405224 409221 412252 416797 423765 430671 436095 441876 449166 456432 462995
56261D62995P513Q816Q262P897J0592J4185J5088J4904J7252K0794K2054K2533
$$ 462995 470508 479324 487586 495483 506075 520260 535348 550252 567504 588298 610352 632885
56249F32885K6094L1634L5289L7792M2591M8700N2451N4570N8442O2988O4397
$$ 632885 658979 690613 725902 763694 806285 854985 907436 962006 1020448 1083436 1147833
56238A147833O3352O3443O3817O0581N4142M8094M2081L2906K1495J1599K695
$$ 1147833 1211185 1274628 1338445 1399026 1453168 1501262 1543343 1576249 1597744 1609343 1612038
56227A612038q538k0795k9481l4627m0256m6603n0130n0685n1582n2994n2131
$$ 1612038 1603500 1582705 1553224 1518597 1478341 1431738 1381608 1330923 1279341 1226347 1174216
56216A174216m9393m7701m6538m3274l9302l7957l7585l3954k8312k5657k5961
$$ 1174216 1124823 1077122 1030584 987310 948008 910051 872466 838512 810200 784543 758582
56205G58582k4727k1394j9398j8685j5869j1438r206r025p481n133n423p193o134
$$ 758582 733855 712461 693063 674378 658509 647071 637865 628840 621359 616226 610803 603610 597476
56192E97476k985k324l928l471j154j275l588l598j259r16k722k515j24O02j88
$$ 597476 594491 592167 588239 584768 583614 582339 578751 575153 573894 572978 570256 567741 567617 568219 568031
56177E68031J163L604K584p90q62K297L026O44L27K907L463J060M42K742L762
$$ 568031 569194 572798 575382 574592 573730 576027 579053 579697 580024 582931 586394 587454 587896 590638 594400
56162E94400K732L674O739P300N008M787P537Q740P525Q082J0982J2155J1456
$$ 594400 597132 600806 607545 614845 619853 624640 632177 640917 648442 656524 667506 679661 691117
56149F91117J3009J6201J5957J2988J3746J9005K2544K2597K4393K9646L3790
$$ 691117 704126 720327 736284 749272 763018 782023 804567 827164 851557 881203 914993
56138I14993L5696L9953M7486N3994N9740P0687Q7758J04948J19890J35890J51518
$$ 914993 950689 990642 1038128 1092122 1151862 1222549 1310307 1415255 1535145 1671035 1822553
56127A822553J58906J54895J43886J28086J05730Q0694O2356N3343M7978M4053
$$ 1822553 1981459 2136354 2280240 2408326 2514056 2594750 2657106 2710449 2758427 2802480
56117B802480M4215M4352L4199J3032p757k0989l0300l7818l9223l5684l7508
$$ 2802480 2846695 2891047 2925246 2938278 2930521 2909532 2879232 2841414 2802191 2766507 2728999
56106B728999n0240o8597q8187j10707j33261j45781j44768j37710j29158j14905
$$ 2728999 2678759 2610162 2521975 2411268 2278007 2132226 1987458 1849748 1720590 1605685
56096A605685r4529p6459o4854n4033m1268l2355k9108k4456j5780j0164j0617
$$ 1605685 1511156 1434697 1369843 1315810 1274542 1242187 1213079 1188623 1172843 1162679 1152062
56085A152062j0201n559k963m973m758J63K370r74k071K626N742L754L889R296
$$ 1152062 1141861 1136302 1133339 1128366 1123608 1123771 1126141 1125167 1123096 1125722 1131464 1135218 1139107 1148403
56071A148403J2108Q773P436J2302J5581J3004J2193J7348K0742J8024J6751K0948
$$ 1148403 1160511 1169284 1176720 1189022 1204603 1217607 1229800 1247148 1267890 1285914 1302665 1323613
56059A323613K2706J8006J5203J8664J9960J4665J1597J5633J8017J3762J1738
$$ 1323613 1346319 1364325 1379528 1398192 1418152 1432817 1444414 1460047 1478064 1491826 1503564
56048A503564J7023K0480J6779J5210K1272K5394K1754K0090K6508L0976K6942
$$ 1503564 1520587 1541067 1557846 1573056 1594328 1619722 1641476 1661566 1688074 1719050 1745992
56037A745992K4552L0886L5857L1993K9181L5067L9925L6245L4062M1053M6842
$$ 1745992 1770544 1801430 1837287 1869280 1898461 1933528 1973453 2009698 2043760 2084813 2131655
56026B131655M3297M0905M8208N4780N1747M9228N5740O0769N5960N2854O0750
$$ 2131655 2174952 2215857 2264065 2318845 2370592 2419820 2475560 2536329 2592289 2645143 2705893
56015B705893O8028O4882O2909P2153Q0710P8056P6172Q5887R5076R2660R1026
$$ 2705893 2773921 2838803 2901712 2973865 3054575 3132631 3208803 3294690 3389766 3482426 3573452
56004C573452J01587J11883J10674J11169J24842J37515J36958J37948J53372
$$ 3573452 3675039 3786922 3897596 4008765 4133607 4271122 4408080 4546028 4699400
55995D699400J67871J68075J70571J90269K10277K14461K19700K42952K67264
$$ 4699400 4867271 5035346 5205917 5396186 5606463 5820924 6040624 6283576 6550840
55986F550840K75354K84954L14259L45180L59424L76984M18151M62682M89525
$$ 6550840 6826194 7111148 7425407 7770587 8130011 8506995 8925146 9387828 9877353
55977I877353N20189N77478O39974O85528P39105Q26127R21698J001208J095566
$$ 9877353 10397542 10975020 11614994 12300522 13039627 13865754 14787452 15788660 16884226
55968A6884226J236968J398782J553595J738748J994696K295175K615621L010021
$$ 16884226 18121194 19519976 21073571 22812319 24807015 27102190 29717811 32727832
55960C2727832L535841M170528M897448N801121O972462Q404835J0105354J2211767
$$ 32727832 36263673 40434201 45331649 51132770 58105232 66510067 76615421 88827188
55952H8827188J4859816J8052713K1815413K6275249L1290986L6159365M0048069
$$ 88827188 103687004 121739717 143555130 169830379 201121365 237280730 277328799
55945B77328799M2494253M2819874L9119941K8945693J1930552q504172k6818838
$$ 277328799 319823052 362642926 401762867 430708560 442639112 434134940 407316102
55938D07316102l8948608m4211710m4271073m1161195l6420315l1181365k6212707
$$ 407316102 368367494 324155784 279884711 238723516 202303201 171121836 144909129
55931A44909129k1820190j8019737j4824119j2252984j0202551q512402p119622
$$ 144909129 123088939 105069202 90245083 77992099 67789548 59277146 52157524
55924E2157524o020314n144182m392915l750647l244670k840923k475943k149652
$$ 52157524 46137210 40993028 36600113 32849466 29604796 26763873 24287930 22138278
55916B2138278j894790j691210j493532j309297j171781j065985r53507q42201
$$ 22138278 20243488 18552278 17058746 15749449 14577668 13511683 12558176 11715975
55908A1715975p63430p06455o38962n68371n22596m92337m49324m00893l72572
$$ 11715975 10952545 10246090 9607128 9038757 8516161 8023824 7574500 7173607 6801035
55899F801035l56197l26605k91107k73164k64738k42274k13157k00537j97745
$$ 6801035 6444838 6118233 5827126 5553962 5289224 5046950 4833793 4633256 4435511
55890D435511j82039j58871j49570j48745j35484j14256j04582j01874q7255o5267
$$ 4435511 4253472 4094601 3945031 3796286 3660802 3546546 3441964 3340090 3252835 3187568
55880C187568n4224m9525l2925q520N700J2664K8038M6169M8002L5025K2729Q135
$$ 3187568 3133344 3083819 3050894 3042374 3048074 3060738 3088776 3134945 3182947 3217972 3240701 3248836
55868C248836k3653o7090j01623j23761j44252j59894j58007j43629j33425j27085
$$ 3248836 3225183 3158093 3056470 2932709 2788457 2628563 2470556 2326927 2193502 2066417
55858B066417j12242r2434q2535q0906p3283o0340n4965n5907n0325l9470l6348
$$ 2066417 1954175 1861741 1779206 1698300 1625017 1564677 1509712 1453805 1403480 1364010 1327662
55847A327662m0404l9132l2451l1454l5211l2425k4368k3001k7907k7409k1162
$$ 1327662 1287258 1248126 1215675 1184221 1149010 1116585 1092217 1069216 1041309 1013900 992738
55836I92738j9726k3041k0949j4131j3287j8262j8477j3443j2836j6858j6138
$$ 992738 973012 949971 929022 914891 901604 883342 864865 851422 838586 821728 805590
55825H05590j0642r462j2430j0794n595o558j3126j5034j1381j1046j4535j3527
$$ 805590 794948 785486 773056 762262 756667 750109 736983 721949 710568 699522 684987 671460
55813F71460q266p531j1133j0066m210k565n605m584J126L049N14J815P579R541
$$ 671460 663194 655663 644530 634464 630254 627689 622084 617500 618626 621675 622189 624004 631583 641124
55799F41124O871P561J2234J2605P383M198M235L71p792j2184j1338j2492j6984
$$ 641124 647995 655556 667790 680395 687778 691976 696211 696582 688790 676606 665268 652776 635792
55786F35792j7997j4572j3589j5873j4360p999m025m660m806m176q110j4994j6453
$$ 635792 617795 603223 589634 573761 559401 551402 547377 542717 537911 533735 525625 510631 494178
55773D94178j1802q915r381o424Q38N039M587O293J1337J1967N326k008o100j0233
$$ 494178 482376 473461 464080 457656 458494 463533 468120 474413 485750 497717 503043 501035 494935 484702
55759D84702j4874j5254j1691j0585j2712j2063q188p672j1288j1983q024o031
$$ 484702 469828 454574 442883 432298 419586 407523 399335 391663 380375 368392 360368 354337
55747C54337q290r185o893o546q921q055l272j605m826n913k000P50q99j895M24
$$ 354337 346047 336862 329969 323423 314502 306447 303175 301570 296744 290831 288831 289581 288682 286787 287211
55732B87211J312j397k812p39J29k220l323j699k142n827p141m202k643n021o255
$$ 287211 288523 287126 284314 283575 283704 281484 278161 276462 274320 268493 261352 257150 254507 249486 243231
55717B43231l630j654k834l000j3K009J117J301M064N154L322L276O300P025L321
$$ 243231 239601 237947 235113 232113 232100 234109 235226 236527 240591 245745 249067 252343 258643 265668 268989
55702B68989K28L58m97m325o655n487n327q119r068n895l424m539n174k731r25
$$ 268989 269217 269575 269078 264753 258098 252611 247284 239165 230097 224202 220778 216239 211065 208334 207409
55687B07409j836j691R93J581j749l688j142J455R14R61M134O248M295K080K611
$$ 207409 205573 203882 204875 206456 204707 201019 199877 201332 202246 203207 207341 213589 217884 219964 222575
55672B22575K478q93l737l076k181l725m500k151k86j649k848j020Q55K31J3K374
$$ 222575 225053 224160 220423 217347 215166 211441 206941 204790 204504 202855 200007 198987 199842 200073 200086 202460
55656B02460M102L032K648N293P294N815M206N485O729N044K928K678J577k331
$$ 202460 206562 209594 212242 217535 224829 230644 234850 240335 247064 252108 255036 257714 259291 256960
55642B56960n599n567n250p226q598p035n765p425q770o790m376m722n511l972
$$ 256960 251361 245794 240544 233318 224720 217685 211920 204495 195725 188935 184559 179837 174326 170354
55628A70354k294k861l334j555k31j687l111j881n30j548k390o53R03m51k254
$$ 170354 168060 165199 161865 160310 160079 158392 155281 153400 152870 151322 148932 148279 149182 148731 146477
55613A46477j816j336l072m357k497M1L15K8J199J563p43k620j195Q89L65j073
$$ 146477 144661 143325 140253 135896 133399 133440 133755 133783 134982 136545 135802 133182 131987 132876 133241 132168
55597A32168q19l85j553k069r5J487J29j522n76P53k72j560m81Q97q9j533r18
$$ 132168 131349 130964 129411 127342 127247 128734 128863 127341 126765 127518 127246 125686 125205 126102 126013 124480 123562
55580A23562l4j073j958m87J040J93p95N41J973J014o3J331K900J886M64J441
$$ 123562 123528 122455 120497 120010 121050 121243 120448 120989 122962 123976 123913 125244 128144 130030 130494 131935
55564A31935K771J693K66J340K883J868N0L56J179k59k379k457j864k816l414
$$ 131935 134706 136399 136665 138005 140888 142756 142806 143162 144341 144082 141703 139246 137382 134566 131152
55549A31152j408O13o14l011k785q77l61o12M41J330j08j814q60J095Q79m58k22
$$ 131152 129744 130357 129743 126732 123947 123070 122709 122097 122538 123868 123760 121946 121086 122181 123060 122602 122380
55532A22380N67l06j321p8J720J375L45J130J994J94k355k270p59r95k114j405
$$ 122380 122947 122641 121320 121242 122962 124337 124682 125812 127806 128000 125645 123375 122616 121621 119507 118102
55516A18102L2n21j908j343Q2m12j786j225M51O65K16J324K759K151Q98J488K297
$$ 118102 118134 117613 115705 114362 114444 114032 112246 111021 111472 112137 112353 113677 116436 118587 119485 120973 123270
55499A23270M96k175k099k61l19k198l104l153m365n763m967l117k854l087j136
$$ 123270 123766 121591 119492 119231 118912 116714 113610 110457 106092 100329 95362 92245 89391 86304 85168
55484H5168J617J757K7r1J326J284l30q99j01J79qO75J278K29r29l4J259L17j282
$$ 85168 86785 88542 88569 88478 89804 91088 90758 89859 89758 89937 89929 90604 91882 92111 91182 91148 92407 92724 91442
55465I1442n15J257P62q51r8K092J843o00j418l9N27l06k06Q82O30p02m92J169
$$ 91442 90927 92184 92946 92095 91997 94089 95932 95332 93914 93875 94402 94096 93890 94772 95402 94700 94208 95377
55447I5377J635P63Q08J556N76j816k659j380k14K08J227K418J935L02l24j39
$$ 95377 97012 97775 98583 100139 100715 98899 96240 94860 94646 94854 96081 98499 100434 100736 100412 100273
55431A00273q27j623o28J000P11o06j01J706J981R17R86J745O24j691j954l9J140
$$ 100273 99446 97823 97195 98195 98906 98300 98199 99905 101886 102803 103789 105534 106158 104467 102513 102474 103614
55414A03614R96J551K695K278O93M21J207N81j137j276M6K35o59k20J164P04j344
$$ 103614 104610 106161 108856 111134 111827 112248 113455 114036 112899 111623 111669 111904 111245 111025 112189 112893 111549
55397A11549j841m67m0j038j018K37J71j442j928q10n46j630j769n16k6o53m12
$$ 111549 109708 109241 109201 108163 107145 107382 107553 106111 104183 103373 102827 101197 99428 98912 98886 98233 97821
55380I7821P10N89n25o7J847K245O36k65L32K82q32p97O58J124J29p1R97J235
$$ 97821 98531 99120 98595 98528 100375 102620 103256 102991 103323 103605 102773 101976 102634 103758 103887 103816 104813 106048
55362A06048L24K98J218R19m31l69Q18J69k142k396J70J797N35j016r07q49j965
$$ 106048 106372 106670 107888 108807 108376 108007 108825 108994 106852 104456 104626 106423 106958 105942 105035 104186 102221
55345A02221k310q28M08j1n56q0K10k99k77N35N06n73q13J70N68J4J35Q12P6j703
$$ 102221 99911 99083 99491 99480 98924 98844 99054 98755 98478 99013 99519 98946 98133 98303 98871 98885 99020 99832 99908 98205
55325I8205j762R1R25p2l41R97J556M31j44O68O95p24j162K13Q87k77r81n4K96
$$ 98205 96443 96534 97459 97387 97046 98043 99599 100030 99886 100554 101249 100525 99363 99576 100463 100186 99205 99151 99447
55306I9447j108j983p89N49L27k78k16n25j410j066O92J339j7r05R3J057O54M97
$$ 99447 98339 96356 95567 96116 96443 96165 95949 95424 94014 92948 93640 94979 94962 94057 94150 95207 95861 96358
55288I6358J550K035J001L06J007J331K63m55J67M41m53o44P08J530O06k35K26
$$ 96358 97908 99943 100944 101250 102257 103588 103851 103396 103563 104004 103551 102907 103615 105145 105751 105516 105742
55271A05742M45m92r38j02K34o20o23Q91J387l72j882j293m66j073j430N9J709
$$ 105742 106187 105695 104757 104655 104889 104269 103646 104537 105924 105552 103670 102377 101911 100838 99408 99467 101176
55254A01176J617P60N11R2j002j186K03J137L83l37J89L78q13j630r63n53j423
$$ 101176 102793 103553 104064 104156 103154 101968 102171 103308 103691 103354 103543 103921 103108 101478 100515 99962 98539
55237I8539j613N1J352N44o22l36J60l71m78P87J369q5j283j61J455J208J80L35
$$ 98539 96926 96977 98329 98873 98251 97915 98075 97704 97226 98013 99382 99297 98014 97853 99308 100516 100696 101031
55219A01031Q23K07l37O99K031J824P90K98k47j484k067j139l68r20j113L24J514
$$ 101031 101854 102061 101724 102423 104454 106278 107068 107366 107119 105635 103568 102429 102061 101141 100028 100352 101866
55202A01866P27l35M38J924K043J181N18n20k270k919j414J48j31q75l66K48m39
$$ 101866 102593 102258 102696 104620 106663 107844 108362 107842 105572 102653 101239 101387 101256 100381 100015 100263 99824
55185I9824j099l73K49o12j171L06J981J520J40J07P33L57j30O38J303K62q85
$$ 99824 98725 98352 98601 97989 96818 97124 99105 100625 100765 100872 101605 101962 101832 102470 103773 104035 103150
55168A03150l8J442J161k6J10R88P29k4M31J289Q18j16K38R09Pj435j166K16N78
$$ 103150 103112 104554 105715 105689 105799 106787 107516 107492 107923 109212 110030 109914 110152 111061 111068 109633 108467 108683 109261
55149A09261K15P65J520O24j092j299k26Mo84m94P07J351J014M29n62k197k949
$$ 109261 109476 110241 111761 112385 111293 109994 109768 109772 109088 108594 109301 110652 111666 112095 111533 109336 106387
55132A06387j469O35Q73k34l54O39R63L24n2l5l71n56K79J210P74m15q47p22r62
$$ 106387 104918 105553 106426 106192 105838 106477 107440 107764 107712 107677 107306 106750 107029 108239 109013 108598 107751 107029 106067
55113A06067q91L46J517J184M54R71J677P31q32o99O70J046M38O65J657J688O51
$$ 106067 105176 105522 107039 108223 108677 109648 111325 112056 111224 110525 111195 112241 112679 113344 115001 116689 117340
55096A17340j1j87q72j618j193j03K56K47J021J745Q51p97r95J48P22M03L75M77
$$ 117340 117329 117142 116270 114652 113459 113356 113612 113859 114880 116625 117476 116679 115684 115832 116554 116957 117332 117809
55078A17809m40j776j780n85J47J47M35Q36L25o10o22lNk96J70P41oj438j788
$$ 117809 117369 115593 113813 113228 113375 113522 113957 114793 115118 114508 113886 113883 113888 113592 113762 114503 114497 113059 111271
55059A11271j168r37q40L70K051K364J324N20K71k70q27m62K97L48L13J297K290
$$ 111271 110103 109166 108326 108696 110747 113111 114435 114955 115226 114956 114129 113667 113964 114312 114625 115922 118212
55042A18212J558k27j045q41r63j207m74N20K43p06o35Q6q0o22Q4J492J745J114
$$ 118212 119770 119543 118498 117657 116694 115487 115013 115533 115776 115070 114435 114521 114441 113819 113903 115395 117140 118254
55024A18254J239J680P35r32j073J68N76j73l70J69n1r64r50j16q4o80j41J362
$$ 118254 119493 121173 121908 120976 119903 120071 120647 120474 120104 120273 120222 119258 118308 118192 118108 117428 117287 118649
55006A18649J871J241J153J603R07o55q83L25N96o90j369l93N36J99l83l03j91
$$ 118649 120520 121761 122914 124517 125424 124769 123886 124211 124807 124117 122748 122355 122891 123090 122707 122404 122213
54989A22213l77k40Q8k53p93j65J217J546P43M39Q81P80K48P42J914J758K42m00
$$ 122213 121836 121596 121684 121431 120638 120473 121690 123236 123979 124418 125299 126079 126327 127069 128983 130741 130983 130583
54971A30583M76R60J11o77n76n80j053p66O19J731J849J703J443L42j059j128
$$ 130583 131059 132019 132130 131453 130877 130297 129244 128478 129097 130828 132677 134380 135823 136165 135106 133978
54955A33978J10R61J055J631K665K617J429Q06J077P40l74n64M72Q88j18j117
$$ 133978 134088 135049 136104 137735 140400 143017 144446 145252 146329 147069 146695 146131 146603 147491 147373 146256
54939A46256j238j297j522r54K44O21J06Q5M99j10j309q94J178K383J950J994
$$ 146256 145018 143721 142199 141245 141489 142110 142216 142301 142800 142690 141381 140487 141665 144048 145998 147992
54923A47992L470M568M463N036P235R048Q907Q101P902P275N310L226J925J09
$$ 147992 151462 156030 160493 165529 172764 181812 190719 198820 206722 213997 219307 222533 224458 224567
54909B24567l176o381p843q258q895r258q306o437m700l448k877l283l895l230
$$ 224567 221391 215010 207167 198909 190014 180756 172450 166013 161313 157865 154988 151705 147810 144580
54895A44580j353OJ42J04K98j30r52o12Q50J339K85j54J343L168L705L743M421
$$ 144580 143227 143233 143375 143479 143777 143647 142695 142083 142933 144272 144557 144403 145746 148914 152619 156362 160783
54878A60783N188N384N678O443O794O492O640P246O457L589N45j157k480m525
$$ 160783 165971 171355 177033 183476 190270 196762 203402 210648 217105 220694 221239 220082 217602 213077
54864B13077o460p301p667q081p715o334n431n849o224n326l954l098k209q66
$$ 213077 206617 199316 191649 183568 175853 169519 164088 158239 152015 146689 142735 139637 137428 136562
54850A36562j33p03j439j252o84l60J75Q37K82j719l091k256l42P21O95L49j5
$$ 136562 136429 135726 134287 133035 132351 131991 132166 133003 133285 131566 128475 126219 125877 126598 127293 127642 127627
54833A27627j46L85J048O62m14m36P70J344O45L17J055J140l64j702j375m75l07
$$ 127627 127481 127866 128914 129576 129162 128726 129496 130840 131485 131802 132857 133997 133633 131931 130556 130081 129774
54816A29774j82O14R98J98n16j05L12m17j393j465j041n69O10K273K473O05j044
$$ 129774 129592 130206 131204 131402 130886 130781 131093 130676 129283 127818 126777 126208 126818 129091 131564 132169 131125
54799A31125o94K94J75j53P24J863J744J080J262J690J120J44o1m4q66j824j608
$$ 131125 130431 130725 130900 130747 131471 133334 135078 136158 137420 139110 140230 140374 140313 140269 139403 137579 135971
54782A35971n77R8M48R78J236Q67Q06J716K549K341J985K562L378L420L282L877
$$ 135971 135394 135492 135940 136918 138154 139021 139827 141543 144092 146433 148418 150980 154358 157778 161060 164937
54766A64937M757N391O550Q661J0328J0263R173Q053O271L174r4k315m119o319
$$ 164937 169694 175085 181635 190296 200624 210887 220060 228113 234384 237558 237464 235149 231030 224711
54752B24711p954p952p217p058p026o182n034m303l369j765o90j051j675j321
$$ 224711 216757 208805 201588 194530 187504 181322 176288 171985 168616 166851 166161 165110 163435 162114
54738A62114p97j067j110J27J331Q56m35o65Q2N73Q26J420J767J378J495L209
$$ 162114 161317 160250 159140 159267 160598 161454 161019 160354 160436 161009 161835 163255 165022 166400 167895 171104
54722A71104N251N922N851O508P330O852N414M287L143Q87j962m035n403o910
$$ 171104 176355 182277 188128 194636 201966 208818 214232 218519 221662 222549 220587 216552 211149 204239
54708B04239q149q231p560o878n679l575j930j937k439j912j178j670k429j625
$$ 204239 196090 187859 180299 173421 167742 164167 162237 160300 157861 155949 154771 153101 150672 149047
54694A49047R5N98k34q30r31j511k286j965p00J24K34M10O17K83j14K14O51K70
$$ 149047 149142 149740 149506 148676 147745 146234 143948 141983 141283 141407 141641 142051 142668 142951 142837 143051 143702 143972
54676A43972k27K72R53L26j015j236k83L47L01N10J034J021N24L36L57r5p73j037
$$ 143972 143745 144017 144970 145296 144281 143045 142762 143109 143410 143920 144954 145975 146499 146835 147192 147097 146324 145287
54658A45287j182j569j361N3J376J125L0l43j75m60o64K11J293J081J51J00O22
$$ 145287 144105 142536 141175 141228 142604 143729 143759 143416 143241 142781 142117 142328 143621 144702 144853 144953 145575
54641A45575K98n56m15O21J115Q45O30K38r56j950j316J18L90m37p50m23n58q58
$$ 145575 145873 145317 144902 145523 146638 147483 148113 148351 147395 145445 144129 144247 144637 144200 143450 143027 142469 141611
54623A41611j11J073R06l59p56l3J10p52j140m19L73O93J050J296P23o6K76J333
$$ 141611 141500 142573 143479 143120 142364 142331 142441 141689 140549 140130 140503 141196 142246 143542 144265 144199 144475 145808
54605A45808J384L75L0Q84J620J572J473J521Q89l59j019p26l24j41K49N96K48
$$ 145808 147192 147567 147597 148481 150101 151673 153146 154667 155556 155197 154178 153452 153128 152987 153236 153832 154080
54588A54080l50k51J41k35r53p92r8j28n33J1J061R85P3K34J623K340J660Q67
$$ 154080 153730 153479 153620 153385 152432 151640 151542 151414 150881 150892 151953 152938 153011 153245 154868 157208 158868 159735
54570A59735N78j08j322j789j025l9N09Q30O28n88j801j416J06Q10M19M14J067
$$ 159735 160313 160205 158883 157094 156069 156030 156539 157369 157997 157409 155608 154192 154298 155108 155527 155941 157008
54553A57008J093L21m0K6p65k181k375j028J97O93J622L116L648K886K354K444
$$ 157008 158101 158422 158382 158408 157643 155462 153087 152059 152256 152949 154571 157687 161335 164221 166575 169019
54537A69019J722M8n13Q49K172J957J379J750K200J588N71J95J20l10p22p43q83
$$ 169019 170741 170789 170276 171125 173297 175254 176633 178383 180583 182171 182742 182937 183057 182747 182025 181282 180399
54520A80399j385j636j463j496j648r33O05J544J310Q81P61K26p96j187p25o73
$$ 180399 179014 177378 175915 174419 172771 171838 172443 173987 175297 176178 176939 177165 176369 175182 174457 173784
54504A73784j452j786j019l23o36j257j430j446j367n34P71J081P5p02k94L71
$$ 173784 172332 170546 169527 169204 168568 167311 165881 164435 163068 162534 163305 164386 164461 163759 163465 163836
54488A63836N41R17J868K289J480M60K67N49P48J097J562J413P68Q61J925K546
$$ 163836 164377 165294 167162 169451 170931 171391 171658 172207 172955 174052 175614 177027 177795 178656 180581 183127
54472A83127J965J257J318J479J159J039J504J600P84J10N11J273J382J038Q38
$$ 183127 185092 186349 187667 189146 190305 191344 192848 194448 195232 195342 195853 197126 198508 199546 200384
54457B00384O85M41M80P83O61o3p23j054j449j760j349n23k77m82k09J73o01k017
$$ 200384 201069 201510 201990 202773 203434 203371 202648 201594 200145 198385 197036 196513 196236 195754 195545 195718 195117 193100
54439A93100k053n77J65p97j665j066j80l36r08r60q62q66j98J026J138l62j528
$$ 193100 191047 190470 190635 189838 188173 187107 186927 186591 185683 184723 183861 182995 182797 183823 184961 184599 183071
54422A83071r44M2k13r51o44L00N21R7J17P83J452J725J425L85q74j314q65m38
$$ 183071 182127 182169 181956 181005 180361 180661 181182 181279 181396 182179 183631 185356 186781 187166 186292 184978 184113 183675
54404A83675j31Q99K298K409J071L62J420K665K477J569J287J406J133O05N4q99
$$ 183675 183544 184443 186741 189150 190221 190583 192003 194668 197145 198714 200001 201407 202540 203145 203199 202300
54388B02300j927j723k17P67K23n91n80n57j233j622j024n33r56j218n41j56j034
$$ 202300 200373 198650 198433 199200 199423 198832 198252 197695 196462 194840 193816 193283 192327 191109 190568 190412 189378
54371A89378j845j163J21N07K99M50O65N65R78K200K669J341k69m54Q8l4k97K52
$$ 189378 187533 186370 186491 186998 187297 187747 188412 188977 189955 192155 194824 196165 195896 195442 195530 195496 195199 195451
54353A95451O90j88j339j062R5L89k41o19o99j143j518j006j64j6k21pJ18n04
$$ 195451 196141 195953 194614 193552 193647 194036 193795 193176 192477 191334 189816 188810 188646 188630 188409 188402 188520 188016
54335A88016r57j69J013J185P25P66R40L34l80j00M12k33j387j361l96j52p73
$$ 188016 187059 186890 187903 189088 189813 190579 191519 191853 191473 191373 191785 191552 190165 188804 188408 188256 187483
54318A87483r32m10l11p77p99k31j3l46m49j90k70p75j063j012j073j240j176
$$ 187483 186551 186141 185830 185053 184254 184023 184010 183664 183215 183025 182755 181980 180917 179905 178832 177592 176416
54301A76416j022r36l61R68K016J782R21O37P67M71m2q2o6p69j634j489m88L04
$$ 176416 175394 174458 174097 175065 177081 178863 179784 180421 181188 181659 181617 181535 181469 180700 179066 177577 177089 177393
54283A77393O21P99N30n09j477j374p27o57r99r25o65q57r20L7J274J307K91k99
$$ 177393 178014 178813 179343 178834 177357 175983 175256 174599 173600 172675 172010 171153 170233 170270 171544 172851 173142 172843
54265A72843j4L07K94L59N14M22L91Q21J142O72K1J14M80O0p72p79J09R25J378
$$ 172843 172829 173136 173430 173789 174303 174725 175116 175937 177079 177751 177772 177886 178366 178426 177654 176875 176984 177909 179287
54246A79287J814J863Q84o31j538j625j397q71k9K91m83j373j324j089j841k774
$$ 179287 181101 182964 183848 183217 181679 180054 178657 177786 177757 178048 177565 176192 174868 173779 171938 169164
54230A69164k173k91J055J298J394J563R62l68j210j003m10N6M27M49j51p23l79
$$ 169164 166991 166700 167755 169053 170447 172010 172972 172604 171394 170391 169981 170037 170464 170913 170762 170039 169660
54213A69660N53J072J016P96K32q66j686j496j019j054p28R44K687K460O46n92
$$ 169660 170213 171285 172301 173097 173329 172463 170777 169281 168262 167208 166480 167424 170111 172571 173217 172625
54197A72625o23o07q43m67L38L74k20r4P24P61j05k48P90J389O01l16j14N97P01
$$ 172625 172002 171395 170552 170085 170423 170797 170577 170483 171207 171968 171863 171615 172405 173794 174395 174079 173965 174562 175263
54178A75263K51j67n26r05j039q67p56q04p94q51j248j643j567j422j775k007
$$ 175263 175514 175347 174821 173916 172877 172010 171254 170450 169656 168805 167557 165914 164347 162925 161150 159143
54162A59143j043P70J969K008J577J099M61k4P8K01m23j116o42M81N40n75j111
$$ 159143 158100 158870 160839 162847 164424 165523 165984 165960 166038 166239 165816 164700 164058 164539 165079 164504 163393
54145A63393k31Q75J057O66L90J98m3j12l3o9J6O04J214J129P75J140J957K083
$$ 163393 163162 164037 165094 165760 166150 166348 166305 166193 166160 166091 166107 166711 167925 169054 169829 170969 172926 175009
54127A75009J488J225J402R33m42j585j736j437j393j579j782j821j203K93J741
$$ 175009 176497 177722 179124 180057 179615 178030 176294 174857 173464 171885 170103 168282 167079 167372 169113
54112A69113J965J176N72N56O29O33P79P59L06J29Q90J714J373L16j59j22n04
$$ 169113 171078 172254 172826 173382 174011 174644 175423 176182 176488 176617 177507 179221 180594 180910 180751 180629 180125
54095A80125j002o25J60Q2n18k83M97L08p16r11j21P2o54p51K76R66O15M60J310
$$ 180125 179123 178498 178658 178740 178222 177939 178436 178744 178028 177117 176996 177068 176414 175663 175939 176905 177520 177980 179290
54076A79290K150J999J218L17o82j157j98J402J578N2j137p81JJ72M32J375K075
$$ 179290 181440 183439 184657 184974 184292 183135 182937 184339 185917 185969 184832 184051 184052 184224 184656 186031 188106
54059A88106J831J486J798K046J421L86l35p29o58N18K463L500K668J029J69M65
$$ 188106 189937 191423 193221 195267 196688 197074 196739 196010 195352 195870 198333 201833 204501 205530 205699 206164
54043B06164J423K558L318L362L242L751M510M536M211M937O807Q411R246J0366
$$ 206164 207587 210145 213463 216825 220067 223818 228328 232864 237075 242012 248819 257230 266476 276842
54029B76842J2300J4242J5703J7013J7658J6150J2147O982J663l726q288j0272
$$ 276842 289142 303384 319087 336100 353758 369908 382055 389037 390700 386974 378686 368414
54017C68414r534q015p100o369n460m976m891m263l233l186m164m517l850l841
$$ 368414 358880 350865 343765 337396 331936 326960 322069 317806 314573 311387 307223 302706 298856 295015
54003B95015n119n922n105l990l845l905l395l131l509l235j809j053k202l566
$$ 295015 289896 283974 278869 274879 271034 267129 263734 260603 257094 253859 252050 250997 248795 245229
53989B45229l183j866j477j861j730j153j040j292j437j885k799k956j600k01
$$ 245229 242046 240180 238703 236842 235112 233959 232919 231627 230190 228305 225506 222550 220950 220749
53975B20749m87j843k477k119j752j581j169p64p88o47L13J325J202J78n61n94
$$ 220749 220262 218419 215942 213823 212071 210490 209321 208557 207769 207122 207435 208760 209962 210140 209579 208985
53959B08985k87J81O97P88M21M01J069J561J279R95J450K028J941J612J732K040
$$ 208985 208698 208879 209576 210364 210785 211186 212255 213816 215095 216090 217540 219568 221509 223121 224853 226893
53943B26893K141K413L000L178K731K634L274L448K485J729K424L608L819L486
$$ 226893 229034 231447 234447 237625 240356 242990 246264 249712 252197 253926 256350 259958 263777 267263
53929B67263L776M279L809K608J800J440Q84M17P83J682K253K612L416M435M894
$$ 267263 271039 275318 279127 281735 283535 284975 285859 286276 287059 288741 290994 293606 297022 301457 306351
53914C06351M774M609M553M607N100N983O475O350O557P596Q417Q008O947O209
$$ 306351 311125 315734 320287 324894 329994 335977 342452 348802 355359 362955 371372 379380 386327 392536
53900C92536N670N023M805N163M897L271J499Q58O15m83j937k615k986m200n827
$$ 392536 398206 403229 408034 413197 418094 421365 422864 423722 424337 423854 421917 419302 416316 412116 406289
53885D06289o606o718p356q560r276r177q714p852o311m650l616k841j611k65
$$ 406289 399683 392965 385609 377049 367773 358596 349882 342030 335719 331069 327453 324612 323001 322736
53871C22736N39J219K497L936M797N513O626O996M910N84m120q047j1163j3168
$$ 322736 323275 324494 326991 330927 335724 341237 347863 354859 359769 360353 356233 348186 337023 323855
53857C23855j3459j2382j0992r623p932o094m743l978l506l353l503l362k646
$$ 323855 310396 298014 287022 277399 269467 263373 258630 254652 251146 247793 244290 240928 238282
53844B38282k091k195k137j126O5J92n88j278j596j690j218j77L45l17j015m69
$$ 238282 236191 233996 231859 230733 230798 230990 230402 229124 227528 225838 224620 224443 224788 224471 223456 222987
53828B22987O34Q46K81L2N1m29j112j092n68l94m66j81J58o5m37k75Pj39j3J105
$$ 222987 223621 224467 224748 224780 224831 224402 223290 222198 221630 221236 220770 220589 220747 220682 220245 219970 219977 219838 219825 220930
53808B20930K330K504K192K431K640J882J132J875L403L941L742M343N427N318
$$ 220930 223260 225764 227956 230387 233027 234909 236041 237916 241319 245260 249002 253345 258772 264090
53794B64090M252M237N506N992M707L056K299K005J697J835K497K830K495J991
$$ 264090 268342 272579 278085 284077 288784 291840 294139 296144 297841 299676 302173 305003 307498 309489
53780C09489J325Oj442j788j128q20j231j428j284j876l384m516m581m294m079
$$ 309489 310814 310820 309378 307590 306462 305642 304411 302983 301699 299823 296439 291923 287342 283048 278969
53765B78969l294j816p19o95j167j540j926k344k463k521l125l978m124l571l171
$$ 278969 275675 273859 273140 272445 271278 269738 267812 265468 263005 260484 257359 253381 249257 245686 242515
53750B42515k889j892m34J81j74j81N69Q37M1o25j45P56J010P44N47L78K0l29
$$ 242515 239626 237734 237300 237481 237307 237126 237695 238532 238573 237948 237803 238559 239569 240313 240860 241238 241258 240929
53732B40929n52q95j284j248p66l15O2O61J166R33K83J72O16P83O23R15J579J551
$$ 240929 240377 239482 238198 236950 236184 235869 235931 236592 237758 238691 238974 239146 239762 240545 241168 242083 243662 245213
53714B45213O05k73n61p79j063p96pM19L51O64J496J821J293R71J492K042J867
$$ 245213 245818 245545 244984 244205 243142 242346 242339 242758 243109 243773 245269 247090 248383 249354 250846 252888 254755
53697B54755J505J742K545L646M993O024N719M020K182J184Q10O56P66Q70L07
$$ 254755 256260 258002 260547 264193 269186 275210 280929 284949 287131 288315 289125 289781 290547 291417 291724
53682B91724p71j323j067r31j330j381m94N22P77N74N76O58L90j27n93r45j011
$$ 291724 290953 289630 288563 287632 286302 284921 284427 284949 285726 286300 286876 287534 287924 287797 287204 286259 285248
53665B85248m89L42O54K22k50k30K9J54J24j15o47j119j132j054j458j870j321
$$ 285248 284759 285101 285755 285977 285727 285497 285526 285680 285804 285689 285042 283923 282791 281737 280279 278409 277088
53648B77088k3Q14Q26P35P41K52n79o89R8O64M52J76K61R1n38p47j32L72L8m02
$$ 277088 277065 277879 278705 279440 280181 280433 279854 279165 279263 279927 280379 280555 280816 280907 280369 279622 279490 279862 279900 279498
53628B79498L4J161K160K672K687K196J484J019P58L71K22J062K536L333L050
$$ 279498 279532 280693 282853 285525 288212 290408 291892 292911 293669 294040 294262 295324 297860 301193 304243
53613C04243K666K781K779K184J590J600J994K469L136L821L883L230K565K359
$$ 304243 306909 309690 312469 314653 316243 317843 319837 322306 325442 329263 333146 336376 338941 341300
53599C41300K456K751L208L199K241J248J525K531K371P82l88j01M15q9j019j312
$$ 341300 343756 346507 349715 352914 355155 356403 357928 360459 362830 363612 363224 363123 363538 363449 362430 361118
53583C61118j169j281j645j995k356k486j898r63p14j148j112l12K13R2L04J184
$$ 361118 359949 358668 357023 355028 352672 350186 348288 347325 346611 345463 344351 344039 344252 344344 344648 345832
53567C45832J612J083Q06J616K535K605K556L232L894L503K504J932J745J395
$$ 345832 347444 348527 349333 350949 353484 356089 358645 361877 365771 369274 371778 373710 375455 376850
53553C76850R93P11O2j113j839j356l55J87L70O31O10mm77p1P26J087J245J930
$$ 376850 377843 378554 378616 377503 375664 374308 373953 374140 374510 375141 375751 375747 375270 375199 375925 377012 378257 380187
53535C80187L078M007M391M305L911L732M429N880P174P987Q921J0141J0912J0965
$$ 380187 383265 387272 391663 395968 399879 403611 408040 413920 421094 429081 438002 448143 459055 470020
53521D70020J1089J1692J2139J2052J2032J2392J2661J2963J4320J6761J8737
$$ 470020 481109 492801 504940 516992 529024 541416 554077 567040 581360 598121 616858
53510F16858J9402J9926K1411K3130K4015K4443K5113K5554K5143K4394K3932
$$ 616858 636260 656186 677597 700727 724742 749185 774298 799852 824995 849389 873321
53499H73321K3300K2134K1283K1465K1898K1617K0964K0565K0004J8879J7983
$$ 873321 896621 918755 940038 961503 983401 1005018 1025982 1046547 1066551 1085430 1103413
53488A103413J8056J8480J8526J8716J9548K0073J9292J7891J7061J6644J5937
$$ 1103413 1121469 1139949 1158475 1177191 1196739 1216812 1236104 1253995 1271056 1287700 1303637
53477A303637J5254J5118J4963J4101J3046J2284J0889Q047M798K534P47j841
$$ 1303637 1318891 1334009 1348972 1363073 1376119 1388403 1399292 1407339 1412137 1414671 1415418 1413577
53465A413577m899p273r252j1859j4516j5647j5295j5092j5772j6532j6906j7417
$$ 1413577 1408678 1401405 1392153 1380294 1365778 1350131 1334836 1319744 1303972 1287440 1270534 1253117
53453A253117j8381j9561k0960k2593k3651k3314k2227k1774k2074k2038k1248
$$ 1253117 1234736 1215175 1194215 1171622 1147971 1124657 1102430 1080656 1058582 1036544 1015296
53442A015296k0296j9450j8367j7112j6148j5310j3955j2053j0109q195o112m218
$$ 1015296 995000 975550 957183 940071 923923 908613 894658 882605 872496 864301 858189 853971
53430H53971k956j867j86J844L357M291N224O188O771P211Q222R884J1696J3538
$$ 853971 851015 849148 848962 850806 854163 858454 863678 869866 876637 883848 892070 901954 913650 927188
53416I27188J5608J7741J9627K1385K3089K4259K4747K5396K6871K8576K9747
$$ 927188 942796 960537 980164 1001549 1024638 1048897 1073644 1099040 1125911 1154487 1184234
53405A184234L0760L2138L3297L3747L4622L7220M0759M3398M4966M6696M8705
$$ 1184234 1214994 1247132 1280429 1314176 1348798 1386018 1426777 1470175 1515141 1561837 1610542
53394A610542M9889N0239N1138N3039N4687N5141N5016N5149N5396N5306N4879
$$ 1610542 1660431 1710670 1761808 1814847 1869534 1924675 1979691 2034840 2090236 2145542 2200421
53383B200421N4169N2954N1130M8687M5289M0748L5895L2052K9520K7399K4834
$$ 2200421 2254590 2307544 2358674 2407361 2452650 2493398 2529293 2561345 2590865 2618264 2643098
53372B643098K1654J7927J3824R798O084K094k862q572j4404k0414k7103l4345
$$ 2643098 2664752 2682679 2696503 2706301 2712385 2714479 2711617 2703045 2688641 2668227 2641124 2606779
53360B606779m1498m8139n3867n7877n9801o0555o1253o1727o1131n9570n7884
$$ 2606779 2565281 2517142 2463275 2405398 2345597 2285042 2223789 2162062 2100931 2041361 1983477
53349A983477n6308n4566n2838n1442m9922m7797m5768m4913m4989m4843m4139
$$ 1983477 1927169 1872603 1819765 1768323 1718401 1670604 1624836 1579923 1534934 1490091 1445952
53338A445952m3329m2329m0653l8567l6667l4605l1698k8445k5923k3922k1293
$$ 1445952 1402623 1360294 1319641 1281074 1244407 1209802 1178104 1149659 1123736 1099814 1078521
53327A078521j7952j4942j2627j0544q935q697r534r903r117p984p114o103m762
$$ 1078521 1060569 1045627 1033000 1022456 1013521 1004824 995290 985387 976270 968286 961172 955069 950307
53314I50307l625k788j645k29N29M18O23K072M287O339P984R281J0091J0569J1385
$$ 950307 946682 943894 942249 942020 942549 942967 943590 945662 949949 956288 964272 973553 983644 994213 1005598
53299A005598J2912J4760J6440J7949J9482K1035K2478K3592K4151K4419K5180
$$ 1005598 1018510 1033270 1049710 1067659 1087141 1108176 1130654 1154246 1178397 1202816 1227996
53288A227996K6731K8307K9212K9825L0471L0139K7687K3857K0486J8052J5597
$$ 1227996 1254727 1283034 1312246 1342071 1372542 1402681 1430368 1454225 1474711 1492763 1508360
53277A508360J2841J0604R014P071M358J692m21k588n306q112j0439j2329j3907
$$ 1508360 1521201 1531805 1540819 1547890 1552248 1553940 1553519 1550931 1545625 1537513 1527074 1514745 1500838
53264A500838j5153j6493j8610k1319k3562k4909k6093k7816k9859l1686l3108
$$ 1500838 1485685 1469192 1450582 1429263 1405701 1380792 1354699 1326883 1297024 1265338 1232230
53253A232230l4049l4390l4279l3985l3425l2345l0900k9414k7898k6452k5659
$$ 1232230 1198181 1163791 1129512 1095527 1062102 1029757 998857 969443 941545 915093 889434
53242H89434k5728k5734k4794k3496k2963k3043k2767k2116k1773k1434k0006
$$ 889434 863706 837972 813178 789682 766719 743676 720909 698793 677020 655586 635580
53231F35580j7513j5193j3768j2936j2485j2333j1634r587p225o575p762q724
$$ 635580 618067 602874 589106 576170 563685 551352 539718 530131 522906 516331 508569 499845
53219D99845q162p067o766p112p374p459p486p274p003p298q112q517q089p462
$$ 499845 491683 484616 477850 470738 463364 455905 448419 441145 434142 426844 418732 410215 402126 394664
53205C94664p149o808o131n396m796m184l733l917m583n055n217n453n455m484
$$ 394664 387515 380707 374576 369180 364384 360200 356467 352550 347967 342912 337695 332242 326787 322303
53191C22303k903k090k555l429m028m576n061m858l963l228k854k041o40J63m69
$$ 322303 319400 317310 314755 311326 307298 302722 297661 292803 288840 285612 282758 280717 280077 280240 279771
53176B79771j762k421k022q35O72J731J693R34M77M67R6q43j556j663j643j681
$$ 279771 278009 275588 273566 272731 273403 275134 276827 277761 278238 278705 278801 277958 276402 274739 273096 271415
53160B71415j359q76j085j894k048j063j5J87l7j35l82r45j267j101j068j461
$$ 271415 270056 269180 268095 266201 264153 263090 263075 263262 263225 263090 262708 261763 260496 259395 258327 256866
53144B56866j647j284j003j142r92j13O65M20n62j375j630j395p65n0L90P53J511
$$ 256866 255219 253935 252932 251790 250798 250685 251350 251770 251208 249833 248203 246808 246043 245993 246383 247136 248647
53127B48647K363K438J693J011P74N09J16R0L02j6p75r78m82k51m69r8J121J929
$$ 248647 251010 253448 255141 256152 256926 257435 257551 257641 257943 257927 257152 256174 255692 255441 254972 254874 255995 257924
53109B57924J576R19O43O3j269k273j996j213j184j808k197k135j938j638j174
$$ 257924 259500 260419 261062 261125 259856 257583 255587 254374 253190 251382 249185 247050 245112 243474 242300
53094B42300p34l23K62O50J51q60j138n28l01r95j493r86k68j26K7Q39J721J979
$$ 242300 241566 241243 241505 242155 242306 241446 240308 239780 239479 238484 236991 236005 235737 235611 235638 236477 238198 240177
53076B40177J958K024J604L92o89q10m36k57o5L25K80m34r56p70o88j243j491
$$ 240177 242135 244159 245763 246155 245466 244656 244220 243963 243898 244223 244503 244069 243113 242343 241655 240412 238921
53059B38921o30M43N30m5l64n37j065j504j198n35j93K7M70O18K2o30n27kL21
$$ 238921 238291 238734 239264 239219 238855 238318 237253 235749 234551 234016 233823 233850 234320 234938 234960 234330 233803 233801 234122
53040B34122O28J108J072J10q19q13n84j265k482l028k728k266j760q85P0M52
$$ 234122 234750 235858 236930 237040 236221 235408 234824 233559 231077 228049 225321 223055 221295 220410 220480 220932
53024B20932K64j4j50l3M94J097J063N77P10J541J625L15r33p64L6J67L9O96J695
$$ 220932 221196 221182 221032 220999 221493 222590 223653 224230 224940 226481 228106 228421 227488 226724 226760 226927 226966 227662 229357
53005B29357J859J256P60L76l56j032j021p19p26n78J94O76j56j442j558n16L79
$$ 229357 231216 232472 233232 233608 233252 232220 231199 230480 229754 229176 229370 230046 229890 228448 226890 226374 226753
52988B26753O65Q32Q46L11k61J2Q37J190R85Q48P17J68l65j44M17M08O4K47P56
$$ 226753 227418 228250 229096 229407 229146 229158 229995 231185 232170 233018 233735 233903 233538 233394 233811 234219 234283 234530 235286
52969B35286P09L01M90J213J540J404J599K119K065J269N50L17J79MR7L17J93
$$ 235286 235995 236296 236786 237999 239539 240943 242542 244661 246726 247995 248545 248862 249041 249045 249142 249459 249652
52952B49652j58k29k30q15j853k537k555k210j605p36p6q5m33o27q95j487j675
$$ 249652 249494 249265 249035 248220 246367 243830 241275 239065 237460 236724 236648 236563 236130 235503 234608 233121 231446
52935B31446p14P43J470J397J303J280Q84K95k1l71j177j782j418p72j049j883
$$ 231446 230732 231475 232945 234342 235645 236925 237809 238104 238083 237712 236535 234753 233335 232563 231514 229631
52919B29631j906j053m87m63j19O05O80j16o82m06j6k33q02j225j394j200n12
$$ 229631 227725 226672 226185 225722 225603 226208 226888 226772 226090 225684 225668 225435 224633 223408 222014 220814 220302
52902B20302K99O48O06O80Q55P56M71L26J67j50l3R18J786J452M14J06P26J179
$$ 220302 220601 221249 221855 222535 223390 224146 224617 224943 225110 224960 224927 225845 227631 229083 229497 229603 230329 231508
52884B31508R59O11M53J98k21o53j380k515l141k371r09o1L03J196K282K175Q13
$$ 231508 232467 233078 233531 233729 233508 232855 231475 228960 225819 223448 222539 222478 222781 223977 226259 228434 229247
52867B29247k48j39M62R07J361J812J833J674K141L134L617L271K814K544J946
$$ 229247 228999 228860 229322 230229 231590 233402 235235 236909 239050 242184 245801 249072 251886 254430 256376
52852B56376R09j2o56j386k064k204k109k518l162l113k506k355k658k393j494
$$ 256376 257285 257273 256617 255231 253167 250963 248854 246336 243174 240061 237555 235200 232542 230149 228655
52837B28655j137j742k295k021j304n78K48R82J084P36P12J025J016Q50J359K272
$$ 228655 227518 225776 223481 221460 220156 219578 219826 220808 221892 222628 223340 224365 225381 226231 227590 229862
52821B29862K195O81j154k310k764k520j394L6P53Q39J219J859J873J489J998
$$ 229862 232057 232738 231584 229274 226510 223990 222596 222632 223385 224224 225443 227302 229175 230664 232662
52806B32662L519M693M860M598L803J439k158m837n422m995m684m092k893k019
$$ 232662 236181 240874 245734 250332 254135 255574 253416 248579 243157 238162 233478 229386 226493 224474
52792B24474k040k124j682j416j651j397k47M82j73j198j342r27o07J00J415K044
$$ 224474 222434 220310 218628 217212 215561 214164 213917 214399 214226 213028 211686 210759 210152 210252 211667 213711
52776B13711J018l65k80R50J706J672J773K168K049J238M04j29n66q16n86j11
$$ 213711 214729 214364 214084 215034 216740 218412 220185 222353 224402 225640 226044 225915 225349 224533 223947 223836
52760B23836O8r8k57k75r8M48J176J392Q26K7o07j412k392k644j699n43k37l53
$$ 223836 223904 223806 223549 223274 223176 223624 224800 226192 227018 227045 226438 225026 222634 219990 218291 217748 217511 217158
52742B17158J59J204J825J750J457J137O59L01N13J034J206R93R55J242J442J368
$$ 217158 217317 218521 220346 222096 223553 224690 225349 225650 226163 227197 228403 229396 230351 231593 233035 234403
52726B34403J357J647J953J799J124M01J66L25J59p15j687j902j415r29p56p96
$$ 234403 235760 237407 239360 241159 242283 242684 242850 243175 243334 242619 240932 239030 237615 236686 235930 235134
52710B35134j218k043k361j294L13O84k87q23o5O37k0j245j494o84Q9K08j00m93
$$ 235134 233916 231873 229512 228218 228531 229215 228928 228105 228040 228677 228657 227412 225918 225234 225323 225531 225431 224938
52692B24938p04n09o3K02L01O49J035O76l88j001m86N46J387K061K523K254J380
$$ 224938 224234 223725 223662 223864 224165 224814 225849 226525 226137 225136 224650 225196 226583 228644 231167 233421 234801
52675B34801Q86J020P89j97q24m05l0o69j325o00R10J510R45L89L39J50m99j057
$$ 234801 235687 236707 237496 237299 236475 236070 236040 235371 234046 233446 234356 235866 236811 237200 237539 237689 237190 236133
52657B36133j062n66L58J600K596K734K208J822K059K807L691M180L670K080J31
$$ 236133 235071 234505 234863 236463 239059 241793 244001 245823 247882 250689 254380 258560 262230 264310 264441
52642B64441j416k430l071l290l094k786k452j747n73N01R82J075J212J431J558
$$ 264441 263025 260595 257524 254234 251140 248354 245902 244155 243582 244083 245065 246140 247352 248783 250341
52627B50341J549J404J238J491K309K845K082L56j035j766k663l845m263l519
$$ 250341 251890 253294 254532 256023 258332 261177 263259 263615 262580 260814 258151 254306 250043 246524
52613B46524k580k060j373l55n1q81j566j114m22o02j031n92K93M97J12qP1k26
$$ 246524 243944 241884 240511 240156 240105 239224 237658 236544 236122 235520 234489 233897 234190 234687 234799 234791 234862 234636
52595B34636n07R7J374K272K400K155J666P92j06m08r8M07Q90J252J278J086J138
$$ 234636 234129 234226 235600 237872 240272 242427 244093 244885 244779 244371 244273 244680 245570 246822 248100 249186 250324
52578B50324J307Q42k03o51n4M49Q9r3Q15J633P28j355k685k612j899r37L13J089
$$ 250324 251631 252473 252270 251619 251565 252014 252103 252010 252825 254458 255186 253831 251146 248534 246635 245698 246011 247100
52560B47100M62r70j656j271p81n38O0J033J527J235P50L56l20j245j780j692
$$ 247100 247562 246592 244936 243665 242884 242346 242406 243439 244966 246201 246951 247307 246987 245742 243962 242270
52544B42270j389j011l18M49O27J96j43o0J07K00N04J034J340J184P59K14l69
$$ 242270 240881 239870 239552 240001 240628 240824 240681 240621 240728 240928 241432 242466 243806 244990 245749 245963 245594
52527B45594n99r0Q42J353J088N01K57O11J273J559J028J86J10R55J549R57k00
$$ 245594 244995 244905 245747 247100 248188 248689 248946 249557 250830 252389 253417 253603 253713 254668 256217 257174 256974
52510B56974o33oJ066K019K599K672K503K712L255L082J492p78k551l557m100
$$ 256974 256341 256335 257401 259420 262019 264691 267194 269906 273161 276243 277735 276957 274406 270849 266749
52495B66749m133l547k685j829q05K04M20k10n15J45P44L54k00J79Q73P00J03
$$ 266749 262616 259069 256384 254555 253750 253954 254374 254164 253649 253794 254538 254892 254692 254871 255744 256444 256547
52478B56547L44J275J722J569J673K046J927J413J327J613J473R58Q96J341J593
$$ 256547 256891 258166 259888 261457 263130 265176 267103 268516 269843 271456 272929 273887 274783 276124 277717
52463B77717J657K156K862K872K238J853J784J181k2r24j307j941k961l430k950
$$ 277717 279374 281530 284392 287264 289502 291355 293139 294320 294298 293374 292067 290126 287165 283735 280785
52448B80785k406k567l136l558l666l230j910j61Q80P76K47j01n58j460k416k796
$$ 280785 278379 275812 272676 269118 265452 262222 260312 260151 261031 261807 262054 261953 261395 259935 257519 254723
52432B54723k462j646o78R2M87P06R37J007P82N72N74M11j16m07j3M45K54p5L52
$$ 254723 252261 250615 249937 250029 250516 251222 252159 253166 253948 254520 255094 255505 255389 254982 254969 255414 255668 255593 255945
52413B55945J247J590J281J038J085J174J551K588L717M105M141M955O635Q252
$$ 255945 257192 258782 260063 261101 262186 263360 264911 267499 271216 275321 279462 284417 291052 299304
52399B99304R396J0209J0146Q237M646O29l022o232q506r047q105o805n581m067
$$ 299304 308700 318909 329055 337292 341938 342567 339545 333313 324807 315760 307655 300850 295269 291202
52385B91202k458j557j382j135o24l55k28L55R90N61p43j281l03J056J650J795
$$ 291202 288744 287187 285805 284670 284046 283691 283463 283818 284808 285369 284626 283345 283042 284098 285748 287543
52369B87543K249K997L676M238M511L973K466N20j229k346k449j592o53l64k79
$$ 287543 289792 292789 296465 300703 305214 309187 311653 312173 310944 308598 306149 304557 303904 303540 303261
52354C03261L10Q90N17l11k97M00L57n99j015j61R90J649K187K705K390J101J14
$$ 303261 303571 304461 304978 304667 304370 304770 305127 304528 303513 303352 304342 305991 308178 310883 313273 314374 314488
52337C14488L36J053J328J378J795K433K905L256L523L525L545M236N453O225
$$ 314488 314824 315877 317205 318583 320378 322811 325716 328972 332495 336020 339565 343801 349254 355479
52323C55479O343O806Q134R424R698R176Q506P727O671N613M919M614M694N176
$$ 355479 361822 368628 376762 386186 395884 405060 413566 421293 427964 433577 438496 443110 447804 452980
52309D52980N724N973O282P207Q309Q588Q153Q158Q993R823J0091J0182J0303
$$ 452980 458704 464677 470959 478166 486475 495063 503216 511374 520367 530190 540281 550463 560766
52296E60766J0137R885J0267J1078J1082R793Q046O447M651K593R84P1o85j283
$$ 560766 570903 580788 591055 602133 613215 623008 631054 637501 642152 644745 645729 645800 645115 643832
52282F43832r83M6M85o8l36N24J578J772J514J569J707J417R43O34L75L38J244
$$ 643832 642849 642895 643380 643312 642976 643500 645078 646850 648364 649933 651640 653057 654000 654634 655009 655347 656591
52265F56591K992M275M353M009L998L770K767J698J456J787K155K929M574O474
$$ 656591 659583 663858 668211 672220 676218 679988 682755 684453 685909 687696 689851 692780 697354 703828
52251G03828P623P977Q176Q562R084R573R541Q390O389M677L951L861L960M207
$$ 703828 711451 719428 727604 736166 745250 754823 764364 772754 779143 783820 787771 791632 795592 799799
52237G99799M307L744K796K337K324J813P89M32J077J542J040J88n49j633k887
$$ 799799 804106 807850 810646 812983 815307 817120 817909 818341 819418 820960 822000 822188 821639 820006 817119
52222H17119l046j858r04j203j744j528j234j492j354j45Q11J69j133j382o08
$$ 817119 814073 812215 811311 810108 808364 806836 805602 804110 802756 802611 803422 803591 802458 801076 800468
52207H00468J88J099K649M103M480M361M814N237M274K273R27R00J525K466L909
$$ 800468 800656 801755 804404 808507 812987 817348 822162 827399 831673 833946 834873 835773 837298 839764 843673
52192H43673N388O089O169O368O566O113N225M603L958K452M20q82j232j743l115
$$ 843673 849061 855150 861319 867687 874253 880366 885591 890194 894152 896604 897024 896142 894910 893167 890052
52177H90052m800n972o304n768m657l858m079m865n119m538l771l333l132k945
$$ 890052 885252 879280 872976 867208 862551 858693 854614 849749 844630 840092 836321 832988 829856 826911
52163H26911k612j884o44Q61K322L559M119L481K012R24O83L75p22j944k380k180
$$ 826911 824299 822415 821771 822632 824954 828513 832632 836113 838125 839049 839732 840107 839385 837441 835061 832881
52147H32881j821j069K55J460K024K543L533M243L819K745J844Q50p14k112k448
$$ 832881 831060 829991 830246 831706 833730 836273 839806 844049 847868 850613 852457 853307 852593 850481 848033
52132H48033k283k641l041k233l94J157K134L545N873Q455J0657J2421J3644J4123
$$ 848033 845750 843109 840068 837835 837441 838598 840732 844277 850150 858605 869262 881683 895327 909450
52118I09450J4085J3811J3048J1621J0199R473R012P990O459M969L537K126J460
$$ 909450 923535 937346 950394 962015 972214 981687 990699 998689 1005148 1010117 1013654 1015780 1017240
52105A017240K096L319M186N043O705Q776J0289J1306J2421J3243J2998J2125
$$ 1017240 1019336 1022655 1026841 1031884 1038589 1047365 1057654 1068960 1081381 1094624 1107622 1119747
52093A119747J1596J1082R481O859M185J505j781n134p245q112q824r307q295
$$ 1119747 1131343 1142425 1151906 1158765 1162950 1164455 1162674 1157540 1150295 1142183 1133359 1124052 1115757
52080A115757n784l542k687k441j923j573k123l336m506n166m927l653k139j601
$$ 1115757 1109973 1106431 1103744 1101303 1099380 1097807 1095684 1092348 1087842 1082676 1077749 1074096 1071957 1070356
52066A070356k122k572k258j619j098m02O73J693K236K419K521K801L634N053
$$ 1070356 1068234 1065662 1063404 1061785 1060687 1060285 1060958 1062651 1064887 1067306 1069827 1072628 1076262 1081315
52052A081315O259O398N734N098M440L067J190j50o92j315k508l618l916l421
$$ 1081315 1087574 1093972 1099706 1104804 1109244 1112311 1113501 1113351 1112659 1111344 1108836 1105218 1101302 1097881
52038A097881k471j359n56l90m47m8O08O80q2j170k276l349l935l578k875k925
$$ 1097881 1095410 1094051 1093495 1093105 1092658 1092610 1093218 1093898 1093816 1092646 1090370 1087021 1083086 1079508 1076633 1073708
52022A073708l690l974l136j791q58q57j991l794m867m177k593j848k040j694
$$ 1073708 1070018 1066044 1062908 1061117 1060259 1059402 1057411 1053617 1048750 1044573 1041980 1040132 1038092 1036398
52008A036398l05P17J29j585l383n241p805j1227j4985j8323k0553k1447k1411
$$ 1036398 1036093 1036810 1036939 1035354 1031971 1026730 1018925 1007698 992713 974390 953837 932390 910979
51995I10979k0859j9641j7753j6101j5540j5468j4666j3244j2474j2739j3089
$$ 910979 890120 870479 852726 836625 821085 805617 790951 777707 765233 752494 739405
51984G39405j2912j2660j2679j2610j2298j2112j2145j2110j2236j3046j4102
$$ 739405 726493 713833 701154 688544 676246 664134 651989 639879 627643 614597 600495
51973F00495j4134j2807j1109r773q342o207l570r95J214K978M568O655R336J1332
$$ 600495 586361 573554 562445 552672 544330 538123 534553 533558 534772 537750 542318 548973 558309 569641
51959E69641J1350R954Q806Q159O743M038J013j692m466p153q533q135p135o581
$$ 569641 580991 590945 599751 607910 614653 618691 619704 618012 613546 606393 597860 589725 582590 576009
51945E76009o030m678k638l06K481N797R048J1706J3822J5321J5714J5015J4037
$$ 576009 569979 565301 562663 562357 564838 570635 579683 591389 605211 620532 636246 651261 665298
51932F65298J3222J2092J0275Q124N795K772j155n171q363j0613j2308j3779j5262
$$ 665298 678520 690612 700887 709011 714806 717578 716423 711252 702889 692276 679968 666189 650927
51919F50927j6713j7548j7347j6705j6348j5680j3627j0746q807q141p158m968
$$ 650927 634214 616666 599319 582614 566266 550586 536959 526213 517406 509265 502107 497139
51907D97139k606r85N88K862N159O583P397Q169Q731Q972R459J0211R940P648
$$ 497139 494533 493548 494136 496998 502157 508740 516137 524306 533037 542009 551468 561679 571619 579267
51893E79267M058N14k498m799n592m373j879J040M761R898J5713K0723K4296K6368
$$ 579267 583325 583839 581341 576542 570950 566577 564698 565738 570499 580397 596110 616833 641129 667497
51879F67497K6041K1891J3890M145m486j0087j2304j1942j0072p418m558k481
$$ 667497 693538 715429 729319 733464 728978 718891 706587 694645 684573 677155 672597 670116
51867F70116k230l999p186j1212j5458j8580j9162j7420j5110j3403j1839r737
$$ 670116 667886 663887 656701 645489 630031 611451 592289 574869 559759 546356 534517 524780
51855E24780p345n178l271j795j192j217r44l36o00k303m399n879p018q077q148
$$ 524780 517435 512257 508986 507191 505999 504782 503838 503502 502902 500599 496200 490321 483303 475226 467078
51840D67078o613m642l795l937l829l146k501j958q60R56K854M244M985N112M746
$$ 467078 460465 455823 452028 448091 444262 441116 438615 436657 435797 436753 439607 443851 448836 453948 458694
51825D58694M117L238J879J93j156j821k125k199j590k26J050J538J619K032K807
$$ 458694 462811 466049 467928 468121 466965 465144 463019 460820 459230 459004 460054 461592 463211 465243 468050
51810D68050L502L893L892L308K155O09j454m100o327o645n073l410k927k979
$$ 468050 471552 475445 479337 482645 484800 485409 483955 479855 473528 466883 461810 458400 455473 452494
51796D52494k585k030j899j655n29R73J590Q96n07j917k854l034k693k470k497
$$ 452494 449909 447879 445980 444325 443796 444769 446359 447255 446748 444831 441977 438943 436250 433780 431283
51781D31283k232j584j256j573j971k189k769l707l809k328j56J578L026M826
$$ 431283 429051 427467 426211 424638 422667 420478 417709 414002 410193 407865 407709 409287 412313 417139
51767D17139O813Q498R899J0957J1094J0257R326Q541O768L379l82l113n097p140
$$ 417139 423952 432450 442349 453306 464400 474657 483983 492524 499292 502671 502289 499176 494079 486939
51753D86939q722q918q165p525o988o036n113m923n003m512l746l384k906j371
$$ 486939 478217 469299 461134 453609 446621 440585 435472 430549 425546 421034 417288 413904 410998 409627
51739D09627Q30K589L910N491P082P883Q149Q804R844J0649J1326J2072J1747
$$ 409627 410457 413046 416956 422447 429529 437412 445561 454365 464209 474858 486184 498256 510003
51726E10003R064M974J928R34J134K096M339P285Q752P329L768m54m497p674r070
$$ 510003 519067 524041 525969 526903 528037 530133 534472 541757 550509 557838 561606 561152 556655 548981 539911
51711E39911q510o865m915k933j623k112m307o319o376m545k054K80K264L619
$$ 539911 531401 524536 519621 516688 515065 512953 508646 502327 495951 491406 489352 489632 491896 495515
51697D95515L749K178r23m345o227n513l004m12J521L212M764N260L776L97l908
$$ 495515 499264 501442 500519 496174 489947 484434 481430 481018 482539 485751 490515 495775 499551 499948 496040
51682D96040p766r875r761q241o514m829k666m1K221L553M095M055L334K025O48
$$ 496040 488274 478399 468638 460397 453883 449054 446388 446347 448568 452121 456216 460271 463605 465630 466278
51667D66278l06n26L56K629N976R560J2641J4738J5396J4194J1014O036k14o539
$$ 466278 465972 465446 465802 468431 474407 483967 496608 511346 526742 540936 551950 557986 557772 551233
51653E51233j1392j4029j4846j4195j1673p307k592Q53L034M919O454O499M402
$$ 551233 539841 525812 510966 496771 485098 477791 475199 476052 479086 484005 490459 496958 501360
51640E01360N94m179q955j2322j3351j2770j2060j1451j0010p562n206l725k718
$$ 501360 501954 497775 488820 476498 463147 450377 438317 426866 416856 409294 404088 400363 397645
51627C97645j672q73p25r85j050n33N83J880K636K535K080J820J577J021N21M42
$$ 397645 395973 395100 394375 393390 392340 391807 392390 394270 396906 399441 401521 403341 404918 405939 406460 406902
51611D06902J68j032k548l133k837k894l710m315m017l245k463j400J46J720K860
$$ 406902 407070 406038 403490 400357 397520 394626 390916 386601 382584 379339 376876 375476 375622 377342 380202
51596C80202L657M350N101O276Q186J0373J1975J2881J3715J4522J4333J2264
$$ 380202 383859 388209 393310 399586 407772 418145 430120 443001 456716 471238 485571 497835
51584D97835Q428L670r20m119n070l944j697R06L538N954Q106J0470J3446J6491
$$ 497835 506263 509933 509013 504894 499824 495880 494183 495089 498627 504581 512687 523157 536603 553094
51570E53094J8587J9399J9316J8714J8056J8269J9833K1578K1606J9511J6858
$$ 553094 571681 591080 610396 629110 647166 665435 685268 706846 728452 747963 764821
51559G64821J5558J6770K0989K7854L5696M2510M7491N0551N0492M5241L4357
$$ 764821 780379 797149 818138 845992 881688 924198 971689 1022240 1072732 1117973 1152330
51548A152330K0105N583p374j8302k7402l5267m2287m7876n1006n1693n1094m9907
$$ 1152330 1172435 1178018 1170644 1152342 1124940 1089673 1047386 999510 948504 896811 845717 795810
51536G95810m7732m4242l9954l5420l0619k5601k0879j6754j3071r893p701o613
$$ 795810 748078 703836 663882 628462 597843 572242 551363 534609 521538 511645 503944 497331
51524D97331o087n662n245m647l664k692k354k439k172j598j524k026k179j645
$$ 497331 491244 485582 480337 475690 472026 469334 466980 464541 462369 460771 459247 457221 455042 453397
51510D53397j252j574k052k051j818j842k144k627l278l653l191k325k248l097
$$ 453397 452145 450571 448519 446468 444650 442808 440664 438037 434759 431106 427915 425590 423342 420245
51496D20245l567k834j716j194r56l25L88N26L89Q01J829K809L368L645L792L861
$$ 420245 416678 413844 412128 410934 409978 409653 410041 410567 410956 411757 413586 416395 419763 423408 427200 431061
51480D31061L965M048L704K624J041n21j760k669l413m203m982n272m794m143
$$ 431061 435026 439074 442778 445402 446443 445922 444162 441493 438080 433877 428895 423623 418829 414686
51466D14686m188m845n174m751m126l803l557l058k435j960j679j612j768j904
$$ 414686 410498 405653 400479 395728 391602 387799 384242 381184 378749 376789 375110 373498 371730 369826
51452C69826j696j186n30M37J732K652K639K523L772O507R395J1582J3606J6123
$$ 369826 368130 366944 366414 366851 368583 371235 373874 376397 380169 386676 396071 407653 421259 437382
51438D37382J8721K0257J9582J6031J0210M335O75l94R6J645M181O225N291Q42
$$ 437382 456103 476360 495942 511973 522183 526518 527193 526799 526895 528540 532721 538946 544237 545079
51424E45079m806r194j1954j3682j4272j3472j1875j0270q792p465o601o013m884
$$ 545079 540273 531079 519125 505443 491171 477699 465824 455554 446762 439297 432696 426683 421799
51411D21799l163j978j937k102j511o28k51q1N87J517K021K111K255K497K678
$$ 421799 418636 416658 414721 412619 411108 410480 410229 410148 410735 412252 414273 416384 418639 421136 423814
51396D23814L017L739M617N346N882O065N712N461O458Q747J0957J2222J3350
$$ 423814 426831 430570 435187 440533 446415 452480 458192 463653 470111 478858 489815 502037 515387
51383E15387J5363J8126K1268K5246L0442L6138M1554M6996N2844N8235O2010
$$ 515387 530750 548876 570144 595390 625832 661970 703524 750520 803364 861599 923609
51372I23609O4286O5737O5729O2434N4665M2751K7894J1632m330j8744l1362m2474
$$ 923609 987895 1053632 1119361 1181795 1236460 1279211 1307105 1318737 1314407 1295663 1264301 1221827
51360A221827n2027n9570o4626o6817o6102o3247n9422n5028m9539m2818l5813
$$ 1221827 1169800 1110230 1045604 978787 912685 849438 790016 734988 685449 642631 606818
51349F06818k9549k4305k0120j7206j5342j3725j2016j0677r945r393q790q280
$$ 606818 577269 552964 532844 515638 500296 486571 474555 463878 453933 444540 435750 427470
51337D27470p424n519l244k336k952l098j692k62l51j055q31j04j46p31r48j157
$$ 427470 420046 414527 411283 408947 405995 402897 401205 400943 400592 399537 398706 398602 398456 397725 396777 395620
51321C95620k036k695j958p48q70j999k255j477j360k347k783j747n29m39r19
$$ 395620 393584 390889 388931 388183 387313 385314 383059 381582 380222 377875 375092 373345 372816 372377 371458
51306C71458q42k21K66M66N81N83M54M44N95N17r4j042j846k027j366l49ko61
$$ 371458 370616 370395 370661 371127 371708 372291 372745 373189 373784 374301 374207 373165 371319 369292 367926 367577 367575 366914
51288C66914j315r30J52J028J878L493N523O614O334N618N171M647L677K549J510
$$ 366914 365599 364669 364821 365849 367727 371220 376743 383357 389691 395309 400480 405127 408804 411353 412863
51273D12863L38r95k034k531k763k930k852k455j907j234l71K95K19m25p53l06
$$ 412863 413201 412206 410172 407641 404878 401948 399096 396641 394734 393500 393129 393424 393643 393218 392465 392159
51257C92159M30P01K40o97j595j973j822j646j762j870j701j548j596j278j41
$$ 392159 392589 393290 393530 392833 391238 389265 387443 385797 384035 382165 380464 378916 377320 376042 375901
51242C75901J077J279O17K74Q19J732K412K637K129P32q58j515j061m33l41n69
$$ 375901 376978 378257 378874 379148 379967 381699 384111 386748 388877 389609 388751 387236 386175 385742 385401 384832
51226C84832p14p73p67m06M82J612K528K887K531J645P59K10j64n17n77j97P0
$$ 384832 384118 383345 382578 382172 382654 384266 386794 389681 392212 393857 394616 394826 394662 394145 393568 393371 393441
51209C93441l26j026j243p80N8J103K138K551K122J705K188L139L496L231L065
$$ 393441 393115 392089 390846 390066 390124 391227 393365 395916 398038 399743 401931 405070 408566 411797 414862
51194D14862K926K030N31l85k20K12K17J03L03O45R89J685K804L597L279J940
$$ 414862 417788 419818 420349 419964 419744 419956 420173 420276 420579 421224 422213 423898 426702 430299 433578 435518
51178D35518L44q16j298j329j439j895k358k413k253k387k842l223l408l566l646
$$ 435518 435862 435046 433748 432419 430980 429085 426727 424314 422061 419674 416832 413609 410201 406635 402989
51163D02989l418k869k007o21J197K586K789K167J602J278Q49M69N94J034J187
$$ 402989 399571 396702 394695 394074 395271 397857 400646 402813 404415 405693 406542 407011 407605 408639 409826
51148D09826J070J122J244J028P14P71P46k59j946k993k902k464k255j929j269
$$ 409826 410896 412018 413262 414290 415004 415775 416521 416262 414316 411323 408421 405957 403702 401773 400504
51133D00504p38n41k44K84N10K40J46P79J871K909L699M128M086L822L681L350
$$ 400504 399766 399225 398981 399265 399775 400015 400161 400940 402811 405720 409419 413547 417633 421455 425136 428486
51117D28486K245O95k30k78l64j021j574j291m57K52O76R53J068J058J107J093
$$ 428486 430731 431426 431196 430918 430554 429533 427959 426668 426211 426463 427139 428092 429160 430218 431325 432418
51101D32418O57m6k89L06J365K450L367L673K803J034m43q33m88j03R1R0j45l15
$$ 432418 433075 433029 432740 433046 434411 436861 440228 443901 446704 447738 447295 446462 445974 445871 445962 446052 445907 445592
51083D45592J16J082J756J553P07l42j498k623l281l206k579j665o92m1N6O0N81
$$ 445592 445708 446790 448546 450099 450806 450464 448966 446343 443062 439856 437277 435612 434920 434879 434935 434995 435576
51066D35576J380J723J698K138L160L943M209M678N683O523O818P417R123J1273
$$ 435576 436956 438679 440377 442515 445675 449618 453827 458505 464188 470711 477529 484946 494069 505342
51052E05342J2321J1323Q487N008K737L159O045R738J2949J5468J6941J6461J4217
$$ 505342 517663 528986 537473 542481 545218 548377 554422 564160 577109 592577 609518 625979 640196
51039F40196J2111J1486J1107Q755M276k69l093m123m171m030m550o561j0116
$$ 640196 652307 663793 674900 683655 687931 687662 684569 680446 676275 672245 667695 661134 651018
51026F51018j4219j7597j9426j9407j7589j4373j0538p025m524l019j791k06J518
$$ 651018 636799 619202 599776 580369 562780 548407 537869 530844 526320 523301 521510 521304 522822
51013E22822K661L085L422M113M857N249N339N315N161N053N472O513P539Q036
$$ 522822 525483 528568 531990 536103 540960 546209 551548 556863 562024 567077 572549 579062 586601 594637
50999E94637Q361R126J0173J0803J0759J0446J0205J0004R873J0141J0931J1653
$$ 594637 602998 612124 622297 633100 643859 654305 664510 674514 684387 694528 705459 717112
50987G17112J1462J0304R141Q793Q836Q200O765N606N467N820N925N941O204O088
$$ 717112 728574 738878 748019 756812 765648 773848 780613 786219 791686 797506 803431 809372 815576 821664
50973H21664M642J947j051l692n605o080m546j494K104O012J0315J4272J7002
$$ 821664 826306 828253 827202 823510 817905 811825 807279 805785 807889 813901 824216 838488 855490
50960H55490J9114K1970K5371K7632K8266K8809L0318L1698L1388K9462K7013
$$ 855490 874604 896574 921945 949577 977843 1006652 1036970 1068668 1100056 1129518 1156531
50949A156531K4583K2195K0025J8046J5748J3082J1083J0767J1947J3890J6473
$$ 1156531 1181114 1203309 1223334 1241380 1257128 1270210 1281293 1292060 1304007 1317897 1334370
50938A334370J9925K3774K6726K7197K3832J6305O333k891r133j2664j5007j6858
$$ 1334370 1354295 1378069 1404795 1431992 1455824 1472129 1478462 1475571 1466438 1453774 1438767 1421909
50926A421909j7953j8368j8892k0249k2549k5483k8653l1673l4213l5887l6290
$$ 1421909 1403956 1385588 1366696 1346447 1323898 1298415 1269762 1238089 1203876 1167989 1131699
50915A131699l5465l4199l3197l2121l0125k7328k4738k2752k0779j8589j6858
$$ 1131699 1096234 1062035 1028838 996717 966592 939264 914526 891774 870995 852406 835548
50904H35548j5938j5207j4213j3404j3078j2511j0999q941p187n918m902m191
$$ 835548 819610 804403 790190 776786 763708 751197 740198 731257 724070 718152 713250 709059
50892G09059l871l584l082k746k970l390l289k398r96M21J295J312Q20M72M15
$$ 709059 705188 701604 698522 695776 692806 689416 686127 683729 682733 683154 684449 685761 686581 687053 687468
50877F87468M09O98J773L243M056M130M583N893P087P302P039P173P768Q564R682
$$ 687468 687877 688575 690348 693591 697647 701777 706360 712253 719340 726642 733681 740854 748622 757186 766868
50862G66868J1069J2217J3057J4226J5791J6833J7119J7989K0611K4299K7675
$$ 766868 777937 790154 803211 817437 833228 850061 867180 885169 905780 930079 957754
50851I57754L0530L3521L6842M0390M4491M9319N4125N8139O1654O5302O8735
$$ 957754 988284 1021805 1058647 1099037 1143528 1192847 1246972 1305111 1366765 1432067 1500802
50840A500802P1047P2025P2099P1487P0028O7430O3086N6377M7856L9286L1803
$$ 1500802 1571849 1643874 1715973 1787460 1857488 1924918 1988004 2044381 2092237 2131523 2163326
50829B163326K4867J7734J0988N652J874n15j036N94L575P141J1676J7496K3317
$$ 2163326 2188193 2205927 2216915 2222567 2224441 2223926 2222890 2223484 2227059 2234200 2245876 2263372 2286689
50816B286689K7320K8995K8634K5856K0114J2014K557q286k0676l3247m4056n2898
$$ 2286689 2314009 2343004 2371638 2397494 2417608 2429622 2432179 2423893 2403217 2369970 2325914 2273016
50804B273016o0945o8416p4228p7788p9348p8666p5141o9456o3426n7805n1725
$$ 2273016 2212071 2143655 2069427 1991639 1912291 1833625 1758484 1689028 1625602 1567797 1516072
50793A516072m4728l7798l1791k6154j9964j3395p376k500J237M159O656Q804
$$ 1516072 1471344 1433546 1401755 1375601 1355637 1342242 1334866 1332366 1333603 1337762 1344418 1353222
50781A353222J0086J0012Q919P551N953L625O67k106m229n952p497q787j0046
$$ 1353222 1363308 1373320 1382239 1389790 1395743 1399368 1400035 1397929 1393700 1387748 1380251 1371464 1361418
50768A361418j1891j4653j8109k1898k5605k8547l0205l0873l1280l1588l1381
$$ 1361418 1349527 1334874 1316765 1294867 1269262 1240715 1210510 1179637 1148357 1116769 1085388
50757A085388l0486k9081k7193k4736k2009j9425j6858j3968j0947q261n797l116
$$ 1085388 1054902 1025821 998628 973892 951883 932458 915600 901632 890685 882424 876627 873511
50745H73511l52J944L743N544P482R293J1047J3169J5678J8154K0442K2818K5549
$$ 873511 873159 875103 878846 884390 891872 901165 912212 925381 941059 959213 979655 1002473 1028022
50732A028022K8761L2528L6526L9941M2335M4192M5904M6885M6566M5573M4758
$$ 1028022 1056783 1089311 1125837 1165778 1208113 1252305 1298209 1345094 1391660 1437233 1481991
50721A481991M3524M0626L6264L1999K8450K4530J9157J2522N398j672q055j2938
$$ 1481991 1525515 1566141 1602405 1634404 1662854 1687384 1706541 1719063 1724461 1722789 1714734 1701796
50709A701796j6034j7721j8145j6855j3603q867l480J896O901J1606J6328K0787
$$ 1701796 1685762 1668041 1649896 1633041 1619438 1610571 1607091 1608987 1615888 1627494 1643822 1664609
50697A664609K3711K3994K1889J8360J3692P689Q56n751j1664j6927k1086k3416
$$ 1664609 1688320 1712314 1734203 1752563 1766255 1773944 1774800 1769049 1757385 1740458 1719372 1695956
50685A695956k3982k3420k1825j9069j5973j3745j2261j0337p721n390l561r71
$$ 1695956 1671974 1648554 1626729 1607660 1591687 1577942 1565681 1555344 1547623 1542233 1538672 1537701
50673A537701L368R018J5239K2006K9206L5961M1508M5830M8816M9691M8017M4532
$$ 1537701 1541069 1550087 1565326 1587332 1616538 1652499 1694007 1739837 1788653 1838344 1886361 1930893
50661A930893M0352L5971L1597K7744K4870K2890K1467K0429J9509J8223J6292
$$ 1930893 1971245 2007216 2038813 2066557 2091427 2114317 2135784 2156213 2175722 2193945 2210237
50650B210237J3769J0641O940L346J019O10J937M626Q415J2886J7704K3134K9415
$$ 2210237 2224006 2234647 2241587 2244933 2245952 2246562 2248499 2253125 2261540 2274426 2292130 2315264 2344679
50637B344679L5687M0593M4075M7236N0180N1287M9305M4976L9743L4036K7850
$$ 2344679 2380366 2420959 2465034 2512270 2562450 2613737 2663042 2708018 2747761 2781797 2809647
50626B809647K2048J7668J4412J1118P608M617J273o105k1189m3115o5352p9918
$$ 2809647 2831695 2849363 2863775 2874893 2882501 2887118 2888391 2882286 2861097 2817982 2752630 2672712
50614B672712q3071p6901o5899n3050l9344k5567j2971k464N663J1127J3623J3244
$$ 2672712 2589641 2512740 2446841 2393791 2354447 2328880 2315909 2313445 2319108 2330235 2343858 2357102
50602B357102J0209M237m963j6558k8769m0179n0266n8763o5368p0012p2731p3312
$$ 2357102 2367311 2371548 2366585 2350027 2321258 2281079 2230813 2172050 2106682 2036670 1963939 1890627
50590A890627p1787o9006o5952o2663n8582n3683m8359m2589l6271l0065k4796
$$ 1890627 1818840 1749834 1683882 1621219 1562637 1508954 1460595 1418006 1381735 1351670 1326874
50579A326874k0240j5627j1094p353m240j001K070L920M626N426O770P833Q276
$$ 1326874 1306634 1291007 1279913 1272560 1268320 1267319 1269389 1273309 1277935 1283361 1290131 1297964 1306240
50566A306240Q786R464R234P621N759M940N331O605Q674J1204J3601J6108J9807
$$ 1306240 1315026 1324490 1333724 1341345 1347104 1352044 1357375 1363980 1372654 1383858 1397459 1413567 1433374
50553A433374K5063L1019L6991M3056M8758N2730N4312N4265N3164N0403M5803
$$ 1433374 1458437 1489456 1526447 1569503 1618261 1670991 1725303 1779568 1832732 1883135 1928938
50542A928938M0912L7638L6484L7018L9064M2459M6530N0806N5559O0905O6186
$$ 1928938 1969850 2007488 2043972 2080990 2120054 2162513 2209043 2259849 2315408 2376313 2442499
50531B442499P0973P5827Q1323Q7213R3329J00332J08608J17325J25458J32975
$$ 2442499 2513472 2589299 2670622 2757835 2851164 2951496 3060104 3177429 3302887 3435862
50521C435862J40072J46023J49724J50785J49218J44583J36227J23824J07124
$$ 3435862 3575934 3721957 3871681 4022466 4171684 4316267 4452494 4576318 4683442
50512D683442Q5892O0748L3370N220k3174n1225p7521j00797j20737j37105j49002
$$ 4683442 4769334 4830082 4863452 4868672 4845498 4794273 4716752 4615955 4495218 4358113 4209111
50501D209111j55683j57185j53405j43656j28122j08716q7465o4829m0719j6204
$$ 4209111 4053428 3896243 3742838 3599182 3471060 3362344 3274879 3210050 3169331 3153127
50491C153127O913K7417M4414N6453O2118O0945N2840L7385J5017j1714l9376
$$ 3153127 3160040 3187457 3231871 3288324 3350442 3411387 3464227 3501612 3516629 3504915 3465539
50480C465539o5696q9396j08719j21826j28638j31076j31208j29838j26827j22032
$$ 3465539 3399843 3310447 3201728 3079902 2951264 2820188 2688980 2559142 2432315 2310283
50470B310283j15973j09870j04636r9602r3058q4515p5492o7448o0172n3157m7184
$$ 2310283 2194310 2084440 1979804 1880202 1787144 1702629 1627137 1559689 1499517 1446360 1399176
50459A399176m3023l9566l5030k9530k4704k1153j7957j4607j1671r377p066m537
$$ 1399176 1356153 1316587 1281557 1252027 1227323 1206170 1188213 1173606 1161935 1152558 1145492 1140955
50447A140955k670k064j978j187O08K651M039M592M972N974P621R305J0868J2755
$$ 1140955 1138285 1136221 1134243 1133056 1133664 1136315 1140354 1144946 1149918 1155892 1163513 1172818 1183686 1196441
50433A196441J4748J5565J4599J3136J2795J3397J3555J2914J2534J3379J5478
$$ 1196441 1211189 1226754 1241353 1254489 1267284 1280681 1294236 1307150 1319684 1333063 1348541
50422A348541J8382K1392K3641K5048K6897L0373L4869L8980M2883M8186N5342
$$ 1348541 1366923 1388315 1411956 1437004 1463901 1494274 1529143 1568123 1611006 1659192 1714534
50411A714534O2710O8637P3245P7474Q1399Q4256Q5584Q5650Q4845Q3092P9885
$$ 1714534 1777244 1845881 1919126 1996600 2077999 2162255 2247839 2333489 2418334 2501426 2581311
50400B581311P4924O8718O2174N5319M6907L5823K2330P381q789k6398m4784o2254
$$ 2581311 2656235 2724953 2787127 2842446 2889353 2925176 2947506 2954887 2946098 2919700 2874916 2812662
50388B812662p7221q8785r6396r9804r9320r5536q8802p9555o8820n7656m6233
$$ 2812662 2735441 2646656 2550260 2450456 2351136 2255600 2166798 2087243 2018423 1960767 1914534
50377A914534l4204k1763r700J375J1093J8802K3738K5625K4387J9577J0897p97
$$ 1914534 1880330 1858567 1848867 1850242 1861335 1880137 1903875 1929500 1953887 1973464 1984361 1983564
50365A983564j3779k6556l8190m7821n4882n9576o2337o3009o1356n8146n4776
$$ 1983564 1969785 1943229 1905039 1857218 1802336 1742760 1680423 1617414 1556058 1497912 1443136
50354A443136n1838m8946m5919m3193m0975l9013l7255l5943l4841l3111l0302
$$ 1443136 1391298 1342352 1296433 1253240 1212265 1173252 1135997 1100054 1065213 1032102 1001800
50343A001800k6888k3703k1231j9439j7849j5857j3425j1289j0044r297q276o920
$$ 1001800 974912 951209 929978 910539 892690 876833 863408 852119 842075 832778 824502 817582
50331H17582n691m670l661k889k720k837k554j793r73j46R36K129L158M402O486
$$ 817582 811891 807221 803560 800671 797951 795114 792560 790767 789794 789648 790584 792713 795871 800273 806759
50316H06759R240J1980J4664J7688K0671K2540K2921K2241K0341J6250R810K658
$$ 806759 815999 827979 842643 860331 881002 903542 926463 948704 969045 985295 995105 997763
50304I97763l009o039o521n295l598k527k203j840q81L47J206J509J516J592J963
$$ 997763 994754 988715 982194 976899 973301 970774 968571 966731 965850 966197 967403 968912 970428 972020 973983
50289I73983K427K306J137n49j547j191K02K025M139O740R503J0825Q366J243
$$ 973983 976410 978716 979853 979304 977757 976566 976768 978793 982932 989672 999175 1010000 1018366 1019609
50275A019609q059j5080j7411j6452j4606j2087p904k807J010K825M005N493O544
$$ 1019609 1011550 996470 979059 962607 948001 935914 928010 925203 926213 929038 933043 938536 945080
50262I45080O409N681N180M857M562M768N733O677O733O061N293M373K637q7k972
$$ 945080 951489 957170 962350 967207 971769 976537 982270 988947 995680 1001741 1007034 1011407 1014044 1013957 1010985
50247A010985m800n069m519m440n189n813n508m876m904n206m480k486m18Q40
$$ 1010985 1006185 1001116 996597 992157 986968 981155 975647 970771 965867 960661 956181 953695 953277 954117
50233I54117J725L113N353Q342J1725J4830J7250J9598K2838K6835L0481L3286
$$ 954117 955842 958955 964308 972650 984375 999205 1016455 1036053 1058891 1085726 1116207 1149493
50221A149493L5734L7874L8723L7496L4533L0581K6049K1420J7549J4994J3573
$$ 1149493 1185227 1223101 1261824 1299320 1333853 1364434 1390483 1411903 1429452 1444446 1458019
50210A458019J2827J2350J1432R107M839j326r281j8716k8452l6807m2919m6914
$$ 1458019 1470846 1483196 1494628 1503735 1508574 1507248 1497967 1479251 1450799 1413992 1371073 1324159
50198A324159m8823m8260m5368m1003l5679k9389k2749j7231j3642j1355r745
$$ 1324159 1275336 1227076 1181708 1140705 1105026 1075637 1052888 1035657 1022015 1010660 1000915
50187A000915r501j1706j6160k1283k5305k7150k6585k4156k0772j7152j3758
$$ 1000915 991414 979708 963548 942265 916960 889810 863225 839069 818297 801145 787387
50176G87387j1049r194p662n833l972k805k174j198J89R02L28p13j055m05P99
$$ 787387 776338 767144 759482 753649 749677 746872 744698 743500 743689 744591 744919 744206 743151 742746 743545
50161G43545K050K872K996K774K822L185L515L983N023O250O817O939P729R232
$$ 743545 745595 748467 751463 754237 757059 760244 763759 767742 772765 779015 785832 792771 800500 809732
50147H09732J0054R384P988O549M482J368j726l510m129m502m845m834m561m179
$$ 809732 819786 829170 837158 843707 848189 849557 847831 844321 840192 835690 830845 826011 821450 817271
50133H17271l272j485O63K483M086N830P292P758P330O746O351O034N872O135
$$ 817271 813999 812514 813177 815660 819746 825576 832868 840626 847956 854702 861053 867087 872959 879094
50119H79094O876Q042R802J2170J4695J7018J9382K2199K5451K9077L3515L9306
$$ 879094 885970 894012 903814 915984 930679 947697 967079 989278 1014729 1043806 1077321 1116627
50107A116627M6337N3870O1050O7132P1499P3794P3818P1267O6192N9797N3994
$$ 1116627 1162964 1216834 1277884 1345016 1416515 1490309 1564127 1635394 1701586 1761383 1815377
50096A815377M9870M7159M5334M4285M3487M1432L6579K8295J6537J496j5784
$$ 1815377 1865247 1912406 1957740 2002025 2045512 2086944 2123523 2151818 2168355 2169851 2154067
50085B154067l3127m8428o0797p0230p6762q0434q1476q0106p6662p2088o7417
$$ 2154067 2120940 2072512 2011715 1941485 1864723 1784289 1702813 1622707 1546045 1473957 1406540
50074A406540o2461n6045m8037m0029l3361k7699k2490j8595j7056j7018j6375
$$ 1406540 1344079 1288034 1239997 1199968 1166607 1138908 1116418 1097823 1080767 1063749 1047374
50063A047374j4221j1555r742r232r572r836r099p224n098l709l317l848n332
$$ 1047374 1033153 1021598 1011856 1002624 993052 983216 974117 966893 961795 958086 954769 950921 945589
50050I45589p335q651q474p382o462n934n398m886m679m485l667k104j33J983
$$ 945589 938254 929603 921129 913747 907285 901351 895953 891067 886388 881903 878236 876132 875999 877982
50036H77982L815M524L792K687K808M605P186R411J0623J0740J0307J0207J0559
$$ 877982 881797 886321 890113 892800 895608 900213 907399 916810 927433 938173 948480 958687 969246
50023I69246J0315Q564N814L317J634N96J20J04p4r97k402l764n276p319r273
$$ 969246 979561 988125 993939 997256 998890 999486 999606 999710 999636 998639 996237 992473 987197 979878 970605
50008I70605r921q988p411o090n252m867m850m680l615j418J554M948Q659J2591
$$ 970605 960684 951696 944285 938195 932943 928076 923226 918546 914931 913513 915067 920015 928674 941265
49994I41265J6601K0453K3505K4885K4632K4177K5068K7533L0830L4337L7410
$$ 941265 957866 978319 1001824 1026709 1051341 1075518 1100586 1128119 1158949 1193286 1230696
49983A230696L8712L7018L2699K7472K2557J7915J3316R322O922O672Q244J0487
$$ 1230696 1269408 1306426 1339125 1366597 1389154 1407069 1420385 1429707 1436629 1443301 1451545 1462032
49971A462032J1946J1625R149M137l903j4597k6228l6895m5741n2423n6190n6487
$$ 1462032 1473978 1485603 1494752 1498889 1494986 1480389 1454161 1417266 1371525 1319102 1262912 1206425
49959A206425n4050n0271m5694m0036l3495k7005k1167j5770j0495n426q62K824
$$ 1206425 1152375 1102104 1056410 1016374 982879 955874 934707 918937 908442 903016 902154 904978
49947I04978N242O300O307N338L079j85l114m655n350o339p706q849j0002j1965
$$ 904978 910220 916520 922827 928165 931244 931059 927945 923290 917940 911601 903895 895046 885044 873079
49933H73079j4594j6847j8323j9560k0700k1069k0284j8726j6803j4576j2293
$$ 873079 858485 841638 823315 803755 783055 761986 741702 722976 706173 691597 679304
49922F79304j0360q659o724m680l092j877l45J538K930L373L368L384L234K779
$$ 679304 668944 660285 653561 648881 645789 643912 643567 645105 648035 651408 654776 658160 661394 664173
49908F64173K466K751L603M852O464Q296J0134J2026J4055J5743J6447J6327J6140
$$ 664173 666639 669390 672993 677845 684309 692605 702739 714765 728820 744563 761010 777337 793477
49895G93477J6005J5189J3238J0492P360L919M36k534m854o979r267j1756j4538
$$ 793477 809482 824671 837909 848401 855761 859680 860116 857582 852728 845749 836482 824726 810188
49882H10188j7462j9447j9226j7084j4897j3988j3913j3737j3391j3106j2484
$$ 810188 792726 773279 754053 736969 722072 708084 694171 680434 667043 653937 641453
49871F41453j1106r381p981o804n277l315j295O00K324L506L809L635L932N179
$$ 641453 630347 620966 612985 606181 600904 597589 596294 596894 599218 602724 606533 610168 614100 619279
49857F19279O963Q641J0094J1682J3643J5674J7147J7689J7350J6232J4288J1710
$$ 619279 626242 634883 644977 656659 670302 685976 703123 720812 738162 754394 768682 780392
49845G80392R155P079N162K924P01p94j805l632p059j1273j4660j6255j6162j4933
$$ 780392 789547 796626 801788 804712 805413 804619 802814 799182 792123 780850 766190 749935 733773 718840
$$ [...]
##END NTUPLES=NMR SPECTRUM
##END=
