
##TITLE=UV1262_M11_1332-1242_90_7409891_1Pyz8EknLK
##JCAMPDX= 6.0         $$ Bruker NMR JCAMP-DX V2.0
##DATA TYPE= NMR SPECTRUM
##DATA CLASS= NTUPLES
##ORIGIN= BRUKER
##OWNER= Administrator
$$ 1.72 TOPSPIN		Version 2.1
$$ 2013-01-24 22:18:31.990 -0500  Administrator@X
$$ Compression mode = diff/dup
##.OBSERVE FREQUENCY= 400.02188249412
##.OBSERVE NUCLEUS= ^1H
##.ACQUISITION MODE= SIMULTANEOUS (DQD)
##.ACQUISITION SCHEME= undefined
##.AVERAGES= 8
##.DIGITISER RES= 22
##SPECTROMETER/DATA SYSTEM= spect
##.PULSE SEQUENCE= zg30
##.SOLVENT NAME= COFFEE_meoh
##.SHIFT REFERENCE= INTERNAL, COFFEE_meoh, 1, 14.98509
##AUDIT TRAIL= $$ (NUMBER, WHEN, WHO, WHERE, PROCESS, VERSION, WHAT)
$$ ##TITLE= Audit trail, TOPSPIN		Version 2.1
$$ ##JCAMPDX= 5.01
$$ ##ORIGIN= Bruker BioSpin GmbH
$$ ##OWNER= Administrator
$$ $$ E:\/data/COFFEE/nmr/UV1262_M11_1332-1242_90_7409891_1Pyz8EknLK/10/pdata/1/auditp.txt
$$ ##AUDIT TRAIL=  $$ (NUMBER, WHEN, WHO, WHERE, PROCESS, VERSION, WHAT)
(   1,<2013-01-24 22:18:23.958 -0500>,<Administrator>,<X>,<go>,<TOPSPIN 2.1>,
      <created by zg
	started at 2013-01-24 22:17:17.974 -0500,
	POWCHK enabled, PULCHK disabled,
       configuration hash MD5:
       86 BA 57 50 F2 9D 5C 9B 26 00 A9 28 5F 66 2E 89
       data hash MD5: 64K
       37 D1 B8 F7 FF B6 46 A0 A1 D7 B9 3A 8B B0 24 E5>)
(   2,<2013-01-24 22:18:27.005 -0500>,<Administrator>,<X>,<proc1d>,<TOPSPIN 2.1>,
      <Start of raw data processing
       efp LB = 0 FT_mod = 6 PKNL = 1 PHC0 = 0 PHC1 = 0 SI = 32K 
       data hash MD5: 32K
       64 7A 45 29 F0 98 30 EE 70 B8 73 FA 42 08 C4 97>)
(   3,<2013-01-24 22:18:27.458 -0500>,<Administrator>,<X>,<proc1d>,<TOPSPIN 2.1>,
      <pk PHC0 = 97.99255 PHC1 = 0 
       data hash MD5: 32K
       DE 1B F1 94 0E 3E AD 4C 40 26 EA 47 18 28 52 C8>)
(   4,<2013-01-24 22:18:27.708 -0500>,<Administrator>,<X>,<proc1d>,<TOPSPIN 2.1>,
      <abs ABSG = 1 
       data hash MD5: 32K
       BF 62 C3 25 C7 D8 B5 F9 CA 49 45 A3 FD FE 69 0A>)
(   5,<2013-01-24 22:18:27.849 -0500>,<Administrator>,<X>,<proc1d>,<TOPSPIN 2.1>,
      <abs ABSG = 2 
       data hash MD5: 32K
       40 D0 04 AA CE 06 E8 A4 61 3F FA 6E 86 16 07 E3>)
(   6,<2013-01-24 22:18:28.005 -0500>,<Administrator>,<X>,<proc1d>,<TOPSPIN 2.1>,
      <abs ABSG = 3 
       data hash MD5: 32K
       F6 C0 17 42 D9 F1 18 A8 B2 11 10 DF 4D DE 65 98>)
(   7,<2013-01-24 22:18:28.146 -0500>,<Administrator>,<X>,<proc1d>,<TOPSPIN 2.1>,
      <abs ABSG = 4 
       data hash MD5: 32K
       15 C8 90 FC 21 53 C3 44 35 AF 4E DE EF 53 06 12>)
(   8,<2013-01-24 22:18:28.302 -0500>,<Administrator>,<X>,<proc1d>,<TOPSPIN 2.1>,
      <abs ABSG = 5 
       data hash MD5: 32K
       1F EA B4 EE C5 24 72 33 C5 19 F6 75 C8 36 48 97>)
$$ ##END=
$$ 
$$ $$ hash MD5
$$ $$ 0A 44 B8 80 4C F1 CC 93 73 C2 B0 AF 6F 49 54 80
##$RELAX= 
##$RELAX= 
##$RELAX= 
##$RELAX= 
##$RELAX= 
##$RELAX= 
##$RELAX= 
$$ Bruker specific parameters
$$ --------------------------
##$DU= <E:\>
##$EXPNO= 10
$$ [...]
##$TP= (0..7)
150 150 150 150 150 150 150 150
##$TP07= 0
##$TPNAME0= <>
##$TPNAME1= <>
##$TPNAME2= <>
##$TPNAME3= <>
##$TPNAME4= <>
##$TPNAME5= <>
##$TPNAME6= <>
##$TPNAME7= <>
##$TPOAL= (0..7)
0.5 0.5 0.5 0.5 0.5 0.5 0.5 0.5
##$TPOFFS= (0..7)
0 0 0 0 0 0 0 0
##$TUNHIN= 0
##$TUNHOUT= 0
##$TUNXOUT= 0
##$USERA1= <user>
##$USERA2= <user>
##$USERA3= <user>
##$USERA4= <user>
##$USERA5= <user>
##$V9= 5
##$VALIST= <valist>
##$VCLIST= <CCCCCCCCCCCCCCC>
##$VD= 0
##$VDLIST= <DDDDDDDDDDDDDDD>
##$VPLIST= <PPPPPPPPPPPPPPP>
##$VTLIST= <TTTTTTTTTTTTTTT>
##$WBST= 1024
##$WBSW= 4
##$XGAIN= (0..3)
0 0 0 0
##$XL= 0
##$YL= 0
##$YMAX_a= 671870
##$YMIN_a= -572287
##$ZGOPTNS= <>
##$ZL1= 120
##$ZL2= 120
##$ZL3= 120
##$ZL4= 120
##$ABSF1= 14.98509
##$ABSF2= -5.573092
##$ABSG= 5
##$ABSL= 3
##$ALPHA= 0
##$AQORDER= 0
##$ASSFAC= 0
##$ASSFACI= 0
##$ASSFACX= 0
##$ASSWID= 0
##$AUNMP= <proc_prof1d_extract_pilot.lims>
##$AXLEFT= 0
##$AXNAME= <>
##$AXNUC= <1H>
##$AXRIGHT= 0
##$AXTYPE= 0
##$AXUNIT= <>
##$AZFE= 0.1
##$AZFW= 0.1
##$BCFW= 0
##$BC_mod= 0
##$BYTORDP= 0
##$COROFFS= 0
##$CY= 15
##$DATMOD= 1
##$DC= 0
##$DFILT= <>
##$DTYPP= 0
##$F1P= 0
##$F2P= 0
##$FCOR= 0.5
##$FTSIZE= 32768
##$FT_mod= 6
##$GAMMA= 0
##$GB= 0
##$INTBC= 1
##$INTSCL= 1
##$ISEN= 128
##$LB= 0
##$LEV0= 0
##$LPBIN= 0
##$MAXI= 10000
##$MC2= 0
##$MEAN= 0
##$ME_mod= 0
##$MI= 0
##$NCOEF= 0
##$NC_proc= -8
##$NLEV= 6
##$NOISF1= 0
##$NOISF2= 0
##$NSP= 0
##$NTH_PI= 0
##$NZP= 0
##$OFFSET= 14.98509
##$PC= 1
##$PHC0= 97.99255
##$PHC1= 0
##$PH_mod= 1
##$PKNL= yes
##$PPARMOD= 0
##$PPDIAG= 0
##$PPIPTYP= 0
##$PPMPNUM= 2147483647
##$PPRESOL= 1
##$PSCAL= 4
##$PSIGN= 0
##$PYNMP= <proc.py>
##$REVERSE= no
##$SF= 400.02
##$SI= 32768
##$SIGF1= 0
##$SIGF2= 0
##$SINO= 400
##$SIOLD= 32768
##$SPECTYP= <>
##$SREGLST= <1H.CDCl3>
##$SSB= 0
##$STSI= 32768
##$STSR= 0
##$SW_p= 8223.68421052631
##$SYMM= 0
##$S_DEV= 0
##$TDeff= 65536
##$TDoff= 0
##$TI= <>
##$TILT= no
##$TM1= 0
##$TM2= 0
##$TOPLEV= 0
##$USERP1= <user>
##$USERP2= <user>
##$USERP3= <user>
##$USERP4= <user>
##$USERP5= <user>
##$WDW= 1
##$XDIM= 32768
##$YMAX_p= 472695026
##$YMIN_p= -696804
##$CURPLOT= <Network HP LaserJet P1505>
##$CURPRIN= <$Network HP LaserJet P1505>
##$DFORMAT= <normdp>
##$LAYOUT= <+/1D_H.xwp>
##$LFORMAT= <normlp>
##$PFORMAT= <normpl>
##$SURQMSG= 1
$$ End of Bruker specific parameters
$$ ---------------------------------
##NTUPLES= NMR SPECTRUM
##VAR_NAME=  FREQUENCY,     SPECTRUM/REAL,   SPECTRUM/IMAG
##SYMBOL=    X,             R,               I
##VAR_TYPE=  INDEPENDENT,   DEPENDENT,       DEPENDENT
##VAR_FORM=  AFFN,          ASDF,            ASDF
##VAR_DIM=   32768,         32768,           32768
##UNITS=     HZ,            ARBITRARY UNITS, ARBITRARY UNITS
##FACTOR=    0.250966925370066, 1,           1
##FIRST=     8223.43324360094, -388848,      -159011
##LAST=      0,             285450,          -8296
##MIN=       0,             -696804,         0
##MAX=       8223.43324360094, 472695026,    0
$$ Real data points
##PAGE= N=1
##DATA TABLE= (X++(R..R)), XYDATA
$$ [...]
19536a87666m6057j30057M9735D83814C3467b21084A63a0821j39069l34908C11545
$$ -187666 -233723 -363780 -314045 483814 33467 -221084 163 -10821 -149890 -484798 311545
19524B0243c0938n5755Q045C31143A26888a22241j59318d4664C73a08759j6604
$$ 20243 -30938 -86693 -78648 331143 126888 -122241 -281559 -44664 373 -108759 -125363
19513a25363j87468i0690D13701A53022E6554b9526j18677j2260k1750a20A34491
$$ -125363 -312831 -90690 413701 153022 56554 -29526 -148203 -160463 -182213 -120 134491
19501A50399b17565c0285n2404k52321C0131a83470m271c1656p595A57791b57563
$$ 150399 -217565 -30285 -82689 -335010 30131 -183470 -187741 -31656 -39251 157791 -257563
19489a18013j40113q8515a33523j19551L5370R0515j34300m2279d3739k05424
$$ -118013 -258126 -346641 -133523 -253074 -217704 -127189 -261489 -303768 -43739 -249163
19479b49163A446K11858d2006A13320a88114i0090A85069b46112O3571j08561
$$ -249163 1446 213304 -42006 113320 -188114 -90090 185069 -246112 -182541 -291102
19469b91102M5291Q5243L0236N8629A63737E3531c73383D5991a14687m0619I7918
$$ -291102 -245811 -160568 -130332 -71703 163737 53531 -373383 45991 -114687 -155306 97918
19457a58447E3625j7926d01797I7745d32779g4823k77112B02684d146j65450h1246
$$ -158447 53625 35699 -401797 97745 -432779 -74823 -351935 202684 -4146 -169596 -81246
19445h67q4007m21711a11901C02337a86314A4147Q7729a37580M3781A17249M6591
$$ -867 -84874 -506585 -111901 302337 -186314 14147 101876 -137580 -93799 117249 163840
19434A63840a13390i658A89862i3408I482P4637A5868g4574m5113d2205B50081
$$ 163840 -113390 -9658 189862 -93408 9482 84119 15868 -74574 -119687 -42205 250081
19422b7963B76290a95642K4790F176a52853O6294G8868i4051m2266A18676H553
$$ -27963 276290 -195642 -170852 6176 -152853 -86559 78868 -94051 -136317 118676 8553
19410A00495P4139a56295A04842m7832L17089a63917j63096a28776e8561B8835
$$ 100495 174634 -156295 104842 57010 374099 -163917 -327013 -128776 -58561 28835
19399b56755f31C66711A74209g3352j71482d5444j67002A15179C7172a12613C7453
$$ -256755 -631 366711 174209 -73352 -244834 -45444 -212446 115179 37172 -112613 37453
19387E9538J3831K92979a21241k1202n6659b9702p1984k67365d2318F964c49754
$$ 59538 73369 366348 -121241 -142443 -199102 -29702 -101686 -369051 -42318 6964 -349754
19375f0153K9715l12788E7636i2916B0836L83624B2570b58350c95G4571h5827
$$ -60153 -30438 -343226 57636 -92916 20836 404460 22570 -258350 -395 74571 -85827
19363a32645d085k77012C5395J82050a31847A84988c4146A35231a06854A1120
$$ -132645 -4085 -281097 35395 217445 -131847 184988 -34146 135231 -106854 11120
19352C8209b24558G1631b989q1902k69353a23729a1319n7097p0636B10277a08289
$$ 38209 -224558 71631 -2989 -84891 -354244 -123729 -11319 -68416 -139052 210277 -108289
19340b21003f6697q3540o9042C3703J46240J29456h4364l31991d1309E3141a21393
$$ -221003 -66697 -150237 -219279 33703 179943 309399 -84364 -416355 -41309 53141 -121393
19328B17595a84454a8491k5272a5971p0964j30891L2497n7164f5638F1978c34627
$$ 217595 -184454 -18491 -43763 -15971 -86935 -217826 -185329 -242493 -65638 61978 -334627
19316d63539D1226F663J54951K45667I6706a02366B03416a46526k41547H4431
$$ -463539 41226 6663 161614 407281 96706 -102366 203416 -146526 -388073 84431
19305i5034n3222E6383b90624A66832J5858F5803j691A8469a85817A86726b31936
$$ -95034 -148256 56383 -290624 166832 182690 65803 64112 18469 -185817 186726 -231936
19293a36556l3477L7294G4188a32483n9425j9838o9387e216I7615K92260j65184
$$ -136556 -170033 -132739 74188 -132483 -191908 -211746 -281133 -5216 97615 389875 224691
19282B24691H8655N1786E004L468b83632a14175I4950a27143j34792J07526a5628
$$ 224691 88655 140441 5004 8472 -283632 -114175 94950 -127143 -261935 -154409 -15628
19270A05390l737a04978j86316A3712f3880a3025j85925B46142b91437C2617a22776
$$ 105390 101653 -104978 -291294 13712 -63880 -13025 -198950 246142 -291437 32617 -122776
19258A1441h6388A39469a32581A23849b88676D0284h138E52460A7613b97195f8827
$$ 11441 -86388 139469 -132581 123849 -288676 40284 -8138 552460 17613 -297195 -68827
19246c79406A39884D5274D639a49966b737j27944j61542C4512c16202D130a91046
$$ -379406 139884 45274 4639 -149966 -2737 -130681 -292223 34512 -316202 4130 -191046
19234a67610A09699B9943a74857o1457B44013c6953j41907N7013p1928q0680M7042
$$ -167610 109699 29943 -174857 -236314 244013 -36953 -178860 -121847 -193775 -274455 -227413
19223b27413d0849d435o4872A31442a29082A53270g2166A07208b65918a17037
$$ -227413 -40849 -4435 -69307 131442 -129082 153270 -72166 107208 -265918 -117037
19212g9217D2395d19333A9536g005A04627a21265A40243D0716O1424a35303A25830
$$ -79217 42395 -419333 19536 -7005 104627 -121265 140243 40716 102140 -135303 125830
19200a20644k27825G0174a86701f7924D1606K81905b1728A09875a43804b7262
$$ -120644 -348469 70174 -186701 -67924 41606 323511 -21728 109875 -143804 -27262
19189f4531l11675D848c47832B19070c5167F5726b16705E0421k4479b73127b2449
$$ -64531 -376206 4848 -347832 219070 -35167 65726 -216705 50421 25942 -273127 -22449
19177f5250q2494j61518a23195m22263c7605I6821l0360c5362j40747N5372B4221
$$ -65250 -147744 -309262 -123195 -545458 -37605 96821 66461 -35362 -176109 -120737 24221
19165c35536A61953a8692L83k06845e8632j16588B819f2163l92540b27155b6990
$$ -335536 161953 -18692 -18309 -225154 -58632 -175220 2819 -62163 -454703 -227155 -26990
19153A2490M69218d08224A18603l9766J38483E3084J25607H8596f8679j96597
$$ 12490 481708 -408224 118603 78837 217320 53084 178691 88596 -68679 -265276
19143b65276i0582B4155J85025e7900k12070J12469j56585D3463G973a750j96506
$$ -265276 -90582 24155 209180 -57900 -269970 -157501 -314086 43463 7973 -1750 -198256
19132a98256j10070K2533m922b9833A352a08066A73531a76349j73558C20032c25100
$$ -198256 -308326 -285793 -290715 -29833 1352 -108066 173531 -176349 -349907 320032 -325100
19120i6703B72823a75696d6210j44805H4421b40582c9140d250k14457A90055a75196
$$ -96703 272823 -175696 -46210 -191015 84421 -240582 -39140 -4250 -218707 190055 -175196
19108b23426A64235G4174R6381a6406j08924B140i6626j02922A40245c17782P1717
$$ -223426 164235 74174 170555 -16406 -125330 2140 -96626 -199548 140245 -317782 -246065
19097b46065b6103C17093a40667k2965A21234a97033j1904b1654E265K21751b09310
$$ -246065 -26103 317093 -140667 -163632 121234 -197033 -208937 -21654 5265 227016 -209310
19085I6420m1815a71275P7667M4652j42410N721n4114P0325B08848c1085A14378
$$ 96420 54605 -171275 -93608 -48956 -191366 -185645 -239759 -169434 208848 -31085 114378
19073e5379k3822n2713A9897R7577A075b1898j5718m27265C7085L7754b16786
$$ -55379 -79201 -131914 19897 117474 1075 -21898 -37616 -464881 37085 74839 -216786
19061D2144d8572C21979b74830d6344H3202b55344a18580A74848G0085b89393
$$ 42144 -48572 321979 -274830 -46344 83202 -255344 -118580 174848 70085 -289393
19050a72028d0085E1724g3908J416A08561Q2986o8370a82239F5683a19875M3415
$$ -172028 -40085 51724 -73908 -72492 108561 191547 123177 -182239 65683 -119875 -76460
19039g6460m5462a1558A98233b53085G6454a01243b0726A27717N9345G0517f736
$$ -76460 -121922 -11558 198233 -253085 76454 -101243 -20726 127717 187062 70517 -6736
19027c60176f8331A70927K0984P9087a55856g4057q6924Q0394A95676B4093J37042
$$ -360176 -68331 170927 191911 270998 -155856 -74057 -160981 -80587 195676 24093 161135
19016A61135D5217a84460L7414j17577A90018b284j86065A95710a63908f5426
$$ 161135 45217 -184460 -147046 -264623 190018 -2284 -188349 195710 -163908 -65426
19005A87158k3339M4184b00776A66976h7154c4297k44175K5241A91890d15200
$$ 187158 163819 208003 -200776 166976 -87154 -34297 -278472 -253231 191890 -415200
18994E5102i2610K0489A66945a54459e4275m5762A71277m8357i1113A89989h599
$$ 55102 -92610 -72121 166945 -154459 -54275 -100037 171277 122920 -91113 189989 -8599
18982i7772E145b2510B51191D1199b5316H2022a87257A21401a49702d3098o4656
$$ -97772 5145 -22510 251191 41199 -25316 82022 -187257 121401 -149702 -43098 -107754
18971a07754B11325h08k69685a23167k8375e644A09563a08558j00597E12851a20402
$$ -107754 211325 -808 -270493 -123167 -151542 -5644 109563 -108558 -209155 512851 -120402
18959I792b1827I553b46473D9375a19266k50896A13146c68308D2087J8556a61445
$$ 9792 -21827 9553 -246473 49375 -119266 -370162 113146 -368308 42087 60643 -161445
18947a93582L295A93100p6861Q8499H4492g7988A10797a93352c6346j52343p7813
$$ -193582 -190287 193100 116239 204738 84492 -77988 110797 -193352 -36346 -188689 -266502
18936b66502E4743c2459A39463a8714C8597c27787A10785b20592h7035B82740
$$ -266502 54743 -32459 139463 -18714 38597 -327787 110785 -220592 -87035 282740
18925I9206a36577o4123A08580a27212k2151H2289c32789D5655a21813n9776k08519
$$ 99206 -136577 -200700 108580 -127212 -149363 82289 -332789 45655 -121813 -181589 -390108
18914c90108J63298b100A8723K7308M1391a39823j05727a22643e830A61054e056
$$ -390108 -226810 -2100 18723 46031 87422 -139823 -245550 -122643 -5830 161054 -5056
18902D53131a59339C0432b46766C02203j06001b1838B5084a54786j06645B02582
$$ 453131 -159339 30432 -246766 302203 196202 -21838 25084 -154786 -261431 202582
18891a57795O4903l1786o7338j10481A72916a083j05430F6241f070r8869C4737
$$ -157795 -92892 -124678 -192016 -302497 172916 -1083 -106513 66241 -6070 -104939 34737
18879b38660P0136L5075j79990m6625J03762A55526A0771c47719J36862D8220
$$ -238660 -168524 -133449 -313439 -360064 -256302 155526 10771 -347719 -210857 48220
18868E1841b02781L1047j52545A07854e06897G9489a62133A99372g611j66152
$$ 51841 -202781 -171734 -324279 107854 -506897 79489 -162133 199372 -7611 -173763
18858a73763G2155d3082a9119I6627D0271b9606B3282o840h9673j5636H9557f7682
$$ -173763 72155 -43082 -19119 96627 40271 -29606 23282 16442 -89673 -105309 89557 -67682
18845A89430i5713H2459a77818A80011H7534a90548B208L8883b20263m981p1513
$$ 189430 -95713 82459 -177818 180011 87534 -190548 2208 41091 -220263 -225244 -296757
18834b96757p8167A22815L45806A09111a37858f4463k27376a14745D5225a74653
$$ -296757 -374924 122815 468621 109111 -137858 -64463 -291839 -114745 45225 -174653
18823A3367a5492E2692L81075b25354J01419B42403P5862i9431A18286A4164b3558
$$ 13367 -15492 52692 433767 -225354 -123935 242403 318265 -99431 118286 14164 -23558
18811C53014p8336a01217C1650K6619a39255E4729a4546l9538j98949B20095a75085
$$ 353014 274678 -101217 31650 58269 -139255 54729 -14546 -54084 -253033 220095 -175085
18799A43757f7692n2554d7q6628K2730B56080A5323a17232N4622A3614d5342F8614
$$ 143757 -67692 -120246 -47 -86675 -63945 256080 15323 -117232 -62610 13614 -45342 68614
18786A94782I0245g3410A31831J67203A8170b6717k64585A98530J87231a85810
$$ 194782 90245 -73410 131831 299034 18170 -26717 -291302 198530 385761 -185810
18775E7694A6418e5841k28297A42901c7609A87428K9425b43277B04321g0330B51706
$$ 57694 16418 -55841 -284138 142901 -37609 187428 216853 -243277 204321 -70330 251706
18763a25446m7016B78499g0333k09235M268C28777C8236h8300m2639k44404b922
$$ -125446 -172462 278499 -70333 -279568 -275300 328777 38236 -88300 -130939 -375343 -2922
18751H3368a02336m9575G6189a85029F0536c03957A42451b78651k26181b39405
$$ 83368 -102336 -151911 76189 -185029 60536 -303957 142451 -278651 -504832 -239405
18740C957b40419a12300E0141h544j61549b3670A94140a90560P0143E1711c0487
$$ 3957 -240419 -112300 50141 -8544 -170093 -23670 194140 -190560 -120417 51711 -30487
18728A28278J65760e5899B36062b7290k37218a04462C6168c51467a67746D2586
$$ 128278 294038 -55899 236062 -27290 -264508 -104462 36168 -351467 -167746 42586
18717a15383q2528F7719p075J68055b93348A24625a26929a5312E6499a53376n6004
$$ -115383 -197911 67719 60644 228699 -293348 124625 -126929 -15312 56499 -153376 -209380
18706b09380e9920j73274k4734a04938p5750M920A07476b13456a7550F0541b55146
$$ -209380 -59920 -233194 -257928 -104938 -180688 -175768 107476 -213456 -17550 60541 -255146
18694D6327c47022J07158A53934b23886P3210k40822A58444i1352A18624l6225
$$ 46327 -347022 -239864 153934 -223886 -150676 -391498 158444 -91352 118624 82399
18684H2399a37065l50960I2254l2838f6650l9777H9485b21578i0866b3671n6119
$$ 82399 -137065 -488025 92254 59416 -66650 -106427 89485 -221578 -90866 -23671 -79790
18673g9790j72294A85231J89934f9170a9797g623n20463C29909A09406c8024l78718
$$ -79790 -252084 185231 375165 -69170 -19797 -7623 -528086 329909 109406 -38024 -416742
18662d16742C12548a1080j77651g2823I4840m0736c32783O5859I5612C0078J67826
$$ -416742 312548 -11080 -188731 -72823 94840 54104 -332783 -266924 95612 30078 197904
18651A97904o9678h4544q7976h6059M2282k56849d6319b344j24190B8331b94384
$$ 197904 128226 -84544 -172520 -86059 -43777 -300626 -46319 -2344 -126534 28331 -294384
18639F05c314j76354j2880a9040l22981B32025c1609a3294A98650J0227d10257
$$ 605 -3314 -179668 -192548 -19040 -342021 232025 -31609 -13294 198650 208877 -410257
18627B76310a04395j8286j50918b663r4019m5596l65143f6359A7931d58020A8789
$$ 276310 -104395 -122681 -273599 -2663 -96682 -142278 -507421 -66359 17931 -458020 18789
18615a82152M6741B06218p1699a40674A08721a46888P0521j85802A53895b51418
$$ -182152 -135411 206218 134519 -140674 108721 -146888 -76367 -262169 153895 -251418
18604a31518N1462c3761k78551I4205C8069K7773a51103e6244o1994c7263j79363
$$ -131518 -80056 -33761 -312312 94205 38069 65842 -151103 -56244 -118238 -37263 -216626
18593b16626h3806r7577q9556A4425b14507h851G8332l0821P0538k3942B9723
$$ -216626 -83806 -181383 -270939 14425 -214507 -8851 78332 47511 118049 94107 29723
18581f4130B30757c1249A45036Q7539a03880M5272k69128F0968a06606A9466L21229
$$ -64130 230757 -31249 145036 232575 -103880 -58608 -327736 60968 -106606 19466 340695
18570C40695d8916k1781A811N0551j2267A9562c15669l2672H7234K8237K13075
$$ 340695 -48916 -70697 1811 52362 40095 19562 -315669 -348341 87234 115471 328546
18559C28546a9245e357I6018E152d94469a08572A39758b78607D7508g2869j5744
$$ 328546 -19245 -5357 96018 5152 -494469 -108572 139758 -278607 47508 -72869 -88613
18548h8613A11235J50181h6619j81604D9801O427b89273M5880E7295L7491a652
$$ -88613 111235 261416 -86619 -268223 49801 56228 -289273 -243393 57295 94786 -1652
18536B05503a10053A70672D016b20212p5527R4192A13362d8710A8746e2291H513
$$ 205503 -110053 170672 4016 -220212 -295739 -201547 113362 -48710 18746 -52291 8513
18524g7799j15031K7736o2387C85700a92470B94110b29424A51811J07797a7826
$$ -77799 -192830 -165094 -227481 385700 -192470 294110 -229424 151811 259608 -17826
18513D1338a06533H121b71641r3797A24360l761a58603A4887J5424j4930J5073
$$ 41338 -106533 8121 -271641 -365438 124360 120599 -158603 14887 30311 15381 30454
18502C0454b45015b0005m2448j0213a6435p3165Q067r3035B58922a7253A67971
$$ 30454 -245015 -20005 -62453 -72666 -16435 -89600 -81533 -174568 258922 -17253 167971
18490b42954i2234C88834a86087E2553B5378g3122p7142A38394J40566b73397
$$ -242954 -92234 388834 -186087 52553 25378 -73122 -150264 138394 278960 -273397
18479b61616F0207M5457c12224F8517Q1125a359r8049F9772i4138A4707J1634
$$ -261616 60207 105664 -312224 68517 149642 -1359 -99408 69772 -94138 14707 26341
18468B6341a87500f944q0954J8069o863B72269e6552B03119a924L73F3349a67195
$$ 26341 -187500 -6944 -87898 -69829 -76692 272269 -56552 203119 -1924 -1551 63349 -167195
18455B47521h4194F6875a55765n1632h2740j67436A16932b38130A35671a39488
$$ 247521 -84194 66875 -155765 -207397 -82740 -250176 116932 -238130 135671 -139488
18444b7399A96337I6726d53115H1387a36035p9713e4738B30177E1968b15713b2259
$$ -27399 196337 96726 -453115 81387 -136035 -215748 -54738 230177 51968 -215713 -22259
18432f0056j80462N5080j34883a41220A35506b56313A68087f9102A74681a05389
$$ -60056 -240518 -185438 -320321 -141220 135506 -256313 168087 -69102 174681 -105389
18421a48164A4390P4370M2923b7271k27331B24922b78082E43044A69388a69138
$$ -148164 14390 88760 131683 -27271 -254602 224922 -278082 543044 169388 -169138
18410B67917a07979B98928a71041m3276j56057e2349j45374j09872a53178m4001
$$ 267917 -107979 298928 -171041 -214317 -370374 -52349 -197723 -307595 -153178 -197179
18400a97179k8684Q3996n3171C46670r6525c59616e136k21823b8724B0123J4813
$$ -197179 -225863 -141867 -195038 346670 250145 -359616 -5136 -226959 -28724 20123 34936
18389C4936b79482l4544A43751g8277A86516c06866a24055m9235r2794P4576B8391
$$ 34936 -279482 -314026 143751 -78277 186516 -306866 -124055 -173290 -266084 -191508 28391
18377A7972K16866b7682j00151A03759B2323b27318n3425R5971A74715K83601
$$ 17972 234838 -27682 -127833 103759 22323 -227318 -280743 -184772 174715 458316
18367D58316b41297b9522j87903C2337b79033H2758a87671O0789k8566b3665A8261
$$ 458316 -241297 -29522 -217425 32337 -279033 82758 -187671 -126882 -155448 -23665 18261
18355B55549b18750e9975D6154a68689c5559m41971a42113o643p3168d3449j06395
$$ 255549 -218750 -59975 46154 -168689 -35559 -477530 -142113 -148756 -221924 -43449 -149844
18344a49844k01548a2083A63159K58304c8508I9159a29393B13921a92711e8809
$$ -149844 -351392 -12083 163159 421463 -38508 99159 -129393 213921 -192711 -58809
18333b68071J6249c3058j22684H8729M2435a21979j67592A71997B7627b17840
$$ -268071 -251822 -33058 -155742 88729 131164 -121979 -289571 171997 27627 -217840
18322a86502j91306J32151C40390a25800B94759d60874a58575E594Q3617K26336
$$ -186502 -377808 -245657 340390 -125800 294759 -460874 -158575 5594 89211 315547
18312C15547h5920E0025K2185O5350g0244H66a0527F5623b7087A8413b49254c1680
$$ 315547 -85920 50025 72210 137560 -70244 866 -10527 65623 -27087 18413 -249254 -31680
18299H9368b27278q3344b5769q3630A9949h1728k02293J29502E240Q8996b74068
$$ 89368 -227278 -310622 -25769 -109399 19949 -81728 -284021 -154519 5240 94236 -274068
18287B80828a47109j32565J33690b4539A8971b14278h1386L304A29630P2805a79741
$$ 280828 -147109 -279674 -145984 -24539 18971 -214278 -81386 -78082 129630 202435 -179741
18275D0348P8331E3759a83349d3014j56744J7822Q3755L2907A22318a24945e1920
$$ 40348 118679 53759 -183349 -43014 -199758 -181936 -98181 -65274 122318 -124945 -51920
18263G3549b78311O6041C2713M3512Q438l0851b39470O6983A07269a5268C40450
$$ 73549 -278311 -212270 32713 76225 84663 53812 -239470 -172487 107269 -15268 340450
18251A51312D2536J73350k3756G3473d73539e7227A022a57776k9114c6094j86845
$$ 151312 42536 215886 192130 73473 -473539 -57227 1022 -157776 -186890 -36094 -222939
18240b22939A91154b0528Q772A7605i8996m2160E7605a37813l3284J2810E5963
$$ -222939 191154 -20528 -11756 17605 -98996 -141156 57605 -137813 -171097 -158287 55963
18228I572c6941J7110j48005N9719A2619a13151l1140a9999j45867j16754e4323
$$ 9572 -36941 -19831 -167836 -108117 12619 -113151 -144291 -19999 -165866 -282620 -54323
18216B9158q630c111k19203c96A04515b00749m0851B53579a60312d0274j9590
$$ 29158 20528 -3111 -222314 -396 104515 -200749 -241600 253579 -160312 -40274 -59864
18205e9864q4356B25250r7981a58568j51384a19425A60175J3855a09796j1093
$$ -59864 -144220 225250 127269 -158568 -309952 -119425 160175 174030 -109796 -120889
18195a20889j19118A816b31208d4962k638B85482c04798B23854b00205A79130
$$ -120889 -240007 1816 -231208 -44962 -47600 285482 -304798 223854 -200205 179130
18184A8589Q7270J72176a31289j50977a2618A48408d9276G4287h7118H4939a77075
$$ 18589 105859 278035 -131289 -282266 -12618 148408 -49276 74287 -87118 84939 -177075
18172B52467e19323B17930f2199A90293b10584j9431p726A77737c95703J51882
$$ 252467 -519323 217930 -62199 190293 -210584 -230015 -237741 177737 -395703 -243821
18162b43821B12207C209M4180M6257f1571H1402e4719q631f816G6692R1473a03866
$$ -243821 212207 3209 47389 93646 -61571 81402 -54719 -63350 -6816 76692 168165 -103866
18149A20876b9460C35340D2034m308a30445A70152k2662F1532K28947c53902E2853
$$ 120876 -29460 335340 42034 37726 -130445 170152 147490 61532 290479 -353902 52853
18137b62073L8979j0067I6497A723d3467A26074f0133j35449M141B7002b79114
$$ -262073 -223094 -233161 96497 1723 -43467 126074 -60133 -195582 -191441 27002 -279114
18125h3243L8619j50700g6767j98138j19844a84350O1587A4759a33174B29891
$$ -83243 -44624 -195324 -76767 -274905 -394749 -184350 -122763 14759 -133174 229891
18114d5941k97242f4193B21761a39736C08081a36054K2327N5937a6700j28165
$$ -45941 -343183 -64193 221761 -139736 308081 -136054 -113727 -57790 -16700 -144865
18104a44865B06330b17196f1895D84824e3348j99088A55478N2261a4786j80869
$$ -144865 206330 -217196 -61895 484824 -53348 -252436 155478 207739 -14786 -195655
18094a95655r095B67661n6866r5244a01660d6372I9419B7573R3228J03241j4812
$$ -195655 -204750 267661 210795 115551 -101660 -46372 99419 27573 120801 224042 209230
18083B09230A729c8616j48122A07342B1014C666e3607D9049P5466B93J76764L0654
$$ 209230 1729 -38616 -186738 107342 21014 3666 -53607 49049 124515 293 177057 207711
18071B07711e82657B3593J11669i7991F3385J14722c0603k4399D5631c12232B39046
$$ 207711 -582657 23593 135262 -97991 63385 178107 -30603 -55002 45631 -312232 239046
18059i695L162r2471b8541p7064j55442A56097F9580K16064L00391I2235a47979
$$ -9695 -6533 -99004 -28541 -105605 -261047 156097 69580 285644 586035 92235 -147979
18047A41660c18030E6155b56966c7142q686k7773p1394D7999j6088P0213c35530
$$ 141660 -318030 56155 -256966 -37142 -45828 -73601 -144995 47999 31911 102124 -335530
18035B7191h2824B9564d35987E7121b13041D42525B5094c79855B2776h3633P526
$$ 27191 -82824 29564 -435987 57121 -213041 442525 25094 -379855 22776 -83633 -76107
18024g6107a0124j23116B10917H926a924o3391E9607b94457A70545b15521b0178
$$ -76107 -10124 -133240 210917 8926 -1924 -65315 59607 -294457 170545 -215521 -20178
18012B23642h9431j978A32912b09082B48062O248B0849M8078J2440i1017n162
$$ 223642 -89431 -91409 132912 -209082 248062 254310 20849 68927 81367 -91017 -96179
18001i6179c1385k5804E5580k1609c7223m2100E8457a70721L6845f1554K0399
$$ -96179 -31385 -57189 55580 33971 -37223 -79323 58457 -170721 -133876 -61554 -41155
17990d1155j06131A32702a58343G9266b12770d3682A084a80006O1944d5038r7535
$$ -41155 -147286 132702 -158343 79266 -212770 -43682 1084 -180006 -118062 -45038 -142573
17979a42573f5866B41862D6281a82638j56273B08938d7091k8273B6205b31530
$$ -142573 -65866 241862 46281 -182638 -338911 208938 -47091 -75364 26205 -231530
17968c32111C6267a08290l7882B4964L3020b3697A34787b69927g6845E7204q959
$$ -332111 36267 -108290 -146172 24964 57984 -23697 134787 -269927 -76845 57204 48245
17957D8245b30192D87978c7066j84744B38518a08464F7164O6502L3791M177J95071
$$ 48245 -230192 487978 -37066 -221810 238518 -108464 67164 133666 167457 171634 366705
17946C66705b4082j24916A15178j7758a75431Q5765E9671a01226C68349a48712
$$ 366705 -24082 -148998 115178 97420 -175431 -89666 59671 -101226 368349 -148712
17935a15798A5733a17530B33063C9490b50912B52043D5953P8264B321a57429r1799
$$ -115798 15733 -117530 233063 39490 -250912 252043 45953 124217 2321 -157429 -249228
17924b49228J16719C4234O5792K06677H8766a97379j19554e0674C2356f1535k85238
$$ -249228 -132509 34234 100026 306703 88766 -197379 -316933 -50674 32356 -61535 -346773
17913c46773i4930A03282f185k96010i5509c1477p7741A82228a79228C19382b33530
$$ -346773 -94930 103282 -6185 -302195 -95509 -31477 -109218 182228 -179228 319382 -233530
17901a31068M5745B81720j24721B5708J36892a35464j14985J00320A2048J42618
$$ -131068 -85323 281720 156999 25708 162600 -135464 -250449 -150129 12048 154666
17891A54666b73529g6563j5365K645k32747C2567a02800n9539D7986O7742m1053
$$ 154666 -273529 -76563 -91928 -89283 -322030 32567 -102800 -162339 47986 115728 74675
17880G4675a49071N3984p8062H0735P3442N0837G8061a8723j88338l3328C93309
$$ 74675 -149071 -95087 -173149 80735 154177 205014 78061 -18723 -207061 -240389 393309
17868e6699K4151j63590B737K1134h9250b6349A79517Q0558a15184A92571G7840
$$ -56699 -32548 -196138 2737 23871 -89250 -26349 179517 260075 -115184 192571 77840
17856e8337D17780A67728K1007F1303a77508B79879q7662a42992A19541h4727
$$ -58337 417780 167728 188735 61303 -177508 279879 192217 -142992 119541 -84727
17845c5442n5577A10256K11677D0617R4992j5677a26087A06808P396a18961A75496
$$ -35442 -91019 110256 321933 40617 135609 119932 -126087 106808 114204 -118961 175496
17833A52795l1138a29260B00882L9376D3932c2114o4918c9172B35110a00183j58195
$$ 152795 121657 -129260 200882 240258 43932 -32114 -97032 -39172 235110 -100183 -258378
17822b58378O5360b8982p4738B09070a73518B25879A10752n0987a64450M8040
$$ -258378 -193018 -28982 -103720 209070 -173518 225879 110752 59765 -164450 -116410
17812a16410B3887f6745C4879J34830a48519C9058J42051c89353B66335r3851
$$ -116410 23887 -66745 34879 169709 -148519 39058 181109 -389353 266335 172484
17802A72484b46859A21461a5671I5375J40080b65520F1902L01242j65790Q2194
$$ 172484 -246859 121461 -15671 95375 235455 -265520 61902 363144 197354 279548
17792B79548m5888n1107b82284c3566D657K75428b17060C44126G1661A4434J6339
$$ 279548 233660 182553 -282284 -33566 4657 280085 -217060 344126 71661 14434 30773
17781C0773K81382k7112G8729a31106d3870a3097A71641a2208B48424a7847j39690
$$ 30773 312155 285043 78729 -131106 -43870 -13097 171641 -12208 248424 -17847 -157537
17770a57537G447L5463b25101b7662g64q5799B88607j07826o7579B1061b19020
$$ -157537 7447 42910 -225101 -27662 -764 -86563 288607 180781 113202 21061 -219020
17758f1998A23240L1293a32231q3305B66944C8053J19789a74357F7885F808b79824
$$ -61998 123240 154533 -132231 -215536 266944 38053 157842 -174357 67885 6808 -279824
17746H2357a46292A80989g9668A44384K9842b94255a16329N6017a0819A69412
$$ 82357 -146292 180989 -79668 144384 174226 -294255 -116329 -60312 -10819 169412
17735F8135k3078J11565c7681B29515H9284Q3407a8719D5903J38554c774o5338
$$ 68135 45057 156622 -37681 229515 89284 172691 -18719 45903 184457 -3774 -69112
17724f9112A37696N4714a42476E9005M3055C4361a105j47502E673J92459r7132
$$ -69112 137696 192410 -142476 59005 102060 34361 -1105 -148607 5673 198132 101000
17713A01000J74043b72757j1082H9279a79614C49837e5508b5953k3258R297A36197
$$ 101000 275043 -272757 -283839 89279 -179614 349837 -55508 -25953 -49211 -39914 136197
17701F5859O1051C8483f8205j89061c2535j73722C34140c7542A62436L5652f6486
$$ 65859 126910 38483 -68205 -257266 -32535 -206257 334140 -37542 162436 198088 -66486
17689a99226e8962m5504l55658a96742c1536j702E6640J44604j7684a48866b5423
$$ -199226 -58962 -104466 -460124 -196742 -31536 -33238 56640 201244 183560 -148866 -25423
17677a96666N9212j22259f8828B9350J45790c63466D90005b60836A71736a70957
$$ -196666 -137454 -259713 -68828 29350 175140 -363466 490005 -260836 171736 -170957
17666B7275b36352a0942n5425A63523B8894c3904I1955J12024c37527a12479j26486
$$ 27275 -236352 -10942 -66367 163523 28894 -33904 91955 203979 -337527 -112479 -238965
17655b38965D2143J8318A8799J37795L3366d1398c38j8514B7357J05843k9951
$$ -238965 42143 60461 18799 156594 189960 -41398 -338 -18852 27357 133200 103249
17644A03249B4321g383C5955c8205E9456K17533a46274D93981A98104B2823O0815
$$ 103249 24321 -7383 35955 -38205 59456 276989 -146274 493981 198104 22823 83638
17633H3638K63489b24075J4015D6414c9206A7917a06577A24431m5571k2201B4507
$$ 83638 347127 -224075 -210060 46414 -39206 17917 -106577 124431 78860 56659 24507
17621h1280J6824b2142A91519e05551J0291A71406g1394B18013f6617j12620h6734
$$ -81280 -64456 -22142 191519 -505551 -495260 171406 -71394 218013 -66617 -179237 -86734
17609A40081a443j77222A46295A7600b16837M4158K1371B76135k6931E5375a14250
$$ 140081 -1443 -178665 146295 17600 -216837 -172679 -151308 276135 249204 55375 -114250
17597C5836a42774B2849N1975a1520C699J16453b32090A58843c4284A47155a10886
$$ 35836 -142774 22849 74824 -11520 3699 120152 -232090 158843 -34284 147155 -110886
17585B12756M03153f076B27556C7162O181N3540J16355a65809G4190O2301m1305
$$ 212756 615909 -6076 227556 37162 43343 96883 213238 -165809 74190 136491 95186
17574I5186a29379K3978B61662i7379E4669a17317e5925B87119D2186a8120I6156
$$ 95186 -129379 -105401 261662 -97379 54669 -117317 -55925 287119 42186 -18120 96156
17562a00806E2792K27749g647B42807a98737B4508K96434g7142A24503a25348
$$ -100806 52792 280541 -7647 242807 -198737 24508 320942 -77142 124503 -125348
17551C96062j81935m7664a5294L388A34602a57539C10075a12435c1481C1402K59029
$$ 396062 214127 166463 -15294 -11906 134602 -157539 310075 -112435 -31481 31402 290431
17540B90431r7597G7392f3728A24003E5768a56730B37619J70535H8906A6446J84307
$$ 290431 192834 77392 -63728 124003 55768 -156730 237619 408154 88906 16446 200753
17529B00753G9311C1721b18942A45842F1097J4856a75589B24441a12305m7591
$$ 200753 79311 31721 -218942 145842 61097 75953 -175589 224441 -112305 -159896
17519a59896A10000a10155k83990e5877A92766J25645H2176a05269C29113m9212
$$ -159896 110000 -110155 -394145 -55877 192766 318411 82176 -105269 329113 279901
17509B79901j262A25973c3598A65808K2991a3349B7079P3564C2033K82796b1170
$$ 279901 278639 125973 -33598 165808 188799 -13349 27079 100643 32033 314829 -21170
17497C0758a78512A65075L09810i9226H5470N04804B42629j442p564a38313L9089
$$ 30758 -178512 165075 474885 -99226 85470 590274 242629 241187 233623 -138313 -99224
17486i9224m2332D62346I0555K16143G2480L5423N9981Q2600D7625K47240c00645
$$ -99224 -141556 462346 90555 306698 72480 107903 167884 250484 47625 294865 -300645
17474C26998j02342a5655B12774J23855A67587a88352C14035A45408b0250A06814
$$ 326998 224656 -15655 212774 336629 167587 -188352 314035 145408 -20250 106814
17463A18130a9165j72848A18753E1264J7474O8454d0461A73609H1793K83944a26844
$$ 118130 -19165 -192013 118753 51264 68738 137192 -40461 173609 81793 365737 -126844
17451H3685b0811A65128F4640d4855D17801b22268D02827A1691J93323J1494k9023
$$ 83685 -20811 165128 64640 -44855 417801 -222268 402827 11691 205014 216508 187485
17440A87485q6219L41500j21848c1965C30271A47090a2123F22076a04473B10144
$$ 187485 101266 442766 320918 -31965 330271 147090 -12123 622076 -104473 210144
17429B59532R1884a26628C0631K40770j7308p1793D5253b81249C55340G5783l3756
$$ 259532 351416 -126628 30631 271401 254093 182300 45253 -281249 355340 75783 42027
17418D2027f1776A28360P2874q7613a53391A33311N2871i6810B66172A07638D0425
$$ 42027 -61776 128360 201234 113621 -153391 133311 186182 -96810 266172 107638 40425
17406A72067K87636A71692K93642j94687a8132A36726E0346K03623c0672G6605
$$ 172067 459703 171692 465334 270647 -18132 136726 50346 253969 -30672 76605
17395A87197L5486D3314K31946p2837H1851M848k5539J69155o1486K02334A45427
$$ 187197 222683 43314 275260 202423 81851 86699 61160 230315 168829 371163 145427
17383A72155K68099D8807a5991B38915l7900D9310J62553I6887K0554A7553J7906
$$ 172155 440254 48807 -15991 238915 201015 49310 211863 96887 117441 17553 35459
17372C5459O6244e7229B24408O6506L9942j46846J26489G4117c1130A72159Q5851
$$ 35459 101703 -57229 224408 290914 330856 184010 310499 74117 -31130 172159 258010
17361B58010b4761j42332A88276P3641a53829C9992a17082A13326J03999E2837
$$ 258010 -24761 -167093 188276 261917 -153829 39992 -117082 113326 217325 52837
17350E0141O7724L05288b78074A33378n3721a29706C59387A4962b06169B04024
$$ 50141 117865 423153 -278074 133378 79657 -129706 359387 14962 -206169 204024
17339B23425q4300a3994D02096j19533C5013L62865I2467j6773M5969a73056h0736
$$ 223425 139125 -13994 402096 282563 35013 397878 92467 75694 121663 -173056 -80736
17327a44852I8137A3242K68220n6403J6136M5363F3587J27610d3522l7012A79533
$$ -144852 98137 13242 281462 225059 241195 286558 63587 191197 -43522 -80534 179533
17315D12864A08929J06768k1976q8886D5303b62811C11861j05841Q0479a32240
$$ 412864 108929 215697 193721 104835 45303 -262811 311861 206020 286499 -132240
17304B05383l6382p9930R189J59602j20202e8206A19001K92000j32734A18943
$$ 205383 169001 89071 98260 257862 137660 -58206 119001 411001 278267 118943
17293A52005b1068I5139K15293A07819J39528A9648K72817m1034b38848C69803
$$ 152005 -21068 95139 310432 107819 247347 19648 292465 251431 -238848 369803
17282A06850J59629j18775N2310N4213L9532F5866L3981J77643A12777k7493J84023
$$ 106850 266479 147704 200014 254227 293759 65866 99847 277490 112777 85284 269307
17271B69307J26997b82691A24243n8926b11700B85649L32589B03645N2340A10894
$$ 269307 396304 -282691 124243 65317 -211700 285649 618238 203645 255985 110894
17260E40839B0914J02176C1913L62671j60412L1880j19605N137k0222M40297E8488
$$ 540839 20914 123090 31913 394584 234172 266052 146447 151584 131362 571659 58488
17248A85921M2974o4196K87316a50359B2974J73138F2133a02852C23405N4349
$$ 185921 228895 164699 452015 -150359 22974 196112 62133 -102852 323405 377754
17238C77754A36604J05758C6842M84657F4106K48513j46149L029L36605A55957
$$ 377754 136604 242362 36842 521499 64106 312619 166470 169499 506104 155957
17227C27853a87178c2656F6170J56534K7576a50192d5285D52110Q2890k05792
$$ 327853 -187178 -32656 66170 222704 250280 -150192 -45285 452110 535000 329208
17217C29208A27525P669Q0493j5316F5516J16815E4981L66445b4891A30013M8281
$$ 329208 127525 135194 215687 200371 65516 182331 54981 421426 -24891 130013 178294
17206A78294J43047j3606r4840J17917l6498j28925M05957a04131A81235p8440
$$ 178294 321341 307735 212895 330812 294314 165389 571346 -104131 181235 102795
17196A02795N0580D7486J89556J81662q9826A34200K24101j69811m5866M7841
$$ 102795 153375 47486 237042 418704 328878 134200 358301 188490 142624 190465
17186A90465D1182M51787A54902J25838A01352L63227H8744M8308J54267J61350
$$ 190465 41182 492969 154902 280740 101352 464579 88744 137052 291319 452669
17176D52669q9290j62796l2208L16896J44515A70309J44451o0357o6645O3529
$$ 452669 363379 200583 168375 485271 629786 170309 314760 254403 187758 251287
17166B51287M82457A74354L24465j47623J56809C1540K01458l5474J56884l0512
$$ 251287 733744 174354 498819 351196 508005 31540 232998 197524 354408 323896
17156C23896J12465p5385j51920K90930q1302A46561g6168D07802J4327J13676
$$ 323896 436361 360976 209056 499986 418684 146561 -76168 407802 422129 535805
17146E35805j83358l7077K2857O6581K71641B45451K13685G0718a5693C36245
$$ 535805 352447 315370 338227 404808 676449 245451 459136 70718 -15693 336245
17135A93289I2840K95664j13388Q0867r4159J84969j20315J10603A71654L63184
$$ 193289 92840 388504 275116 355983 261824 446793 326478 437081 171654 534838
17125E34838p0330l4511j15754n6438J63679J31998j52081K2037K11852B96197
$$ 534838 464508 429997 314243 257805 421484 553482 401401 423438 635290 296197
17114B03279M9948J43135r4547J42207O855F9539K09929J72863j37074p6369K84299
$$ 203279 253227 396362 301815 444022 450877 69539 279468 452331 315257 238888 523187
17103E23187k46221J72650l3399J78073j00057j71231j27998l971L59462k7590
$$ 523187 276966 449616 416217 594290 494233 323002 195004 191033 550495 522905
17093E22905N029A90618L56356j90571K29587k11695j01624L29529Q719K15958
$$ 522905 527934 190618 546974 356403 585990 374295 272671 602200 610919 826877
17083H26877C52132K48225O400k88045O761L27222j35358N1722k83073p5024j839
$$ 826877 352132 600357 606757 318712 325473 652695 517337 569059 285986 210962 209123
17072B09123L30383B39874l225L05553A32554K07338M45128B86642M87100B90230
$$ 209123 539506 239874 236649 542202 132554 339892 785020 286642 773742 290230
17061D73046J74069k94212O7807K39389k12j93296j23401N51276C01274N8014
$$ 473046 647115 352903 420710 660099 659887 466591 343190 894466 301274 359288
17051C59288j9804K21312B25037m8068M37095m0949j68843R6586O3702k03052
$$ 359288 339484 560796 225037 176969 614064 573115 404272 500858 564560 361508
17041C61508j2012M6651L86435l45241j8289n4383N7230K98875k95567J95144
$$ 361508 349496 396147 782582 437341 419052 364669 421899 720774 425207 620351
17031F20351J867J7580k12947L05900l61360k9684K00901j00312J42968r8076
$$ 620351 622218 639798 426851 732751 371391 341707 542608 442296 585264 487188
17021D87188J77788l6392J17180l36266K77205j11933k14804L06876P3860J29751
$$ 487188 664976 628584 745764 409498 686703 574770 359966 666842 740702 870453
17011H70453l17858o7244K97615l27514K92291J51952J57083m6655j15125k37488
$$ 870453 552595 485351 782966 455452 747743 899695 1056778 1010123 894998 657510
17001F57510R9922K16822j73241o7497O9904J93715k71026j07122R9094o573K18563
$$ 657510 757432 974254 801013 733516 803420 997135 726109 618987 718081 711508 930071
16990I30071k28855l2423L31796j09376K70840m11963N8622m4789O45595m98967
$$ 930071 701216 668793 1000589 891213 1162053 750090 808712 763923 1409518 910551
16980I10551J84358l37927j09347J36637J24942m3950j78329L47783l7080l42799
$$ 910551 1094909 756982 647635 784272 909214 865264 686935 1034718 997638 654839
16970F54839M12050j18516J08670j86331K7373M0847R728k1481l0586J65164m33504
$$ 654839 1066889 948373 1057043 870712 898085 938932 948660 927179 896593 1061757 628253
16959F28253K34648k46881K66860J23644R1008j08369K24975k4489j74884J49538
$$ 628253 862901 616020 882880 1006524 1097532 989163 1214138 1189649 1014765 1164303
16949A164303J17043k93921r7183J84850j52721K81196j5934N3154j93634K42689
$$ 1164303 1281346 987425 890242 1075092 922371 1203567 1187633 1240787 1047153 1289842
16939A289842m02987J21540K07902R2434r9866j06240K30738r4733j11263K08058
$$ 1289842 886855 1008395 1216297 1308731 1208865 1102625 1333363 1238630 1127367 1335425
16929A335425k38685L05504o7740j52137L9563K01619m9589r1652J61855K69781
$$ 1335425 1096740 1402244 1334504 1182367 1221930 1423549 1373960 1282308 1444163 1713944
16919A713944j53210l79776p4608M86267O9892m74172K24284M8975J27011J59069
$$ 1713944 1560734 1180958 1106350 1592617 1662509 1188337 1412621 1461596 1588607 1747676
16909A747676k12695J1618R6653k8141M13135k43321j15658k3622L12492K4591
$$ 1747676 1534981 1546599 1643252 1615111 2028246 1784925 1669267 1645645 1958137 1982728
16899A982728k58022J155r2544K73182l9072K04468j41896k18469J36521p5948
$$ 1982728 1724706 1725861 1633317 1906499 1867427 2071895 1929999 1711530 1848051 1772103
16889A772103M42217m42114M68546L2215j74115k30903J36404L14766o4542k33002
$$ 1772103 2214320 1772206 2240752 2272967 2098852 1867949 2004353 2319119 2254577 2021575
16879B021575K45568J39010m7329k45936K93773l17562K50399K31437k23258j41537
$$ 2021575 2267143 2406153 2358824 2112888 2406661 2089099 2339498 2570935 2347677 2206140
16869B206140L73517P875L7354k6112N9553k3384L31383O5549J4156k16288J38814
$$ 2206140 2579657 2587532 2624886 2598774 2658327 2634943 2966326 3031875 3046031 2829743 2968557
16858B968557Q2338J58496j38135J94184K5510k04774J11314K47120l34979K24413
$$ 2968557 3050895 3209391 3071256 3265440 3290950 3086176 3197490 3444610 3109631 3334044
16848C334044m7191K08549m0853N4732M61542k17856p8086K62588K01530m16103
$$ 3334044 3286853 3495402 3454549 3509281 3970823 3752967 3674881 3937469 4138999 3722896
16838C722896L31790J82457p53j60843K83303J2384J3987r6009P0123O51880n57380
$$ 3722896 4054686 4237143 4236390 4075547 4358850 4371234 4385221 4289212 4359335 5011215 4453835
16827D453835N03442m23459N60476r0284M19553k48386M86047J47560l9543J16095
$$ 4453835 4957277 4533818 5094294 5004010 5423563 5175177 5661224 5808784 5769241 5885336
16817E885336p716J64276j51207K33543M82377k21286L55964M6329K44290j36732
$$ 5885336 5877620 6041896 5890689 6124232 6606609 6385323 6741287 6787616 7031906 6895174
16807F895174J90614J61967K91308M8489J12376M72734J54540J24137K72173Q8273
$$ 6895174 7085788 7247755 7539063 7587552 7699928 8172662 8327202 8451339 8723512 8811785
16797H811785N13199j97815L70064J24164J56769L57772N16922j373L12495L65372
$$ 8811785 9324984 9127169 9497233 9621397 9778166 10135938 10652860 10651487 10963982 11329354
16787A1329354K89337K82025O50642J4484L47008L12332J56759O15911N44959
$$ 11329354 11618691 11900716 12551358 12565842 12912850 13225182 13381941 13997852 14542811
16778A4542811O91986L97989M01013L44240N70860P68617K26106R48126N44948
$$ 14542811 15234797 15632786 16033799 16378039 16948899 17717516 17943622 18891748 19436696
16769A9436696O92216R50020L62821O47280J202706N95888J204864P83067Q60213
$$ 19436696 20128912 21078932 21441753 22089033 23291739 23887627 25092491 25875558 26735771
16760B6735771J118416J374061J341725J260464J123265J576930J320072J660834
$$ 26735771 27854187 29228248 30569973 31830437 32953702 34530632 35850704 37511538
16752C7511538J751972J732921J737577J985890K847402K063828K362981K949047
$$ 37511538 39263510 40996431 42734008 44719898 47567300 49631128 51994109 54943156
16744E4943156K777055L209630L487478L078871L706274L941229M326637M531251
$$ 54943156 57720211 60929841 64417319 67496190 71202464 75143693 79470330 84001581
16736H4001581M807981M906920N391080N532264O205403O470659O268213O545781
$$ 84001581 88809562 93716482 99107562 104639826 110845229 117315888 123584101 130129882
16728A30129882P029013P013880P133631O803853O618814O474002N744446N572933
$$ 130129882 137158895 144172775 151306406 158110259 164729073 171203075 176947521 182520454
16720A82520454L773321L630682K587666J051415l44297j189236k473617l750925
$$ 182520454 186293775 189924457 192512123 193563538 193219241 192030005 189556388 185805463
16712A85805463m729391n250362o399471o353555p185891p492085p486917o724530
$$ 185805463 181076072 175825710 169426239 163072684 155886793 148394708 140907791 134183261
16704A34183261o976340p180760o652943o141484o267708o119876m805272n547764
$$ 134183261 127206921 120026161 113373218 107231734 100964026 94844150 90038878 84491114
16696H4491114m758595m058397m298319l926723l751427l222552l105928l017563
$$ 84491114 79732519 75674122 71375803 67449080 63697653 60475101 57369173 54351610
16688E4351610k636784k980662k332387k086989k433149j724200j869182j837284
$$ 54351610 51714826 48734164 46401777 44314788 41881639 40157439 38288257 36450973
16680C6450973j403028j508068j677705j274535j443112j304231r60750r51282
$$ 36450973 35047945 33539877 31862172 30587637 29144525 27840294 26879544 25928262
16672B5928262j259126q86106j111441n07235p21639q14214q33447o84341l55431
$$ 25928262 24669136 23783030 22671589 22164354 21442715 20628501 19795054 19110713 18755282
16663A8755282j109710k02781r86984l25876m66688l70653n98135m04544n91150
$$ 18755282 17645572 17442791 16455807 16129931 15663243 15292590 14694455 14289911 13698761
16654A3698761m96106k46888m00282j43638k82785n92476m40300k75605j25202
$$ 13698761 13202655 12955767 12555485 12411847 12129062 11536586 11096286 10820681 10695479
16645A0695479j36797l49178m82371J01438p19814k78658L9608J9059n67916Q0791
$$ 10695479 10558682 10209504 9727133 9828571 9108757 8830099 8869707 8888766 8320850 8401641
16635H401641k43098m00400k17325l7208l52411k07194J6496j37741P4611l67278
$$ 8401641 8158543 7758143 7540818 7503610 7151199 6944005 6960501 6822760 6897371 6530093
16625F530093l19136J83533k38595j9179j12602l00749r6023l8176o5952n04217
$$ 6530093 6210957 6394490 6155895 6136716 6024114 5723365 5627342 5589166 5523214 5018997
16615E018997L75418l26391l02878J57442O0864l61640O6508j91836j35256J83651
$$ 5018997 5394415 5068024 4765146 4922588 4983452 4621812 4688320 4496484 4361228 4544879
16605D544879k53332J12081l21949K81005j73695n6291m85097J26987k86089K38623
$$ 4544879 4291547 4403628 4081679 4362684 4188989 4132698 3647601 3774588 3488499 3727122
16595C727122j34212J45408j07047m3469L76440m09059m38884K55157k52274p3329
$$ 3727122 3592910 3738318 3631271 3587802 3964242 3555183 3116299 3371456 3119182 3045853
16585C045853J58687m30649K2242J57596j11404p8538o7561L49420m17314Q0648
$$ 3045853 3204540 2773891 2796133 2953729 2842325 2763787 2696226 3045646 2628332 2708980
16575B708980l43667K67461k17828L20893m10333J59492J300k18223k04547J87563
$$ 2708980 2365313 2632774 2414946 2735839 2325506 2484998 2486298 2268075 2063528 2251091
16565B251091M28938l15975j78905R2540J05659j02913j20498N60519p62047R9520
$$ 2251091 2680029 2364054 2185149 2277689 2383348 2280435 2159937 2720456 1958409 2057929
16555B057929M6524k21137m8275l7954K39115k03906L85316j93044j21721K01870
$$ 2057929 2104453 1883316 1835041 1797087 2036202 1832296 2217612 2024568 1902847 2104717
16545B104717k81793m2643j09878O2369n7367n9109j85176J84985m2121J9044
$$ 2104717 1822924 1780281 1670403 1732772 1675405 1616296 1431120 1616105 1573984 1593028
16535A593028M47037o36884J5416J54359K94447k52898j12990J74944j90440j32077
$$ 1593028 2040065 1403181 1418597 1572956 1867403 1614505 1501515 1676459 1486019 1353942
16525A353942L45891m07806N6489n8206K4031R222M2186k44324K22352L2742l25172
$$ 1353942 1699833 1292027 1348516 1290310 1314341 1323563 1365749 1121425 1343777 1376519 1051347
16514A051347K93720P8258l16814k6322Q3841K6773K3462o7743Q8696P1837k56953
$$ 1051347 1345067 1423325 1106511 1080189 1164030 1190803 1214265 1146522 1235218 1307055 1050102
16503A050102J72506j38534J01202J2093j77324J25405j91888O6026j61261K0435
$$ 1050102 1222608 1084074 1185276 1197369 1020045 1145450 953562 1019588 858327 878762
16493H78762j20722L05389j41778o3237M49868l39430R3568j78532J87859Q9085
$$ 878762 758040 1063429 921651 858414 1308282 968852 1062420 883888 1071747 1160832
16483A160832j19694j16119o9891L55853n31677Q8216K58589k60596O990N75454
$$ 1160832 1041138 925019 855128 1210981 679304 767520 1026109 765513 772503 1347957
16473A347957k23254j03691J59378l52608J36352r1425k36322j08295O0117J86530
$$ 1347957 1124703 1021012 1180390 827782 964134 872709 636387 528092 588209 774739
16463G74739q1989M42200k98170k76022K50886P5605l5724j08095Q2375L5438
$$ 774739 692750 1134950 836780 560758 811644 887249 851525 743430 825805 861243
16453H61243m4788C35170J73149K84316Q4243k88215J13253n0770l6640K1779
$$ 861243 816455 335170 508319 792635 876878 588663 701916 651146 614506 636285
16443F36285P1934J39016B40247O05421j82583Q3664n3989n6138k19786L78348
$$ 636285 708219 847235 240247 845668 663085 746749 692760 636622 416836 795184
16433G95184l8845C76120K32061K0936P9493k14821P4767J36909k02116J7924
$$ 795184 756339 376120 608181 629117 708610 493789 568556 705465 503349 521273
16423E21273B49533N10784k23809J00924m5545j07864K78540B23295N19243R63
$$ 521273 249533 760317 536508 637432 591887 484023 762563 223295 742538 743501
16413G43501l62540J06039n1570Q5722L03493C10210L30785J22923l01910j88411
$$ 743501 380961 487000 435430 521152 824645 310210 640995 763918 462008 273597
16403B73597K68743k07931J82001B50734P1962K11407n9555N4522J39187j3182
$$ 273597 542340 334409 516410 250734 322696 534103 474548 529070 668257 655075
16393F55075J83766l99316Q0461r4480J013N2089K08079k91111j20795J82481
$$ 655075 838841 439525 519986 425506 426519 478608 686687 395576 274781 457262
16383D57262N683d1283F48415k01837p0078M07062k99148J67384p5952q4605o7187
$$ 457262 462945 -41283 648415 446578 376500 783562 484414 651798 575846 491241 424054
16372D24054N996J05880m619B63589K18213B26226J76256M1297j16894J63098
$$ 424054 430050 535930 531311 263589 481802 226226 402482 443779 326885 489983
16362D89983j15120A86125N55789m1746k49053A68259J40680K69445j32613B2928
$$ 489983 374863 186125 741914 700168 451115 168259 308939 578384 445771 22928
16351A50920J683J75403A41271K26021j42907k2807q0685J4250J79765p0783J68140
$$ 150920 152603 328006 141271 367292 224385 201578 120893 135143 314908 244125 412265
16340D12265L74670k50312j01850D1330K88200j661G9504J67509L5221Q1531O267
$$ 412265 786935 536623 434773 41330 329530 327869 79504 247013 282234 363765 370032
16329C70032O8125J03939A14469L24882k03074L47718J6656B69526J10665m914
$$ 370032 438157 542096 114469 439351 236277 583995 600651 269526 380191 375277
16319C75277J59231B38686K90058B43255C3454M6944Q8178L21128j55382k7308
$$ 375277 534508 238686 528744 243255 33454 80398 168576 489704 334322 307014
16309C07014N3072J30303k11795R7051A41248P6777K34192A22722Q0791R7820
$$ 307014 360086 490389 278594 375645 141248 218025 452217 122722 203513 301333
16299C01333j19081K61427j3282g4816I7247K23541p0491O8262p1029J2099h9872
$$ 301333 182252 443679 430397 -74816 97247 320788 250297 318559 247530 259629 -89872
16287A65108J51141j9272C8563K2706M44683c6470G5164k6308d4248C04333b4636
$$ 165108 316249 296977 38563 61269 505952 -36470 75164 48856 -44248 304333 -24636
16275C01705c0453C76503o1070j6317i3514B55007P4268j23012r9384J30671M0020
$$ 301705 -30453 376503 315433 299116 -93514 255007 329275 206263 106879 237550 277570
16264B77570B769M670M07741j97425b535A75028K24229h7346L6001l63178E9530
$$ 277570 2769 7439 415180 217755 -2535 175028 399257 -87346 -51345 -414523 59530
16252a08716C35472E4242a10414D24504A15021L46720M9238C981L18947n5884
$$ -108716 335472 54242 -110414 424504 115021 461741 510979 3981 322928 267044
16242B67044A05037R985E1047K78330j03945J86229j02814K1997P4488a17743
$$ 267044 105037 115022 51047 329377 225432 411661 308847 330844 405332 -117743
16231b68191b3438F43314A66690A1634K01235M21243e40080C36926A0958M88964
$$ -268191 -23438 643314 166690 11634 212869 634112 -540080 336926 10958 499922
16221D99922k41181J1676D3097J9797K4174Q0993l0948F4186L16773j3479A23215
$$ 499922 258741 270417 43097 62894 87068 168061 137113 64186 380959 367480 123215
16209F31185B79268m4951J1923l5154j02338R9049D4744K60006J9263H4544P1133
$$ 631185 279268 234317 246240 211086 108748 207797 44744 304750 324013 84544 155677
16198A55677L4724b48414B89180j02096C2523K34658C9581h3027A0058J03756
$$ 155677 190401 -248414 289180 187084 32523 267181 39581 -83027 10058 113814
16188A13814f4809D01152A95520C6903J45838f3819A11491l2640k8611j3619a42497
$$ 113814 -64809 401152 195520 36903 182741 -63819 111491 78851 50240 36621 -142497
16176B74075D9741O2543Q4363C3995c6819D87811c8458k05583A82087N6139I6120
$$ 274075 49741 112284 196647 33995 -36819 487811 -38458 -244041 182087 238226 96120
16164E5584i7462A08092L8310Q7733F0667N816L6133J11911e9104j11277A92481
$$ 55584 -97462 108092 146402 234135 60667 66483 102616 214527 -59104 -170381 192481
16152I9897K66942o6250j38069a17720D7572J9559b8653P699j10825A5735K58331
$$ 99897 366839 300589 162520 -117720 47572 67131 -28653 -20954 -131779 15735 274066
16141B74066G8123a37850C5404c03834G5319J56983m3955A6453d8221j14507H7696
$$ 274066 78123 -137850 35404 -303834 75319 232302 188347 16453 -48221 -162728 87696
16129D6091K1590a49165l16181G6241k6163J4402J78779A391b16225g181A48823
$$ 46091 67681 -149165 -465346 76241 50078 64480 243259 1391 -216225 -7181 148823
16117a50778k96571e8797j63009h7795A64751b8218D5154P118O3242j1601C9060
$$ -150778 -447349 -58797 -221806 -87795 164751 -28218 45154 52272 115514 103913 39060
16105c1000B9798c4374A70523o1207K4844J84781A22536K51485A71581H5263C88
$$ -31000 29798 -34374 170523 109316 134160 318941 122536 374021 171581 85263 388
16093b45350D59279A48707L3802a52321j06919h127I0626l8502A8547d0517j15311
$$ -245350 459279 148707 182509 -152321 -259240 -8127 90626 52124 18547 -40517 -155828
16082a55828A70549p125a39163B60125G7015b82206A68676a6923F7239A4937a24352
$$ -155828 170549 163424 -139163 260125 77015 -282206 168676 -16923 67239 14937 -124352
16070g4838b5682B2278a03623j89013B6161J15858A0376K11397D7159J37688a28447
$$ -74838 -25682 22278 -103623 -292636 26161 142019 10376 221773 47159 184847 -128447
16058i8152F7696C3731a57608A85290r1929J12498E8914j3122Q2051i9965A08238
$$ -98152 67696 33731 -157608 185290 93361 205859 58914 45792 127843 -99965 108238
16046A68575i32j68530f2776j65113h6955r484k52410A84198K9528b1025B87236
$$ 168575 -932 -169462 -62776 -227889 -86955 -96439 -348849 184198 213726 -21025 287236
16034A08192a24165D5731J55143a61385O7485B49004J4687b1970D3823Q6825i9136
$$ 108192 -124165 45731 200874 -161385 -93900 249004 263691 -21970 43823 130648 -99136
16022D53869i4239C0031d5094D5438f3363j04333k0973B436P1057c08861H4084
$$ 453869 -94239 30031 -45094 45438 -63363 -167696 -188669 2436 73493 -308861 84084
16010A21337L4257a42141i287G9622j5926b12304A78881J15089K03689k01114
$$ 121337 155594 -142141 -9287 79622 63696 -212304 178881 293970 497659 296545
16000B96545a36829c5766E6452k4897H252c72657A27466b69576a11525B51988
$$ 296545 -136829 -35766 56452 31555 8252 -372657 127466 -269576 -111525 251988
15989A0746L42482e0336l5477a1952A88985e4685n3079A1080P3011K22958b23654
$$ 10746 353228 -50336 -85813 -11952 188985 -54685 -107764 11080 84091 307049 -223654
15977B94187E9977A4954J09002b04541A22253a51256G1943b10522e6371A68554
$$ 294187 59977 14954 123956 -204541 122253 -151256 71943 -210522 -56371 168554
15966c16202a49837D1295b73389C7571M7394M03L6578a45925L3115d3083k89163
$$ -316202 -149837 41295 -273389 37571 84965 85368 121946 -145925 -112810 -43083 -332246
15955c32246m8678J23852A03829L4826n3062b95743a45966d2300j14184P0260
$$ -332246 -380924 -257072 103829 138655 85593 -295743 -145966 -42300 -156484 -86224
15945h6224j03715Q3896l0915H1775a2620A99583l8733E9372J19429J3259c80952
$$ -86224 -189939 -106043 -136958 81775 -12620 199583 160850 59372 178801 192060 -380952
15933g4605j70228f7957K274l69124f3685A078M17425B9700J48903a23386d4704
$$ -74605 -244833 -67957 -65683 -434807 -63685 1078 418503 29700 178603 -123386 -44704
15921C41344a29469j43726D9610a44912A9178b52819D5695R3276A0798c47858
$$ 341344 -129469 -273195 49610 -144912 19178 -252819 45695 138971 10798 -347858
15910a02978k0872G6239e9178j66142A43819g8593A814c17271Q1030E1374L1009
$$ -102978 -123850 76239 -59178 -225320 143819 -78593 1814 -317271 -236241 51374 82383
15899H2383Q7134f9630c0978k71403J805A89411a48815d2134j8229K8424j1466
$$ 82383 169517 -69630 -30978 -302381 -300576 189411 -148815 -42134 -60363 -31939 -43405
15888d3405p6679e2598B29506f2357j09121a7935B92459A01273a06549j28055
$$ -43405 -120084 -52598 229506 -62357 -171478 -17935 292459 101273 -106549 -234604
15878b34604j11451F6508a18842A27714l6602C7425a22279E2363b18267A38566
$$ -234604 -346055 66508 -118842 127714 91112 37425 -122279 52363 -218267 138566
15867b67800a02640l8408J5855a2563k79694a4563j24062d409G1470b31205d2064
$$ -267800 -102640 -141048 -125193 -12563 -292257 -14563 -138625 -4409 71470 -231205 -42064
15855B6797O3625K30496a06801k49705F5798P6499M5498g4380A07955e9794k6649
$$ 26797 90422 320918 -106801 -356506 65798 142297 187795 -74380 107955 -59794 -86443
15844h6443B38278a72824A42572e8005j14672D6023M268K30961G5486j2146a13356
$$ -86443 238278 -172824 142572 -58005 -172677 46023 50291 281252 75486 63340 -113356
15832A99863a99393L4515b5832B86465J51453a27296A67447o0041b95376a10865
$$ 199863 -199393 -164878 -25832 286465 437918 -127296 167447 107406 -295376 -110865
15821A75770A8370K30777a50918A37922L6812c1846j10409C8964J5650h9521B08554
$$ 175770 18370 249147 -150918 137922 174734 -31846 -142255 38964 54614 -89521 208554
15809A15262a26666j0448B56719j01961b69813b2001B56934c83291B57600b75220
$$ 115262 -126666 -137114 256719 154758 -269813 -22001 256934 -383291 257600 -275220
15798g4211o4403A03563i7832l4763d9980j14417H4518J04756h8323M3998a1196
$$ -74211 -138614 103563 -97832 -132595 -49980 -164397 84518 189274 -88323 -44325 -11196
15786A51611a31747A85316d80655A74145c40200J52576O9769A33458b40295k25847
$$ 151611 -131747 185316 -480655 174145 -340200 -187624 -117855 133458 -240295 -466142
15776d66142a18762a5745r7412B61916a5093A76902b72955A01003C0813M9333
$$ -466142 -118762 -15745 -113157 261916 -15093 176902 -272955 101003 30813 80146
15766H0146c1013G8436c5188P852k52080B04479G5992b65431F6738P1387K3984
$$ 80146 -31013 78436 -35188 -27336 -279416 204479 75992 -265431 66738 138125 162109
15755A62109n3118i2232l1586A23594c11737H6029d2298o2253E4626a74754A02208
$$ 162109 108991 -92232 -123818 123594 -311737 86029 -42298 -104551 54626 -174754 102208
15743c43725Q2630r9068e0824B07034a09708O236d1226M584m1016j01315J95c8637
$$ -343725 -261095 -360163 -50824 207034 -109708 -103472 -41226 -36642 -77658 -178973 -178778 -38637
15730a74697C10504g2716j93756A10254b38289F1506d6221E1945e09528b7685
$$ -174697 310504 -72716 -266472 110254 -238289 61506 -46221 51945 -509528 -27685
15719d1349E6001g7889j3067k16518M6644E4214J53488e0189D0613o745b35042
$$ -41349 56001 -77889 -90956 -307474 -260830 54214 207702 -50189 40613 33868 -235042
15707d50038A76743A0445K05380a48305k3432d8435n5059C5193N29698c38810
$$ -450038 176743 10445 215825 -148305 -171737 -48435 -103494 35193 564891 -338810
15696A18752i3844A30124a49111k36267F2069a21499j21417J11957m4718j03293
$$ 118752 -93844 130124 -149111 -385378 62069 -121499 -242916 -130959 -175677 -278970
15686b78970E4356a14491B76753M277j25166K9836l4208a19118B15a32888m5757
$$ -278970 54356 -114491 276753 281030 155864 185700 151492 -119118 215 -132888 -178645
15675a78645j06465a02180r8619A09738N8187F3055a62984c3879E0615Q8996a68254
$$ -178645 -285110 -102180 -200799 109738 167925 63055 -162984 -33879 50615 139611 -168254
15663G3919c276A21890b32129l3873I120b3592j24223k7114j46661B09732A02396
$$ 73919 -3276 121890 -232129 -266002 9120 -23592 -147815 -174929 -321590 209732 102396
15651h0676b95j82302F3003a06422G3049j5905j5077d8706A41015F7502J44585
$$ -80676 -295 -182597 63003 -106422 73049 57144 42067 -48706 141015 67502 212087
15640B12087f6787k06009Q5582F6845g3965k04446A89516c93612J39314L6576
$$ 212087 -66787 -272796 -187214 66845 -73965 -278411 189516 -393612 -254298 -217722
15630b17722B4808g4961j19096c5349L259j09215A38552o539m6885f6011A29586
$$ -217722 24808 -74961 -194057 -35349 -32090 -141305 138552 132013 85128 -66011 129586
15618e9162B55h9803k75458B54919b8563F121J31824f3706n2981A05999m7623
$$ -59162 255 -89803 -365261 254919 -28563 6121 137945 -63706 -116687 105999 58376
15607E8376a52450m2025k4384c817n4439R564j39030J0984H5336b27958G2685
$$ 58376 -152450 -194475 -218859 -3817 -58256 -48692 -187722 -176738 85336 -227958 72685
15595g1610p28D5443B618a53197m5232h0476A24916R369O722c4390B89959a62691
$$ -71610 -72338 45443 2618 -153197 -198429 -80476 124916 134285 141007 -34390 289959 -162691
15582a93841N7810d0779k61936a11561D1513a83563j20588f4139j84581a12356
$$ -193841 -136031 -40779 -302715 -111561 41513 -183563 -304151 -64139 -248720 -112356
15571i0707G3107b23583D23746b43261E8305a36592C9820a54581A90384c81410
$$ -90707 73107 -223583 423746 -243261 58305 -136592 39820 -154581 190384 -381410
15560B35729n8865R9126G4309j5032q915c00437a20835M5085k11011N5637G8387
$$ 235729 176864 275990 74309 59277 50362 -300437 -120835 -75750 -286761 -231124 78387
15548a33847A26705b2871j68327B83067C1819M20637e7213N087k66114C3946a53132
$$ -133847 126705 -22871 -191198 283067 31819 452456 -57213 -52126 -318240 33946 -153132
15536a557l05159H0573P0825J20748H0249g4507l5276o7676e2547k9782B3313
$$ -1557 -306716 80573 151398 272146 80249 -74507 -109783 -177459 -52547 -82329 23313
15524E8028a81226a9204e100o2785A62342i2264L1053E0255Q596K57993a3301
$$ 58028 -181226 -19204 -5100 -67885 162342 -92264 -61211 50255 58851 316844 -13301
15512b62839C638d13036G2415i9472b7311c720j40820l1525f557C36366j56214
$$ -262839 3638 -413036 72415 -99472 -27311 -3720 -144540 -176065 -6557 336366 180152
15501A80152c20011A39903m4775a49228A0008f0144b9939L845k25024a03313B75924
$$ 180152 -320011 139903 95128 -149228 10008 -60144 -29939 -26094 -251118 -103313 275924
15489a8128k71805a29803A59613P687N0424f3719j1938C09692g5948a5701C4556
$$ -18128 -289933 -129803 159613 167300 217724 -63719 -75657 309692 -75948 -15701 34556
15477B65828F5677K14061A07521b10492J7117A15028a95281O0627B52327a23519
$$ 265828 65677 279738 107521 -210492 -193375 115028 -195281 -134654 252327 -123519
15466A78998a97294B7982c5143k16345B39720H4238a06203k86846D1143J60880
$$ 178998 -197294 27982 -35143 -251488 239720 84238 -106203 -393049 41143 202023
15456B02023i4545k3249A81963J05877G3437d6807G9451a66348j50515J39605
$$ 202023 -94545 -117794 181963 287840 73437 -46807 79451 -166348 -316863 -177258
15446a77258A48617n4037n57K3294K4443J46410A09293h3953K1009A44075j3630
$$ -177258 148617 94580 94023 117317 141760 288170 109293 -83953 -62944 144075 130445
15435A30445B2147K49150a30140m4027E3964c6688p9373j0209e1631B7184c05753
$$ 130445 22147 271297 -130140 -174167 53964 -36688 -116061 -126270 -51631 27184 -305753
15423A38992i0695k7656n5786b3945B25413A9438N0768k3622a3773A27889a9639
$$ 138992 -90695 -118351 -174137 -23945 225413 19438 70206 46584 -13773 127889 -19639
15411c16535D4628j3916E272P7240C0587P055c33566D4636e2586m0185k81606
$$ -316535 44628 30712 5272 82512 30587 37642 -333566 44636 -52586 -92771 -374377
15400c74377i8832c8829I9961L8715a62343q3891C2441a07596M6190K6074j15851
$$ -374377 -98832 -38829 99961 138676 -162343 -246234 32441 -107596 -61406 -35332 -151183
15389a51183B5172N7972a4805F3261a0153j1376G9735l6696J88599E8812a36886
$$ -151183 25172 83144 -14805 63261 -10153 -21529 79735 43039 231638 58812 -136886
15377D4164J18490g0452F7376J62922B0875b06105Q3104j10652d0106I6748R7948
$$ 44164 162654 -70452 67376 230298 20875 -206105 -123001 -233653 -40106 96748 194696
15366A94696l0597a16780j31356A0200K15511C2307a2154H3177g2346a1194j682
$$ 194696 164099 -116780 -248136 10200 225711 32307 -12154 83177 -72346 -11194 -12876
15355a2876F0832M1699b4032k17871A61064f3480C615J69994L0651c01277f0506
$$ -12876 60832 102531 -24032 -241903 161064 -63480 3615 173609 204260 -301277 -60506
15343b79090q8818B26765J85532A5631O0267a64795b582I4972d1315j46704e6022
$$ -279090 -367908 226765 412297 15631 75898 -164795 -2582 94972 -41315 -188019 -56022
15331b24509R9290B84427I9481K6459b00211h0854F2548c94788f6453A71514a5054
$$ -224509 -125219 284427 99481 125940 -200211 -80854 62548 -394788 -66453 171514 -15054
15319A89194B6390f6054k8009o729B38541D6154a31611M0413m0280I6819M9113
$$ 189194 26390 -66054 -94063 -100792 238541 46154 -131611 -91198 -131478 96819 145932
15308A45932C8299e2061B24813A00678J36527c6339A18024D4624J83306b21338
$$ 145932 38299 -52061 224813 100678 237205 -36339 118024 44624 227930 -221338
15297c54099a65479D1901a54637A69547A5494b23749B22485d56054C24083a63296
$$ -354099 -165479 41901 -154637 169547 15494 -223749 222485 -456054 324083 -163296
15286a81449Q9823m2061I2681i0175B82722a40668e6827A83140c20323B11132
$$ -181449 -91626 -133687 92681 -90175 282722 -140668 -56827 183140 -320323 211132
15275G3923f8205B40107R5103O1494A88521c9485n9557B7215J88694b56993E6426
$$ 73923 -68205 240107 335210 396704 188521 -39485 -99042 27215 215909 -256993 56426
15263b95466g6752C6411R881O9812g8540A33297J00497K0895m3259a4363B04182
$$ -295466 -76752 36411 46292 116104 -78540 133297 233794 254689 211430 -14363 204182
15251A7467P4764K95997M4808J73067L41512J782746o23294L64410l91688H13386
$$ 17467 92231 388228 433036 606103 947615 2730361 2107067 2471477 2079789 813386
15240H3820J81413Q3531b87645A87069k9929R2172E1851K24040H2177g3281p9860
$$ 83820 265233 348764 -287645 187069 157140 249312 51851 275891 82177 -73281 -153141
15229a53141B56669j15290b5751B6929b80980B15459J300q4481k6416d6267F890
$$ -153141 256669 141379 -25751 26929 -280980 215459 216759 132278 105862 -46267 6890
15217c46080D9199a20388g527B05669J17926e2606a1863d336A82179e9567G2712
$$ -346080 49199 -120388 -7527 205669 323595 -52606 -11863 -4336 182179 -59567 72712
15205A87815A340N013K77687j34640F9386J91137B9363K95870j41290a67859e4520
$$ 187815 1340 6353 284040 149400 69386 260523 29363 325233 183943 -167859 -54520
15193a29230m8535D7039J06385d7452A75246O0435H4740J15614p2461i2662a7821
$$ -129230 -177765 47039 153424 -47452 175246 235681 84740 200354 127893 -92662 -17821
15181D3919L0735a68639C07764a3893j49501P8584A05547P3026e0798A25074B3860
$$ 43919 74654 -168639 307764 -13893 -163394 -84810 105547 178573 -50798 125074 23860
15169b13836H7931g3373A47677J92474a9913A70172K7013P7210n7182A04378D2982
$$ -213836 87931 -73373 147677 340151 -19913 170172 197185 274395 217213 104378 42982
15157A01992J03408C1536J49304J55033A22162a11995J9296F7297J9967m2412
$$ 101992 205400 31536 180840 335873 122162 -111995 -92699 67297 87264 44852
15147D4852f968A46600a70161J6648b6642p8068B7845L13918g8386O952B57562
$$ 44852 -6968 146600 -170161 -153513 -26642 -104710 27845 341763 -78386 -71434 257562
15135H3749b11438i389k85317B51615g4221A06535c74040f031C50467j18233j1264
$$ 83749 -211438 -9389 -294706 251615 -74221 106535 -374040 -6031 350467 232234 220970
15124B20970L4801K3668J02758b7785F5297J04183e1970k0398j65002B84068a14000
$$ 220970 255771 279439 382197 -27785 65297 169480 -51970 -72368 -237370 284068 -114000
15112D00324A04172e697A81400j7391G6251L15778j22016J7215m290J07401j64324
$$ 400324 104172 -5697 181400 164009 76251 392029 270013 287228 282938 390339 226015
15101B26015o8472b52812A32210a93312A30696d67n382A56054J52431f3441B58396
$$ 226015 157543 -252812 132210 -193312 130696 -467 -5849 156054 308485 -63441 258396
15089F4081j0664c8272B87617D8410J30396R863q6126P5446E9883J17871J60109
$$ 64081 53417 -38272 287617 48410 178806 188669 102543 177989 59883 177754 337863
15078C37863b5459I4147J35015E6282L74685h8735C3271J00751o1956L03824K7714
$$ 337863 -25459 94147 229162 56282 430967 -88735 33271 134022 72066 375890 403604
15067D03604A68710C7542L921K40761J68985A77575K42418A02501a06739G7651
$$ 403604 168710 37542 41463 282224 451209 177575 419993 102501 -106739 77651
15056G9071K59728l8795a55176B31148j2357A497M20131A59920R7501J45445A3681
$$ 79071 338799 300004 -155176 231148 218791 1497 421628 159920 257421 402866 13681
15044A46108j3378J6742m1807J75532g2203A34049J42965A38039J75651o1836
$$ 146108 132730 149472 107665 283197 -72203 134049 277014 138039 313690 251854
15034B51854B7607b52565E94179A07347J62401G4592c8357D94934g2969B80927
$$ 251854 27607 -252565 594179 107347 269748 74592 -38357 494934 -72969 280927
15023A97866R2479P1823a69510A13311a06132B20422r4479Q5404a7138r3379C26791
$$ 197866 290345 362168 -169510 113311 -106132 220422 125943 211347 -17138 -110517 326791
15011C18215r8009J02959n5714j14937C7915L48810d0621I7594R5898j4366d3325
$$ 318215 220206 323165 267451 152514 37915 386725 -40621 97594 193492 179126 -43325
14999D03266L4282B0319K10809k983K16708j50262K9831h33E03919G1347L17914
$$ 403266 437548 20319 231128 228145 444853 294591 324422 -833 503919 71347 389261
14988C89261d9785D84742B02941q0132J0355C0032N61669H3182J250N71736G4997
$$ 389261 -49785 484742 202941 122809 133164 30032 591701 83182 84432 656168 74997
14976B89820J78086B0165J4761J25799K39938k1566j73718Q961l0007H5991L65412
$$ 289820 467906 20165 34926 160725 400663 379097 205379 214340 184333 85991 451403
14965D51403j92508f3372C74645j09571j7359h9489B35048K37766A1151J22480
$$ 451403 258895 -63372 374645 265074 247715 -89489 235048 472814 11151 133631
14955A33631L1751K90487A54571J2496J89867d3066B86010C8198L88982A82660
$$ 133631 165382 455869 154571 167067 356934 -43066 286010 38198 427180 182660
14944A93614R3110m2821L6922A30182K34482b14196C91578d7814A05774L65950
$$ 193614 286724 243903 280825 130182 364664 -214196 391578 -47814 105774 471724
14934D71724j76538q2821j02836J69288J88354r8625d2014A98609K39580q0214
$$ 471724 295186 212365 109529 278817 467171 368546 -42014 198609 438189 357975
14924C57975m0760j8793o1103n6635L05519j58768n1257j25263o1668A1123L43984
$$ 357975 317215 298422 237319 180684 486203 327435 276178 150915 89247 11123 355107
14913C55107J1802A41600M26941J6871B45359J83150K26350B25251J78649P7889
$$ 355107 366909 141600 568541 585412 245359 428509 654859 225251 403900 481789
14903D81789E2019J17427K13207J57624j08504J77739j73221L9374J99062r2672
$$ 481789 52019 169446 382653 540277 431773 609512 436291 475665 674727 582055
14893E82055A23730P4739M74075B91968r8278K95588l3254n8890J08457A47991
$$ 582055 123730 198469 672544 291968 193690 489278 456024 397134 505591 147991
14882E34145J4466K1481q2019M2183G8827L33962n2096j05204o0724M14182j50626
$$ 534145 548611 570092 488073 530256 78827 412789 360693 255489 194765 608947 458321
14871D58321j3496J46504j76002M9595B2200L93356J01554k28580r7898P7321
$$ 458321 444825 591329 415327 464922 22200 415556 517110 288530 190632 267953
14861B67953L01484J53750l21553A91165J41235A38166K33628L5472j50940M30976
$$ 267953 569437 723187 401634 191165 332400 138166 371794 407266 256326 687302
14851F87302j94035K33764k82727j84238K27537A78871J72089L13546r3151j61798
$$ 687302 493267 727031 444304 260066 487603 178871 350960 664506 571355 409557
14841D09557j1617M5632k10992K17947l2631A61861J75466O0235J50081A42196
$$ 409557 397940 443572 232580 450527 417896 161861 337327 397562 547643 142196
14830D94510J76083N9533k85165j55006K17808L4981j2923J10247j18484j39231
$$ 494510 670593 730126 444961 289955 507763 542744 529821 640068 521584 382353
14820C82353J80279k05186K95299k71594N49847l70444R4171j85992J31986L67741
$$ 382353 562632 357446 652745 381151 930998 560554 654725 468733 600719 968460
14810I68460D31404K8584j15857K33462n7532j31820j04341K15869J902K91373
$$ 968460 431404 459988 344131 577593 520061 388241 283900 499769 501671 793044
14800G93044j21401m1491k03186L61949k93075q6720L65815j63999A62564N12412
$$ 793044 671643 630152 426966 788915 495840 409120 774935 610936 162564 674976
14790F74976j74508A20516M93043j41449k4876K71892l27790J02031K54894k42972
$$ 674976 500468 120516 613559 472110 447234 719126 391336 493367 748261 505289
14780E05289J78557l10348J08105R6698q5562j7302O07416l00104k81259j22636
$$ 505289 683846 373498 481603 578301 492739 475437 1082853 782749 501490 378854
14770C78854R5903R8477L31208D42300m9272J01807K44741J88738l00191o471
$$ 378854 474757 573234 904442 442300 393028 494835 739576 928314 628123 621652
14760F21652j51779J30319j16441R5666J90615N5018j77340P5335J06698k91716
$$ 621652 469873 600192 483751 579417 770032 825050 647710 723045 829743 538027
14750E38027N6480K62114O1896l10386j65462M02319r4419j45251k3177J36711
$$ 538027 594507 856621 918517 608131 442669 844988 750569 605318 582141 718852
14740G18852j47585L70574M342k67003J12687j18578R4363p1802K43444L29712
$$ 718852 571267 941841 946183 679180 791867 673289 767652 695850 939294 1269006
14730A269006l45179j03956J84973m31630K15186R1419k00766K75765l9009j94698
$$ 1269006 923827 819871 1004844 573214 788400 879819 679053 954818 915809 721111
14720G21111J19392j58533J72467m8566J7807l711L17009k81072l87805J02464
$$ 721111 840503 681970 854437 805871 823678 819967 1136976 855904 468099 570563
14710E70563J23404j3886J60852l9400J72438p8700K39241j58053J02805m03835
$$ 570563 693967 680081 840933 801533 973971 895271 1134512 976459 1079264 675429
14700F75429M63232l0930m82769L18548k16462O08550j72687l67283P4967j1690
$$ 675429 1138661 1107731 624962 943510 727048 1335598 1162911 795628 870595 858905
14690H58905Q6883o4688K35143l60455J62913j9577R06k76247K39105N5551L4723
$$ 858905 945788 881100 1116243 755788 918701 899124 900030 623783 862888 918439 953162
14679I53162L11373l53504Q4601K81600k50521R0102j30269K02562j39763L4998
$$ 953162 1264535 911031 995632 1277232 1026711 1116813 986544 1189106 1049343 1084341
14669A084341l4492K03920l32896p1451p3695J66355M9785q8052K49918N39549
$$ 1084341 1049849 1253769 920873 849422 775727 942082 991867 903815 1153733 1693282
14659A693282l66269k42293j34507L82716P7836k49043k69005M10499j15333m2976
$$ 1693282 1327013 1084720 950213 1332929 1410765 1161722 892717 1303216 1187883 1144907
14649A144907O1312k20958L8598J54492J92603J89372m27906K37025J36496r5771
$$ 1144907 1206219 985261 1023859 1178351 1370954 1560326 1132420 1369445 1505941 1410170
14639A410170j21485J01135m7175k00933L03244l61995K74079K32911l39534K77488
$$ 1410170 1288685 1389820 1342645 1141712 1444956 1082961 1357040 1589951 1250417 1527905
14629A527905j57487j08279l6824K39139J5469j11161q7091M9669L51483k46608
$$ 1527905 1370418 1262139 1225315 1464454 1479923 1368762 1281671 1331340 1682823 1436215
14619A436215M61997l18669j13264j43929r5626K30390L89448m0412j8368O3034
$$ 1436215 1898212 1579543 1466279 1322350 1226724 1457114 1846562 1806150 1787782 1850816
14609A850816n6440p8391j94232M14565k58379L1690j03041J04395j77782M55863
$$ 1850816 1794376 1715985 1521753 1936318 1677939 1709629 1606588 1710983 1533201 1989064
14599A989064j18307J3744j98437K61519j27280J50247j82185r4391j10102M01041
$$ 1989064 1870757 1884501 1686064 1947583 1820303 1970550 1788365 1693974 1583872 1984913
14589A984913j60654L47357l78074N00901k94576k10002K42449j1241K82617k10181
$$ 1984913 1824259 2171616 1793542 2294443 1999867 1789865 2032314 2021073 2303690 2093509
14579B093509L2489j68526O3796L34286n231l5527M6929j67990K85732j59428
$$ 2093509 2125998 1957472 2021268 2355554 2350323 2314796 2361725 2193735 2479467 2320039
14569B320039J77415q8357j8956J68566m861j43779L04176j95586K88310k23936
$$ 2320039 2497454 2409097 2390141 2558707 2553846 2410067 2714243 2518657 2806967 2583031
14559B583031L23542J85075O3983p141M24895J40927J32631N55909Q77062O31638
$$ 2583031 2906573 3091648 3155631 3148490 3573385 3714312 3846943 4402852 5279914 5911552
14549E911552J754802L866944P917795J9471400P261416B2069481A0133085j307936
$$ 5911552 7666354 11533298 19451093 38922493 46183909 22069481 10133085 8825149
14541H825149k172165l219140q02837j20273j28320p24353N43398p7596J74433
$$ 8825149 6652984 3433844 2631007 2510734 2382414 1658061 2201459 2123863 2298296
14532B298296L9705J65297j81185J75196j10725J5797m2867k0887K53882n0469
$$ 2298296 2338001 2503298 2322113 2497309 2386584 2402381 2359514 2338627 2592509 2542040
14522B542040m8805o3637K77257k9392j92355J47341j41297L70724j53726N4144
$$ 2542040 2493235 2429598 2706855 2677463 2485108 2632449 2491152 2861876 2708150 2762294
14512B762294O0089N2982N3776k00962Q0004K37316n8362M5342J86712p7828K44598
$$ 2762294 2822383 2875365 2929141 2728179 2808183 3045499 2987137 3032479 3219191 3141363 3385961
14501C385961J448O801j59860j41969J05251K3849J17577J96237K2916J0110Q6025
$$ 3385961 3387409 3394210 3234350 3092381 3197632 3221481 3339058 3535295 3558211 3568321 3654346
14490C654346o7791L68608o90256N66837j09881J12204J66304k68154K13247j48689
$$ 3654346 3586555 3955163 3264907 3831744 3721863 3834067 4000371 3732217 3945464 3796775
14480C796775L35034N38817n41242K40479k87667K46520P3883M9623j37480J89631
$$ 3796775 4131809 4670626 4129384 4369863 4082196 4328716 4402599 4452222 4314742 4504373
14470D504373j46448J83323j39924R2201K38208j87653o4225K43852M01285l2427
$$ 4504373 4357925 4541248 4401324 4493525 4731733 4544080 4479855 4723707 5124992 5092565
14460E092565k73945j54028K74487M78137n89240N00222N7330K43933J23445k23784
$$ 5092565 4818620 4664592 4939079 5417216 4827976 5328198 5385528 5629461 5752906 5529122
14450E529122J93092n9517J42906M7958J03543j25049M30581k49373K62539J91838
$$ 5529122 5722214 5662697 5805603 5853561 5957104 5832055 6262636 6013263 6275802 6467640
14440F467640k94172N26681k09742J83867k2308Q2690L45997l82718j5568P11589
$$ 6467640 6173468 6700149 6490407 6674274 6651966 6734656 7080653 6697935 6682367 7393956
14430G393956k68844p9267J56736N32032k9838j66165L62660J50591J67839j92241
$$ 7393956 7125112 7045845 7202581 7734613 7704775 7538610 7901270 8051861 8219700 8027459
14420H027459K79603L48760L0215l19680O89811j48597L9721P0556L05230r7288
$$ 8027459 8307062 8655822 8686037 8366357 9056168 8907571 8947292 9017848 9323078 9225790
14410I225790L97017j1068K66556J90423K16490Q3873K5121K17926M39036j05538
$$ 9225790 9622807 9611739 9878295 10068718 10285208 10369081 10394202 10612128 11051164 10945626
14400A0945626K06946J70629K11029J83601j67983N07285L03511K08333J73490
$$ 10945626 11152572 11323201 11534230 11717831 11549848 12057133 12360644 12568977 12742467
14391A2742467M35010k27734N53919J17085J17879J78119M93887M7706N43714
$$ 12742467 13177477 12949743 13503662 13620747 13738626 13916745 14410632 14458338 15002052
14382A5002052J74228N76950M9867J12619K24201N34825K37204K14096M23550
$$ 15002052 15176280 15753230 15803097 15915716 16139917 16674742 16911946 17126042 17549592
14373A7549592L37755M38023n9049R30122K98561P1631K56410P70808N28346L37483
$$ 17549592 17887347 18325370 18266321 19196443 19495004 19566635 19823045 20593853 21122199 21459682
14363B1459682N76802J46981N70501N47130K98289R45187L24091N69874M14305
$$ 21459682 22036484 22183465 22753966 23301096 23599385 24544572 24868663 25438537 25852842
14354B5852842L75199R51331P99684M25990J069007N41077Q41588O54935J108039
$$ 25852842 26228041 27179372 27979056 28405046 29474053 30015130 30856718 31511653 32619692
14345C2619692L79411Q19800R39659Q98178J142133J003542R77156R48514J378246
$$ 32619692 32999103 33818903 34758562 35656740 36798873 37802415 38779571 39728085 41106331
14336D1106331J285316J131930R95583J703567J088473J503420J438330J636452
$$ 41106331 42391647 43523577 44519160 46222727 47311200 48814620 50252950 51889402
14328E1889402J839852J896345J816145J697426K282414K008842K088718K207949
$$ 51889402 53729254 55625599 57441744 59139170 61421584 63430426 65519144 67727093
14320F7727093K713323K153005K835361K695497L063121L140680K947817L574408
$$ 67727093 70440416 72593421 75428782 78124279 81187400 84328080 87275897 90850305
14312I0850305L685864M005540L749258M022438M720514M884183M824028N195803
$$ 90850305 94536169 98541709 102290967 106313405 111033919 115918102 120742130 125937933
14304A25937933N603282O270065O052859O357300O864260P833025P330286Q696589
$$ 125937933 131541215 137811280 143864139 150221439 157085699 164918724 172249010 180945599
14296A80945599Q507423R025147R850506R972704J0892649J1271110J1503212
$$ 180945599 189453022 198478169 208328675 218301379 229194028 240465138 251968350
14289B51968350J2399281J2162628J3400715J3703558J3836094J4458871J4590431
$$ 251968350 264367631 276530259 289930974 303634532 317470626 331929497 346519928
14282C46519928J4556785J4744896J4191037J4127399J3262814J2607389J2076035
$$ 346519928 361076713 375821609 390012646 404140045 417402859 430010248 442086283
14275D42086283J0451473R029300O728569L387311J012090j00220k154940m072410
$$ 442086283 452537756 461567056 468295625 471682936 472695026 472594806 470439866 466367456
14267D66367456l673023o134008r005563j1103951j3098581j4182618j5092830
$$ 466367456 462694433 456560425 447554862 436450911 423352330 409169712 394076882
14260C94076882j5511613j5872104j5623470j5991302j5364574j4747065j4804840
$$ 394076882 378565269 362693165 347069695 331078393 315713819 300966754 286161914
14253B86161914j4020159j1680224j2664777j1893511j1702416j1061042j0711783
$$ 286161914 272141755 260461531 247796754 235903243 224200827 213139785 202428002
14246B02428002r421090r233789q372498q433706p657797p372737o992173o260371
$$ 202428002 193006912 183773123 175400625 166966919 159309122 151936385 144944212 138683841
14238A38683841n963455n589256n387642n410264n014915m561788m205333l231600
$$ 138683841 132720386 127131130 121743488 116333224 111318309 106756521 102551188 99319588
14230I9319588m284772l974068l296580l440707k862615l240370k893135k788344
$$ 99319588 95034816 91060748 87764168 84323461 81460846 78220476 75327341 72538997
14222G2538997k369584k412539k113750k198571k321863j714524j774693j968374
$$ 72538997 70169413 67756874 65643124 63444553 61122690 59408166 57633473 55665099
14214E5665099j530225j360895k133954j113906j883093j626673j160471m91083
$$ 55665099 54134874 52773979 50640025 49526119 47643026 46016353 44855882 44364799
14206D4364799j290557j086804j768745j093021r53974r43920o91008q51605j214289
$$ 44364799 43074242 41987438 40218693 39125672 38171698 37227778 36536770 35685165 34470876
14197C4470876p27261j011708q36425l87590j352961n12772n46373p58327q57328
$$ 34470876 33743615 32731907 31895482 31507892 30154931 29642159 29095786 28337459 27480131
14188B7480131l85175r05634o10417k76083q79315p28320k27187m49299l59385
$$ 27480131 27094956 26189322 25578905 25302822 24423507 23695187 23468000 23018701 22659316
14179B2659316o69859m12613o22094l09014n10372n14381l88529k12379m92298
$$ 22659316 21989457 21576844 20954750 20645736 20135364 19620983 19232454 19020075 18527777
14170A8527777O1061m22667n82767j18213m94290k80981j03611k59387m09423
$$ 18527777 18588838 18166171 17583404 17465191 16970901 16689920 16586309 16326922 15917499
14161A5917499k01174n13601k15485l35388l1548m56824J34210m69981l22407
$$ 15917499 15716325 15202724 14987239 14651851 14620303 14163479 14297689 13827708 13505301
14152A3505301j61353k86428J38195l61654k87368L7031n24500p1614o28217M44002
$$ 13505301 13343948 13057520 13195715 12834061 12546693 12583724 12059224 11987610 11359393 11803395
14142A1803395o89278M4432k86408L4062l40380Q1903j42135l41872o3097k38574
$$ 11803395 11114117 11158549 10872141 10906203 10565823 10647726 10505591 10163719 10100622 9862048
14132I862048K1474j98819K75204n13862l66882j90346K076L02466j34951p68706
$$ 9862048 9883522 9684703 9959907 9446045 9079163 8888817 8890893 9193359 9058408 8289702
14122H289702k10256M14516o8086j12494j31341L314k35859k44898K42612l4411
$$ 8289702 8079446 8493962 8425876 8313382 8182041 8185355 7949496 7704598 7947210 7912799
14112G912799k27352j82949o1331J3941l38146r5334L0361k20556K8481j15199
$$ 7912799 7685447 7502498 7441167 7455108 7116962 7021628 7051989 6831433 6859914 6744715
14102F744715j32466R1326l18247Q4997O9450k77658j08680J64327k44824l55951
$$ 6744715 6612249 6703575 6385328 6470325 6539775 6262117 6153437 6317764 6072940 5716989
14092E716989L01848m34390R6106j36429M1245J81465n1122k47653L10217m05532
$$ 5716989 6018837 5584447 5680553 5544124 5585369 5766834 5715712 5468059 5778276 5372744
14082E372744J26675k35299k94185K29405n17982L71632j329j74089p8427K47085
$$ 5372744 5499419 5264120 4969935 5199340 4681358 5052990 5051661 4877572 4799145 5046230
14072E046230l71700p8312K42500j72369k04996L2490j94645L21418k18562l34236
$$ 5046230 4674530 4596218 4838718 4666349 4461353 4493843 4299198 4620616 4402054 4067818
14062D067818K88347K5031j48551j42801N751K85041J30122o65835J68167m57569
$$ 4067818 4356165 4381196 4232645 4089844 4095595 4380636 4510758 3844923 4013090 3555521
14052C555521K09694p0102n0726K70348j0263p967k25883k90330N01574r4414
$$ 3555521 3765215 3695113 3644387 3914735 3904472 3896505 3670622 3380292 3881866 3787452
14042C787452j47761l4281l3306j21572K42484k93182m0965J17951j28278n6638
$$ 3787452 3639691 3605410 3572104 3450532 3693016 3399834 3358869 3476820 3348542 3291904
14032C291904p1939j2654n3217L59505n28764N81623j66527m9527j63443l70116
$$ 3291904 3219965 3207311 3154094 3513599 2984835 3566458 3399931 3350404 3186961 2816845
14022B816845M23146r5078k50857l6219L01386j87658j75456J96806k54328j64244
$$ 2816845 3239991 3144913 2894056 2857837 3159223 2971565 2796109 2992915 2738587 2574343
14012B574343K96157m65931Q1428Q1651p7193N8092l8373q9664j20264L31907
$$ 2574343 2870500 2404569 2485997 2567648 2490455 2548547 2510174 2420510 2300246 2632153
14002B632153l9645o6424m97427K89992K93559k93512j0994K24740M0228o8755
$$ 2632153 2592508 2526084 2028657 2318649 2612208 2318696 2307702 2532442 2572670 2503915
13992B503915P1557R3725L86586Q63575K391931O652698J7812514J7515898j9870854
$$ 2503915 2575472 2669197 3055783 3919358 6311289 12963987 30776501 48292399 28421545
13983B8421545j4024589n419712k952166j352219k72512m05765k69695j24498
$$ 28421545 14396956 8977244 6025078 4672859 4400347 3994582 3724887 3600389
13975C600389o80779K45580m92044K61168L2713M8725n31539K35553P0867k05578
$$ 3600389 2919610 3165190 2673146 2934314 2967027 3015752 2484213 2719766 2790633 2585055
13965B585055J62986n25683L07005k02501q720j37580J93465j32087j06439R5161
$$ 2585055 2748041 2222358 2529363 2326862 2318142 2180562 2374027 2241940 2135501 2230662
13955B230662k67903J19975M81952l63349j25160k07090K31478L541P673J3863
$$ 2230662 1962759 2082734 2564686 2201337 2076177 1869087 2100565 2104106 2111779 2125642
13945B125642m06608J27654M4859P6802J04682k36678o0895J52274l4000J32967
$$ 2125642 1719034 1846688 1891547 1968349 2073031 1836353 1775458 1927732 1893732 2026699
13935B026699o9693r5636K05021p7216o26150N49564n09873J35902Q9931L25356
$$ 2026699 1957006 1861370 2066391 1989175 1363025 1912589 1402716 1538618 1628549 1953905
13925A953905n19299K55265j96239N73193q1460m76710L39779l56867K38825l30304
$$ 1953905 1434606 1689871 1493632 2066825 1985365 1508655 1848434 1491567 1730392 1400088
13915A400088L72788m73916J53154L02574k7626j76799J2580j07555M8678j09367
$$ 1400088 1772876 1298960 1452114 1754688 1727062 1550263 1562843 1455288 1503966 1394599
13905A394599k2636K31046R3949M0698l94467J61439L69872m13467j84387N38606
$$ 1394599 1371963 1603009 1696958 1737656 1343189 1504628 1874500 1461033 1276646 1815252
13895A815252p25437J26131J33757R6978k68301L62182j12142K21035l86718Q4879
$$ 1815252 1089815 1215946 1349703 1446681 1178380 1540562 1428420 1649455 1262737 1347616
13885A347616o2099q1970l2989L24048K411k84737M2123J72317l69009r3824J93857
$$ 1347616 1285517 1203547 1170558 1494606 1497017 1212280 1254403 1426720 1057711 963887 1157744
13874A157744K17803k68853P40681n43232q1804Q1111o0074k36475J74630J16308
$$ 1157744 1375547 1106694 1847375 1304143 1222339 1303450 1243376 1006901 1181531 1297839
13864A297839n0688j48598p3907L38126n8226l06557J03832K07019m09168k08845
$$ 1297839 1247151 1098553 1024646 1362772 1304546 997989 1101821 1308840 899672 690827
13854F90827Q46202m48078J67381l9143k53956J84202j2061m05907O3479M56605
$$ 690827 1537029 1088951 1256332 1217189 963233 1147435 1135374 729467 792946 1249551
13844A249551J25098l91284K41431j09763l12118L06535j22010N87916l35427
$$ 1249551 1374649 983365 1224796 1115033 802915 1109450 987440 1575356 1239929
13835A239929j81367J11622k46946J19260j06837M33599k45056P2696l09723j1453
$$ 1239929 1058562 1170184 923238 1042498 935661 1369260 1124204 1196900 887177 875724
13825H75724K48313K9810p1260j30951J12051K62504n66376J17309J63175J55020
$$ 875724 1124037 1153847 1082587 951636 1063687 1326191 759815 877124 1040299 1195319
13815A195319j01497l66283L24914J41450j76941J31623m78021J37163j20770
$$ 1195319 1093822 727539 1052453 1193903 1016962 1148585 670564 807727 686957
13806F86957K62533L4720j954k93457J93074J03066l5210J8896p2779K06083l34502
$$ 686957 949490 984210 982256 688799 881873 984939 949729 968625 895846 1101929 767427
13795G67427P0666j00169J04740q7985J78425J12520j6072j87790K16129l05626
$$ 767427 838093 737924 842664 754679 933104 1045624 1029552 841762 1057891 752265
13785G52265j35836K21553K08106k83338J20804m04249K77170q223K81357j98133
$$ 752265 616429 837982 1046088 762750 883554 479305 756475 748252 1029609 831476
13775H31476K10109k59333M1327C72768N41442k42161l7708m2801q1864L57714
$$ 831476 1041585 782252 823579 372768 914210 672049 634341 591540 509676 867390
13765H67390k19483N6064C25456N28485j60116K2431J83382l53586Q5437L40786
$$ 867390 647907 703971 325456 853941 693825 716256 899638 546052 631489 972275
13755I72275j77420r84K25980l54670J86951L1452l6767k32879K9086j9362j42099
$$ 972275 794855 793871 1019851 665181 852132 883584 846817 613938 643024 623662 481563
13744D81563J1588r1990K64756B82350L75796K86638k89991j58913K08154o0181
$$ 481563 493151 401161 665917 282350 658146 944784 654793 495880 704034 643853
13734F43853P8941K84892j93804R661m6191n0982k87734K17884J17175p8009m3550
$$ 643853 722794 1007686 813882 823543 777352 726370 438636 656520 773695 695686 652136
13723F52136j54445j00501J15562J81406P2709C70572M00537n2321n0100m2917
$$ 652136 497691 397190 512752 694158 766867 370572 771109 718788 668688 625771
13713F25771j3335k64067J07273J19587N0768J8071j79521o9625K30324m8936
$$ 625771 612436 348369 455642 575229 625997 644068 464547 394922 625246 576310
13703E76310k0665Q829l6816L8126R1461j46515J21843k10186K32653j70116K39629
$$ 576310 555645 564474 527658 565784 657245 510730 632573 422387 655040 484924 724553
13692G24553j72111L27714k5447l07853K00677j16594k65284K46251r972j40016
$$ 724553 552442 880156 854709 546856 747533 630939 365655 611906 601934 461918
13682D61918J76005j13695P535J93540j18367j51385M617j14039L20026j39002
$$ 461918 637923 524228 531763 725303 606936 455551 460168 346129 666155 527153
13672E27153K06496k67372Q0162n9002K36599k63612N5973J19299k20997K79745
$$ 527153 733649 466277 546439 487437 724036 460424 516397 635696 414699 694444
13662F94444l8630k33938K15365j09555J1408J54741J3062C52752K75353k94220
$$ 694444 655814 421876 637241 527686 539094 693835 706897 352752 628105 333885
13652C33885J07783N04295B58124M14980C01780N9718j18493K64562j1669m130
$$ 333885 441668 945963 258124 673104 301780 361498 243005 507567 495898 491768
13642D91768j57390Q0680J34720M3195k76546q823J60866p8209K4104j34741L42628
$$ 491768 334378 415058 549778 592973 316427 307604 468470 390261 414365 279624 622252
13631F22252q9089q267n1116p7390L0613q6007O0278L51832A94030J23331J88856
$$ 622252 533163 524896 473780 396390 427003 340996 401274 753106 194030 317361 506217
13620E06217j22210j1036j5989L756K04498k41155m6180R8543j18612L56707k50925
$$ 506217 384007 372971 356982 360738 565236 324081 277901 376444 257832 614539 363614
13609C63614M19951j18556A78199N66060o218C31658r0771J67653j27187p747
$$ 363614 783565 665009 178199 744259 738041 331658 240887 408540 281353 273606
13599B73606L72916C02680N0482L17606k63165F4761n48P2843J31029P0568K60501
$$ 273606 646522 302680 353162 670768 407603 64761 64213 137056 268085 338653 599154
13588E99154j59445j26892j0099J54838M4031N3188C3074N3974K01164J95355
$$ 599154 439709 312817 302718 457556 501587 554775 33074 87048 288212 483567
13578D83567j0258j33316K46022j77499A72281K88512m8153J75470j31342J0322
$$ 483567 473309 339993 586015 408516 172281 460793 412640 588110 456768 467090
13568D67090j31917A30748N0076K48242J18054B55525Q3634k6869a15437E06534
$$ 467090 335173 130748 180824 429066 547120 255525 339159 312290 -115437 506534
13557D23622o1828L27568A79922N74364I7400M92455j25960L15841l11027n9987
$$ 423622 361794 689362 179922 754286 97400 589855 463895 779736 468709 408722
13547D08722j37446I2603N54148B31618H8229J94451l9709J69411p5658b8925
$$ 408722 271276 92603 646751 231618 88229 282680 242971 412382 336724 -28925
13536B35209N420K80942j76968J03487A90896K20094A63419M19540j40490K1238
$$ 235209 240629 521571 344603 448090 190896 410990 163419 582959 442469 463707
13526D63707j16157l9921L37787k27862k05911J8917K57816j80085J15036J23131
$$ 463707 347550 307629 645416 417554 211643 230560 488376 308291 423327 546458
13516E46458j81557A13921P041J55006O9253l4443A39416K53477A70604F4721
$$ 546458 364901 113921 120962 275968 345221 310778 139416 392893 170604 64721
13505C16404K04317p7515A51256K18672J5230J1940p566j0348J41714m692L5442
$$ 316404 520721 443206 151256 369928 385158 397098 389532 379184 520898 516206 551648
13494E51648j49411A69285K72687F7725M04808k31299J73613A31905N84869k22500
$$ 551648 402237 169285 441972 67725 472533 241234 414847 131905 716774 494274
13484D94274k17191J61348A97284b4937F63287k67923J05980A47059n1333f3968
$$ 494274 277083 438431 197284 -24937 663287 395364 501344 147059 95726 -63968
13473D48727m9911P5299C3319K76212D2942K92841E5627K2196L44649j2311A29962
$$ 448727 398816 474115 33319 309531 42942 335783 55627 77823 422472 410161 129962
13461a19596A31299N692n0483a3371A4522M50406j93758J8175L4421r3490r9635
$$ -119596 131299 136991 86508 -13371 14522 464928 271170 289345 323766 230276 130641
13450A30641K3019a12638C60230j56054J46389A74073m8213a1876A82762j3355
$$ 130641 153660 -112638 360230 204176 350565 174073 125860 -11876 182762 169407
13440A69407o1400P2176K8989h564B66826j3057i8360A90884J7456R9827R2523
$$ 169407 108007 180183 209172 -8564 266826 253769 -98360 190884 208340 308167 400690
13429D00690I9616J01871L7922J07628b27819G301a9874B29833R6041j46567d2487
$$ 400690 99616 201487 239409 347037 -227819 7301 -19874 229833 325874 179307 -42487
13417B30557G4618R8803M9350N1975c117C21124a63709E30064A04698K89309g7704
$$ 230557 74618 173421 222771 274746 -3117 321124 -163709 530064 104698 394007 -77704
13405A58209K18562G7365K86579N7286j27598M3001a959C56391j72102K89839
$$ 158209 376771 77365 363944 421230 293632 336633 -1959 356391 184289 474128
13395D74128j12279h993B03886k4684O0034J55453a67071H8754J43940J46857
$$ 474128 361849 -8993 203886 179202 239236 394689 -167071 88754 232694 379551
13385C79551j8175a407C77451J68154j45052G0764A2313D88N03032C9204K71163
$$ 379551 361376 -1407 377451 545605 400553 70764 12313 488 503520 39204 310367
13374C10367j2711J77399B24503P0233L04359B61028n5309I8085K03944N0193
$$ 310367 297656 475055 224503 294736 599095 261028 205719 98085 302029 352222
13364C52222M3439A70936q3698m236L19413A94883M53719d1332J795A74602P9630
$$ 352222 395661 170936 87238 83002 402415 194883 648602 -41332 -39537 174602 254232
13353B54232b02000C4874O8146E0796a17243C73028A44124m0929Q0570K06189
$$ 254232 -202000 34874 103020 50796 -117243 373028 144124 103195 183765 389954
13343C89954j7922J48542E4522R7711K75751j29097Q4554A22658J42597J22296
$$ 389954 372032 520574 54522 152233 427984 298887 383441 122658 265255 387551
13333C87551E6821e9220B20263J7157K45377A46540J08087j2771J01189p6711
$$ 387551 56821 -59220 220263 237420 482797 146540 254627 241856 343045 266334
13323B66334J9127h0549A23638i301B60445K11862a16024A57372M5286J30152
$$ 266334 285461 -80549 123638 -9301 260445 472307 -116024 157372 202658 332810
13313C32810r3685P5082I5441L55031A12500K83378E808J16284O618J44233A10746
$$ 332810 239125 314207 95441 450472 112500 395878 5808 122092 128710 272943 110746
13301f8278L856b8392D07254b9302D42948B14783l9434B4897J00639J42091I7784
$$ -68278 -64422 -28392 407254 -29302 442948 214783 175349 24897 125536 267627 97784
13289D73336A88501C2963J52940m2659J69574N8017r9337p0478H4276J30023F5159
$$ 473336 188501 32963 185903 143244 312818 370835 271498 201020 84276 214299 65159
13277A71862K19667I1239i6721f468B85657a62530B38796A01479N2493c6001C789
$$ 171862 391529 91239 -96721 -6468 285657 -162530 238796 101479 153972 -36001 3789
13265C55280j01266A16771C0010K23398m7360K15104j36596A41632a52993B42791
$$ 355280 254014 116771 30010 253408 206048 421152 284556 141632 -152993 242791
13254A70516J33012h655A66739L58311e892F4525J11759C9157M3852J05255E1154
$$ 170516 303528 -8655 166739 525050 -5892 64525 176284 39157 83009 188264 51154
13242D44230k00855f8724K5266A13614c4623A59131O1859E5379J17782a90944
$$ 444230 243375 -68724 -43458 113614 -34623 159131 220990 55379 173161 -190944
13231C90411a08151H3400J47125Q9669j42780J43906J2398A16362J14631N8648
$$ 390411 -108151 83400 230525 320194 177414 321320 333718 116362 230993 289641
13221B89641A14251C7053G690L70069C4495K23829m3077b1917L566A74044K01400
$$ 289641 114251 37053 7690 377759 34495 258324 215247 -21917 -18351 174044 375444
13210C75444C314g0107G5793A0340M87827q2640D489P9279d2585B54691n0410
$$ 375444 3314 -70107 75793 10340 498167 415527 4489 83768 -42585 254691 204281
13199B04281J47361r9347l0768j1387K1820d4390B29413J9074A17538N0309a1731
$$ 204281 351642 252295 221527 210140 231960 -44390 229413 248487 117538 167847 -11731
13187B84862m9922a31546A00493d7654B8943R823L3785L18337d9991B70000J51416
$$ 284862 234940 -131546 100493 -47654 28943 38766 72551 390888 -49991 270000 421416
13176D21416j58618A21608B0938K25091h2320B12851I7090o269a19584r0050G9936
$$ 421416 262798 121608 20938 246029 -82320 212851 97090 90821 -119584 -209634 79936
13164C70875A41066e7026C58548F1973A7560J42998h9343B93291A02485D808g2752
$$ 370875 141066 -57026 358548 61973 17560 160558 -89343 293291 102485 4808 -72752
13152a1656C7032J03035a77426C91797a16262C41681j64341a04131H0187O11i116
$$ -11656 37032 140067 -177426 391797 -116262 341681 177340 -104131 80187 80798 -9116
13140I7433i6186n155G2524P0558k5895b9292B2231J00668i2217C0350A3694J66772
$$ 97433 -96186 -101341 72524 143082 117187 -29292 22231 122899 -92217 30350 13694 180466
13128A80466a77214C38368a28747I6933r642J2809f3030J144A82821B8264K02771
$$ 180466 -177214 338368 -128747 96933 87291 100100 -63030 -61886 182821 28264 231035
13117B31035j03949O4357D1555d3268j39372D65884A2500M3293N7113L6366J8905
$$ 231035 127086 191443 41555 -43268 -182640 465884 12500 55793 112906 149272 168177
13106A68177C0696g0200E4947L3970i9307A35915K29471f5161n0229C09072g8443
$$ 168177 30696 -70200 54947 88917 -99307 135915 365386 -65161 -115390 309072 -78443
13094h4532b1661F9331K6601m5774K01592e7611I2763a01948B06450a50787O9557
$$ -84532 -21661 69331 95932 50158 251750 -57611 92763 -101948 206450 -150787 -81230
13083h1230B10382Q5995E4061e0391b59I0759A902a31323e5981A53869b0280B46315
$$ -81230 210382 296377 54061 -50391 -259 90759 1902 -131323 -55981 153869 -20280 246315
13070H759J32248f3877B33479N0324C0883b2962A27923a51017c5660l767B3690
$$ 8759 141007 -63877 233479 283803 30883 -22962 127923 -151017 -35660 -39427 23690
13058g6736o7153M2012D49060c2107F3106A4214i9117E5222a17439d0152J0412
$$ -76736 -143889 -101877 449060 -32107 63106 14214 -99117 55222 -117439 -40152 -29740
13047b9740B91317j25609O690a10727F8845b12477B14160a40511D44334j73040
$$ -29740 291317 165708 172398 -110727 68845 -212477 214160 -140511 444334 271294
13037B71294d5969C68756c7551E9161J27249n8248K01431q2052m9420G8132b46447
$$ 271294 -45969 368756 -37551 59161 186410 128162 329593 247541 198121 78132 -246447
13025A40592d4362E2911R9942a28456C1994a9663A41393a4335A51156A8589J79391
$$ 140592 -44362 52911 152853 -128456 31994 -19663 141393 -14335 151156 18589 197980
13014A97980r1698B283J53944O5198D4954J02070l2602N6314a8940o6499C9263
$$ 197980 106282 2283 156227 221425 44954 147024 114422 170736 -18940 -85439 39263
13002B18090f5847B5743K82855L910a8895C35383H9932J67677p8114H9675K38279
$$ 218090 -65847 25743 308598 312508 -18895 335383 89932 257609 179495 89675 327954
12991C27954C2345J1029R2798n3519d2012A22899d6491j121B12654h2399A09688
$$ 327954 32345 43374 136172 82653 -42012 122899 -46491 -47612 212654 -82399 109688
12979A40568d07703B67552M3187H2200K60328c53715a61867C1640d0299p4448
$$ 140568 -407703 267552 310739 82200 342528 -353715 -161867 31640 -40299 -114747
12969a14747C2725D601L07242j21924B096L5945J20774a729D31231g9502o0502
$$ -114747 32725 4601 311843 189919 2096 38041 158815 -1729 431231 -79502 -140004
12958a40004M6290E9130a98030G5010J57837B5671O0902i6656G4887a60489I8431
$$ -140004 -93714 59130 -198030 75010 232847 25671 86573 -96656 74887 -160489 98431
12946A13841J02098g5703C14346a71236j96627a24087A92008a99450r2067A03136
$$ 113841 215939 -75703 314346 -171236 -367863 -124087 192008 -199450 -291517 103136
12935A42199b86783g8187C41014j04443Q5560e7390A07048b07794N6620A25010
$$ 142199 -286783 -78187 341014 236571 322131 -57390 107048 -207794 -151174 125010
12924A98240J4531I6486C95Q7834a93014A7203R641M575L82371J43089R1574a54558
$$ 198240 212771 96486 395 88229 -193014 17203 26844 31419 413790 556879 648453 -154558
12911i2952c407j22567H4912a38998B25842o8125a33543C60836m5850E7613J29436
$$ -92952 -3407 -125974 84912 -138998 225842 157717 -133543 360836 314986 57613 187049
12900A87049p534d46335a14630N6189D92493F1382R7021M4169G9873a53167K4430
$$ 187049 179515 -446335 -114630 -58441 492493 61382 158403 202572 79873 -153167 -128737
12889a28737I4068J36464R1151A18287H368g6457n0396o6130G8212R5561a98883
$$ -128737 94068 230532 321683 118287 8368 -76457 -126853 -192983 78212 173773 -198883
12877C9235R078J92218H5672j6589b03227m3908p1966A77987J87312A64428i8797
$$ 39235 48313 240531 85672 69083 -203227 -247135 -319101 177987 365299 164428 -98797
12865A90551c7022k12267B33851b57357J27563A0363M0538e5948e432D24705a00970
$$ 190551 -37022 -249289 233851 -257357 -129794 10363 50901 -55948 -5432 424705 -100970
12853A02207N1083R1563N4560I9852a32273B21152i9763D9713a84253A53685J3806
$$ 102207 153290 244853 299413 99852 -132273 221152 -99763 49713 -184253 153685 167491
12842A67491P2180B0522J56817j8712K44328h7780l5903k3458l4401h3022A82246
$$ 167491 239671 20522 177339 158627 402955 -87780 -123683 -147141 -181542 -83022 182246
12830a27645N2208A56950a61179N3363F1207D94K39043G5159a15402j64925A33393
$$ -127645 -75437 156950 -161179 -107816 61207 494 239537 75159 -115402 -280327 133393
12818F1603M6364e4857k982k21559I1925g5368j19085B54786J8255a47095I5609
$$ 61603 107967 -54857 -57839 -279398 91925 -75368 -194453 254786 273041 -147095 95609
12806a18285J8651m1700L5740A16839K40603a11492A63601b137A79335J63516
$$ -118285 -99634 -141334 -105594 116839 357442 -111492 163601 -2137 179335 342851
12796C42851j4848a82097C30436a71008D41212j44917G8109a27071a2451A52218
$$ 342851 328003 -182097 330436 -171008 441212 296295 78109 -127071 -12451 152218
12785a42485A22081h863B01705a4491k9933r1026D24965A01616b32003J06933
$$ -142485 122081 -8863 201705 -14491 -44424 -135450 424965 101616 -232003 -125070
12775a25070A81964b20088D8824h6323A72675Q6648b35668B95860i6825A57552
$$ -125070 181964 -220088 48824 -86323 172675 259323 -235668 295860 -96825 157552
12764b9918B99492j03775a99079D72616I0231e6269m5787D04382d65r3769q7885
$$ -29918 299492 195717 -199079 472616 90231 -56269 -102056 404382 -465 -94234 -182119
12753a82119b2276C01915a95934c939k809A41395M7293r0594M21434A59513C9784
$$ -182119 -22276 301915 -195934 -3939 -6748 141395 188688 98094 519528 159513 39784
12741a16932g563j94897A2221L82595e7168B21969M3786a41668d6555p7931k465
$$ -116932 -7563 -202460 12221 394816 -57168 221969 265755 -141668 -46555 -124486 -126951
12730a26951a2094l0861A50295i6841J9206r994c1472l0768F5758c2308C12015
$$ -126951 -12094 -42955 150295 -96841 -77635 -87629 -31472 -62240 65758 -32308 312015
12718B12213f3674A16569j2425b75706b0374j14104A26560N0279d336j77448M1880
$$ 212213 -63674 116569 104144 -275706 -20374 -134478 126560 176839 -4336 -181784 -139904
12707a39904C6136d5118j4194b6860B86037a41801C1894K9927i2789E7933a2137
$$ -139904 36136 -45118 -59312 -26860 286037 -141801 31894 61821 -92789 57933 -12137
12695A00f6406K7387k91083B4825J59670F7351R1006L3253D6518R0863d9970A35354
$$ 100 -66406 -39019 -330102 24825 184495 67351 158357 191610 46518 137381 -49970 135354
12682B51532B0198L7426b7131F6386a14733d529m7311D40473j23817G3556J88587
$$ 251532 20198 57624 -27131 66386 -114733 -4529 -51840 440473 316656 73556 262143
12671B62143D3775c22269A05186i3456B96296M0326D9919a07167A31625N9250
$$ 262143 43775 -322269 105186 -93456 296296 336622 49919 -107167 131625 190875
12661A90875M5749E9436P5854m5239P5776b7289B29897A1266a3338D470K83962
$$ 190875 236624 59436 135290 90051 165827 -27289 229897 11266 -13338 4470 288432
12650B88432F9035a70890B08337a72717A27395l5843n586L4211d4383A65962J26662
$$ 288432 69035 -170890 208337 -172717 127395 91552 85966 120177 -44383 165962 292624
12639B92624j11341c23867G1568g7161F0221f9105q2525A3802o789a6630A17087
$$ 292624 181283 -323867 71568 -77161 60221 -69105 -151630 13802 7013 -16630 117087
12627C91555A85658J28321A8439J99669I0874K66307e4494A72651G2170J68121
$$ 391555 185658 313979 18439 218108 90874 357181 -54494 172651 72170 240291
12617B40291j14837b49402I7319L61568A6793J55421J47913j26241f57A9024J12947
$$ 240291 125454 -249402 97319 458887 16793 172214 320127 193886 -657 19024 131971
12606A31971a91519B58847H5347P5289i5862A04513M0959J59409p4905Q7490j45945
$$ 131971 -191519 258847 85347 160636 -95862 104513 145472 304881 229976 317466 171521
12595A71521J28472j42667P111k7946E9395M1078f3110A68504b8471R236j66866
$$ 171521 299993 157326 164437 136491 59395 100473 -63110 168504 -28471 -19235 -186101
12584a86101P2917I6783b2132j33222G577J28963J63002F4888b75101N9562E04250
$$ -186101 -113184 96783 -22132 -155354 7577 136540 299542 64888 -275101 -215539 504250
12572b6757F8461b0005m9872B09257q785a30450j28551h2484J7662A16067D7340
$$ -26757 68461 -20005 -69877 209257 200472 -130450 -259001 -82484 -64822 116067 47340
12560I7713b42109D4894c6828D65914E4955L2769a28980D55404k13686f4915A85767
$$ 97713 -242109 44894 -36828 465914 54955 87724 -128980 455404 241718 -64915 185767
12548b8284A34098e926j4646k33731J1240D6408h5151E6860J24851o7181a74486
$$ -28284 134098 -5926 -20572 -254303 -243063 46408 -85151 56860 181711 114530 -174486
12536D2660J20264e7778A01498k6953b1475B7966c2915B41878e9743l5132n8554
$$ 42660 162924 -57778 101498 74545 -21475 27966 -32915 241878 -59743 -94875 -153429
12525a53429p1942b6238A40987B4637p466a90250M2162L8682B60542k2711I8805
$$ -153429 -225371 -26238 140987 24637 17171 -190250 -148088 -109406 260542 237831 98805
12513E01615f0224A83518a13548A98840Q4169A38787o6090i1091K1227m621A08995
$$ 501615 -60224 183518 -113548 198840 283009 138787 72697 -91091 -69864 -74485 108995
12501i9919G2599K07781E184J49819f7134p745a3522C68101C1318L29840b04300
$$ -99919 72599 280380 5184 155003 -67134 -74879 -13522 368101 31318 361158 -204300
12489F0835J1181h1648C6694b45776a091j58889d0522C8579g2645n8599A310J39498
$$ 60835 72016 -81648 36694 -245776 -1091 -159980 -40522 38579 -72645 -131244 1310 140808
12477A40808b03861R0408B12066a17513k28966c6066A69011a04822J7374i251
$$ 140808 -203861 -113453 212066 -117513 -346479 -36066 169011 -104822 -87448 -9251
12466b48195F1571Q1303J12884b7050E2812b83485A76284d1986j60855A28851
$$ -248195 61571 142874 255758 -27050 52812 -283485 176284 -41986 -202841 128851
12455A12271B5871L251e4854E2857N7500c24247a09185d2717A01281Q5007m3636
$$ 112271 25871 29122 -54854 52857 110357 -324247 -109185 -42717 101281 186288 142652
12444A42652c2990r6497M5578M1647n3341b6278H5082h6427G3389c572k59515
$$ 142652 -32990 -129487 -83909 -42262 -95603 -26278 85082 -86427 73389 -3572 -263087
12433b63087m394A02855P1499R9325k917j19220a18307A819K44305D1588a3235
$$ -263087 -267481 102855 174354 273679 270762 151542 -118307 1819 246124 41588 -13235
12421A62439j4434c14227B26753g1460a7940B80410b97292o1659C30085j06444
$$ 162439 148005 -314227 226753 -71460 -17940 280410 -297292 -358951 330085 223641
12411B23641A397c49810e1696j5462i409A947K12147K49199a30272r6008A12004
$$ 223641 1397 -349810 -51696 -67158 -9409 1947 214094 463293 -130272 -226280 112004
12399B62630A20011a47484C10789p7339D9070K82260c20599a5107k27808b3738
$$ 262630 120011 -147484 310789 233450 49070 331330 -320599 -15107 -242915 -23738
12388H060c69615J83673C3061g900k54815A39270a49787K0214M4501A77329J40932
$$ 8060 -369615 -185942 33061 -7900 -262715 139270 -149787 -129573 -85072 177329 318261
12377C18261a07136a8722B38053B8287d6399l77871A37488d3358R960r148p0850
$$ 318261 -107136 -18722 238053 28287 -46399 -424270 137488 -43358 -33398 -42546 -113396
12366a13396j96898A44743E289b087k09338L175A79642J23238A16367a71537q5281
$$ -113396 -310294 144743 5289 -2087 -211425 -208250 179642 302880 116367 -171537 -256818
12355b56818O8784B79814a0539F8902C93J14563K9883O0830b06409H9523h6734
$$ -256818 -188034 279814 -10539 68902 393 114956 144839 205669 -206409 89523 -86734
12343D77692a96971d2675J0534n9426A80019p345K24942h3146C88521h6079j117
$$ 477692 -196971 -42675 -32141 -91567 180019 172674 397616 -83146 388521 -86079 -87196
12332h7196k3437B01773R6743r9835b8340A189J66954a22898B48899a7109j54624
$$ -87196 -110633 201773 298516 198681 -28340 1189 168143 -122898 248899 -17109 -171733
12321a71733j12314J23596O0922D1085M32453d5659E9659J82094C8946J95578
$$ -171733 -284047 -160451 -99529 41085 473538 -45659 59659 241753 38946 234524
12311B34524m0820N6260a28496F1655a15333A0494R725i7099M392q0598C00363
$$ 234524 193704 249964 -128496 61655 -115333 10494 20219 -97099 -92707 -173305 300363
12299a75069d8384F1529b34832g9781b2578C81356f6001k86534A08348m999L1849
$$ -175069 -48384 61529 -234832 -79781 -22578 381356 -66001 -352535 108348 103349 135198
12288A35198a58964e0502j4267A14668a21882j63037A92604K76315f6448F3688
$$ 135198 -158964 -50502 -64769 114668 -121882 -284919 192604 468919 -66448 63688
12277H0885f4540r108G3070b35481B45563j22496C2600b73862C99037a53605M5620
$$ 80885 -64540 -73648 73070 -235481 245563 123067 32600 -273862 399037 -153605 -107985
12266a07985c4019C55548F2247K36971A20460J40506J09399f5898F3987K30056
$$ -107985 -34019 355548 62247 299218 120460 260966 370365 -65898 63987 294043
12256B94043o0875p4893k8317d2530A18648a8164B13853E3782a09837A26046c87627
$$ 294043 233168 158275 129958 -42530 118648 -18164 213853 53782 -109837 126046 -387627
12244c6214B89961A36183R999b17277E6473M82376A41369a67338a350B33848J3004
$$ -36214 289961 136183 146182 -217277 56473 538849 141369 -167338 -1350 233848 246852
12233B46852a99607A75043a7278A3015M0985J06987o6496L29171a2634j22179
$$ 246852 -199607 175043 -17278 13015 54000 160987 94491 423662 -12634 -134813
12223a34813A06614Q8111c0133A21148M52714a57789A00532R5311k0364J08010
$$ -134813 106614 194725 -30133 121148 573862 -157789 100532 195843 175479 283489
12213B83489c5852C03122a70452B1601K33631h0144C93809A26116n44J31066q6257
$$ 283489 -35852 303122 -170452 21601 255232 -80144 393809 126116 125572 256638 170381
12202A70381F4192a41325D8444N4903j7244R3194R8385J16691h8921B42433N0115
$$ 170381 64192 -141325 48444 103347 86103 179297 277682 394373 -88921 242433 292548
12191B92548A6318J7120J09988L12894k12684H1696N005K68642A45928A0779J39845
$$ 292548 16318 33438 143426 456320 243636 81696 86701 355343 145928 10779 150624
12180A50624E4243k3099J00730c33090B13151k3144M322J74140d752B03729I4514
$$ 150624 54243 31144 131874 -333090 213151 190007 194329 368469 -4752 203729 94514
12168B58658J4939B9173K9704J89106F144J85371G9098i5634O87B78205b73152
$$ 258658 273597 29173 58877 247983 6144 191515 79098 -95634 -94947 278205 -273152
12156c10046B2150j0323J90458M5276m8815l9577l8632a7838E7884i2300A18166
$$ -310046 22150 11827 202285 247561 198746 159169 120537 -17838 57884 -92300 118166
12144A64794E3997A7679a47427o2760K1616d5501j45501D5831J65399b22234d9285
$$ 164794 53997 17679 -147427 -210187 -188571 -45501 -191002 45831 211230 -222234 -49285
12132a27667B88331j30562b26683B9355J89752a18549C06850D1778A1382K45070
$$ -127667 288331 157769 -226683 29355 219107 -118549 306850 41778 11382 256452
12122B56452b5135A02769b33319D6820a04326F4859R5634p4582A0694a23067B1381
$$ 256452 -25135 102769 -233319 46820 -104326 64859 160493 85911 10694 -123067 21381
12110B7900c2980k20700J7222A74314F4503J99596e0439k25828B1868a15413j41111
$$ 27900 -32980 -253680 -236458 174314 64503 264099 -50439 -276267 21868 -115413 -256524
12099b56524C2780a07817A35225N640n9620f8593j20801C8684e0742a2502B42548
$$ -256524 32780 -107817 135225 140865 81245 -68593 -189394 38684 -50742 -12502 242548
12087A52730m2026c4689I5797b12947f7669C23551b6177A08037c9998j97347B52645
$$ 152730 110704 -34689 95797 -212947 -67669 323551 -26177 108037 -39998 -237345 252645
12075A03922a21387A8929f896E4476J75281A06708O4460e0239A0021O2243a55502
$$ 103922 -121387 18929 -6896 54476 229757 106708 171168 -50239 10021 72264 -155502
12063i3892l2773m327B76801J213157o24129C04792K54297B16093J48023I8874
$$ -93892 -126665 -130992 276801 1489958 865829 304792 559089 216093 364116 98874
12052A55317R1587D1098K20507r7181J16233C3927a92266F3274a76383F8294h2649
$$ 155317 246904 41098 261605 164424 280657 33927 -192266 63274 -176383 68294 -82649
12040f3810C76908j62437b22306j11178F336f5254r2778j4355C69182a6839r7420
$$ -63810 376908 214471 -222306 -333484 6336 -65254 -158032 -172387 369182 -16839 -114259
12029a14259A10765K8436K16341a77113E3275b25806i0589A9898N15909a65997
$$ -114259 110765 139201 355542 -177113 53275 -225806 -90589 19898 535807 -165997
12018A678J74245o8841a21794l2844k8296L3428B32739d9283j4531B23592f0157
$$ 1678 175923 107082 -121794 -154638 -182934 -149506 232739 -49283 -63814 223592 -60157
12006E3481a95093K863B26932E5480R0867I04J9611L2784b50563J01455B45567
$$ 53481 -195093 -192230 226932 55480 146347 904 20515 53299 -250563 -149108 245567
11994B0649K05431j01877b88674I3235b1447j39867d2841e795k65689e0454B16907
$$ 20649 226080 124203 -288674 93235 -21447 -161314 -42841 -5795 -271484 -50454 216907
11982B2945e1462D6898i6230J6477j37988e1478a4791k28851g3060A16921h4365
$$ 22945 -51462 46898 -96230 -79753 -217741 -51478 -14791 -243642 -73060 116921 -84365
11970g6810k35177a8611A60392b18713B09020H4091l9257A7190K65514a08930
$$ -76810 -311987 -18611 160392 -218713 209020 84091 44834 17190 282704 -108930
11959b43565A91332G9387K9959J60640C6941A8009J25089a28473A8910a52675
$$ -243565 191332 79387 109346 269986 36941 18009 143098 -128473 18910 -152675
11948d4296A98240g3811c217m280A39498a85348B8109d01228A26442m3776a48394
$$ -44296 198240 -73811 -3217 -7497 139498 -185348 28109 -401228 126442 82666 -148394
11936A525K14906n1268a05784c4156J017j04804C9890N1254g4695m7936L6863
$$ 1525 216431 165163 -105784 -34156 -33139 -137943 39890 91144 -74695 -122631 -85768
11925h5768C6288h5526G8944a79280G1345a10739A08046h968F1279a83115G2809
$$ -85768 36288 -85526 78944 -179280 71345 -110739 108046 -8968 61279 -183115 72809
11913C76055A59347N733M9155c235A77051b48684B9924K44203b39489m6172G4842
$$ 376055 159347 165080 214235 -3235 177051 -248684 29924 274127 -239489 -285661 74842
11901b08626E5654a41099O2901B87863H361f7854l7397a99j60855I1920i9587
$$ -208626 55654 -141099 -78198 287863 8361 -67854 -105251 -199 -161054 91920 -99587
11889a09794b6229j50005d8194k93262f0953B28082A3980a20426o6819e9367j29420
$$ -109794 -26229 -176234 -48194 -341456 -60953 228082 13980 -120426 -187245 -59367 -188787
11878a88787r753A51098C8544J82436b7555j02101N5200C2627L39840j13766a11166
$$ -188787 -198540 151098 38544 220980 -27555 -129656 -74456 32627 372467 258701 -111166
11866D730L08903B1918K44180a58135E0092M1188a89191b357j67765m747j03356
$$ 4730 313633 21918 266098 -158135 50092 91280 -189191 -2357 -170122 -174869 -278225
11855b78225h4324j3359B0936J81989a45961B00172K4782d6552A79545a81818
$$ -278225 -84324 -97683 20936 202925 -145961 200172 224954 -46552 179545 -181818
11844e9016m3235d4977B24648H4232P1185b82681R3677C13224b58600a27129B5211
$$ -59016 -102251 -44977 224648 84232 155417 -282681 -189004 313224 -258600 -127129 25211
11832g6499j19904b8001q5267H8495a97508h1657o9099C30398g1825q211a1158
$$ -76499 -196403 -28001 -113268 88495 -197508 -81657 -150756 330398 -71825 -80036 -11158
11820f480j55593b1263D6436K8090e6140A60833a0154D8919a37411L909k09271
$$ -6480 -162073 -21263 46436 74526 -56140 160833 -10154 48919 -137411 -133502 -342773
11809c42773J33082J0889b7139J002B14016b43861l6721A70478b68936D19108
$$ -342773 -209691 -198802 -27139 -26137 214016 -243861 -280582 170478 -268936 419108
11798b5863j00975M620b2217l69294B9405Q3334a64786a2879B02482n9378J3893
$$ -25863 -126838 -122218 -22217 -391511 29405 112739 -164786 -12879 202482 143104 156997
11787A56997C4625c4142A91278a50183I6648a05322j90A86725b09649B63128j13746
$$ 156997 34625 -34142 191278 -150183 96648 -105322 -105512 186725 -209649 263128 149382
11776A49382E5397b00823c8468A3406i0915q0773D7313e2750A43828K228a98496
$$ 149382 55397 -200823 -38468 13406 -90915 -171688 47313 -52750 143828 146056 -198496
11764D1425a23434N9678B4935O4405i3778k1692C53102a73281F5118b89625Q0494
$$ 41425 -123434 -63756 24935 89340 -93778 -115470 353102 -173281 65118 -289625 -209131
11753b09131P8743N2243m7733a1484A31697K8900E1538K92778A23832B3845g677
$$ -209131 -130388 -78145 -125878 -11484 131697 160597 51538 344316 123832 23845 -7677
11741E0857K00288a40922f1469j0418j92251A53761N3405e622A65184c60905a36422
$$ 50857 251145 -140922 -61469 -71887 -264138 153761 207166 -5622 165184 -360905 -136422
11729B10921c90688H2835b3857k0208A49950A8277b27794c7147o4667B65610H7577
$$ 210921 -390688 82835 -23857 -44065 149950 18277 -227794 -37147 -101814 265610 87577
11717b94042B09124p2755L4360a20245A6486d08116A02377J16659g2772a7388
$$ -294042 209124 136369 170729 -120245 16486 -408116 102377 219036 -72772 -17388
11706a02729I2452a69349g9569B21747a36577A85531a80176h803k10601K0473
$$ -102729 92452 -169349 -79569 221747 -136577 185531 -180176 -8803 -219404 -198931
11696a98931d0764m0381c9366B59697b20827o110J11607k07635P0048B35550n0704
$$ -198931 -40764 -81145 -39366 259697 -220827 -226937 -115330 -322965 -252917 235550 184846
11685A84846m3489g397l34782A77678M5347a3j4093E16739g0021A1258P5870C1328
$$ 184846 141357 -7397 -342179 177678 223025 -13 -14106 516739 -70021 11258 87128 31328
11672g642B50176f4702A69457F8036a79258A6060c20767A41789b7499k47962R7950
$$ -7642 250176 -64702 169457 68036 -179258 16060 -320767 141789 -27499 -275461 -177511
11661a77511f3952B04584a91659Q3906O313B08030c30871F9365c2753k03175A96810
$$ -177511 -63952 204584 -191659 -107753 -101440 208030 -330871 69365 -32753 -235928 196810
11649b96802B98622E4757k887a44069B71540G3623a11537d2762j82592f0976B6099
$$ -296802 298622 54757 51870 -144069 271540 73623 -111537 -42762 -225354 -60976 26099
11637B36269c15613h6041j96108A18504D446c5666D6044J5929f696A85039J83334
$$ 236269 -315613 -86041 -282149 118504 4446 -35666 46044 61973 -6696 185039 368373
11626C68373B0204L63597a50982B5968d7432H0482J34176h6995B02526D771a18902
$$ 368373 20204 383801 -150982 25968 -47432 80482 214658 -86995 202526 4771 -118902
11614a00968B8403i3072A06773b49066i252n7363A75400a28070D1239b6534C35656
$$ -100968 28403 -93072 106773 -249066 -9252 -66615 175400 -128070 41239 -26534 335656
11602C69847c22611b9254j37968B63030a9776B25622c64904a4064D1596d6983
$$ 369847 -322611 -29254 -167222 263030 -19776 225622 -364904 -14064 41596 -46983
11591A58039a3179A07878c00880a27462p924A80555a05394A59555D6567b51828
$$ 158039 -13179 107878 -300880 -127462 -135386 180555 -105394 159555 46567 -251828
11580A46592d12548B98837i924l20176B44196b58363O0759B11542c25551C21767
$$ 146592 -412548 298837 -9924 -330100 244196 -258363 -197604 211542 -325551 321767
11569A23530b3886q240j2715l8410A97771M6433q6284A3171b51988B6097c44794
$$ 123530 -23886 -32126 -44841 -83251 197771 244204 157920 13171 -251988 26097 -344794
11557B10061h454A33031e4503j50851n525B88157N2698j14527K3392K0518D8413
$$ 210061 -8454 133031 -54503 -205354 -210879 288157 340855 226328 249720 270238 48413
11545d02229J66970B0629a04718a4707B11514F5437Q1108f536m3163B72937j36464
$$ -402229 -235259 20629 -104718 -14707 211514 65437 146545 -6536 -49699 272937 136473
11534A36473g0996j8071d3747B5086a99503c7315n7413A88228a14013A09880a16864
$$ 136473 -70996 -89067 -43747 25086 -199503 -37315 -94728 188228 -114013 109880 -116864
11522A60926M6990c42175H6524K2452a00516D2011N55168A08722P1913e449p837
$$ 160926 207916 -342175 86524 108976 -100516 42011 597179 108722 180635 -5449 -13286
11511a3286m0634B63329J71969A51938k17f0931B43439j13475L555J77511k8116
$$ -13286 -53920 263329 435298 151938 151721 -60931 243439 129964 133519 311030 282914
11500B82914l6657F1468g4515A44530a72256E8639J459I975g8730A70022c27045
$$ 282914 246257 61468 -74515 144530 -172256 58639 60098 9975 -78730 170022 -327045
11488A70533h9431n793C5676J47110a81930O5884B6109P2954J25683C9236J2630
$$ 170533 -89431 -95224 35676 182786 -181930 -116046 26109 99063 224746 39236 51866
11477E1866a66710B81595o6250a94426B89099H5952K40747b37646A65195p815
$$ 51866 -166710 281595 215345 -194426 289099 85952 326699 -237646 165195 157380
11467A57380L883k8975i46A21572a5658q2340F975P8505J18042a6169B76129c4758
$$ 157380 161263 132288 -946 121572 -15658 -97998 6975 85480 203522 -16169 276129 -34758
11454a28757m7739A68191a84912A48812a60843j33329A09300L00262o9599a04990
$$ -128757 -176496 168191 -184912 148812 -160843 -294172 109300 409562 339963 -104990
11443E0561b6570I013M0050j9377J65169J73534d42946D07942D803h899B5375
$$ 50561 -26570 9013 49063 29686 194855 368389 -442946 407942 4803 -8899 25375
11431c5540G0916O4114M5263a45891B31924q8211b73346e0703k376A18984E1708
$$ -35540 70916 135030 180293 -145891 231924 143713 -273346 -50703 -53079 118984 51708
11419E4015k5292c48240a48290B6161L4263g1687j99786D35593d44658A85947
$$ 54015 28723 -348240 -148290 26161 60424 -71687 -271473 435593 -444658 185947
11408B88642a49566C2398J22898O7447a44251N4607B48267q9187J25363A12159
$$ 288642 -149566 32398 155296 222743 -144251 -89644 248267 159080 284443 112159
11397B7337J11721L5018b62907O2233q0150a04913B58970B8180J6676b60971O0838
$$ 27337 139058 174076 -262907 -200674 -280824 -104913 258970 28180 44856 -260971 -200133
11386b00133G3783J21756b16816q5890A26038a36614F4456a35873B3230d9342
$$ -200133 73783 195539 -216816 -302706 126038 -136614 64456 -135873 23230 -49342
11375h5385n5546j07852B76769H366a71898B23755h53k36639i3038n6663D55251
$$ -85385 -140931 -248783 276769 8366 -171898 223755 -853 -237492 -93038 -149701 455251
11363H2132h8872A04780J9043J69559a34473l4803K1841r1645B98795b8230a2390
$$ 82132 -88872 104780 123823 293382 -134473 -169276 -147435 -239080 298795 -28230 -12390
11351A61696B5173L7754b82818a05360B6904R5129I10e3622K3713l10988J54497
$$ 161696 25173 62927 -282818 -105360 26904 122033 910 -53622 -29909 -340897 -186400
11340a86400c0537A60369L2582A8861c40974B38866d66726h5688G3679a40374
$$ -186400 -30537 160369 192951 18861 -340974 238866 -466726 -85688 73679 -140374
11329h7797r2291B16647c3626D073b05371f3631n9377j40510j92033a51670F8105
$$ -87797 -180088 216647 -33626 4073 -205371 -63631 -123008 -263518 -455551 -151670 68105
11317b85701A24879a6661A41097g6379E4063e5797G781c79688f6750B12266p0838
$$ -285701 124879 -16661 141097 -76379 54063 -55797 7781 -379688 -66750 212266 141428
11306A41428b26353A79703k3940a69463c5545E1270a08510A17376c25573B6700
$$ 141428 -226353 179703 155763 -169463 -35545 51270 -108510 117376 -325573 26700
11295A5005h3369A33003b58444C7695g3714l1658D1713L2782i5280H5899c00805
$$ 15005 -83369 133003 -258444 37695 -73714 -105372 41713 74495 -95280 85899 -300805
11283d5075A8076P5839J9679g0142D7641N3635h257c619n9058l57644h5816B24448
$$ -45075 18076 93915 113594 -70142 47641 101276 -8257 -3619 -62677 -420321 -85816 224448
11270a97799H5936l5854K5542b31060A56888C8568a60637j04776c8357G9176E748
$$ -197799 85936 50082 75624 -231060 156888 38568 -160637 -265413 -38357 79176 5748
11258a40414H4137J16756I5513C0339b2602k0613k7335B05834n2940J58411b75628
$$ -140414 84137 200893 95513 30339 -22602 -43215 -70550 205834 152894 311305 -275628
11246f019r6690m2339r3671C029L1044a36417m4898j8500B03357C9260a40814
$$ -6019 -102709 -145048 -238719 3029 34073 -136417 -181315 -199815 203357 39260 -140814
11234b52282c8342a4505B48556B043K67022b68234J21684p7217B08957b67973
$$ -252282 -38342 -14505 248556 2043 269065 -268234 -146550 -223767 208957 -267973
11223A54278j1790k6222R7309G1296b33975Q2526P896F7107M3415K8234a2515
$$ 154278 142488 116266 213575 71296 -233975 -151449 -143553 67107 110522 138756 -12515
11211a39845M3267A63100c5651A51043h6184B24820J10663A04968D7773L570A1000
$$ -139845 -96578 163100 -35651 151043 -86184 224820 335483 104968 47773 51343 11000
11199c99893B0346c33188H2254a9524m3739k11059J08466j86112a02929C5298
$$ -399893 20346 -333188 82254 -19524 -63263 -274322 -165856 -351968 -102929 35298
11188a94423J1590d7937a1142H8968c20421i1922j55707B59709a15164L5732B659
$$ -194423 -182833 -47937 -11142 88968 -320421 -91922 -247629 259709 -115164 -79432 2659
11176D462L98869I8647a14324G8820a08163A20719j874a16683G6841J41333b0885
$$ 4462 403331 98647 -114324 78820 -108163 120719 118845 -116683 76841 218174 -20885
11164f946k21988B3107c98399i1510G7129i579B54186l9266a53955j62198A90021
$$ -6946 -228934 23107 -398399 -91510 77129 -9579 254186 214920 -153955 -316153 190021
11152f7689K3767E05194I0219h2067C5086i0724A43394C9893e2381A12433P738
$$ -67689 -43922 505194 90219 -82067 35086 -90724 143394 39893 -52381 112433 120171
11141A20171D257b05009n8412a9133C52312L712A14124b9314k12008B8045O5976
$$ 120171 4257 -205009 -263421 -19133 352312 356024 114124 -29314 -241322 28045 94021
11130I4021l3970a43580N4038A65758C0881a95668k49165J70216H4062J58798
$$ 94021 60051 -143580 -89542 165758 30881 -195668 -444833 -274617 84062 242860
11120B42860h2857l83991J97080I273J29848K0185b11534A13724N58183b5740
$$ 242860 -82857 -466848 -269768 9273 139121 159306 -211534 113724 671907 -25740
11109B47949D0345K33667m4960d2426B0662L30996a66155D28834m9125G9091f370
$$ 247949 40345 274012 229052 -42426 20662 351658 -166155 428834 379709 79091 -6370
11097b00621A69497N8374F2847L6050R7142J26248p5323p4110J23988a7546j13934
$$ -200621 169497 227871 62847 98897 196039 322287 246964 172854 296842 -17546 -131480
11086a31480d0248A62478L6992Q034J39827A61229o0406N3977l3573K41576D7178
$$ -131480 -40248 162478 199470 207504 347331 161229 100823 154800 121227 362803 47178
11074C43011k9598L2685a0065A29716J71419j7897J3884j32561J6249k0751n4056
$$ 343011 313413 346098 -10065 129716 301135 283238 297122 164561 180810 160059 106003
11063A06003b1968A12974K85660k8557J49103k40192L21489l8702j82315K97205
$$ 106003 -21968 112974 398634 370077 519180 278988 600477 561775 379460 676665
11053F76665j81325J52497j98049K80080R7227j51211j86513Q5326L79247l71823
$$ 676665 495340 647837 449788 729868 827095 675884 489371 574697 953944 582121
11043E82121K65921J23016D73464M40574C34615M74846L5330C75387N65849m66086
$$ 582121 848042 971058 473464 914038 334615 809461 844791 375387 941236 475150
11033D75150q8573M14429N4258j95094j41769J21352K6383r2580r3479P8712j11814
$$ 475150 386577 801006 855264 660170 518401 639753 666136 573556 480077 558789 446975
11022D46975K62408k41782j22628J81379q0897k09340J87731M07675C40294k720
$$ 446975 709383 467601 344973 526352 445455 236115 423846 831521 340294 337574
11012C37574K95244B33343J40346O109J15897B36182L77295k9424k13220K96332
$$ 337574 632818 233343 373689 379798 495695 236182 613477 584053 370833 667165
11002F67165j97585n2890R2288J36270M38034C95715J21705J32264P2612J8657
$$ 667165 469580 416690 508978 645248 1083282 395715 517420 649684 722296 740953
10992G40953j93865L06785j66869q1083K3511j60455L25637J40386k76447K10256
$$ 740953 547088 853873 687004 605921 629432 468977 794614 935000 658553 868809
10982H68809K70497j02784k77671K20285M15438N6211K52081M00560j4322M71469
$$ 868809 1139306 1036522 758851 979136 1394574 1450785 1702866 2103426 2089104 2560573
10972B560573k08560K83782j66908o5263n28709K34590k21848m59852m82051R1471
$$ 2560573 2352013 2635795 2468887 2403624 1874915 2109505 1887657 1427805 945754 1037225
10962A037225L82472o1942l19380Q6392L8137l31531j2445L4649j07940L43318
$$ 1037225 1419697 1357755 1038375 1124767 1162904 831373 818928 853577 745637 1088955
10952A088955D60968A30532K36206j48844J9561J02030j17788a00208A07551P4401
$$ 1088955 460968 130532 366738 217894 237455 339485 221697 -100208 107551 181952
10942A81952J59124j51884o1248h7355C08842f0059j8010C59286n0890K26729
$$ 181952 341076 189192 127944 -87355 308842 -60059 -78069 359286 308396 535125
10932E35125b2176j46835A68625K3628b28887d9195j40426A91456a2118p233G7421
$$ 535125 -22176 -169011 168625 192253 -228887 -49195 -189621 191456 -12118 -19351 77421
10920D7445M6004B9418J31545l7412a48947L5936F1688M2934b43860O4695B9074
$$ 47445 93449 29418 160963 123551 -148947 -113011 61688 104622 -243860 -179165 29074
10908b71897B80488b76607B6465L43880j75428a43454b9915q7140B0594b4570
$$ -271897 280488 -276607 26465 370345 194917 -143454 -29915 -117055 20594 -24570
10897E054c20697D7259A8741J18860p98b1198j29541j25475a33625E5982B6084
$$ 5054 -320697 47259 18741 137601 136803 -21198 -150739 -276214 -133625 55982 26084
10885h647A70981J5865b04274k9434a6312k54450C2373A758M7036Q5552b08228
$$ -8647 170981 186846 -204274 -233708 -16312 -270762 32373 1758 48794 134346 -208228
10873A8683M37204i2700j72025o4442d009l55395a26900j27019h747I3997a6278
$$ 18683 455887 -92700 -264725 -329167 -4009 -359404 -126900 -253919 -8747 93997 -16278
10861A45376a31717A5492L4906a11876M5781m6148k0519c3458A37962e1522G3118
$$ 145376 -131717 15492 50398 -111876 -66095 -112243 -132762 -33458 137962 -51522 73118
10849b06503A62794g9531K2336H6955a08010p5928o2567a9006q3786k798K9455
$$ -206503 162794 -79531 -57195 86955 -108010 -183938 -246505 -19006 -102792 -105590 -76135
10838g6135F2650a94869A88356b18764o3028a28272k95721C18016e8645D8524
$$ -76135 62650 -194869 188356 -218764 -281792 -128272 -423993 318016 -58645 48524
10827a7374o8995A10491J43034h2798j33820B39729A5560R7621b52468b7828r8569
$$ -17374 -86369 110491 253525 -82798 -216618 239729 15560 113181 -252468 -27828 -126397
10816a26397q232A65219i7626R786B67894a4798C094K7574c32182a10719C7698
$$ -126397 -134629 165219 -97626 -87840 267894 -14798 3094 30668 -332182 -110719 37698
10804B09880A4522P6498k9788a52691I4194J24320b44666I592b72481j3329a03627
$$ 209880 14522 91020 61232 -152691 94194 218514 -244666 9592 -272481 -285810 -103627
10792h278F9788b5260j17473O6001q931j0285L3181A98746b92230j37382A17081
$$ -8278 69788 -25260 -142733 -76732 -85663 -95948 -62767 198746 -292230 -429612 117081
10780A40064a7304A08984k1759h1019j01675C68627j31885F451b24747O2820e109
$$ 140064 -17304 108984 87225 -81019 -182694 368627 236742 6451 -224747 -161927 -5109
10768c4068n28746b8944qD6563a79693E3137a63324L8489H133L24990a21909k8155
$$ -34068 -562814 -28944 -28952 46563 -179693 53137 -163324 -124835 8133 333123 -121909 -150064
10756a50064O6991A69123c97422A11929a05940D6246f6621m96j1666J8145n1232
$$ -150064 -83073 169123 -397422 111929 -105940 46246 -66621 -67117 -78783 -60638 -111870
10745a11870E7960J13610b65518F5973A2360m651a33123F4279R7716B7980a39690
$$ -111870 57960 171570 -265518 65973 12360 7709 -133123 64279 161995 27980 -139690
10733a01137D0076b00818B52202b82639B35476f4007r9491j31820a39474f860
$$ -101137 40076 -200818 252202 -282639 235476 -64007 -163498 -295318 -139474 -6860
10722a78160A91062d40114a11354a5750q6789c8353j65892F8997a13143A64452
$$ -178160 191062 -440114 -111354 -15750 -102539 -38353 -204245 68997 -113143 164452
10711a34248C3922J36547B5328L5367L30856A2885a96291Q5800l04047K06709
$$ -134248 33922 170469 25328 60695 391551 12885 -196291 -110491 -414538 -207829
10701b07829A39054k457a305q086k57042a13055B1106d7705m5937j00458j38783
$$ -207829 139054 136597 -1305 -9391 -266433 -113055 21106 -47705 -93642 -194100 -332883
10690c32883A21323J5323P1089c8927j17291J3173L1008L5557A19285B087b2765
$$ -332883 121323 136646 207735 -38927 -156218 -143045 -112037 -76480 119285 2087 -22765
10678b37602I0974b30723F5519h0551D3140b20460D5065a41234C1878c13538m2858
$$ -237602 90974 -230723 65519 -80551 43140 -220460 45065 -141234 31878 -313538 -356396
10667c56396a13046C41741H5503b1700j78063f8503l25688f9158m9133j56981
$$ -356396 -113046 341741 85503 -21700 -199763 -68503 -394191 -69158 -118291 -275272
10657b75272G1170A298J88186c74384A37739g1585K5841j11280D021J31205i5803
$$ -275272 71170 1298 189484 -374384 137739 -71585 -45744 -157024 4021 135226 -95803
10645b58284A59041a47292A1508L9776J84813c8402j75443a02084B75048A0630
$$ -258284 159041 -147292 11508 51284 236097 -38402 -213845 -102084 275048 10630
10634A97622j5930b27358r3376B28954G7077b5155C17236b60556B9477J06838
$$ 197622 181692 -227358 -320734 228954 77077 -25155 317236 -260556 29477 136315
10624A36315K49954c71418O6720A01042f6386j87844f878j16073J744B6515p827
$$ 136315 386269 -371418 -304698 101042 -66386 -254230 -6878 -122951 -121207 26515 18688
10613A8688Q1200b7445H1466B136f9687A1003L2993J28455F9149c60483J9949
$$ 18688 99888 -27445 81466 2136 -69687 11003 43996 172451 69149 -360483 -340534
10602c40534R6864a10394B37980a19254A10126b3553L608j8979A69115K82858
$$ -340534 -243670 -110394 237980 -119254 110126 -23553 -19945 -38924 169115 451973
10592D51973a50936A27708e3530m2811a2880A22890a28033A58504k0389B9046
$$ 451973 -150936 127708 -53530 -96341 -12880 122890 -128033 158504 138115 29046
10581i5690j18113e6298B80234l9785A03284d3669k171m1033J4221A21138i5491
$$ -95690 -213803 -56298 280234 240449 103284 -43669 -45840 -86873 -72652 121138 -95491
10569A41669h8408j0694H2468A426b22226C29406g5387r4635A4502a21405B20176
$$ 141669 -88408 -99102 82468 1426 -222226 329406 -75387 -170022 14502 -121405 220176
10557b90739b5785A00036h1534r1201B25384b42044J13402c1448D14796e6243
$$ -290739 -25785 100036 -81534 -172735 225384 -242044 -128642 -31448 414796 -56243
10546C3966a92863H7818g5343J2091q8553n3460j1361A33927O2024I2397b8247
$$ 33966 -192863 87818 -75343 -63252 -151805 -205265 -216626 133927 195951 92397 -28247
10534g3162n6601k2368k26789b6412k05097D3158j7410a92527C64603H9692J82508
$$ -73162 -129763 -152131 -378920 -26412 -231509 43158 25748 -192527 364603 89692 272200
10523B72200A00820g5135j64298c0173m7278A9898a23478D7672J46475p3154b5804
$$ 272200 100820 -75135 -239433 -30173 -77451 19898 -123478 47672 194147 120993 -25804
10511A23378a77315B24400A6954L5120f4586A05310P6815E6185i2006C70784F7467
$$ 123378 -177315 224400 16954 52074 -64586 105310 182125 56185 -92006 370784 67467
10499a72611j53156j2141a39369I915b20207F5053b4201k75547D2723K45144a39188
$$ -172611 -325767 -337908 -139369 9915 -220207 65053 -24201 -299748 42723 287867 -139188
10487h1703B64941a72908F246c42566A31937F0249J4586O541a29747m3798A36840
$$ -81703 264941 -172908 6246 -342566 131937 60249 74835 81376 -129747 -173545 136840
10475a86629d0209j63026F6123g5673k9932r790k81124h0041q6046a7158G771
$$ -186629 -40209 -203235 66123 -75673 -105605 -115395 -396519 -80041 -166087 -17158 7771
10463A8099L03801f5195A70906J81686b12913C16486F7375a26574j70490K2596
$$ 18099 321900 -65195 170906 352592 -212913 316486 67375 -126574 -297064 -274468
10453b74468a17009A54320i1322g655A0247L40746c53260G9193m133l5358i8509
$$ -274468 -117009 154320 -91322 -7655 10247 350993 -353260 79193 75060 39702 -98509
10441f7772H468K2311a04681K1499A72319F4332P2646a64203d6447G799c92362
$$ -67772 8468 30779 -104681 -83182 172319 64332 136978 -164203 -46447 7799 -392362
10429A49541c25255A67486D4409j9886K9821b5276A50761A875L20379a49876q5955
$$ 149541 -325255 167486 44409 24523 54344 -25276 150761 1875 322254 -149876 -235831
10418b35831O0566A90933D5984j3123a13393E7003a47408A03137a36408M4657
$$ -235831 -175265 190933 45984 32861 -113393 57003 -147408 103137 -136408 -91751
10408i1751m2660A00860L6854a140j82245A45514i4222E4582i5989A98451a7483
$$ -91751 -134411 100860 137714 -1140 -183385 145514 -94222 54582 -95989 198451 -17483
10396A19324K31371E8466L28438c62834B10933Q9716B5676J46695m3544K79951
$$ 119324 350695 58466 386904 -362834 210933 300649 25676 172371 128827 408778
10386D08778n1956C6312M5275i2445n2548a8967F0581C916K08146K0864i4107
$$ 408778 356822 36312 81587 -92445 -144993 -18967 60581 3916 212062 232926 -94107
10374D38324H173J37196J68476l8987j20742Q9502K92124B04676D2892J95650
$$ 438324 8173 145369 313845 274858 154116 243618 535742 204676 42892 238542
10364B38542L19003K7016k85922D7722b08330C44208a37210C5602L17936I8773
$$ 238542 557545 584561 298639 47722 -208330 344208 -137210 35602 353538 98773
10353a0241A99694K74862k03315J96227A60568K67806j09656o6978H5055J9009
$$ -10241 199694 474556 271241 467468 160568 428374 318718 251740 85055 104064
10343A04064j0218k6910i543C2975L56979G6177J66137R5630h5742L6180G9524
$$ 104064 93846 66936 -9543 32975 389954 76177 242314 337944 -85742 -49562 79524
10331B19649b11178A6629R919f5439C64272j55386O0l8634K16625a123C45536
$$ 219649 -211178 16629 26548 -65439 364272 208886 208946 170312 386937 -1123 345536
10319H202J52736C5137a12068n9083H5363K3197M20174E0294J30757b17979r8314
$$ 8202 160938 35137 -112068 -171151 85363 108560 528734 50294 181051 -217979 -316293
10308c16293B78728b73442B61044a76757B05980c90807B5055b24924A97115L2203
$$ -316293 278728 -273442 261044 -176757 205980 -390807 25055 -224924 197115 229318
10298B29318n270a16325C25511E8407d06089f7402E3890J33444a88630C2309P7099
$$ 229318 224048 -116325 325511 58407 -406089 -67402 53890 187334 -188630 32309 109408
10287A09408b29557c017A74541F529Q5139C223b24666D7747a26540C71447D7246
$$ 109408 -229557 -3017 174541 6529 91668 3223 -224666 47747 -126540 371447 47246
10275a03810A5155O2427L85100b13935A06267E171P0974E187b33279A51498B5874
$$ -103810 15155 77582 462682 -213935 106267 5171 76145 5187 -233279 151498 25874
10263a9191p5987L293l0096E1703J21386N7716N0054j34057k5881C4513O23277
$$ -19191 -95178 -91885 -121981 51703 173089 230805 280859 146802 120921 34513 657790
10252F57790a5844A44730n5591B2250K04924e543j70065I2301a00476C33025d1838
$$ 657790 -15844 144730 89139 22250 227174 -5543 -175608 92301 -100476 333025 -41838
10240c95057j8790A40346B2620b49975h7276H9344A924c28114A53257k9842d5752
$$ -395057 -413847 140346 22620 -249975 -87276 89344 1924 -328114 153257 123415 -45752
10228B55910a1404B32289P9131a07924E6881b23341A23545a04766j63487A8964
$$ 255910 -11404 232289 311420 -107924 56881 -223341 123545 -104766 -268253 18964
10217e3111E6530J102a62435c721A38216g4602I1595e8976k39255E3503P1521
$$ -53111 56530 57632 -162435 -3721 138216 -74602 91595 -58976 -298231 53503 125024
10206A25024J95371e2905j58260N6042A68692c79558e5963A69700e5656k91382
$$ 125024 320395 -52905 -211165 -155123 168692 -379558 -55963 169700 -55656 -347038
10196c47038a8968j46591q516a4844A50247A9714g7654A50206a13347a358F0527
$$ -347038 -18968 -165559 -174075 -14844 150247 19714 -77654 150206 -113347 -1358 60527
10184b71142D409Q7819b43230B0531c21232A51222a59629k785q3275f8699C4146
$$ -271142 4409 92228 -243230 20531 -321232 151222 -159629 -162414 -245689 -68699 34146
10172C0752a77177H0780c68836a78875I0725O1931c6434A11485i9947A0563J60501
$$ 30752 -177177 80780 -368836 -178875 90725 152656 -36434 111485 -99947 10563 171064
10161A71064b84863L4178B0046d4077k02020J14175A56213d1841E8877d8832p0346
$$ 171064 -284863 -250685 20046 -44077 -246097 -131922 156213 -41841 58877 -48832 -119178
10150a19178c7395o1299F2851O6897a38535f4608A43546f0247j76151a11621j09258
$$ -119178 -37395 -98694 62851 129748 -138535 -64608 143546 -60247 -236398 -111621 -220879
10139b20879b5603G1568i8454j60390E7489d15532a00735d3743j88495i5167k15818
$$ -220879 -25603 71568 -98454 -258844 57489 -415532 -100735 -43743 -232238 -95167 -310985
10128c10985q2359e1445A73002E5064a37214D6684d4889D2349a12170K3525b0253
$$ -310985 -393344 -51445 173002 55064 -137214 46684 -44889 42349 -112170 -88645 -20253
10116B02267H5824J0180b92954f7131k10857F7705h7593R613o9126A83979F7043
$$ 202267 85824 96004 -292954 -67131 -277988 67705 -87593 -77980 -147106 183979 67043
10104e9070j32990K9569L1262K9733B45431B5321c02109E9153Q3743d6354B7309
$$ -59070 -192060 -162491 -131229 -101496 245431 25321 -302109 59153 142896 -46354 27309
10092C4656g2981j96374a08368D4539c0172C7739b55916c5476k7410K540l7993
$$ 34656 -72981 -269355 -108368 44539 -30172 37739 -255916 -35476 -62886 -60346 -98339
10081i8339A65310e4098G8480a05108B0921a12839F8314K0736C1492d34237b09053
$$ -98339 165310 -54098 78480 -105108 20921 -112839 68314 89050 31492 -434237 -209053
10069a73261Q3291F8704b13586Q3121c7544l42665h5060A40230o7191b8747j54909
$$ -173261 -89970 68704 -213586 -130465 -37544 -380209 -85060 140230 73039 -28747 -183656
10058a83656C2555b54145B16416a17317n7493L6907G3046R4834l4618D064a5692
$$ -183656 32555 -254145 216416 -117317 -174810 -137903 73046 167880 133262 4064 -15692
10046b7343j39516m9678A02423A9371b63715K7664a13727k15702J964B84395n4853
$$ -27343 -166859 -216537 102423 19371 -263715 -236051 -113727 -329429 -327465 284395 229542
10035B29542E1721J22607j3810c92622A59650J59633a5730B4927a39693m0942
$$ 229542 51721 174328 160518 -392622 159650 319283 -15730 24927 -139693 -180635
10025a80635A79825P0291a62119l8199m6811e7824r7909N8797A97420A8880b34960
$$ -180635 179825 250116 -162119 -200318 -247129 -57824 -155733 -96936 197420 18880 -234960
10013g4255j48659m4783P5723G491a74416I9453d58688a99008B1149J28390b68006
$$ -74255 -222914 -267697 -191974 7491 -174416 99453 -458688 -199008 21149 149539 -268006
10001g9372l416j15123b7304B189c06967Q5445C6421j3456Q42f922E122c11454
$$ -79372 -82788 -197911 -27304 2189 -306967 -221522 36421 22965 23807 -6922 5122 -311454
9988B50734a41849J45k01788f6223p1124l06871N4228a60217j44525a3054A31491
$$ 250734 -141849 -141704 -343492 -66223 -137347 -444218 -389990 -160217 -304742 -13054 131491
9976g7292E216J71405a81435c9904q5902j49053J23073a1610j476B85298a84549
$$ -77292 5216 176621 -181435 -39904 -125806 -274859 -151786 -11610 -13086 285298 -184549
9964a93567o1772a18656l4551F8848a53342M9328A55277e39943e2728D6478a13794
$$ -193567 -255339 -118656 -153207 68848 -153342 -104014 155277 -539943 -52728 46478 -113794
9952C81138h5657k09283G8656b78640D8078f1610C8093e05276f828p7776g858
$$ 381138 -85657 -294940 78656 -278640 48078 -61610 38093 -505276 -6828 -84604 -7858
9940B29772a11339k42698a01133n5857L1280A07810M2005o8945k6471l953d6137
$$ 229772 -111339 -354037 -101133 -156990 -125710 107810 149815 80870 54399 50446 -46137
9928a15870B3798O0580d70291H46b3398F7758i1983C4090K3625K9423j893B4012
$$ -115870 23798 84378 -470291 846 -23398 67758 -91983 34090 57715 87138 85245 24012
9915a45036E8613A3487a04500n7931A45863E8852c8436E4381b40692P5684c1453
$$ -145036 58613 13487 -104500 -162431 145863 58852 -38436 54381 -240692 -165008 -31453
9903i6273C95461a96008k04403a70205A12747i9637k80951h7144c9915j1131a3138
$$ -96273 395461 -196008 -400411 -170205 112747 -99637 -380588 -87144 -39915 -51046 -13138
9891E0932a78702P4614B31791a6474B76185B3597c91573A25797B1377J06695d12252
$$ 50932 -178702 -104088 231791 -16474 276185 23597 -391573 125797 21377 128072 -412252
9879F8365b16180A94295a2409j08165k02208g06C21882L1683a00105L9353B59895
$$ 68365 -216180 194295 -12409 -120574 -322782 -706 321882 353565 -100105 -60752 259895
9867b29384j26631a0822m7545B26599a31206p7750P2708l0143j69569D3187j6873
$$ -229384 -356015 -10822 -58367 226599 -131206 -208956 -136248 -166391 -335960 43187 26314
9856B6314A2173b07117E3661c0048l05671j6928C06350F5471i585r3322D1203
$$ 26314 12173 -207117 53661 -30048 -335719 -352647 306350 65471 -9585 -102907 41203
9844A77347A6051a43193b5947F1571b92769J01426c1331H8350A1547a64549h1892
$$ 177347 16051 -143193 -25947 61571 -292769 -191343 -31331 88350 11547 -164549 -81892
9832i3948E1089g2675D3769a50735P3469j53112r6067B70992a6468A66693J13812
$$ -93948 51089 -72675 43769 -150735 -77266 -230378 -326445 270992 -16468 166693 280505
9821B80505A24099c29131I0079d2631p7019k11348C65d90582b20511Q2059q1617
$$ 280505 124099 -329131 90079 -42631 -119650 -330998 365 -490582 -220511 -138452 -220069
9810b20069o6193b7862j55918C57511a92717F8536c87387a18710q1836l4285a09523
$$ -220069 -286262 -27862 -183780 357511 -192717 68536 -387387 -118710 -200546 -234831 -109523
9798A84442a79371b5582q4792k05313A46858a66917k3695A61783b20068A26983
$$ 184442 -179371 -25582 -110374 -315687 146858 -166917 -190612 161783 -220068 126983
9787f2015A1326K7622J09033f7257j99954P8894A27329i072l09794G0903J45O7129
$$ -62015 11326 38948 147981 -67257 -267211 -188317 127329 -9072 -318866 70903 71048 138177
9775A38177r705c37114A5496f1728R224K320k42613a32356c997D2566K2824h1602
$$ 138177 128472 -337114 15496 -61728 -52504 -50184 -292797 -132356 -3997 42566 65390 -81602
9762C09863j54208A6625f0294l5092l9898j3910k39442g9939K7210H0929b26770
$$ 309863 155655 16625 -60294 -95386 -135284 -149194 -388636 -79939 -52729 80929 -226770
9750a81232e5297j6121r0962B04415d00757J52793f4619A41606R816e80776d8148
$$ -181232 -55297 -71418 -162380 204415 -400757 -247964 -64619 141606 151422 -580776 -48148
9738a97893f0448B43195j1329i0776A48119B9705a88226A75012a69629j78313
$$ -197893 -60448 243195 231866 -90776 148119 29705 -188226 175012 -169629 -347942
9728c47942A14543a45498O1527N24j42542A55368a59167C25990A36216D3491M039
$$ -347942 114543 -145498 -83971 -83447 -225989 155368 -159167 325990 136216 43491 47530
9717D7530e0645O041j65713f017j44307j1266f7287j7813c4256j94211A99183
$$ 47530 -50645 -44604 -210317 -6017 -150324 -161590 -67287 -85100 -34256 -228467 199183
9705d420n83444h9644j81476h1450A06742a9666I5080c9464A13887c55850a32494
$$ -4420 -587864 -89644 -271120 -81450 106742 -19666 95080 -39464 113887 -355850 -132494
9693b86322i7268m8809k0571e9913j35838b1439B6511N7769P9383a9134C538a16454
$$ -286322 -97268 -146077 -166648 -59913 -195751 -21439 26511 84280 163663 -19134 3538 -116454
9680C9523j9049g1738A92746D8184P9548l0164b71470G7059h8290o7668A57853
$$ 39523 20474 -71738 192746 48184 127732 97568 -271470 77059 -88290 -155958 157853
9668a3745B00406e847C0352R5298a51773q2048J15616E6538d2332C16610b53980
$$ -13745 200406 -5847 30352 125650 -151773 -233821 -118205 56538 -42332 316610 -253980
9656a42831J7944Q048A72094k893d34263b0137B31330b04163G1277k7714d1187
$$ -142831 -124887 -116839 172094 169201 -434263 -20137 231330 -204163 71277 43563 -41187
9644a15346F6094c32517d7747A57998c98113J37401a00827p859H2305b40158i458
$$ -115346 66094 -332517 -47747 157998 -398113 -260712 -100827 -108686 82305 -240158 -9458
9632B30156a38756E1663i2846A6159a91296E8187N1075a31490j35016l5489h3679
$$ 230156 -138756 51663 -92846 16159 -191296 58187 109262 -131490 -266506 -301995 -83679
9620A00215c18383I1363a50609F708K08389f0044l0674A51086b20661G1230c39663
$$ 100215 -318383 91363 -150609 6708 215097 -60044 -90718 151086 -220661 71230 -339663
9608a65587A89328c77379A28293K09263I1649d01536e1303j20162P520j6714K9054
$$ -165587 189328 -377379 128293 337556 91649 -401536 -51303 -171465 -163945 -180659 -151605
9597a51605F3182a47007o3212A23362d64778a37793j82603k938k298B90317a76907
$$ -151605 63182 -147007 -210219 123362 -464778 -137793 -320396 -323334 -325632 290317 -176907
9585d5097l39143a74270O2849d7788m52713a37340A36623J25263a87621k92057
$$ -45097 -384240 -174270 -111421 -47788 -500501 -137340 136623 261886 -187621 -479678
9575d79678K14624A44525a07673D4253J62015r8902a7274j91842r467g0550A18759
$$ -479678 -265054 144525 -107673 44253 206268 107366 -17274 -209116 -218583 -70550 118759
9563A21339a66569C3149M6076i2973r921r8071B51619b42787l262R5555N6930
$$ 121339 -166569 33149 79225 -92973 -102894 -200965 251619 -242787 -246049 -150494 -93564
9552i3564A175J01485e16005A61208e5222C96298A48590f1622I8470C3553a10546
$$ -93564 1175 102660 -516005 161208 -55222 396298 148590 -61622 98470 33553 -110546
9540f2898G3344b21544A77692b0496C01987f1083k43523B37910c37695i925j46471
$$ -62898 73344 -221544 177692 -20496 301987 -61083 -304606 237910 -337695 -9925 -156396
9529a56396A20847B0453a84163N1891a0531A52154f6866j49359C3028a73280k04058
$$ -156396 120847 20453 -184163 -132272 -10531 152154 -66866 -216225 33028 -173280 -377338
9518c77338B1950a16163j9996J4971B48102a274k26864k9492C1949e4378A19087
$$ -377338 21950 -116163 -136159 -121188 248102 -1274 -228138 -257630 31949 -54378 119087
9506F3105i1874k6779r4780A10502a13582j93218a49157B750b18910j318C1214
$$ 63105 -91874 -118653 -213433 110502 -113582 -306800 -149157 2750 -218910 -220228 31214
9494A49601k0573N2578C706a69994E7095b87522A67944o7999k7983f748j27806
$$ 149601 129028 181606 3706 -169994 57095 -287522 167944 99945 71962 -6748 -134554
9483a34554A09590d4216J1342A16636g3331G6082d5844j78170B36573j14440c28078
$$ -134554 109590 -44216 -32874 116636 -73331 76082 -45844 -224014 236573 122133 -328078
9471G6144c02760a034m0303q3195H6348i6028a5449D5284b21046r6301h6665m1892
$$ 76144 -302760 -1034 -41337 -124532 86348 -96028 -15449 45284 -221046 -317347 -86665 -128557
9459a28557d8649k09562h937I7692a50961f3893r5288m2456F5b64615B56786C2846
$$ -128557 -48649 -258211 -8937 97692 -150961 -63893 -159181 -201637 65 -264615 256786 32846
9446a15360o602E691a9359H7914b63478d3562m33239a19200k29862D6685a506
$$ -115360 -121962 5691 -19359 87914 -263478 -43562 -476801 -119200 -349062 46685 -1506
9434A65033D8481a04119G2911b86480Q0882N3304M5538N1967k4291A28246c06671
$$ 165033 48481 -104119 72911 -286480 -205598 -152294 -106756 -54789 -79080 128246 -306671
9422D668K0297J0544b83319o9517a21304L5018B70342a47837A5173J7318j0044
$$ 4668 24965 35509 -283319 -352836 -121304 -86286 270342 -147837 15173 32491 22447
9411B2447h7461A84176b42157h6018j67265d1946f82B02892l9542a23663p2074
$$ 22447 -87461 184176 -242157 -86018 -253283 -41946 -682 202892 163350 -123663 -195737
9400a95737j25278R4304P9318k9532B2134K3073a28211e0735p6943A25577Q3840
$$ -195737 -321015 -226711 -147393 -176925 22134 45207 -128211 -50735 -127678 125577 209417
9389B09417b32957a00155M2614A89656F7673M0716a4600o0802B15201K72445A66642
$$ 209417 -232957 -100155 -57541 189656 67673 108389 -14600 -75402 215201 487646 166642
9377b4105l436h621D1861b47693a19205B80614E9683k0732K3633f7976G9833K88491
$$ -24105 -27541 -8621 41861 -247693 -119205 280614 59683 38951 62584 -67976 79833 368324
9365C68324A17427o542A0444R5410P9667E6731b17339e0166A11180c29297P8315
$$ 368324 117427 110885 10444 105854 185521 56731 -217339 -50166 111180 -329297 -250982
9354b50982g4840E0816a85005D7813J58348m3721b09745P0056B09618l0259c0629
$$ -250982 -74840 50816 -185005 47813 206161 162440 -209745 -139689 209618 179359 -30629
9342a10733M3530k7276F2090J01010f8620k2215j01916A96157b90542G4527K36612
$$ -110733 -67203 -94479 62090 163100 -68620 -90835 -192751 196157 -290542 74527 311139
9331C11139E6956b0894n14156h9370j20905A08943a86275Q8084q2888c6398A33200
$$ 311139 56956 -20894 -535050 -89370 -210275 108943 -186275 -98191 -181079 -36398 133200
9319b48500R5980E1611b52159f4537B15471F3318K69838j60073c47986J65244
$$ -248500 -152520 51611 -252159 -64537 215471 63318 333156 173083 -347986 -182742
9309a82742B5560R550b4312F2586k947h8597j78527c821k57662a00192l1204q2051
$$ -182742 25560 35110 -24312 62586 59639 -88597 -267124 -3821 -261483 -100192 -131396 -213447
9297b13447g9805j37383c8969A07612a4438k58496H1103K06751H4956a49361J3402
$$ -213447 -79805 -217188 -38969 107612 -14438 -272934 81103 287854 84956 -149361 -135959
9286a35959N151C5808b90701J13631Q4415a4765k74680B37098I6479c19673R4338
$$ -135959 -130808 35808 -290701 -177070 -92655 -14765 -289445 237098 96479 -319673 -225335
9275b25335F9885e4448q2671A66722p5102d10027b6548K459j23760j8661A64909
$$ -225335 69885 -54448 -137119 166722 91620 -410027 -26548 -24089 -147849 -166510 164909
9263C9384a74333A9702d0363j05930I7965b94644D30763g5134p9433k6005g324
$$ 39384 -174333 19702 -40363 -146293 97965 -294644 430763 -75134 -154567 -180572 -7324
9251B30263a98602A18353f3666k24654b6463p6157A09558h5654F0943K39596i280
$$ 230263 -198602 118353 -63666 -288320 -26463 -102620 109558 -85654 60943 300539 -9280
9239c74210a2679k27753O9938j53637N0403A62108n2920d0861j59558L6682A80827
$$ -374210 -12679 -240432 -170494 -324131 -273728 162108 109188 -40861 -200419 -163737 180827
9227a10432F3380A4653b79356A6396b00763A38359c23069a14292A8561a79665
$$ -110432 63380 14653 -279356 16396 -200763 138359 -323069 -114292 18561 -179665
9216C17706a59754j36176I3038b39908D09980f9167o0823k61998h4191j29883
$$ 317706 -159754 -295930 93038 -239908 409980 -69167 -129990 -391988 -84191 -214074
9206b14074A6275b04528E7760A5954c88059H2883h2316C8968a36624f7704A22764
$$ -214074 16275 -204528 57760 15954 -388059 82883 -82316 38968 -136624 -67704 122764
9194A4600a89005e6888B59293g3493m18611b37265a11771G6408l631J53522N2549
$$ 14600 -189005 -56888 259293 -73493 -492104 -237265 -111771 76408 72777 226299 278848
9183B78848N6629n094a23497j59759A68111b09855Q6672A6838J66057n6560a08403
$$ 278848 335477 330383 -123497 -283256 168111 -209855 -123183 16838 182895 126335 -108403
9171h9645F7512a54245D16768c02824B21417c8685l69038G0962k8028a19838k2929
$$ -89645 67512 -154245 416768 -302824 221417 -38685 -407723 70962 42934 -119838 -142767
9160a42767e4289j84850F7647b3830A56940N4358K1590L7315c57502e5022A59524
$$ -142767 -54289 -239139 67647 -23830 156940 211298 232888 270203 -357502 -55022 159524
9148g5150q2165q8805E2187a27007A25758a51250F1672A9345g0029r9099d0792
$$ -75150 -157315 -246120 52187 -127007 125758 -151250 61672 19345 -70029 -169128 -40792
9136a1796j34866j68332N7786h482n2538l9875M4480a3478j50488E8195b58026
$$ -11796 -146662 -314994 -257208 -8482 -61020 -100895 -56415 -13478 -163966 58195 -258026
9124I2137a44068G4438J10278a9977j97259e3042J8192j81169a03064J0203l581
$$ 92137 -144068 74438 184716 -19977 -217236 -53042 -34850 -216019 -103064 -92861 -96442
9113i6442C65614D0867J10885b42670j19514B3393a74904e8653e954j10318J102
$$ -96442 365614 40867 151752 -242670 -362184 23393 -174904 -58653 -5954 -116272 -115170
9102a15170A12388c38868d0868F7184J80762h4418c9117k56521G733J43633a26186
$$ -115170 112388 -338868 -40868 67184 247946 -84418 -39117 -295638 7733 151366 -126186
9090C41188c14331O9070h6l86797c6601A22922b19800A70997k0702b15256h6580
$$ 341188 -314331 -245261 -86 -386883 -36601 122922 -219800 170997 150295 -215256 -86580
9078c55039K9745R4127n5833a30135C04734a71096A88780a08974k7865B62889
$$ -355039 -325294 -231167 -287000 -130135 304734 -171096 188780 -108974 -136839 262889
9067A36497d94307B392b73606A78416h0004c4438A95210b94581J01655A92156
$$ 136497 -494307 2392 -273606 178416 -80004 -34438 195210 -294581 -192926 192156
9056a28179r8485D4272L691K9915b15013O6004G564J42500k5922Q0179e7059j0049
$$ -128179 -226664 44272 47963 77878 -215013 -149009 7564 150064 124142 204321 -57059 -67108
9044f7108N866p2262B23085e9630A28081C2071a48214j41228g7332G3776g6668
$$ -67108 -61242 -133504 223085 -59630 128081 32071 -148214 -289442 -77332 73776 -76668
9032A12067f5585C9971a9189A28743a14229o7067A729J48156e6955k26416A15288
$$ 112067 -65585 39971 -19189 128743 -114229 -181296 1729 149885 -56955 -283371 115288
9020A51414j9229b46747c398C4688a03718L9520l02789e3088o2727k69584J01767
$$ 151414 132185 -246747 -3398 34688 -103718 -64198 -366987 -53088 -115815 -385399 -283632
9009b83632L4479A72161a59749j3956B46218o9843c86749A2262b57569a25493
$$ -283632 -249153 172161 -159749 -173705 246218 176375 -386749 12262 -257569 -125493
8998C8709g0103k98542e1405C9485A7117J35992b58591O7014a6717A6882a31497
$$ 38709 -70103 -368645 -51405 39485 17117 153109 -258591 -191577 -16717 16882 -131497
8986f2841k36000A71621Q8778f4489B47922a36958M5719A90115b17834e0154j83663
$$ -62841 -298841 171621 260399 -64489 247922 -136958 -91239 190115 -217834 -50154 -233817
8975b33817c50k01964O170j08758a23573K1351o2938e6456K7057A51067C8707
$$ -233817 -350 -202314 -196144 -304902 -123573 -102222 -165160 -56456 -29399 151067 38707
8963H783J66974j2623D2648J11578b30647i8575b3460j33278B48682E5199B6255
$$ 8783 175757 163134 42648 154226 -230647 -98575 -23460 -156738 248682 55199 26255
8951A99150E2808M9726J22018d6203B72689A1804J76650g5733L2811H9002Q5581
$$ 199150 52808 102534 224552 -46203 272689 11804 188454 -75733 -42922 89002 174583
8940A74583c2715m5320B59950i2329B89945L444K25424k47216l7582m2225o783
$$ 174583 -32715 -78035 259950 -92329 289945 293389 518813 271597 234015 191790 185007
8929A85007b5011A63461j8494L95607L8226Q95829J458874Q133677M978811D798683
$$ 185007 -25011 163461 144967 540574 578800 1474629 2933503 11067180 16045991 4798683
8918A566609C91051o2554M989C3324J9474d1345j98346a03341A12451j5354M79770
$$ 1566609 391051 328497 333486 33324 52798 -41345 -239691 -103341 112451 97097 576867
8907E76867B767P6382a26265n63766b4359k289g9A5556b01293L2820c0382B39980
$$ 576867 2767 79149 -126265 -690031 -24359 -26648 -79 15556 -201293 -168473 -30382 239980
8894A33210C0637b50702P1942j26353q2853I2790H690J50272b58651B36266A04426
$$ 133210 30637 -250702 -178760 -305113 -387966 92790 8690 158962 -258651 236266 104426
8882D4041d26183B25222b36437m0696L9624a7064j00615F6421k1497c03141k39128
$$ 44041 -426183 225222 -236437 -277133 -237509 -17064 -117679 66421 44924 -303141 -542269
8871e42269a24009H7494b38921J17615j91104J06856g8143k48859A0970b82208
$$ -542269 -124009 87494 -238921 -121306 -312410 -205554 -78143 -327002 10970 -282208
8860A56703G5117J5034c4949m07195A2579a67505g2649k80838J24140b4522j45469
$$ 156703 75117 90151 -34949 -442144 12579 -167505 -72649 -353487 -229347 -24522 -169991
$$ [...]
##END NTUPLES=NMR SPECTRUM
##END=
