
##TITLE=UV1262_M11_1332-1242_90_7409891_1Pyz8EknLK
##JCAMPDX= 6.0         $$ Bruker NMR JCAMP-DX V2.0
##DATA TYPE= NMR SPECTRUM
##DATA CLASS= NTUPLES
##ORIGIN= BRUKER
##OWNER= Administrator
$$ 1.72 TOPSPIN		Version 2.1
$$ 2013-01-24 22:31:34.115 -0500  Administrator@X
$$ Compression mode = diff/dup
##.OBSERVE FREQUENCY= 400.02188249412
##.OBSERVE NUCLEUS= ^1H
##.ACQUISITION MODE= SIMULTANEOUS (DQD)
##.ACQUISITION SCHEME= undefined
##.AVERAGES= 64
##.DIGITISER RES= 22
##SPECTROMETER/DATA SYSTEM= spect
##.PULSE SEQUENCE= noesygpps1d.comp
##.SOLVENT NAME= COFFEE_meoh
##.SHIFT REFERENCE= INTERNAL, COFFEE_meoh, 1, 14.96099
##AUDIT TRAIL= $$ (NUMBER, WHEN, WHO, WHERE, PROCESS, VERSION, WHAT)
$$ ##TITLE= Audit trail, TOPSPIN		Version 2.1
$$ ##JCAMPDX= 5.01
$$ ##ORIGIN= Bruker BioSpin GmbH
$$ ##OWNER= Administrator
$$ $$ E:\/data/COFFEE/nmr/UV1262_M11_1332-1242_90_7409891_1Pyz8EknLK/12/pdata/1/auditp.txt
$$ ##AUDIT TRAIL=  $$ (NUMBER, WHEN, WHO, WHERE, PROCESS, VERSION, WHAT)
(   1,<2013-01-24 22:31:28.287 -0500>,<Administrator>,<X>,<go>,<TOPSPIN 2.1>,
      <created by zg
	started at 2013-01-24 22:19:58.693 -0500,
	POWCHK enabled, PULCHK disabled,
       configuration hash MD5:
       86 BA 57 50 F2 9D 5C 9B 26 00 A9 28 5F 66 2E 89
       data hash MD5: 64K
       26 A0 0D 9A DF 90 C4 AE B1 6D 7A CC D4 79 9C EC>)
(   2,<2013-01-24 22:31:31.365 -0500>,<Administrator>,<X>,<proc1d>,<TOPSPIN 2.1>,
      <Start of raw data processing
       efp LB = 0.3 FT_mod = 6 PKNL = 1 PHC0 = 0 PHC1 = 0 SI = 128K 
       data hash MD5: 128K
       C3 6C C3 71 95 47 7C F0 DE A1 92 0A 5C DA B4 16>)
(   3,<2013-01-24 22:31:32.380 -0500>,<Administrator>,<X>,<proc1d>,<TOPSPIN 2.1>,
      <pk PHC0 = -80.01892 PHC1 = 0 
       data hash MD5: 128K
       16 3D 3E F9 7D 58 07 93 5E 09 6F C9 68 CE F0 96>)
(   4,<2013-01-24 22:31:33.083 -0500>,<Administrator>,<X>,<proc1d>,<TOPSPIN 2.1>,
      <abs ABSG = 1 
       data hash MD5: 128K
       38 DE D6 A7 9B 18 FB 6E 7E 5C 0A 2A 45 04 9B 04>)
(   5,<2013-01-24 22:31:33.255 -0500>,<Administrator>,<X>,<proc1d>,<TOPSPIN 2.1>,
      <abs ABSG = 2 
       data hash MD5: 128K
       84 C7 FE C9 01 1D A3 00 EC DE CB 05 F1 06 39 52>)
(   6,<2013-01-24 22:31:33.443 -0500>,<Administrator>,<X>,<proc1d>,<TOPSPIN 2.1>,
      <abs ABSG = 3 
       data hash MD5: 128K
       79 49 53 F0 14 84 44 B9 0C E7 9A D1 AA 12 D0 E1>)
(   7,<2013-01-24 22:31:33.630 -0500>,<Administrator>,<X>,<proc1d>,<TOPSPIN 2.1>,
      <abs ABSG = 4 
       data hash MD5: 128K
       5D 61 96 24 87 DE 4F 07 5B 25 FB 7F 2C 77 41 BF>)
(   8,<2013-01-24 22:31:33.802 -0500>,<Administrator>,<X>,<proc1d>,<TOPSPIN 2.1>,
      <abs ABSG = 5 
       data hash MD5: 128K
       C1 1E F6 64 0C B6 56 48 36 B4 B3 DD 5D DA 62 BD>)
$$ ##END=
$$ 
$$ $$ hash MD5
$$ $$ 27 38 16 31 49 01 55 47 27 A3 8B 61 DB EA 50 3B
##$RELAX= 
##$RELAX= 
##$RELAX= 
##$RELAX= 
##$RELAX= 
##$RELAX= 
##$RELAX= 
##$RELAX= 
$$ Bruker specific parameters
$$ --------------------------
##$DU= <E:\>
##$EXPNO= 12
$$ [...]
##$TP07= 0
##$TPNAME0= <>
##$TPNAME1= <>
##$TPNAME2= <>
##$TPNAME3= <>
##$TPNAME4= <>
##$TPNAME5= <>
##$TPNAME6= <>
##$TPNAME7= <>
##$TPOAL= (0..7)
0.5 0.5 0.5 0.5 0.5 0.5 0.5 0.5
##$TPOFFS= (0..7)
0 0 0 0 0 0 0 0
##$TUNHIN= 0
##$TUNHOUT= 0
##$TUNXOUT= 0
##$USERA1= <user>
##$USERA2= <user>
##$USERA3= <user>
##$USERA4= <user>
##$USERA5= <user>
##$V9= 5
##$VALIST= <valist>
##$VCLIST= <CCCCCCCCCCCCCCC>
##$VD= 0
##$VDLIST= <DDDDDDDDDDDDDDD>
##$VPLIST= <PPPPPPPPPPPPPPP>
##$VTLIST= <TTTTTTTTTTTTTTT>
##$WBST= 1024
##$WBSW= 4
##$XGAIN= (0..3)
0 0 0 0
##$XL= 0
##$YL= 0
##$YMAX_a= 5883667
##$YMIN_a= -12287345
##$ZGOPTNS= <>
##$ZL1= 120
##$ZL2= 120
##$ZL3= 120
##$ZL4= 120
##$ABSF1= 14.96099
##$ABSF2= -5.597192
##$ABSG= 5
##$ABSL= 3
##$ALPHA= 0
##$AQORDER= 0
##$ASSFAC= 0
##$ASSFACI= 0
##$ASSFACX= 0
##$ASSWID= 0
##$AUNMP= <proc_prof1d_extract.lims>
##$AXLEFT= 0
##$AXNAME= <>
##$AXNUC= <1H>
##$AXRIGHT= 0
##$AXTYPE= 0
##$AXUNIT= <>
##$AZFE= 0.1
##$AZFW= 0.1
##$BCFW= 0
##$BC_mod= 0
##$BYTORDP= 0
##$COROFFS= 0
##$CY= 15
##$DATMOD= 1
##$DC= 0
##$DFILT= <>
##$DTYPP= 0
##$F1P= 0
##$F2P= 0
##$FCOR= 0.5
##$FTSIZE= 131072
##$FT_mod= 6
##$GAMMA= 0
##$GB= 0
##$INTBC= 1
##$INTSCL= 1
##$ISEN= 128
##$LB= 0.3
##$LEV0= 0
##$LPBIN= 0
##$MAXI= 10000
##$MC2= 0
##$MEAN= 0
##$ME_mod= 0
##$MI= 0
##$NCOEF= 0
##$NC_proc= -2
##$NLEV= 6
##$NOISF1= 0
##$NOISF2= 0
##$NSP= 0
##$NTH_PI= 0
##$NZP= 0
##$OFFSET= 14.96099
##$PC= 1
##$PHC0= -80.01892
##$PHC1= 0
##$PH_mod= 1
##$PKNL= yes
##$PPARMOD= 0
##$PPDIAG= 0
##$PPIPTYP= 0
##$PPMPNUM= 2147483647
##$PPRESOL= 1
##$PSCAL= 4
##$PSIGN= 0
##$PYNMP= <proc.py>
##$REVERSE= no
##$SF= 400.020009639675
##$SI= 131072
##$SIGF1= 0
##$SIGF2= 0
##$SINO= 400
##$SIOLD= 131072
##$SPECTYP= <>
##$SREGLST= <1H.CDCl3>
##$SSB= 0
##$STSI= 131072
##$STSR= 0
##$SW_p= 8223.68421052631
##$SYMM= 0
##$S_DEV= 0
##$TDeff= 65536
##$TDoff= 0
##$TI= <>
##$TILT= no
##$TM1= 0
##$TM2= 0
##$TOPLEV= 0
##$USERP1= <user>
##$USERP2= <user>
##$USERP3= <user>
##$USERP4= <user>
##$USERP5= <user>
##$WDW= 1
##$XDIM= 131072
##$YMAX_p= 426459137
##$YMIN_p= -12620
##$CURPLOT= <Network HP LaserJet P1505>
##$CURPRIN= <$Network HP LaserJet P1505>
##$DFORMAT= <normdp>
##$LAYOUT= <+/1D_H.xwp>
##$LFORMAT= <normlp>
##$PFORMAT= <normpl>
##$SURQMSG= 1
$$ End of Bruker specific parameters
$$ ---------------------------------
##NTUPLES= NMR SPECTRUM
##VAR_NAME=  FREQUENCY,     SPECTRUM/REAL,   SPECTRUM/IMAG
##SYMBOL=    X,             R,               I
##VAR_TYPE=  INDEPENDENT,   DEPENDENT,       DEPENDENT
##VAR_FORM=  AFFN,          ASDF,            ASDF
##VAR_DIM=   131072,        131072,          131072
##UNITS=     HZ,            ARBITRARY UNITS, ARBITRARY UNITS
##FACTOR=    0.0627417313425164, 1,          1
##FIRST=     8223.62146879497, 1402,         -56147
##LAST=      0,             3124,            -56660
##MIN=       0,             -12620,          0
##MAX=       8223.62146879497, 426459137,    0
$$ Real data points
##PAGE= N=1
##DATA TABLE= (X++(R..R)), XYDATA
$$ [...]
$$ plain form
63884 515806 502210 489393 477676 467586 459587 453572 448953 445281 442499 440568 439251 438465 438488 439587
63870 439587 441763 445101 450085 457188 466347 477161 489472 503419 519063 536344 555414 576707
63858 576707 600584 627108 656087 687116 719596 753006 787293 822830 859879 898068 936344
63847 936344 973414 1008392 1041022 1071118 1097790 1119660 1136102 1147807 1155685 1159513 1158315 1151948
63835 1151948 1141541 1128115 1111297 1089830 1063083 1031701 996884 959387 919349 877020 833482
63824 833482 790444 749271 710356 673493 638578 605716 574920 546120 519385 494814 472310
63813 472310 451840 433775 418466 405449 393550 381876 370322 359113 348440 338756 330858 325105
63801 325105 320792 316681 312068 307091 302153 297341 292350 286765 280555 274375 269184 265302 262042 258557
$$ packed form
63884E15806j3596j2817j1717j0090p999o015m619l672k782j931j317p86K3J099
63870D39587K176L338M984P103R159J0814J2311J3947J5644J7281J9070K1293
63858E76707K3877K6524K8979L1029L2480L3410L4287L5537L7049L8189L8276
63847I36344L7070L4978L2630L0096K6672K1870J6442J1705P878L828j198o367
63835A151948j0407j3426j6818k1467k6747l1382l4817l7497m0038m2329m3538
63824H33482m3038m1173l8915l6863l4915l2862l0796k8800k6735k4571k2504
63813D72310k0470j8065j5309j3017j1899j1674j1554j1209j0673r684p898n753
63801C25105m313m111m613m977m938m812m991n585o210o180n191l882l260l485
$$ plain form
63787 258557 254893 251875 250048 249092 248293 247238 245908 244418 242901 241544 240501 239744 239051 238165 236989
63772 236989 235712 234744 234371 234437 234466 234189 233829 233733 233817 233600 232758 231436 230000 228726 227854 227647 228099 228675 228680
63753 228680 227935 226936 226301 226280 226778 227626 228600 229345 229507 229052 228450 228407 229249 230491 231200 230964 230415 230606 232042
63734 232042 234546 237859 241858 246197 250181 253226 255191 256220 256599 256940 258116 260760 264891 270095 275849
63719 275849 281726 287592 293675 300062 306107 310810 313863 315843 317152 317305 315631 312272 308154 304315
63705 304315 301487 299809 298564 296646 293769 290845 288816 287562 286467 285515 285120 285246 285521 286029 287268
63690 287268 289378 292007 294904 297994 300958 303359 305211 306848 308258 309077 309262 309146 308812 308048 307042
63675 307042 306610 307548 310114 314065 318705 323021 326527 330031 334808 340796 346367 350233 352820 355228 357548
$$ packed form
63787B58557l664l018j827r56p99j055j330j490j517j357j043p57o93q86j176
63772B36989j277r68l73O6K9k77l60r6Q4k17q42j322j436j274q72k07M52N76N
63753B28680p45r99o35k1M98Q48R74P45J62m55o02m3Q42J242P09k36n49J91J436
63734B32042K504L313L999M339L984L045J965J029L79L41J176K644M131N204N754
63719B75849N877N866O083O387O045M703L053J980J309J53j674l359m118l839
63705C04315k828j678j245j918k877k924k029j254j095r52l95J26K75N08J239
63690B87268K110K629K897L090K964K401J852J637J410Q19J85j16l34p64j006
63675C07042m32R38K566L951M640M316L506L504M777N988N571L866K587K408K320
$$ plain form
63660 357548 358947 359038 358258 356919 354629 350949 346155 341032 336145 331642 327659 324487 322113 319894 317137
63645 317137 313961 311159 309125 307480 305972 305161 305652 307071 308529 309849 311640 314189 317042 319770 322543
63630 322543 325678 329162 332880 337009 341895 347778 354714 362652 371472 381081 391369 401978 412473
63617 412473 423145 435319 450288 468077 487751 508758 531334 555795 582265 611065 642529
63606 642529 676219 711015 746139 781327 815683 847093 873238 892731 905069 910201 908752 902276
63594 902276 892728 881769 870667 860322 850928 841796 831725 819476 804056 785192 763706 740916
63582 740916 717516 693613 669967 648302 629894 614445 600938 589117 579559 572770 568817 567517
63570 567517 568285 570034 571903 574087 577460 582370 588182 594047 599768 605850 612854 620762 628920 636689
$$ packed form
63660C57548J399R1p80j339k290l680m794n123m887m503l983l172k374k219k757
63645C17137l176k802k034j645j508q11M91J419J458J320J791K549K853K728K773
63630C22543L135L484L718M129M886N883O936P938Q820R609J0288J0609J0495
63617D12473J0672J2174J4969J7789J9674K1007K2576K4461K6470K8800L1464
63606F42529L3690L4796L5124L5188L4356L1410K6145J9493J2338N132j449o476
63594I02276r548j0959j1102j0345r394r132j0071j2249j5420j8864k1486k2790
63582G40916k3400k3903k3646k1665j8408j5449j3507j1821r558o789l953j300
63570E67517P68J749J869K184L373M910N812N865N721O082P004P908Q158P769
$$ plain form
63556 636689 644147 651981 660783 670784 682332 696136 712843 732689 755735 782178 812439 847444
63544 847444 888770 937564 992417 1048307 1097999 1134824 1154911 1158147 1147813 1128886 1105859 1081778
63532 1081778 1058728 1038194 1020574 1005107 990924 977650 964575 949975 932121 910675 886444
63521 886444 860139 832078 802818 773209 743849 715059 687373 661490 637751 616120 596637
63510 596637 579440 564362 550951 538899 528193 518896 510991 504314 498398 492638 486945 481919 477952
63497 477952 474402 470167 464933 459357 454167 449629 445791 442650 439965 437374 434842 432649 430872 429160
63483 429160 427208 425206 423710 423212 423855 425477 427908 431240 435659 440960 446404 451177 454881 457500 459129
63468 459129 459859 459634 458115 454907 450103 444336 438232 432110 426256 420995 416261 411584 406786 402324 398681
$$ packed form
63556F36689P458P834Q802J0001J1548J3804J6707J9846K3046K6443L0261L5005
63544H47444M1326M8794N4853N5890M9692L6825K0087L236j0334j8927k3027k4081
63532A081778k3050k0534j7620j5467j4183j3274j3075j4600j7854k1446k4231
63521H86444k6305k8061k9260k9609k9360k8790k7686k5883k3739k1631j9483
63510E96637j7197j5078j3411j2052j0706r297p905o677n916n760n693n026l967
63497D77952l550m235n234n576n190m538l838l141k685k591k532k193j777j712
63483D29160j952k002j496m98O43J622K431L332M419N301N444M773L704K619J629
63468D59129P30k25j519l208m804n767o104o122n854n261m734m677m798m462l643
$$ plain form
63453 398681 395829 393583 392006 391159 390906 391365 393129 396557 401244 406558 412392 419036 426724 435679 446173
63438 446173 458139 471291 486029 503733 525732 552598 584879 623409 667641 713982 756868
63427 756868 791595 815869 829544 834245 833160 829940 827310 827008 830692 839952 855465 876938 903928
63414 903928 936056 972484 1011759 1051983 1090427 1123282 1146911 1159742 1162616 1157536 1146750 1132643
63402 1132643 1117265 1101615 1085916 1070462 1055406 1039859 1022132 1001000 976142 947649 916173
63391 916173 883390 851056 819475 788038 757385 729622 705987 685610 667266 651122 637908
63380 637908 627380 618682 611634 606729 604225 603948 605557 608497 612182 616776 623175 631612 640915 649948
63366 649948 659249 670380 684035 699662 716689 735247 755728 778419 803659 831746 862572 895753
$$ packed form
63453C98681k852k246j577q47k53M59J764L428M687N314N834O644P688Q955J0494
63438D46173J1966J3152J4738J7704K1999K6866L2281L8530M4232M6341M2886
63427G56868L4727K4274J3675M701j085l220k630l02L684R260J5513K1473K6990
63414I03928L2128L6428L9275M0224L8444L2855K3629J2831K874n080j0786j4107
63402A132643j5378j5650j5699j5454j5056j5547j7727k1132k4858k8493l1476
63391I16173l2783l2334l1581l1437l0653k7763k3635k0377j8344j6144j3214
63380F37908j0528q698p048m905k504k77J609K940L685M594O399Q437R303R033
63366F49948R301J1131J3655J5627J7027J8558K0481K2691K5240K8087L0826L3181
$$ plain form
63354 895753 931132 968702 1007945 1047478 1085288 1119089 1146657 1166358 1177566 1180599 1176453 1166691
63342 1166691 1153195 1137628 1121192 1104863 1089309 1074191 1058010 1039250 1017503 993111 966096
63331 966096 936161 903648 869928 836755 805581 777343 752267 729792 709232 690839 675996
63320 675996 666285 662665 665447 674196 686791 698718 704324 699794 685339 664488 641251 617910 595182
63307 595182 573639 554257 537666 523435 510462 497973 486039 475264 466035 458045 450553 443107
63295 443107 435798 428727 421593 414195 407049 400918 395859 391254 386735 382469 378466 374370 370179 366565
63281 366565 364032 362198 360347 358318 356450 354895 353428 351790 349912 347864 345761 343700 341683 339761
63267 339761 338173 337086 336207 335041 333552 332145 330975 329788 328551 327632 327067 326246 324757 323078 322021
$$ packed form
63354H95753L5379L7570L9243L9533L7810L3801K7568J9701J1208L033m146r762
63342A166691j3496j5567j6436j6329j5554j5118j6181j8760k1747k4392k7015
63331I66096k9935l2513l3720l3173l1174k8238k5076k2475k0560j8393j4843
63320F75996r711l620K782Q749J2595J1927N606m530j4455k0851k3237k3341k2728
63307E95182k1543j9382j6591j4231j2973j2489j1934j0775r229p990p492p446
63295D43107p309p071p134p398p146o131n059m605m519m266m003m096m191l614
63281C66565k533j834j851k029j868j555j467j638j878k048k103k061k017j922
63267C39761j588j087q79j166j489j407j170j187j237r19n65q21j489j679j057
$$ plain form
63252 322021 321855 322333 323129 323816 323841 323124 322418 322547 323480 324634 325805 327216 328860 330404 331802 333486 335845
63235 335845 338817 342008 345012 347634 350085 352923 356554 360834 365281 369517 373316 376455 378840 380710
63221 380710 382544 384886 388309 393179 399177 405361 411008 416172 421191 425993 430292 434136 437806 441377
63207 441377 444740 447785 450184 451338 451033 449871 448482 446624 443699 439914 436142 432747 429385 426117
63193 426117 423857 423381 424449 426296 428573 431452 435165 439825 445522 452363 460476 470053 481145 493379
63179 493379 506072 518711 531124 543256 555053 566585 577921 588885 599263 609228 619100 628740
63167 628740 637683 645937 653946 661461 667136 669782 669553 667355 663489 657490 649038 638214 624987 609191
63153 609191 591276 572518 554178 536737 520126 504307 489409 475651 463419 453142 444734 437341
$$ packed form
63252C22021j66M78P96O87K5p17p06J29R33J154J171J411J644J544J398J684K359
63235C35845K972L191L004K622K451K838L631M280M447M236L799L139K385J870
63221C80710J834K342L423M870N998O184N647N164N019M802M299L844L670L571
63207D41377L363L045K399J154l05j162j389j858k925l785l772l395l362l268
63193D26117k260m76J068J847K277K879L713M660N697O841Q113R577J1092J2234
63179D93379J2693J2639J2413J2132J1797J1532J1336J0964J0378R965R872R640
63167F28740Q943Q254Q009P515N675K646k29k198l866n999q452j0824j3227j5796
63153F09191j7915j8758j8340j7441j6611j5819j4898j3758j2232j0277q408p393
$$ plain form
63141 437341 430034 422695 415975 410449 406131 402760 400198 398414 397347 396886 396829 396866 396846 397097 398198 400314
63125 400314 403071 406222 410100 415156 421314 428072 435011 441870 448368 454372 460161 466102 472139 477915
63111 477915 483349 488720 494163 499462 504368 508766 512553 515753 518828 522477 526967 531968 537104 542322
63097 542322 547650 553019 558483 564262 570358 576481 582491 588557 594687 600575 606131 611684 617254 622042
63083 622042 625089 626150 625489 623150 618944 612955 605566 597134 588131 579377 571547 564441 557328 550003
63069 550003 543011 536749 530999 525566 520838 517284 514798 512989 511848 511635 512203 513001 513856 515369 518335
63054 518335 523064 529439 537382 546826 557354 568317 579471 591226 604059 617923 632419 647315
63042 647315 662566 677961 693092 707677 721657 735010 747736 760010 772119 784235 796453
$$ packed form
63141D37341p307p339o720n526m318l371k562j784j067m61n7L7k0K51J101K116
63125D00314K757L151L878N056O158O758O939O859O498O004N789N941O037N776
63111D77915N434N371N443N299M906M398L787L200L075L649M490N001N136N218
63097E42322N328N369N464N779O096O123O010O066O130N888N556N553N570M788
63083F22042L047J061o61k339m206n989p389q432r003q754p830p106p113p325
63069E50003o992o262n750n433m728l554k486j809j141k13N68P98Q55J513K966
63054E18335M729O375P943R444J0528J0963J1154J1755J2833J3864J4496J4896
63042F47315J5251J5395J5131J4585J3980J3353J2726J2274J2109J2116J2218
$$ plain form
63031 796453 808889 821371 833100 843075 850925 856931 861207 863316 862831 859757 854162 845888 835048
63018 835048 822457 809164 795688 781975 767881 753436 738835 724595 711601 700749 692492 686796
63006 686796 683359 681852 682217 684943 690757 699833 711558 725239 740718 757989 776561 795621 814659
62993 814659 833566 852297 870812 889256 907861 926643 945360 963590 980737 996228 1010043
62982 1010043 1022781 1034779 1045325 1053124 1057419 1058181 1055251 1047926 1035593 1018458 997410 973368
62970 973368 946971 918735 889281 859366 829794 801314 774532 749818 727210 706487 687442
62959 687442 670021 654035 638902 624010 609349 595444 582574 570396 558432 546562 534907
62948 534907 523546 512560 502025 491761 481385 470807 460361 450304 440607 431535 423929 418410
$$ packed form
63031G96453J2436J2482J1729R975P850O006M276K109m85l074n595q274j0840
63018H35048j2591j3293j3476j3713j4094j4445j4601j4240j2994j0852q257n696
63006F86796l437j507L65K726N814R076J1725J3681J5479J7271J8572J9060J9038
62993H14659J8907J8731J8515J8444J8605J8782J8717J8230J7147J5491J3815
62982A010043J2738J1998J0546P799M295P62k930p325j2333j7135k1048k4042
62970I73368k6397k8236k9454k9915k9572k8480k6782k4714k2608k0723j9045
62959F87442j7421j5986j5133j4892j4661j3905j2870j2178j1964j1870j1655
62948E34907j1361j0986j0535j0264j0376j0578j0446j0057r697r072p606n519
$$ plain form
62936 418410 414538 411175 407484 403163 398051 392129 385919 380393 376248 373409 371220 369076 366944 365353
62922 365353 364669 364358 363372 361353 359022 357170 355800 354604 353676 353149 352623 351682 350778 350826 351957 353279 353919
62905 353919 353864 353846 354854 357655 362195 367376 371903 375492 378948 383136 388282 394257 401004 408493 416551
62890 416551 424873 433016 440396 446584 451671 456146 460380 464391 468004 470954 472858 473324 472153 469389
62876 469389 465267 460166 454418 448068 441114 433953 427187 420793 414092 406849 399856 393903 388704 383422
62862 383422 377850 372374 367167 362203 357802 354364 351636 349005 346434 344403 342959 341562 339940 338391
62848 338391 337134 335968 334713 333497 332473 331710 331341 331327 331192 330593 330074 330491 331691 332536 332423 332017 332148
62831 332148 332776 333467 334271 335497 336968 338108 338646 338908 339407 340335 341440 342311 342797 343042 343086 342752 342156 341921
$$ packed form
62936D18410l872l363l691m321n112n922o210n526m145k839k189k144k132j591
62922C65353o84l11r86k019k331j852j370j196r28n27n26r41r04M8J131J322O40
62905C53919n5j8J008K801M540N181M527L589L456M188N146N975O747P489Q058
62890D16551Q322Q143P380O188N087M475M234M011L613K950J904M66j171k764
62876D69389m122n101n748o350o954p161o766o394o701p243o993n953n199n282
62862C83422n572n476n207m964m401l438k728k631k571k031j444j397j622j549
62848C38391j257j166j255j216j024p63l69j4j35n99n19M17J200Q45j13m06J31
62831C32148O28O91Q04J226J471J140N38K62M99R28J105Q71M86K45M4l34n96k35
$$ plain form
62813 341921 342443 343272 343788 344140 344861 345848 346562 347119 348246 350086 351960 353501 355170 357314 359552 361507
62797 361507 363526 366200 369634 373458 377108 379884 381332 381868 382486 383641 384987 386465 388904 393157 399252
62782 399252 406841 415872 426327 437853 450265 464011 479590 496803 514958 533483 551894 569616
62770 569616 586340 602307 617740 632250 645171 656164 665060 671393 674614 674651 671889 666708 659382
62757 659382 650200 639360 626834 612610 596961 580376 563405 546648 530547 514998 499552 484218
62745 484218 469689 456558 444760 434038 424444 415897 407725 399284 390867 383457 377651 373196 369441
62732 369441 365910 362506 359528 357400 356134 355132 353782 352209 351286 351933 354401 358059 361808 364951 367709
62717 367709 370681 373942 377124 380301 384123 388934 394465 400721 408415 418014 428979 440555 452815
$$ packed form
62813C41921N22Q29N16L52P21R87P14N57J127J840J874J541J669K144K238J955
62797C61507K019K674L434L824L650K776J448N36O18J155J346J478K439M253O095
62782C99252P589R031J0455J1526J2412J3746J5579J7213J8155J8525J8411J7722
62770E69616J6724J5967J5433J4510J2921J0993Q896O333L221L7k762n181p326
62757F59382r182j0840j2526j4224j5649j6585j6971j6757j6101j5549j5446j5334
62745D84218j4529j3131j1798j0722r594q547q172q441q417p410n806m455l755
62732C69441l531l404k978k128j266j002j350j573r23O47K468L658L749L143K758
62717C67709K972L261L182L177L822M811N531O256P694R599J0965J1576J2260
$$ plain form
62704 452815 466267 480792 495792 511247 528030 547163 569116 593625 619797 646684 674268
62693 674268 703707 736122 771310 808103 845701 883886 922021 958534 991611 1019940 1042669
62682 1042669 1059119 1068813 1071526 1067203 1055980 1038386 1015289 987558 955861 920794 883146 844091
62670 844091 805144 767622 731956 697723 664604 633101 604030 577581 553263 530666 509853
62659 509853 491013 474097 458943 445485 433721 423552 414740 407051 400438 394997 390535 386268 381313
62646 381313 375646 370259 366135 363230 360662 357664 354185 350738 347889 345848 344476 343742 343990 345390 347280
62631 347280 348571 348835 348402 347365 345300 342319 339537 337788 336501 334577 332002 329768 328496 327931 327720
62616 327720 327873 328314 328611 328449 328029 327777 327871 328112 328173 328037 328268 329548 331724 333584 333952 332928 331773 331770
$$ packed form
62704D52815J3452J4525J5000J5455J6783J9133K1953K4509K6172K6887K7584
62693F74268K9439L2415L5188L6793L7598L8185L8135L6513L3077K8329K2729
62682A042669J6450R694K713m323j1223j7594k3097k7731l1697l5067l7648l9055
62670H44091l8947l7522l5666l4233l3119l1503k9071k6449k4318k2597k0813
62659E09853j8840j6916j5154j3458j1764j0169q812p689o613n441m462m267m955
62646C81313n667n387m124k905k568k998l479l447k849k041j372p34K48J400J890
62631C47280J291K64m33j037k065k981k782j749j287j924k575k234j272n65k11
62616C27720J53M41K97j62m20k52R4K41O1j36K31J280K176J860L68j024j155l
$$ plain form
62598 331770 333392 336313 339785 343229 346836 351513 357886 365489 373238 380533 387615 395070 403337 412479
62584 412479 421994 430903 438334 443931 447569 449055 448504 446628 444099 440813 436246 430321 423455 415991
62570 415991 408174 400491 393408 386823 380387 374301 369131 364781 360339 355186 349693 344587 340094 336100
62556 336100 332799 330763 330388 331421 333005 334135 334248 333471 332291 331081 329970 328999 328194 327652 327782 329182
62540 329182 331893 334965 337275 338783 340528 343237 346378 348842 350206 350988 351745 352450 352933 353668 355609
62525 355609 359111 363488 367922 372447 377537 383091 388660 394651 402345 412389 424090 436627 450271
62512 450271 465757 483098 501765 521606 542785 565058 587849 610928 634352 657763 680244
62501 680244 700854 718862 733622 744743 752332 756715 757976 756061 751160 743704 734364 724412 715664
$$ packed form
62598C31770J622K921L472L444L607M677O373P603P749P295P082P455Q267R142
62584D12479R515Q909P431N597L638J486n51j876k529l286m567n925o866p464
62570D15991p817p683p083o585o436o086n170m350m442n153n493n106m493l994
62556C36100l301k036l75J033J584J130J13p77j180j210j111r71q05n42J30J400
62540C29182K711L072K310J508J745K709L141K464J364P82P57P05M83P35J941
62525C55609L502M377M434M525N090N554N569N991P694J0044J1701J2537J3644
62512D50271J5486J7341J8667J9841K1179K2273K2791K3079K3424K3411K2481
62501F80244K0610J8008J4760J1121P589M383J261j915m901p456r340r952q748
$$ plain form
62488 715664 709400 705598 703769 704217 707770 714566 723949 735569 749794 766918 786610 808192 830744
62475 830744 852729 872068 887074 897242 903109 905486 904597 899571 888834 871357 847571 819012
62463 819012 787397 754249 720759 687307 653517 619479 586664 556949 530996 508262 488284
62452 488284 470961 455763 441797 428932 418002 409551 403012 397400 392274 387770 384174 381674 380116
62439 380116 378950 377801 377014 377137 377963 378731 379226 379908 380871 381439 381003 379672 377861 375865 374036 372739
62423 372739 371876 370929 369674 368321 366772 364378 360772 356490 352478 349357 347374 346590 346830 347651 348548 349047
62407 349047 348764 347789 346882 346705 346969 346903 346469 346353 346790 347272 347592 348376 350233 353023 356317 359958 363885
62390 363885 367957 372220 376806 381396 385428 389054 393254 398640 404736 410751 416529 422452 429018 436792
$$ packed form
62488G15664o264l802j829M48L553O796R383J1620J4225J7124J9692K1582K2552
62475H30744K1985J9339J5006J0168N867K377q89n026j0737j7477k3786k8559
62463H19012l1615l3148l3490l3452l3790l4038l2815k9715k5953k2734j9978
62452D88284j7323j5198j3966j2865j0930q451o539n612n126m504l596k500j558
62439C80116j166j149p87J23Q26P68M95O82R63N68m36j331j811j996j829j297
62423C72739q63r47j255j353j549k394l606m282m012l121j983p84K40Q21Q97M99
62407C49047k83r75r07j77K64o6m34j16M37M82L20P84J857K790L294L641L927
62390C63885M072M263M586M590M032L626M200N386O096O015N778N923O566P774
$$ plain form
62376 436792 446161 456764 467734 478810 490610 503564 517307 531540 546737 563468 581648 601030
62364 601030 621843 644353 668446 694380 723490 757324 796380 840318 889097 943104 1002327
62353 1002327 1066020 1133075 1202062 1270850 1336642 1396453 1447468 1487377 1515042 1530907 1536318
62342 1536318 1532395 1519750 1499070 1471472 1438154 1399944 1357303 1310637 1260611 1208274 1155007
62331 1155007 1102438 1052365 1006378 965101 927949 893980 862873 834663 808782 784163 760308
62320 760308 737502 715784 694509 673235 652329 632256 612913 594201 576666 560989 547155
62309 547155 534609 522935 511990 501747 492378 484240 477461 471863 467470 464515 462658 460817 458333
62296 458333 455804 454207 453610 453359 453180 453467 454700 457096 460585 464663 468521 471858 475323 479705 484932
$$ packed form
62376D36792R369J0603J0970J1076J1800J2954J3743J4233J5197J6731J8180J9382
62364F01030K0813K2510K4093K5934K9110L3834L9056M3938M8779N4007N9223
62353A002327O3693O7055O8987O8788O5792N9811N1015L9909K7665J5865N411
62342A536318l923j2645k0680k7598l3318l8210m2641m6666n0026n2337n3267
62331A155007n2569n0073m5987m1277l7152l3969l1107k8210k5881k4619k3855
62320G60308k2806k1718k1275k1274k0906k0073j9343j8712j7535j5677j3834
62309E47155j2546j1674j0945j0243r369q138o779n598m393k955j857j841k484
62296D58333k529j597n97k51j79K87J233K396L489M078L858L337L465M382N227
$$ plain form
62281 484932 490400 495966 501863 507785 512877 516809 520382 524779 530517 537258 544378 551560 559003 567256
62267 567256 576925 588507 602336 618492 636902 657796 681982 710273 742763 779237 820299 867368
62255 867368 921199 980963 1045121 1112676 1183010 1254703 1324918 1389840 1445740 1490084 1522050
62244 1522050 1541921 1550062 1546865 1533440 1511436 1481869 1444813 1400553 1350357 1295731 1237714 1177445
62232 1177445 1116763 1057520 1000757 947078 897279 852007 811239 774748 742606 714686 690160
62221 690160 668162 648590 631569 616582 602810 590047 578570 568341 558952 550095 541513 532799
62209 532799 523893 515527 508592 503211 498918 495387 492465 489878 487514 485720 484716 484098 483482 483218 483818
62194 483818 485176 487158 490450 495818 502798 510120 517300 524866 533170 542002 551397 561820 573293 585181
$$ packed form
62281D84932N468N566N897N922N092L932L573M397N738O741P120P182P443Q253
62267E67256R669J1582J3829J6156J8410K0894K4186K8291L2490L6474M1062M7069
62255H67368N3831N9764O4158O7555P0334P1693P0215O4922N5900M4344L1966
62244A522050J9871Q141l197j3425k2004k9567l7056m4260n0196n4626n8017o0269
62232A177445o0682n9243n6763n3679m9799m5272m0768l6491l2142k7920k4526
62221F90160k1998j9572j7021j4987j3772j2763j1477j0229r389q857q582q714
62209E32799q906q366o935n381m293l531k922k587k364j794j004o18o16k64O00
62194D83818J358J982L292N368O980P322P180P566Q304Q832R395J0423J1473J1888
$$ plain form
62180 585181 597081 609254 621867 634406 646078 656410 665439 673757 682406 692296 703760 717101
62168 717101 733347 753842 779251 809639 845394 887167 934734 986593 1040795 1095470 1148362
62157 1148362 1196607 1237522 1269482 1291981 1305288 1310186 1307664 1298655 1284054 1264710 1240989 1212625
62145 1212625 1179608 1143130 1105147 1067192 1030160 994992 962686 933595 907426 884055 863680
62134 863680 846134 830717 816960 804904 794434 784882 775583 766332 757101 747753 738245 728783 719586
62121 719586 710746 702358 694484 687059 680249 674800 671592 670940 672777 677327 684984 695637 708777 724077
62107 724077 740870 756968 769104 775210 775874 773298 769576 766362 765303 767572 772737 778519 781875 780462
62093 780462 773617 762535 749617 737303 727111 719429 714028 710868 710522 713714 720438 729876 741356
$$ packed form
62180E85181J1900J2173J2613J2539J1672J0332R029Q318Q649R890J1464J3341
62168G17101J6246K0495K5409L0388L5755M1773M7567N1859N4202N4675N2892
62157A148362M8245M0915L1960K2499J3307M898k522r009j4601j9344k3721k8364
62145A212625l3017l6478l7983l7955l7032l5168l2306k9091k6169k3371k0375
62134H63680j7546j5417j3757j2056j0470r552r299r251r231r348r508r462r197
62121G19586q840q388p874p425o810n449l208o52J837M550P657J0653J3140J5300
62107G24077J6793J6098J2136O106O64k576l722l214j059K269N165N782L356j413
62093G80462o845j1082j2918j2314j0192p682n401l160l46L192O724R438J1480
$$ plain form
62080 741356 755012 771157 789407 808987 829626 851636 875330 900864 928415 957862 988425
62069 988425 1019235 1050169 1081587 1113489 1145675 1178593 1213191 1249761 1287566 1325661 1363385
62058 1363385 1399800 1433162 1461213 1481835 1493667 1496700 1492337 1482395 1468011 1449650 1427663 1402137
62046 1402137 1372560 1338555 1300833 1260668 1218685 1175076 1130865 1087797 1046818 1007694 970273
62035 970273 935092 902443 871886 843181 816833 793211 771915 752533 735326 720634 708130
62024 708130 697132 687159 677894 669113 660991 653864 647421 640675 633079 625040 617058 609036 600865 593050
62010 593050 586214 580378 575133 570166 565354 560761 556799 554053 552846 553395 556253 561835 569396 577284
61996 577284 584362 590393 595042 597669 598477 598697 598965 598424 596040 591888 586401 579299 570237 559879 549385
$$ packed form
62080G41356J3656J6145J8250J9580K0639K2010K3694K5534K7551K9447L0563
62069I88425L0810L0934L1418L1902L2186L2918L4598L6570L7805L8095L7724
62058A363385L6415L3362K8051K0622J1832L033m363r942j4384j8361k1987k5526
62046A402137k9577l4005l7722m0165m1983m3609m4211m3068m0979l9124l7421
62035I70273l5181l2649l0557k8705k6348k3622k1296j9382j7207j4692j2504
62024G08130j0998r973r265q781q122p127o443o746p596q039p982q022q171p815
62010E93050o836n836n245m967m812m593l962k746j207N49K858N582P561P888
61996E77284P078O031M649K627Q08K20K68n41k384m152n487p102r062j0358j0494
$$ plain form
61981 549385 539261 529418 519874 510691 501746 493336 486521 482106 479629 478026 476826 476048 475491 475006 475038
61966 475038 476013 477430 478333 478480 478363 478363 478620 479450 481120 483360 485722 488201 490909 493493 495645 497851
61950 497851 500786 504218 507380 510308 513947 519021 525663 534161 545191 559097 575616 594445 615415
61937 615415 638037 661552 685649 710522 736033 761459 786301 810739 834897 858152 879581
61926 879581 898742 915626 930028 941298 948750 952133 951732 948061 941412 931786 919359 904929 889752
61913 889752 875069 862008 851771 845542 844099 847638 855965 868725 885501 905807 928895 953427
61901 953427 977447 998797 1015559 1026276 1030274 1028049 1020960 1010125 995732 977627 956338 933208
61889 933208 909702 886785 864790 843573 822948 803176 784911 768573 754047 741055 729367
$$ packed form
61981E49385j0124r843r544r183q945q410o815m415k477j603j200p78n57m85L2
61966D75038R75J417R03J47j17%K57Q30J670K240K362K479K708K584K152K206
61950D97851K935L432L162K928L639N074O642Q498J1030J3906J6519J8829K0970
61937F15415K2622K3515K4097K4873K5511K5426K4842K4438K4158K3255K1429
61926H79581J9161J6884J4402J1270P452L383m01l671o649r626j2427j4430j5177
61913H89752j4683j3061j0237o229j443L539Q327J2760J6776K0306K3088K4532
61901I53427K4020K1350J6762J0717L998k225p089j0835j4393j8105k1289k3130
61889I33208k3506k2917k1995k1217k0625j9772j8265j6338j4526j2992j1688
$$ plain form
61878 729367 718391 707150 695133 682859 671165 660279 649991 640344 631540 623530 616352 610695
61866 610695 607402 606460 607074 608722 611516 615506 620324 625788 632402 640970 652007 665774 682569 702687
61852 702687 726191 752969 783031 816657 854132 895252 939139 984690 1031152 1077940 1123843
61841 1123843 1166869 1205154 1237766 1264253 1283770 1295190 1298114 1293321 1282199 1266120 1246601 1225812
61829 1225812 1206403 1190550 1179202 1172480 1170787 1175074 1185761 1201782 1221201 1242456 1264365 1285084
61817 1285084 1301944 1312494 1315178 1308992 1293365 1268700 1236326 1197611 1153707 1106314 1057751 1009749
61805 1009749 962933 917892 875835 837488 802232 769308 739201 712868 690149 670007 651981
61794 651981 636281 622666 610305 598879 588840 580433 573185 566509 560220 554369 549111 544817 541756
$$ packed form
61878G29367j0976j1241j2017j2274j1694j0886j0288r647q804q010p178n657
61866F10695l293r42O14J648K794L990M818N464O614Q568J1037J3767J6795K0118
61852G02687K3504K6778L0062L3626L7475M1120M3887M5551M6462M6788M5903
61841A123843M3026L8285L2612K6487J9517J1420K924m793j1122j6079j9519k0789
61829A225812j9409j5853j1348o722j693M287J0687J6021J9419K1255K1909K0719
61817A285084J6860J0550K684o186j5627k4665l2374l8715m3904m7393m8563m8002
61805A009749m6816m5041m2057l8347l5256l2924l0107k6333k2719k0142j8026
61794F51981j5700j3615j2361j1426j0039q407p248o676o289n851n258m294l061
$$ plain form
61781 541756 539585 537538 535038 531801 527598 522605 517842 514547 512987 512393 511986 511528 510922 510011 508974
61766 508974 508420 508866 510374 512687 515357 517840 519934 522090 524876 528207 531520 534617 537842 541486 545498
61751 545498 549729 553994 557963 561509 565079 569176 573524 577306 580229 582785 585491 588456 591797 595760
61737 595760 600138 604047 606666 607950 608487 608895 609452 610061 610479 610714 611131 611924 612737 613135 613290 613656 614128
61720 614128 614114 613471 612758 612422 612236 611812 611258 611020 611251 611597 611555 610881 609580 607493 604077 598970 592753 586666
61702 586666 581390 576538 571601 566811 562626 558911 555257 551684 548434 545449 542717 540749 539970 539957 539994
61687 539994 540019 540201 539965 538516 536206 534270 533101 531886 530155 528662 528277 528868 529752 530640 531613 532630
61671 532630 533546 534277 534657 534429 533616 532643 531950 531699 531875 532300 532600 532592 532721 533729 535827 538568 541383 543870
$$ packed form
61781E41756k171k047k500l237m203m993m763l295j560n94m07m58o06r11j037
61766E08974n54M46J508K313K670K483K094K156K786L331L313L097L225L644M012
61751E45498M231M265L969L546L570M097M348L782K923K556K706K965L341L963
61737E95760M378L909K619J284N37M08N57O09M18K35M17P93Q13L98J55L66M72
61720F14128j4o43p13l36j86m24n54k38K31L46m2o74j301k087l416n107o217o087
61702E86666n276m852m937m790m185l715l654l573l250k985k732j968p79j3L7
61687E39994K5J82k36j449k310j936j169j215j731j493l85N91Q84Q88R73J017
61671E32630R16P31L80k28q13r73o93k51J76M25L00qJ29J008K098K741K815K487
$$ plain form
61653 543870 545773 547290 549305 552641 557079 561684 565994 570183 574213 577706 580753 584005 587721 591479
61639 591479 595069 598905 603176 607209 610106 611535 611552 610143 607231 602831 597059 590337 583533 577381 571695
61624 571695 565777 559590 553841 548845 544166 539620 535837 533404 532147 531592 531471 531352 530463 528463 525933
61609 525933 523546 521124 517898 513357 507458 500361 492397 484105 476037 468633 462282 457151 452865 448819
61595 448819 444850 441191 437732 433957 429691 425340 421263 417590 414780 413550 413845 414483 414238 412797 410467
61580 410467 407588 404554 401742 399011 395771 391911 388129 385070 382719 380883 379596 378693 377734 376757 376354
61565 376354 376482 376033 374320 372321 371539 372138 373022 373397 373381 373231 372819 371965 370795 369663 368993 369051 369601 370002
61547 370002 369920 369711 369882 370491 371264 371916 372137 371771 371305 371639 373034 374798 376399 378245 380829 383710 386048
$$ packed form
61653E43870J903J517K015L336M438M605M310M189M030L493L047L252L716L758
61639E91479L590L836M271M033K897J429J7j409k912m400n772o722o804o152n686
61624E71695n918o187n749m996m679m546l783k433j257n55j21j19q89k000k530
61609E25933k387k422l226m541n899p097p964q292q068p404o351n131m286m046
61595D48819l969l659l459l775m266m351m077l673k810j230K95O38k45j441k330
61580D10467k879l034k812k731l240l860l782l059k351j836j287r03r59r77m03
61565C76354J28m49j713j999p82N99Q84L75j6j50m12q54j170j132o70N8N50M01
61547C70002q2k09J71O09P73O52K21l66m66L34J395J764J601J846K584K881K338
$$ plain form
61530 386048 387683 388964 389919 390357 390485 390635 390514 389481 387499 385201 383038 380980 379036 377473 376343
61515 376343 375225 373660 371615 369511 367882 366911 366173 365010 363331 361792 361029 361008 361303 361592 361559 360771 359141
61498 359141 357249 355735 354621 353592 352641 351989 351523 350801 349541 347840 346069 344700 344024 343836 343701 343647
61482 343647 344100 344937 345279 344711 344086 344492 345839 347189 348106 348934 349956 351013 351877 352411 352371 351623 350530
61465 350530 349700 349366 349363 349545 349799 349852 349559 349282 349494 350141 350832 351498 352379 353439 354298 354751 354936 355078 355447
61446 355447 356439 358217 360273 361804 362535 362842 363140 363599 364432 365973 368293 371051 373870 376739 379943 383697
61430 383697 387832 391808 395160 397913 400323 402255 403307 403695 404443 406256 408670 410825 412727 415118 418330
61415 418330 421895 425217 428085 430524 432594 434394 435890 436708 436365 434734 432100 428871 425402 421944 418461
$$ packed form
61530C86048J635J281R55M38J28J50j21j033j982k298k163k058j944j563j130
61515C76343j118j565k045k104j629r71p38j163j679j539p63k1K95K89l3p88j630
61498C59141j892j514j114j029r51o52m66p22j260j701j771j369o76j88j35n4
61482C43647M53Q37L42n68o25M06J347J350R17Q28J022J057Q64N34m0p48j093
61465C50530q30l34lJ82K54N3k93k77K12O47O91O66Q81J060Q59M53J85J42L69
61446C55447R92J778K056J531P31L07K98M59Q33J541K320K758K819K869L204L754
61430C83697M135L976L352K753K410J932J052L88P48J813K414K155J902K391L212
61415D18330L565L322K868K439K070J800J496Q18l43j631k634l229l469l458l483
$$ plain form
61400 418461 414674 410530 406477 403047 400320 398006 395806 393510 391063 388851 387665 388013 389659 392014
61386 392014 394676 397272 399202 400038 399973 399516 398989 398624 398790 399594 400493 400820 400608 400491 400945 401985 403465
61369 403465 405315 407524 410112 412930 415428 417025 417936 419160 421270 423724 425820 427831 430570 434145
61355 434145 437836 441079 444070 447515 452164 458422 466067 474571 483918 494715 507230 520855 534934
61342 534934 549495 564554 579254 592477 603879 613617 621434 626867 630077 631713 632073 631125 629095
61329 629095 626286 622509 617443 611393 604964 598144 590477 582060 573615 565707 558582 552646 548317 545379
61315 545379 543178 541382 539945 538569 537041 536018 536495 538370 540409 541835 543226 545627 549489 554742
61301 554742 561307 569149 578215 588535 600020 612011 623298 632600 638869 641422 640325 636506 630997
$$ packed form
61400D18461l787m144m053l430k727k314k200k296k447k212j186L48J646K355
61386C92014K662K596J930Q36o5m57n27l65J66Q04Q99L27k12j17M54J040J480
61369D03465J850K209K588K818K498J597R11J224K110K454K096K011K739L575
61355D34145L691L243K991L445M649O258P645Q504R347J0797J2515J3625J4079
61342E34934J4561J5059J4700J3223J1402R738P817N433L210J636L60r48k030
61329F29095k809l777n066o050o429o820p667q417q445p908p125n936m329k938
61315E45379k201j796j437j376j528j023M77J875K039J426J391K401L862N253
61301E54742O565P842R066J0320J1485J1991J1287R302O269K553j097l819n509
$$ plain form
61288 630997 624179 616180 607681 599690 592711 586727 581737 577659 574048 570688 568229 567373 567728 568432 569648
61273 569648 572312 576500 581374 586831 593874 602893 612788 622444 632103 642553 653689 664613 674670
61260 674670 683837 692489 701235 710658 721013 732579 746321 763450 783926 805984 827365 846422
61248 846422 861872 872494 877797 878482 875650 869888 861484 850966 838859 825269 810245 794377 778683
61235 778683 764106 751285 740492 731572 724232 718477 714356 711145 707451 702510 696989 692206 688944
61222 688944 687227 686724 686938 687447 688321 689954 692157 693847 694056 692948 691419 689966 688387 686460 684483
61207 684483 683124 682878 683645 684789 685714 686348 686853 687090 686812 686397 686851 688920 692684 698168 705876 716404
61191 716404 729879 746082 764871 786223 810028 835952 863243 890542 916103 938426 956747
$$ packed form
61288F30997o818p999q499p991o979n984m990m078l611l360k459q56L55P04J216
61273E69648K664M188M874N457P043R019R895R656R659J0450J1136J0924J0057
61260F74670R167Q652Q746R423J0355J1566J3742J7129K0476K2058K1381J9057
61248H46422J5450J0622N303O85k832n762q404j0518j2107j3590j5024j5868j5694
61235G78683j4577j2821j0793q920p340n755m121l211l694m941n521m783l262
61222F88944j717n03K14N09Q74J633K203J690K09j108j529j453j579j927j977
61207F84483j359k46P67J144R25O34N05K37k78m15M54K069L764N484P708J0528
61191G16404J3475J6203J8789K1352K3805K5924K7291K7299K5561K2323J8321
$$ plain form
61180 956747 971153 982465 991876 1000282 1007951 1015006 1021862 1028803 1035354 1040593 1043789 1044280 1041208 1034341
61166 1034341 1024884 1014517 1003610 991339 977394 962358 946251 928191 908197 888109 869717
61155 869717 852723 835593 817863 800658 785264 772152 761350 752853 746484 741898 739018 738197 739802
61142 739802 743773 749578 756378 763077 768275 770441 768558 762852 754695 745587 736441 728019 721439 717504
61128 717504 715712 714710 713817 713533 714615 717393 722071 728967 738016 748629 760394 773604 788854 806447
61114 806447 826387 848582 872746 898289 924490 950789 976981 1003178 1029365 1054833 1078413
61103 1078413 1099513 1118475 1135580 1150311 1162219 1171975 1180696 1188522 1194578 1197945 1197828 1193154 1183053
61090 1183053 1167698 1148019 1124941 1099660 1073998 1049194 1024691 999326 973469 948719 925801
$$ packed form
61180I56747J4406J1312R411Q406P669P055O856O941O551N239L196M91l072o867
61166A034341r457j0367j0907j2271j3945j5036j6107j8060j9994k0088j8392
61155H69717j6994j7130j7730j7205j5394j3112j0802q497o369m586k880q21J605
61142G39802L971N805O800O699N198K166j883n706q157r108r146q422o580l935
61128G17504j792j002q93k84J082K778M678O896R049J0613J1765J3210J5250J7593
61114H06447J9940K2195K4164K5543K6201K6299K6192K6197K6187K5468K3580
61103A078413K1100J8962J7105J4731J1908R756Q721P826O056L367j17m674j0101
61090A183053j5355j9679k3078k5281k5662k4804k4503k5365k5857k4750k2918
$$ plain form
61079 925801 904232 883930 865536 849058 833746 819556 807297 797066 787988 779827 773407 769065
61067 769065 766048 763803 762467 761737 760841 760112 761047 764167 768295 772526 777333 783020 788806 794438 801125
61052 801125 809759 819548 829582 840398 852798 866351 880512 896176 914747 936279 959788 984768
61040 984768 1011358 1039526 1069029 1099838 1132024 1165636 1200886 1237714 1275136 1312156 1349467
61029 1349467 1388834 1430608 1473474 1516981 1562419 1610633 1661082 1713979 1771234 1833987 1900912
61018 1900912 1970039 2040368 2110807 2180047 2249216 2322668 2404606 2497007 2602095 2723867 2864722
61007 2864722 3022916 3195712 3383071 3586802 3809974 4060700 4353655 4704554 5126347
60998 5126347 5634363 6250825 6999474 7901621 8987162 10308695 11940327 13971329 16509519
$$ packed form
61079I25801k1569k0302j8394j6478j5312j4190j2259j0231r078q161o420m342
61067G69065l017k245j336p30q96p29R35L120M128M231M807N687N786N632O687
61052H01125Q634R789J0034J0816J2400J3553J4161J5664J8571K1532K3509K4980
61040I84768K6590K8168K9503L0809L2186L3612L5250L6828L7422L7020L7311
61029A349467L9367M1774M2866M3507M5438M8214N0449N2897N7255O2753O6925
61018A900912O9127P0329P0439O9240O9169P3452Q1938R2401J05088J21772J40855
61007B864722J58194J72796J87359K03731K23172K50726K92955L50899M21793
60998E126347N08016O16462P48649R02147J085541J321533J631632K031002K538190
$$ plain form
60989 16509519 19659416 23419665 27536191 31465518 34563292 36403089 36978911 36646897
60981 36646897 35908275 35236895 35013685 35463405 36527949 37787882 38590462 38360669 36874029
60972 36874029 34298448 31026805 27473030 23959254 20692823 17779152 15245891 13076425
60964 13076425 11239310 9699167 8416368 7350914 6469156 5743277 5145900 4649960 4233332
60955 4233332 3879746 3575638 3309567 3074419 2866692 2682962 2519003 2371969 2240978
60946 2240978 2125330 2023918 1936027 1860557 1794195 1731979 1669878 1605994 1539940 1472557 1405748
60935 1405748 1340964 1278061 1216756 1158460 1105089 1056722 1012160 971277 934936 902824 873312
60924 873312 845548 820066 797211 776454 757411 740172 724483 709852 696543 685221 675525 666234
$$ packed form
60989A6509519L149897L760249M116526L929327L097774J839797N75822l32014
60981C6646897p38622o71380k23210M49720J064544J259933Q02580k29793j486640
60972C6874029k575581l271643l553775l513776l266431k913671k533261k169466
60964A3076425j837115j540143j282799j065454q81758p25879n97377m95940m16628
60955D233332l53586l04108k66071k35148k07727j83730j63959j47034j30991
60946B240978j15648j01412q7891p5470o6362o2216o2101o3884o6054o7383o6809
60935A405748o4784o2903o1305n8296n3371m8367m4562m0883l6341l2112k9512
60924H73312k7764k5482k2855k0757j9043j7239j5689j4631j3309j1322r696r291
$$ plain form
60912 666234 657012 648790 642313 637502 634381 633369 634284 636079 637975 639992 642228 644504 646907 649778
60898 649778 652918 655568 657304 658138 657781 655763 652345 648261 643375 636669 627870 618124 608607 599363 589970
60883 589970 580440 570926 561213 551071 540648 530117 519454 508901 499149 490710 483548 477490 472446
60870 472446 468053 463838 459987 457248 455717 454543 453301 452843 454060 456549 459394 462702 467275 472962
60856 472962 478517 483272 488023 493875 500851 507996 514388 519665 524051 528358 533599 539988 546483 551860
60842 551860 556148 560380 564918 568739 570700 570846 569910 568054 564870 560415 555410 550368 545202 539882 534844
60827 534844 530397 526185 521562 516185 510019 503210 496276 489988 484623 479527 473834 467460 461053 455072
60813 455072 449261 443049 436201 429089 422409 416667 411908 407991 405024 403309 402894 403459 404596 405887 406796
$$ packed form
60912F66234r222q222o477m811l121j012R15J795J896K017K236K276K403K871
60898F49778L140K650J736Q34l57k018l418m084m886o706q799r746r517r244r393
60883E89970r530r514r713j0142j0423j0531j0663j0553r752q439p162o058n044
60870D72446m393m215l851k739j531j174j242m58J217K489K845L308M573N687
60856D72962N555M755M751N852O976P145O392N277M386M307N241O389O495N377
60842E51860M288M232M538L821J961J46r36j856l184m455n005n042n166n320n038
60827E34844m447m212m623n377o166o809o934o288n365n096n693o374o407n981
60813D55072n811o212o848p112o680n742m759l917k967j715m15N65J137J291R09
$$ plain form
60798 406796 406918 406480 406173 406474 407431 409095 411547 414407 416942 418929 420916 423435 426537 430325 435200
60783 435200 441054 446919 452090 457147 463113 469945 476623 482626 488561 495250 502755 510468 517753 524340
60769 524340 530357 536148 541996 547920 553764 559414 564976 570844 577465 584734 591664 597156 601229 605096
60755 605096 609913 615884 622650 629996 637769 645589 653089 660280 667451 674899 682933 691793 701509 712181
60741 712181 724339 738367 753474 768138 781998 796484 812935 830779 848334 864901 881124
60730 881124 897506 913462 927840 939694 948445 953821 955781 954273 948992 939603 926156 909238 889913
60717 889913 869536 849236 829315 809437 789512 770032 751452 733825 717261 702151 688565
60706 688565 675989 663970 652454 641153 629341 616820 604397 592738 581339 569333 556749
$$ packed form
60798D06796J22m38l07L01R57J664K452K860K535J987J987K519L102L788M875
60783D35200N854N865N171N057N966O832O678O003N935O689P505P713P285O587
60769E24340O017N791N848N924N844N650N562N868O621P269O930N492M073L867
60755F05096M817N971O766P346P773P820P500P191P171P448Q034Q860R716J0672
60741G12181J2158J4028J5107J4664J3860J4486J6451J7844J7555J6567J6223
60730H81124J6382J5956J4378J1854Q751N376J960j508n281r389j3447j6918j9325
60717H89913k0377k0300j9921j9878j9925j9480j8580j7627j6564j5110j3586
60706F88565j2576j2019j1516j1301j1812j2521j2423j1659j1399j2006j2584
$$ plain form
60695 556749 544233 532032 520116 508864 498736 489505 480598 471971 463903 456237 448586 441095 434288
60682 434288 428378 423394 419647 417267 415572 413821 412374 412121 412934 413649 413618 413287 413130 412934 412457 411991 411906
60665 411906 412176 412603 413067 413325 413008 411918 410079 407543 404525 401583 399245 397661 397024 397952 400704 404383
60649 404383 407808 411029 415080 420321 426045 431750 437659 443694 448923 452575 454874 456452 457603 458606
60635 458606 460106 462560 465700 469008 472413 476088 479844 483114 485433 486718 487230 487337 487135 486262 484319
60620 484319 481399 477865 473761 468923 463683 458896 455219 452692 450968 449375 446914 442968 438200 434102
60606 434102 431430 429659 428097 426868 426440 426827 427625 428388 428607 427801 426035 423992 422246 420750 419259 417799
60590 417799 416462 415186 414048 413388 413322 413529 413849 414660 416289 418446 420705 423255 426575 430502 434126 436712
$$ packed form
60695E56749j2516j2201j1916j1252j0128r231q907q627q068p666p651p491o807
60682D34288n910m984l747k380j695j751j447k53Q13P15l1l31j57j96m77m66q5
60665D11906K70M27M64K58l17j090j839k536l018k942k338j584o37R28K752L679
60649D04383L425L221M051N241N724N705N909O035N229L652K299J578J151J003
60635D58606J500K454L140L308L405L675L756L270K319J285N12J07k02q73j943
60620D84319k920l534m104m838n240m787l677k527j724j593k461l946m768m098
60606D34102k672j771j562j229m28L87P98P63K19q06j766k043j746j496j491j460
60590D17799j337j276j138o60o6K07L20Q11J629K157K259K550L320L927L624K586
$$ plain form
60574 436712 438467 440397 443612 448673 455317 462768 470453 478579 488074 500017 514959 532568 551923
60561 551923 572363 594024 617261 641518 664976 685352 700830 710339 713476 710525 702518 691080
60549 691080 678088 665188 653365 642960 634259 627960 624889 625493 629820 637752 648946 662888 679594
60536 679594 699998 725038 754348 786276 818884 850191 877663 898651 911781 917314 915941 908090
60524 908090 894818 878532 861968 846750 833349 821932 812515 804585 797353 790481 784152 778501 773455
60511 773455 769199 766369 765535 766640 769114 772513 776996 783147 791374 801598 813610 827637 844474
60498 844474 865204 891052 923380 963475 1012224 1070096 1137324 1213794 1298740 1390672 1487418
60487 1487418 1585907 1681976 1770785 1847469 1907316 1945825 1959467 1946791 1908624 1847374 1766612
$$ packed form
60574D36712J755J930L215N061O644P451P685Q126R495J1943J4942J7609J9355
60561E51923K0440K1661K3237K4257K3458K0376J5478R509L137k951q007j1438
60549F91080j2992j2900j1823j0405q701o299l071O04M327P932J1194J3942J6706
60536F79594K0404K5040K9310L1928L2608L1307K7472K0988J3130N533j373p851
60524I08090j3272j6286j6564j5218j3401j1417r417p930p232o872o329n651n046
60511G73455m256k830q34J105K474L399M483O151Q227J0224J2012J4027J6837
60498H44474K0730K5848L2328M0095M8749N7872O7228P6470Q4946R1932R6746
60487A487418R8489R6069Q8809P6684N9847L8509J3642j2676l8167o1250q0762
$$ plain form
60476 1766612 1671243 1567244 1460579 1356211 1257772 1167436 1085815 1012449 946874 889118 839148
60465 839148 796201 758955 726259 697505 672390 650475 631019 613371 597515 583894 572534
60454 572534 562664 553478 544905 537247 530512 524634 519873 516189 512571 507974 502782 498377 495216 492409
60440 492409 489338 486565 484659 483158 481406 479675 478651 478311 478042 477582 477203 477131 477262 477356 477159 476441 475115
60423 475115 473217 470733 467742 464784 462604 461314 460251 458869 457365 456198 455388 454653 453936 453534 453895
60408 453895 455343 457714 460164 461778 462455 462825 463291 463702 463998 464478 465157 465539 465393 465226 465648 466755 468390
60391 468390 470483 472782 474765 476219 477477 478855 480260 481580 482820 483652 483503 482460 481497 481465 482471
60376 482471 484482 487575 491098 493546 494115 493721 493720 494298 494954 495804 497254 498834 499585 499486 499523 500407 502090 504408
$$ packed form
60476A766612r5369j03999j06665j04368r8439r0336q1621p3366o5575n7756m9970
60465H39148m2947l7246l2696k8754k5115k1915j9456j7648j5856j3621j1360
60454E72534r870r186q573p658o735n878m761l684l618m597n192m405l161k807
60440D92409l071k773j906j501j752j731j024l40k69m60l79p2J31R4j97p18j326
60423D75115j898k484k991k958k180j290j063j382j504j167q10p35p17m02L61
60408D53895J448K371K450J614O77L70M66M11K96M80O79L82j46j67M22J107J635
60391D68390K093K299J983J454J258J378J405J320J240Q32j49j043r63l2J006
60376D82471K011L093L523K448N69l94jN78O56Q50J450J580P51r9L7Q84J683K318
$$ plain form
60358 504408 507246 510042 512016 513089 513928 514979 516054 516917 517642 518301 518874 519550 520607 521956 523349 525081
60342 525081 527892 532051 537022 542112 546909 550978 553769 555110 555444 555284 554702 553473 551450 548704 545624
60327 545624 542957 541379 540826 540533 539929 539248 539102 539644 540444 541135 541973 543583 546166 549183 552060 555042
60311 555042 558929 563973 569589 575351 581689 589209 597883 607479 618432 631664 647996 668495 694912
60298 694912 728380 767089 806117 840267 866862 885527 895905 896577 886392 866336 839606 809895
60286 809895 779820 750888 724303 701092 681492 664827 650316 637582 626213 615398 604568
60275 604568 594037 584528 576258 568941 562427 556773 551807 547194 542917 539221 536128 533438 531177 529536
60261 529536 528393 527381 526445 525866 525618 525228 524388 523289 522138 520786 519121 517481 516298 515512 514681 513652
$$ packed form
60358E04408K838K796J974J073Q39J051J075Q63P25O59N73O76J057J349J393J732
60342E25081K811M159M971N090M797M069K791J341L34j60n82j229k023k746l080
60327E45624k667j578n53k93o04o81j46N42Q00O91Q38J610K583L017K877K982
60311E55042L887N044N616N762O338P520Q674R596J0953J3232J6332K0499K6417
60298F94912L3468L8709L9028L4150K6595J8665J0378O72j0185k0056k6730k9711
60286H09895l0075k8932k6585k3211j9600j6665j4511j2734j1369j0815j0830
60275F04568j0531r509q270p317o514n654m966m613m277l696l093k690k261j641
60261E29536j143j012r36n79k48l90q40j099j151j352j665j640j183p86q31j029
$$ plain form
60245 513652 512810 512621 513060 513637 513939 514015 514208 514731 515562 516660 518025 519539 521016 522447 523930 525369 526602
60228 526602 527993 530407 534318 539157 543780 547367 549739 551253 552679 554730 557293 559408 560375 560602 561056
60213 561056 562298 564491 567774 571906 575894 578840 581048 583585 586822 590202 593402 596790 600517 603950
60199 603950 606514 608493 610477 612437 613875 614656 615193 615793 616200 615831 614333 611871 608989 606264 604032
60184 604032 602281 600651 598522 595451 591719 588288 585966 584650 583521 581896 579744 577540 575816 574719
60170 574719 573828 572568 570956 569737 569580 570357 571408 572183 572418 572104 571682 571897 572928 573966 574214 574036 574545
60153 574545 576267 578870 582068 585978 590501 595093 599388 603497 607529 611408 615372 620082 625794 631841
60139 631841 637334 642085 646483 650733 654674 658348 662357 667463 673795 680486 686203 690132 692403 693448
$$ packed form
60245E13652q42j89M39N77L02P6J93N23Q31J098J365J514J477J431J483J439J233
60228E26602J391K414L911M839M623L587K372J514J426K051K563K115R67K27M54
60213E61056J242K193L283M132L988K946K208K537L237L380L200L388L727L433
60199F03950K564J979J984J960J438P81N37O00M07l69j498k462k882k725k232
60184F04032j751j630k129l071l732l431k322j316j129j625k152k204j724j097
60170E74719q91j260j612j219j57P77J051P75K35l14m22K15J031J038K48j78N09
60153E74545J722K603L198L910M523M592M295M109M032L879L964M710N712O047
60139F31841N493M751M398M250L941L674M009N106O332O691N717L929K271J045
$$ plain form
60125 693448 693226 691366 687913 683491 678718 673880 669270 665463 662987 661922 661945 662671 663839 665259 666700
60110 666700 667907 668935 670440 673281 677495 681896 685071 686640 687156 686976 685791 683315 679863 676020 672031
60095 672031 667752 663018 657965 653117 649146 646373 644555 643391 643058 643954 646008 648746 652013 656114 661064
60080 661064 666159 670664 674648 678753 683172 687153 689524 689567 687309 683147 677415 670431 662821 655461 648971
60065 648971 643320 637956 632196 625617 618390 611283 604997 599361 593548 587185 580850 575230 570266 565520
60051 565520 560985 557041 553822 551021 548248 545349 542617 540837 540738 542168 544216 546408 549111 552385 555229
60036 555229 556820 557967 560336 564411 569077 572992 575483 576199 574987 572429 569772 567895 566582 564813
60022 564813 561480 556003 548785 540942 533193 525285 517025 509348 503422 499007 494810 490414 486745 484442
$$ packed form
60125F93448k22j860l453m422m773m838m610l807k476j065K3P26J168J420J441
60110F66700J207J028J505K841M214M401L175J569N16j80j185k476l452l843l989
60095F72031m279m734n053m848l971k773j818j164l33Q96K054K738L267M101M950
60080F61064N095M505L984M105M419L981K371M3k258m162n732o984p610p360o490
60065F48971n651n364n760o579p227p107o286n636n813o363o335n620m964m746
60051E65520m535l944l219k801k773k899k732j780r9J430K048K192K703L274K844
60036E55229J591J147K369M075M666L915K491P16j212k558k657j877j313j769
60022E64813l333n477p218p843p749p908q260p677n926m415m197m396l669k303
$$ plain form
60008 484442 482827 480891 478475 476124 474526 474370 475948 478565 481041 483123 485723 489422 493593 497421
59994 497421 501047 505082 509581 514108 518395 522373 525901 528874 531396 533610 535741 538395 542224 547034
59980 547034 551789 555824 559407 562809 565537 567000 567270 566625 564971 562448 560039 558703 558116 557029 554740
59965 554740 551578 548126 544654 541342 538487 536258 534590 533341 532407 531732 531466 531979 533481 535679 537987
59950 537987 539979 541529 542676 543552 544327 545130 546088 547354 548748 549541 549133 548024 547494 548102 549105 549617
59934 549617 549650 549532 549003 547721 546250 545590 545753 545572 544164 542045 540579 540563 541609 542728 543329 543626 544152
59917 544152 545051 546052 547015 548167 549740 551682 553770 555648 556723 556524 555418 554579 554929 556367 558242
59902 558242 560208 562325 564687 567329 570277 573379 576270 578779 581159 583724 586528 589604 593142 597116
$$ packed form
60008D84442j615j936k416k351j598j56J578K617K476K082K600L699M171L828
59994D97421L626M035M499M527M287L978L528K973K522K214K131K654L829M810
59980E47034M755M035L583L402K728J463K70o45j654k523k409j336n87j087k289
59965E54740l162l452l472l312k855k229j668j249r34o75k66N13J502K198K308
59950E37987J992J550J147Q76P75Q03R58J266J394P93m08j109n30O08J003N12
59934E49617L3j18n29j282j471o60J63j81j408k119j466j6J046J119O01K97N26
59917E44152Q99J001R63J152J573J942K088J878J075j99j106q39L50J438J875
59902E58242J966K117K362K642K948L102K891K509K380K565K804L076L538L974
$$ plain form
59888 597116 601088 604709 608168 611773 615415 618848 622282 626200 630649 635195 639586 644045 648773 653472
59874 653472 657572 660840 663540 665915 667657 668110 666986 664519 660832 655678 649235 642644 636978 631949
59860 631949 626525 620755 615991 613093 611334 609506 607304 605118 603221 601827 601406 602269 604184 606894 610663
59845 610663 615878 622496 630313 639396 649940 662268 677244 695760 716829 736785 751506 759484
59833 759484 762197 761995 760677 759924 761561 766493 773660 780481 784207 782971 776164 764336 748686 730431
59819 730431 710477 689531 668370 648058 629802 614246 600902 588767 577688 568572 561912 556792
59807 556792 551999 547593 544490 542739 541178 538918 536350 534359 533096 531924 530311 528363 526486 524773
59793 524773 522862 520499 518063 516173 514783 513136 510862 508609 507152 506250 504933 502693 499857 496967
$$ packed form
59888E97116L972L621L459L605L642L433L434L918M449M546M391M459M728M699
59874F53472M100L268K700K375J742M53j124k467l687n154o443o591n666n029
59860F31949n424n770m764k898j759j828k202k186j897j394m21Q63J915K710L769
59845F10663N215O618P817R083J0544J2328J4976J8516K1069J9956J4721P978
59833G59484K713k02j318p53J637M932P167O821L726j236o807j1828j5650j8255
59819G30431j9954k0946k1161k0312j8256j5556j3344j2135j1079r116o660n120
59807E56792m793m406l103j751j561k260k568j991j263j172j613j948j877j713
59793E24773j911k363k436j890j390j647k274k253j457r02j317k240k836k890
$$ plain form
59779 496967 494343 492178 490499 488968 487112 484798 482237 479609 477071 475057 474108 474340 475341 476628 477950
59764 477950 479188 480279 481306 482467 483963 485994 488756 492233 496100 500015 503879 507643 511148 514471
59750 514471 518189 522904 528500 534124 538844 542168 544136 545263 546287 547633 549118 550331 551186 551862 552371
59735 552371 552463 551896 550557 548390 545469 542169 539107 536867 535754 535652 536109 536701 537284 537719 537589 536659 535558
59718 535558 535309 535951 536282 535333 533567 532193 531736 531782 531751 531450 531103 531285 532582 534954 537684 540244 542874
59701 542874 545975 549422 552948 556740 560996 565215 568653 571370 574188 577540 580872 583253 584268 584243 583853
59686 583853 583574 583433 583294 583277 583595 584088 584380 584520 584856 585193 584821 583654 582492 581707 580481 577927 574234
59669 574234 570004 565238 559849 554606 550550 547806 545791 544221 543071 542045 541020 540670 541586 543031 543690
$$ packed form
59779D96967k624k165j679j531j856k314k561k628k538k014r49K32J001J287J322
59764D77950J238J091J027J161J496K031K762L477L867L915L864L764L505L323
59750E14471L718M715N596N624M720L324J968J127J024J346J485J213Q55O76N09
59735E52371R2n67j339k167k921l300l062k240j113j02M57N92N83M35j30r30j101
59718E35558k49O42L31r49j766j374m57M6l1l01l47J82J297K372K730K560K630
59701E42874L101L447L526L792M256M219L438K717K818L352L332K381J015k5l90
59686E83853k79j41j39j7L18M93K92J40L36L37l72j167j162p85j226k554l693
59669E74234m230m766n389n243m056k744k015j570j150j026j025l50R16J445O59
$$ plain form
59654 543690 543599 544281 546869 550972 555496 559703 563317 566406 569381 572520 575325 576867 576743 575130 572058
59639 572058 567449 561876 556409 551550 547038 542883 539789 538246 537806 537648 537404 537174 537120 537289 537580 537716
59623 537716 537452 536788 535809 534531 533202 532450 532586 532973 532651 531380 529548 527334 524734 522258 520764 520464
59607 520464 520724 520925 520991 521068 521260 521719 522509 523397 524181 525019 525918 526209 525266 523509 521894 520605 519115 517431
59589 517431 516305 516103 516303 516290 515926 515248 514323 513512 513146 512865 511947 510300 508425 506418 503805 500448 496718
59572 496718 492715 488182 483395 479255 476290 474352 473484 474146 476208 478523 479974 480414 480343 480294 480733 481808
59556 481808 482926 483235 482798 482586 483099 483799 484284 485246 487648 491428 495479 498637 500505 501719 503589 507163
59540 507163 512592 519627 528433 539445 552991 569902 591638 617991 644549 664309 672789 670863
$$ packed form
59654E43690r1O82K588M103M524M207L614L089K975L139K805J542j24j613l072
59639E72058m609n573n467m859m512m155l094j543m40j58k44k30n4J69K91J36
59623E37716k64o64r79j278j329p52J36L87l22j271j832k214k600k476j494l00
59607E20464K60K01O6P7J92M59P90Q88P84Q38Q99K91r43j757j615j289j490j684
59589E17431j126k02K00j3l64o78r25q11l66k81r18j647j875k007k613l357l730
59572D96718m003m533m787m140k965j938q68O62K062K315J451M40p1m9M39J075
59556D81808J118L09m37k12N13P00M85R62K402L780M051L158J868J214J870L574
59540E07163N429P035Q806J1012J3546J6911K1736K6353K6558J9760Q480j926
$$ plain form
59528 670863 662532 651407 639857 629752 622361 617980 616547 618159 622434 628152 634206 640261 645982
59515 645982 650532 653574 655803 657545 657619 654612 648648 640906 632037 622212 612242 603241 595184 586922 577831
59500 577831 568641 560522 553961 548698 544177 539922 535822 532197 529374 527267 525556 524089 522869 521881
59486 521881 521207 521092 521599 522411 523222 524230 526010 529010 533152 537741 541922 545628 549948 555990 563391
59471 563391 570579 576456 581041 584486 586459 586847 586192 584968 583176 581093 579612 579344 580064 581506 583972
59456 583972 587705 592507 598579 606925 618091 631120 644565 658025 671994 686638 701468 715867
59444 715867 729223 740726 749530 754904 755999 752063 743323 731166 717087 702022 687011 673577
59432 673577 662672 653823 645927 638379 630963 623438 616064 609970 606217 604865 605475 607952 612295 618141
$$ packed form
59528F70863q331j1125j1550j0105p391m381j433J612M275N718O054O055N721
59515F45982M550L042K229J742P4l007n964p742q869r825r970r001q057q262r091
59500E77831r190q119o561n263m521m255m100l625k823k107j711j467j220r88
59486E21881o74j15N07Q12Q11J008J780L000M142M589M181L706M320O042P401
59471E63391P188N877M585L445J973L88o55j224j792k083j481k68P20J442K466
59456E83972L733M802O072Q346J1166J3029J3445J3460J3969J4644J4830J4399
59444G15867J3356J1503Q804N374J095l936q740j2157j4079j5065j5011j3434
59432F73577j0905q849p896p548p416p525p374o094l753j352O10K477M343N846
$$ plain form
59418 618141 625285 634208 645631 660008 677685 698688 722171 747357 775382 808184 843969 875223
59406 875223 893319 894854 882590 861665 836822 812202 790879 774169 763031 759893 766621 780031
59394 780031 791460 792258 779219 754825 724058 691871 662014 636319 614801 596807 581795 569122
59382 569122 558067 548543 541061 535631 531466 528123 526120 525813 526418 526818 526857 527164 528106 529495 531092 532872
59366 532872 534860 537049 539455 542042 544715 547464 550411 553628 557072 560640 564142 567353 570420 574059
59352 574059 579020 585448 593154 602379 613727 627380 642908 659956 678597 698819 720026 741312
59340 741312 762087 782287 802115 821566 840113 856841 870871 881578 888485 891373 890567 886673
59328 886673 879926 870278 858252 845052 831505 817589 803386 789695 777106 765264 753823 743387
$$ packed form
59418F18141P144Q923J1423J4377J7677K1003K3483K5186K8025L2802L5785L1254
59406H75223J8096J535j2264k0925k4843k4620k1323j6710j1138l138O728J3410
59394G80031J1429P98j3039k4394l0767l2187k9857k5695k1518j7994j5012j2673
59382E69122j1055r524p482n430m165l343k003l07O05M00L9L07R42J389J597J780
59366E32872J988K189K406K587K673K749K947L217L444L568L502L211L067L639
59352E74059M961O428P706R225J1348J3653J5528J7048J8641K0222K1207K1286
59340G41312K0775K0200J9828J9451J8547J6728J4030J0707O907K888q06l894
59328H86673o747r648j2026j3200j3547j3916j4203j3691j2589j1842j1441j0436
$$ plain form
59316 743387 734580 726829 719143 711586 704843 698743 692529 686369 681311 677744 675048 672833 671315 670351
59302 670351 669305 668218 667975 668878 670097 671101 672750 676335 682197 689958 699643 711955 727826 748256
59288 748256 774203 805650 840155 872329 895340 904115 898153 881519 859818 837067 815142 795122
59276 795122 778069 764753 755587 750893 750610 753836 759396 766874 776422 787700 799757 811933 824006
59263 824006 835420 845180 852706 858006 860800 860182 855411 846533 834150 819154 802721 785866 768831
59250 768831 751475 734269 718209 703707 690402 678178 667566 658784 651251 644545 639319 636678
59238 636678 636936 639350 642881 646974 651774 657665 664544 671655 678291 684348 689853 694360 697328 698665
59224 698665 698336 695852 690951 684388 677152 669192 659928 649794 640127 631605 623884 616742 610345 604217
$$ packed form
59316G43387q807p751p686p557o743o100o214o160n058l567k696k215j518r64
59302F70351j046j087k43R03J219J004J649L585N862P761R685J2312J5871K0430
59288G48256K5947L1447L4505L2174K3011Q775n962j6634k1701k2751k1925k0020
59276G95122j7053j3316r166m694k83L226N560P478R548J1278J2057J2176J2073
59263H24006J1414R760P526N300K794o18m771q878j2383j4996j6433j6855j7035
59250G68831j7356j7206j6060j4502j3305j2224j0612q782p533o706n226k641
59238F36678K58K414L531M093M800N891O879P111O636O057N505M507K968J337
59224F98665l29k484m901o563p236p960r264j0134r667q522p721p142o397o128
$$ plain form
59210 604217 597247 589257 581625 575870 572240 569939 567950 565480 562417 559623 558020 557306 556385 555130 554682
59195 554682 555885 558539 562347 567342 572968 578021 582188 586570 592100 598460 605102 612119 619325 625606
59181 625606 630290 634350 639190 644907 650659 656115 661506 666716 671379 675649 680085 684993 690504 697011
59167 697011 704849 713779 723303 733241 743611 754349 765545 777371 789267 799789 807948 814174 819249
59154 819249 822732 823247 820068 813727 805260 795470 784752 773088 760410 747311 735055 724380 714728
59141 714728 705227 696015 687885 681014 674875 669255 664583 661184 658909 657576 657237 657800 658773 659612 660177
59126 660177 660891 662623 666234 671895 678869 686209 693688 701868 711343 722120 733746 745886 758642
59113 758642 772270 786614 801023 814913 828173 840747 852145 861793 869601 875740 880107 882711
$$ packed form
59210F04217o970p990p632n755l630k301j989k470l063k794j603p14r21j255m48
59195E54682J203K654L808M995N626N053M167M382N530O360O642P017P206O281
59181F25606M684M060M840N717N752N456N391N210M663M270M436M908N511O507
59167F97011P838Q930R524R938J0370J0738J1196J1826J1896J0522Q159O226N075
59154H19249L483N15l179o341q467r790j0718j1664j2678j3099j2256j0675r652
59141G14728r501r212q130o871o139n620m672l399k275j333l39N63R73Q39N65
59126F60177P14J732L611N661O974P340P479Q180R475J0777J1626J2140J2756
59113G58642J3628J4344J4409J3890J3260J2574J1398R648P808O139M367K604
$$ plain form
59101 882711 884326 885964 887633 888363 887455 884977 881050 875540 868724 861459 854390 847634 841415 836269 832355
59086 832355 829256 826572 823949 820448 814919 807335 798820 790005 780359 769567 758468 747907 737583
59073 737583 726874 716005 705606 695777 686399 677816 670445 664228 659124 655557 653649 652535 651211
59060 651211 649666 648463 647623 646612 645099 643139 640853 638408 635996 633482 630508 627188 624058 621126
59046 621126 617847 614513 612599 612968 614573 615867 616741 618081 620176 622623 625276 628187 631005 633442 635974
59031 635974 639120 642435 645244 648027 651939 657211 663110 669383 676600 685050 694352 704325 715378 727765
59017 727765 741099 754711 767867 779567 788789 795130 798778 799884 798447 794779 789563 783463 777119
59004 777119 771452 767456 765656 766105 768757 773408 779411 785994 792866 800141 807738 815173 821920 827702
$$ packed form
59101H82711J615J638J669P30r08k478l927n510o816p265p069o756o219n146l914
59086H32355l099k684k623l501n529p584q515q815r646j0792j1099j0561j0324
59073G37583j0709j0869j0399r829r378q583p371o217n104l567j908j114j324
59060F51211j545j203q40j011j513j960k286k445k412k514k974l320l130k932
59046F21126l279l334j914L69J605J294Q74J340K095K447K653K911K818K437K532
59031F35974L146L315K809K783L912N272N899O273P217Q450R302R973J1053J2387
59017G27765J3334J3612J3156J1700R222O341L648J106j437l668n216o100o344
59004G77119n667l996j800M49K652M651O003O583O872P275P597P435O747N782
$$ plain form
58990 827702 832562 836835 840790 844034 845571 844622 841075 834987 826292 815385 803405 791374 779458
58977 779458 767581 756287 746466 738609 732856 729365 728134 728855 731387 735908 742169 749170 756207 763703
58963 763703 772359 782063 792331 803273 815243 827885 840224 851403 860629 866836 869151 867458 861994
58950 861994 852845 840494 826262 811375 796021 780138 764591 750615 738509 727873 718880 712215
58938 712215 707840 704758 702061 699459 696762 693554 689571 684977 680289 676176 672982 670185 666810 662682
58924 662682 658581 654793 650486 645225 640123 636397 633639 630693 627589 625298 624081 623417 623245 624018 625731
58909 625731 628057 631241 635667 640747 645465 649944 655447 662910 672466 684156 697901 712860 727944
58896 727944 742916 758011 772665 785859 797606 808998 820940 834070 849764 869654 893882
$$ packed form
58990H27702M860M273L955L244J537r49l547o088q695j0907j1980j2031j1916
58977G79458j1877j1294r821p857n753l491j231P21K532M521O261P001P037P496
58963G63703Q656R704J0268J0942J1970J2642J2339J1179R226O207K315j693n464
58950H61994r149j2351j4232j4887j5354j5883j5547j3976j2106j0636q993o665
58938G12215m375l082k697k602k697l208l983m594m688m113l194k797l375m128
58924F62682m101l788m307n261n102l726k758k946l104k291j217o64j72P73J713
58909F25731K326L184M426N080M718M479N503P463R556J1690J3745J4959J5084
58896G27944J4972J5095J4654J3194J1747J1392J1942J3130J5694J9890K4228
$$ plain form
58885 893882 921014 949852 980119 1011168 1041253 1068533 1091892 1110643 1124474 1133839 1139297 1140263
58873 1140263 1135437 1124647 1109136 1089870 1066931 1040996 1014157 988551 965104 944114 925987
58862 925987 910585 896716 883100 869421 855857 842072 827285 811088 793882 776734 760798
58851 760798 746433 732885 719317 706131 694642 685530 678282 672097 666526 661177 655629 649797 643799
58838 643799 637480 630770 624373 619211 615212 611489 607715 604367 601596 598869 595879 592858 589804 586328
58824 586328 582505 579064 576512 574793 573789 573338 572812 571690 570645 570980 572855 575052 576681 578059 579665
58809 579665 581383 583172 585492 588544 591850 594855 597237 598528 598351 597228 596153 595192 593510 591055 589061
58794 589061 588474 588872 589391 589720 589700 588926 587411 585971 585495 586342 588655 592418 596973 601389 605664 610762
$$ packed form
58885H93882K7132K8838L0267L1049L0085K7280K3359J8751J3831R365N458R66
58873A140263m826j0790j5511j9266k2939k5935k6839k5606k3447k0990j8127
58862I25987j5402j3869j3616j3679j3564j3785j4787j6197j7206j7148j5936
58851G60798j4365j3548j3568j3186j1489r112p248o185n571n349n548n832n998
58838F43799o319o710o397n162l999l723l774l348k771k727k990l021l054l476
58824E86328l823l441k552j719j004m51n26j122j045L35J875K197J629J378J606
58809E79665J718J789K320L052L306L005K382J291j77j123j075r61j682k455j994
58794E89061n87L98N19L29k0p74j515j440m76Q47K313L763M555M416M275N098
$$ plain form
58778 610762 617177 624287 631396 638463 645443 651787 656987 660873 663044 662860 660356 656464 652052 647442
58764 647442 642979 639180 636106 633368 630847 628630 626364 623738 621549 620972 621752 622437 622627 623524 625986
58749 625986 629474 633394 637943 642989 647516 651002 654156 657614 661151 664839 669697 676276 683729 691157
58735 691157 698807 707096 715595 723948 732871 743188 754620 766364 778123 789812 800980 811248
58723 811248 820650 829071 836143 842201 848361 855157 862075 868951 876629 885652 895459 905558 916218 927165
58709 927165 936854 944015 948779 951339 950706 946006 938009 928067 916264 901738 884154 863841 841170
58696 841170 816749 791649 766653 741932 718084 696463 677681 660820 645126 631458 620946
58685 620946 613081 606324 599899 593835 587914 581729 575362 569104 563013 557432 553281 551051 550188 550143 551140
$$ packed form
58778F10762O415P110P109P067O980O344N200L886K171j84k504l892m412m610
58764F47442m463l799l074k738k521k217k266k626k189n77P80O85J90Q97K462
58749F25986L488L920M549N046M527L486L154L458L537L688M858O579P453P428
58735F91157P650Q289Q499Q353Q923J0317J1432J1744J1759J1689J1168J0268
58723H11248R402Q421P072O058O160O796O918O876P678R023R807J0099J0660J0947
58709I27165R689P161M764K560o33m700p997r942j1803j4526j7584k0313k2671
58696H41170k4421k5100k4996k4721k3848k1621j8782j6861j5694j3668j0512
58685F20946p865o757o425o064n921o185o367o258o091n581m151k230q63m5R97
$$ plain form
58670 551140 553196 555439 557375 559912 564115 569869 576750 585278 596139 608939 622713 636785 650097
58657 650097 660666 667013 669512 669371 667122 663129 658497 654126 649627 644433 639177 634682 630408 625307
58643 625307 619610 614459 610334 607069 604765 603469 602607 601933 602325 604413 607161 609119 610304 611468 612317
58628 612317 612053 611011 610079 608933 606493 602812 598966 595384 591794 588600 586779 586542 587514 590156 595651
58613 595651 604389 615727 629129 644286 660137 674954 687547 697598 704935 709401 711247 710837 708161
58600 708161 703371 697388 691164 684749 677847 670675 663464 655854 647848 640740 636001 633761 633360 634720
58586 634720 638136 643385 650112 658462 668403 679160 690336 702568 715953 728915 739989 749641 758857
58573 758857 767107 773455 778681 784399 790964 798140 806939 818641 832704 847887 864829 885128 908169
$$ packed form
58670E51140K056K243J936K537M203N754O881Q528J0861J2800J3774J4072J3312
58657F50097J0569O347K499j41k249l993m632m371m499n194n256m495m274n101
58643F25307n697n151m125l265k304j296q62o74L92K088K748J958J185J164Q49
58628F12317k64j042r32j146k440l681l846l582l590l194j821k37R72K642N495
58613E95651Q738J1338J3402J5157J5851J4817J2593J0051P337M466J846m10k676
58600G08161m790n983o224o415o902p172p211p610q006p108m739k240m01J360
58586F34720L416N249O727Q350R941J0757J1176J2232J3385J2962J1074R652R216
58573G58857Q250O348N226N718O565P176Q799J1702J4063J5183J6942K0299K3041
$$ plain form
58560 908169 931391 953774 976691 1001011 1025453 1048257 1068474 1085135 1096963 1103690 1106251 1105204
58548 1105204 1100245 1091579 1080481 1068116 1054934 1041349 1027807 1014058 999493 984254 968917 953212
58536 953212 936307 918244 899842 881301 862244 843116 825258 809621 796432 785844 777731 771160
58524 771160 765414 761203 759588 760165 761644 763704 766673 769920 772398 774441 777211 780565 783275 785221
58510 785221 787588 790924 794666 798548 802762 806732 809267 810001 809369 807484 804462 801328 798905 796242 791885
58495 791885 786197 780647 775405 769737 764184 760000 756815 753301 749950 748671 749653 751104 752225 754037
58481 754037 757106 760919 765878 773493 784087 796412 809744 824176 838695 851450 862243 872297
58469 872297 881112 886124 886097 882431 876519 868267 858001 847379 837400 827714 818652 811733 807290 803894
$$ packed form
58560I08169K3222K2383K2917K4320K4442K2804K0217J6661J1828O727K561j047
58548A105204m959q666j1098j2365j3182j3585j3542j3749j4565j5239j5337j5705
58536I53212j6905j8063j8402j8541j9057j9128j7858j5637j3189j0588q113o571
58524G71160n746m211j615N77J479K060K969L247K478K043K770L354K710J946
58510G85221K367L336L742L882M214L970K535P34o32j885l022l134k423k663m357
58495G91885n688n550n242n668n553m184l185l514l351j279R82J451J121J812
58481G54037L069L813M959P615J0594J2325J3332J4432J4519J2755J0793J0054
58469H72297Q815N012k7l666n912q252j0266j0622r979r686r062o919m443l396
$$ plain form
58455 803894 801115 800674 803827 809622 816692 824728 833200 840652 846355 850902 854302 855307 853401 849654
58441 849654 844841 838693 831641 825315 820512 816625 813768 813314 815577 819050 822717 827059 832119 836840
58427 836840 841120 846240 852463 858597 864750 872955 883968 895899 907145 918178 929202 938619 945327
58414 945327 950214 953913 955345 954070 951811 949970 947615 943521 938230 932579 926100 918470 910751 903799
58400 903799 897170 890850 886135 883569 881954 880615 880586 882363 884688 886844 889877 894063 897419 898383 897926
58385 897926 897502 896971 896069 895832 896876 898135 898799 899685 901423 903293 905061 907824 911810 915653 919121 924139
58369 924139 931683 940105 947971 956087 965286 974881 984959 997486 1013238 1030110 1046261 1062416 1079315
58356 1079315 1095586 1110060 1123609 1136668 1147512 1154992 1160526 1165456 1169064 1171053 1173214 1176595 1179808
$$ packed form
58455H03894k779m41L153N795P070Q036Q472P452N703M547L400J005j906l747
58441H49654m813o148p052o326m803l887k857m54K263L473L667M342N060M721
58427H36840M280N120O223O134O153Q205J1013J1931J1246J1033J1024R417O708
58414I45327M887L699J432j275k259j841k355m094n291n651o479p630p719o952
58400I03799o629o320m715k566j615j339k9J777K325K156L033M186L356R64m57
58385H97926m24n31r02k37J044J259O64Q86J738J870J768K763L986L843L468N018
58369I24139P544Q422P866Q116R199R595J0078J2527J5752J6872J6151J6155J6899
58356A079315J6271J4474J3549J3059J0844P480N534M930L608J989K161L381L213
$$ plain form
58343 1179808 1182243 1186121 1193165 1202048 1211267 1221626 1233733 1246159 1258469 1272902 1290533 1308910
58331 1308910 1326057 1343567 1362923 1382163 1399218 1415303 1431748 1446650 1458043 1467434 1476887 1485500
58319 1485500 1492073 1498264 1505689 1512845 1518238 1523569 1530536 1537741 1544306 1553026 1566048 1580795 1594306
58306 1594306 1608248 1625288 1643819 1661030 1678222 1698247 1720297 1741993 1764051 1788189 1812797
58295 1812797 1835367 1856882 1879429 1902021 1923211 1945106 1970159 1996722 2022454 2049231 2079754
58284 2079754 2112254 2143724 2175604 2210975 2248846 2286484 2324678 2365346 2406794 2446919 2488261
58273 2488261 2534197 2582892 2630727 2678890 2730676 2785187 2839825 2896125 2956979 3021018 3086034
58262 3086034 3154817 3230996 3312207 3394039 3477529 3565740 3656321 3744859 3832411 3922180 4012172
$$ packed form
58343A179808K435L878P044Q883R219J0359J2107J2426J2310J4433J7631J8377
58331A308910J7147J7510J9356J9240J7055J6085J6445J4902J1393R391R453Q613
58319A485500O573O191P425P156N393N331O967P205O565Q720J3022J4747J3511
58306A594306J3942J7040J8531J7211J7192K0025K2050K1696K2058K4138K4608
58295A812797K2570K1515K2547K2592K1190K1895K5053K6563K5732K6777L0523
58284B079754L2500L1470L1880L5371L7871L7638L8194M0668M1448M0125M1342
58273B488261M5936M8695M7835M8163N1786N4511N4638N6300O0854O4039O5016
58262C086034O8783P6179Q1211Q1832Q3490Q8211R0581Q8538Q7552Q9769Q9992
$$ plain form
58251 4012172 4099117 4186323 4279371 4377261 4476265 4579089 4691269 4811777 4936397 5067124
58241 5067124 5208691 5359181 5514070 5676342 5852288 6040562 6236046 6441122 6661905
58232 6661905 6896697 7139993 7394763 7668758 7961926 8269919 8596401 8948705 9325125
58223 9325125 9720622 10141321 10598526 11092382 11617335 12179827 12793601 13461424 14179611
58214 14179611 14956951 15810164 16744682 17760493 18873109 20107144 21474023 22980455
58206 22980455 24654877 26540084 28665699 31058205 33774799 36897515 40502583 44675555
58198 44675555 49555002 55324763 62174730 70321593 80065022 91775430 105854847 122806891
58190 122806891 143351347 168362490 198630509 234622373 276094433 321191791 365417239
$$ packed form
58251D012172Q6945Q7206R3048R7890R9004J02824J12180J20508J24620J30727
58241E067124J41567J50490J54889J62272J75946J88274J95484K05076K20783
58232F661905K34792K43296K54770K73995K93168L07993L26482L52304L76420
58223I325125L95497M20699M57205M93856N24953N62492O13774O67823P18187
58214A4179611P77340Q53213R34518J015811J112616J234035J366879J506432
58206B2980455J674422J885207K125615K392506K716594L122716L605068M172972
58198D4675555M879447N769761O849967Q146863R743429J1710408J4079417J6952044
58190A22806891K0544456K5011143L0268019L5991864M1472060M5097358M4225448
$$ plain form
58183 365417239 401851668 423488532 426459137 411669851 383702555 348272587 310301640
58176 310301640 273324966 239601418 210333088 185989042 166695321 152327357 142194725
58169 142194725 134806947 128223642 120834192 111940564 101757637 90990449 80382766
58162 80382766 70473777 61558307 53741214 47002351 41249600 36363710 32227655 28731469
58154 28731469 25767547 23238128 21068178 19202573 17592876 16195479 14978272 13916269
58146 13916269 12980577 12141457 11380661 10689821 10057350 9467637 8912683 8393687 7910561
58137 7910561 7459644 7041697 6661538 6318280 6004947 5718667 5462391 5235488 5031048
58128 5031048 4843288 4669309 4502972 4335764 4165535 3997090 3833380 3673506 3519620
$$ packed form
58183C65417239L6434429K1636864K970605j4789286k7967296l5429968l7970947
58176C10301640l6976674l3723548k9268330k4344046j9293721j4367964j0132632
58169A42194725p387778o583305p389450q893628j0182927j0767188j0607683
58162H0382766r908989q915470p817093o738863n752751m885890m136055l496186
58154B8731469k963922k529419k169950j865605j609697j397397j217207j062003
58146A3916269r35692q39120p60796o90840o32471n89713n54954n18996m83126
58137G910561m50917m17947l80159l43258l13333k86280k56276k26903k04440
58128E031048j87760j73979j66337j67208j70229j68445j63710j59874j53886
$$ plain form
58119 3519620 3377238 3247139 3124479 3007387 2899230 2801076 2709166 2621522 2540149 2465008
58109 2465008 2392500 2321717 2255868 2195729 2137706 2080010 2024880 1973087 1921979 1870550 1820937
58098 1820937 1773503 1725918 1678424 1634561 1595298 1557813 1521224 1487992 1458354 1429060 1399234
58087 1399234 1372043 1348843 1326998 1305190 1285562 1268681 1251534 1232591 1213942 1196401 1177365
58076 1177365 1155665 1133825 1113270 1091815 1068179 1044646 1022853 1001130 978405 956823 938058
58065 938058 920655 903310 887397 874100 862329 851398 842540 835940 829392 821504 813109 804214 793070
58052 793070 779719 766946 756173 745879 735438 726651 719824 712290 702852 693955 687293 680904 672961
58039 672961 664946 658529 652503 645433 638444 632822 627490 621213 614812 608991 602436 594218 585663 577767
$$ packed form
58119C519620j42382j30099j22660j17092j08157r8154r1910q7644q1373p5141
58109B465008p2508p0783o5849o0139n8023n7696n5130n1793n1108n1429m9613
58098A820937m7434m7585m7494m3863l9263l7485l6589l3232k9638k9294k9826
58087A399234k7191k3200k1845k1808j9628j6881j7147j8943j8649j7541j9036
58076A177365k1700k1840k0555k1455k3636k3533k1793k1723k2725k1582j8765
58065I38058j7403j7345j5913j3297j1771j0931q858o600o548p888q395q895j1144
58052G93070j3351j2773j0773j0294j0441q787o827p534r438q897o662o389p943
58039F72961q015o417o026p070o989n622n332o277o401n821o555q218q555p896
$$ plain form
58025 577767 569275 559381 549867 542330 535585 527986 520173 513425 507320 501094 495361 490642 486031 481021
58011 481021 476691 473527 470165 465890 462247 460475 459491 458085 456942 456776 456522 455174 453435 451961 450009
57996 450009 447473 446056 446652 447593 447311 446803 447731 450076 453305 457790 463270 467990 471184 474432 478712
57981 478712 482196 482953 481856 480673 479201 476539 473510 471463 470022 468142 466217 465181 464660 463825 462970
57966 462970 462663 462498 462139 462349 463547 464675 464861 464804 465253 465574 465072 464123 462721 459710 454868 449969 446303
57949 446303 442896 438584 433921 429571 424920 419967 416432 415050 413902 411501 409461 409831 411818 413727
57935 413727 416331 421485 428856 436724 444886 454092 463671 472331 480445 489060 497431 503941 508833 513693
57921 513693 518761 522934 525863 527923 528592 526947 523383 518976 513599 506452 497975 489474 481328 473192
$$ packed form
58025E77767q492r894r514p537o745p599p813o748o105o226n733m719m611n010
58011D81021m330l164l362m275l643j772r84j406j143j66k54j348j739j474j952
57996D50009k536j417N96R41k82n08R28K345L229M485N480M720L194L248M280
57981D78712L484P57j097j183j472k662l029k047j441j880j925j036n21q35q55
57966D62970l07j65l59K10J198J128J86n7M49L21n02r49j402l011m842m899l666
57949D46303l407m312m663m350m651m953l535j382j148k401k040L70J987J909
57935D13727K604N154P371P868Q162R206R579Q660Q114Q615Q371O510M892M860
57921E13693N068M173K929K060O69j645l564m407n377p147q477q501q146q136
$$ plain form
57907 473192 465344 458185 450959 442618 433396 424098 414581 404495 394715 386349 379080 372006 365295 359394
57893 359394 353590 347129 340868 336060 332391 329039 326648 326210 326863 326969 326694 327434 329318 331404 333749
57878 333749 337085 340833 343587 345251 346693 347661 347165 345631 344504 343831 342337 339868 337627 335847 333276
57863 333276 329301 324826 320687 316754 313019 310157 308616 308177 308601 309803 311600 314247 318775 325635 333480
57848 333480 340585 347002 354009 362008 370457 379354 389088 399112 408279 416285 423411 429220 432928 434644
57834 434644 434869 433285 429512 424432 419203 413595 407014 400403 395175 390874 386028 380897 377151 374982
57820 374982 372769 369657 366409 363632 361170 359392 359118 359976 360632 360780 361193 361834 361872 361639 362447 364166 364989
57803 364989 363983 361927 359178 354764 348307 341096 334459 328575 323430 319330 315910 312238 308527 306166
$$ packed form
57907D73192p848p159p226q341r222r298r517j0086r780q366p269p074o711n901
57893C59394n804o461o261m808l669l352k391m38O53J06k75P40J884K086K345
57878C33749L336L748K754J664J442R68m96j534j127o73j494k469k241j780k571
57863C33276l975m475m139l933l735k862j541m39M24J202J797K647M528O860P845
57848C33480P105O417P007P999Q449Q897R734J0024R167Q006P126N809L708J716
57834D34644K25j584l773n080n229n608o581o611n228m301m846n131l746k169
57820C74982k213l112l248k777k462j778k74Q58O56J48M13O41L8k33Q08J719Q23
57803C64989j006k056k749m414o457p211o637n884n145m100l420l672l711k361
$$ plain form
57789 306166 305478 305098 304276 304074 305292 306766 306890 305667 304143 302804 301592 300739 300631 301277 302486 304076
57773 304076 305709 307252 309467 313505 319483 326335 333144 339716 345875 351272 356047 360565 364297 366026
57759 366026 365299 362747 358969 354184 348887 343565 337744 330654 322862 315826 309755 303464 296545 290100
57745 290100 284923 280565 276696 273852 272098 270277 267369 263544 259365 255073 251170 248524 247248 246475
57731 246475 245702 245418 246016 247127 248344 249583 250480 250566 250369 251110 253022 255128 256902 258748 260570 261362
57715 261362 260786 259791 259120 258499 257812 257619 257855 257403 255755 253832 252429 251103 249373 247769 246766 245817
57699 245817 244389 242960 242149 241716 241227 240862 240910 241226 241797 242960 244559 245753 246115 246060 245877 245461 245282 246339
57681 246339 248664 251181 253576 256981 262210 268798 276608 286911 300861 318223 338799 364008 395951
$$ packed form
57789C06166o88l80q22k02J218J474J24j223j524j339j212q53j08O46J209J590
57773C04076J633J543K215M038N978O852O809O572O159N397M775M518L732J729
57759C66026p27k552l778m785n297n322n821p090p792p036o071o291o919o445
57745B90100n177m358l869k844j754j821k908l825m179m292l903k646j276p73
57731B46475p73k84N98J111J217J239Q97Q6j97P41J912K106J774J846J822P92
57715B61362n76r95o71o21o87j93K36m52j648j923j403j326j730j604j003r49
57699B45817j428j429q11m33m89l65M8L16N71J163J599J194L62n5j83m16j79J057
57681B46339K325K517K395L405N229O588P810J0303J3950J7362K0576K5209L1943
$$ plain form
57668 395951 435960 485216 545629 618039 698926 779022 845117 884303 889379 862412 812973 752049
57656 752049 687437 623850 564708 512186 466758 428161 396331 370753 350016 332930 319239
57645 319239 308478 299342 291092 284448 280010 276822 273602 270453 268218 267004 266417 266432 266950 267332 267318 267649
57629 267649 268736 269602 269215 268024 267129 266661 266041 265099 263878 262085 259784 257869 256839 255820 253854 251381
57613 251381 249445 248176 247118 246263 245658 244776 243412 242523 243045 244612 246483 248875 252150 255475 257630
57598 257630 258541 258827 258511 257479 256458 256098 255624 253864 251195 249092 248068 247332 246180 244480 242144 239357
57582 239357 237028 235796 234927 233289 231026 229107 227676 226173 224703 223849 223364 222421 221079 220174 219782 219027
57566 219027 217463 215504 213509 211486 209734 208705 208181 207579 207051 207285 208210 208873 208744 208305 208272 208923 210165
$$ packed form
57668C95951M0009M9256O0413P2410Q0887Q0096O6095L9186N076k6967m9439o0924
57656G52049o4612o3587n9142n2522m5428l8597l1830k5578k0737j7086j3691
57645C19239j0761r136q250o644m438l188l220l149k235j214n87J5N18L82j4L31
57629B67649J087Q66l87j191q95m68o20r42j221j793k301j915j030j019j966k473
57613B51381j936j269j058q55o05q82j364q89N22J567J871K392L275L325K155
57598B57630R11K86l16j032j021l60m74j760k669k103j024p36j152j700k336k787
57582B39357k329j232q69j638k263j919j431j503j470q54m85r43j342r05l92p55
57566B19027j564j959j995k023j752j029n24o02n28K34R25O63j29m39l3O51J242
$$ plain form
57549 210165 211614 212685 213211 213736 214625 215295 215093 214502 214640 215915 217995 220688 223868 226941 229392 231602
57533 231602 234164 236684 238256 238825 239117 239481 239825 240422 241681 243225 244180 244325 244169 244100 244290 245098 246655
57516 246655 248270 249112 249215 249052 248611 247826 247426 248194 249754 251198 252536 254330 256269 257343 257280 256680 255875
57499 255875 254780 253618 252700 251732 250386 249205 248748 248343 247045 245471 245127 246154 247313 248065 248934 249810
57483 249810 249735 248766 248366 249325 250725 251569 252092 252760 253168 252802 251988 251325 250888 250618 250853 251843 253169 254086
57465 254086 254160 253467 252593 252403 253280 254686 256008 257653 260549 264721 269176 273094 276348 278956 280883 282362
57449 282362 283701 284878 285896 287154 288658 289393 288595 287178 286716 287361 288064 288558 289640 291623 293996 296661
57433 296661 300075 304012 307515 310243 312624 314655 315967 317177 319623 323379 326869 328906 329885 330628 331391
$$ packed form
57549B10165J449J071N26N25Q89O70k02n91J38J275K080K693L180L073K451K210
57533B31602K562K520J572N69K92L64L44N97J259J544R55J45j56o9J90Q08J557
57516B46655J615Q42J03j63m41p85m00P68J560J444J338J794J939J074o3o00q05
57499B55875j095j162r18r68j346j181m57m05j298j574l44J027J159P52Q69Q76
57483B49810p5r69m00R59J400Q44N23O68M08l66q14o63m37k70K35R90J326R17
57465B54086P4o93q74j90Q77J406J322J645K896M172M455L918L254K608J927J479
57449B82362J339J177J018J258J504P35p98j417m62O45P03M94J082J983K373K665
57433B96661L414L937L503K728K381K031J312J210K446L756L490K037R79P43P63
$$ plain form
57418 331391 332426 334250 336751 339029 340544 341581 342404 343094 344270 346695 349895 352494 354205 356146 358842
57403 358842 361373 362975 364183 365794 367971 370830 374627 378821 382247 384795 387598 391062 394201 396598
57389 396598 399488 403872 408885 413090 416295 419115 421889 425067 429626 435874 442634 448627 453923 459153
57375 459153 464094 468050 470946 473123 474677 475876 477611 480593 484557 488867 493293 497625 501390 504638
57361 504638 508297 512932 517879 522313 526504 531265 536805 542916 549654 557055 564676 572097 579396 586650
57347 586650 593574 600153 606922 614119 621332 628452 636077 644378 652519 659959 667369 675443 683686 691321
57333 691321 698637 706402 714623 722851 731125 739715 748416 756964 765693 774935 784364 793702 803545 814613
57319 814613 826650 838835 850777 862436 873675 884787 896830 910457 924836 938633 951651
$$ packed form
57418C31391J035J824K501K278J515J037Q23O90J176K425L200K599J711J941K696
57403C58842K531J602J208J611K177K859L797M194L426K548K803L464L139K397
57389C96598K890M384N013M205L205K820K774L178M559O248O760N993N296N230
57375D59153M941L956K896K177J554J199J735K982L964M310M426M332L765L248
57361E04638L659M635M947M434M191M761N540O111O738P401P621P421P299P254
57347E86650O924O579O769P197P213P120P625Q301Q141P440P410Q074Q243P635
57333F91321P316P765Q221Q228Q274Q590Q701Q548Q729R242R429R338R843J1068
57319H14613J2037J2185J1942J1659J1239J1112J2043J3627J4379J3797J3018
$$ plain form
57308 951651 964652 977992 991480 1005316 1020106 1035977 1052414 1068979 1085591 1102285 1119280
57297 1119280 1137147 1156297 1176387 1196706 1217023 1237664 1258954 1280924 1303346 1325776 1347813
57286 1347813 1369558 1391518 1413924 1436651 1459870 1484054 1509036 1533810 1557745 1581422 1605803
57275 1605803 1631082 1656730 1682164 1707100 1731796 1757181 1784086 1812154 1840238 1867997 1896177
57264 1896177 1925115 1954078 1982495 2010699 2038945 2066763 2093941 2121045 2148305 2175100 2201343
57253 2201343 2228271 2256834 2286259 2315208 2343552 2372063 2401108 2430641 2460747 2491246 2521514
57242 2521514 2551595 2582809 2616237 2651229 2686347 2721168 2756239 2791807 2827545 2863095 2898153
57231 2898153 2932474 2966404 3000825 3036041 3071456 3106800 3142731 3179669 3217238 3255597 3295999
$$ packed form
57308I51651J3001J3340J3488J3836J4790J5871J6437J6565J6612J6694J6995
57297A119280J7867J9150K0090K0319K0317K0641K1290K1970K2422K2430K2037
57286A347813K1745K1960K2406K2727K3219K4184K4982K4774K3935K3677K4381
57275A605803K5279K5648K5434K4936K4696K5385K6905K8068K8084K7759K8180
57264A896177K8938K8963K8417K8204K8246K7818K7178K7104K7260K6795K6243
57253B201343K6928K8563K9425K8949K8344K8511K9045K9533L0106L0499L0268
57242B521514L0081L1214L3428L4992L5118L4821L5071L5568L5738L5550L5058
57231B898153L4321L3930L4421L5216L5415L5344L5931L6938L7569L8359M0402
$$ plain form
57220 3295999 3338978 3383087 3426657 3469761 3513346 3557560 3602174 3647634 3694188 3740820 3786444
57209 3786444 3831332 3876094 3920263 3963343 4006253 4049935 4093331 4134581 4173744 4212546 4251930
57198 4251930 4291570 4331482 4372299 4414082 4456419 4499537 4543867 4588782 4633344 4678003 4723986
57187 4723986 4771166 4818136 4864233 4909850 4954895 4998728 5041774 5085433 5130009 5174196 5217005
57176 5217005 5258859 5300411 5341498 5381705 5420905 5458845 5495027 5529160 5560962 5589635 5614507
57165 5614507 5636104 5655595 5673298 5688778 5702113 5713806 5723541 5730391 5734308 5736230 5736705 5735620 5733298
57152 5733298 5730521 5727306 5722887 5717181 5711197 5705828 5701209 5697337 5694259 5691588 5688908 5686718 5685941 5686474
57138 5686474 5687253 5687707 5688059 5688245 5687717 5686397 5684675 5682410 5679024 5674574 5669605 5663981 5657055 5649043 5641041
$$ packed form
57220C295999M2979M4109M3570M3104M3585M4214M4614M5460M6554M6632M5624
57209C786444M4888M4762M4169M3080M2910M3682M3396M1250L9163L8802L9384
57198D251930L9640L9912M0817M1783M2337M3118M4330M4915M4562M4659M5983
57187D723986M7180M6970M6097M5617M5045M3833M3046M3659M4576M4187M2809
57176E217005M1854M1552M1087M0207L9200L7940L6182L4133L1802K8673K4872
57165E614507K1597J9491J7703J5480J3335J1693R735O850L917J922M75j085k322
57152E733298k777l215m419n706n984n369m619l872l078k671k680k190p77N33
57138E686474P79M54L52J86n28j320j722k265l386m450m969n624o926q012q002
$$ plain form
57123 5641041 5633688 5627083 5622117 5620608 5623917 5632457 5646585 5666796 5693009 5724888 5762943 5808266
57111 5808266 5861410 5923121 5996264 6085638 6195734 6330066 6492902 6690243 6928933 7216470
57101 7216470 7562449 7979344 8482048 9088437 9821243 10708560 11782364 13077573 14632068
57092 14632068 16484966 18672623 21224931 24162605 27493286 31206309 35268722 39623048
57084 39623048 44185284 48844767 53468746 57908589 62001563 65571097 68437599 70444520
57076 70444520 71487859 71532705 70611654 68810832 66250688 63067258 59398954 55380635
57068 55380635 51141346 46801698 42471053 38245805 34207407 30419273 26925024 23750059
57060 23750059 20904307 18383730 16172126 14245298 12575807 11135426 9895921 8830309
$$ packed form
57123E641041p353o605m966j509L309Q540J4128K0211K6213L1879L8055M5323
57111E808266N3144O1711P3143Q9374J10096J34332J62836J97341K38690K87537
57101G216470L45979M16895N02704O06389P32806Q87317J073804J295209J554495
57092A4632068J852898K187657K552308K937674L330681L713023M062413M354326
57084C9623048M562236M659483M623979M439843M092974L569534K866502K006921
57076G0444520J043339M4846r21051j800822k560144l183430l668304m018319
57068E5380635m239289m339648m330645m225248m038398l788134l494249l174965
57060B3750059k845752k520577k211604j926828j669491j440381j239505j065612
$$ plain form
57052 8830309 7914299 7126491 6447818 5861546 5353423 4911204 4524345 4184256 3884067
57043 3884067 3617608 3379304 3165310 2973654 2802529 2649153 2510809 2386002 2273765
57034 2273765 2172584 2080817 1997456 1921733 1852667 1789782 1733631 1684850 1643311 1608936 1582786
57023 1582786 1566507 1561346 1568637 1591023 1632498 1697948 1793960 1929655 2113219 2342268 2593366
57012 2593366 2821168 2973443 3014922 2942731 2782101 2568794 2334279 2101274 1884679 1692080
57002 1692080 1524774 1381101 1259366 1157774 1073411 1002907 943571 893310 850411 814159
56992 814159 784673 761312 742084 725238 710487 698054 687699 679506 674523 673571 676011 680222 684276
56979 684276 685587 681276 670072 653191 632756 610296 587299 565697 546588 529488 513899 500679
$$ packed form
57052H830309r16010p87808o78673n86272n08123m42219l86859l40089l00189
57043C884067k66459k38304k13994j91656j71125j53376j38344j24807j12237
57034B273765j01181r1767q3361p5723o9066o2885n6151m8781m1539l4375k6150
57023A582786j6279n161P291K2386M1475O5450R6012J35695J83564K29049K51098
57012B593366K27802J52275M1479p2191j60630k13307k34515k33005k16595j92599
57002A692080j67306j43673j21735j01592q4363p0504n9336n0261m2899l6252
56992H14159k9486k3361j9228j6846j4751j2433j0355q193m983r52K440M211M054
56979F84276J311m311j1204j6881k0435k2460k2997k1602j9109j7100j5589j3220
$$ plain form
56967 500679 490803 483819 478704 475421 474485 475810 479266 485708 496319 511347 530243 552180 575258
56954 575258 595817 609748 614464 609337 595225 574448 550316 525467 500951 477438 456363 439037
56942 439037 425470 415033 407565 403007 400833 400905 404184 411689 423433 439186 459417 484503 513692
56929 513692 545345 576942 603823 619507 619336 603738 577123 544343 509094 474323 442071 412957
56917 412957 386985 364593 346098 330776 317608 306362 296971 288618 280568 273199 267073 261739 256622
56904 256622 252327 249611 247722 245202 241945 239141 237584 237252 238142 240247 243144 246761 252202 260649 271878
56889 271878 285034 300407 319276 342348 369324 399292 430141 457998 478751 490306 492844 487641
56877 487641 476738 462988 448887 435550 423639 414515 409216 407134 407217 409881 416296 426484 439929
$$ packed form
56967E00679r876o984n115l283r36J325L456O442J0611J5028J8896K1937K3078
56954E75258K0559J3931M716n127j4112k0777k4132k4849k4516k3513k1075j7326
56942D39037j3567j0437p468m558k174P2L279P505J1744J5753K0231K5086K9189
56929E13692L1653L1597K6881J5684j71j5598k6615l2780l5249l4771l2252k9114
56917D12957k5972k2392j8495j5322j3168j1246r391q353q050p369o126n334n117
56904B56622m295k716j889k520l257k804j557l32Q90K105K897L617N441Q447J1229
56889B71878J3156J5373J8869K3072K6976K9968L0849K7857K0753J1555K538n203
56877D87641j0903j3750j4101j3337j1911r124n299k082Q3K664O415J0188J3445
$$ plain form
56864 439929 457689 482123 514571 554802 602580 658001 719666 783154 841103 884402 904954
56853 904954 899853 873299 833312 786720 737973 691187 650413 617540 591949 572828 560552 555730
56841 555730 558504 569162 588185 615587 651526 697772 757296 832078 921895 1024060 1131640
56830 1131640 1231434 1306408 1342877 1336415 1291948 1219912 1132352 1040114 950964 869328 797494
56819 797494 736581 686635 646870 616496 595155 582717 579204 584856 599910 624627 660000 707744
56807 707744 768506 839901 916141 988462 1045590 1076195 1073940 1040858 985129 916036 841496 768265
56795 768265 701211 641954 589974 545330 509032 481160 460522 446291 438412 436355 439181 447087
56783 447087 461426 482992 511503 546348 585739 624638 655341 671209 669416 650699 618311 577483
$$ packed form
56864D39929J7760K4434L2448M0231M7778N5421O1665O3488N7949M3299K0552
56853I04954n101k6554l9987m6592m8747m6786m0774l2873k5591j9121j2276m822
56841E55730K774J0658J9023K7402L5939M6246N9524P4782Q9817J02165J07580
56830A131640R9794P4974L6469o462m4467p2036q7560r2238q9150q1636p1834
56819G97494o0913m9946l9765l0374k1341j2438l513N652J5054K4717L5373M7744
56807G07744O0762P1395P6240P2321N7128L0605k255l3082n5729o9093p4540p3231
56795G68265o7054n9257n1980m4644l6298k7872k0638j4231p879k057K826P906
56783D47087J4339K1566K8511L4845L9391L8899L0703J5868j793j8717l2388m0828
$$ plain form
56771 577483 533833 491031 450474 413076 380049 351791 327500 306306 287740 271042 255444
56760 255444 241378 230010 221328 213977 207108 200990 195577 190044 184199 178960 174923 171687 168965 167048
56746 167048 165792 164368 162450 160543 158863 157039 155181 153991 153542 153165 152729 152772 153219 153327 153071 153162 153504
56729 153504 153173 152217 151884 152557 153044 152473 151487 150934 150735 150671 151010 151736 152266 152498 153066 154203 155471 156820
56711 156820 158599 160268 160548 159308 157928 157424 157553 158042 159111 160350 160655 159814 158683 157380 154978 151539
56695 151539 148709 147495 147101 146733 146864 147787 148559 148528 148505 149298 150305 150616 150356 149989 149450 148839 148855 149682 150506
56676 150506 150874 151343 152143 152482 151958 151350 151258 151289 151313 151999 153288 153919 153511 153487 154757 156061 156004 155221 154942
56657 154942 154769 153686 152244 151820 152312 152275 151095 149592 148623 148194 147881 147325 146455 145692 145575 145899 145900 145584
$$ packed form
56771E77483m3650m2802m0557l7398l3027k8258k4291k1194j8566j6698j5598
56760B55444j4066j1368q682p351o869o118n413n533n845n239m037l236k722j917
56746A67048j256j424j918j907j680j824j858j190m49l77m36M3M47J08k56R1L42
56729A53504l31r56l33O73M87n71r86n53j99o4L39P26N30K32N68J137J268J349
56711A56820J779J669K80j240j380n04J29M89J069J239L05q41j131j303k402l439
56695A51539k830j214l94l68J31R23P72l1k3P93J007L11k60l67n39o11J6Q27Q24
56676A50506L68M69Q00L39n24o08r2L1K4O86J289O31m08k4J270J304n7p83k79
56657A54942j73j083j442m24M92l7j180j503r69m29l13n56q70p63j17L24Jl16
$$ plain form
56639 145584 145909 147323 149206 151195 153852 157365 160933 164230 168121 172949 177368 180044 181437 182730
56625 182730 184002 184643 184702 184648 184427 183813 183101 182642 182314 182141 182555 183325 183245 181750 179958 179239 179650 180568 181862
56606 181862 183445 184578 184620 183829 182648 180985 178803 176568 174484 172271 170272 169556 170195 170693 170010 169002
56590 169002 168957 169870 171064 172266 173142 172984 172010 171771 173115 174772 175044 173891 172323 170894 169904 170022 171383
56573 171383 172938 173785 174331 175294 176564 177971 180026 182899 185785 188252 191084 194856 198930 202947 208015
56558 208015 215221 224116 233676 243419 252467 259074 262567 264538 266783 269223 271078 272604 274212 275262
56544 275262 275282 275092 275231 274647 272540 270058 268410 266737 263731 260034 256933 254020 250380 246997 245556
56529 245556 245543 244833 242670 239982 237246 234224 231494 230136 229915 229408 227871 225612 222928 220062 217649
$$ packed form
56639A45584L25J414J883J989K657L513L568L297L891M828M419K676J393J293
56625A82730J272O41N9n4k21o14p12m59l28j73M14P70q0j495j792p19M11R18J294
56606A81862J583J133M2p91j181j663k182k235k084k213j999p16O39M98o83j008
56590A69002m5R13J194J202Q76j58r74k39J344J657K72j153j568j429r90J18J361
56573A71383J555Q47N46R63J270J407K055K873K886K467K832L772M074M017N068
56558B08015P206Q895R560R743R048O607L493J971K245K440J855J526J608J050
56544B75262K0j90J39n84k107k482j648j673l006l697l101k913l640l383j441
56529B45556j3p10k163k688k736l022k730j358k21n07j537k259k684k866k413
$$ plain form
56514 217649 215787 213234 209052 204386 201122 199403 198080 196872 196352 196386 196345 196382 196849 196936 195550 193177 191318
56497 191318 190544 190532 191346 193059 194652 194965 194353 193943 193866 193659 193698 194564 195602 195717 195002 194126 192898 191087
56479 191087 189763 190014 191010 191206 190777 190979 191824 192284 192219 192179 191909 190977 190302 191133 193072 194973 196997 199787
56461 199787 202396 203396 203442 204333 205976 206706 206351 206502 207794 209232 210268 211346 212335 212499 212156 212444 213448
56444 213448 214447 215874 218852 222800 225670 226759 227320 228162 228610 228152 227368 226847 226702 227202 228447 229520
56428 229520 229449 228721 228348 227959 226664 225244 225372 226939 228282 228819 229313 229769 229312 228169 227555 227554 227213 226689
56410 226689 227071 228030 227928 226517 225362 225238 225190 224574 224062 224206 224748 225691 227403 229413 230700 231298 232166
56393 232166 233517 234754 235700 236287 235596 233094 230303 229174 229371 229280 228925 229355 229751 228130 224749 222007
$$ packed form
56514B17649j862k553m182m666l264j719j323j208n20L4m1L7M67Q7j386k373j859
56497A91318p74j2Q14J713J593L13o12m10p7k07L9Q66J038J15p15q76j228j811
56479A91087j324K51R96J96m29K02Q45M60o5m0k70r32o75Q31J939J901K024K790
56461A99787K609J000M6Q91J643P30l55J51J292J438J036J078R89J64l43K88J004
56444B13448R99J427K978L948K870J089N61Q42M48m58p84n21j45N00J245J073
56428B29520p1p28l73l89j295j420J28J567J343N37M94M56m57j143o14jl41n24
56410B26689L82R59j02j411j155j24m8o16n12J44N42R43J712K010J287N98Q68
56393B32166J351J237R46N87o91k502k791j129J97r1l55M30L96j621l381k742
$$ plain form
56377 222007 220945 220543 220435 221396 223044 224050 224963 227885 232846 237349 240085 242239 244538 245912 246009 246271
56361 246271 247435 248427 248759 249649 251746 253946 255332 256142 256152 254475 251744 250165 250531 251396 251889 252888 254671
56344 254671 255951 256327 257256 259438 261467 262247 262620 263467 264242 264536 265169 266674 268393 269899 271584 273302
56328 273302 274326 275175 277423 281193 284915 287988 291324 294859 297122 297983 299177 301256 302573 302226 301507
56313 301507 301454 301400 300966 301030 301716 301811 301185 301344 302671 303610 303598 304193 306205 308342 309863 311935 315019 317536
56295 317536 318535 319256 320633 321723 321946 322431 323689 324367 323796 323407 324266 325504 326546 328385 331270 333553
56279 333553 334378 335161 337003 339064 340881 343668 347776 351451 353764 356235 359911 363456 365935 368926 373850
56264 373850 379569 384565 389233 394173 398564 402194 406836 413618 421191 428374 436479 447054 459426 472376
$$ packed form
56377B22007j062m02j08R61J648J006R13K922M961M503K736K154K299J374R7K62
56361B46271J164R92L32Q90K097K200J386Q10J0j677k731j579L66Q65M93R99J783
56344B54671J280L76R29K182K029P80L73Q47P75K94O33J505J719J506J685J718
56328B73302J024Q49K248L770L722L073L336L535K263Q61J194K079J317l47p19
56313C01507n3n4m34O4O86R5o26J59J327R39j2N95K012K137J521K072L084K517
56295C17536R99P21J377J090K23M85J258O78n71l89Q59J238J042J839K885K283
56279C33553Q25P83J842K061J817K787M108L675K313K471L676L545K479K991M924
56264C73850N719M996M668M940M391L630M642O782P573P183Q105J0575J2372J2950
$$ plain form
56250 472376 486256 501661 518003 535183 554630 576988 600768 624823 650047 677208 705445
56239 705445 734344 764934 796918 827457 854507 878852 901112 919390 931901 939388 942961 941990
56227 941990 936051 926478 914143 898274 879248 859704 840848 820574 797399 773370 750816 729185
56215 729185 707580 687485 670284 654722 639469 625562 613757 602277 589939 578753 570532 563624
56203 563624 555951 548642 543505 539388 534374 529333 526067 523982 521674 519877 519794 520342 519886 518986 518832 518901
56187 518901 518563 518932 520731 522522 523344 524616 527111 528886 528740 528891 531401 534836 537268 539593 542855
56172 542855 545372 545835 546328 548879 551923 553560 555340 559199 563626 566646 569762 575055 581207 586390 592334
56157 592334 601351 611966 621687 631567 643804 657239 669499 681237 694049 706577 717096 727695
$$ packed form
56250D72376J3880J5405J6342J7180J9447K2358K3780K4055K5224K7161K8237
56239G05445K8899L0590L1984L0539K7050K4345K2260J8278J2511P487L573r71
56227I41990n939r573j2335j5869j9026j9544j8856k0274k3175k4029k2554k1631
56215G29185k1605k0095j7201j5562j5253j3907j1805j1480j2338j1186q221o908
56203E63624p673p309n137m117n014n041l266k085k308j797q3N48m56r00j54O9
56187E18901l38L69J799J791Q22J272K495J775j46J51K510L435K432K325L262
56172E42855K517M63M93K551L044J637J780L859M427L020L116N293O152N183N944
56157E92334R017J0615R721R880J2237J3435J2260J1738J2812J2528J0519J0599
$$ plain form
56145 727695 741543 758206 775868 795868 820583 848997 878863 911245 948766 991614 1039694
56134 1039694 1096471 1166289 1250057 1347620 1461411 1592761 1736766 1885365 2032882 2174015
56124 2174015 2299991 2403359 2485229 2552770 2611420 2664121 2714681 2764827 2809169 2839137 2851381
56113 2851381 2848083 2831667 2805085 2775049 2747966 2722643 2691633 2648384 2588531 2507191 2401994
56102 2401994 2278254 2145772 2011500 1879755 1756760 1648366 1554664 1472671 1402771 1346838
56092 1346838 1302176 1263812 1231286 1206910 1188999 1173382 1160073 1151885 1147799 1144291 1141808 1143247
56080 1143247 1147325 1150243 1152655 1158201 1166362 1173589 1180200 1189176 1199456 1207599 1214940 1225788 1239616
56067 1239616 1252299 1263969 1278268 1294986 1311014 1327409 1347680 1370167 1390113 1408331 1429711
$$ packed form
56145G27695J3848J6663J7662K0000K4715K8414K9866L2382L7521M2848M8080
56134A039694N6777O9818Q3768R7563J13791J31350J44005J48599J47517J41133
56124B174015J25976J03368Q1870O7541N8650N2701N0560N0146M4342K9968J2244
56113B851381l298j6416k6582l0036k7083k5323l1010m3249n9853q1340j05197
56102B401994j23740j32482j34272j31745j22995j08394r3702q1993o9900n5933
56092A346838m4662l8364l2526k4376j7911j5617j3309q188m086l508k483J439
56080A143247M078K918K412N546Q161P227O611Q976J0280Q143P341J0848J3828
56067A239616J2683J1670J4299J6718J6028J6395K0271K2487J9946J8218K1380
$$ plain form
56056 1429711 1454002 1476427 1496617 1518467 1541662 1561962 1579584 1598834 1619799 1638904 1657273
56045 1657273 1679801 1706203 1731678 1756038 1783391 1813348 1841719 1869401 1901170 1936151 1969188
56034 1969188 2001205 2038148 2079906 2120648 2160078 2203766 2252058 2299478 2345642 2396007 2451155
56023 2451155 2506059 2560547 2619613 2682890 2745024 2807006 2875629 2951064 3026700 3101888 3182825
56012 3182825 3270166 3358190 3447086 3543379 3647297 3752636 3859940 3976331 4101497 4227819
56002 4227819 4355353 4492246 4639333 4789413 4942979 5109018 5288737 5474672 5667501
55993 5667501 5876951 6104089 6340002 6584040 6845510 7125364 7415133 7716366 8041481
55984 8041481 8392835 8761444 9149057 9569837 10027387 10513054 11030251 11596171 12215808
$$ packed form
56056A429711K4291K2425K0190K1850K3195K0300J7622J9250K0965J9105J8369
56045A657273K2528K6402K5475K4360K7353K9957K8371K7682L1769L4981L3037
56034A969188L2017L6943M1758M0742L9430M3688M8292M7420M6164N0365N5148
56023B451155N4904N4488N9066O3277O2134O1982O8623P5435P5636P5188Q0937
56012C182825Q7341Q8024Q8896R6293J03918J05339J07304J16391J25166J26322
56002D227819J27534J36893J47087J50080J53566J66039J79719J85935J92829
55993E667501K09450K27138K35913K44038K61470K79854K89769L01233L25115
55984H041481L51354L68609L87613M20780M57550M85667N17197N65920O19637
$$ plain form
55975 12215808 12880167 13594661 14382116 15252873 16200877 17234899 18383175 19661579 21070670
55966 21070670 22631474 24389532 26377317 28612370 31142087 34050332 37414295 41305464
55958 41305464 45846932 51221207 57615598 65225391 74328082 85291447 98511227 114453158
55950 114453158 133795784 157417480 186159365 220588843 260704479 305124345 349913273
55943 349913273 388413678 413270688 419758321 407866133 381613882 346597795 307873921
55936 307873921 269144655 232776783 200013577 171264764 146474199 125382823 107605179
55929 107605179 92672981 80137954 69631250 60826069 53410665 47128739 41799386
55922 41799386 37271423 33394281 30047898 27158404 24661868 22483155 20563960 18877624
$$ packed form
55975A2215808O64359P14494P87455Q70757R48004J034022J148276J278404J409091
55966B1070670J560804J758058J987785K235053K529717K908245L363963L891169
55958D1305464M541468N374275O394391P609793R102691J0963365J3219780J5941931
55950A14453158J9342626K3621696K8741885L4429478M0115636M4419866M4788928
55943C49913273L8500405K4857010O487633j1892188k6252251l5016087l8723874
55936C07873921l8729266l6367872l2763206k8748813k4790565k1091376j7777644
55929A07605179j4932198j2535027j0506704q805181p415404o281926n329353
55922D1799386m527963l877142l346383k889494k496536k178713j919195j686336
$$ plain form
55914 18877624 17398895 16086597 14909175 13859044 12927030 12087236 11319698 10624031 9997928
55905 9997928 9423911 8888997 8396744 7948561 7532368 7140122 6777879 6448261 6140647
55896 6140647 5848402 5578716 5335669 5109728 4893552 4692940 4512883 4347193 4190885
55887 4190885 4049098 3925178 3812923 3708816 3619567 3549945 3495341 3453671 3432522 3437041 3462000
55876 3462000 3502358 3559590 3629938 3697552 3746909 3772153 3768114 3723790 3633441 3505207 3351637
55865 3351637 3180089 2998207 2818723 2650866 2494481 2348578 2217636 2103873 2001945
55856 2001945 1907540 1823530 1751964 1688090 1628087 1574859 1530296 1489387 1447816 1408098 1372575
55845 1372575 1337612 1300428 1264610 1233175 1202910 1171084 1141036 1115648 1091852 1067057 1044454
$$ packed form
55914A8877624j478729j312298j177422j050131r32014q39794p67538o95667o26103
55905I997928n74017n34914m92253m48183m16193l92246l62243l29618l07614
55896F140647k92245k69686k43047k25941k16176k00612j80057j65690j56308
55887D190885j41787j23920j12255j04107q9249o9622n4604m1670k1149M519K4959
55876C462000M0358N7232P0348O7614M9357K5244m039m4324r0349j28234j53570
55865C351637j71548j81882j79484j67857j56385j45903j30942j13763j01928
55856B001945r4405q4010p1566o3874o0003n3228m4563m0909m1571l9718l5523
55845A372575l4963l7184l5818l1435l0265l1826l0048k5388k3796k4795k2603
$$ plain form
55834 1044454 1026496 1009526 990433 972413 958476 945270 929100 912472 898987 887054 874142
55823 874142 862120 852836 843252 830336 816313 804109 792029 777704 762942 750120 738022 725527
55811 725527 714935 707549 700527 692120 685241 681826 678727 673492 669224 669214 671672 674348 679427 688910
55797 688910 699783 708628 716637 725254 731411 732189 729943 727665 723312 713945 701581 689724 677722
55784 677722 663926 650971 642366 636528 629173 619054 606909 591760 573138 554361 538860 525593
55772 525593 512286 500540 493427 490671 490552 493842 501184 508937 512329 510980 507338 501801 493483 483737
55758 483737 474731 466088 456537 447082 439114 431388 422272 412916 404901 397002 387671 378435 371387 365544
55744 365544 359065 352739 347910 343333 337572 332120 328738 326112 322655 320031 320183 321348 320884 319721 320109
$$ packed form
55834A044454j7958j6970j9093j8020j3937j3206j6170j6628j3485j1933j2912
55823H74142j2022r284r584j2916j4023j2204j2080j4325j4762j2822j2098j2495
55811G25527j0592p386p022q407o879l415l099n235m268j0K458K676N079R483
55797F88910J0873Q845Q009Q617O157P78k246k278m353r367j2364j1857j2002
55784F77722j3796j2955q605n838p355j0119j2145j5149j8622j8777j5501j3267
55772E25593j3307j1746p113k756j19L290P342P753L392j349l642n537q318r746
55758D83737r006q643r551r455p968p726r116r356q015p899r331r236p048n843
55744C65544o479o326m829m577n761n452l382k626l457k624J52J165m64j163L88
$$ plain form
55729 320109 321249 321100 320311 320292 319465 315548 309771 304809 300298 294360 287865 283087 279686 275903 272313
55714 272313 270588 269984 268818 267980 269286 271787 273480 275108 278521 282744 285607 287847 291488 295299 295943
55699 295943 292823 288010 282271 274968 267089 260566 255121 249186 243298 239193 236369 232947 229168 226635
55685 226635 224883 222165 218980 217473 217938 219113 221108 224747 228783 231208 232677 235192 238027 238387 235678
55670 235678 231808 227746 223070 218524 215660 214092 212137 209876 208699 208384 207656 207072 208257 210788 212945
55655 212945 215012 218666 223599 228071 232313 238004 244743 250421 254919 259970 265399 268911 269754 269340 268052
55640 268052 264661 259213 253390 247637 240790 232841 225309 218608 211772 204907 199137 194078 188278 182345
55626 182345 178692 177825 177689 177040 176645 176760 176220 174625 172920 171323 169050 166391 164587 163440 161570 159213
$$ packed form
55729C20109J140j49p89j9q27l917n777m962m511n938o495m778l401l783l590
55714B72313j725o04j166q38J306K501J693J628L413M223K863K240L641L811O44
55699B95943l120m813n739p303p879o523n445n935n888m105k824l422l779k533
55685B26635j752k718l185j507M65J175J995L639M036K425J469K515K835L60k709
55670B35678l870m062m676m546k864j568j955k261j177l15p28n84J185K531K157
55655B12945K067L654M933M472M242N691O739N678M498N051N429L512Q43m14j288
55640B68052l391n448n823n753o847p949p532o701o836o865n770n059n800n933
55626A82345l653q67j36o49l95J15n40j595j705j597k273k659j804j147j870k357
$$ plain form
55610 159213 158057 158016 157010 154429 152057 150925 149941 148387 147166 146663 145737 143816 141943 140909 140265 139801
55594 139801 140027 140663 140581 139751 139366 139647 139490 138601 137950 137807 137415 136927 137508 139102 140195 140213 140125 140328 140114
55575 140114 139542 139636 140288 140203 139425 139641 141323 142773 142781 142245 142410 143351 144835 146846 148660 149160 148543 147974
55557 147974 147358 145455 142454 140151 139122 137940 135831 133838 132627 131328 129451 127925 127242 126484 125153
55542 125153 124209 124363 124925 125142 125162 125066 124576 124217 125022 126551 127054 126152 125502 126123 126982 126935 126262 125479 124430
55523 124430 123358 123210 124056 124778 124941 125354 126282 126924 127227 128320 130447 132341 133287 133877 134094 132816 130087
55506 130087 127762 126819 125988 124111 121839 119849 117402 114106 111251 109869 109058 107683 106242 105625 105458
55491 105458 105132 105156 106104 107445 108718 110570 113313 115702 116632 116962 118134 119889 120802 120446 119731 119576 120178
$$ packed form
55610A59213j156m1j006k581k372j132r84j554j221n03r26j921j873j034o44m64
55594A39801K26O36q2q30l85K81j57q89o51j43l92m88N81J594J093J8q8K03k14
55575A40114n72R4O52q5p78K16J682J450Qn36J65R41J484K011J814N00o17n69
55557A47974o16j903l001k303j029j182k109j993j211j299j877j526o83p58j331
55542A25153r44J54N62K17K0r6m90l59Q05J529N03r02o50O21Q59m7o73p83j049
55523A24430j072j48Q46P22J63M13R28O42L03J093K127J894R46N90K17j278k729
55506A30087k325r43q31j877k272j990k447l296k855j382q11j375j441o17j67
55491A05458l26K4R48J341J273J852K743K389R30L30J172J755R13l56p15j55O02
$$ plain form
55474 120178 121159 121745 121421 120821 121150 122353 122960 122195 120951 120151 119510 118683 118233 118522 118832 118500 117870 117325
55456 117325 116535 115436 114779 114868 114867 114149 113175 112354 111281 109920 109248 109842 110981 111957 113036 114324 115045 114888
55438 114888 114737 115100 115129 114237 113269 112960 112511 111066 109447 109078 110084 111692 113614 115870 118012 119694
55422 119694 121255 122869 123890 123947 123705 123745 123681 123325 123542 124849 126236 126572 126275 126393 126930 127239 127253 127143
55404 127143 126508 125037 123319 121966 120629 118804 116906 115591 114820 114393 114582 115272 115485 114737 113885 113550
55388 113550 112738 110353 107237 105277 105084 105800 106662 107484 108018 108017 107699 107260 106401 105088 104099 103921 103776 102766
55370 102766 101380 100798 101264 102189 103320 104733 106111 107108 108106 109670 111503 112812 113394 113699 114138 114967
55354 114967 116400 118175 119431 119632 119171 118609 117969 117240 116736 116311 115089 112743 110307 108922 108521 108484 108722
$$ packed form
55474A20178R81N86l24o00L29J203O07p65j244q00o41q27m50K89L10l32o30n45
55456A17325p90j099o57Q9jp18r74q21j073j361o72N94J139R76J079J288P21j57
55438A14888j51L63K9q92r68l09m49j445j619l69J006J608J922K256K142J682
55422A19694J561J614J021N7k42M0o4l56K17J307J387L36k97J18N37L09J4j10
55404A27143o35j471j718j353j337j825j898j315p71m27J89O90K13p48q52l35
55388A13550q12k385l116j960j93P16Q62Q22N34jl18m39q59j313r89j78j45j010
55370A02766j386n82M66R25J131J413J378R97R98J564J833J309N82L05M39Q29
55354A14967J433J775J256K01m61n62o40p29n04m25j222k346k436j385m01l7K38
$$ plain form
55337 108722 109264 109585 109304 108911 108917 108973 108659 108385 108671 109242 109713 110409 111549 112387 112186 111381 110823 110497 109969
55318 109969 109442 109345 109426 109213 108865 108698 108455 107887 107443 107541 107731 107402 106706 106058 105524 105425 106542 108705 110146
55299 110146 109489 107573 106137 105548 105094 104799 105387 106849 108379 109490 110132 110101 109403 108790 108914 109368 109551
55282 109551 109909 111187 112936 113965 113969 113635 113488 113670 114461 115984 117632 118701 119257 119665 119824 119647 119586 119748
55264 119748 119293 117748 116109 115419 115088 114023 112642 112156 112435 112272 111469 111060 111560 112466 113421 114505 115443
55247 115443 115871 116319 117609 119321 120121 119631 118747 118082 117370 116483 115850 115642 115548 115481 115604 115667 115292 114866 115199
55228 115199 116263 117233 117741 118142 118634 119041 119388 119721 119507 118239 116576 115797 116060 116258 115680 114838 114485 114722
55210 114722 115227 115654 115687 115313 115026 115206 115525 115596 115819 116784 118199 119288 119892 120285 120321 119806 119354 119667 120244
$$ packed form
55337A08722N42L21k81l93ON6l14k74K86N71M71O96J140Q38k01q05n58l26n28
55318A09969n27r7Q1k13l48j67k43n68m44R8J90l29o96o48n34r9J117K163J441
55299A10146o57j916j436n89m54k95N88J462J530J111O42l1o98o13J24M54J83
55282A09551L58J278J749J029Ml34j47J82P91J523J648J069N56M08J59j77o1J62
55264A19748m55j545j639o90l31j065j381m86K79j63q03m09N00R06R55J084R38
55247A15443M28M48J290J712Q00m90q84o65p12q87o33k08r4o7J23O3l75m26L33
55228A15199J064R70N08M01M92M07L47L33k14j268j663p79K63J98n78q42l53K37
55210A14722N05M27L3l74k87J80L19P1K23R65J415J089O04L93L6n15m52L13N77
$$ plain form
55191 120244 119980 118841 117809 117343 117136 117191 117807 118494 118229 116987 115881 115583 115641 115475 115050 114450 113789 113594
55173 113594 114313 115366 115710 115313 115047 115172 115184 115176 116009 117770 119303 119807 119885 120485 121650 122810 123590 123900
55155 123900 123834 123771 124076 124493 124415 123826 123387 123489 123850 124085 124102 123883 123419 122858 122296 121657 121190 121527 122576 122999
55135 122999 121788 119816 118645 118270 117458 115978 114938 114884 115150 115364 116159 117851 119560 120234 119738 118638
55119 118638 117634 117344 117809 118173 117659 116831 116896 117883 118658 118726 118736 119081 119336 119409 119971 121242 122454 123048 123418
55100 123418 124069 124897 125717 126559 127108 126771 125738 125072 125373 126097 126506 126488 126247 126050 126486 127968 129716 130238
55082 130238 129150 127559 126402 125435 124270 123205 122425 121388 119723 117964 116778 116145 115882 116289 117651
55067 117651 119602 121455 122791 123523 123859 124330 125239 126011 125771 124567 123268 122226 120998 119488 118351 118042
$$ packed form
55191A20244k64j139j032m66k07N5O16O87k65j242j106k98N8j66m25o00o61j95
55173A13594P19J053L44l97k66J25J2qQ33J761J533N04P8O00J165J160P80L10
55155A23900o6o3L05M17p8n89m39J02L61K35J7k19m64n61n62o39m67L37J049M23
55135A22999j211j972j171l75q12j480j040n4K66K14P95J692J709O74m96j100
55119A18638j004k90M65L64n14q28O5R87P75O8J0L45K55P3N62J271J212N94L70
55100A23418O51Q28Q20Q42N49l37j033o66L01P24M09j8k41j97M36J482J748N22
55082A30238j088j591j157r67j165j065p80j037j665j759j186o33k63M07J362
55067A17651J951J853J336P32L36M71R09P72k40j204j299j042j228j510j137l09
$$ plain form
55051 118042 118325 118962 119925 120792 120918 120451 120178 120224 119961 119385 119335 120046 120759 121169 121942 123238 124074 123956 123933
55032 123933 125079 126920 128328 129085 129579 129764 129488 129289 129787 130576 130513 129035 126684 124575 123595 123779 124222
55015 124222 123994 123239 122816 122939 123003 122829 123041 123837 124432 124216 123661 123628 124486 126246 128683 130963 132092 132176
54997 132176 132325 132950 133227 132729 132405 133123 134225 134478 133782 133069 133067 133849 135118 136322 136868 136661 136042 135088
54979 135088 133695 132385 132041 132560 132890 132829 133596 135971 138965 141132 142277 143061 143726 144048 143946 143464 142713
54962 142713 142263 142878 144465 146046 147053 147709 147948 147236 145929 145454 146440 147919 149027 150041 151012 150928 149420
54945 149420 147874 147541 147750 147257 146168 145140 143910 142200 140988 141207 142073 142444 142976 145041 148140 150401
54929 150401 151314 152015 152919 153026 151918 150828 151215 153396 156952 161532 166916 173073 180237 188311 196338
$$ packed form
55051A18042K83O37R63Q67J26m67k73M6k63n76n0P11P13M10P73J296Q36j18k3
55032A23933J146J841J408P57M94J85k76j99M98P89o3j478k351k109r80J84M43
55015A24222k28p55m23J23O4j74K12P96N95k16n55l3Q58J760K437K280J129Q4
54997A32176J49O25K77m98l24P18J102K53o96p13kP82J269J204N46k07o19r54
54979A35088j393j310l44N19L30o1P67K375K994K167J145P84O65L22j02m82p51
54962A42713m50O15J587J581J007O56K39p12j307m75R86J479J108J014R71q4j508
54945A49420j546l33K09m93j089j028j230j710j212K19Q66L71N32K065L099K261
54929A50401R13P01R04J07j108j090L87K181L556M580N384O157P164Q074Q027
$$ plain form
54914 196338 203281 209047 213963 217511 218636 217092 213569 208695 202864 196800 191198 185852 180085 173980
54900 173980 168258 163087 158047 153300 149774 147988 147427 147196 146676 145609 144192 143078 142711 142800 142957 143539
54884 143539 145132 147507 149935 152337 155352 159355 164115 169275 174585 179888 185488 192221 200426 209128
54870 209128 216790 222485 225738 225910 222776 217329 211054 204643 198160 191947 186342 180973 175430 170318
54856 170318 166484 163545 160329 156642 153376 150958 148834 146526 144180 142026 140195 139051 138821 138959 138766
54841 138766 138421 138463 138462 137371 135097 132625 130627 129066 128167 128516 129958 131468 132388 132957 133441 133655 133558 133501
54823 133501 133749 134411 135721 137583 139011 139042 138122 137542 137591 137433 136781 136406 136765 137338 137680 138021 138481 138741
54805 138741 138845 139343 140304 141074 141360 141589 141923 141893 141397 141091 141363 141838 142266 142919 143699 143847 143095 142174 141635
$$ packed form
54914A96338O943N766M916L548J125j544l523m874n831o064n602n346n767o105
54900A73980n722n171n040m747l526j786n61k31n20j067j417j114l67Q9J57N82
54884A43539J593K375K428K402L015M003M760N160N310N303N600O733Q205Q702
54870B09128P662N695L253J72l134n447o275o411o483o213n605n369n543n112
54856A70318l834k939l216l687l266k418k124k308k346k154j831j144k30J38j93
54841A38766l45M2jj091k274k472j998j561q99L49J442J510R20N69M84K14r7n7
54823A33501K48O62J310J862J428L1r20n80M9j58o52l75L59N73L42L41M60K60
54805A38741J04M98R61P70K86K29L34l0m96l06K72M75M28O53P80J48p52r21n39
$$ plain form
54786 141635 141064 140100 139326 139363 139794 139820 139419 139173 139382 139971 140910 142141 143483 145083 147558 151237 155620
54769 155620 160001 164277 168696 173251 177836 182770 188632 195584 203094 210280 216477 221550 225612 228308
54755 228308 228633 225896 220654 214205 207368 200337 193468 187339 182039 177192 172768 169125 166191 163483
54741 163483 161056 159511 158815 158006 156542 155201 155070 156210 157762 158987 159826 160752 162309 164527 166788
54726 166788 168591 170276 172422 174804 176854 179094 183023 189309 196969 204589 211480 217303 221476 223534
54712 223534 223450 221162 216419 209546 201819 194638 188669 183891 179966 176325 172512 168687 165369 162735 160740
54697 160740 159712 159863 160273 159541 157686 156275 156334 157169 157652 157495 156752 155213 153120 151528 151108 151331 151481
54680 151481 151659 152037 152011 150985 149341 147811 146490 145251 144463 144355 144250 143356 141945 140921 140573 140546 140687
$$ packed form
54786A41635n71r64p74L7M31K6m01k46K09N89R39J231J342J600K475L679M383
54769A55620M381M276M419M555M585M934N862O952P510P186O197N073M062K696
54755B28308L25k737n242o449o837p031o869o129n300m847m424l643k934k708
54741A63483k427j545o96q09j464j341j31J140J552J225Q39R26J557K218K261
54726A66788J803J685K146K382K050K240L929O286P660P620O891N823M173K058
54712B23534q4k288m743o873p727p181n969m778l925l641l813l825l318k634j995
54697A60740j028J51M10p32j855j411N9Q35M83j57p43j539k093j592m20K23J50
54680A51481J78L78k6j026j644j530j321j239p88j08j05q94j411j024l48k7J41
$$ plain form
54663 140687 141104 141626 141920 141976 141888 141412 140347 139048 138045 137461 137346 138160 140251 143107 145725 147524 148488
54646 148488 148804 148946 149710 151441 153414 154570 154744 154675 155012 155806 156797 157649 158005 157674 156775 155537 154192
54629 154192 153099 152596 152506 152287 151831 151525 151326 150513 148793 146941 145795 145259 144861 144590 144592 144649 144749 145558 147506
54610 147506 149839 151343 151664 151278 150683 150398 151221 153454 156108 157739 157977 157563 157221 157274 157996 159406 160810
54593 160810 161359 161017 160317 159375 157951 156355 155467 155819 157236 159206 160947 161395 160045 157811 156271 155965
54577 155965 156150 156106 155904 155814 155846 156079 156777 157928 159237 160687 162498 164399 165561 165531 164701 163668 162659
54560 162659 161836 161583 162089 162963 163634 163911 163965 164027 164352 165221 166622 168007 168655 168357 167626 167152 167085 167025 166811
54541 166811 167018 168367 170769 173460 175999 178572 181225 183472 184945 185811 186235 186106 185713 185988 187424 189247
$$ packed form
54663A40687M17N22K94N6q8m76j065j299j003n84j15Q14K091K856K618J799R64
54646A48488L16J42P64J731J973J156J74o9L37P94R91Q52L56l31q99j238j345
54629A54192j093n03r0k19m56l06j99q13j720j852j146n36l98k71KN7J00Q09J948
54610A47506K333J504L21l86n95k85Q23K233K654J631K38m14l42N3P22J410J404
54593A60810N49l42p00r42j424j596q88L52J417J970J741M48j350k234j540l06
54577A55965J85m4k02r0L2K33O98J151J309J450J811J901J162l0q30j033j009
54560A62659q23k53N06Q74O71K77N4O2L25Q69J401J385O48k98p31m74o7o0k14
54541A66811K07J349K402K691K539K573K653K247J473Q66M24j29l93K75J436J823
$$ plain form
54525 189247 190310 190317 189566 188099 186007 184169 183646 184444 185614 186450 186878 186899 186496 185971 185587 184886 183170 180655
54507 180655 178372 176877 175770 174548 173192 171844 170603 169801 169819 170501 171336 172290 173779 175722 177375 178311
54491 178311 178880 179464 179990 180447 181166 182152 182785 182712 182552 183144 184501 186098 187809 189919 192293 194248 195426
54474 195426 196341 197752 199708 201537 202797 203911 205644 208077 210440 211978 212662 212939 213244 213930 215226
54459 215226 216762 217471 216542 214398 212354 211435 211855 213347 215382 217105 217729 217226 216254 215320 214272 212687
54443 212687 210405 207686 205076 203143 202101 201645 201284 200755 200003 199055 198199 198022 198824 200132 201116 201371 201020
54426 201020 200331 199623 199284 199392 199486 199092 198297 197448 196646 196024 196074 196999 197998 197995 196994 195984 195609 195652 195785 196011
54406 196011 196218 196064 195541 195134 195185 195593 196218 197098 198169 199248 200377 201650 202672 202760 201820 200545 199626
$$ packed form
54525A89247J063Pp51j467k092j838n23P98J170Q36M28K1m03n25l84p01j716k515
54507A80655k283j495j107j222j356j348j241q02J8O82Q35R54J489J943J653R36
54491A78311N69N84N26M57P19R86O33p3j60N92J357J597J711K110K374J955J178
54474A95426R15J411J956J829J260J114J733K433K363J538O84K77L05O86J296
54459B15226J536P09r29k144k044r19M20J492K035J723O24n03r72r34j048j585
54443B12687k282k719k610j933j042m56l61n29p52r48q56j77Q02J308R84K55l51
54426B01020o89p08l39J08R4l94p95q49q02o22N0R25R99lj001j010l75M3J33K26
54406A96011K07j54n23m07N1M08O25Q80J071J079J129J273J022Q8r40j275r19
$$ plain form
54389 199626 199239 199319 199788 200361 200668 200769 201105 201838 202649 203244 203588 203581 203036 202117 201350 201105 201401 202169 203148 203607
54369 203607 202850 201145 199548 198738 198595 198925 199798 200958 201653 201447 200718 200067 199713 199672 199957 200375 200627 200769
54351 200769 201027 201011 199822 197269 194305 191925 190204 188765 187494 186368 185199 184057 183429 183490 183710 183662
54335 183662 183651 183969 184072 183228 181659 180354 179898 180046 180306 180420 180376 180382 180739 181434 182023 182191 182188 182361 182579 182549
54315 182549 182475 182903 183998 185381 186591 187334 187434 186994 186524 186521 186819 186705 185729 184199 182819 182035 181770 181690
54297 181690 181576 181434 181270 180964 180544 180426 180964 181779 181982 181191 179946 178947 178257 177512 176538 175390 174070 172573
54279 172573 171132 170113 169710 169866 170441 171305 172350 173431 174193 174107 173013 171623 170994 171383 172047 172361 172691
54262 172691 173824 175820 177800 178745 178341 177175 176256 176174 176681 177164 177408 177528 177342 176504 175310 174633 174721 174758
$$ packed form
54389A99626l87Q0M69N73L07J01L36P33Q11N95L44pn45r19p67k45K96P68R79M59
54369B03607p57j705j597q10j43L30Q73J160O95k06p29o51l54m1K85M18K52J42
54351B00769K58j6j189k553k964k380j721j439j271j126j169j142o28O1K20m8
54335A83662j1L18J03q44j569j305m56J48K60J14m4OL57O95N89J68lJ73K18l0
54315A82549p4M28J095J383J210P43J00m40m70lK98j14r76j530j380p84k65q0
54297A81690j14j42j64l06m20j18N38Q15K03p91j245r99o90p45r74j148j320j497
54279A72573j441j019m03J56N75Q64J045J081P62q6j094j390o29L89O64L14L30
54262A72691J133J996J980R45m04j166r19q2N07M83K44J20j86q38j194o77Q8L7
$$ plain form
54244 174758 174089 173256 173176 173755 174098 173829 173445 173375 173381 173071 172503 172034 171847 171864 171975 172158 172366 172408 172095 171560 171220
54223 171220 171163 170732 169199 166859 164957 164334 164647 165154 165728 166609 167564 167933 167439 166459 165481 164701 164178 164014
54205 164014 164207 164501 164596 164502 164627 165420 166866 168393 169362 169595 169382 169139 169228 169854 170794 171381 171190 170635 170447
54186 170447 170648 170555 169738 168461 167110 165831 164807 164324 164296 164278 164137 164289 165026 166117 167295 168600 170009
54169 170009 171191 171910 172280 172413 172306 172226 172606 173320 173647 173307 172911 172932 172856 171850 169874 167615 165682 164276
54151 164276 163283 162309 160973 159506 158701 158940 159703 160287 160551 160706 160987 161810 163527 165634 166961 167181 167350
54134 167350 168380 169780 170686 171304 172318 173466 173810 173083 171812 170448 169261 168748 169122 169635 169323 168282
54118 168282 167289 166521 165657 165006 165311 166452 167533 168382 169834 172194 174478 175623 175630 175098 174417 173826 173611
$$ packed form
54244A74758o69q33q0N79L43k69l84p0Ol10n68m69j87J7J11J83K08M2l13n35l40
54223A71220n7m31j533k340j902o23L13N07N74Q81R55L69m94r80r78p80n23j64
54205A64014J93K94R5r4J25P93J446J527R69K33k13k43Q9O26R40N87j91n55j88
54186A70447K01r3q17j277j351j279j024m83k8j8j41J52P37J091J178J305J409
54169A70009J182P19L70J33j07q0L80P14L27l40l96K1p6j006j976k259j933j406
54151A64276r93r74j336j467q05K39P63N84K64J55K81Q23J717K107J327K20J69
54134A67350J030J400R06O18J014J148L44p27j271j364j187n13L74N13l12j041
54118A68282r93p68q64o51L05J141J081Q49J452K360K284J145Pn32o81n91k15
$$ plain form
54101 173611 173726 173709 173329 172899 172683 172487 172126 171819 171828 172076 172354 172522 172327 171506 170358 169810 170587 172497 174647
54082 174647 176112 176395 175679 174758 174408 174728 175364 176288 177846 180007 182106 183516 184199 184509 184819 185445 186416
54065 186416 187219 187181 186300 185282 184673 184302 183672 182510 180870 179147 178073 178236 179431 180869 182079 183238
54049 183238 184622 186282 188293 190722 193206 195109 196341 197462 198837 200271 201718 203661 206323 209117
54035 209117 211408 213520 216399 220476 225270 230029 234444 238805 243635 249083 254652 259676 264033 268092
54021 268092 271979 275415 278239 280628 282579 283773 284179 284358 284824 285521 286198 286836 287335 287154 285728 283089
54005 283089 279880 276992 275271 275117 276062 277077 277547 277658 277799 278191 279439 282743 288987 298063 309505
53990 309505 323022 337507 350061 357286 357790 352757 343996 332324 318137 302744 288263 276277
$$ packed form
54101A73611J15j7l80m30k16j96l61l07RK48K78J68j95q21j148n48P77J910K150
54082A74647J465K83p16r21l50L20O36R24J558K161K099J410O83L10L10O26R71
54065A86416Q03l8q81j018o09l71o30j162j640j723j074J63J195J438J210J159
54049A83238J384J660K011K429K484J903J232J121J375J434J447J943K662K794
54035B09117K291K112K879M077M794M759M415M361M830N448N569N024M357M059
54021B68092L887L436K824K389J951J194M06J79M66O97O77O38M99j81j426k639
54005B83089l209k888j721j54R45J015M70J11J41L92J248L304O244R076J1442
53990C09505J3517J4485J2554P225N04n033q761j1672j4187j5393j4481j1986
$$ plain form
53978 276277 266929 259324 252592 246590 241708 238082 235182 232299 229302 226627 224547 222813 221139 219728
53964 219728 219051 219172 219558 219594 219137 218496 217954 217468 216865 216159 215501 214913 214306 213737 213467 213700 214465 215805 217808
53945 217808 220340 222965 225393 227839 230729 234076 237398 240289 242864 245572 248692 252200 256047 260292
53931 260292 264748 268656 271140 272094 272368 272883 273802 274769 275707 276962 278776 280937 283013 284683 285952 287332
53915 287332 289727 293751 299131 305004 310792 316508 322348 328389 334716 341370 348053 354232 359676 364597
53901 364597 369148 373050 375853 377360 377756 377485 376948 376075 374351 371619 368705 366673 365524 364194 361865
53886 361865 358597 354598 349700 343917 337847 331998 326233 320358 314771 309940 305688 301579 297714 294511
53872 294511 291966 289763 287920 286616 285414 283433 280498 277516 275381 273971 272502 270504 268026 265138
$$ packed form
53978B76277r348p605o732o002m882l626k900k883k997k675k080j734j674j411
53964B19728o77J21L86L6m57o41n42m86o03p06o58n88o07n69k70K33P65J340K003
53945B17808K532K625K428K446K890L347L322K891K575K708L120L508L847M245
53931B60292M456L908K484R54K74N15R19R67R38J255J814K161K076J670J269J380
53915B87332K395M024N380N873N788N716N840O041O327O654O683O179N444M921
53901C64597M551L902K803J507L96k71n37q73j724k732k914k032j149j330k329
53886C61865l268l999m898n783o070n849n765n875n587m831m252m109l865l203
53872B94511k545k203j843j304j202j981k935k982k135j410j469j998k478k888
$$ plain form
53858 265138 261734 257881 253988 250462 247356 244499 241800 239290 236986 234971 233541 232981 233170 233695 234366
53843 234366 235244 236037 236038 235040 233931 233823 234854 236305 237599 238611 239173 239037 238378 237808 237851 238821 241065 244774
53825 244774 249682 255567 262836 271758 281207 289083 294008 295737 294048 288654 280616 272465 266052 261174
53811 261174 256925 253374 251062 249863 249521 250504 253196 256787 260141 263299 266978 271060 274841 278457 282710
53796 282710 287550 291996 295587 298673 301150 302295 302296 302709 304669 307473 309618 310591 310980 311370 311823 312201
53780 312201 312445 312602 312723 312540 311290 308380 304307 300317 296965 293592 289478 284895 280669 277310 274945
53765 274945 273503 272444 270784 268030 264754 261722 258856 255690 252488 250084 248661 247378 245387 242662
53751 242662 239716 236967 234619 232788 231428 230321 229336 228588 228180 227948 227671 227496 227902 229108 230679 231919
$$ packed form
53858B65138l404l853l893l526l106k857k699k510k304k015j430n60J89N25O71
53843B34366Q78P93Jr98j109j08J031J451J294J012N62j36o59n70M3R70K244L709
53825B44774M908N885P269Q922R449P876M925J729j689n394q038q151o413m878
53811B61174m249l551k312j199l42R83K692L591L354L158L679M082L781L616M253
53796B82710M840M446L591L086K477J145JM13J960K804K145R73L89L90M53L78
53780C12201K44J57J21j83j250k910m073l990l352l373m114m583m226l359k365
53765B74945j442j059j660k754l276l032k866l166l202k404j423j283j991k725
53751B42662k946k749k348j831j360j107r85p48m08k32k77j75M06J206J571J240
$$ plain form
53735 231919 232659 233449 234835 236629 238105 238805 238857 238556 237973 237093 236080 235171 234446 233804 233128 232390 231715 231327
53717 231327 231312 231477 231608 231824 232356 233013 233278 233108 233157 233913 234943 235456 235444 235766 237092 239169 241244 242914
53699 242914 244368 246034 248170 250734 253470 256115 258610 261097 263720 266430 268994 271111 272503 273016
53685 273016 272753 272172 271924 272410 273399 274179 274218 273642 272975 272491 272092 271820 272072 273033 274158 274684 274580 274547 275044
53666 275044 275802 276470 277226 278216 278800 278108 276320 274709 274171 274225 273740 272201 269910 267426 265325 264169 264041
53649 264041 264212 263844 263029 262657 263247 264437 265615 266453 266698 266086 264840 263788 263583 264128 265035 266192 267457
53632 267457 268198 267765 266354 264937 264339 264670 265589 266772 268100 269644 271529 273760 276294 279261 282817
53617 282817 286593 289699 291662 293085 294980 297660 300752 304045 307677 311442 314506 316137 316455 316277 316441
$$ packed form
53735B31919P40P90J386J794J476P00N2l01n83q80j013r09p25o42o76p38o75l88
53717B31327j5J65J31K16N32O57K65j70M9P56J030N13j2L22J326K077K075J670
53699B42914J454J666K136K564K736K645K495K487K623K710K564K117J392N13
53685B73016k63n81k48M86R89P80L9n76o67m84l99k72K52R61J125N26j04l3M97
53666B75044P58O68P56R90N84o92j788j611n38N4m85j539k291k484k101j156j28
53649B64041J71l68q15l72N90J190J178Q38K45o12j246j052k05N45R07J157J265
53632B67457P41m33j411j417n98L31R19J183J328J544J885K231K534K967L556
53617B82817L776L106J963J423J895K680L092L293L632L765L064J631L18j78J64
$$ plain form
53602 316441 317346 318935 320934 323174 325677 328301 330470 331585 331743 331713 332052 332505 332491 331988 331616 331786 332025
53585 332025 331441 329867 328195 327331 327101 326627 325651 324767 324267 323542 322127 320620 319808 319335 318129 316037 314124
53568 314124 313237 313074 312927 312668 312554 312577 312508 312335 312266 312478 313237 315015 318090 321972 325613 328240 329859 330904
53550 330904 331687 332371 333283 334853 337180 339896 342715 345819 349426 353249 356929 360954 366445 373796 382121
53535 382121 390413 398673 407381 416304 424520 431452 437338 442840 448696 455588 463784 472916 482514 492595
53521 492595 503285 514103 524295 533901 543938 555439 568729 583601 599693 616655 634390 653149
53509 653149 673100 693979 715600 738321 762306 786558 809622 831249 852431 873735 894593
53498 894593 914496 933812 952893 971315 988755 1005935 1023850 1042540 1061347 1080046 1098980
$$ packed form
53602C16441R05J589J999K240K503K624K169J115J58l0L39M53j4n03l72J70K39
53585C32025n84j574j672q64k30m74r76q84n00p25j415j507q12m73j206k092j913
53568C14124q87j63j47k59j14K3o9j73o9K12P59J778L075L882L641K627J619J045
53550C30904P83O84R12J570K327K716K819L104L607L823L680M025N491P351Q325
53535C82121Q292Q260Q708Q923Q216O932N886N502N856O892Q196R132R598J0081
53521D92595J0690J0818J0192R606J0037J1501J3290J4872J6092J6962J7735J8759
53509F53149J9951K0879K1621K2721K3985K4252K3064K1627K1182K1304K0858
53498H94593J9903J9316J9081J8422J7440J7180J7915J8690J8807J8699J8934
$$ plain form
53487 1098980 1118233 1137347 1155753 1173055 1189028 1203831 1218136 1232619 1247348 1261952 1276192
53476 1276192 1289983 1302953 1314387 1323672 1330628 1335432 1338347 1339410 1338342 1334937 1329497 1322467 1313572
53463 1313572 1301927 1287298 1270756 1253631 1236274 1218352 1199861 1181144 1162116 1142259 1121353
53452 1121353 1099661 1077386 1054562 1031614 1009421 988550 968711 949262 930031 911430 893871
53441 893871 877309 861441 846306 832548 820923 811611 804219 798407 794148 791311 789405 788028 787280
53428 787280 787505 788965 792016 797205 804757 814234 825112 837499 851847 868252 886424 906125 927059
53415 927059 948557 970051 991893 1015131 1040378 1067377 1095735 1125560 1157102 1190212 1224387
53404 1224387 1259188 1294544 1330942 1369408 1410853 1455232 1501581 1549051 1597637 1647736 1699317
$$ packed form
53487A098980J9253J9114J8406J7302J5973J4803J4305J4483J4729J4604J4240
53476A276192J3791J2970J1434R285O956M804K915J063j068l405n440p030q895
53463A313572j1645j4629j6542j7125j7357j7922j8491j8717j9028j9857k0906
53452A121353k1692k2275k2824k2948k2193k0871j9839j9449j9231j8601j7559
53441H93871j6562j5868j5135j3758j1625r312p392n812m259k837j906j377p48
53428G87280K25J460L051N189P552R477J0878J2387J4348J6405J8172J9701K0934
53415I27059K1498K1494K1842K3238K5247K6999K8358K9825L1542L3110L4175
53404A224387L4801L5356L6398L8466M1445M4379M6349M7470M8586N0099N1581
$$ plain form
53393 1699317 1751792 1804485 1856952 1909009 1960800 2012770 2065263 2118047 2170394 2221586 2271139
53382 2271139 2318425 2362360 2401835 2436501 2466931 2493869 2517454 2537289 2553101 2565077 2573586
53371 2573586 2578876 2581042 2579985 2575270 2566138 2551720 2531082 2503212 2467535 2424679 2376404 2324452
53359 2324452 2269638 2212274 2153045 2092998 2032829 1972653 1912545 1852955 1794511 1737666 1682634
53348 1682634 1629543 1578559 1529822 1483169 1437914 1393111 1348196 1303308 1259038 1216121 1175355
53337 1175355 1137332 1101997 1068845 1037831 1009677 984895 962917 942685 923793 906519 891042
53326 891042 877360 865788 856696 849609 843265 836879 830857 825978 822306 819273 816523 814373 813592 814879
53312 814879 818403 823654 829885 836727 844338 853018 862962 874296 886972 900610 914825 929803 946149
$$ packed form
53393A699317N2475N2693N2467N2057N1791N1970N2493N2784N2347N1192M9553
53382B271139M7286M3935L9475L4666L0430K6938K3585J9835J5812J1976Q509
53371B573586N290K166j057m715r132j4418k0638k7870l5677m2856m8275n1952
53359B324452n4814n7364n9229o0047o0169o0176o0108n9590n8444n6845n5032
53348A682634n3091n0984m8737m6653m5255m4803m4915m4888m4270m2917m0766
53337A175355l8023l5335l3152l1014k8154k4782k1978k0232j8892j7274j5477
53326H91042j3682j1572r092p087o344o386o022m879l672l033k750k150p81J287
53312H14879L524N251O231O842P611Q680R944J1334J2676J3638J4215J4978J6346
$$ plain form
53299 946149 964119 983478 1004256 1027055 1052137 1078615 1105171 1131455 1158310 1186554 1215920
53288 1215920 1245249 1273421 1299995 1325171 1349329 1372531 1394321 1413961 1430867 1444888 1456286
53277 1456286 1465457 1472545 1477201 1478795 1476982 1472089 1464915 1456131 1445867 1433725 1419180 1402036 1382663
53264 1382663 1361738 1339711 1316509 1291786 1265374 1237451 1208367 1178469 1148020 1117080 1085351
53253 1085351 1052341 1017975 983039 948834 916290 885472 855972 827508 800035 773540 747990
53242 747990 723350 699342 675382 651110 626945 603736 581905 561315 541915 523961 507487
53231 507487 492183 478068 465707 455298 446024 436900 427978 420118 413722 408254 402949 397489 391920
53218 391920 386355 380877 375498 370164 364964 360152 355705 351041 345618 339750 334426 330325 327320 324835
$$ packed form
53299I46149J7970J9359K0778K2799K5082K6478K6556K6284K6855K8244K9366
53288A215920K9329K8172K6574K5176K4158K3202K1790J9640J6906J4021J1398
53277A456286R171P088M656J594j813m893p174q784j0264j2142j4545j7144j9373
53264A382663k0925k2027k3202k4723k6412k7923k9084k9898l0449l0940l1729
53253A085351l3010l4366l4936l4205l2544l0818k9500k8464k7473k6495k5550
53242G47990k4640k4008k3960k4272k4165k3209k1831k0590j9400j7954j6474
53231E07487j5304j4115j2361j0409r274r124q922p860o396n468n305n460n569
53218C91920n565n478n379n334n200m812m447m664n423n868n324m101l005k485
$$ plain form
53204 324835 322317 319454 316376 313583 311308 309034 306127 302883 300311 298809 297620 295775 293079 289957
53190 289957 286869 284157 282056 280495 279172 277968 276985 276030 274550 272372 270046 268108 266378 264409 262283
53175 262283 260481 259178 258163 257278 256508 255755 254956 254334 254088 253895 253249 252305 251892 252458 253410 253850 253662 253487
53157 253487 253683 253735 252834 250886 248728 247382 247133 247383 247308 246644 245805 245315 245250 245282 245204 245146 245188 244960 243961 242237
53137 242237 240452 239181 238427 237955 237800 238158 238914 239609 239810 239360 238375 237187 236174 235433 234724 233923 233293
53120 233293 233086 233162 233364 233953 235160 236453 236974 236754 236869 238104 239990 241482 242177 242416 242462 242069 240954
53103 240954 239317 237730 236515 235374 233776 231727 229954 229172 229366 229953 230315 229880 228067 224907 221600
53088 221600 219776 219964 221240 222435 223084 223187 222784 222224 222206 223046 224195 224885 224914 224514 223840 223042 222422 222059
$$ packed form
53204C24835k518k863l078k793k275k274k907l244k572j502j189j845k696l122
53190B89957l088k712k101j561j323j204r83r55j480k178k326j938j730j969k126
53175B62283j802j303j015q85p70p53p99o22k46j93o46r44m13N66R52M40j88j75
53157B53487J96N2r01j948k158j346k49K50p5o64q39m90o5L2p8n8M2k28r99j724
53137B42237j785j271p54m72j55L58P56O95K01m50r85j188j013p41p09q01o30
53120B33293k07P6K02N89J207J293N21k20J15J235J886J492O95K39M6l93j115
53103B40954j637j587j215j141j598k049j773p82J94N87L62m35j813l160l307
53088B21600j824J88J276J195O49J03m03n60j8Q40J149O90K9m00o74p98o20l63
$$ plain form
53070 222059 221602 220922 220633 221315 222475 222991 222590 222193 222600 223433 223735 223220 222524 222370 222847 223514 223925 223882 223348
53051 223348 222425 221517 221285 222129 223774 225546 226998 227995 228404 228211 227970 228465 229620 230223 229175 226698 223931
53034 223931 221637 219815 218309 217148 216268 215389 214360 213306 212383 211612 210983 210491 210043 209549 209191 209374 210305
53017 210305 211721 213117 214170 214895 215413 215616 215194 214080 212733 211702 211017 210338 209744 209827 210827 212149
53001 212149 213132 213836 214557 214912 214157 212371 210659 209957 210115 210429 210682 211256 212358 213529 214070 213813 213266
52984 213266 212967 212843 212432 211656 211046 211137 211910 212988 214051 214840 215071 214714 214134 213621 212939 211785 210565 210227
52966 210227 211319 213622 216719 220376 224073 226686 227254 226045 224438 223591 223490 223467 223309 223400 223824 223941 223196
52949 223196 221938 220946 220350 219571 218235 216532 214656 212575 210518 209074 208481 208315 208162 208071 208037 207673 206876
$$ packed form
53070B22059m57o80k89O82J160N16m01l97M07Q33L02n15o96j54M77O67M11m3n34
53051B23348r23r08k32Q44J645J772J452R97M09j93k41M95J155O03j048k477k767
53034B23931k294j822j506j161q80q79j029j054r23p71o29m92m48m94l58J83R31
53017B10305J416J396J053P25N18K03m22j114j347j031o85o79n94Q3J000J322
53001B12149R83P04P21L55p55j786j712p02J58L14K53N74J102J171N41k57n47
52984B13266k99j24m11p76o10R1P73J078J063P89K31l57n80n13o82j154j220l38
52966B10227J092K303L097L657L697K613N68j209j607q47j01k3j58R1M24J17p45
52949B23196j258r92n96p79j336j703j876k081k057j444n93j66j53r1l4l64p97
$$ plain form
52932 206876 206255 206330 206784 207080 207302 207701 207882 207329 206378 205721 205150 203787 201555 199468 198301 197849 197668 197726
52914 197726 198013 198322 198768 199833 201526 203118 204131 204922 205836 206412 206052 204999 204031 203579 203733 204686 206464
52897 206464 208405 209652 210130 210477 211057 211626 211970 212281 212742 213263 213824 214641 215683 216406 216311 215551 214675 213866
52879 213866 212837 211432 210017 209122 208882 208994 209115 209104 208955 208685 208392 208241 208334 208696 209492 211029 213362 215954
52861 215954 218013 219128 219473 219471 219590 220395 222374 225436 228781 231483 233151 233899 233847 232961 231319 229228 226884
52844 226884 224100 220633 216756 213265 210727 208908 207193 205506 204452 204453 205068 205401 205040 204402 204273 205183
52828 205183 207056 209244 211040 212331 213605 215140 216444 216802 216164 215091 213943 212606 210988 209354 208065
52813 208065 207341 207389 208417 210409 213173 216744 221438 227342 233889 239968 244231 245460 243190 238296 232572
$$ packed form
52932B06876o21P5M54K96K22L99J81n53r51o57n71j363k232k087j167m52j81N8
52914A97726K87L09M46J065J693J592J013P91R14N76l60j053r68m52J54R53J778
52897B06464J941J247M78L47N80N69L44L11M61N21N61Q17J042P23r5p60q76q09
52879B13866j029j405j415q95k40J12J21j1j49k70k93j51R3L62P96J537K333K592
52861B15954K059J115L45kJ19Q05J979L062L345K702J668P48n2q86j642k091k344
52844B26884k784l467l877l491k538j819j715j687j054JO15L33l61o38j29R10
52828B05183J873K188J796J291J274J535J304L58o38j073j148j337j618j634j289
52813B08065p24M8J028J992K764L571M694N904O547O079M263J229k270m894n724
$$ plain form
52798 232572 227381 222835 218476 214385 211176 209054 207410 205529 203439 201781 200896 200329 199347 197836 196398
52783 196398 195570 195250 195102 195215 195967 197334 198759 199775 200421 200992 201646 202369 203070 203594 203804 203724 203464 203051
52765 203051 202551 202307 202696 203657 204721 205566 206236 206755 206974 206910 206873 207029 207149 207028 206834 206825 206918 206850 206544 206086
52745 206086 205527 204984 204797 205278 206320 207459 208320 208884 209312 209644 209692 209274 208609 208359 209039 210400 211649 212330
52727 212330 212727 213422 214822 217168 220444 223906 226130 226123 224352 222288 220942 220148 219262 218160 217375 217456 218321
52710 218321 219229 219324 218318 216701 215322 214767 215047 215691 216056 215700 214687 213586 213058 213346 214080 214524 214097
52693 214097 212814 211314 210371 210279 210652 210775 210195 209119 208247 208077 208384 208605 208727 209382 210858 212517 213614
52676 213614 214331 215396 216895 218107 218453 218069 217429 216966 216997 217437 217627 217122 216635 217381 219329 220947 221056
$$ packed form
52798B32572n191m546m359m091l209k122j644j881k090j658q85n67r82j511j438
52783A96398q28l20j48J13P52J367J425J016O46N71O54P23P01N24K10q0k60m13
52765B03051n00k44L89R61J064Q45O70N19K19o4l7J56J20j21j94rR3o8l06m58
52745B06086n59n43j87M81J042J139Q61N64M28L32M8m18o65k50O80J361J249O81
52727B12330L97O95J400K346L276L462K224pj771k064j346p94q86j102p85Q1Q65
52710B18321R08R5j006j617j379n55K80O44L65l56j013j101n28K88P34M44m27
52693B14097j283j500r43r2L73J23n80j076q72j70L07K21J22O55J476J659J097
52676B13614P17J065J499J212L46l84o40m63L1M40J90n05m87P46J948J618J09
$$ plain form
52659 221056 220095 219071 218137 216980 215957 215826 216607 217643 218736 220514 223548 227668 232212 236441 239585
52644 239585 240948 240299 238055 235017 231935 229185 226711 224366 222371 221225 221038 221235 221182 220828 220542 220563
52628 220563 220975 221960 223739 226339 229571 233009 235806 236962 236198 234311 232337 230592 228828 226935 225007
52613 225007 223023 221021 219434 218643 218333 217779 216786 215875 215571 215886 216463 216875 216821 216399 216132 216427 217148 217999
52595 217999 219065 220498 221927 222715 222711 222273 221745 221401 221681 222749 223916 224254 223823 223581 223978 224440 224533 224816
52577 224816 226019 227869 229387 230070 230279 230539 230867 230855 230220 229180 228288 227873 227781 227791 228028 228625 229201 229183 228653
52558 228653 228309 228528 228918 228944 228491 227651 226435 225020 223903 223451 223475 223448 222963 221925 220599 219653 219779 220992
52540 220992 222520 223566 223988 224084 224036 223829 223554 223485 223898 224868 226149 227253 227872 228229 228814 229779 230864 231890
$$ packed form
52659B21056r61j024r34j157j023j31P81J036J093J778L034M120M544M229L144
52644B39585J363o49k244l038l082k750k474k345j995j146j87J97n3l54k86K1
52628B20563M12R85J779K600L232L438K797J156p64j887j974j745j764j893j928
52613B25007j984k002j587p91l10n54r93r11l04L15N77M12n4m22k67K95P21Q51
52595B17999J066J433J429P88mm38n28l44K80J068J167L38m31k42L97M62R3K83
52577B24816J203J850J518O83K09K60L28j2o35j040q92m15r2J0K37N97N76j8n30
52558B28653l44K19L90K6m53q40j216j415j117m52K4k7m85j038j326r46J26J213
52540B20992J528J046M22R6m8k07k75o9M13R70J281J104O19L57N85R65J085J026
$$ plain form
52522 231890 232929 233903 234414 234137 233086 231415 229364 227545 226753 227222 228399 229797 231696 234628 238471
52507 238471 242502 246241 249803 253408 256765 259021 259291 257407 254230 251052 248601 246764 245241 244050
52493 244050 243266 242737 242363 242330 242674 242873 242338 241147 239921 239046 238372 237645 236889 236308 236067 236299 237161 238841
52475 238841 241439 244778 248284 251213 253139 254127 254478 254509 254665 255521 257385 259972 262653 264964 266883 268777
52459 268777 271049 273574 275416 275502 273686 270880 267983 265093 261989 258863 256137 253903 252020 250530 249451
52444 249451 248352 246712 244674 242933 241837 241082 240398 240101 240648 241864 242889 242865 241664 240010 238897 238785
52428 238785 239348 239997 240502 240978 241436 241636 241323 240459 239223 237964 237073 236726 236793 237104 237655 238390 238998 239297
52410 239297 239757 241234 244044 247526 250655 253034 255305 258742 264367 272228 281387 290582 298867 305550
$$ packed form
52522B31890J039R74N11k77j051j671k051j819p92M69J177J398J899K932L843
52507B38471M031L739L562L605L357K256K70j884l177l178k451j837j523j191
52493B44050p84n29l74l3L44J99n35j191j226q75o74p27p56n81k41K32Q62J680
52475B38841K598L339L506K929J926R88L51L1J56Q56J864K587K681K311J919J894
52459B68777K272K525J842Q6j816k806k897k890l104l126k726k234j883j490j079
52444B49451j099j640k038j741j096p55o84k97N47J216J025k4j201j654j113j12
52428B38785N63O49N05M76M58K00l13q64j236j259q91l47O7L11N51P35O08K99
52410B39297M60J477K810L482L129K379K271L437N625P861R159R195Q285O683
$$ plain form
52396 305550 309837 310932 308618 303586 297168 290757 285260 280803 276941 273363 270372 268460 267516 266755 265527
52381 265527 263930 262531 261733 261548 261778 262219 262762 263512 264799 266946 269903 273143 275987 278164 280055 282268
52365 282268 284877 287205 288439 288358 287316 285696 283685 281543 279734 278583 277977 277575 277235 277072 277155 277367
52349 277367 277611 277978 278550 279073 279143 278804 278712 279446 280793 282077 283095 284304 285977 287682 288936 290065 291934
52332 291934 294972 298854 303166 307982 313659 320242 327297 334262 340918 347554 354712 362711 371374 380051
52318 380051 387792 393641 397156 398830 399800 401005 402766 405156 408302 412007 415486 418066 420087 422635
52304 422635 426415 431273 436808 442900 449462 456119 462542 468883 475489 482214 488319 493198 496983 500202
52290 500202 502919 504508 504470 503206 501653 500270 498808 497095 495500 494424 493823 493598 494004 495122 496289
$$ packed form
52396C05550M287J095k314n032o418o411n497m457l862l578k991j912r44p61j228
52381B65527j597j399p98j85K30M41N43P50J287K147K957L240K844K177J891K213
52365B82268K609K328J234q1j042j620k011k142j809j151o06m02l40j63Q3K12
52349B77367K44L67N72N23P0l39r2P34J347J284J018J209J673J705J254J129J869
52332B91934L038L882M312M816N677O583P055O965O656O636P158P999Q663Q677
52318C80051P741N849L515J674R70J205J761K390L146L705L479K580K021K548
52304D22635L780M858N535O092O562O657O423O341O606O725O105M879L785L219
52290E00202K717J589l8j264j553j383j462j713j595j076o01k25M06J118J167
$$ plain form
52275 496289 496724 496610 496911 498164 500068 502347 505259 508948 512857 516283 519242 522395 526308 531044 536264
52260 536264 541357 545598 548565 550506 552146 554142 556782 560111 564164 569035 574831 581505 588737 596020
52246 596020 602888 609011 614110 617989 620708 622625 624151 625544 626883 628165 629455 631119 633776 637666
52232 637666 642042 645664 648114 650255 653086 656434 659274 661144 662664 664604 667002 669483 672011 674831
52218 674831 677809 680415 682502 684701 687687 691283 694685 697502 700111 702901 705661 708153 710907 714854
52204 714854 720117 725676 730403 734028 736894 739121 740535 741298 742145 743842 746596 750141 754256 758976 764305
52189 764305 769830 774778 778510 780987 782741 784388 786159 787779 788679 788336 786558 783578 779839 775622 770854
52174 770854 765275 758817 751834 745020 739062 734286 730538 727455 724891 723136 722642 723511 725271 727268 729279
$$ packed form
52275D96289M35j14L01J253J904K279K912L689L909L426K959L153L913M736N220
52260E36264N093M241K967J941J640J996K640L329M053M871N796O674P232P283
52246E96020O868O123N099L879K719J917J526J393J339J282J290J664K657L890
52232F37666M376L622K450K141K831L348K840J870J520J940K398K481K528K820
52218F74831K978K606K087K199K986L596L402K817K609K790K760K492K754L947
52204G14854N263N559M727L625K866K227J414P63Q47J697K754L545M115M720N329
52189G64305N525M948L732K477J754J647J771J620R00l43j778k980l739m217m768
52174G70854n579o458o983o814n958m776l748l083k564j755m94Q69J760J997K011
$$ plain form
52159 729279 731603 734450 737415 739804 741360 742400 743231 743739 743666 742987 741904 740738 739983 740163 741348 743076
52143 743076 745032 747506 750781 754312 757033 758401 758645 758030 756502 754170 751550 749012 746440 743883 742178
52128 742178 742390 744704 748371 752743 758013 764800 773363 783404 794468 806201 818242 830097 841363
52115 841363 852022 862333 872322 881491 889130 894874 898799 901119 902027 901854 901059 899929 898483 896915
52101 896915 895944 896430 898653 902220 906808 912762 920704 930596 941367 951521 959966 966176 969830 970554
52087 970554 968112 962654 954742 945305 935572 926837 919979 915138 911842 909542 908097 907809 908830 910447
52073 910447 911230 910247 908049 906024 904816 903903 902786 901910 902002 903014 904270 905339 906225 906942 907461 908005 908890
52056 908890 910058 911133 911936 912611 913324 914143 915090 915951 916223 915652 914612 913454 911696 908458 903645 898027
$$ packed form
52159G29279K324K847K965K389J556J040Q31N08p3o79j083j166p55J80J185J728
52143G43076J956K474L275L531K721J368K44o15j528k332k620k538k572k557j705
52128G42178K12K314L667M372N270O787Q563J0041J1064J1733J2041J1855J1266
52115H41363J0659J0311R989R169P639N744L925K320R08j73p95j130j446j568
52101H96915r71M86K223L567M588N954P942R892J0771J0154Q445O210L654P24
52087I70554k442n458p912r437r733q735o858m841l296k300j445k88J021J617
52073I10447P83r83k198k025j208r13j117q76R2J012J256J069Q86P17N19N44Q85
52056I08890J168J075Q03O75P13Q19R47Q61K72n71j040j158j758l238m813n618
$$ plain form
52040 898027 892281 886664 881707 878340 876912 876709 876815 876997 877462 878267 879394 880953 882891 884794 886307
$$ packed form
52040H98027n746n617m957l367j428k03J06J82M65Q05J127J559J938J903J513
$$ [...]
##END NTUPLES=NMR SPECTRUM
##END=
