
##TITLE=UV1263_M12_1292-1216_5_7414465_SWiK2NhbUS
##JCAMPDX= 6.0         $$ Bruker NMR JCAMP-DX V2.0
##DATA TYPE= NMR SPECTRUM
##DATA CLASS= NTUPLES
##ORIGIN= BRUKER
##OWNER= Administrator
$$ 1.72 TOPSPIN		Version 2.1
$$ 2013-01-25 19:08:13.186 -0500  Administrator@X
$$ Compression mode = diff/dup
##.OBSERVE FREQUENCY= 400.02188249412
##.OBSERVE NUCLEUS= ^1H
##.ACQUISITION MODE= SIMULTANEOUS (DQD)
##.ACQUISITION SCHEME= undefined
##.AVERAGES= 64
##.DIGITISER RES= 22
##SPECTROMETER/DATA SYSTEM= spect
##.PULSE SEQUENCE= noesygpps1d.comp
##.SOLVENT NAME= COFFEE_meoh
##.SHIFT REFERENCE= INTERNAL, COFFEE_meoh, 1, 14.96103
##AUDIT TRAIL= $$ (NUMBER, WHEN, WHO, WHERE, PROCESS, VERSION, WHAT)
$$ ##TITLE= Audit trail, TOPSPIN		Version 2.1
$$ ##JCAMPDX= 5.01
$$ ##ORIGIN= Bruker BioSpin GmbH
$$ ##OWNER= Administrator
$$ $$ E:\/data/COFFEE/nmr/UV1263_M12_1292-1216_5_7414465_SWiK2NhbUS/12/pdata/1/auditp.txt
$$ ##AUDIT TRAIL=  $$ (NUMBER, WHEN, WHO, WHERE, PROCESS, VERSION, WHAT)
(   1,<2013-01-25 19:08:07.389 -0500>,<Administrator>,<X>,<go>,<TOPSPIN 2.1>,
      <created by zg
	started at 2013-01-25 18:56:37.826 -0500,
	POWCHK enabled, PULCHK disabled,
       configuration hash MD5:
       86 BA 57 50 F2 9D 5C 9B 26 00 A9 28 5F 66 2E 89
       data hash MD5: 64K
       FC 85 3E 04 07 0B C5 A4 6E 61 E2 A8 EA 83 97 B2>)
(   2,<2013-01-25 19:08:10.451 -0500>,<Administrator>,<X>,<proc1d>,<TOPSPIN 2.1>,
      <Start of raw data processing
       efp LB = 0.3 FT_mod = 6 PKNL = 1 PHC0 = 0 PHC1 = 0 SI = 128K 
       data hash MD5: 128K
       65 41 A0 D5 DA 33 ED 37 E1 8E B8 F0 30 23 6A 0F>)
(   3,<2013-01-25 19:08:11.482 -0500>,<Administrator>,<X>,<proc1d>,<TOPSPIN 2.1>,
      <pk PHC0 = -77.80518 PHC1 = 0 
       data hash MD5: 128K
       D1 13 8E 2E 11 AA B0 18 D8 B2 92 E5 67 5D 80 EB>)
(   4,<2013-01-25 19:08:12.139 -0500>,<Administrator>,<X>,<proc1d>,<TOPSPIN 2.1>,
      <abs ABSG = 1 
       data hash MD5: 128K
       50 07 66 09 6F FD C0 FF 98 6D E0 38 41 FF 25 1D>)
(   5,<2013-01-25 19:08:12.295 -0500>,<Administrator>,<X>,<proc1d>,<TOPSPIN 2.1>,
      <abs ABSG = 2 
       data hash MD5: 128K
       11 EB 70 9B 53 7A 1E 16 35 08 E2 E8 C1 2D C0 0C>)
(   6,<2013-01-25 19:08:12.482 -0500>,<Administrator>,<X>,<proc1d>,<TOPSPIN 2.1>,
      <abs ABSG = 3 
       data hash MD5: 128K
       DE BF 1F 97 3A DF 91 CD 2A 2B 22 F4 EF 91 C2 95>)
(   7,<2013-01-25 19:08:12.670 -0500>,<Administrator>,<X>,<proc1d>,<TOPSPIN 2.1>,
      <abs ABSG = 4 
       data hash MD5: 128K
       E6 9A 0C 62 03 90 19 03 3B 73 50 8A 0B DD A8 0B>)
(   8,<2013-01-25 19:08:12.857 -0500>,<Administrator>,<X>,<proc1d>,<TOPSPIN 2.1>,
      <abs ABSG = 5 
       data hash MD5: 128K
       B7 5B 33 CF 38 4C 3F 51 B6 A9 16 59 CF 27 D4 18>)
$$ ##END=
$$ 
$$ $$ hash MD5
$$ $$ B8 0A A4 94 CA E9 8A BF 74 DB C2 ED 31 7E 8C 11
##$RELAX= 
##$RELAX= 
##$RELAX= 
##$RELAX= 
##$RELAX= 
##$RELAX= 
##$RELAX= 
##$RELAX= 
$$ Bruker specific parameters
$$ --------------------------
##$DU= <E:\>
##$EXPNO= 12
$$ [...]
##$TP07= 0
##$TPNAME0= <>
##$TPNAME1= <>
##$TPNAME2= <>
##$TPNAME3= <>
##$TPNAME4= <>
##$TPNAME5= <>
##$TPNAME6= <>
##$TPNAME7= <>
##$TPOAL= (0..7)
0.5 0.5 0.5 0.5 0.5 0.5 0.5 0.5
##$TPOFFS= (0..7)
0 0 0 0 0 0 0 0
##$TUNHIN= 0
##$TUNHOUT= 0
##$TUNXOUT= 0
##$USERA1= <user>
##$USERA2= <user>
##$USERA3= <user>
##$USERA4= <user>
##$USERA5= <user>
##$V9= 5
##$VALIST= <valist>
##$VCLIST= <CCCCCCCCCCCCCCC>
##$VD= 0
##$VDLIST= <DDDDDDDDDDDDDDD>
##$VPLIST= <PPPPPPPPPPPPPPP>
##$VTLIST= <TTTTTTTTTTTTTTT>
##$WBST= 2048
##$WBSW= 25
##$XGAIN= (0..3)
0 0 0 0
##$XL= 0
##$YL= 0
##$YMAX_a= 5852966
##$YMIN_a= -12035296
##$ZGOPTNS= <>
##$ZL1= 120
##$ZL2= 120
##$ZL3= 120
##$ZL4= 120
##$ABSF1= 14.96103
##$ABSF2= -5.597152
##$ABSG= 5
##$ABSL= 3
##$ALPHA= 0
##$AQORDER= 0
##$ASSFAC= 0
##$ASSFACI= 0
##$ASSFACX= 0
##$ASSWID= 0
##$AUNMP= <proc_prof1d_extract.lims>
##$AXLEFT= 0
##$AXNAME= <>
##$AXNUC= <1H>
##$AXRIGHT= 0
##$AXTYPE= 0
##$AXUNIT= <>
##$AZFE= 0.1
##$AZFW= 0.1
##$BCFW= 0
##$BC_mod= 0
##$BYTORDP= 0
##$COROFFS= 0
##$CY= 15
##$DATMOD= 1
##$DC= 0
##$DFILT= <>
##$DTYPP= 0
##$F1P= 0
##$F2P= 0
##$FCOR= 0.5
##$FTSIZE= 131072
##$FT_mod= 6
##$GAMMA= 0
##$GB= 0
##$INTBC= 1
##$INTSCL= 1
##$ISEN= 128
##$LB= 0.3
##$LEV0= 0
##$LPBIN= 0
##$MAXI= 10000
##$MC2= 0
##$MEAN= 0
##$ME_mod= 0
##$MI= 0
##$NCOEF= 0
##$NC_proc= -2
##$NLEV= 6
##$NOISF1= 0
##$NOISF2= 0
##$NSP= 0
##$NTH_PI= 0
##$NZP= 0
##$OFFSET= 14.96103
##$PC= 1
##$PHC0= -77.80518
##$PHC1= 0
##$PH_mod= 1
##$PKNL= yes
##$PPARMOD= 0
##$PPDIAG= 0
##$PPIPTYP= 0
##$PPMPNUM= 2147483647
##$PPRESOL= 1
##$PSCAL= 4
##$PSIGN= 0
##$PYNMP= <proc.py>
##$REVERSE= no
##$SF= 400.02000962497
##$SI= 131072
##$SIGF1= 0
##$SIGF2= 0
##$SINO= 400
##$SIOLD= 131072
##$SPECTYP= <>
##$SREGLST= <1H.CDCl3>
##$SSB= 0
##$STSI= 131072
##$STSR= 0
##$SW_p= 8223.68421052631
##$SYMM= 0
##$S_DEV= 0
##$TDeff= 65536
##$TDoff= 0
##$TI= <>
##$TILT= no
##$TM1= 0
##$TM2= 0
##$TOPLEV= 0
##$USERP1= <user>
##$USERP2= <user>
##$USERP3= <user>
##$USERP4= <user>
##$USERP5= <user>
##$WDW= 1
##$XDIM= 131072
##$YMAX_p= 465782026
##$YMIN_p= -22805
##$CURPLOT= <Network HP LaserJet P1505>
##$CURPRIN= <$Network HP LaserJet P1505>
##$DFORMAT= <normdp>
##$LAYOUT= <+/1D_H.xwp>
##$LFORMAT= <normlp>
##$PFORMAT= <normpl>
##$SURQMSG= 1
$$ End of Bruker specific parameters
$$ ---------------------------------
##NTUPLES= NMR SPECTRUM
##VAR_NAME=  FREQUENCY,     SPECTRUM/REAL,   SPECTRUM/IMAG
##SYMBOL=    X,             R,               I
##VAR_TYPE=  INDEPENDENT,   DEPENDENT,       DEPENDENT
##VAR_FORM=  AFFN,          ASDF,            ASDF
##VAR_DIM=   131072,        131072,          131072
##UNITS=     HZ,            ARBITRARY UNITS, ARBITRARY UNITS
##FACTOR=    0.0627417313425164, 1,          1
##FIRST=     8223.62146879497, -1575,        -60258
##LAST=      0,             573,             -60619
##MIN=       0,             -22805,          0
##MAX=       8223.62146879497, 465782026,    0
$$ Real data points
##PAGE= N=1
##DATA TABLE= (X++(R..R)), XYDATA
$$ [...]
63967C79615Q633R469J0242J1303J2890J4522J5631J6425J7636J9629K2237K5264
63955E63496K8703L2636L7297M2995M9743N7288O5879P6434Q9419J03959J18700
63944A266549J33144J47369J60869J72672J82574J91231J98788K04141K05788
63935B863125K02759J94495J80597J61229J37490J10940Q2900N4196K5105m745
63925D008091l5965o8399j00539j30098j55145j74691j88584j97184k01055k00735
63915B555696j96714j89615j80213j69079j56399j42309j27430j12811r9293q7080
63905A094753p6070o6380n8198n1154m4392l7541l1291k6581k3449k1084j8799
63894F39814j6449j4142j2187j1202j1473j2164j1883j0294q398p060o045m882
$$ y = [379615, 388248, 397717, 407959, 419262, 432152, 446674, 462305, 478730, 496366, 515995, 538232, 563496, 592199, 624835, 662132, 705127, 754870, 812158, 878037, 954471, 1043890, 1147849, 1266549, 1399693, 1547062, 1707931, 1880603, 2063177, 2254408, 2453196, 2657337, 2863125, 3065884, 3260379, 3440976, 3602205, 3739695, 3850635, 3933535, 3987731, 4012836, 4008091, 3972126, 3903727, 3803188, 3673090, 3517945, 3343254, 3154670, 2957486, 2756431, 2555696, 2358982, 2169367, 1989154, 1820075, 1663676, 1521367, 1393937, 1281126, 1181833, 1094753, 1018683, 952303, 894105, 842951, 798559, 761018, 729727, 703146, 679697, 658613, 639814, 623365, 609223, 597036, 585834, 574361, 562197, 550314, 540020, 531622, 524562, 518517, 513635]
63882E13635l711k644j095J355M027O070P901J0714J4554J7966J9754K0390K1264
63869F30180K3071K5255K6903K7759K8292K8841K8975K8006K6019K3854K1938
63858I19093J9774J6881J3631J0604P657M231K67l803p762j1694j5561j9200k2605
63845I11513k5711k8075k9316k9791l0285l1135l1986l2357l1990l0851k9205
63834E80811k7598k6345k5200k3823k2326k1026j9878j8674j7510j6549j5491
63823C46391j3891j1831r862q325p223o544o263o133n835n325m682l939l303l128
63809B50107l275k997j985j042j071j811k411k736l213l690l525k769k199k134
63795B15249k078j705j330j244j317j445j721j995j929j625j578j844j948j689
$$ y = [513635, 509924, 507280, 506185, 507540, 511567, 517637, 525538, 536252, 550806, 568772, 588526, 608916, 630180, 653251, 678506, 705409, 733168, 761460, 790301, 819276, 847282, 873301, 897155, 919093, 938867, 955748, 969379, 979983, 987640, 991871, 992138, 988335, 980573, 968879, 953318, 934118, 911513, 885802, 857727, 828411, 798620, 768335, 737200, 705214, 672857, 640867, 610016, 580811, 553213, 526868, 501668, 477845, 455519, 434493, 414615, 395941, 378431, 361882, 346391, 332500, 320669, 310807, 302482, 295259, 288715, 282452, 276319, 270484, 265159, 260477, 256538, 253235, 250107, 246832, 243835, 241850, 240808, 239737, 237926, 235515, 232779, 229566, 225876, 222351, 219582, 217383, 215249, 213171, 211466, 210136, 208892, 207575, 206130, 204409, 202414, 200485, 198860, 197282, 195438, 193490, 191801]
63781A91801j412j271r36k69L31N28M32K31m3j94O4N07N53J82Q8N72R95P25O1
63762A92945l01k36r4J3K33N06N67L66J32M7Q4J53J70J4m02r41j152n54P83K004
63742A94337K248J734J641K585L691L733K780J974J926K087J735R03J75O5P24
63727B22338J819K707L060L294L976M917N358M983M290L894L917L968L466K073
63713B74060K10j180j711k012k633l140k989k674k967l489l282k482k060k020
63699B41631j307L52J864K393K339K257K117K066K682L815M352L814L174L273
63685B74822L495K934J934J358J151O90K9l72o85j419k305k501j818q74n9Q11
63669B77191J812K586K836K699K470K255J903J111k51j762k691k828k769l104
$$ y = [191801, 190389, 189118, 188182, 187913, 188244, 188772, 189204, 189435, 189392, 189198, 189262, 189769, 190322, 190504, 190592, 191164, 192159, 192884, 192945, 192644, 192408, 192314, 192327, 192560, 193066, 193633, 193999, 194131, 194178, 194262, 194415, 194585, 194599, 194197, 193256, 192104, 191550, 192333, 194337, 196585, 198319, 199960, 202545, 206236, 209969, 212749, 214723, 216649, 218736, 220471, 221374, 221549, 221614, 222338, 224157, 226864, 229924, 233218, 237194, 242111, 247469, 252452, 256742, 260636, 264553, 268521, 271987, 274060, 274270, 273090, 271379, 269367, 266734, 263594, 260605, 257931, 254964, 251475, 248193, 245711, 243651, 241631, 240324, 240676, 242540, 244933, 247272, 249529, 251646, 253712, 256394, 260209, 264561, 268375, 271549, 274822, 278317, 281251, 283185, 284543, 285694, 286384, 286413, 286041, 285356, 283937, 281632, 279131, 277313, 276439, 276380, 277191, 279003, 281589, 284425, 287124, 289594, 291849, 293752, 294863, 294612, 292850, 290159, 287331, 284562, 281458]
63655B81458l706m152m455m876n330n376m669l201j321K26P45L16k01j65K70O85
63639B46248R33R53O51M21J003K315L165K728J785J705K736M129N457O836Q126
63624B89191Q885R191R636J0447J1229J1723J2303J3506J5410J7517J9163K0105
63612D48306K0978K2757K5571K8381L0240L1306L2067L2069L0259K6252K0538
63601G48724J3648O074j061o260q849r396q854p846o837o257o233o772q286j1285
63587F80510j5333j9021k1390k2797k3985k4802k4446k2692k0217j7825j5773
63576D52229j3859j1767r278o526m075k510j709q32P57K716M195M975N687O850
63562D26853Q164R080R615J0162J0773J1243J1757J2791J4320J5825J7266J9415
$$ y = [281458, 277752, 273600, 269145, 264269, 258939, 253563, 248894, 245693, 244372, 244598, 245343, 245659, 245458, 245293, 245563, 246248, 247181, 248134, 248785, 249206, 250209, 252524, 255689, 258417, 260202, 261907, 264643, 268772, 274229, 281065, 289191, 298076, 307267, 316903, 327350, 338579, 350302, 362605, 376111, 391521, 409038, 428201, 448306, 469284, 492041, 517612, 545993, 576233, 607539, 639606, 671675, 701934, 728186, 748724, 762372, 768446, 767385, 761125, 752276, 742880, 734026, 726180, 719343, 713086, 706853, 700081, 691795, 680510, 665177, 646156, 624766, 601969, 577984, 553182, 528736, 506044, 485827, 468002, 452229, 438370, 426603, 417325, 410799, 406724, 404214, 402505, 401673, 402430, 405146, 409341, 414316, 420003, 426853, 435017, 444097, 453712, 463874, 474647, 485890, 497647, 510438, 524758, 540583, 557849, 577264]
63550E77264K2922K7689L3389L9829M6017M9386M7091L8376K5363J1458p30j0116
63538I07938j6496j9799k0012j7703j4108j0429p045l861j410r34l207p693j3186
63525G72055j8790k3958k8070l0639l1758l1918l1482l0616k9393k7634k4943
63514D62854k1359j7791j5305j4082j3461j2762j1691j0181q394o817n906n555
63502C19550n264m772m224l752l253k596j758q38j55j49q84j692j708p37N73J379
63486B89720J349Q62P36J575L084M259M443L999L665L590L434L163L093L190K872
63471C33034J721P1j356k168k575l102m086n312o112n964m987l818l022k705k605
63456B87014k404j951j287n27K67J057J744K291K849L591M556N734P219Q989J0773
$$ y = [577264, 600186, 627875, 661264, 701093, 747110, 796496, 843587, 881963, 907326, 918784, 918054, 907938, 891442, 871643, 851631, 833928, 819820, 809391, 802346, 798485, 797075, 796141, 792934, 785241, 772055, 753265, 729307, 701237, 670598, 638840, 606922, 575440, 544824, 515431, 487797, 462854, 441495, 423704, 408399, 394317, 380856, 368094, 356403, 346222, 337828, 331011, 325105, 319550, 314286, 309514, 305290, 301538, 298285, 295689, 293931, 293093, 292938, 292789, 291905, 290213, 288505, 287768, 288341, 289720, 291069, 291931, 292667, 294242, 297326, 301585, 306028, 310027, 313692, 317282, 320716, 323879, 326972, 330162, 333034, 334755, 334826, 333470, 331302, 328727, 325625, 321539, 316227, 310115, 304151, 299164, 295346, 292324, 289619, 287014, 284610, 282659, 281372, 280845, 281112, 282169, 283913, 286204, 289053, 292644, 297200, 302934, 310153, 319142, 329915]
63441C29915J2474J4488J7153K0219K3457K7410L2480L7164L8471L4605K6639
63430F14475J7187Q334J220l397n303n032l151L97N623J1661J7376K2490K7492
63417G09372L2629L7498M1198M2441M0020L3934K5685J6863P941q01p919j1659
63405I67202j2019j0804r541q440p480p388q950j2083j6195k0951k6149l1159
63393G96043l4947l6731l6471l4853l2726l0506k8049k5235k2332j9601j6898
63382D77694j4070j1423r333p519n354k779m29J160K057K685L480M751O438Q060
63368D55418R283J0479J2313J4844J7446J9645K1621K3813K6373K9055L1531L3730
63356G05551L5863L7884L8946L7880L4434K9453K3521J6227P415j462q246j1998
$$ y = [329915, 342389, 356877, 374030, 394249, 417706, 445116, 477596, 514760, 553231, 587836, 614475, 631662, 639996, 641216, 637819, 632516, 627484, 624333, 624730, 630353, 642014, 659390, 681880, 709372, 742001, 779499, 820697, 863138, 903158, 937092, 962777, 979640, 987581, 986780, 978861, 967202, 955183, 944379, 934838, 926398, 918918, 911530, 902580, 890497, 874302, 853351, 827202, 796043, 761096, 724365, 687894, 653041, 620315, 589809, 561760, 536525, 514193, 494592, 477694, 463624, 452201, 442868, 435349, 429995, 427216, 426787, 427947, 430004, 432689, 436169, 440920, 447358, 455418, 464701, 475180, 487493, 502337, 519783, 539428, 561049, 584862, 611235, 640290, 671821, 705551, 741414, 779298, 818244, 856124, 890558, 920011, 943532, 959759, 967174, 965712, 957466, 945468]
63344I45468j3239j2691j0885q835p860q438j0063j2475j6119k1038k6152l0133
63332G67540l2527l3617l3692l2852l1118k8286k4054j8647j3035q076l728M41
63320E08349L895M791J467n649j3764j9692k2140k1953k0423j8035j4960j1945
63308C69941r867q792q137p565p138o738n994m862l754l025k633k358j998j446
63294B95634q64o36r52j575k193k754l126k968k309j806j892k096j784j064m11
63279B69204J51O78O26m32j698j890r37mK14J49K37K40lj6N96J443J833J543R31
63260B72865O21J081K171L061L166K905L004L296L051K396K345L236M131M207
63246C11536L963M442N849P464Q581R078R293R622J0252J1181J2510J4439J6664
$$ y = [945468, 932229, 919538, 908653, 899818, 891958, 883520, 873457, 860982, 844863, 823825, 797673, 767540, 735013, 701396, 667704, 634852, 603734, 575448, 551394, 532747, 519712, 511636, 507908, 508349, 512244, 517035, 518502, 512853, 499089, 479397, 457257, 435304, 414881, 396846, 381886, 369941, 360074, 351282, 343145, 335580, 328442, 321704, 315710, 310848, 307094, 304069, 301436, 299078, 297080, 295634, 294770, 294134, 293182, 291607, 289414, 286660, 283534, 280566, 278257, 276451, 274559, 272463, 270679, 269615, 269204, 269355, 270033, 270659, 270227, 268529, 266639, 265702, 265698, 265912, 266061, 266298, 266538, 266535, 266519, 267115, 268558, 270391, 271934, 272865, 273486, 274567, 276738, 279799, 282965, 285870, 288874, 292170, 295221, 297617, 299962, 303198, 307329, 311536, 315499, 319941, 325790, 333254, 341835, 350913, 360206, 369828, 380080, 391261, 403771, 418210, 434874]
63233D34874J8279J8827J9131K0318K2181K3357K3087K1906K0579J9250J7940
63222F59729J7066J6954J7401J8041J8696J9217J9375J9198J9019J8965J8647
63211H62308J7383J4569J0013M231j798p533j3151j8592k2961k5608k7150k8465
63199G63246k9190k8426k6509k4637k2911k0235j6317j2295r039o170l189l57
63187E63971K129M707P595J0275J2424J4451J6641J8632K0196K1599K2733K2880
63175G38233K1812K0262J8790J7222J5740J5373J6532J7952J8005J6365J3655
63164I29941J0218O047J332l765r385j5297k0564k4603k7949l1293l4205l5657
63152G44820l5389l4055l2283l0244k7929k5334k2571j9989j7882j5927j3535
$$ y = [434874, 453153, 471980, 491111, 511429, 533610, 556967, 580054, 601960, 622539, 641789, 659729, 676795, 693749, 711150, 729191, 747887, 767104, 786479, 805677, 824696, 843661, 862308, 879691, 894260, 904273, 908504, 906706, 899173, 886022, 867430, 844469, 818861, 791711, 763246, 734056, 705630, 679121, 654484, 631573, 611338, 595021, 582726, 573687, 567517, 564328, 563971, 566100, 570807, 578402, 588677, 601101, 615552, 632193, 650825, 671021, 692620, 715353, 738233, 760045, 780307, 799097, 816319, 832059, 847432, 863964, 881916, 899921, 916286, 929941, 940159, 946206, 947538, 943773, 934388, 919091, 898527, 873924, 845975, 814682, 780477, 744820, 709431, 675376, 643093, 612849, 584920, 559586, 537015, 517026, 499144, 483217, 469682]
63141D69682j0909q988q078p392o316n228m563m047l463l231l419l157j904n40
63127C98447j17k41K11J277K002K011K013K645L709M544M666M023L056K348K029
63112D32623J812J665J862K232K135J556J347J913K523K486K122J885J491P25
63098D58377K06M16P64N38N4j01j84o25r96p58l28k70j80M28Q61L12m50r6J043
63079D59011J476J086J324K744M139M559M702N496O614P187P166P146P426P928
63065E28004Q622R571J0726J1989J3280J4518J5840J7624K0039K2682K5217K8001
63053G26113L1471L5180L8261M0684M3186M5962M8295M9694N0561N1331N1572
63042A212310N0410M7681M4426M2222M1938M2939M3794M3907M3968M4578M5098
$$ y = [469682, 458773, 449785, 441707, 434315, 427999, 422771, 418208, 414161, 410698, 407467, 404048, 400891, 398987, 398447, 398330, 398089, 398300, 399577, 401579, 403590, 405603, 408248, 411957, 416501, 421167, 425190, 428246, 430594, 432623, 434435, 436100, 437962, 440194, 442329, 443885, 445232, 447145, 449668, 452154, 454276, 456161, 457652, 458377, 458583, 458999, 459763, 460301, 460355, 460254, 460070, 459445, 458449, 457691, 457363, 457093, 456913, 457341, 458202, 458514, 458064, 457968, 459011, 460487, 461573, 462897, 465641, 469780, 474339, 479041, 484537, 491151, 498338, 505504, 512650, 520076, 528004, 536626, 546197, 556923, 568912, 582192, 596710, 612550, 630174, 650213, 672895, 698112, 726113, 757584, 792764, 831025, 871709, 914895, 960857, 1009152, 1058846, 1109407, 1160738, 1212310, 1262720, 1310401, 1354827, 1397049, 1438987, 1481926, 1525720, 1569627, 1613595, 1658173, 1703271]
63031A703271M4514M2750M0156L6166K9645K0427R550k104j4342k6840l8674m8981
63019A795538n7357o3453o6837o7575o6360o3833o0166n5365m9562m2951l5865
63008A166214k8848k2284j6003r683l423K574Q581J4955K1304K6662L0463L2854
62996A223366L4203L4918L5545L6367L6985L6935L6498L6263L6096L5303L3693
62985A616172L1659K9313K6229K2125J6985J0570K490p059j7281k7479l7257m6092
62973A620375n3416n9144o3487o6275o7074o5974o3621o0507n6775n2627m8354
62962I63121m4002l9618l5546l1990k8539k4929k1911k0445k0200j9846j8765
62951F57330j7528j6669j6030j5404j4881j4357j3508j2437j1623j1047j0223
$$ y = [1703271, 1747785, 1790535, 1830691, 1866857, 1896502, 1916929, 1926479, 1924375, 1910033, 1883193, 1844519, 1795538, 1738181, 1674728, 1607891, 1540316, 1473956, 1410123, 1349957, 1294592, 1245030, 1202079, 1166214, 1137366, 1115082, 1099079, 1089396, 1085973, 1088547, 1097128, 1112083, 1133387, 1160049, 1190512, 1223366, 1257569, 1292487, 1328032, 1364399, 1401384, 1438319, 1474817, 1511080, 1547176, 1582479, 1616172, 1647831, 1677144, 1703373, 1725498, 1742483, 1753053, 1755543, 1748484, 1731203, 1703724, 1666467, 1620375, 1566959, 1507815, 1444328, 1378053, 1310979, 1245005, 1181384, 1120877, 1064102, 1011475, 963121, 919119, 879501, 843955, 811965, 783426, 758497, 736586, 716141, 695941, 676095, 657330, 639802, 623133, 607103, 591699, 576818, 562461, 548953, 536516, 524893, 513846, 503623]
62940E03623r209q737r046r347q779p400n915m905m512m448m227l727l353l307
62926D16711l059k149j112q30j235j524j371j047o25o1K06k38q75r44p98j358
62910C99691k429k915k659k593k982k911j906p36k14l26q05j392j363j19J515
62895C77856J902Q16k58l37nR4K06L24k45j347j607n56L84M2p51p98m22l83k07
62876C74708P98J830J612M25m74q48j378k019k042j493j189j278j093m65m4j65
62860C66885l76k27K07O64R54R33P09P26J122J329R45N06O90J089P51k85r41o04
62842C75077J70N09J95l95p83p20l54p4n8k02n63j389k419k823k235j324p48j74
62824C61690R29K190K805K712K442K186J843J642J936K570L215L919M674M846
$$ y = [503623, 494414, 485677, 476631, 467284, 458505, 451105, 445190, 440285, 435773, 431325, 427098, 423371, 420018, 416711, 413652, 411503, 410391, 409561, 408326, 406802, 405431, 404384, 403759, 403698, 403904, 403666, 402791, 401847, 401049, 399691, 397262, 394347, 391688, 389095, 386113, 383202, 381296, 380560, 380346, 380020, 379215, 377823, 376460, 376341, 377856, 379758, 380574, 380316, 379979, 379974, 380068, 380274, 380598, 380353, 379006, 377399, 376843, 377227, 377269, 376518, 375720, 375298, 374915, 374708, 375506, 377336, 378948, 379373, 378899, 378051, 376673, 374654, 372612, 371119, 369930, 368652, 367559, 367094, 367050, 366885, 366509, 366282, 366489, 367153, 368107, 369040, 369749, 370475, 371597, 372926, 373871, 374377, 375067, 376156, 376907, 376622, 375681, 375077, 375247, 375756, 375951, 375556, 374773, 374053, 373699, 373625, 373567, 373365, 372802, 371413, 368994, 366171, 363936, 362612, 361864, 361690, 362619, 364809, 367614, 370326, 372768, 374954, 376797, 378439, 380375, 382945, 386160, 390079, 394753, 399599]
62810C99599M070L268L670M992N778N477N012N157N603N976O714Q170R670J0179
62796D83335R604Q851Q849R897J1721J3786J5610J7095J8610K0751K3940K8092
62784F70141L2657L7123M1593M6532N1930N7178O2060O7138P2701P7861Q1479
62773A298393Q3477Q4384Q3924Q1037P5244O6990N6543M3643K8599J2843k208
62762A912869j6274k9676m2178n2984o1610o8171p2909p5865p7085p6831p5439
62751A263847p3142p0095o6471o2423n8026n3381m8762m4487m0505l6357l1797
62740F78401k7338k3781k1214j8977j6631j4493j2942j1725j0364q883p663o775
62728D97615n900m834l723k826k229j708q24O35K203L097L194L276M135N729P519
$$ y = [399599, 403669, 406937, 410607, 415599, 421377, 426854, 431866, 437023, 442626, 448602, 455316, 463486, 473156, 483335, 492939, 501790, 510639, 520536, 532257, 546043, 561653, 578748, 597358, 618109, 642049, 670141, 702798, 739921, 781514, 828046, 879976, 937154, 999214, 1066352, 1139053, 1216914, 1298393, 1381870, 1466254, 1550178, 1631215, 1706459, 1773449, 1829992, 1873635, 1902234, 1915077, 1912869, 1896595, 1866919, 1824741, 1771757, 1710147, 1641976, 1569067, 1493202, 1416117, 1339286, 1263847, 1190705, 1120610, 1054139, 991716, 933690, 880309, 831547, 787060, 746555, 710198, 678401, 651063, 627282, 606068, 587091, 570460, 555967, 543025, 531300, 520936, 512053, 504390, 497615, 491715, 486881, 483158, 480332, 478103, 476395, 475571, 476206, 478409, 481506, 484700, 487976, 492111, 497840, 505359]
62713E05359R255J0998J2722J4331J5936J7750J9834K2193K4897K7900L0970L4086
62701G46231L7654M1924M6540N1009N5453O0443O6125P1830P6536P9584Q0819
62690A414148Q0142P7075P1075O2346N1875M0227K6834J1256n282k0694l4193
62679A774809m6409n7385o5955p1580p5294p7981p8973p7451p4141p0391o6392
62668A012857o1623n6398n1553m7063m2298l7447l3372l0245k7468k4849k2694
62657E77847k0768j8388j5656j3475j2186j1146r945q993q630q492q224q017q037
62644D25890p900p190n985m584l107j689o63k84n05j092j656j680r69q9J40l67
62628C88270r62j223j412j856k406k698k572k038j176j87O38J142J352J409J608
$$ y = [505359, 514614, 525612, 538334, 552665, 568601, 586351, 606185, 628378, 653275, 681175, 712145, 746231, 783885, 825809, 872349, 923358, 978811, 1039254, 1105379, 1177209, 1253745, 1333329, 1414148, 1494290, 1571365, 1642440, 1704786, 1756661, 1796888, 1823722, 1834978, 1829696, 1809002, 1774809, 1728400, 1671015, 1605060, 1533480, 1458186, 1380205, 1301232, 1223781, 1149640, 1079249, 1012857, 951234, 894836, 843283, 796220, 753922, 716475, 683103, 652858, 625390, 600541, 577847, 557079, 538691, 523035, 509560, 497374, 486228, 476283, 467290, 458660, 450168, 441944, 433927, 425890, 417990, 410800, 404815, 400231, 397124, 395435, 394772, 394488, 393983, 392891, 391235, 389555, 388586, 388497, 388637, 388270, 387308, 386085, 384673, 382817, 380411, 377713, 375141, 373103, 371927, 371740, 372378, 373520, 374872, 376281, 377889]
62613C77889K295L396M335M674M592M427M200M083M735O485Q535R837J0550J1709
62599D61742J3707J6029J8420K1300K4820K8455L1841L5132L8261M0613M1789
62588G72109M2082M1717M0174L6756L1435K4789J7454R879K343n047j2189j8768
62576I82734k4499k9458l3751l6928l8282l7833l6486l5046l3632l2039l0157
62565F14623k7824k4911k1846j9521j8279j7426j6010j3846j1482r525q233p577
62553D18143p302p071o619n783m451k795j417r15j165j377r38j1P37Q00K34l90
62537C79680n46l45l68p30p50P5J266K060K556L381M560N531O163O936Q056R238
62521D26763J0441J2058J4239J6700J9362K2484K5985K9317L2240L5125L8243
$$ y = [377889, 380184, 383580, 387915, 392589, 397181, 401608, 405808, 409891, 414626, 421111, 429646, 439483, 450033, 461742, 475449, 491478, 509898, 531198, 556018, 584473, 616314, 651446, 689707, 730320, 772109, 814191, 855908, 896082, 932838, 964273, 989062, 1006516, 1016395, 1018738, 1013691, 1001502, 982734, 958235, 928777, 895026, 858098, 819816, 781983, 745497, 710451, 676819, 644780, 614623, 586799, 561888, 540042, 520521, 502242, 484816, 468806, 454960, 443478, 433953, 425720, 418143, 410841, 403770, 397151, 391368, 386917, 384122, 382705, 381790, 380625, 379248, 378310, 378299, 379036, 379836, 380070, 379680, 379134, 378789, 378421, 377691, 376941, 377016, 378282, 380342, 382898, 386279, 390839, 396370, 402533, 409469, 417525, 426763, 437204, 449262, 463501, 480201, 499563, 522047, 548032, 577349, 609589, 644714, 682957]
62510F82957M1304M3897M5809M6668M5837M3024L8567L2961K6490J9441J2152
62499A079107M621l384j1580j8937k4479k7989k9940l0973l1416l0854k8331k3616
62487H22229j8057j3452j0072o635k292K349O362R640J2439J4637J5964J6230
62475H49342J4957J1613O740K049j386m393q431j3661j9043k3841k7974l1182
62463G54790l2848l2882l2062l1223l0451k9217k7047k4057k0896j8180j5911
62452D60016j3674j1382r379p713n903l789k116j604j739j199N42K604L814L970
62438D12448L759L807M082M207L976L427K551J274k37j549k484l422m794o424
62424D20621p671q149p978p472o929o564o314n829n020m403m353m339l519k063
$$ y = [682957, 724261, 768158, 813967, 860635, 906472, 949496, 988063, 1021024, 1047514, 1066955, 1079107, 1083728, 1080344, 1068764, 1049827, 1025348, 997359, 967419, 936446, 905030, 874176, 845845, 822229, 804172, 790720, 780648, 774013, 771721, 774070, 780432, 790072, 802511, 817148, 833112, 849342, 864299, 875912, 882652, 884701, 883315, 878922, 870491, 856830, 837787, 813946, 785972, 754790, 721942, 689060, 656998, 625775, 595324, 566107, 539060, 515003, 494107, 475927, 460016, 446342, 434960, 425581, 417868, 411965, 408176, 406060, 404456, 402717, 401518, 402060, 404664, 408478, 412448, 416207, 420014, 424096, 428303, 432279, 435706, 438257, 439531, 439294, 437745, 435261, 431839, 427045, 420621, 412950, 404801, 396823, 389351, 382422, 375858, 369544, 363715, 358695, 354292, 349939, 345600, 342081, 340018]
62410C40018j053j091j673k089k206k169j966j657j422j191o53J16O41Q08J104
62395C25517J814K547K827K680K331J883J544J675K300K993L552M246N149N804
62381C66862N915N838O014O367O655O948P325P576P633P887Q572R338R859J0497
62367D73286J1745J3311J4479J5206J6320J8564K1853K5607K9461L3577L8374
62356G11783M4014N0074N5698N9952O2028O1332N7703N1527M3346L3582K2955
62345A253994J2842M535j922p506j2912j8107k3138k8423l3858l8392m1062m1973
62333A024078m1808m0866l9043l6419l3362l0159k6883k3536k0239j7388j5571
62322F98804j5035j5271j5554j5733j6116j6738j7312j7720j7857j7249j5595
$$ y = [340018, 338965, 337874, 336201, 334112, 331906, 329737, 327771, 326114, 324692, 323501, 322848, 322964, 323605, 324413, 325517, 327331, 329878, 332705, 335385, 337716, 339599, 341143, 342818, 345118, 348111, 351663, 355909, 361058, 366862, 372777, 378615, 384629, 390996, 397651, 404599, 411924, 419500, 427133, 435020, 443592, 452930, 462789, 473286, 485031, 498342, 512821, 528027, 544347, 562911, 584764, 610371, 639832, 673409, 711783, 755797, 805871, 861569, 921521, 983549, 1044881, 1102584, 1154111, 1197457, 1231039, 1253994, 1266836, 1271371, 1269449, 1261943, 1249031, 1230924, 1207786, 1179363, 1145505, 1107113, 1066051, 1024078, 982270, 941404, 902361, 865942, 832580, 802421, 775538, 752002, 731763, 714375, 698804, 683769, 668498, 652944, 637211, 621095, 604357, 587045, 569325, 551468, 534219, 518624]
62311E18624j3651j2522j2108j1277r685q245p496o763n480m181l494l130k656
62298D17936k313k317k116j286m06j98l45r0N65J072J312J562J878K213K725L373
62282D23565L653L376L146L407L582L012K153J977K566L241L825M803O296P750
62268D76352Q645R052R509J0695J3035J6255J9629K2934K6699L1227L6036M0759
62256G20827M5800N1500N7317O2508O6835O9703O9534O5144N7318M7950L8137
62245A352573K8128J8584J0374L310l702j1203j8883k6550l4284m1626m7674n2115
62233A176932n5237n6990n6973n5358n2822m9559m5369m0704l6577l3138k9545
62222F64660k5511k1945j9621j8118j6645j5130j3914j2987j2081j1095r997q728
$$ y = [518624, 504973, 492451, 480343, 469066, 459381, 451136, 443640, 436877, 431397, 427216, 423722, 420592, 417936, 415623, 413306, 411190, 409904, 409498, 409300, 408955, 408865, 409430, 410502, 411814, 413376, 415254, 417467, 420192, 423565, 427218, 430594, 433740, 437147, 440729, 443741, 445894, 447871, 450437, 453678, 457503, 462306, 468602, 476352, 484997, 494049, 503558, 514253, 527288, 543543, 563172, 586106, 612805, 644032, 680068, 720827, 766627, 818127, 875444, 937952, 1004787, 1074490, 1144024, 1209168, 1266486, 1314436, 1352573, 1380701, 1399285, 1409659, 1412969, 1409267, 1398064, 1379181, 1352631, 1318347, 1276721, 1229047, 1176932, 1121695, 1064705, 1007732, 952374, 899552, 849993, 804624, 763920, 727343, 694205, 664660, 639149, 617204, 597583, 579465, 562820, 547690, 533776, 520789, 508708, 497613, 487616, 478888]
62210D78888p472o598o029n158l732k367j792j941k098j721q24K08R55J318J662
62195D43299K427L562M618N425O249P287Q313Q984R222R218R236R516J0108J0771
62181E48235J1196J1233J0808R797Q257O603N236M170L377L300M531P075J0360
62168F44178J3976J8024K2795K8361L4323L9806M3786M5838M6283M5289M2227
62157A024886L6383K8190J9210J1015M388o86m847r057j3885j9074k4095k8855
62145A023573l3385l7129l9138l8985l7071l4110l0744k7401k4095k0473j6449
62134F84593j2598r521p128n027l215j869p56M64J674K594L404M506N963P786
62120F70870J0346J3652J6456J7000J4686J0453N769J848m77j084p20k39P5j00
$$ y = [478888, 471416, 464818, 458789, 453631, 449899, 447532, 445740, 443799, 441701, 439980, 439156, 439364, 440319, 441637, 443299, 445726, 449288, 453906, 459331, 465580, 472867, 481180, 490164, 499386, 508604, 517840, 527356, 537464, 548235, 559431, 570664, 581472, 591269, 599526, 606129, 611365, 615535, 618912, 622212, 626743, 633818, 644178, 658154, 676178, 698973, 727334, 761657, 801463, 845249, 891087, 937370, 982659, 1024886, 1061269, 1089459, 1108669, 1119684, 1124072, 1123386, 1118539, 1109482, 1095597, 1076523, 1052428, 1023573, 990188, 953059, 913921, 874936, 837865, 803755, 773011, 745610, 721515, 701042, 684593, 671995, 662474, 655346, 650319, 647104, 645235, 644479, 644943, 646617, 649211, 652615, 657121, 663084, 670870, 681216, 694868, 711324, 728324, 743010, 753463, 759232, 761080, 760603, 759519, 758799, 758560, 758635, 758535]
62106G58535j761n473j0000j3257j4548j4764j4475j3215j0739p774n010k445
62094F45074n6J791L039M136N225N883O077O415P125P576P329O869O809P081P450
62079G27823Q222R784J1904J3989J5784J7380J8806J9941K0645K0880K0845K0958
62067I26961K1359K1665K1707K2213K3977K6471K8193K8372K7425K5554K2074
62056A195971J6611J0088L978q80m350o662q478j0766j4036j8051k2473k7252
62044A113700l2108l6231l8914m0071l9903l8592l6636l4799l3322l1555k8887
62033G22682k5643k2740k0617j8860j6732j4024j1410r840r428r248q616q032
62021E47492q267q990r227q874q695r016r356r366r074q291o899n588n149n021
$$ y = [758535, 756774, 751301, 741301, 728044, 713496, 698732, 684257, 671042, 660303, 652529, 647519, 645074, 645018, 646809, 649848, 653984, 659209, 665092, 671169, 677584, 684709, 692285, 699614, 706483, 713292, 720373, 727823, 736045, 745829, 757733, 771722, 787506, 804886, 823692, 843633, 864278, 885158, 906003, 926961, 948320, 969985, 991692, 1013905, 1037882, 1064353, 1092546, 1120918, 1148343, 1173897, 1195971, 1212582, 1222670, 1226648, 1225768, 1221418, 1214756, 1206278, 1195512, 1181476, 1163425, 1140952, 1113700, 1081592, 1045361, 1006447, 966376, 926473, 887881, 851245, 816446, 783124, 751569, 722682, 697039, 674299, 653682, 634822, 618090, 604066, 592656, 582816, 573388, 564140, 555524, 547492, 539225, 530235, 521008, 512134, 503439, 494423, 485067, 475701, 466627, 458336, 451437, 445849, 440700, 435679]
62007D35679l923j954n49p7Q24K955N181O176O108N660M699L033J363L47l88j278
61991D63856j860j789j874k907m316n208n895p019p954p586o247n308n081m597
61977C96215l433k343j897j720j449j430j991k739k956k317j059J27M14m64j758
61962C71200k371j935r85k12L7k38p34r69p51l14K17J140K610M152N242O001O845
61945C88935P817Q815J0031J1640J3369J4981J6740J8759K0377K0965K0966K1296
61933E74691K1913K1901K0887J9513J8396J7379J5951J3832J0988P610M179J218
61921G48458j160l228n223p212r128j0647j1154j0251q117n150j541K483O395
61908F84525R833J2993J6060J8524J9605J9122J7427J4784J1378P617L848q7m453
$$ y = [435679, 431756, 429802, 429253, 429176, 430000, 432955, 438136, 444312, 450420, 456080, 460779, 463812, 465175, 465522, 465134, 463856, 461996, 460207, 458333, 455426, 451110, 445902, 440007, 432988, 425034, 417448, 411201, 405893, 400812, 396215, 392782, 390439, 388542, 386822, 385373, 383943, 381952, 379213, 376257, 373940, 372881, 373008, 373422, 372958, 371200, 368829, 366894, 365909, 365697, 365734, 365496, 364762, 363793, 363042, 362728, 362945, 364085, 366695, 370847, 376089, 382090, 388935, 396752, 405567, 415598, 427238, 440607, 455588, 472328, 491087, 511464, 532429, 553395, 574691, 596604, 618505, 639392, 658905, 677301, 694680, 710631, 724463, 735451, 743061, 747240, 748458, 747298, 744070, 738847, 731635, 722507, 711860, 700706, 690455, 682338, 677188, 675647, 678130, 684525, 694358, 707351, 723411, 741935, 761540, 780662, 798089, 812873, 824251, 831868, 835716, 835629, 831176]
61895H31176q911j2755j5597j7408j8180j8131j7870j7778j7446j6440j5204j4448
61883F41008j3926j2810j1192j0182j0328j0891j0978j0644j0428j0377j0073
61872E19179r311q334p499o883o148m776k613j70J772K857L380L978N159O958
61858D97549Q890J0503J2057J4248J7152K0055K2578K5214K8305L1200L3183L4536
61846G55470L5803L6596L6172L4775L3138L0875K6729K0461J3316O341n83p576
61834A021517j3677j7666j9301j9114j7473j4436j0117m803J074O773J1476J4930
61822I39183J7500J9269J9543J7571J3401P647P83o909j4899k2474k9110l4442
61810I27063l7942l9119l8174l6178l4324l3031l1746k9655k6512k2893j9678
$$ y = [831176, 822265, 809510, 793913, 776505, 758325, 740194, 722324, 704546, 687100, 670660, 655456, 641008, 627082, 614272, 603080, 592898, 582570, 571679, 560701, 550057, 539629, 529252, 519179, 509868, 501534, 494035, 487152, 481004, 476228, 473615, 473445, 475217, 478074, 481454, 485432, 490591, 497549, 506439, 516942, 528999, 543247, 560399, 580454, 603032, 628246, 656551, 687751, 720934, 755470, 791273, 827869, 864041, 898816, 931954, 962829, 989558, 1010019, 1023335, 1029676, 1029093, 1021517, 1007840, 990174, 970873, 951759, 934286, 919850, 909733, 904930, 906004, 912777, 924253, 939183, 956683, 975952, 995495, 1013066, 1026467, 1034114, 1034897, 1027988, 1013089, 990615, 961505, 927063, 889121, 850002, 811828, 775650, 741326, 708295, 676549, 646894, 620382, 597489, 577811]
61799E77811j7301j5471j3589j1466r549q364p738o903n492m182l843m321m622
61786D64970m236l613l225k892k339j830j764k102k598l121l394k912j661n49
61772D28734m17r36j052l23O41R90M05p78j794j962j296m89l6L00Q75J479J713
61755D26054J674J712J850J881J773J472O95n62j671k097k122k308k616k637k320
61740D20778j800r73K7M58q7p78o25j6k7m72r4J316K375K096J158O61P08Q96J328
61721D26929K239L240L735L785L872M061L976L446K732K103J625J277J042P44
61707D64806L6j295k989m334m793m596m535m993n482n311m474l568l131l334m017
61692D07990m656m615l837l000k623k416j993j696k009k585k642k141j717j642
$$ y = [577811, 560510, 545039, 531450, 519984, 510435, 502071, 494333, 487430, 481938, 477756, 473913, 469592, 464970, 460734, 457121, 453896, 451004, 448665, 446835, 445071, 442969, 440371, 437250, 433856, 430944, 429283, 428734, 428317, 427381, 426329, 426006, 426647, 427637, 428042, 427264, 425470, 423508, 422212, 421723, 421687, 421987, 422862, 424341, 426054, 427728, 429440, 431290, 433171, 434944, 436416, 437111, 436549, 434878, 432781, 430659, 428351, 425735, 423098, 420778, 418978, 418005, 418032, 418490, 418403, 417625, 417000, 416984, 416957, 416485, 416391, 417707, 420082, 422178, 423336, 423997, 424705, 425601, 426929, 429168, 432408, 436143, 439928, 443800, 447861, 451837, 455283, 458015, 460118, 461743, 463020, 464062, 464806, 464842, 463547, 460558, 456224, 451431, 446835, 442300, 437307, 431825, 426514, 422040, 418472, 415341, 412007, 407990, 403334, 398719, 394882, 391882, 389259, 386843, 384850, 383154, 381145, 378560, 375918, 373777, 372060, 370418]
61678C70418j664j714j979k238k035j553j495j930k117j697j289j544k219k555
61664C44389k165j276m17p9l24o40m01M23J335J910K011J597Q13J77K13Q80J792
61647C50238K723L533L896L774L750M245M728M483L820L484L208K044J48j150
61633C92924j312j447k717m819o598p298o781n286l578k672k792l099k848k223
61619C39454j646r93m1Q52J175J063J065J331J427Q82l92k085l670m704n089n053
61603C23576m909m872m923m693l846k816k651l639m664m576l686l020k635j830
61589B70816p29l03q01j331j238q17m49j1N35Q95R75Q74L38q28j896j918j325
61572B62787j395k110k072r63k85r37j716j333m23k15m35m6P96J132R50J114J765
$$ y = [370418, 368754, 367040, 365061, 362823, 360788, 359235, 357740, 355810, 353693, 351996, 350707, 349163, 346944, 344389, 342224, 340948, 340531, 340452, 340128, 339488, 339087, 339510, 340845, 342755, 344766, 346363, 347176, 347353, 347566, 348446, 350238, 352961, 356494, 360390, 364164, 367914, 372159, 376887, 381370, 385190, 388674, 391882, 393926, 394074, 392924, 391612, 390165, 387448, 382629, 376031, 368733, 361952, 356666, 353088, 350416, 347624, 344525, 341677, 339454, 337808, 336815, 336774, 337626, 338801, 339864, 340929, 342260, 343687, 344569, 344177, 342092, 338422, 333718, 328629, 323576, 318667, 313795, 308872, 304179, 300333, 297517, 294866, 291227, 286563, 281987, 278301, 275281, 272646, 270816, 270087, 269784, 268983, 267652, 266414, 265597, 265148, 265137, 265672, 266567, 267542, 268416, 268754, 267926, 266030, 264112, 262787, 261392, 259282, 257210, 256247, 255962, 255025, 253309, 251976, 251553, 251338, 250903, 250857, 251653, 252785, 253735, 254849, 256614]
61555B56614K082J608Q12L12K74N55Q48Q30O08P27J392K036K083J612R60L08P2
61538B73733Q43K274K900J975P32P63J802K251J467L19l21m27j77L99R32P70j66
61521B90069j176j664j721j735j789j629j064l11j4n54j313j135K44J722K152
61506B80082J555O46k25r86j295r09k58P3J31L11N97P43P85P80L35q00j995k323
61488B77247j727q99k08N12J253J633J502J162R41R34J137J438J578J368Q81K47
61472B88999m32q57o96k02q2m35n09R5O77N66J96L19P48P76L36j08l76m81j94
61453B88340M56P36K23k61K79J378J732J154P41J170J942K387K466K427K454K749
61437C10373L256L432K990K576K907L541L459K685K154K115J879J197P19P81Q38
$$ y = [256614, 258696, 260304, 261116, 261428, 261702, 262257, 263105, 263935, 264543, 265270, 266662, 268698, 270781, 272393, 273353, 273661, 273733, 274576, 276850, 279750, 281725, 282457, 283220, 285022, 287273, 288740, 289059, 288738, 288311, 288134, 288533, 289465, 290235, 290069, 288893, 287229, 285508, 283773, 281984, 280355, 279291, 278980, 278966, 278412, 277099, 275964, 276208, 277930, 280082, 281637, 282283, 282058, 281072, 279777, 278868, 278610, 278683, 278814, 279125, 279722, 280465, 281250, 282030, 282365, 281565, 279570, 277247, 275520, 274621, 274413, 274925, 276178, 277811, 279313, 280475, 281416, 282350, 283487, 284925, 286503, 287871, 288752, 288999, 288567, 287710, 287014, 286812, 286730, 286295, 285786, 285881, 286558, 287124, 287320, 287639, 288387, 289163, 289499, 289391, 289015, 288534, 288340, 288796, 289532, 289755, 289494, 289773, 291151, 292883, 294037, 294778, 295948, 297890, 300277, 302743, 305170, 307624, 310373, 313629, 317061, 320051, 322627, 325534, 329075, 332534, 335219, 337373, 339488, 341367, 342564, 343283, 344064, 344902]
61422C44902M93J93N12J426K539L358L276K093O67J83N78O18l06j460k053k266
61406C54753k504k655k649k934l686m264m047l274k487j694o87K78P44O42K12
61391C25748l60q49r33o11l11k29K5P57J572J861J588J206J077J229J472J436
61375C34678Q73J28p7M40J020J088Q53Q26J059J310J539J764J770J425J096J228
61359C51020J774K384K932L427L689L680M012N429P797J0035J1242J1367J0695
61346D29483R288P292N364M181L648L178K741K997M086M946M484L087K133K067
61332D88975J880O62j192k756l795m490m625l968l113l031l781m448m361l701
61318D48256k862j942j104o96p30n89L51J989L606M530M754N025O219Q401J0645
$$ y = [344902, 345395, 345588, 346100, 347526, 350065, 353423, 356699, 358792, 359459, 359642, 360220, 360838, 360532, 359072, 357019, 354753, 352249, 349594, 346945, 344011, 340325, 336061, 332014, 328740, 326253, 324559, 323872, 324150, 324894, 325536, 325748, 325388, 324539, 323606, 322995, 322684, 322455, 322480, 323237, 324809, 326670, 328258, 329464, 330541, 331770, 333242, 334678, 335551, 335679, 335602, 336042, 337062, 338150, 339003, 339829, 340888, 342198, 343737, 345501, 347271, 348696, 349792, 351020, 352794, 355178, 358110, 361537, 365226, 368906, 372918, 378347, 386144, 396179, 407421, 418788, 429483, 438771, 446063, 451427, 455608, 459256, 462434, 465175, 468172, 472258, 477204, 481688, 484775, 486908, 488975, 490855, 491517, 490325, 487569, 483774, 479284, 474659, 470691, 467578, 464547, 460766, 456318, 451957, 448256, 445394, 443452, 442348, 441652, 440922, 440333, 440684, 442673, 446279, 450809, 455563, 460588, 466807, 475208, 485853]
61303D85853J1961J2243J1895J0984R253O810M177J768k44j668k511l245m213
61290E43063n003n093m947n550o853p684p403o693o358o187n541m413l236k131
61276D65971q64O52K258L684M615M874M735M653M593M133L368L116L847N000N855
61261E20490O569P808R588J1106J1601J0959R522P738N997M536L370K428J663
61248F13375R55Q0j101k457l702m664n404o042o505o460n720m755m443n108o084
61233E51965o568o440n874m642k566l89P89R43J145K041L053L361K941K304J828
61218E43891J738K237L176L998M354M458M622M769M709M443L912K852J266j42
61204E90283n12L46J841L239M286N279O638Q438J0395J2375J4608J7079J9033
$$ y = [485853, 497814, 510057, 521952, 532936, 542189, 548999, 553176, 554944, 554700, 553032, 550521, 547276, 543063, 538060, 532967, 528020, 522470, 515617, 507933, 500530, 493837, 487479, 481292, 475751, 471338, 468102, 465971, 465107, 465759, 468017, 471701, 476316, 481190, 485925, 490578, 495171, 499304, 502672, 505788, 509635, 514635, 520490, 527059, 534867, 544455, 555561, 567162, 578121, 587643, 595381, 601378, 605914, 609284, 611712, 613375, 614330, 614410, 613309, 610852, 607150, 602486, 597082, 591040, 584535, 578075, 572355, 567600, 563157, 558049, 551965, 545397, 538957, 533083, 528441, 525875, 525486, 526275, 527218, 528363, 530404, 533457, 536818, 539759, 542063, 543891, 545629, 547866, 551042, 555040, 559394, 563852, 568474, 573243, 577952, 582395, 586307, 589159, 590425, 590283, 589771, 590117, 591958, 595197, 599483, 604762, 611400, 619838, 630233, 642608, 657216, 674295, 693328]
61191F93328J9524J8321J5907J2858R717P199N728M828L684K256J217Q29O14J42
61177G96152o51j919l855o005p439p857p816p804p777p790q178q932r662j0435
61163G00032j1714j3268j4052j3646j2863j2467j2190j1486j0387r040p211m947
61151E66761k916j454%J800L116K887J170j191l686o264q706j0588j1555j1287
61137E18087r690p433n538m127k385k22J171J203J134K436M788O903Q459R942
61123E24728J1265J2050J2785J4331J6420J7968J8765J9605K0827K1956K2754
61112G13454K3514K4203K4333K3797K2958K1888K0443J8983J8026J7110J5011
61101I43720J1266O701K325j489m779p764j0916j4420j7533j9293j9812k0094
$$ y = [693328, 712852, 731173, 747080, 759938, 769655, 776854, 782582, 787410, 791094, 793350, 794567, 795396, 796010, 796152, 795501, 793582, 789727, 783722, 776283, 768426, 760610, 752806, 745029, 737239, 729061, 720129, 710467, 700032, 688318, 675050, 660998, 647352, 634489, 622022, 609832, 598346, 587959, 578919, 571708, 566761, 563845, 562391, 562391, 564191, 567307, 570194, 571364, 570173, 566487, 560223, 551517, 540929, 529374, 518087, 508397, 500964, 495426, 491299, 488914, 488692, 489863, 491066, 492200, 494636, 499424, 506327, 514786, 524728, 535993, 548043, 560828, 575159, 591579, 609547, 628312, 647917, 668744, 690700, 713454, 736968, 761171, 785504, 809301, 832259, 854147, 874590, 893573, 911599, 928709, 943720, 954986, 961687, 964012, 962523, 957744, 949980, 939064, 924644, 907111, 887818, 868006, 847912]
61089H47912k0644k1158k1450k1655k1529k0608j9121j7804j6749j5478j4079
61078F37637j3161j2575j1422r553p816o622n394l826k441j539p92k47m47j061
61064E60741p51R22K664L339L520M258N460O443P181Q011Q878R730J0906J2434
61050F43736J3687J4414J5212J6406J7583J8789K0844K3704K5907K6799K7743
61039H64824K9809L1775L2122L1675L2299L4107L5972L7857M0415M2996M4284
61028A258135M4374M4181M3415M1459L9655M0279M3543M8068N3862O2023P1709
61017A790703Q0396Q7348R4120J01943J12033J28184J54756J91588K35380K86746
61007C263197L50817M30466N26394O46532Q07055J019981J288961J619161K003973
$$ y = [847912, 827268, 806110, 784660, 763005, 741476, 720868, 701747, 683943, 667194, 651716, 637637, 624476, 611901, 600479, 590926, 583110, 576488, 571094, 567268, 564827, 563288, 562496, 562249, 561802, 560741, 559990, 560912, 563576, 566915, 570435, 574693, 580153, 586596, 593777, 601788, 610666, 620396, 631302, 643736, 657423, 671837, 687049, 703455, 721038, 739827, 760671, 784375, 810282, 837081, 864824, 894633, 926408, 958530, 990205, 1022504, 1056611, 1092583, 1130440, 1170855, 1213851, 1258135, 1302509, 1346690, 1390105, 1431564, 1471219, 1511498, 1555041, 1603109, 1656971, 1718994, 1790703, 1871099, 1958447, 2052567, 2154510, 2266543, 2394727, 2549483, 2741071, 2976451, 3263197, 3614014, 4044480, 4570874, 5217406, 6024461, 7044442, 8333403, 9952564, 11956537]
60998A1956537K368775K537913K316625J659583P60499n5500n45272o58668m71745
60989A9868747p7683M15155Q17437Q85210M78698l02636j168990j835381k177036
60980A6903521k229795k093361j856536j583205j318744j087317q92112p28197
60972E114254n93088m84378l95964l22610k64130k20930j89123j63901j44411
60963B335719j31197j21531j11473j00792r1791q4471p6489o7201n8245n0506
60953A442023m3671l8580l6882l7995l9083l8589l7537l6856l5695l3219l0178
60942A033738k7702k5897k4548k4024k4612k5675k6181k5679k4462k3193k2449
60931G59316k2172k1660k0450j8907j7548j6329j5194j4536j4330j3508j1348
$$ y = [11956537, 14325312, 16863225, 19179850, 20839433, 21599932, 21544432, 20999160, 20340492, 19868747, 19791064, 20206219, 21023656, 21908866, 22387564, 22084928, 20915938, 19080557, 16903521, 14673726, 12580365, 10723829, 9140624, 7821880, 6734563, 5842451, 5114254, 4521166, 4036788, 3640824, 3318214, 3054084, 2833154, 2644031, 2480130, 2335719, 2204522, 2082991, 1971518, 1870726, 1778935, 1694464, 1617975, 1550774, 1492529, 1442023, 1398352, 1359772, 1322890, 1284895, 1245812, 1207223, 1169686, 1132830, 1097135, 1063916, 1033738, 1006036, 980139, 955591, 931567, 906955, 881280, 855099, 829420, 804958, 781765, 759316, 737144, 715484, 695034, 676127, 658579, 642250, 627056, 612520, 598190, 584682, 573334]
60920E73334q801p343p074p035o761o253n143l312j749j326j248k77J066J329
60906E19407P07P64J820K606K556K479K710K594K082J996K265J721J42j282k014
60891E40553k868m074m521l773l076l340l824l809l977m913n712n436m771m862
60877D81597n547n980o136o457o740o459n655m642l533k678k668l250l193k038
60863D16621q71n71m47L08J031O88l82j166j502j643j111N33K412L227K987K563
60847D22677J994O33j314k737l053k584j705o80j18n28j393j711j395j299j884
60832D04903k727l308l494l233k497j543p25n9N83J093J397J741K194K257J564
60817C98146N81p9n60j301k065k289k073j979k082k001j765j857k400k957l129
$$ y = [573334, 564533, 557190, 550116, 543081, 536320, 530067, 524924, 521612, 519863, 518537, 517289, 517012, 518078, 519407, 520114, 520878, 522698, 525304, 527860, 530339, 533049, 535643, 537725, 539721, 541986, 543707, 543849, 542567, 540553, 537685, 533611, 529090, 525317, 522241, 518901, 515077, 511268, 507291, 502378, 496666, 491230, 486459, 481597, 476050, 470070, 463934, 457477, 450737, 444278, 438623, 433981, 430448, 427770, 425102, 421852, 418659, 416621, 415750, 415179, 414732, 415040, 416071, 416759, 416377, 415211, 413709, 412066, 410955, 411488, 413900, 417127, 420114, 422677, 424671, 425304, 423990, 421253, 418200, 415616, 413911, 413231, 413113, 412585, 411192, 409481, 408086, 406787, 404903, 402176, 398868, 395374, 392141, 389644, 388101, 387376, 387317, 387900, 388993, 390390, 392131, 394325, 396582, 398146, 398727, 398648, 398088, 396787, 394722, 392433, 390360, 388381, 386299, 384298, 382533, 380676, 378276, 375319, 372190]
60802C72190k919k565k372k491k622k309j792j975l093m093l966l066k423k301
60788C34203k216j889j412r01o34j065j943k109r87K73K06r44j651j260n06r1
60772C17074J37N62J219J979K649K935K827K861L401M015M147M001M018L968L389
60757C59182K593K208K012J268P4o34m05K56P47R61R47P77P12R27J071N79o09
60740C72666k090l522m717n555o217p054p822p674o468n263m859m620l704k564
60726C00537k063j912j307n43m99r47q86k62R3O3K96P47O50K6k50n2k43j061j577
60707B90810j169l44K72P26J032Q30J54k72m5M39P80J144J719K314K755L102L342
60690C07589L421L594M069M451M254L787L681L759L375K657K313K341K145J847
$$ y = [372190, 369271, 366706, 364334, 361843, 359221, 356912, 355120, 353145, 350052, 345959, 341993, 338927, 336504, 334203, 331987, 330098, 328686, 327785, 327151, 326086, 324143, 322034, 321047, 321320, 321526, 320582, 318931, 317671, 317165, 317074, 317211, 317773, 318992, 320971, 323620, 326555, 329382, 332243, 335644, 339659, 343806, 347807, 351825, 355793, 359182, 361775, 363983, 365995, 367263, 367337, 366703, 366298, 366554, 367301, 368262, 369209, 369986, 370698, 371625, 372696, 373275, 372666, 370576, 367054, 362337, 356782, 350565, 343511, 335689, 328015, 321547, 316284, 311425, 306805, 303101, 300537, 298474, 296562, 295255, 294712, 294213, 293266, 292380, 292118, 292211, 292274, 292570, 293317, 293967, 293993, 293743, 293691, 293448, 292387, 290810, 289641, 289297, 289569, 290295, 291327, 292157, 292311, 292039, 291994, 292433, 293213, 294357, 296076, 298390, 301145, 304247, 307589, 311010, 314604, 318673, 323124, 327378, 331165, 334846, 338605, 341980, 344637, 346950, 349291, 351436, 353283]
60676C53283K154K821K712J625P03N95N24k86j470k429l262m064m296l656k816
60661C42138k545k728k806k677k526k275j686p32L84J314J655J363J035J227J697
60646C32838J923K024K333K390J508N6j012j755k926m208m427l659l391m054m149
60631C13491k654o49M51Q77J482J956J499M52j13NQ8j88l39J47J213K281K569
60614C22568J729M42j92k1J14j35n5P17J306Q65j02n53l38J3L53Q39J192R33J37
60595C29812o24q96n78J74Q57Q85L13p7K39Q84J222J102O49r6r13j278r50k52
60577C30473M70J228J993K518K801L165L687M176M873O373Q603J0641J1913J2780
60563D05694J3609J4057J3680J2387R966O050J088l475o599q472r495r417q116
$$ y = [353283, 355437, 358258, 360970, 362595, 363298, 363893, 364417, 364131, 362661, 360232, 356970, 352906, 348610, 344954, 342138, 339593, 336865, 334059, 331382, 328856, 326581, 324895, 324163, 324547, 325861, 327516, 328879, 329914, 331141, 332838, 334761, 336785, 339118, 341508, 343016, 343072, 342060, 340305, 337379, 333171, 328744, 325085, 321694, 317640, 313491, 310837, 310188, 310639, 311516, 312998, 314954, 316453, 316905, 316792, 316797, 316885, 316697, 316358, 316505, 317718, 319999, 322568, 324297, 324739, 324547, 324526, 324640, 324505, 324450, 325167, 326473, 327338, 327236, 326683, 326345, 326358, 326711, 327550, 328742, 329675, 329812, 329188, 328292, 327714, 327888, 328745, 329630, 329943, 329866, 330105, 330989, 332211, 333313, 333962, 333866, 332953, 331675, 330725, 330473, 330943, 332171, 334164, 336682, 339483, 342648, 346335, 350511, 355384, 361757, 370360, 381001, 392914, 405694, 419303, 433360, 447040, 459427, 469393, 475443, 476531, 473056, 466457, 457985, 448490, 439073, 430957]
60550D30957o361m855l304j200J002K440L152M033N696P958J0232J2019J3262
60537D75031J4475J6183J8090J9292J9317J8303J6106J2226O922J445l241p053
60525F07096r814j0789r913q424p494o975o201n211m443l879l293k761k293j571
60511E24035n75J16J90J67O31J649L325N942R128J1877J4094J7090K1779K7365
60497F36813L2598L7401M2256M6869N0454N2707N3592N2724M9655M4155L5725
60486A134949K3790R075o263k0595l3759m5349n3525n6983n6904n5429n3079m9208
60474G36720m4160l9222l4913l0896k7264k4420k1988j9241j6451j4494j3319
60463D50352j2060j0528r251q199o752m962l669l229l125k979k992l271l496l392
$$ y = [430957, 424596, 419741, 416437, 415237, 416239, 418679, 421831, 425864, 431560, 439518, 449750, 461769, 475031, 489506, 505689, 523779, 543071, 562388, 580691, 596797, 609023, 615945, 617390, 614149, 607096, 597282, 586493, 576580, 568156, 560662, 553687, 547486, 542275, 537832, 533953, 530660, 527899, 525606, 524035, 523460, 523576, 523766, 523933, 524564, 526213, 529538, 535480, 544608, 556485, 570579, 587669, 609448, 636813, 669411, 706812, 749068, 795937, 846391, 899098, 952690, 1005414, 1055069, 1099224, 1134949, 1158739, 1167814, 1161551, 1140956, 1107197, 1061848, 1008323, 951340, 894436, 839007, 785928, 736720, 692560, 653338, 618425, 587529, 560265, 535845, 513857, 494616, 478165, 463671, 450352, 438292, 427764, 418513, 410314, 403562, 398600, 394931, 391702, 388577, 385598, 382606, 379335, 375839, 372447]
60449C72447k981k405k003k226k918l104k236j110p67j013r72n61l55l54r1L45
60433C49696L82k8m39p52j107j241q56l49k20j18N08J159Q60k13q53n55%J90K44
60414C46308N75J181J820K163J857R80K56K65P12J039J283J583J499P32J0J58
60398C62421P39P46K62K24Q25J350J540J902K671L480M048M352M164L350K462
60383C94536K213K493K675K625K580K357J684R60P67Q85P40M49N12Q25J040J378
60367D18719K067K431J815R37J033K034K869L156L225K960K167J824L204N863
60353D54304Q075R203J0125J1317J2144J2172J1616J0376Q078N155K369p28n039
60340E49167r620j2034j1545j0077r397r078q080o695n790n396n071m741m342
$$ y = [372447, 369466, 367061, 365058, 362832, 359914, 356810, 354574, 353464, 352697, 351684, 350712, 350151, 349796, 349442, 349351, 349696, 350078, 350050, 349611, 348859, 347752, 346511, 345655, 345306, 345086, 344968, 345476, 346635, 347495, 347282, 346429, 345874, 345874, 346064, 346308, 346883, 348064, 349884, 352047, 353904, 354884, 355140, 355405, 356117, 357156, 358439, 360022, 361521, 362253, 362263, 362421, 363160, 363906, 364168, 364392, 365217, 366567, 368107, 370009, 372680, 376160, 380208, 384560, 388724, 392074, 394536, 396749, 399242, 401917, 404542, 407122, 409479, 411163, 412123, 412890, 413775, 414515, 414964, 415476, 416301, 417341, 418719, 420786, 423217, 425032, 425969, 427002, 429036, 431905, 435061, 438286, 441246, 443413, 445237, 448441, 454304, 462379, 471582, 481707, 493024, 505168, 517340, 528956, 539332, 547410, 552565, 554934, 554206, 549167, 539547, 527513, 515968, 505891, 496494, 487416, 479336, 472641, 466851, 461455, 456384, 451643, 447301]
60327D47301l577k634k282k665k973k735k384k095j303rP71N81M74J491L227M787
60311D35975O243Q121J0245J2066J3632J5352J7186J8771J9993K0810K0787J9227
60299F18408J5662J0143L499k850p940j2189j6474k0443k2667k2524k0805j8365
60287E03455j5341j2069r424p704o189m464l182k913l163l240l271l613l969l794
60273D21119l072k246j775j996k830l444k928j574o62p57j113r91o44n73o84o71
60257C95159n18k01M09J064J247R85P93P70N43K00K30N59O40O25J098J653J167
60240D06423k06q56j42O38L54l46m53k76n03p72k95P91J789K399K607K285J673
60223D15110J442J679J644J133J061J987L083L434L364L571L878L847L814M283
$$ y = [447301, 443724, 441090, 438808, 436143, 433170, 430435, 428051, 425956, 424653, 424644, 425415, 425996, 426470, 427961, 431188, 435975, 442218, 450339, 460584, 472650, 486282, 501634, 518820, 537591, 557584, 578394, 599181, 618408, 634070, 644213, 647712, 644862, 636922, 624733, 608259, 587816, 565149, 542625, 521820, 503455, 488114, 476045, 466621, 458917, 452728, 448264, 445082, 442169, 439006, 435766, 432495, 428882, 424913, 421119, 418047, 415801, 414026, 412030, 409200, 405756, 402828, 401254, 400592, 399835, 398722, 397731, 397087, 396514, 395830, 395159, 394641, 394440, 394849, 395913, 397160, 398145, 398938, 399708, 400251, 400451, 400681, 401240, 401880, 402505, 403603, 405256, 406423, 406217, 405361, 405219, 405857, 406211, 405865, 405412, 405136, 404633, 403861, 403566, 404357, 406146, 408545, 411152, 413437, 415110, 416552, 418231, 419875, 421008, 422069, 424056, 427139, 430573, 433937, 437508, 441386, 445233, 449047, 453330]
60209D53330M987N386N503N492N108M336L768L656L458K963K890L532L953L477
60195E11839K941L228L560K689R73j98n54j081k228l321l667l251k372j504j309
60180E05745j987k780k807k235j943k301k878l101k669j658o94n88j317j859j508
60165D75420p61m34o05r21j192j115k63J026J601J096O20J036J638J493J090J317
60149D81046J695J140q9p09l85L8J07L43J197K469L803M933N552N670N913O710
60133E19433P475P335O303M943L335J366l94j174j147j070r63k76P88J248P64
60118E47966J79L08R87J529J559J146N23j67r71j945k764k834k111j386j403k062
60102E38554k785l207l184k673k025j845k105k081j491r38o93j9J550L143L703
$$ y = [453330, 458317, 463703, 469206, 474698, 479806, 484142, 487910, 491566, 495024, 497987, 500877, 504409, 508362, 511839, 514780, 518008, 521568, 524257, 525230, 525032, 524478, 523397, 521169, 517848, 514181, 510930, 508558, 507054, 505745, 503758, 500978, 498171, 495936, 493993, 491692, 488814, 485713, 483044, 481386, 480692, 480104, 478787, 476928, 475420, 474659, 474225, 473620, 472699, 471507, 470392, 470129, 471155, 472756, 473852, 474472, 475508, 477146, 478639, 479729, 481046, 482741, 483881, 483792, 483083, 482698, 482736, 482843, 483186, 484383, 486852, 490655, 495588, 501140, 506810, 512723, 519433, 526908, 534243, 540546, 545489, 548824, 550190, 549796, 548622, 547475, 546405, 545442, 545166, 545954, 547202, 547966, 548145, 548453, 549440, 550969, 552528, 553674, 554197, 554030, 553059, 551114, 548350, 545516, 543405, 542019, 540616, 538554, 535769, 532562, 529378, 526705, 524680, 522835, 520730, 518649, 517158, 516220, 515527, 515508, 517058, 520201, 523904]
60087E23904L457L304L375L250K964K772K408J623J002J140J446Q32p14k305l596
60072E44862m929o260p020p039o774o606o659p042p626p781p127o223n778n559
60058D52439m874l773k882k319j772j319j271j336q33K55J252J758J935J978J956
60043D41194K067K492L062L550M001M337M094L090J875R58J17r18j706j768j499
60028D64946j595k119k806l702m737n263m910m327m230m341m125l900m178m600
60014D10113m578m426m659m848m363l699l710l972l280j561k2M66P4o75j247j007
59998C68606J33J176J126K94l07l95j55P03K373L913M202L588L209L105K432J277
59982C95280O64Q13Q53L16l93j011j637j988j700j300j602k219j985q22J21K27
$$ y = [523904, 527361, 530665, 534040, 537290, 540254, 543026, 545434, 547057, 548059, 549199, 550645, 551477, 550763, 548458, 544862, 539933, 533673, 526653, 519614, 512840, 506234, 499575, 492533, 484907, 477126, 469999, 463776, 457998, 452439, 447565, 443792, 440910, 438591, 436819, 435500, 434229, 432893, 432060, 432315, 433567, 435325, 437260, 439238, 441194, 443261, 445753, 448815, 452365, 456366, 460703, 464797, 467887, 469762, 470720, 470837, 469919, 468213, 466445, 464946, 463351, 461232, 458426, 454724, 449987, 444724, 439814, 435487, 431257, 426916, 422791, 418891, 414713, 410113, 405535, 401109, 396450, 391602, 387239, 383540, 379830, 375858, 372578, 371017, 370995, 371461, 371535, 370860, 369613, 368606, 368739, 369915, 371041, 371335, 371028, 370633, 370478, 371181, 373554, 377467, 381669, 385257, 388466, 391571, 394003, 395280, 395944, 396757, 397610, 397926, 397533, 396522, 394885, 392897, 391197, 389897, 388295, 386076, 384091, 383269, 383390, 383617]
59966C83617j2j54k64j39N65J402J557J257J395J822J465L21k12N71J578J509
59950C96278M16p73j378j229o47m13j024j801j666p00j27o76j955l284m231m310
59934C72480l300j845q35k81L43R74J275J617K497L320L218K736L124M237M822
59919C94382M708M969N790O135N628M998M287K615J76j288p44R05K360L248L446
59904D41615K731J743J784K909L650L176K250J555P25k46l87N00J121P54N58J621
59888D66059L061L434K848K390K421K652L106L793M100L617L021L213M054M645
59874E12414M388L178J195q91k228k777l391m479n407n576n122m205k667q62L06
59859D83876P62J489K720L226K352J506K423M843P097Q322Q998R709J0338J0218
$$ y = [383617, 383605, 383451, 383187, 383048, 383613, 385015, 386572, 387829, 389224, 391046, 392511, 392832, 392620, 393191, 394769, 396278, 396694, 395921, 394543, 393314, 392667, 392254, 391230, 389429, 387763, 387063, 386936, 386260, 384305, 381021, 376790, 372480, 369180, 367335, 366500, 366219, 366562, 367536, 368811, 370428, 372925, 376245, 379463, 382199, 385323, 389560, 394382, 399090, 404059, 409849, 415984, 421612, 426610, 430897, 433512, 433688, 432400, 431656, 432561, 434921, 438169, 441615, 444346, 446089, 447873, 450782, 454432, 457608, 459858, 461413, 462138, 461892, 461505, 462005, 463126, 463880, 464438, 466059, 469120, 472554, 475402, 477792, 480213, 482865, 485971, 489764, 493864, 497481, 500502, 503715, 507769, 512414, 516802, 519980, 521175, 520284, 518056, 515279, 511888, 507409, 502002, 496426, 491304, 487099, 484432, 483570, 483876, 484638, 486127, 488847, 492073, 494425, 495931, 498354, 503197, 510294, 518616, 527614, 537323, 547661, 557879]
59845E57879Q518M936N06k845l999l383j854J82K079K533P54k583o084q771j0143
59830E37725j0023q881p514o070m246k636k533l842m719m100l204l433m133l849
59816D68542k757k234k624k944k548j872j466j348j293j169r41p72r02j242j377
59801D43053j152q42n98l11p4q2j9N45J176R87J02m94o60j218k163k403j732j438
59783D32677k162k801k437j795j672j556r67p46j483k039j242P8L97p5M1J042
59767D15260K061K727L297L591L213K574K335K238J715J276J985L750N361O016
59753D57399N831N128M317M219N322O781P174O195M796L840L462L543L972M381
59739E26360M330L750K845J795Q55L20l5q87k264l242l212k733k481k236j646
$$ y = [557879, 566397, 571333, 571839, 568994, 564995, 561612, 559758, 559940, 562019, 564552, 565306, 562723, 556639, 547868, 537725, 527702, 518821, 511307, 505237, 500991, 498355, 495822, 491980, 487261, 483161, 479957, 476524, 472391, 468542, 465785, 463551, 460927, 457983, 455435, 453563, 452097, 450749, 449456, 448287, 447346, 446574, 445672, 444430, 443053, 441901, 441059, 440461, 440150, 440076, 439994, 439975, 440520, 441696, 442683, 442785, 442291, 441631, 440413, 438250, 435847, 434115, 432677, 430515, 427714, 425277, 423482, 421810, 420254, 419287, 418541, 417058, 415019, 413777, 413855, 414252, 414177, 414218, 415260, 417321, 420048, 423345, 426936, 430149, 432723, 435058, 437296, 439011, 440287, 442272, 446022, 451383, 457399, 463230, 468358, 472675, 476894, 482216, 488997, 496171, 502366, 507162, 511002, 514464, 518007, 521979, 526360, 530690, 534440, 537285, 539080, 539935, 540255, 540220, 539333, 537069, 533827, 530615, 527882, 525401, 523165, 521519]
59724E21519j185j363j670j403r30j094j772k077j757j429j523j720j492p31L7
59709E01410L7q23j455p62P37J427Q58J47J2j11m49j55R24J380L72q88j074p58
59691E00829j051j525j224o16p90j421j343n13J45L59M87M16r5n27m08m31j400
59674D90892k756l590m354n852p254o987n258l813l318k827j836j153j370j959
59660D38565k198j930j197j13Q61J415K021L199M377M557L818L147L012L051K908
59645D65493K405J243m96j945k549k951l797m367l703k388j697j576j080l35l29
59630D41928r52j089n88n53j443k408k729k626k491k421k601l088l231k465j482
59615D11761j450k214k520j917j098n03R9O74Q94J052J744K657K888K444K123
$$ y = [521519, 520334, 518971, 517301, 515898, 514968, 513874, 512102, 510025, 508268, 506839, 505316, 503596, 502104, 501373, 501410, 501447, 500624, 499169, 498407, 499144, 500571, 501429, 501576, 501588, 501477, 501028, 500873, 501797, 503177, 503549, 502661, 501587, 500829, 499778, 498253, 497029, 496413, 495623, 494202, 492859, 492346, 492491, 492850, 493337, 493753, 493658, 493131, 492723, 492292, 490892, 488136, 484546, 480192, 474340, 467086, 460099, 454841, 451028, 447710, 444883, 443047, 441894, 440524, 438565, 436367, 434437, 433240, 433127, 433988, 435403, 437424, 440623, 445000, 449557, 453375, 456522, 459534, 462585, 465493, 467898, 469141, 468645, 466700, 464151, 461200, 457403, 453036, 449333, 446945, 445248, 443672, 442592, 442257, 441928, 440976, 439887, 439299, 438746, 437303, 434895, 432166, 429540, 427049, 424628, 422027, 418939, 415708, 413243, 411761, 410311, 408097, 405577, 403660, 402562, 402059, 402158, 402832, 403726, 404778, 406522, 409179, 412067, 414511, 416634]
59600D16634K020J537Q45Q85J706K233J920J408J267J249J122J095J176R97N20
59585D36614R0k12n20o26l47j53m85q77q11r18j947l016k581q91K28o1q30j293
59567D21364j693k116j999j304q01p86p35m81n00p80o81j14L13M95R14J468J516
59550D14080J206J352J919K084J946K559L971M902M967N470P452J0453J4061J8961
59536D95383K5003K9301K7887J9373O462n882j3593j5690j4067j1175q015m528
59524E30459j152J135K111K462K634K495K012J291P6j794l637m716n441o611p861
59509E13463q295q203q534q985q414p001o117n970n400m216l659m111m312l527
59495D26719k641k362k080j362q91j046j025m22j70r23j723j338P5J543K534K885
$$ y = [416634, 418654, 420191, 421036, 421921, 423627, 425860, 427780, 429188, 430455, 431704, 432826, 433921, 435097, 436094, 436614, 436704, 436492, 435972, 435346, 434999, 434846, 434361, 433484, 432673, 431755, 429808, 426792, 424211, 423320, 423548, 423487, 422657, 421364, 419671, 417555, 415556, 414252, 413451, 412665, 411930, 411449, 410949, 410169, 409488, 409374, 409687, 410182, 411096, 412564, 414080, 415286, 416638, 418557, 420641, 422587, 425146, 429117, 434019, 438986, 444456, 451908, 462361, 476422, 495383, 520386, 549687, 577574, 596947, 603409, 597527, 583934, 568244, 554177, 543002, 534987, 530459, 529307, 530442, 532553, 535015, 537649, 540144, 542156, 543447, 543523, 541729, 538092, 533376, 527935, 521324, 513463, 505168, 496965, 488431, 479446, 471032, 464031, 457914, 451944, 446544, 442328, 438669, 434558, 430246, 426719, 424078, 421716, 419636, 418274, 417383, 416337, 415312, 414890, 414720, 413797, 412074, 410736, 410811, 412354, 414888, 417773]
59479D17773K473J706J517K160K872L084L092L105K806K249K158K751L321L322
59465D54389K984K576K142K066K669L194K634J681K121M051N551N620N475O172
59451E03325O869O642O213O496O811O017M294K497O96j460l716n599p162q446
59437E23477q974q471p394o118m522k794j624j014p9J384K378K467K759M222O246
59422E01943P840R142J0728J2413J3804J5231J7079J8995K0712K3025K6765L0885
59410G08562L2206K7322J5209j155j5884k4128k5385k2529j8044j2353n248K892
59398F61465J1099J7205J7427R211m774j7718k4724k6136k4601k1475j7337j3547
59386E66095j1110r374p399n448m006k731j520j083j345q99P54K107K075J750
$$ y = [417773, 420246, 421952, 423469, 425629, 428501, 431585, 434677, 437782, 440588, 442837, 444995, 447746, 451067, 454389, 457373, 459949, 462091, 464157, 466826, 470020, 472654, 474335, 476456, 480507, 486058, 491678, 497153, 503325, 510194, 516836, 523049, 529545, 536356, 542373, 546667, 549164, 549860, 548400, 544684, 539085, 531923, 523477, 514503, 506032, 498638, 492520, 487998, 485204, 483580, 482566, 482487, 483871, 486249, 488716, 491475, 495697, 501943, 509783, 518925, 529653, 542066, 555870, 571101, 588180, 607175, 627887, 650912, 677677, 708562, 740768, 768090, 783299, 782144, 766260, 742132, 716747, 694218, 676174, 663821, 658573, 661465, 672564, 689769, 707196, 716407, 711633, 693915, 669191, 643055, 618454, 596979, 579642, 566095, 554985, 545611, 538212, 532764, 528758, 526027, 524507, 523424, 522079, 521180, 521934, 524041, 526116, 527866]
59372E27866K261K707J990J060J293K043J928J398J945L447M312L799K639J783
59358E60471J856L234N455P201P917Q536R745J0731J0852J1105J2479J4101J4641
59345F78324J4403J4411J4437J3689J2436J1247R560O661L326P52j324l765o226
59332G67931p932r457j1801j4334j5519j5273j4817j4568j3870j2593j1415j0629
59320F15723r984r485r238q839p944o914o045m890l365k454k541k261m22J909
59306E43250K985L080L968O500J0361J5076J9264J9786J4222M145o023j3292j7669
59293F05653j9974k0279j8745j6155j3151j0026p288n372l982k689j765j417q94
59280D83916M37J854K441K809M140O231P987R261J0532J1492J1574J1419J1997
$$ y = [527866, 530127, 532834, 534824, 535884, 537177, 539220, 541148, 542546, 544491, 547938, 552250, 556049, 558688, 560471, 562327, 565561, 571016, 578217, 586134, 594670, 604415, 615146, 625998, 637103, 649582, 663683, 678324, 692727, 707138, 721575, 735264, 747700, 758947, 768507, 775168, 778494, 779246, 777922, 774157, 767931, 759999, 750542, 738741, 724407, 708888, 693615, 678798, 664230, 650360, 637767, 626352, 615723, 605739, 596254, 587016, 578177, 570233, 563319, 557274, 552384, 549019, 546565, 544024, 541763, 541341, 543250, 546235, 549315, 553283, 559783, 570144, 585220, 604484, 624270, 638492, 642637, 636614, 623322, 605653, 585679, 565400, 546655, 530500, 517349, 507323, 500035, 494663, 490681, 487992, 486227, 484810, 483916, 484353, 486207, 488648, 491457, 495597, 501828, 509815, 519076, 529608, 541100, 552674, 564093, 576090]
59267E76090J2792J2551J1373J0277R172P059M031J277p33k447l895m762n489
59254F27296o658p584p204o078n741o327o574n958n096m148k608o30J047K441
59240E66178M018N307N460M931M938N403N239M455M117M312L964K772J511M01
59226F23006j099k754l652l939m826o585q131q723q670q289p700p546q361r206
59212E33525q617o822n408m843m148l049k488k767l019k845k747k666j811l47
59198D81948M64K23n0K58N84O13R10J656K144K078K034K231K142J683J532J965
59182E02415K521L024L734M352M213L542L272L570L842M073M753N567N714N471
59168E60063N874O847P338P227P343P612P003N474M075K920R96j711l877n049
$$ y = [576090, 588882, 601433, 612806, 623083, 632255, 639314, 643345, 644622, 643889, 641442, 637547, 632785, 627296, 620638, 613054, 605850, 599772, 594031, 587704, 581130, 575172, 570076, 565928, 563320, 562690, 563737, 566178, 570196, 575503, 580963, 585894, 590832, 596235, 601474, 605929, 610046, 614358, 618322, 621094, 622605, 623006, 621907, 619153, 615501, 611562, 606736, 600151, 592020, 583297, 574627, 566338, 558638, 551092, 542731, 533525, 524908, 518086, 512678, 507835, 503687, 500638, 498150, 495383, 492364, 489519, 486772, 484106, 482295, 481948, 482412, 482635, 482585, 482843, 483427, 484040, 484950, 486606, 488750, 490828, 492862, 495093, 497235, 498918, 500450, 502415, 504936, 507960, 511694, 516046, 520259, 523801, 527073, 530643, 534485, 538558, 543311, 548878, 554592, 560063, 565937, 572784, 580122, 587349, 594692, 602304, 609307, 614781, 618856, 621776, 622772, 621061, 617184, 612135]
59154F12135o284q072r483r969j0241j0617j0282q961p728p369p371p170o988
59141E01600o827o145n169n001n782o113n137l762l085k885k412j612q42k77l3
59126D46518K9P10K576M618N213M456M076M940O246P349Q567R848J0389J0190
59112E25725J0312J1086J1629J1525J1375J1207J0155Q258O902O698O577N654
59100F37103M423L425K279Q48k10q07j825l430m419m000k812j572j95J100J380
59085F31288M61o20j329k297l744m763m989n404o564p569p586p075o659o172n601
59070E61377n531n883n584m362l499m002n205n952n945n278l993k697k290k587
59056D98569k415j540r85j115j138q89j227k055j917l97R45R60M28K98J83l12
$$ y = [612135, 605851, 597779, 588296, 578327, 568086, 557469, 547187, 538226, 530498, 523129, 515758, 508588, 501600, 494773, 488628, 483459, 478458, 472676, 466563, 461426, 457664, 454579, 451694, 449282, 447670, 446828, 446551, 446518, 446547, 447257, 449833, 454451, 459664, 464120, 468196, 473136, 479382, 486731, 495298, 505146, 515535, 525725, 536037, 547123, 558752, 570277, 581652, 592859, 603014, 611272, 618174, 624872, 631449, 637103, 641526, 644951, 647230, 648078, 647868, 647061, 645236, 641806, 637387, 633387, 630575, 629003, 628808, 629908, 631288, 631749, 631129, 629800, 627503, 623759, 618996, 614007, 608603, 602039, 594470, 586884, 579809, 573150, 566978, 561377, 555846, 549963, 544379, 540017, 536518, 532516, 527311, 521359, 515414, 510136, 506143, 503446, 501156, 498569, 496154, 494614, 493629, 492514, 491376, 490487, 489260, 487205, 485288, 484891, 485836, 486796, 487224, 487522, 487705, 487393]
59040D87393n40j96j57q38j258p77k17k30j53N19J045R82J212K436M107N781P892
59023E07001J0243J1512J1424J1646J3225J4802J4676J3064J1007Q492N249K046
59011F34387k28j793l200m373n214n919n971m429j817p1K22O83K344M101M954
58996F13676N657O762P094N734L743K361J330K99oM33n3k284m614n494n770o616
58980F22252p080n821l529j576J53K162L652M027M546O408Q602R700J0208J1107
58966F64811J1620J0779R776J0238J1417J1505J0645J0159R764Q103N331K727
58954G76875L47k704o190r095j1539j4213j6434j6806j5571j4366j3923j3654
58942F42727j3096j2221j0705q486o493n497m847l676k505k194k281j924j543
$$ y = [487393, 486853, 486657, 486500, 485662, 484404, 483627, 483410, 483180, 483027, 483546, 484591, 485573, 486785, 489221, 493328, 499109, 507001, 517244, 528756, 540180, 551826, 565051, 579853, 594529, 607593, 618600, 627092, 632341, 634387, 634159, 632366, 629166, 624793, 619579, 613660, 607689, 603260, 601443, 601372, 601594, 602277, 604621, 608722, 613676, 619333, 626095, 633189, 638923, 642666, 645027, 646357, 646656, 646650, 647083, 647030, 644746, 640132, 634638, 628868, 622252, 615172, 609351, 605822, 604246, 604399, 606561, 610213, 614240, 618786, 625194, 633796, 643496, 653704, 664811, 676431, 687210, 696986, 707224, 718641, 730146, 740791, 750950, 760714, 768817, 774148, 776875, 777222, 774518, 768328, 759233, 747694, 733481, 717047, 700241, 684670, 670304, 656381, 642727, 629631, 617410, 606705, 598219, 591726, 586229, 581382, 577706, 575201, 573007, 570726, 568802, 567259]
58929E67259j853k239j735p99l95l10J8k6j127k360k454j838j691j837j401o58
58913E46554l93k69M20J238J491J670K339K838K820L725O654R970J1360J1089
58899F01506J0960J1189J0873J0500J1205J2214J1790J0377J0221J2030J4423
58888G27288J6470J8508K0501K1713K1983K1495J9670J6089J2048R169O924L593
58876I15451q60m943q236j1542j4823j7070j8086j8475j8130j6592j4490j2764
58864G59440j0994q473o229n793o572o802o557p328q998r871r549r341r746r874
58850F43313r506r384r321q159n926m091l448l496l945n011o184o557o323o384
58836E55578o612o228n544n532n962n803n147m853m701l827k572j901j443j65
$$ y = [567259, 565406, 563167, 561432, 560633, 560238, 559928, 559946, 559920, 558793, 556433, 553979, 552141, 550450, 548613, 547212, 546554, 546161, 545892, 546312, 547550, 549041, 550711, 553050, 555888, 558708, 562433, 569087, 579057, 590417, 601506, 612466, 623655, 634528, 645028, 656233, 668447, 680237, 690614, 700835, 712865, 727288, 743758, 762266, 782767, 804480, 826463, 847958, 867628, 883717, 895765, 904934, 911858, 915451, 914591, 909648, 901412, 889870, 875047, 857977, 839891, 821416, 803286, 786694, 772204, 759440, 748446, 739973, 733744, 727951, 721379, 714577, 708020, 700692, 691694, 681823, 672274, 662933, 653187, 643313, 633807, 624423, 615102, 606943, 601017, 596926, 593478, 589982, 586037, 581026, 574842, 568285, 561962, 555578, 548966, 542738, 537194, 531662, 525700, 519897, 514750, 509897, 505196, 501369, 498797, 496896, 495453, 495288]
58822D95288J445K014J746K010K888L355L509M286N231M979L772L163L312K942
58808E39940J870J267J356J158N15J79Op50j561j336q09j768l987n378n203m733
58792E20766m696m553m342m769n269m395k351q20j90P00J989K534K350K800M010
58777E03764M558M101L929M452M461L321J711r3k541n126o549o861p315q059q101
58762D85652p518p347p321o165m149k781j954j25K578M198M192M055M312L773
58748D71400K308J541K101K738K823L250M243M724M511M701N385N446M980N416
58734E25567O752P361P016P345Q726R499Q921Q179P834O948N438M515M129K780
58720F21010O25r7J366L149M071N217P168Q637Q971R281R846R084O430L631J820
$$ y = [495288, 496733, 498747, 500493, 502503, 505391, 508746, 512255, 516541, 521772, 526751, 530523, 533686, 536998, 539940, 541810, 543077, 544433, 545591, 546106, 546285, 546291, 545541, 543980, 542644, 541835, 540067, 536080, 530702, 525499, 520766, 516070, 511517, 507175, 502406, 497137, 492742, 490391, 489571, 489381, 490081, 492070, 494604, 496954, 499754, 503764, 508322, 512423, 516352, 520804, 525265, 528586, 530297, 530204, 527663, 522537, 515988, 509127, 501812, 493753, 485652, 478134, 470787, 463466, 457301, 453152, 450371, 448417, 448292, 450870, 455068, 459260, 463315, 467627, 471400, 473708, 475249, 477350, 480088, 482911, 486161, 490404, 495128, 499639, 504340, 509725, 515171, 520151, 525567, 532319, 539680, 546696, 554041, 562767, 572266, 581187, 589366, 597200, 604148, 609586, 614101, 618230, 621010, 621635, 621538, 622904, 626053, 630124, 635341, 642509, 651146, 660117, 669398, 679244, 688328, 694758, 698389, 700209]
58705G00209j43l184o288q567j0718j3214j5222j6408j7641j8972j9151j7965
58693E52736j6657j5411j2987r631p543p493p687o881n880n137l824k324k524
58680D48757m452n517m413k796j974j038M31J061O15J110L212M721M400M275O140
58665D54532Q704J0305J1662J3680J5091J4535J2738J0679P785L733j63l037n666
58652E54578q237r418r041q915r527q881o271m112m035m277l062j634j581j997
58638D73590j711j669k635l109j961o67n95m99Q62K127J845J160J508J936J211
58623D71393M35J049K293K950L627M992N892N421M794N107N383M829M643N421
58609E28229N318L092O00j70j85j139k501l141l537m079l529j476N9k15o67L5
$$ y = [700209, 700066, 696882, 690594, 682027, 671309, 658095, 642873, 626465, 608824, 589852, 570701, 552736, 536079, 520668, 507681, 498050, 490507, 483014, 475327, 468446, 462566, 457429, 453605, 451281, 448757, 444305, 438788, 434375, 431579, 429605, 428567, 428998, 430059, 430674, 431784, 434996, 439717, 444117, 448392, 454532, 463236, 473541, 485203, 498883, 513974, 528509, 541247, 551926, 559711, 563444, 563281, 560244, 554578, 546341, 536923, 527882, 518967, 509440, 500559, 494288, 490176, 486141, 481864, 478802, 477168, 475587, 473590, 471879, 470210, 467575, 464466, 462505, 461838, 461243, 460744, 461606, 463733, 465578, 466738, 468246, 470182, 471393, 471828, 472877, 475170, 478120, 481747, 486739, 492631, 498052, 502846, 507953, 513336, 518165, 522808, 528229, 533547, 536639, 537239, 537069, 536884, 535745, 533244, 530103, 526566, 522487, 518958, 517482, 517541, 517326, 516659, 516694]
58593E16694K87j362l286l548k955k559r98K735O500Q166R075J1233J3476J3676
58579E67134J2397J1195R607O913M679M266M110K688J830L645O507P698P978R785
58565F60432J2794J4977J6533J9045K2105K4128K5224K6166K5912K3172J9020
58554H89508J5057J0712N244M51j697k430m044o181p201p482q273r101r257r994
58540H55312j2239j4178j4153j3800j5187j7124j7590j7414j8003j7740j4562
58529F83322j0125p497o447m742k380q47R3J334J856P08l92J73P04q22k795k800
58513F49343j998k663l690k796j128j291k726l276l424m640n574m328k531k711
58499F06567l582k560q80j380l072k960j510j254j622l47J523J309Q0R51L250
$$ y = [516694, 516981, 515619, 512333, 508785, 505830, 503271, 502273, 505008, 511508, 519674, 528749, 539982, 553458, 567134, 579531, 590726, 600333, 607246, 611925, 616191, 620301, 622989, 624819, 628464, 634971, 642669, 650647, 660432, 673226, 688203, 704736, 723781, 745886, 770014, 795238, 821404, 847316, 870488, 889508, 904565, 915277, 920521, 920972, 919275, 916845, 912801, 906620, 899419, 891937, 883664, 874563, 865306, 855312, 843073, 828895, 814742, 800942, 785755, 768631, 751041, 733627, 715624, 697884, 683322, 673197, 665700, 659253, 654511, 652131, 651284, 651377, 652711, 654567, 655275, 654883, 655056, 655760, 654938, 652143, 649343, 647345, 644682, 640992, 638196, 637068, 635777, 633051, 629775, 626351, 621711, 616137, 611809, 609278, 606567, 602985, 600425, 599545, 598165, 595093, 592133, 590623, 589369, 587747, 587400, 588923, 590232, 590312, 591263, 594513]
58484E94513L819L082M318P644J0154J1408J3475J5962J6287J4680J3809J3623
58472G22774J1527P431L814R94k897p417j0056j0743j1591j2476j1356q605o536
58459F64863n044k219J336L327M218O290Q960R760R147R474R962P716L214k47
58445G30757j985l938n980o213n323n606o322n000k456j469j363O38L652M293
58431F93685K824K487L493L441K935M764Q068R267Q448Q739R900Q686N284L079
58417G75100K285R7l103m128l420m554p369q155o771o776q374q025n462m269m911
58402G02165m059j415l83j249n28K108L091J950K207M406N127L842L844N369M878
58387G31353K183J284K937L479K225K745N568O836N698N669P222O444K774O49
$$ y = [594513, 598332, 601414, 605732, 613376, 623530, 634938, 648413, 664375, 680662, 695342, 709151, 722774, 734301, 741732, 745546, 746540, 743643, 736226, 726170, 715427, 703836, 691360, 680004, 671399, 664863, 659819, 657600, 658936, 662263, 666481, 672771, 681731, 691491, 700638, 710112, 720074, 727790, 731004, 730757, 728772, 724834, 718854, 712641, 707318, 701712, 695390, 690390, 687934, 686465, 685102, 685740, 689392, 693685, 696509, 698996, 702489, 705930, 708865, 713629, 721697, 730964, 739412, 748151, 758051, 766737, 772021, 775100, 777385, 777482, 774379, 770251, 766831, 762277, 754908, 746753, 739982, 733206, 724832, 716807, 711345, 707076, 702165, 698106, 696691, 696308, 695059, 694531, 696639, 699730, 701680, 703887, 708293, 713420, 717262, 721106, 726475, 731353, 733536, 734820, 737757, 741236, 743461, 746206, 751774, 758610, 764308, 769977, 777199, 783643, 786417, 787066]
58373G87066J622K163J055J532M198N245L797L666N886O874N876O603R539J0399
58359H55521Q362P919J0297J1052Q554O783P186N978K295O84K511L082N22p04
58345I30042J567L293K366K630O066Q898Q995R564J2070J3370J2915J4702J8857
58332A045335J9778J6011J3343J4543J4883J1610Q855Q969P919L770R63J649J548
58319A169176j124j521K456N523M569L972O656Q758P987Q334J1551J3043J1074
58306A250454J0839J4478J6521J4256J2973J5688J7521J5669J4922J7653J8522
58295A419496J4981J2871J5631J8131J7132J7303K0930K2540J9930J9332K3291
58284A621568K4965K1193J9196K3081K5951K3228K1459K5555K9502K8494K8142
$$ y = [787066, 788688, 790851, 791906, 793438, 797636, 802881, 806678, 810344, 816230, 823104, 828980, 835583, 845122, 855521, 863883, 871802, 882099, 893151, 901705, 908488, 915674, 921652, 923947, 924631, 927142, 930224, 930746, 930042, 931609, 934902, 937268, 939898, 945964, 954862, 963857, 973421, 985491, 998861, 1011776, 1026478, 1045335, 1065113, 1081124, 1094467, 1109010, 1123893, 1135503, 1144358, 1153327, 1161246, 1165016, 1165979, 1167628, 1169176, 1168052, 1166531, 1168987, 1174510, 1179079, 1183051, 1189707, 1198465, 1206452, 1214786, 1226337, 1239380, 1250454, 1261293, 1275771, 1292292, 1306548, 1319521, 1335209, 1352730, 1368399, 1383321, 1400974, 1419496, 1434477, 1447348, 1462979, 1481110, 1498242, 1515545, 1536475, 1559015, 1578945, 1598277, 1621568, 1646533, 1667726, 1686922, 1710003, 1735954, 1759182, 1780641, 1806196, 1835698, 1864192, 1892334]
58273A892334L2736L6443L5233L5349M0831M4995M3519M3279M8781N2951N1124
58262B357575N0635N6386O0737N8370N6942O1862O5025O0424N6230N9167O1834
58251C005187N8282N6904O4471P2624P3977P6109Q5630R4320R5573R8110J08416
58240C889603J16671J15778J16625J27957J39372J41768J45629J60593J76126
58231E130122J82085J88894K06849K25400K34274K44609K67016K90037L03488
58222G272774L20881L54230L89831M14835M43399M89363N38793N78742O26116
58213A1428964O96745P74258Q43223R23230J034220J159640J282506J424260J606814
58204B1173860J813674K035072K312623K689911L162274L729404M447380N366669
$$ y = [1892334, 1925070, 1961513, 1996746, 2032095, 2072926, 2117921, 2161440, 2204719, 2253500, 2306451, 2357575, 2408210, 2464596, 2525333, 2583703, 2640645, 2702507, 2767532, 2827956, 2884186, 2943353, 3005187, 3063469, 3120373, 3184844, 3257468, 3331445, 3407554, 3493184, 3587504, 3683077, 3781187, 3889603, 4006274, 4122052, 4238677, 4366634, 4506006, 4647774, 4793403, 4953996, 5130122, 5312207, 5501101, 5707950, 5933350, 6167624, 6412233, 6679249, 6969286, 7272774, 7593655, 7947885, 8337716, 8752551, 9195950, 9685313, 10224106, 10802848, 11428964, 12125709, 12899967, 13743190, 14666420, 15700640, 16860280, 18142786, 19567046, 21173860, 22987534, 25022606, 27335229, 30025140, 33187414, 36916818, 41364198, 46730867]
58196D6730867O476393P785923R405543J1471509J4069856J7329296K1490161
58189A34759548K6745241L3080975M0291735M7709274N3372943N3711235M5180302
58182D34851253K7225191L705582j9057166l5965967m5286102m8038581m6242196
58175B71192014m1811491l6279317l0698267k5582778k1088120j7272905j4155698
58168H4303438j1649669r613623p962929o655305n612728m744554m019125l439910
58160C0605595k976005k578063k236533j964669j745231j546302j368898j229797
58152A4960097j116026j001415q90435q02985p32311o57923n84607n30135m88303
58143H155957m40686l92368l61403l44160l23552l00854k88374k80658k62863
$$ y = [46730867, 53207260, 60993183, 70398726, 81870235, 95940091, 113269387, 134759548, 161504789, 194585764, 234877499, 282586773, 335959716, 389670951, 434851253, 462076444, 465782026, 446724860, 410758893, 365472791, 317434210, 271192014, 229380523, 193101206, 162402939, 136820161, 115732041, 98459136, 84303438, 72653769, 63040146, 55077217, 48421912, 42809184, 38064630, 34045505, 30605595, 27629590, 25051527, 22814994, 20850325, 19105094, 17558792, 16189894, 14960097, 13844071, 12842656, 11952221, 11149236, 10416925, 9759002, 9174395, 8644260, 8155957, 7715271, 7322903, 6961500, 6617340, 6293788, 5992934, 5704560, 5423902, 5161039]
58134E161039k38891k23276k13583j97342j77886j67505j62761j51328j36039
58125C492428j28464j25753j16816j04636j00126j00246r3958q3763q0347q1512
58115B476807p6929o8447o5778o7002o2759n5079n3298n5607n2902m6741m5772
58104A826493m8293m5670l9375l7902m0256l8762l4731l5436l8894l7305l2321
58093A397548l1663l3841l1294k5565k4374k6588k4848k0332k0234k3130k1376
58082A114303j5950j4696j7671j8034j5686j6485j9552j8744j5257j5703j9009
58071I27516j8182j3815j3016j5945j6086j3084j2865j5429j4744j0521q426q849
58059G66554o856l063l178o889q216o791p939j1648j2312r545q586r845q490m767
$$ y = [5161039, 4922148, 4698872, 4485289, 4287947, 4110061, 3942556, 3779795, 3628467, 3492428, 3363964, 3238211, 3121395, 3016759, 2916633, 2816387, 2722429, 2638666, 2558319, 2476807, 2399878, 2331431, 2265653, 2198651, 2135892, 2080813, 2027515, 1971908, 1919006, 1872265, 1826493, 1778200, 1732530, 1693155, 1655253, 1614997, 1576235, 1541504, 1506068, 1467174, 1429869, 1397548, 1365885, 1332044, 1300750, 1275185, 1250811, 1224223, 1199375, 1179043, 1158809, 1135679, 1114303, 1098353, 1083657, 1065986, 1047952, 1032266, 1015781, 996229, 977485, 962228, 946525, 927516, 909334, 895519, 882503, 866558, 850472, 837388, 824523, 809094, 794350, 783829, 775403, 766554, 759698, 756635, 753457, 746568, 738352, 731561, 723622, 711974, 699662, 690117, 681531, 671686, 663196, 658429]
58045F58429m220p151p935n475m531o093o051m112m576p417p823n290m327n589
58031E77839n176l231m217q046r746q589q850j0946j0686q018p655j0000j0116
58018D72563o882m743n109m381j808j201l323m283k956k565l719l315j333j300
58004D25645l081k652M0N87j636k374n80k6j675k097o40o45k187j258K421M280
57988D14122L094K799M552M567J714j43M80K11k097k992j434j222l923n971n378
57973D08379m919o154o480m687l422l781l235j104k91j479j449P79K004J032Q99
57958C76092K777L607K013Q03J280Q00j726l500l240l418m965n293l664k947l837
57943C54782l035N22L299L347L307M851N785N201N887Q908J1176J1078J1157J2575
$$ y = [658429, 654209, 647058, 639123, 633648, 629117, 623024, 616973, 612861, 608285, 600868, 593045, 587755, 583428, 577839, 572663, 569432, 565215, 557169, 547423, 538834, 529984, 519038, 508352, 500334, 492679, 482679, 472563, 465681, 460938, 455829, 451448, 449640, 448439, 445116, 440833, 437877, 435312, 431593, 428278, 426945, 425645, 422564, 419912, 419952, 420539, 418903, 416529, 415949, 415923, 414248, 412151, 411511, 410866, 408679, 407421, 409842, 414122, 417216, 420015, 424567, 429134, 430848, 430705, 431185, 431396, 429299, 426307, 424873, 423651, 419728, 413757, 408379, 403460, 397306, 390826, 386139, 382717, 378936, 375701, 374597, 374306, 372827, 371378, 372157, 374161, 375193, 376092, 378869, 382476, 384489, 385292, 386572, 387372, 385646, 382146, 378906, 375488, 370523, 365230, 361566, 358619, 354782, 351747, 352269, 355568, 358915, 362222, 367073, 372858, 378059, 383946, 392854, 404030, 415108, 426265, 438840]
57929D38840J2357R015N505L641R65l778p411p882p929r776j1080r747q040q222
57915C96458q498o887n062m836m708l212j922k013j554P60K828K994K901L793
57901C71042L724J471o11m87L02M5j29P70J125m6r28m42l51j518j816k83O27n63
57883C71932j611q65l70j831l336l024k374k934l430k893l120n107o579n817m499
57868C24142m140l315j110L91j21n47P44K083K205K930N338P133O827O625Q099
57853C57284Q932P313N578N993O621N099K937K274J792l54k664l123k944l941
57839C90797n125n295n879p805q750p006m904m804m985l239j302j606k751k320
57825C25026j317j695k206r22P48P47N32K353M688M740L189K262J175k096o357
$$ y = [438840, 451197, 460212, 465717, 469358, 470323, 466545, 459134, 451252, 443323, 433547, 422467, 412720, 404680, 396458, 387960, 381073, 376011, 371175, 366467, 363255, 361333, 359320, 357766, 358526, 361354, 364348, 367249, 371042, 374766, 376237, 375626, 375139, 375441, 375486, 375357, 376127, 377252, 377206, 376278, 375836, 375485, 373967, 372151, 371868, 372495, 371932, 370321, 369456, 369086, 367255, 363919, 360895, 358521, 355587, 352157, 349264, 346144, 341037, 334458, 328641, 324142, 320002, 316687, 315577, 315968, 315847, 315300, 316044, 318127, 320332, 323262, 328600, 335733, 342560, 349185, 357284, 366216, 373529, 379107, 385100, 391721, 396820, 399757, 402031, 403823, 403469, 400805, 397682, 394738, 390797, 385672, 380377, 374498, 366693, 357943, 350937, 346033, 341229, 336244, 333005, 331703, 330097, 327346, 325026, 323709, 322014, 319808, 318886, 319634, 320381, 320913, 323266, 327954, 332694, 335883, 338145, 339320, 337224, 330867]
57810C30867q671q864q725q407p225o326o811o980m975k340j439j366j29J273
57796B59882R35J51J208K850K276J31p24j43j41o02L44K483L957M810O404Q164
57780B91985Q482Q015Q616R813R734Q616Q080P828O412M440L646L690K923J475
57766C83755M35q55l484o123o768o267o877q400r006q722q773q594o945m910m375
57751B94091m508l211r83O1N0O55J564J266M60J029K348K264J060Q19J496J235
57735B99696J42J01J201J721J437J637K262K197J903K604L494K919J678J755K520
57720C27267J748l04j391j345j925l059k984j917j898l050l520l122l530m887
57706B96083n624n564n866o113m888l077k960m145m081k605k130l200l715k946
$$ y = [330867, 322196, 313332, 304607, 296200, 288975, 282649, 275838, 268858, 263883, 261543, 260104, 258738, 258609, 259882, 260817, 260968, 262176, 265026, 267302, 267433, 266709, 266566, 266425, 265823, 266167, 268650, 272607, 277417, 283821, 291985, 300467, 308482, 317098, 326911, 336645, 345261, 353341, 361169, 367581, 372021, 375667, 379357, 382280, 383755, 384190, 383335, 379851, 373728, 366960, 360693, 353816, 345416, 336410, 327688, 318915, 310321, 303376, 298466, 294091, 289583, 286372, 285389, 285450, 285500, 286155, 287719, 288985, 289445, 290474, 292822, 295086, 296146, 296965, 298461, 299696, 299838, 299939, 301140, 302861, 304298, 305935, 308197, 310394, 312297, 314901, 318395, 321314, 322992, 324747, 327267, 329015, 328711, 327320, 325975, 324050, 320991, 318007, 316090, 314192, 311142, 307622, 304500, 300970, 296083, 290459, 284895, 279029, 272916, 268028, 264951, 261991, 257846, 253765, 251160, 249030, 245830, 242115, 239169]
57692B39169k564l005k522o44Q13R71R73J190N36p77j023j16J59k86P15L842P096
57675B44527R266J1439J4278J6889J9442K3938L1235M0047M9792O1319P3100P9144
57663F74416P2780N1841K0181j4087m2057n8646o4966o5034o0823n2585m2539
57652D18481l4344k8832k3790j8343j4132j1748r612p243o152o445n940l775j851
57639B46274j355r49K57Q62j05j251j162m54r4J02K10m13j462j553o22k97j102
57622B36886j634j226r62j290j115j22M58K48L94J050Q39l62p59K52R63L16o10
57605B33326j065j886l207l660l008k937l951m231k904j696j898k293j703j043
57591A97844j249j530j352j744l073l758k864j754j637j676j097q71j611k028
$$ y = [239169, 236605, 233600, 231078, 230434, 231247, 232218, 233191, 234381, 234917, 234140, 233117, 233001, 233160, 232874, 233589, 237431, 244527, 253793, 265232, 279510, 296399, 315841, 339779, 371014, 411061, 460853, 522172, 595272, 674416, 747196, 799037, 819218, 805131, 763074, 704428, 639462, 574428, 513605, 461020, 418481, 384137, 355305, 331515, 313172, 299040, 287292, 277680, 270437, 264285, 257840, 251900, 248125, 246274, 244919, 243970, 244227, 245089, 244984, 243733, 242571, 242117, 242023, 242125, 242335, 241922, 240460, 238907, 238285, 237988, 236886, 235252, 234026, 233064, 231774, 230659, 230537, 230995, 231243, 231637, 232687, 233526, 233164, 232405, 232657, 233620, 233936, 233326, 232261, 230375, 227168, 223508, 220500, 217563, 213612, 209381, 206477, 204781, 202883, 200590, 198887, 197844, 196595, 195065, 193713, 191969, 188896, 185138, 182274, 180520, 178883, 177207, 176110, 175239, 173628, 171600]
57577A71600j274o86j376k169j790j145j502k231k191j810j941k162j837j479
57563A48007j562j419o14J04L54R40J975K094P90l46j00M83R9p44j064j040r74
57546A46983l75O22P15l62r65j30R44J220J527K484K914J994R36P75M72j027k687
57529A56040l231l205l428l156j712k90j39m00L01J588K319K546K757K598J895
57514A54483J595K159K467J733R43J054J391J205J030J094L50j426k607k392k311
57499A60768l364l936k719j349j644k315j215R16J854J633J995L070L486L071
57485A60251K946L415L854M161M521M430L613L029L348L557K735J866K018K176
57471B05920J042l66l03O34N04p82j633j572j498j719j732j652j957k193j618
$$ y = [171600, 170326, 169640, 168264, 166095, 164305, 163160, 161658, 159427, 157236, 155426, 153485, 151323, 149486, 148007, 146445, 145026, 144412, 144516, 144870, 145810, 147785, 149879, 150669, 150323, 150223, 150706, 150805, 150061, 148997, 147957, 146983, 146608, 147230, 147945, 147583, 146618, 146488, 147432, 148652, 150179, 152663, 155577, 157571, 158507, 159282, 159754, 158727, 156040, 152809, 149604, 146176, 143020, 141308, 141018, 140879, 140479, 140780, 142368, 144687, 147233, 149990, 152588, 154483, 156078, 158237, 160704, 162437, 163380, 164434, 165825, 167030, 168060, 169154, 169504, 168078, 165471, 163079, 160768, 157404, 153468, 150749, 149400, 147756, 145441, 144226, 145142, 146996, 148629, 150624, 153694, 157180, 160251, 163197, 166612, 170466, 174627, 179148, 183578, 187191, 190220, 193568, 197125, 199860, 201726, 203744, 205920, 206962, 206596, 206293, 206927, 207431, 206649, 205016, 203444, 201946, 200227, 198495, 196843, 194886, 192693, 191075]
57456A91075o52j82o9K04K52m15j165j370j685k704l437k838j650j020m34J033
57440A74943K591K797J833Q83J88m70n38J81L87p41j609m97J478J951Q69l1k83
57423A83932p05j063l72Q47J002n8j026j318j354j089j90P10Q20O77J186J803
57407A83802J501P03M01K57m96j187q78m00r55j706j195k00m97j521j183M50J231
57390A78127N26p2K43M69R1q1K33K75n2J10Q08J098P82O12P00M76J48M50R95O83
57370A86621l72j007r34p86n64J50P96M96k15k24R4l07q08Q0J914K756K234J786
57352A91710J933J745J124J136J794J787R04N24J258K060K118J859J638J244R01
57337B13735J111J356O95l98o00r0k37j002q71M25J333J018M62M70N97M90N74
$$ y = [191075, 190423, 190241, 190172, 190376, 190628, 190213, 189048, 187678, 185993, 183289, 179852, 177014, 175364, 174344, 173910, 174943, 177534, 180331, 182164, 183047, 183235, 182765, 182227, 182408, 182795, 182054, 180445, 179948, 181426, 183377, 184246, 184215, 183932, 183227, 182164, 181792, 182639, 183641, 183583, 182557, 181239, 179885, 178796, 178606, 179316, 180136, 180813, 181999, 183802, 185303, 186006, 186407, 186664, 186168, 184981, 184103, 183703, 182748, 181042, 179847, 179647, 179150, 177629, 176446, 176896, 178127, 178653, 178581, 178824, 179293, 179384, 179303, 179536, 179811, 179759, 179869, 180677, 181775, 182557, 183169, 183869, 184345, 184493, 184943, 185938, 186621, 186249, 185242, 184308, 183522, 182958, 183108, 183904, 184400, 184185, 183961, 184055, 183748, 182940, 183020, 184934, 187690, 189924, 191710, 193643, 195388, 196512, 197648, 199442, 201229, 202133, 202657, 203915, 205975, 208093, 209952, 211590, 212834, 213735, 214846, 216202, 216897, 216499, 215899, 215809, 215572, 214570, 213699, 214124, 215457, 216475, 216937, 217407, 218004, 218494, 219068]
57320B19068Q53P11K32K43P20P70L27K41O45Q77J021J788K845L100K617K430K542
57303B41030K014J039Q67J595K103K200K782L772M018L436L135L249K763J664
57289B75667J076J106P55J18L87J453J879J511J654K305J851P3j125p48m2O7L17
57272B88304R79Q71l07r21l9Q96M02q48j443j279r50n92l06m60p92m57N02J163
57254B84723J403J921K428J824M87J96J319K288K378K648L465L549K499J825K333
57239C15286K757K183J653K071K585K428K440L352M338M560M419M253L541K501
57225C58367K523L773M439L546K556K787L326L059K792L503M243L750K757K797
57211D04218L812M538M464M034L707L861M731N723N837N310N415O199O227N245
$$ y = [219068, 219921, 220632, 220864, 221107, 221827, 222597, 222924, 223165, 223810, 224687, 225708, 227496, 230341, 233441, 236058, 238488, 241030, 243044, 244083, 244950, 246545, 248648, 250848, 253630, 257402, 261420, 264856, 267991, 271240, 274003, 275667, 276743, 277849, 278604, 278722, 279109, 280562, 282441, 283952, 285606, 287911, 289762, 289835, 288710, 287962, 287920, 287987, 288304, 289283, 290154, 289847, 288926, 288887, 289783, 290185, 289337, 287894, 286615, 285665, 285073, 284767, 284307, 283515, 283058, 283560, 284723, 286126, 288047, 290475, 292299, 292786, 292982, 294301, 296589, 298967, 301615, 305080, 308629, 311128, 312953, 315286, 318043, 320226, 321879, 323950, 326535, 328963, 331403, 334755, 339093, 343653, 348072, 352325, 355866, 358367, 360890, 364663, 369102, 372648, 375204, 377991, 381317, 384376, 387168, 390671, 394914, 398664, 401421, 404218, 408030, 412568, 417032, 421066, 424773, 428634, 433365, 439088, 444925, 450235, 455650, 461849, 468076, 473321]
57197D73321M999O404P926Q106P762Q267R330J0008J0405J0976J1492J1872J2652
57184E93520J3658J3769J2978J2865J3999J4775J3980J2601J1809J1188J0414
57173G35556J0580J2155J3551J3495J3089J3757J4860J5228J5438J6658J8547
57162H92914K0108K1360K2639K3527K3874K4491K5529K5773K4848K4353K5283
57151A154699K6280K6052K5563K6027K6675K6514K6448K7586K9179L0277L1673
57140A456973L4059L6051L6325L6080L7018L8542L9334M0069M1965M4114M4969
57129A885499M5240M6678M9140N1406N3801N7345O1413O4864O8482P3703P9884
57118B537455Q5495R1079R8275J06835J15407J24511J35823J49019J62329J75797
$$ y = [473321, 478320, 484724, 492650, 500756, 508518, 516785, 526115, 536123, 546528, 557504, 568996, 580868, 593520, 607178, 620947, 633925, 646790, 660789, 675564, 689544, 702145, 713954, 725142, 735556, 746136, 758291, 771842, 785337, 798426, 812183, 827043, 842271, 857709, 874367, 892914, 913022, 934382, 957021, 980548, 1004422, 1028913, 1054442, 1080215, 1105063, 1129416, 1154699, 1180979, 1207031, 1232594, 1258621, 1285296, 1311810, 1338258, 1365844, 1395023, 1425300, 1456973, 1491032, 1527083, 1563408, 1599488, 1636506, 1675048, 1714382, 1754451, 1796416, 1840530, 1885499, 1930739, 1977417, 2026557, 2077963, 2131764, 2189109, 2250522, 2315386, 2383868, 2457571, 2537455, 2622950, 2714029, 2812304, 2919139, 3034546, 3159057, 3294880, 3443899, 3606228, 3782025]
57108C782025J91349K09917K31274K56422K87514L25648L71424M27538M98228
57099F581339N86297O93328Q22838R80423J170610J395743J657729J957554K292154
57090A8138015K653576L030958L410595L773886M098280M361150M540675M614051
57082D8621186M561094M374111M061440L635258L093824K418627J593781O32466
57074G2991787m12591j463336k442821l293534l979899m483097m797992m932007
57066D7186510m902024m731107m448338m088630l687774l275465k872860k494541
57058A6685771k149861j842849j573765j341682j144742r79107q40064p23990
57050F089711o27659n46650m76817m16748l66385l23804k85848k51435k21454
$$ y = [3782025, 3973374, 4183291, 4414565, 4670987, 4958501, 5284149, 5655573, 6083111, 6581339, 7167636, 7860964, 8683802, 9664225, 10834835, 12230578, 13888307, 15845861, 18138015, 20791591, 23822549, 27233144, 31007030, 35105310, 39466460, 44007135, 48621186, 53182280, 57556391, 61617831, 65253089, 68346913, 70765540, 72359321, 72991787, 72579196, 71115860, 68673039, 65379505, 61399606, 56916509, 52118517, 47186510, 42284486, 37553379, 33105041, 29016411, 25328637, 22053172, 19180312, 16685771, 14535910, 12693061, 11119296, 9777614, 8632872, 7653765, 6813701, 6089711, 5462052, 4915402, 4438585, 4021837, 3655452, 3331648, 3045800, 2794365, 2572911]
57041B572911j95646j72318j51023j32696j17002j02145q7420p3272n8858m2460
57031A440071k4221n137J6463M2481O7016P5361N5715J1233m1601q5500j12016
57020A439865j21772j19724j11148r9730q7440p5426o4647n5614m8241m2341l7746
57009E76036l3935l0255k6611k3290k0222j7252j4927j3894j3693j3232j2386
56998C56339j1971j2234j2581j2673j2555j1911j0534r302r130r134p453l925
56986B32936k88K458N211Q848J2602J4788J4035R655K082o702j4182j8994k1050
56973B41399k0599j8293j5565j3448j1395q605n853m246k971l88L102N674P283
56960A56095R846J4183J9171K4099K9217L3280L3084K6556J4783M69j3731k4984
$$ y = [2572911, 2377265, 2204947, 2053924, 1921228, 1804226, 1702081, 1614661, 1541389, 1482531, 1440071, 1415850, 1410713, 1427176, 1469657, 1536673, 1612034, 1667749, 1678982, 1637381, 1551881, 1439865, 1318093, 1198369, 1087221, 987491, 900051, 824625, 759978, 704364, 656123, 613782, 576036, 542101, 511846, 485235, 461945, 441723, 424471, 409544, 395650, 381957, 368725, 356339, 344368, 332134, 319553, 306880, 294325, 282414, 271880, 262578, 253448, 244314, 236861, 232936, 232648, 235106, 240317, 249165, 261767, 276555, 290590, 300245, 302327, 295625, 281443, 262449, 241399, 220800, 202507, 186942, 173494, 162099, 153494, 147641, 143395, 140424, 140036, 143138, 148812, 156095, 165941, 180124, 199295, 223394, 252611, 285891, 318975, 345531, 360314, 360783, 347052, 322068]
56948C22068l0827l1268k8852k5802k2355j8293j4232j0659p265l987j299J087
56936A28316M328Q779J3686J8864K5045L2099L8366M2011M1445L4641K0503J679
56924D09762j6194k9032l6671m0460m0900l8479l4563l0022k4637j8868j4483
56913H5453j2309j1077r579q352q077p972p123o059n689C418b278n342m826l889
56899a6335k640j775j375o80N32J698K977N372c401H559J4507J8047K3445K9232
56885I3790L3646L6391L7086L3898K5604J3990K588o265j2013j4686j4590j2629
56873B16810r853o928m380k500o41K398O762J1408J5922K1233K8109L6346M5823
56860C60509N6854O8532P7743Q0415P3104N4090K5241o708l3126m9255n6160n7133
$$ y = [322068, 291241, 259973, 231121, 205319, 182964, 164671, 150439, 139780, 132515, 128528, 127229, 128316, 132644, 141423, 155109, 173973, 199018, 231117, 269483, 311494, 352939, 387580, 408083, 409762, 393568, 364536, 327865, 287405, 246505, 208026, 173463, 143441, 118804, 99936, 85453, 73144, 62067, 52488, 44136, 36059, 28087, 20964, 14905, 9216, 3418, -2278, -7620, -12446, -16335, -18975, -20750, -22125, -22805, -22273, -20575, -17598, -12226, -3401, 8559, 23066, 41113, 64558, 93790, 127436, 163827, 200913, 234811, 260415, 274405, 276993, 270728, 258715, 244029, 229439, 216810, 206957, 200029, 195649, 193149, 192508, 194906, 201668, 213076, 228998, 250231, 278340, 314686, 360509, 417363, 485895, 563638, 644053, 717157, 771247, 796488, 789780, 756654, 707399, 651239, 594106]
56848E94106n4106m8034m0169l1440k2068j2762m702K337J0073J9229K8970L9420
56836D80854N2436O8789Q6898J05091J21867J32065J26174R7583N0005m248n2505
56825A265009q7231j06206j11229j06677r6883q4177o9818n5590m3011l1935k1445
56814D50807j1425j999P596J8148K9341M0842N3617O8465Q3392R3265R1847P4589
56802I98485M1732J79l9115o7598q3142q8053q5307p7671o8022n8184m8181l8003
56790C87120k8929k1795j5484q680j808M332J0526J7917K6051L3847M1209M7537
56778D91843M9544M2964K6665L986j9520l8681n0345n4417n3312m9550m4166l7811
56766B67200l1840k7157k3237j9443j6250j4025j1957r477p457o707o439n678
$$ y = [594106, 540000, 491966, 451797, 420357, 398289, 385527, 380825, 383162, 393235, 412464, 441434, 480854, 533290, 602079, 688977, 794068, 915935, 1048000, 1174174, 1271757, 1321762, 1317514, 1265009, 1177778, 1071572, 960343, 853666, 756783, 672606, 602788, 547198, 504187, 472252, 450807, 439382, 437383, 444979, 463127, 492468, 533310, 586927, 655392, 738784, 832049, 923896, 998485, 1040217, 1040396, 1001281, 933683, 850541, 762488, 677181, 599510, 531488, 473304, 425123, 387120, 358191, 336396, 320912, 312232, 310424, 314756, 325282, 343199, 369250, 403097, 444306, 491843, 541387, 584351, 611016, 615002, 595482, 556801, 506456, 452039, 398727, 349177, 305011, 267200, 235360, 208203, 184966, 165523, 149273, 135248, 123291, 113814, 106357, 99650, 93211, 87533]
56754H7533m876m708m489l425k224j948k245k217k000k034j888j202p43j110j504
56739E0920j131o71r14j233q49l91o56j123j050q50r18o02K55L84o99j302k03
56722C8967J107Q97J36O48J902K151J448J007P73O0m57P4O16j39j108m05J304
56705D8981J803Q59R9k4m65j103p75L75J009Q85Q40P76kq24l20J088J616R27L51
56686E6096M80O49P37J396K491L168L394L727L954L663L641M738N971N849N052
56671A05006N488P162Q289Q283Q191Q234P369N442L632K435J191k87j339j859
56657A67237k324k544k037j425j692k349k167j428j451k206k408j794j295j101
56643A41016n48J58R0n92r21r96j780l128l923m011m136m178l371k071j380j232
$$ y = [87533, 82657, 77949, 73460, 70035, 67811, 65863, 63618, 61401, 59401, 57367, 55479, 54277, 53534, 52424, 50920, 49789, 49118, 48204, 46971, 46122, 45731, 45075, 43952, 42902, 42052, 41134, 40532, 40787, 41171, 40472, 39170, 38967, 40074, 40971, 41107, 41755, 43657, 45808, 47256, 48263, 49036, 49096, 48639, 48713, 49329, 49190, 48082, 47677, 48981, 50784, 51643, 51742, 51718, 51253, 50150, 49375, 49750, 50759, 51644, 52484, 53260, 53258, 52434, 52114, 53202, 54818, 55745, 56096, 56576, 57225, 57962, 59358, 61849, 65017, 68411, 72138, 76092, 79755, 83396, 88134, 94105, 99954, 105006, 110494, 117656, 125945, 134228, 142419, 150653, 158022, 163464, 167096, 169531, 170722, 170435, 169096, 167237, 164913, 162369, 160332, 158907, 157215, 154866, 152699, 151271, 149820, 147614, 145206, 143412, 142117, 141016, 140468, 140626, 140716, 140124, 139203, 138207, 136427, 133299, 129376, 125365, 121229, 117051, 113680, 111609, 110229, 108997]
56627A08997p07oj82j118j720j823k044k111j281j02K07k24l87l28o67r24m17
56610I5163o8j000k088j481K02R43Q41J555K788K597J074M08J134J509R08O91
56594A05176J230J182L48L34J498K075J187J45j69o21j641k117j457n77J0R07
56578A07510J971J902N43n23l34L76R44J594K060J612R04J533L351M421M077L714
56562A35655M098M400M397N118O548P126O331N407M889L815K163J545K509L474
56548A97475L294K661K135J123k19m80N77J197K61j206k092k620k951k509j622
56533A95024j668k658k820j496l65q02k037k929l544m082m149l965m399n160m892
56518A50058l584k785k864k480j309q14j521k018j612j522k318k667j755o71k29
$$ y = [108997, 108290, 108284, 108102, 106984, 105264, 103441, 101397, 99286, 98005, 97903, 98110, 97886, 97499, 97171, 96504, 95580, 95163, 95095, 94095, 92007, 90526, 90728, 91671, 92512, 94067, 96855, 99452, 100526, 100934, 102068, 103577, 104485, 105176, 106406, 107588, 107936, 108270, 109768, 111843, 113030, 113175, 113006, 112385, 110744, 108627, 107170, 106593, 106603, 107510, 109481, 111383, 111926, 111403, 111069, 111445, 112389, 113983, 116043, 117655, 118559, 120092, 123443, 127864, 131941, 135655, 139753, 144153, 148550, 153668, 160216, 167342, 173673, 179080, 183969, 187784, 189947, 191492, 194001, 197475, 200769, 203430, 205565, 206688, 206469, 205989, 206566, 207763, 208024, 206818, 204726, 202106, 199155, 196646, 195024, 193356, 190698, 187878, 186382, 186017, 185215, 183178, 180249, 176705, 172623, 168474, 164509, 160110, 154950, 150058, 146474, 143689, 140825, 138345, 137036, 136222, 134701, 132683, 131071, 129549, 127231, 124564, 122809, 122138, 121909]
56503A21909L38J429J993J548J175J438J346L37p08j183j470j402k86J040P99
56488A28303n78p31N62P64j038k370j456J57O83Q27J576K045J510J109J567J640
56472A34570O15nQ05J579R52M9L31J090J059N97N48O11M34N80J141J208Q22J293
56454A48279K579K777J352K82O59R13j19j052o14K60O58J322K348K043J6j336
56438A60367m58Q26N32m34n23k97o37o80J71N63l31r86k64M74Q7j42P90J354L71
56419A60783o06k41o9j469k652j607L35R13O73J246K019J606P38Q12J206Q12M12
56402A64911Q87R93l81j701j219O8N76J036K367K963J330o05k75J256J252n3l57
56385A73048N26R01O44J072K098K530K489K848L056K118Q60P59J412J525J309
$$ y = [121909, 122247, 123676, 125669, 127217, 128392, 129830, 131176, 131513, 130805, 129622, 128152, 126750, 126464, 127504, 128303, 127725, 126994, 127556, 128320, 127282, 124912, 123456, 123613, 124296, 125123, 126699, 128744, 130254, 131363, 132930, 134570, 135185, 135180, 135985, 137564, 138516, 138565, 138896, 139986, 141045, 141642, 142190, 142801, 143235, 143815, 144956, 146164, 146986, 148279, 150858, 153635, 154987, 155269, 155928, 156841, 156722, 155670, 155056, 155316, 155974, 157296, 159644, 161687, 161703, 160367, 159909, 160735, 161267, 160833, 160310, 160013, 159376, 158696, 158867, 159430, 159099, 158113, 157849, 158323, 158410, 158268, 159058, 160412, 160783, 160177, 159936, 159867, 158398, 155746, 154139, 154474, 155387, 156060, 157306, 159325, 160931, 161669, 162481, 163687, 164499, 164911, 165798, 166791, 166410, 164709, 163490, 163558, 164134, 165170, 167537, 170500, 171830, 171225, 170950, 172206, 173458, 173405, 173048, 173574, 174475, 175119, 176191, 178289, 180819, 183308, 186156, 189212, 191330, 192190, 192949, 194361, 195886, 197195]
56370A97195J613J807Q44o06j227j088p41J88J586J813J74j295p31P53J203P79
56354B02267L17p35k556l394k324j293j815k207q06Q15R81J425L959O315N388
56339B06337K431Q68P97n3j565j689n01K74Q16K428M243M414L598L821M790M787
56323B35796M066L968L847K366O53O28J388Q15m74m08O02O58R8N00J186N17m86
56306B55720L46K258K822K259K617L690L650K899L287M331M126L217L604M720
56292B99546M413L211L555N246N696M427L518L812M233M599N667O746O458N415
56278C66542N110N081M294M020N864Q274Q751Q209R257J1442J2338J2129J2895
56265D74206J4327J4495J4002J5127J7579J9277K0526K3301K7227L0445L3526
$$ y = [197195, 198808, 200615, 201459, 200853, 199626, 198538, 197797, 197985, 199571, 201384, 201558, 200263, 199532, 200285, 201488, 202267, 202584, 201849, 199293, 195899, 193575, 192282, 190467, 188260, 187454, 188269, 189250, 190675, 194634, 200949, 206337, 208768, 209636, 210433, 210380, 208815, 207126, 206625, 206899, 207715, 210143, 214386, 218800, 222398, 226219, 231009, 235796, 239862, 243830, 247677, 250043, 250696, 251324, 252712, 253527, 253053, 252645, 253247, 253905, 254003, 254503, 255689, 256206, 255720, 256066, 258324, 261146, 263405, 266022, 269712, 273362, 276261, 279548, 283879, 288005, 291222, 294826, 299546, 303959, 307170, 310725, 315971, 321667, 326094, 329612, 333424, 337657, 342256, 347923, 354669, 361127, 366542, 371652, 376733, 381027, 385047, 390911, 399185, 407936, 416145, 425402, 436844, 449182, 461311, 474206, 488533, 503028, 517030, 532157, 549736, 569013, 589539, 612840, 640067, 670512, 704038]
56254G04038L8383M4323M9447N4762O2509P1567P9168Q5912R4223J03009J08972
56243A496313J12313J15898J19508J20145J17371J13040J06316R4391P7818N9839
56233B532952M0868J9009m387k5255m2693n8862p3393q3659r0372r6973j03311
56222B013924j05819j04228j02129j00446r6426q9790q3893p9723p4486o7364
56212A109620o1119n6861n2486m7379m3455m0599l6401l1216k8169k7288k5070
56201F59577k0764j7601j6770j5677j3278j1709j1433j0134p509o013n880m703
56189E18106k620k379l672l181j024r80l411m217k062l08m09K26K214K426J97
56174D98906r09N27J571R63J278L171L631K042J868M195N599M684M642O963Q616
$$ y = [704038, 742421, 786744, 836191, 890953, 953462, 1025029, 1104197, 1190109, 1284332, 1387341, 1496313, 1608626, 1724524, 1844032, 1964177, 2081548, 2194588, 2300904, 2395295, 2473113, 2532952, 2573820, 2592829, 2588442, 2563187, 2520494, 2461632, 2388239, 2304580, 2214208, 2117235, 2013924, 1908105, 1803877, 1701748, 1601302, 1504876, 1415086, 1331193, 1251470, 1176984, 1109620, 1048501, 991640, 939154, 891775, 848320, 807721, 771320, 740104, 711935, 684647, 659577, 638813, 621212, 604442, 588765, 575487, 563778, 552345, 542211, 534702, 528689, 522809, 518106, 515486, 513107, 509435, 506254, 505230, 504250, 500839, 496622, 494560, 494252, 493843, 494069, 496283, 498709, 498906, 497997, 498524, 500095, 501058, 502336, 505507, 509138, 511180, 513048, 517243, 522842, 527526, 532168, 539131, 547747]
56159E47747P876P216Q106Q608Q189R226J1675J2303J1046J1983J6113J9549K0948
56146G00585K3937L0022L5950M0796M8699O1570P5698Q8513J01967J15913J24819
56135A448469J24618J17039J04362Q6367O5501M8466L9037L4873L3553L5129L6471
56124B173885L0874J6920J171j0889j9739k5523k5382k0996k0715k9651m4326
56113B025629o0554p8678r7189j09465j12038j08991j03752r4048p9387o5467
56103A116060n5965m7332l6756k7783k3030j8971j3193r266r090q080l506J03
56091H63191n69j416J081L385K365J601M127O367N394M774P164Q659O637N460
56077I18220Q215J0533R010P777J0214J2175J0284Q830J1456J4056J2990J2186
$$ y = [547747, 555623, 562839, 570945, 579553, 587742, 596968, 608643, 620946, 631992, 643975, 660088, 679637, 700585, 724522, 754544, 790494, 831290, 879989, 941559, 1017257, 1105770, 1207737, 1323650, 1448469, 1573087, 1690126, 1794488, 1880855, 1946356, 1994822, 2033859, 2068732, 2102285, 2137414, 2173885, 2204759, 2221679, 2222850, 2211961, 2192222, 2166699, 2141317, 2120321, 2099606, 2069955, 2025629, 1965075, 1886397, 1789208, 1679743, 1567705, 1458714, 1354962, 1260914, 1181527, 1116060, 1060095, 1012763, 976007, 948224, 925194, 906223, 893030, 883764, 874674, 866594, 863088, 863191, 862622, 861206, 862287, 865672, 868037, 869638, 873765, 880132, 885526, 890300, 897464, 906123, 912760, 918220, 926435, 936968, 945978, 953755, 963969, 976144, 986428, 995258, 1006714, 1020770, 1033760, 1045946]
56065A045946J4909J6759J4306J2399J5200J8199J6903J5127J6865J8315J5947
56054A220875J4003J5961J7185J4222J2386J5784J9023J7489J6303K0030K3174
56043A406435K0563J7512J9654K2344K0466J9009K3186K7716K6954K5933L0065
56032A659837L3746L0982K7620L0871L6139L6561L6024M0177M4185M2252L9871
56021B058265M3675M8676M8341M7492N2118N6806N5615N4741O0601O6489O5358
56010B658177O4233P0988P8753P9093P8503Q5478R3576R4409R4782J03244J12462
55999C613698J13439J14031J24168J36070J39281J41633J54245J69572J76259
55990D882396J81583J96513K13105K20455K28022K48349K72090K86159L00366
$$ y = [1045946, 1060855, 1077614, 1091920, 1104319, 1119519, 1137718, 1154621, 1169748, 1186613, 1204928, 1220875, 1234878, 1250839, 1268024, 1282246, 1294632, 1310416, 1329439, 1346928, 1363231, 1383261, 1406435, 1426998, 1444510, 1464164, 1486508, 1506974, 1525983, 1549169, 1576885, 1603839, 1629772, 1659837, 1693583, 1724565, 1752185, 1783056, 1819195, 1855756, 1891780, 1931957, 1976142, 2018394, 2058265, 2101940, 2150616, 2198957, 2246449, 2298567, 2355373, 2410988, 2465729, 2526330, 2592819, 2658177, 2722410, 2793398, 2872151, 2951244, 3029747, 3115225, 3208801, 3303210, 3397992, 3501236, 3613698, 3727137, 3841168, 3965336, 4101406, 4240687, 4382320, 4536565, 4706137, 4882396, 5063979, 5260492, 5473597, 5694052, 5922074, 6170423, 6442513, 6728672, 7029038]
55981G029038L28832L61855L85117M09254M49815M96263N33157N72978O33546
55972A1199855P03058P64195Q31727R27015J037930J146488J272217J442419J645442
55963B0970346J863875K126852K475578K908073L418206M054733M873395N870022
55955D8561080P042023Q478576J0307623J2609990J5491511J9171106K3854711
55948A45516620K9568350L6177654M3220190M9154560N0841202M4735913K9619946
55941D28834435Q368029j3350132l0412922m0604685m4446292m3662510m0048043
55934B24677880l5107592k9925172k5075921k0760671j7057706j4003435j1534943
55927G1212440r524595p888451o588377n556631m704943l994186l423702k965185
$$ y = [7029038, 7357870, 7719725, 8104842, 8514096, 8963911, 9460174, 9993331, 10566309, 11199855, 11902913, 12667108, 13498835, 14425850, 15463780, 16610268, 17882485, 19324904, 20970346, 22834221, 24961073, 27436651, 30344724, 33762930, 37817663, 42691058, 48561080, 55603103, 64081679, 74389302, 86999292, 102490803, 121661909, 145516620, 175084970, 211262624, 254482814, 303637374, 354478576, 399214489, 428834435, 437202464, 423852332, 393439410, 352834725, 308388433, 264725923, 224677880, 189570288, 159645116, 134569195, 113808524, 96750818, 82747383, 71212440, 61687845, 53799394, 47211017, 41654386, 36949443, 32955257, 29531555, 26566370]
55919B6566370k569569k224449j944983j718931j513479j325222j173419j052832
55911A3043486r38962q31142p47326o83603o19071n54087n05896m72312m35190
55902G255897l94421l64973l45123l19420k88799k67716k55312k37711k15182
55893D567240k00016j91176j76802j58371j47610j42770j31658j15008j04161
55884C199668r9145r1187q3201q5402r3670r4039q6225q1846q1875p6929o7947
55873B258202o5742p0654p2148o8331o7348o9757o7452o0202n6161n5848n1873
55862A552686m4466m1425m2790m0876l5440l3749l5785l4150k8612k6350k7661
55851A161382k5593k0017j8316k1633k3562k2828k4433k8017k7762k4124k3383
$$ y = [26566370, 23996801, 21772352, 19827369, 18108438, 16594959, 15269737, 14096318, 13043486, 12104524, 11273382, 10526056, 9842453, 9223382, 8669295, 8163399, 7691087, 7255897, 6861476, 6496503, 6151380, 5831960, 5543161, 5275445, 5020133, 4782422, 4567240, 4367224, 4176048, 3999246, 3840875, 3693265, 3550495, 3418837, 3303829, 3199668, 3100523, 3009336, 2926135, 2840733, 2747063, 2653024, 2566799, 2484953, 2403078, 2326149, 2258202, 2192460, 2121806, 2049658, 1981327, 1913979, 1844222, 1776770, 1716568, 1660407, 1604559, 1552686, 1508220, 1466795, 1424005, 1383129, 1347689, 1313940, 1278155, 1244005, 1215393, 1189043, 1161382, 1135789, 1115772, 1097456, 1075823, 1052261, 1029433, 1005000, 976983, 949221, 925097, 901714]
55840I01714k5427k4075j9455j7903j9492j7908j2974j1133j3029j2499q686p410
55828G11723r542r463o316n542p992q255n337m604p559r638r544j0984j3948j3923
55814E89076j0954j0097j1688j0632o449m536o100o195l196j194j429j36L513
55801E19983N805O216Q337J1911J2275R038O885O639L934j847n823o345p307r929
55787E59772j0350p335m831m998n850p185j1406j7114j9330j7556j6384j7001
55775D20432j5521j1034p459n897k830K259M962L596J647P25j696n727p505o212
55761C69740n709p158p022m407l349n493p251o661o448p977q570p219o736p927
55747B77813p806n624m548n369m842k289j353k972l159k55J952J014m90o32j416
$$ y = [901714, 876287, 852212, 832757, 814854, 795362, 777454, 764480, 753347, 740318, 727819, 719133, 711723, 702181, 692718, 686402, 680860, 672868, 664613, 659276, 654672, 647113, 637475, 627931, 616947, 602999, 589076, 578122, 568025, 556337, 545705, 539256, 534720, 528620, 522425, 519229, 518035, 516606, 516470, 519983, 525788, 532004, 540341, 552252, 564527, 573565, 580450, 587089, 591023, 589176, 583353, 577008, 569701, 559772, 549422, 542087, 537256, 532258, 526408, 519223, 507817, 490703, 471373, 453817, 437433, 420432, 404911, 393877, 386418, 380521, 377691, 379950, 384912, 388508, 390155, 390880, 389184, 383457, 375952, 369740, 364031, 356873, 349851, 345444, 342095, 336602, 329351, 322690, 316242, 308265, 299695, 292476, 285740, 277813, 270007, 264383, 259835, 254466, 249624, 247335, 245982, 243010, 239851, 239596, 241548, 242562, 242072, 241440, 240024]
55732B40024l622m284k242n51p53l61J403J268j955m599m432m048n210n422l290
55717B01926j717k444k693n41J457J311J242K986M253L245K141K691K896J293
55703B18046J89J327K406J155j100k706m593p104q010o456n005n176m944l044
55689A74985j516j524j060O88J189m84j168R82L175L087K829M495O138N632M469
55674B01917M228L289N42j518r94j27j143k264j403l02j197k632k327j197j063
55659A93809j242o96o58j918k380m86J838K619L171M887N929M484K336J784J717
55644B15194R6k249l599m523o016o895o116n195n528n806m798l953m454m632l229
55629A48297k200l129l874k195J24L47o93p30k20p13j359p32p8j171k812k876
$$ y = [240024, 236402, 232118, 229876, 229325, 228572, 228211, 229614, 230882, 228927, 224328, 219896, 215848, 210638, 205216, 201926, 200209, 197765, 195072, 194531, 195988, 197299, 198541, 201527, 205780, 209025, 211166, 213857, 216753, 218046, 218235, 219562, 221968, 223123, 222023, 219317, 214724, 207620, 199610, 193154, 188149, 182973, 178029, 174985, 173469, 171945, 170885, 171573, 172762, 172278, 171110, 172092, 175267, 178354, 181183, 185678, 191816, 197448, 201917, 206145, 209434, 209976, 208458, 207464, 207337, 206194, 203930, 202527, 202225, 201028, 198396, 196069, 194872, 193809, 192567, 191871, 191213, 189295, 186915, 186429, 188267, 190886, 194057, 198944, 204873, 209357, 211693, 213477, 215194, 215290, 213041, 209442, 204919, 198903, 192008, 185892, 180697, 175169, 169363, 164565, 160612, 156158, 151526, 148297, 146097, 142968, 139094, 136899, 137023, 137370, 136677, 135947, 135727, 135014, 133655, 132923, 132845, 131674, 128862, 125986]
55613A25986k088k381l248l014k173k247k789k420j473r47m09N94Q39m39j662
55598A02129j554j464k559l186j785k2np04k80M18r4o76J74J014J9j233l00J654
55580I1546J800M78J75R96J031K27J97Q44O93o9n8M49J59m83m8J061J392J153
55562A01543J476J849J095l0%O71M94j47oK26r15k662l144k663k809l102j692
55545I0184J101L041L477L802M543M668L719K377J021k69p91k70r7j409k801k223
55529A10073k39R91J053J088J082J08j327j776j415j617k332k317j641j615k385
55514I7731k773k361j800j302o32k31n97j062q20m31o76q76j73O17L95n2N72J570
55496H7099J379K67k95j79k63m84l29l84j223j708o59P40O25n26r01m17k68l99
$$ y = [125986, 123898, 121517, 118269, 115255, 113082, 110835, 108046, 105626, 104153, 103206, 102797, 103391, 104230, 103791, 102129, 100575, 99111, 96552, 93366, 91581, 91559, 91554, 90850, 90570, 90988, 90894, 90218, 90392, 91406, 91425, 90192, 89892, 91546, 93346, 93824, 93999, 94995, 96026, 96253, 96450, 97294, 97987, 97918, 97860, 98309, 98468, 97985, 97937, 98998, 100390, 101543, 103019, 104868, 105963, 105933, 105933, 106604, 107098, 106951, 106945, 107171, 106256, 103594, 100450, 97787, 94978, 91876, 90184, 91285, 94326, 97803, 101605, 106148, 110816, 114535, 116912, 117933, 117664, 116873, 116603, 116506, 115097, 112296, 110073, 109834, 110825, 111878, 112966, 114048, 114156, 112829, 111053, 109638, 108021, 105689, 103372, 101731, 100116, 97731, 94958, 92597, 90797, 89495, 88863, 88632, 88035, 86973, 86153, 85722, 85046, 84170, 83997, 84614, 85009, 84957, 85529, 87099, 88478, 88745, 88450, 88271, 88008, 87524, 87195, 86811, 85588, 83880, 83221, 83961, 84586, 84060, 83159, 82742, 82474, 82075]
55478H2075J2L80l19j164n24J020J636J314J357J527N55r85j286m41j93q24r99
55461H3141n22n20j002q34j34j40p88q06r7K91L86J051J839J512N41N73J533J729
55443H7753P27l08j005k008k911k487j065k95m91n06j33k38o13k13N43K03r50
55426G6003j147k21J84l57m40M11R52O66N79J054J067L15n6N39J269J414J063
55409H3295J31j461k632k172q26l39o83m28L94L85l61k53P62R57k4m71L35J023
55391G7632P86O56J203J373N69k45l83m36o78l95M90R91Q59R55J435J418R10R81
55373H8121J666J775J210J246J958J741O7j506j918k031k606l011k825k747k960
55358G8180k457r34L91O33K06n54j797k727j960j2Q47L0l71R24K234J684k4j092
$$ y = [82075, 82087, 82467, 82148, 80984, 80460, 81480, 83116, 84430, 85787, 87314, 87869, 86884, 85598, 85157, 84964, 84140, 83141, 82619, 82099, 81097, 80263, 80129, 79989, 79201, 78395, 78298, 78589, 78975, 80026, 81865, 83377, 83918, 84491, 86024, 87753, 88480, 88172, 87167, 85159, 82248, 79761, 78696, 78401, 77910, 77404, 77271, 77033, 76420, 76207, 76750, 76953, 76003, 74856, 74635, 74819, 74462, 74022, 74433, 75385, 76051, 76630, 77684, 78751, 79066, 79010, 79549, 80818, 82232, 83295, 83426, 81965, 79333, 77161, 76335, 75996, 75313, 74885, 75279, 75664, 75303, 75050, 75812, 76769, 76745, 76274, 76609, 77632, 78418, 79074, 80277, 81650, 82219, 81974, 81591, 81155, 80477, 80082, 80572, 81563, 82422, 83377, 84812, 86230, 87140, 88121, 89787, 91562, 92772, 94018, 95976, 97717, 97784, 96278, 94360, 92329, 89723, 86712, 83887, 81140, 78180, 75723, 74789, 75180, 75813, 76019, 75465, 73668, 70941, 68981, 68969, 69816, 69846, 69475, 70399, 72633, 74317, 74293, 73201]
55340G3201j153q15k37M49O02J15j26K52M58N8l15l99q23j480j172K41J112M12
55322G0380p87j229j137j017m48P36J623J643J448J384O98p94j782j351l38K23
55306F9252N47J003J044L55k59k13n8j46J78J124J615R45l5l51k07p6J46K59l72
55287G4751j316j055N50J551P01p43j128o36j60L26Q92P57k31o45M46J821J942
55270G7823J175P45P26N79N03O87L80q57j890j518l43J83k36q90j310j203j16
55253G4438J596K423J557J89k05J54K26RJ16M04K45l63j035j637j903j333k14
55236G4667L02j08l54J79N23o5p36o59m88q62r22Q2J097Q56k2k67j06l42m48M51
55216G2778J489J143j51n45L53J026M77n73j101j015p47o10o30m50L85J522J787
$$ y = [73201, 72048, 71233, 70996, 71445, 72047, 72162, 72036, 72288, 72746, 72804, 72489, 72090, 71267, 69787, 68615, 68856, 69968, 70380, 69593, 68364, 67227, 66210, 65762, 66498, 68121, 69764, 71212, 72596, 73294, 72500, 70718, 69367, 69029, 69252, 69799, 70802, 71846, 72201, 71942, 71729, 71671, 71525, 71703, 72827, 74442, 75387, 75352, 75001, 74794, 74718, 74864, 75123, 74751, 73435, 72380, 72930, 74481, 75182, 74439, 73311, 72675, 72515, 72841, 73733, 74490, 74259, 73614, 74060, 75881, 77823, 78998, 79743, 80469, 81048, 81551, 82238, 82618, 81761, 79871, 78353, 78010, 78193, 77957, 77067, 75757, 74554, 74438, 76034, 78457, 80014, 80203, 79998, 80152, 80378, 80387, 80503, 80907, 81152, 80789, 79754, 78117, 76214, 74881, 74667, 74969, 74861, 74507, 74686, 75209, 75144, 74408, 73749, 73261, 72399, 71477, 71559, 72656, 73512, 73490, 73223, 73117, 72775, 72327, 72778, 74267, 75410, 75259, 74714, 75067, 76093, 76570, 75997, 74896, 73881, 73134, 72524, 71894, 71444, 71829, 73351, 75138]
55199G5138P59m21o48m16p11j217q35N25J828K208J536J91r82j095l13K53K12
55182G6012M44J298J661Q03k89n55n24r37j079j11J069J077J86m14o03q58p04
55165G6476M61J703J599M17m10n00m69k88M48J104P20j74k10N63Q61L70k1n7l88
55146H2205r94j057n32k43l46j65L37L69k46p91r27r41p51K9R78J232R27R52J287
55127H1323J013J04l35J23N71L51o4j86l02o21p30l68J05M21P21R48P70L32K38
55108H4414N61O88L59J2o3j08j89J6N27Q48P13L96J81R4K11N87Q55N14l58j190
55088H9068j594j470p50K73P44J65o64n93L42J139J359J362J238O68j59n22k61
55071I0345jj03j90J20P20J245J308O11n89j385j182m90p8R1K70n9j296k370j777
$$ y = [75138, 75897, 75476, 74828, 74412, 73701, 72484, 71649, 72174, 74002, 76210, 77746, 77937, 76955, 75860, 75547, 75800, 76012, 76456, 77754, 79415, 80218, 79929, 79374, 78850, 77913, 76834, 76723, 77792, 78869, 79055, 78641, 78038, 77180, 76476, 76937, 78640, 80239, 80656, 80246, 79746, 79277, 78989, 79437, 80541, 81261, 81087, 80877, 81440, 82301, 82671, 82650, 82593, 82205, 81211, 80154, 79622, 79379, 79033, 78868, 79205, 79574, 79328, 78537, 77610, 76669, 75918, 75947, 76925, 78157, 79084, 80036, 81323, 82336, 82440, 82105, 82228, 82799, 83150, 83086, 82900, 82598, 81977, 81247, 80879, 80984, 81405, 82126, 83074, 83844, 84176, 84414, 84975, 85663, 86022, 86034, 85971, 85863, 85674, 85690, 86217, 87065, 87778, 88174, 88355, 88449, 88660, 89247, 90102, 90616, 90258, 89068, 87474, 86004, 85254, 85527, 86271, 86436, 85772, 85179, 85521, 86660, 88019, 89381, 90619, 91287, 91128, 90606, 90345, 90344, 90241, 90051, 90171, 90891, 92136, 93444, 94055, 93466, 92081, 90899, 90409, 90331, 90422, 90692, 90633, 89337, 86967, 85190]
55052H5190J24J368R68q1n48l30K65J216K153K129Q27p78j564j460j095q19n73
55035H6992k77L2J80n7n49o27J18J014R81k1r81j227j002o84k46K62N40N66P27
55016H5741J139J365J029K69n06r17p29j5P13J003R44Q79Q72Q24P50N52l1p48
54998I3134p36K80J233J069J97k48j08L1J73Q12J685J958J466P30q3j023j475
54981I9095p91K63K08r08j380k98J261J897J520P87M3n16o34n01p36j314j336
54964I6660l73P59J078O67J82j18l72n27m28j50J37L90N45M67K00M9K14N75R06
54945A00861J015P96L94J17k2l54p80n52N83J543J166j36r22o66o3L76Q51J324
54927A05531J265O73M14J171K713M382N724O442O496O360O575O940O702N495L593
$$ y = [85190, 85314, 86682, 87650, 87569, 87021, 86691, 86956, 88172, 90325, 92454, 93281, 92503, 90939, 89479, 88384, 87565, 86992, 86715, 86747, 86927, 86870, 86321, 85694, 85812, 86826, 87807, 87786, 86805, 85578, 84576, 83892, 83646, 83908, 84448, 85014, 85741, 86880, 88245, 89274, 89543, 89037, 88120, 87391, 87376, 88089, 89092, 90036, 90915, 91787, 92611, 93361, 93913, 93882, 93134, 92398, 92678, 93911, 94980, 95177, 94929, 94821, 94852, 95025, 95837, 97522, 99480, 100946, 101676, 101593, 100570, 99095, 98304, 98567, 98775, 97867, 96487, 96189, 97450, 99347, 100867, 101654, 101697, 101181, 100547, 100046, 99310, 97996, 96660, 96287, 97046, 98124, 98791, 98973, 98855, 98483, 97956, 97528, 97378, 97515, 97905, 98450, 98917, 99117, 99166, 99380, 99955, 100861, 101876, 102672, 103066, 103183, 103161, 102807, 102027, 101475, 102058, 103601, 104767, 104631, 103709, 103043, 102980, 103356, 104207, 105531, 106796, 107469, 107883, 109054, 111767, 116149, 121873, 128315, 134811, 141171, 147746, 154686, 161388, 166883, 170476]
54912A70476J303j162l360m821n623o099o196n773n209m932m620l749k741k527
54898A14967l135l621l378k550j349P3J192J543J486J604J571P73k91m89J50M87
54882A09033J86J50J031K507M255O257P960Q457P858P228O839N808L769J557k71
54867A72624k215m516o255o615o058n509n190m859m481m108l693l358l196k772
54853A09799j643m39l35j286j948j646j186j313j600j476j216j271j451j429j273
54838I0287j024n31M9L70O76J478K308K059P45k88k86J08K70M42O54L40l63l23
54820I6971P65J576J038j62q51r35q52n39P3N25O06P21R19O24k7L7R34J200Q4
54801A02707j027p12L60P70N88O65P69K14n00l57L87O52L38K18L81K67k5K50J174
$$ y = [170476, 171779, 170617, 167257, 162436, 156813, 150714, 144518, 138745, 133536, 128604, 123984, 120235, 117494, 114967, 111832, 108211, 104833, 102283, 100934, 101007, 102199, 103742, 105228, 106832, 108403, 109176, 108885, 108396, 108546, 109033, 109219, 109369, 110400, 112907, 117162, 123419, 131379, 139836, 147694, 154922, 161761, 167569, 171338, 172895, 172624, 170409, 165893, 159638, 153023, 146965, 141456, 136266, 131407, 126926, 122818, 119125, 115767, 112571, 109799, 108156, 107717, 107382, 106096, 104148, 102502, 101316, 100003, 98403, 96927, 95711, 94440, 92989, 91560, 90287, 89263, 88732, 88781, 89151, 89827, 91305, 93613, 95672, 96417, 96129, 95843, 95951, 96221, 96663, 97317, 97657, 97294, 96971, 97736, 99312, 100350, 100188, 99337, 98402, 97550, 97011, 97084, 97609, 98215, 98936, 99855, 100479, 100452, 100489, 101423, 102623, 102707, 101680, 100968, 101328, 102098, 102686, 103351, 104120, 104334, 103834, 103477, 103864, 104516, 104854, 105072, 105453, 105720, 105695, 105945, 107119]
54782A07119K024K268J842P52o19j273o70L21N74L53P08J675K383K663L249M348
54766A27717N253N532N603N915O282O251N544M106K211M08j033k451m145n705
54752A61488o502o469n976n302m680m331l963k850j045J69j81j379k000j700j148
54737A14131p25k67K01M22L97K95J39J16O37J520J845J331J105K156L796M748
54721A31847N068N712O748P253O760N559L809J527p47k319l362m519n698o240
54707A51398o068n703n287m608l944l774l730k882j166L73Q67M05m15r85q17L1
54691A13695P32N82q1n16p15j053j232o48L37O56L5p21j018j069j129r96n35j6
54673A06308K41J23l25p78p70l29j36n23r07p73m86l87rQ42J101oj250q50Q60
$$ y = [107119, 109143, 111411, 113253, 114005, 113386, 112113, 111443, 111764, 112338, 112691, 113399, 115074, 117457, 120120, 123369, 127717, 132970, 138502, 144105, 150020, 156302, 162553, 168097, 172203, 174414, 174822, 173789, 171338, 167193, 161488, 154986, 148517, 142541, 137239, 132559, 128228, 124265, 121415, 120370, 120539, 120358, 118979, 116979, 115279, 114131, 113406, 113139, 113340, 113762, 114159, 114454, 114593, 114709, 115346, 116866, 118711, 120042, 121147, 123303, 127099, 131847, 136915, 142627, 149375, 156628, 163388, 168947, 172756, 174283, 173536, 171217, 167855, 163336, 157638, 151398, 145330, 139627, 134340, 129732, 125788, 122014, 118284, 115402, 114236, 114609, 115476, 115881, 115466, 114481, 113664, 113695, 114427, 115009, 114928, 114412, 113697, 112644, 111412, 110764, 111101, 111757, 111792, 111071, 110053, 108984, 107855, 106859, 106324, 106308, 106549, 106672, 106347, 105569, 104799, 104470, 104334, 103811, 102904, 102131, 101645, 101258, 101249, 102091, 103192, 103186, 101936, 101086, 101946]
54654A01946J890J476P17M69L90J97J96K56k14r12p94J16N65R5k72J13N32M38
54636A07204M48R53J102K06r38j217q00n17n00l64j38o0P8N42R82R12M62Q1j26
54617A08310k47j38K50M86J06p12j328j301o78O7L55O8r4N16J414J404K16j088
54599A07606j541j272q31l92j0Q9nJ98P17Q71L45j71K8O53R99Q86N11j05q35j124
54579A06617n96L22R19J074J119J178J080P57L26j0k7L21N96K66m76p93l73J22
54561A12422M4l47m28j12K83O25R27J013O95Q6n32r03p79q8P27J003P05M74O94
54542A16509J079J293J337J137N55N8M89J677K188J106o88j765j889j696j363
54527A20027o73L5J33k40l44k7J42p1k00N6L75M04K41R3n5j77l7L51M75j63j284
$$ y = [101946, 103836, 105312, 106029, 106498, 106888, 107085, 107281, 107537, 107323, 106411, 105617, 105733, 106298, 106393, 106121, 106234, 106766, 107204, 107652, 108605, 109707, 109913, 108975, 107758, 106958, 106441, 105941, 105577, 105439, 105379, 105457, 105999, 106981, 107893, 108355, 108436, 108310, 108063, 107925, 108175, 108661, 108767, 108055, 106727, 105426, 104748, 104815, 105170, 105238, 105144, 105660, 107074, 108478, 108694, 107606, 106065, 104793, 103962, 103570, 103560, 103649, 103644, 103842, 104559, 105430, 105775, 105604, 105632, 106285, 107284, 108170, 108681, 108576, 107741, 106617, 106021, 106343, 107262, 108336, 109455, 110633, 111713, 112470, 112796, 112786, 112759, 113080, 113676, 113942, 113466, 112673, 112300, 112422, 112466, 112119, 111691, 111579, 111862, 112487, 113414, 114427, 115122, 115208, 114676, 113773, 112994, 112906, 113633, 114636, 115341, 115815, 116509, 117588, 118881, 120218, 121355, 121910, 121968, 122457, 124134, 126322, 127428, 126740, 124975, 123086, 121390, 120027, 119354, 119389, 119522, 119282, 118938, 118911, 119053, 118982, 118782, 118838, 119213, 119617, 119858, 119951, 119896, 119719, 119682, 120033, 120508, 120345, 119061]
54506A19061j992j688p36l0N1nL29Q14Q43M23J36J54K8l73m29K51J048J132O23
54487A19640L14M95P52Q25R86J426J747J400L93o49j122r21l57L49J207K059K365
54470A30909J702M05o44q35k37O40J145P75k97j135j010l84k77p82j075q42p02
54453A27356r52r39k72L19J47k04K37J228J672J306R74J211J453R75j12j170j877
54436A31352k336k538k199j225j08M28K40o2J19O19Q98Q37P41O73M76L56P46J444
54418A30461J601Q87lk71J26Q22J582K080J815P78l18r37j326j726j648o69N96
54401A33850J115Q22N23O77J006J195J302J351J155O84K48J50L69N39K26o21j381
54384A43210j328o44l68r61j553j111Q8Q81P53K29o9rK72N75O22L54J65M17Q83
$$ y = [119061, 117069, 115381, 114645, 114615, 114666, 114661, 114990, 115804, 116647, 117070, 117206, 117360, 117388, 117015, 116586, 116837, 117885, 119017, 119640, 119954, 120449, 121201, 122026, 123012, 124438, 126185, 127585, 127978, 127329, 126207, 125286, 124929, 125278, 126485, 128544, 130909, 132611, 133016, 132372, 131537, 131300, 131940, 133085, 133860, 133563, 132428, 131418, 131034, 130757, 129975, 128900, 128058, 127356, 126404, 125465, 125193, 125512, 125659, 125455, 125692, 126920, 128592, 129898, 130872, 132083, 133536, 134511, 134399, 133229, 131352, 129016, 126478, 124279, 123054, 122946, 123374, 123614, 123552, 123671, 124290, 125188, 126025, 126766, 127439, 127915, 128271, 129017, 130461, 132062, 132949, 132946, 132675, 132801, 133623, 135205, 137285, 139100, 139878, 139560, 138623, 137297, 135571, 133923, 133254, 133850, 134965, 135787, 136310, 136987, 137993, 139188, 140490, 141841, 142996, 143680, 143928, 144078, 144447, 144986, 145212, 144591, 143210, 141882, 141238, 140870, 139909, 138356, 137245, 137333, 138214, 138967, 139196, 139127, 139118, 139390, 139965, 140587, 140941, 141106, 141523, 142406]
54365A42406J156J294J545J712J551J472K036K867L034K524K327K898L448L176
54351A73446K312J421L64j247l095m387m821m676m073k885j399n16q01j686j997
54336A45960j253j98J59k93p93p58l83j42j05j13k54o97j219j318q58k37J01O0
54318A37659j98m03k81J75M79R9p84j326j036m22k89o74q56m04K69N83O10P60
54300A33961Q86K97j020j879j197M14J187L65q42q72L04J350J331O48K66N54J002
54283A36755Q98J40o30p79m60l62p48j117j023p16o41p16n68j95P2J58L04O09
54265A30981Q82R88R98J033J155J366J567J607J467J304J213J150J136J189J008
54250A49044J89r56j401p07K63M44j1k04kj25q43j435j236n31r7l01r13j431j409
$$ y = [142406, 143562, 144856, 146401, 148113, 149664, 151136, 153172, 156039, 159073, 161597, 163924, 166822, 170270, 173446, 175758, 177179, 177543, 176296, 173201, 168814, 163993, 159317, 155244, 152359, 150960, 150444, 149643, 147957, 145960, 144707, 144509, 144668, 144375, 143582, 142824, 142441, 142299, 142194, 142081, 141827, 141130, 139911, 138593, 137735, 137498, 137599, 137659, 137461, 137058, 136777, 136952, 137431, 137530, 136746, 135420, 134384, 133962, 133673, 132999, 132143, 131739, 132008, 132591, 133201, 133961, 134847, 135144, 134124, 132245, 131048, 131462, 132649, 133014, 132172, 131300, 131604, 132954, 134285, 134933, 135199, 135753, 136755, 137653, 137793, 137163, 136384, 135924, 135562, 134814, 133697, 132674, 131958, 131317, 130601, 130033, 129838, 129910, 130068, 130372, 130981, 131863, 132851, 133849, 134882, 136037, 137403, 138970, 140577, 142044, 143348, 144561, 145711, 146847, 148036, 149044, 149233, 148277, 146876, 146169, 146432, 146876, 146865, 146661, 146659, 146534, 145691, 144256, 143020, 142489, 142392, 142091, 141178, 139747, 138338]
54231A38338p13K97J035J182Q17J99l31m00O5N71N79K19O6K84M43K78K9q3k30
54212A42645n73r14j057j175j466j703j474q18k81k77n44m48J73O93M82j96n31
54195A32536l56l48p95r62k72N75N62r2l62r9q8m33k26P75J417P95k98n08K11
54176A32032Q13P49M04J84L6p6j3K01L93O13R53J085N83k21m43J47P10M61l25
54157A38286q09p42n70o57q27p18k39L90Q49R10N93R5m06p82p98j88Q93J741J749
54138A38770J096M72K54K77L65N23O32M28M7K0M65P60M23p6NN30O92K50j64j5
54118A45754M52P08O51N28N16N93O36N18K88J72K08L6n63j110j011n27m43p84
54100A46622p57o1O45R24J221J839K214J922J630K117K966L221K866K650K810
$$ y = [138338, 137625, 137922, 138957, 140139, 140956, 141155, 140824, 140424, 140489, 141060, 141639, 141858, 141924, 142208, 142651, 142929, 142958, 142875, 142645, 142072, 141158, 140101, 138926, 137460, 135757, 134283, 133465, 133184, 132907, 132363, 131915, 132088, 132781, 133263, 133067, 132536, 132180, 131832, 131037, 130075, 129803, 130378, 130940, 130848, 130486, 130387, 130299, 129866, 129640, 130415, 131832, 132627, 132329, 131821, 132032, 132845, 133594, 133998, 134182, 134218, 134142, 134129, 134330, 134723, 135336, 136289, 137374, 137957, 137736, 137293, 137440, 138150, 138611, 138286, 137477, 136735, 136165, 135508, 134681, 133963, 133724, 134114, 134963, 135873, 136466, 136561, 136155, 135373, 134575, 134387, 135280, 137021, 138770, 139866, 140338, 140592, 140869, 141234, 141757, 142389, 142817, 142864, 142884, 143349, 144109, 144532, 144456, 144461, 144991, 145683, 145933, 145769, 145754, 146206, 146914, 147565, 148093, 148609, 149202, 149838, 150356, 150644, 150816, 151024, 151060, 150497, 149387, 148376, 147849, 147406, 146622, 145865, 145804, 146449, 147373, 148594, 150433, 152647, 154569, 156199, 158316, 161282, 164503, 167369, 170019, 172829]
54085A72829L074L703N324P680R550J0105R402P436L878q05m907p025p442p376
54071B05426p278o614n106l408k410k206k071j390m40n4m92j029r31m84m55q16
54055A70242p05K83J489K110K055J639J029M50M04J142K216K996L432L889M534
54040A97205N297O289P718R435J0847J1459J1250J0568R761Q885P656N804L538
54027C05712J477mj136k258l218l582l294k803k554k658k999l403l650l638l579
54012B68413l820m392m932n172n285n569n960o054n572m619l559k796k635l039
53998B05009l524l460k692j656q08k20J14j02j118k510l399l324k578j662p95
53983A77275n1M60P19Q02O46J20n50q62p00n58q17j207j276j002o00j14L98O42
$$ y = [172829, 175903, 179606, 184930, 192610, 202160, 212265, 221667, 229103, 232981, 232176, 227269, 220244, 212802, 205426, 198148, 191534, 186428, 183020, 180610, 178404, 176333, 174943, 174503, 174449, 173957, 172928, 171997, 171513, 171058, 170242, 169537, 169820, 171309, 173419, 175474, 177113, 178142, 178592, 178996, 180138, 182354, 185350, 188782, 192671, 197205, 202502, 208791, 216509, 225944, 236791, 248250, 259500, 270068, 279829, 288714, 296370, 302174, 305712, 307189, 307185, 306049, 303791, 300573, 296991, 293697, 290894, 288340, 285682, 282683, 279280, 275630, 271992, 268413, 264593, 260201, 255269, 250097, 244812, 239243, 233283, 227229, 221657, 217038, 213479, 210683, 208048, 205009, 201485, 198025, 195333, 193677, 192869, 192649, 192763, 192661, 191543, 189033, 185634, 182310, 179732, 178070, 177275, 177224, 177684, 178403, 179205, 179851, 179971, 179421, 178559, 177859, 177301, 176484, 175277, 174001, 172999, 172399, 172285, 172683, 173325]
53965A73325N29N05R53J505J537J163J113J664K251K176J350K69l57kJ255K725
53949A91961L763M338M762N191N790P057R295J2025J4506J6637J8480J8997J6415
53936C29217J0341K810l359o807p957p745o752n384m137l346k884k258j202n2
53922B90485N85O93J029K136L505M244M397M886O162P580Q338Q368Q013P335O199
53907C63955M718L218J883P03l84j420k361l046l432l787m337m770m577l890l569
53892C38904m188n408o495p061p089o702o215o113o565p128p194o608n751n113
53878B51274m881m766m254l279k520k672l499m053l868l376l100k997k818k563
53864B02628k285j914j478j151q97n29k07l21p71r22n96l60n40o62l77j85n80
$$ y = [173325, 173854, 174359, 175312, 176817, 178354, 179517, 180630, 182294, 184545, 186721, 188071, 188340, 187983, 187981, 189236, 191961, 195724, 200062, 204824, 210015, 215805, 222862, 232157, 244182, 258688, 275325, 293805, 312802, 329217, 339558, 342368, 339009, 332202, 324245, 316500, 309748, 304364, 300227, 296881, 293997, 291739, 290537, 290485, 291070, 291763, 292792, 294928, 298433, 302677, 307074, 311960, 318122, 325702, 334040, 342408, 350421, 357756, 363955, 368673, 371891, 373774, 374477, 374093, 372673, 370312, 367266, 363834, 360047, 355710, 350940, 346363, 342473, 338904, 334716, 329308, 322813, 315752, 308663, 301961, 295746, 289633, 283068, 275940, 268746, 262138, 256387, 251274, 246393, 241627, 237373, 234094, 231574, 228902, 225403, 221350, 217482, 214106, 211006, 208009, 205191, 202628, 200343, 198429, 196951, 195800, 194903, 194374, 194167, 193846, 193075, 192153, 191557, 191197, 190657, 189995, 189618, 189433, 188853]
53847A88853j106j095q08r49j343j148k76L82K07l90p49p54o03l01K19Q22J242
53830A82203J299R14K39k14M9Q25J302J062O10O60J170J492J336J109J252J648
53814A96956J897J875J697J383R21O72J175K410L630M201M254M245M238M123M149
53799B37826M600N097M945M192L654L747L948L655K967K288J696J136Q07R35J324
53784B82817J492J064p3j684l165l973m243m545n002n198n096n301n978o325n687
53769B29103m582l882l531k929k171j921k184k159j481p57o20r23j203j420j786
53754A97554k143k024j305n21l46q23j265j128p00o34q90p45M7Q04R31Q04J007
53737A88623J268R49K68J12O19Q60J88p84j012l61L79O22O43R63J483J536R10
$$ y = [188853, 187747, 186652, 185844, 184895, 183552, 182404, 182128, 182510, 182717, 182327, 181578, 180824, 180221, 179920, 180139, 180961, 182203, 183502, 184416, 184655, 184441, 184490, 185315, 186617, 187679, 188289, 188949, 190119, 191611, 192947, 194056, 195308, 196956, 198853, 200728, 202425, 203808, 204729, 205401, 206576, 208986, 212616, 216817, 221071, 225316, 229554, 233677, 237826, 242426, 247523, 252468, 256660, 260314, 264061, 268009, 271664, 274631, 276919, 278615, 279751, 280558, 281493, 282817, 284309, 285373, 285300, 283616, 280451, 276478, 272235, 267690, 262688, 257490, 252394, 247093, 241115, 234790, 229103, 224521, 220639, 217108, 214179, 212008, 210087, 207903, 205744, 204263, 203506, 202886, 201963, 200760, 199340, 197554, 195411, 193387, 192082, 191561, 191215, 190392, 189127, 187999, 187299, 186665, 185775, 185030, 185077, 185881, 186812, 187616, 188623, 189891, 190840, 191108, 191220, 191839, 192699, 192887, 192103, 191091, 190730, 191109, 191731, 192374, 193337, 194820, 196356, 197266]
53720A97266L42O76J704K437K412K143K111K058J649J181J021R97R08J155K063
53705B20123L004L111K584K372K689K858K590K431K683K886K749K775L323L775
53691B59953L324K221J465J434J471Q91j03p67p81n41n47p63q09o05m42m13k04
53674B64784K91N54R2q01j329j146n68l1K24N9m41q59r01q61j135j388r11J94
53656B55827R40P36P2l03k99k99n04q74j242j258o09L88Q55M62nL46J298J849
53638B57380J556R98R11J400K043K447K492K294K059J915J782J474R52M51L28
53623B80482Q06J785K926L872M453M652M635M785N506O719P722P838P068N884
53609C49133M603L371K510K274K235J663O38J48O97J477J388M21n25q31n46J32
$$ y = [197266, 197608, 198284, 199988, 202425, 204837, 206980, 209091, 211149, 212798, 213979, 215000, 215997, 216905, 218060, 220123, 223127, 226238, 228822, 231194, 233883, 236741, 239331, 241762, 244445, 247331, 250080, 252855, 256178, 259953, 263277, 265498, 266963, 268397, 269868, 270759, 270656, 269889, 269108, 268567, 268020, 267257, 266448, 265843, 265401, 264988, 264784, 265075, 265629, 265721, 264920, 263591, 262445, 261877, 261846, 262070, 262129, 261688, 260829, 259928, 259067, 257932, 256544, 255633, 255827, 256767, 257503, 257575, 257272, 256973, 256674, 256170, 255296, 254054, 252796, 252187, 252575, 253430, 253892, 253887, 254233, 255531, 257380, 258936, 259934, 260845, 262245, 264288, 266735, 269227, 271521, 273580, 275495, 277277, 278751, 279703, 280154, 280482, 281288, 283073, 285999, 289871, 294324, 298976, 303611, 308396, 313902, 320621, 328343, 336181, 343249, 349133, 353736, 357107, 359617, 361891, 364126, 365789, 366427, 366575, 367272, 368749, 370137, 370558, 370033, 369202, 368656, 368788]
53593C68788R68J401Q90k74j104j105q34r47j238j062m50j12m00q71j025j002
53577C61623j206j537j522j134j015j678k754l295k756j503l78J00O0n1J8J60
53561C43132K35L52P28J279J620J533J263J203J359J312P37j28o17k59O91J415
53545C55855J340O84J18jJ56L82P76J503K455L371M090M633N152N873O813P562
53529D00762P616P107O859P535Q919J0240J0960J1057J0861J0840J1336J2247
53517E16339J3122J3717J4252J5052J6211J7722J9533K1233K2158K2145K1868
53506G13352K2027K2520K2806K2716K2481K2243K2057K2045K2099K1689K0551
53495I56586J9269J8575J8322J7786J6893J6389J6766J7646J8339J8574J8549
$$ y = [368788, 369756, 371157, 372047, 371773, 370669, 369564, 368730, 367783, 366545, 365483, 365033, 364921, 364521, 363650, 362625, 361623, 360417, 358880, 357358, 356224, 355209, 353531, 350777, 347482, 344726, 343223, 342845, 342945, 343005, 342954, 342972, 343132, 343367, 343719, 344447, 345726, 347346, 348879, 350142, 351345, 352704, 354016, 354753, 354625, 354008, 353749, 354440, 355855, 357195, 357879, 357997, 357996, 358152, 358534, 359310, 360813, 363268, 366639, 370729, 375362, 380514, 386387, 393200, 400762, 408378, 415485, 422344, 429879, 438798, 449038, 459998, 471055, 481916, 492756, 504092, 516339, 529461, 543178, 557430, 572482, 588693, 606415, 625948, 647181, 669339, 691484, 713352, 735379, 757899, 780705, 803421, 825902, 848145, 870202, 892247, 914346, 936035, 956586, 975855, 994430, 1012752, 1030538, 1047431, 1063820, 1080586, 1098232, 1116571, 1135145, 1153694]
53484A153694J8550J8618J8376J7395J6000J5347J6210J7835J8629J7763J5600
53473A344017J2862J0134P975O630N480L540O35k526n454q400j1572j4497j6461
53460A332363j7110j6570j5412j4531j4497j5003j5502j6259j7959k0297k1880
53449A147343k1824k0672j9469j8680j8354j8503j8842j8788j8146j7271j6237
53438I40557j4496j1742q533n655l488k320k411l178l143j486R29K748L828M964
53424H96574O413P617Q188Q424Q841R805J1442J3445J5184J6428J7703J9443K1200
53411A060707K2342K3123K4317K5980K7427K8395K9430L0988L2874L4692L6405
53400A376680L8145L9968M1944M4207M6640M8828N0445N1532N2322N2986N3588
$$ y = [1153694, 1172244, 1190862, 1209238, 1226633, 1242633, 1257980, 1274190, 1292025, 1310654, 1328417, 1344017, 1356879, 1367013, 1374988, 1381618, 1387098, 1390638, 1391273, 1388747, 1383293, 1374893, 1363321, 1348824, 1332363, 1315253, 1298683, 1283271, 1268740, 1254243, 1239240, 1223738, 1207479, 1189520, 1169223, 1147343, 1125519, 1104847, 1085378, 1066698, 1048344, 1029841, 1010999, 992211, 974065, 956794, 940557, 926061, 914319, 905786, 900131, 896643, 894323, 891912, 888734, 885591, 884105, 885034, 887782, 891610, 896574, 902987, 910604, 918792, 927216, 936057, 945862, 957304, 970749, 985933, 1002361, 1020064, 1039507, 1060707, 1083049, 1106172, 1130489, 1156469, 1183896, 1212291, 1241721, 1272709, 1305583, 1340275, 1376680, 1414825, 1454793, 1496737, 1540944, 1587584, 1636412, 1686857, 1738389, 1790711, 1843697, 1897285]
53389A897285N4134N4587N4917N5057N4752N3606N1472M8769M6268M4516M3415
53378B458778M2180L9756L5634L0453K5528K1646J8488J5294J1616P350K416l224
53366B705915r519j6528k4351l2620m0388m6736n1259n3923n4968n5127n5302
53355B265194n5645n5466n4350n2717n0933m8685m5885m3388m1934m1079m0103
53344A735009l9454m0032m1374m1881m0833l9042l7323l5526l3364l1106k8862
53333A326212k6077k2532j9154j7010j5829j4349j2061r972r443j0634j2397j3487
53321A143267j3690j3557j3375j2810j1637j0316r455r018q432p299n608l516
53309A024554j374K63J150J761K708L934M958N850P222R311J1577J3381J4589
$$ y = [1897285, 1951419, 2006006, 2060923, 2115980, 2170732, 2224338, 2275810, 2324579, 2370847, 2415363, 2458778, 2500958, 2540714, 2576348, 2606801, 2632329, 2653975, 2672463, 2687757, 2699373, 2706723, 2709139, 2705915, 2696396, 2679868, 2655517, 2622897, 2582509, 2535773, 2484514, 2430591, 2375623, 2320496, 2265194, 2209549, 2154083, 2099733, 2047016, 1996083, 1947398, 1901513, 1858125, 1816191, 1775112, 1735009, 1695555, 1655523, 1614149, 1572268, 1531435, 1492393, 1455070, 1419544, 1386180, 1355074, 1326212, 1300135, 1277603, 1258449, 1241439, 1225610, 1211261, 1199200, 1189228, 1179785, 1169151, 1156754, 1143267, 1129577, 1116020, 1102645, 1089835, 1078198, 1067882, 1058427, 1049409, 1040977, 1033678, 1028070, 1024554, 1023180, 1023443, 1024593, 1026354, 1029062, 1032996, 1037954, 1043804, 1051026, 1060337, 1071914, 1085295, 1099884]
53296A099884J5489J6513J8093K0355K2914K5289K7399K9221L0254K9984K8787
53285A364182K7576K6486K4762K2088J9280J7231J5842J4418J2531J0074O931
53274A561401L200o21m033o930r320j1033j2153j3364j5409j8309k1470k4325
53262A427634k6579k7991k8454k8280k8071k8200k8601k9091k9683l0370l0749
53251A111565l0113k8198k5792k4166k3848k4158k4240k4077k4135k4355k4179
53240H34304k3453k2644k2144k1843k1466k0882j9976j8706j7268j5823j4100
53229F15999j1836r498p930p243o751o117n776o027o524p031p890r305j0765j1810
53215E01496j2683j3636j4170j3721j2592j1508j0500r074p324o022n573n539
$$ y = [1099884, 1115373, 1131886, 1149979, 1170334, 1193248, 1218537, 1245936, 1275157, 1305411, 1335395, 1364182, 1391758, 1418244, 1443006, 1465094, 1484374, 1501605, 1517447, 1531865, 1544396, 1554470, 1561401, 1564601, 1563980, 1559947, 1553017, 1543697, 1532664, 1520511, 1507147, 1491738, 1473429, 1451959, 1427634, 1401055, 1373064, 1344610, 1316330, 1288259, 1260059, 1231458, 1202367, 1172684, 1142314, 1111565, 1081452, 1053254, 1027462, 1003296, 979448, 955290, 931050, 906973, 882838, 858483, 834304, 810851, 788207, 766063, 744220, 722754, 701872, 681896, 663190, 645922, 630099, 615999, 604163, 594665, 586735, 579492, 572741, 566624, 560848, 554821, 548297, 541266, 533376, 524071, 513306, 501496, 488813, 475177, 461007, 447286, 434694, 423186, 412686, 403612, 396288, 390266, 384693, 379154]
53203C79154n370n063m973n320o048o882p397p243o464n481m764m542m756n157
53189B99694n473n508n160m451l671l315l450l461k836k048j942k370k354j699
53175B51956j382j906k330j713o96o56j797l022l385k768j458M0R45Q00J03k89
53159B32442k48k72n04o93q48j096j085m56K34N9p96j207p91l29k98j58M36Q00
53141B25190K58q18j703k255k555k272j215L1P66J049J304J507J443J334J490
53126B23554J632J310O82K86K13K27L89Q68J312J217P73O27Q50Q82M62q2m98q48
53108B33856j066j012j028j642k559k790k037j163r10r25n86r1k9l31m68l74m51
53091B16394q34j164j112o63L5P09R61O87L29L45N90O36N08N28N95K54m22p20
$$ y = [379154, 373784, 368721, 363748, 358428, 352380, 345498, 338101, 330858, 324394, 318913, 314149, 309607, 304851, 299694, 294221, 288713, 283553, 279102, 275431, 272116, 268666, 265205, 262369, 260321, 258379, 256009, 253655, 251956, 250574, 248668, 246338, 244625, 243929, 243273, 241476, 238454, 235069, 232301, 230843, 230883, 231828, 232628, 232731, 232442, 232194, 231922, 231418, 230725, 229877, 228781, 227696, 227240, 227474, 227533, 226737, 225530, 224739, 224410, 224112, 223954, 224390, 225190, 225448, 224630, 222927, 220672, 218117, 215845, 214630, 214661, 215427, 216476, 217780, 219287, 220730, 222064, 223554, 225186, 226496, 227178, 227464, 227677, 227904, 228293, 229161, 230473, 231690, 232463, 233090, 233940, 234822, 235284, 235202, 234704, 233856, 232790, 231778, 230750, 229108, 226549, 223759, 221722, 220559, 219649, 218724, 218138, 218047, 218018, 217687, 217219, 216845, 216394, 215560, 214396, 213284, 212621, 212656, 213365, 214326, 215013, 215342, 215687, 216277, 216913, 217421, 217949, 218544, 218798, 218376, 217656]
53073B17656k23O05R82O31j70r63j346j199q76q88j244j419j111o25l21j30N6
53056B09415n0o55j252j057l3R77J188O03j49m44q2N70Q01J85q70j406q41M23
53038B07323J406J440O67k27p10p89p31n82k12J85J02n42j057p58J61R26J140
53021B07742J017P95N35M05N61O47O2r89j371m03J118J821J388P11O00R86J391
53004B17016J578J506J092M07j47j75J96M35K22k13m08k32j3j56o45r97p59q1
52986B18626L76K01k19j73L78O92K90k79j87M42O87K08l01k40J4j22l68k8Q15
52967B20812J440J681K121K922L327K676J353K01m83q75j016q59p08r65j537j937
52951B28153j950j791j582j195o35k07j02j66j86k12l78o36q98j219j618j774
$$ y = [217656, 217433, 218038, 219020, 219651, 219481, 218518, 217172, 215973, 215097, 214209, 212965, 211546, 210435, 209810, 209489, 209359, 209415, 209365, 208710, 207458, 206401, 206368, 207345, 208533, 209136, 208987, 208543, 208461, 209031, 209832, 210017, 209147, 207741, 206900, 207323, 208729, 210169, 210836, 210609, 209899, 209110, 208379, 207797, 207585, 207770, 207872, 207330, 206273, 205515, 205676, 206602, 207742, 208759, 209554, 210089, 210494, 211055, 211702, 211764, 210775, 209404, 209001, 210119, 211940, 213328, 214039, 214639, 215625, 217016, 218594, 220100, 221192, 221599, 221452, 221277, 221473, 221908, 222130, 221917, 221509, 221277, 221264, 221108, 220463, 219466, 218707, 218626, 219002, 219203, 218984, 218811, 219189, 219881, 220171, 219892, 219705, 220147, 220834, 221042, 220741, 220501, 220515, 220393, 220025, 219997, 220812, 222252, 223933, 226054, 228976, 232303, 234979, 236332, 236533, 236050, 235175, 234159, 233300, 232592, 231627, 230090, 228153, 226203, 224412, 222830, 221635, 221000, 220793, 220691, 220525, 220339, 220127, 219749, 219113, 218215, 216996, 215378, 213604]
52935B13604j255j35Q07Q35J08m62l23J3k51j017j342p29K54Q55J086J288J285
52918B14621O76k11m94L7N90N62L37M87O91J70j065k096k179j454n02K71O43N42
52900B11626K03M5Q5j44q06j265q87k7M42M14N90J091R94k47j603j591k72P63
52882B09411M75m54q29m97j28K5L49R31J216Q09J93J91J000K043K713K926K955
52865B23329K947K801K363J553L96q23j488j102l8M98l50k027l106k921k216k013
52849B17803k352k482k025j383j084j155j297j312j143q49o60q87j462j743j168
52834A96801j6P81P18L00L62J027J659J654J006P5q10j425j603j364r73o65m25
52817A97102j05L52R13J487J908K105K359L055L977M218L133J175o33j782k393
$$ y = [213604, 212349, 212214, 213021, 213856, 213964, 213502, 213179, 213192, 212941, 211924, 210582, 209853, 210107, 210962, 212048, 213336, 214621, 215297, 215086, 214592, 214629, 215219, 215781, 216118, 216605, 217296, 217466, 216401, 214305, 212126, 210672, 210170, 210441, 211084, 211626, 211829, 211874, 211959, 211815, 211009, 209744, 208857, 208830, 209272, 209686, 210276, 211367, 212361, 212114, 210511, 208920, 208648, 209411, 209886, 209432, 208603, 208106, 207978, 208003, 208352, 209283, 210499, 211308, 211501, 211692, 212692, 214735, 217448, 220374, 223329, 226276, 229077, 231440, 232993, 233389, 232566, 231078, 229976, 229938, 230436, 230086, 228059, 224953, 222032, 219816, 217803, 215451, 212969, 210944, 209561, 208477, 207322, 206025, 204713, 203570, 202721, 202061, 201174, 199712, 197969, 196801, 196785, 197566, 198284, 198584, 198946, 199973, 201632, 203286, 204292, 204367, 203557, 202132, 200529, 199165, 198192, 197527, 197102, 196997, 197349, 198262, 199749, 201657, 203762, 206121, 209176, 213153, 217371, 220504, 221679, 221046, 219264, 216871]
52802B16871k586k397k155k239k394j988j047l92n17r93j284j416j438r87j8O54
52786A95674L29m40n19K69J084J388J419J406J164P20M92N30K39o81j610j816
52770A99648j484j335j476j258k59J069J824J443J57j151j548q60J37N68M51N37
52754A96463J061J234L55r99j501p39L05O57N74R11J723K263K157J814J582J229
52738B09089O04J79M32J153J798K186K401K376K119J944J907J423J78r21p39K64
52722B26393M26p51j834j591p52p32j510j938j645j328j302j049l76M3j98n25
52706B11331l53r7m02r53q94j95L33L91O43J457K016J333k48j331j164l47J94
52689B11714K94L06L31K98L79P71J130Q68M2o00o44n06o11o89l20K06K73p0j74
$$ y = [216871, 214285, 211888, 209733, 207494, 205100, 203112, 202065, 201673, 201156, 200163, 198879, 197463, 196025, 195038, 195020, 195674, 196003, 195563, 195044, 195313, 196397, 197785, 199204, 200610, 201774, 202494, 202986, 203516, 203755, 203074, 201464, 199648, 198164, 196829, 195353, 194095, 193836, 194905, 196729, 198172, 198329, 197178, 195630, 194770, 194907, 195475, 195926, 196463, 197524, 198758, 199113, 198114, 196613, 195874, 196179, 196836, 197410, 198321, 200044, 202307, 204464, 206278, 207860, 209089, 209693, 209872, 210304, 211457, 213255, 215441, 217842, 220218, 222337, 224281, 226188, 227611, 227789, 226868, 226129, 226393, 226819, 226068, 224234, 222643, 221891, 221159, 219649, 217711, 216066, 214738, 213436, 212387, 212011, 212054, 211856, 211331, 210978, 210881, 210479, 209526, 208632, 208437, 208770, 209161, 209804, 211261, 213277, 214610, 214362, 213031, 211867, 211520, 211714, 212008, 212314, 212645, 212943, 213322, 214093, 215223, 216091, 216133, 215533, 214889, 214383, 213772, 213083, 212763, 212969, 213242, 213172, 212998]
52670B12998J43L37K9m27n94n36m32j1R46J886J949J158N34Q98K005L105L814
52653B27802M107L766K477M98j222j867j499q67n73o56r30j348j862k075j482
52638B24269k20P83P03k15q76n58L66R89R10N86Q42K048L634M379L457J295q23
52621B41569k066k644l001k986k295j315p94q06p56l93j83l98n59k14K52J45m85
52604B23071q78n67J36P22J016J103J024P97N10K36n0l00l30j8M48O83M75M6j31
52585B27993J97P09P56J15n89m99M52J344J300M74k22k47R5L03L71N41P30O44
52567B34467L36J73J14l50j345k106j821p47L7q9o64q90n35J8K94J18k90n14l57
52548B25849r8j26l76m31k13j04k37j95L13Q36P52K12qM43J018J009L92j92j71
$$ y = [212998, 213141, 213478, 213507, 213080, 212486, 211950, 211518, 211507, 212453, 214339, 216288, 217446, 217980, 218878, 220883, 223988, 227802, 231909, 235675, 238152, 238650, 237428, 235561, 234062, 233195, 232622, 231966, 231036, 229688, 227826, 225751, 224269, 224049, 224832, 225535, 225320, 224444, 223886, 224252, 225241, 226151, 226737, 227579, 229627, 233261, 237640, 241097, 242392, 241569, 239503, 236859, 233858, 230872, 228577, 227262, 226468, 225662, 224906, 224513, 224330, 223932, 223373, 223159, 223411, 223556, 223071, 222193, 221626, 221762, 222484, 223500, 224603, 225627, 226424, 226934, 227170, 227120, 226820, 226490, 226472, 226920, 227603, 228078, 228124, 227993, 228190, 228899, 229655, 229770, 229181, 228682, 229134, 230478, 231778, 232252, 232030, 231783, 231878, 232181, 232552, 233093, 233823, 234467, 234803, 234976, 235090, 234740, 233395, 231289, 229468, 228721, 228758, 228669, 228005, 227115, 226580, 226598, 226892, 227010, 226720, 226206, 225849, 225751, 225625, 225249, 224818, 224605, 224501, 224264, 224069, 224382, 225218, 225970, 226182, 226174, 226617, 227635, 228644, 229036, 228844, 228673]
52529B28673M02R65J050P25N00P44J282J571J259N32q0k26n8L8rP1L31L91J06
52510B38267P7R14K180K834K657K469K651K389R35j087k378k591k487k721l144
52495B40965l301k940k025p76K04L46k24p37n95O1O52P26L25o1N7N93R29P78O65
52476B35642J157J875J888R31k82r88j052o95r3N44R57J083J124J285J619K155
52460B47150K739K929K326J103j31r62j349j319r56o30p50j282j873k323k511
52445B42161k078q77L67O76R5m07m29n66j156j569j249o34l79l78k32q3k05l09
52427B32748j4L65K81p8r4K65M91M67O24J129J611J752J639J504J542J937K670
52410B48839L394L987N051P246J0174J2544J3443J2869J0975P607K930k114o336
$$ y = [228673, 229075, 230040, 231090, 231815, 232315, 233059, 234341, 235912, 237171, 237703, 237623, 237397, 237339, 237377, 237368, 237439, 237770, 238161, 238267, 238344, 239258, 241438, 244272, 246929, 249398, 252049, 254438, 255373, 254286, 251908, 249317, 246830, 244109, 240965, 237664, 234724, 232699, 231923, 232127, 232473, 232249, 231512, 230917, 230978, 231630, 232356, 232681, 232620, 232677, 233270, 234199, 234977, 235642, 236799, 238674, 240562, 241493, 241211, 240223, 239171, 238476, 238383, 238927, 239884, 240967, 242091, 243376, 244995, 247150, 249889, 252818, 255144, 256247, 256116, 255154, 253805, 252486, 251530, 250900, 250150, 248868, 246995, 244672, 242161, 240083, 239206, 239573, 240249, 240344, 239937, 239508, 238942, 237786, 236217, 234968, 234334, 233955, 233577, 233345, 233262, 233057, 232748, 232734, 233099, 233380, 233302, 233208, 233473, 233964, 234431, 235055, 236184, 237795, 239547, 241186, 242690, 244232, 246169, 248839, 252233, 256220, 261271, 268517, 278691, 291235, 304678, 317547, 328522, 336129, 339059, 336945, 330609]
52397C30609r028j0029r587q389p256o434n511m266l125k499k123j550q95n82
52383B59335n72m52j49L8J32N86J500K277K358K040K116K912L994M663M510L609
52367B88897K542K149K775L634L362J513q12k055j750o45L51Q68R56Q49R12J282
52351C04828J532J114K66o4N95J686K438K747K887K918K847K932L300L629L749
52336C37404M164N288O521O864O335N995O537P621Q679R621J0565J1457J2326
52323D39377J3388J4593J5556J6106J6511J6942J7198J7137J6963J6807J6525
52312F17103J6180J6148J6460J6549J6057J5451J5303J5425J5243J4639J3871
52301G88429J2964J1824J0724R999R396Q321O633M678K637M95j466k860l905n256
$$ y = [330609, 321581, 311552, 301965, 293576, 286320, 279886, 274375, 270109, 266984, 264485, 262362, 260812, 259917, 259335, 258763, 258311, 258162, 258200, 258332, 258918, 260418, 262695, 265053, 267093, 269209, 272121, 276115, 280778, 285288, 288897, 291439, 293588, 296363, 299997, 303359, 304872, 304060, 302005, 300255, 299610, 299961, 300829, 301785, 302634, 303546, 304828, 306360, 307474, 307740, 307676, 308271, 309957, 312395, 315142, 318029, 320947, 323794, 326726, 330026, 333655, 337404, 341568, 346856, 353377, 360241, 366576, 372571, 379108, 386729, 395408, 405029, 415594, 427051, 439377, 452765, 467358, 482914, 499020, 515531, 532473, 549671, 566808, 583771, 600578, 617103, 633283, 649431, 665891, 682440, 698497, 713948, 729251, 744676, 759919, 774558, 788429, 801393, 813217, 823941, 833940, 843336, 851657, 858290, 862968, 865605, 866100, 864634, 861774, 857869, 852613]
52287H52613o977q317q681q241p427o424n417m651l919k632p83P73J492K014L220
52272G96643M982O606Q027R634J1103J1472J0565R477R325J0135J1181J1918J2223
52259I23291J2215J2179J2351J2539J2329J1805J1558J1724J1549J0336Q373O401
52247A056650M544K373j22k348l916n099o380p831r135r908j0001r635r284r205
52233I80703r199q983q643q418q211p732p015o338n712m893l878k963k206j330
52219H95182k34P67J378J620J634J602J894K792L959M648M713M766N185N528N326
52204I40760M850M573M434M217M181M644N278N567N655N972O266N894M996M458
52190A011745M557M512L599K067N45p26j740k454l102m250o043p810q882r389
$$ y = [852613, 845636, 837319, 828638, 820397, 812970, 806546, 801129, 796478, 792559, 789927, 789144, 789917, 791409, 793423, 796643, 801625, 808231, 816258, 825892, 836995, 848467, 859032, 868509, 877834, 887969, 899150, 911068, 923291, 935506, 947685, 960036, 972575, 984904, 996709, 1008267, 1019991, 1031540, 1041876, 1050249, 1056650, 1061194, 1063567, 1063445, 1061097, 1057181, 1052082, 1045702, 1037871, 1028736, 1018828, 1008827, 999192, 989908, 980703, 971504, 962521, 953878, 945460, 937249, 929517, 922502, 916164, 910452, 905559, 901681, 898718, 896512, 895182, 894948, 895715, 897093, 898713, 900347, 901949, 903843, 906635, 910594, 915242, 919955, 924721, 929906, 935434, 940760, 945610, 950183, 954617, 958834, 963015, 967659, 972937, 978504, 984159, 990131, 996397, 1002291, 1007287, 1011745, 1016302, 1020814, 1024413, 1026480, 1027025, 1026299, 1024559, 1022105, 1019003, 1014753, 1008710, 1000900, 992018, 982629]
52176I82629r731r728q930p478o011m891m073l535l132k277n21J440K247J588
52162I27597O21L51L62j73r18p34N67J820J995J378R08R53J169J274J380J659
52146I40209K076K508K813K746K048P75n83j453j637j412j232j315j449j180k58
52131I42656J095K529M096O258R223J2466J5198J7219J9088K1255K3326K4387
52119A098796K4164K3508K3498K4216K4703K4262K3326K2746K2478K1581J9495
52108A352773J6785J4324J2262J0230Q297P002O459N972M910L536K584K177J533
52095A448844j90l023o325r526j2531j5367j7751j9150j9293j8410j6962j5200
52083A295116j3088j0606q041n937m702m199l778k787j063J175L748O524R097
$$ y = [982629, 972898, 963170, 954240, 946762, 940751, 935860, 931787, 928252, 925120, 922843, 922322, 923762, 926009, 927597, 928218, 928569, 928931, 928758, 927840, 927106, 927673, 929493, 931488, 932866, 933774, 934727, 935896, 937170, 938550, 940209, 942285, 944793, 947606, 950352, 952400, 953175, 952592, 951139, 949502, 948090, 946858, 945543, 944094, 942914, 942656, 943751, 946280, 950376, 956634, 965857, 978323, 993521, 1010740, 1029828, 1051083, 1074409, 1098796, 1122960, 1146468, 1169966, 1194182, 1218885, 1243147, 1266473, 1289219, 1311697, 1333278, 1352773, 1369558, 1383882, 1396144, 1406374, 1414671, 1421673, 1428132, 1434104, 1439014, 1442550, 1445134, 1447311, 1448844, 1448654, 1445631, 1439306, 1429780, 1417249, 1401882, 1384131, 1364981, 1345688, 1327278, 1310316, 1295116, 1282028, 1271422, 1263381, 1257444, 1252742, 1248543, 1244765, 1241978, 1240915, 1242090, 1245838, 1252362, 1261459]
52070A261459J0847J1593J1890J2367J3012J3426J3539J3614J3644J3310J2558
52059A401259J1776J1212J0709J0211R985R985R380P346M115P39k146m796p598
52046A472177j0373j2682j4404j5708j6729j7553j8302j8936j9067j8327j6839
52035A293257j5150j3773j2920j2576j2503j2322j1884j1595j2038j3147j4109
52024A151240j4189j3429j2382j1504j0950j0723j0659j0465j0030r558r162q545
$$ y = [1261459, 1272306, 1283899, 1295789, 1308156, 1321168, 1334594, 1348133, 1361747, 1375391, 1388701, 1401259, 1413035, 1424247, 1434956, 1445167, 1455152, 1465137, 1474517, 1481863, 1485978, 1486717, 1484571, 1479775, 1472177, 1461804, 1449122, 1434718, 1419010, 1402281, 1384728, 1366426, 1347490, 1328423, 1310096, 1293257, 1278107, 1264334, 1251414, 1238838, 1226335, 1214013, 1202129, 1190534, 1178496, 1165349, 1151240, 1137051, 1123622, 1111240, 1099736, 1088786, 1078063, 1067404, 1056939, 1046909, 1037351, 1028189, 1019644]
$$ [...]
##END NTUPLES=NMR SPECTRUM
##END=
