
##TITLE=UV1264_M12_1292-1216_10_7414641_7FibY5G672
##JCAMPDX= 6.0         $$ Bruker NMR JCAMP-DX V2.0
##DATA TYPE= NMR SPECTRUM
##DATA CLASS= NTUPLES
##ORIGIN= BRUKER
##OWNER= Administrator
$$ 1.72 TOPSPIN		Version 2.1
$$ 2013-01-25 20:07:30.703 -0500  Administrator@X
$$ Compression mode = diff/dup
##.OBSERVE FREQUENCY= 400.02188249412
##.OBSERVE NUCLEUS= ^1H
##.ACQUISITION MODE= SIMULTANEOUS (DQD)
##.ACQUISITION SCHEME= undefined
##.AVERAGES= 8
##.DIGITISER RES= 22
##SPECTROMETER/DATA SYSTEM= spect
##.PULSE SEQUENCE= zg30
##.SOLVENT NAME= COFFEE_meoh
##.SHIFT REFERENCE= INTERNAL, COFFEE_meoh, 1, 14.98509
##AUDIT TRAIL= $$ (NUMBER, WHEN, WHO, WHERE, PROCESS, VERSION, WHAT)
$$ ##TITLE= Audit trail, TOPSPIN		Version 2.1
$$ ##JCAMPDX= 5.01
$$ ##ORIGIN= Bruker BioSpin GmbH
$$ ##OWNER= Administrator
$$ $$ E:\/data/COFFEE/nmr/UV1264_M12_1292-1216_10_7414641_7FibY5G672/10/pdata/1/auditp.txt
$$ ##AUDIT TRAIL=  $$ (NUMBER, WHEN, WHO, WHERE, PROCESS, VERSION, WHAT)
(   1,<2013-01-25 20:07:22.672 -0500>,<Administrator>,<X>,<go>,<TOPSPIN 2.1>,
      <created by zg
	started at 2013-01-25 20:06:16.047 -0500,
	POWCHK enabled, PULCHK disabled,
       configuration hash MD5:
       86 BA 57 50 F2 9D 5C 9B 26 00 A9 28 5F 66 2E 89
       data hash MD5: 64K
       F7 A2 54 D6 8F 70 E5 B7 D4 BB F9 10 8B 83 C8 09>)
(   2,<2013-01-25 20:07:25.719 -0500>,<Administrator>,<X>,<proc1d>,<TOPSPIN 2.1>,
      <Start of raw data processing
       efp LB = 0 FT_mod = 6 PKNL = 1 PHC0 = 0 PHC1 = 0 SI = 32K 
       data hash MD5: 32K
       2B 28 EB 2B 21 51 09 3F 42 39 A6 39 1E B3 A4 C1>)
(   3,<2013-01-25 20:07:26.172 -0500>,<Administrator>,<X>,<proc1d>,<TOPSPIN 2.1>,
      <pk PHC0 = 97.29492 PHC1 = 0 
       data hash MD5: 32K
       E5 4A C9 3D E9 F9 02 27 26 FF 75 1C 7F C7 FC 44>)
(   4,<2013-01-25 20:07:26.390 -0500>,<Administrator>,<X>,<proc1d>,<TOPSPIN 2.1>,
      <abs ABSG = 1 
       data hash MD5: 32K
       FE F0 85 F3 07 41 F0 00 07 7A 71 6F 08 53 3A 31>)
(   5,<2013-01-25 20:07:26.531 -0500>,<Administrator>,<X>,<proc1d>,<TOPSPIN 2.1>,
      <abs ABSG = 2 
       data hash MD5: 32K
       F9 BB C4 15 6D B8 3B 00 24 F3 1D 42 73 C9 66 54>)
(   6,<2013-01-25 20:07:26.687 -0500>,<Administrator>,<X>,<proc1d>,<TOPSPIN 2.1>,
      <abs ABSG = 3 
       data hash MD5: 32K
       11 1B BC 5C 31 23 4E 37 04 14 C7 17 66 E7 CD 02>)
(   7,<2013-01-25 20:07:26.828 -0500>,<Administrator>,<X>,<proc1d>,<TOPSPIN 2.1>,
      <abs ABSG = 4 
       data hash MD5: 32K
       E1 8E 60 C7 41 FE D1 30 5A F4 D6 1A 48 E5 6C 7C>)
(   8,<2013-01-25 20:07:26.984 -0500>,<Administrator>,<X>,<proc1d>,<TOPSPIN 2.1>,
      <abs ABSG = 5 
       data hash MD5: 32K
       37 2A 1E 8A 12 00 B1 1C F0 DA C4 14 56 4C 65 04>)
$$ ##END=
$$ 
$$ $$ hash MD5
$$ $$ 8C 70 2F 45 91 91 50 1C A4 FB 6B A6 8F E1 AF 52
##$RELAX= 
##$RELAX= 
##$RELAX= 
##$RELAX= 
##$RELAX= 
##$RELAX= 
##$RELAX= 
$$ Bruker specific parameters
$$ --------------------------
##$DU= <E:\>
##$EXPNO= 10
$$ [...]
150 150 150 150 150 150 150 150
##$TP07= 0
##$TPNAME0= <>
##$TPNAME1= <>
##$TPNAME2= <>
##$TPNAME3= <>
##$TPNAME4= <>
##$TPNAME5= <>
##$TPNAME6= <>
##$TPNAME7= <>
##$TPOAL= (0..7)
0.5 0.5 0.5 0.5 0.5 0.5 0.5 0.5
##$TPOFFS= (0..7)
0 0 0 0 0 0 0 0
##$TUNHIN= 0
##$TUNHOUT= 0
##$TUNXOUT= 0
##$USERA1= <user>
##$USERA2= <user>
##$USERA3= <user>
##$USERA4= <user>
##$USERA5= <user>
##$V9= 5
##$VALIST= <valist>
##$VCLIST= <CCCCCCCCCCCCCCC>
##$VD= 0
##$VDLIST= <DDDDDDDDDDDDDDD>
##$VPLIST= <PPPPPPPPPPPPPPP>
##$VTLIST= <TTTTTTTTTTTTTTT>
##$WBST= 2048
##$WBSW= 25
##$XGAIN= (0..3)
0 0 0 0
##$XL= 0
##$YL= 0
##$YMAX_a= 672066
##$YMIN_a= -570900
##$ZGOPTNS= <>
##$ZL1= 120
##$ZL2= 120
##$ZL3= 120
##$ZL4= 120
##$ABSF1= 14.98509
##$ABSF2= -5.573092
##$ABSG= 5
##$ABSL= 3
##$ALPHA= 0
##$AQORDER= 0
##$ASSFAC= 0
##$ASSFACI= 0
##$ASSFACX= 0
##$ASSWID= 0
##$AUNMP= <proc_prof1d_extract_pilot.lims>
##$AXLEFT= 0
##$AXNAME= <>
##$AXNUC= <1H>
##$AXRIGHT= 0
##$AXTYPE= 0
##$AXUNIT= <>
##$AZFE= 0.1
##$AZFW= 0.1
##$BCFW= 0
##$BC_mod= 0
##$BYTORDP= 0
##$COROFFS= 0
##$CY= 15
##$DATMOD= 1
##$DC= 0
##$DFILT= <>
##$DTYPP= 0
##$F1P= 0
##$F2P= 0
##$FCOR= 0.5
##$FTSIZE= 32768
##$FT_mod= 6
##$GAMMA= 0
##$GB= 0
##$INTBC= 1
##$INTSCL= 1
##$ISEN= 128
##$LB= 0
##$LEV0= 0
##$LPBIN= 0
##$MAXI= 10000
##$MC2= 0
##$MEAN= 0
##$ME_mod= 0
##$MI= 0
##$NCOEF= 0
##$NC_proc= -8
##$NLEV= 6
##$NOISF1= 0
##$NOISF2= 0
##$NSP= 0
##$NTH_PI= 0
##$NZP= 0
##$OFFSET= 14.98509
##$PC= 1
##$PHC0= 97.29492
##$PHC1= 0
##$PH_mod= 1
##$PKNL= yes
##$PPARMOD= 0
##$PPDIAG= 0
##$PPIPTYP= 0
##$PPMPNUM= 2147483647
##$PPRESOL= 1
##$PSCAL= 4
##$PSIGN= 0
##$PYNMP= <proc.py>
##$REVERSE= no
##$SF= 400.02
##$SI= 32768
##$SIGF1= 0
##$SIGF2= 0
##$SINO= 400
##$SIOLD= 32768
##$SPECTYP= <>
##$SREGLST= <1H.CDCl3>
##$SSB= 0
##$STSI= 32768
##$STSR= 0
##$SW_p= 8223.68421052631
##$SYMM= 0
##$S_DEV= 0
##$TDeff= 65536
##$TDoff= 0
##$TI= <>
##$TILT= no
##$TM1= 0
##$TM2= 0
##$TOPLEV= 0
##$USERP1= <user>
##$USERP2= <user>
##$USERP3= <user>
##$USERP4= <user>
##$USERP5= <user>
##$WDW= 1
##$XDIM= 32768
##$YMAX_p= 473016737
##$YMIN_p= -844571
##$CURPLOT= <Network HP LaserJet P1505>
##$CURPRIN= <$Network HP LaserJet P1505>
##$DFORMAT= <normdp>
##$LAYOUT= <+/1D_H.xwp>
##$LFORMAT= <normlp>
##$PFORMAT= <normpl>
##$SURQMSG= 1
$$ End of Bruker specific parameters
$$ ---------------------------------
##NTUPLES= NMR SPECTRUM
##VAR_NAME=  FREQUENCY,     SPECTRUM/REAL,   SPECTRUM/IMAG
##SYMBOL=    X,             R,               I
##VAR_TYPE=  INDEPENDENT,   DEPENDENT,       DEPENDENT
##VAR_FORM=  AFFN,          ASDF,            ASDF
##VAR_DIM=   32768,         32768,           32768
##UNITS=     HZ,            ARBITRARY UNITS, ARBITRARY UNITS
##FACTOR=    0.250966925370066, 1,           1
##FIRST=     8223.43324360094, -134983,      -68639
##LAST=      0,             101317,          -240412
##MIN=       0,             -844571,         0
##MAX=       8223.43324360094, 473016737,    0
$$ Real data points
##PAGE= N=1
##DATA TABLE= (X++(R..R)), XYDATA
$$ [...]
$$ plain form
19520 15982 -266274 -359691 215595 -40516 3110 -252287 -75244 167532 61313 -7754 -174578
19509 -174578 199542 -249015 -34187 -115728 -127311 -90981 -163990 70784 -287677 -184299 -166735
19498 -166735 -177780 236685 -339868 25451 131091 -101338 -9753 -89559 -61805 1409 128875
19487 128875 18910 -57474 2580 -125962 -241565 -60295 -108492 -16639 -164136 101911 13479
19475 124054 128989 -2731 253982 -40368 1257 -202732 -143603 24668 -381279 -55876 -19144
19463 -173633 135012 238926 -207818 -266952 -166416 -66740 -176762 -136369 -21057 -58693
19453 -58693 -191764 250379 -149761 -31064 -9593 -80337 252082 113426 52628 658 -229078
19441 -161885 -3954 -187923 -422599 -160210 109767 -239500 373371 -347486 -304560 -44961
$$ packed form
19520A5982b66274r3417B15595d0516C110b52287g5244A67532F1313g754j66824
19509a74578A99542b49015c4187q1541j1583L6330p3009G0784b87677J03378J7564
19498a66735j1045B36685c39868B5451J05640a01338i753p9806K7754A409J27466
19487A28875A8910e7474B580a25962j15603f0295m8197a6639j47497A01911A3479
19475A24054M935b731B53982d0368A257b02732N9129B4668c81279e5876a9144
19463a73633A35012J03914b07818n9134J00536f6740j10022M0393b1057l7636
19453e8693j33071B50379a49761c1064i593p0744B52082A13426E2628F58b29078
19441a61885c954j83969k34676a60210A09767b39500C73371c47486M2926d4961
$$ plain form
19430 -200388 -86593 -336559 144305 2080 -378309 40659 -441693 -166027 -52720 -40216 -91580
19419 -91580 -12300 37742 -76541 63790 -372355 -98390 -177403 -152026 -25476 446991 144753
19407 84894 -320871 102895 -125063 -235837 -468487 180086 170206 50983 -16931 -119887
19397 -119887 -155941 -277600 -336687 332271 -124992 -27232 -4533 -230997 190130 229730 77372
19385 -1653 96431 -14882 -168873 -81697 -96388 150602 -50852 76694 -715426 85309 58887
19374 58887 86878 -88805 -182508 -64478 -298731 -167329 -89475 -391316 362101 -101544 -219723
19363 -219723 220043 116963 -211242 -48089 100738 -254039 -65990 -131549 -227446 -74963
19352 -138994 222483 157300 -185859 -180625 40540 -60825 104225 -177947 -25894 -121793 109874
$$ packed form
19430b00388h6593k49966A44305B080c78309D0659d41693a66027e2720J2504n1364
19419i1580a2300C7742g6541F3790c72355i8390p9013K5377b5476D46991A44753
19407H4894c20871A02895a25063j10774k32650A80086r880E0983a6931j02956
19397a19887l6054j21659n9087C32271a24992b7232d533k26464A90130L9600G7372
19385a653I6431a4882j53991h1697j4691A50602e0852G6694g15426H5309k6422
19374E8887K7991h8805r3703f4478k34253J31402P7854l01841C62101a01544j18179
19363b19723B20043j03080b11242d8089A00738b54039f5990o5559r5897g4963
19352a38994B22483o5183a85859N234D0540f0825A04225a77947b5894r5899A09874
$$ plain form
19340 69398 -106217 -190508 -434152 13483 -131528 130332 233448 102717 97621 52455 -299318
19328 -87957 -83900 -432757 -31784 50434 -69755 5227 -160288 -10395 60211 62764 199289 -106513
19315 -235942 105051 -197871 -126167 327069 -212784 -300991 109474 -114915 -169070 242306
19304 -54285 -1373 40776 -126605 -247486 -249031 -26275 -177106 -234915 -232131 345564 21055
19292 -66783 193729 -198225 -509545 15827 129677 -67004 -47295 -100851 -81155 -100805 -181947
19281 -181947 67872 -213658 -212039 87034 16762 -209741 -391732 -63817 33579 -48570 -134987
19270 -134987 -99348 -342738 -476755 213752 -67203 54034 -23031 140340 -71860 -179637
19260 -179637 -141015 22369 87765 -156566 -120382 -86039 -203008 -186791 -217398 132935 -376964
$$ packed form
19340F9398a06217q4291k43644A3483a31528A30332J03116A02717n096m5166b99318
19328h7957M057l48857c1784E0434f9755E227a60288a0395F0211K553J36525a06513
19315b35942A05051a97871P1704C27069b12784q8207A09474a14915n4155B42306
19304e4285a373D0776a26605j20881j545b6275j50831n7809K784C45564B1055
19292f6783A93729a98225l11320A5827J13850f7004J9709n3556J9696j9650q1142
19281a81947F7872b13658J619H7034A6762b09741j81991f3817C3579d8570q6417
19270a34987L5639k43390j34017B13752f7203E4034b3031A40340g1860j07777
19260a79637L8622B2369O5396a56566L6184L4343j16969J6217l0607A32935c76964
$$ plain form
19248 126727 140578 217590 41813 -61151 -214813 -311968 -208226 110241 3212 -174624 -13659
19236 -126840 -150009 239083 -96330 279245 84772 -103848 95313 -380749 -319114 144019
19225 -45727 399926 -224243 -399575 -180583 238841 61973 -127966 -166608 162225 -122380
19214 -7385 354295 -275377 -83160 27168 38875 -46871 232349 -146924 4436 -45655 22357
19202 -119685 142845 6136 197736 3700 -328927 116731 243983 179363 -120811 -105622 10513
19190 -125904 -186187 -100976 -29875 338015 -97871 12191 -131827 -183065 -122635 -68981 392680
19178 74869 140419 -133338 -112037 -159935 -164396 44759 75787 79911 -101714 62825 -106403
19166 154578 -4471 -314225 156359 -82673 -293393 -237517 -25361 -18734 -360274 20041 69888
$$ packed form
19248A26727J3851P7012D1813f1151j53662r7155J03742A10241C212a74624a3659
19236a26840k3169B39083i6330B79245H4772a03848I5313c80749O1635A44019
19225d5727C99926b24243j75332a80583B38841F1973a27966l8642A62225a22380
19214g385C54295b75377h3160B7168J1707d6871B32349a46924D436d5655B2357
19202a19685A42845F136J91600C700c28927A16731J27252o4620a20811J5189A0513
19190a25904o0283Q5211b9875C38015i7871A2191a31827n1238O0430N3654C92680
19178G4869O5550a33338K1301m7898m461D4759L1028M124a01714F2825a06403
19166A54578d471l09754A56359h2673k10720N5876b5361O627l41540B0041M9847
$$ plain form
19155 69888 -6832 -365708 -144936 -222636 -126911 -234148 -152377 -153545 -52946 80997 270363
19144 270363 -313012 -31613 -113616 -138388 -35065 153398 -144721 -358137 -107746 -128468
19134 -128468 -99084 52114 -65044 -128326 -191168 172699 54034 41018 -132509 56234 5659
19122 -41111 122865 -3530 -263030 93133 -567372 -112774 -305026 -147271 -226989 -331195
19112 -331195 -255379 -181089 -79178 -192349 204842 42741 -50427 -171801 -256245 -45449 -106204
19101 -106204 238226 -194532 -7835 128178 -26844 -313382 197985 279886 77113 71820 40032
19090 40032 14491 -99577 -89700 -129531 -71126 209964 38896 -134456 -80973 180451 -143516
19078 6807 92219 -242728 -45486 84438 154983 14481 -119773 66819 -138574 -81152 -207589
$$ packed form
19155F9888f832l58876a44936p7700R5725j07237Q1771j168e2946H0997J89366
19144B70363c13012c1613q2003k4772c5065A53398a44721k13416a07746k0722
19134a28468K9384E2114f5044o3282o2842A72699E4034j3016a32509E6234E659
19122d1111A22865c530k59500I3133e67372a12774j92252a47271p9718j04206
19112c31195P5816P4290g9178j13171B04842D2741e0427j21374q4444d5449o0755
19101a06204B38226a94532g835A28178b6844k86538A97985Q1901G7113n293l1788
19090D0032A4491i9577R877l9831N8405B09964C8896a34456N3483A80451a43516
19078F807Q5412b42728d5486H4438P0545A4481a19773F6819a38574N7422j26437
$$ plain form
19067 -207589 203013 27305 17909 -4554 -159452 -211074 -84660 -68182 114437 147171 -15266
19055 -92246 -215358 -228114 113829 -325043 -9363 -105634 -1071 195445 367730 -198489 -183237
19044 -183237 90289 -44249 -77333 106299 -134776 -72954 -77945 -40996 -9911 -383895 33367
19032 -350951 -14621 77321 -91897 276240 -86753 -31041 -21100 -42281 -36985 113940 -75616
19020 280625 -140728 -84781 -57461 -31960 -134640 -29965 201032 -191512 -88737 -381703
19010 -381703 48449 283454 -330480 -194378 -7050 -106345 -114764 103312 46830 -45505 -116339
18999 -116339 -112004 52192 -127177 -194567 -329986 -387747 -5793 -321250 -20365 -194431 -72347
18987 183882 -145620 128189 -44195 131165 194118 -227343 -125331 236289 65858 5159
$$ packed form
19067b07589B03013B7305r396d554j54898n1622h4660J6478A14437L2734a5266
19055i2246j23112j2756A13829c25043i363r6271a071A95445J72285a98489J5252
19044a83237I0289d4249l3084A06299a34776O1822m991L6949i911l73984C3367
19032c50951a4621G7321i1897B76240h6753c1041R941k1181N296A13940g5616
19020B80625a40728N5947K7320K5501j02680b9965B01032a91512h8737k92966
19010c81703D8449K35005c30480J36102g050r9295q419A03312D6830d5505p0834
18999a16339M335E2192a27177o7390j35419n7761e793l15457b0365j74066g2347
18987A83882a45620A28189d4195A31165O2953b27343J02012B36289F5858E159
$$ plain form
18976 54639 113475 -111909 -125769 58933 -230258 -71077 -14690 205067 356133 -210226 -253839
18965 -253839 -111636 -177145 17779 -27145 169935 -101010 -17134 -241846 111953 134815
18955 134815 -249478 66118 -314745 44841 -201371 34578 188148 158945 -136424 -283017
18945 -283017 134923 -217554 -136418 133184 40373 -117886 40053 -164074 -191361 -176365
18935 -176365 88708 98317 -169456 231465 -327117 259964 -103591 -101003 59254 -56213 -196053
18924 -196053 301 -114690 169810 -536142 -34098 58555 369255 -124541 -390630 -288943
18914 -288943 -42699 -29636 -93364 -120540 3991 -5670 8005 35515 166311 -199192 -220519 -393332
18902 -393332 -104935 3906 -68351 -113921 178885 202228 19579 52151 -278513 274482 -11054
$$ packed form
18976E4639N8836a11909j3860E8933b30258g1077a4690B05067J51066b10226m3613
18965b53839a11636o5509A7779b7145A69935a01010a7134k24712A11953K2862
18955A34815b49478F6118c14745D4841b01371C4578J53570k9203a36424j46593
18945b83017A34923b17554Q1136A33184D0373a17886D0053a64074k7287J4996
18935a76365H8708R609a69456B31465c27117B59964a03591K588E9254e6213j39840
18924a96053C01a14690A69810e36142c4098E8555L10700a24541k66089J01687
18914b88943d2699J3063o3728k7176C991e670H005K7510J30796a99192k1327j72813
18902c93332a04935C906f8351m5570A78885K3343A9579L2572b78513B74482a1054
$$ plain form
18890 -297017 227813 -336755 -61035 -38917 -57852 -8717 -135771 130772 -115101 138043
18879 -410333 -44196 -287865 116351 -62920 -106032 -128395 39076 -280455 179979 -205084
18868 362107 -391856 -9753 -333605 138392 -80724 -286201 -256054 206443 -255913 139174
18857 -173215 -183302 230059 -243954 394011 -212639 -333136 -24103 99305 204803 151600
18847 151600 -29875 126695 -223173 178965 47868 -150794 -3721 -234153 -218285 -18325 92655
18835 71733 -199916 -118966 62917 -255254 -148887 -188019 -84378 -345680 90792 -149803 59205
18823 89470 -9593 -174574 -387372 210737 61636 -149245 -323412 -25692 223179 -53481 206074
18811 -145580 120760 -51815 297704 -239430 -66939 153478 -43399 -99384 -153700 -167448 78473
$$ packed form
18890b97017B27813c36755f1035K2118j8935h717j27054A30772a15101A38043
18879d10333d4196k43669A16351f2920m3112k2363C9076b80455A79979b05084
18868C62107c91856i753l23852A38392h0724k05477L0147B06443b55913A39174
18857a73215j0087B30059b43954C94011b12639j20497b4103I9305J05498n3203
18847A51600b9875A26695b23173A78965D7868a50794c721k30432J5868a8325I2655
18835G1733a99916Q0950F2917b55254J06367l9132h4378k61302I0792a49803E9205
18823H9470i593j64981k12798B10737F1636a49245j74167b5692B23179e3481B06074
18811a45580A20760e1815B97704b39430f6939A53478d3399n5985n4316j3748G8473
$$ plain form
18799 407796 65308 -136288 46600 25479 -31336 -116065 199915 20052 87829 209179 -216591
18787 123390 -34838 -366575 110705 -205068 -51284 -265573 20885 -353527 43500 -139385
18776 -144905 111589 -28252 120153 -117476 269419 -229676 -332156 33527 -66044 -500876
18766 -500876 11550 -20945 64585 -152708 -61948 83739 -63298 -166305 -188664 39311 -119008
18754 31392 106229 -71290 219988 -294207 -157292 -29699 -213385 -212282 18196 -9849 -213326
18743 -213326 -27738 -191247 35945 -93495 369098 -148486 106702 -94010 -282376 -120386
18732 -75170 228268 97278 109867 1768 -73653 -227776 -6424 -295791 -108488 -74004 5681
18720 -54974 50490 -67151 171769 -257858 -19471 156999 -292071 -277950 -40001 -157152 -114039
$$ packed form
18799D07796F5308a36288D6600k1121c1336q4729A99915B0052O7777J21350b16591
18787A23390c4838l31737A10705b05068e1284k14289B0885c53527D3500a39385
18776a44905A11589b8252A20153a17476B69419b29676j02480C3527f6044m34832
18766e00876A1550b0945F4585a52708f1948H3739f3298j03007k2359C9311a19008
18754C1392P4837g1290B19988b94207J36915b9699j83686J103A8196i849k03477
18743b13326b7738j63509C5945i3495C69098a48486A06702i4010j88366a20386
18732g5170B28268I7278J2589A768g3653j54123f424k89367a08488L4484E681
18720e4974E0490f7151A71769b57858a9471A56999b92071J4121d0001j17151M3113
$$ plain form
18709 -114039 400497 -364854 -221825 -15102 125448 -106765 -264822 -60902 -166560 -7742
18698 138928 -113776 151557 75482 24899 -28287 -272185 -134106 -259713 -7713 -283914
18688 -283914 92610 -110404 -238172 -212475 -85194 -184414 -128691 -405013 -154154 -214741 -128109
18677 -128109 -82584 -84829 70322 -322478 12219 -578575 -133235 -30546 -103853 263935 -258072
18665 39023 -387272 19881 -78214 65262 60340 28607 16069 -380671 -66318 131374 70415
18654 70415 92567 -101374 -73844 183531 -335134 -116260 -199161 -123585 -492399 25757 136801
18643 136801 22095 -238861 -23581 135566 -2887 -74649 -257338 -107791 93298 -171963 327812
18631 -195218 30121 -213477 342791 35648 -169044 -78384 65447 97863 -50445 -90639 -222462
$$ packed form
18709a14039D00497c64854J43029a5102A25448a06765j58057f0902j05658g742
18698A38928a13776A51557G5482B4899b8287k43898a34106j25607g713k76201
18688b83914I2610a10404j27768K5697h5194r9220N5723k76322a54154o0587Q6632
18677a28109M5525k245G0322c22478A2219e78575a33235c0546p3307B63935b58072
18665C9023c87272A9881g8214F5262m922B8607j2538c80671f6318A31374o0959
18654G0415K2152a01374K7530A83531c35134a16260q2901P5576l68814B5757J11044
18643A36801B2095b38861b3581A35566b887p1762j82689a07791I3298a71963C27812
18631a95218C0121b13477C42791C5648a69044g8384F5447L2416e0445m0194j31823
$$ plain form
18620 -222462 -467628 92657 -123018 205592 144283 -167111 -39587 -289943 -153057 -23356
18609 -70965 132935 252576 -322718 -209246 -64205 -352713 203338 -82355 -249012 -15798
18598 -167688 -128363 -76849 -217072 -203443 -156106 181983 83438 -103437 -60491 228300 -127068
18586 88054 1994 53022 -118236 -175103 -196307 129500 -154809 -282619 208605 315453 -290665
18574 -221306 -128755 207607 131843 43927 136993 -155982 31586 67062 448534 -142354 133449
18562 -47541 -133166 -22361 159247 -2223 -81279 34736 -234228 -49256 92493 30043 -67359
18550 -316078 95056 -233862 -84524 -3044 -128075 -137012 32738 -360675 132754 -112061 -113595
18539 -113595 -92823 -131011 -337053 10864 213667 -104812 243349 23162 -143741 -171330
$$ packed form
18620b22462k45166I2657a23018B05592o1309a67111c9587k50356J36886b3356
18609g0965A32935J19641c22718J13472f4205k88508B03338h2355j66657a5798
18598a67688L9325N1514j40223J3629M7337A81983H3438a03437M2946B28300a27068
18586H8054A994N1028a18236n6867k1204A29500a54809j27810B08605J06848b90665
18574b21306R2551B07607p5764D3927R3066a55982C1586L5476L81472a42354A33449
18562d7541q5625b2361A59247b223p9056C4736b34228d9256I2493C0043f7359
18550c16078I5056b33862h4524c044j25031q937C2738c60675A32754a12061j534
18539a13595K0772l8188k06042A0864K02803a04812B43349B3162a43741k7589
$$ plain form
18529 -171330 -85069 -164598 -172216 -248109 17808 78337 -274605 -31150 -230879 -365818 -49151
18517 27032 93401 135303 82187 62251 64884 162603 -207361 -134026 -140263 -161678 -135515 223624
18504 95235 326323 264540 -199552 -228105 -242905 54173 184745 -268269 -319037 -134286 -30389
18492 -173259 -39028 -273508 30984 -124193 -144550 99982 82526 -147848 -214824 34447 27402
18481 27402 -18026 344 -125400 -438706 44290 -121333 83076 -238723 -352769 -75614 -84513
18470 -84513 -100889 -62114 -25837 -519196 -65733 -36390 24721 -326443 -118400 -89544 13784
18458 -132931 234454 -125824 8364 -203641 93431 218700 -57271 -71570 13314 205751 202339
18447 202339 107896 -100182 109994 -99564 -327626 166498 -8031 252493 -388669 -77998
$$ packed form
18529a71330h5069p9529p618p5893A7808O0529b74605c1150j99729j34939d9151
18517B7032O6369M1902n3116j9936K633R7719b07361P3335o237k1415K6163B23624
18504I5235K31088o1783a99552k8553j4800E4173J30572b68269n0768a34286c0389
18492a73259c9028k34480C0984a24193k0357I9982j7456a47848o6976C4447p045
18481B7402a8026C44a25400l13306D4290a21333H3076b38723j14046g5614q899
18470h4513j6376L8775b5837m93359f5733K9343B4721c26443a18400K8856A3784
18458a32931B34454a25824H364b03641I3431J25269e7271j4299A3314J92437l412
18447B02339r4443a00182A09994i9564k28062A66498h031B52493c88669g7998
$$ plain form
18436 -260726 -122212 -16716 169737 -194946 19240 -442218 -316477 112447 -27769 -227571
18426 -227571 -228731 -79835 9000 -241442 306936 -267516 196821 213859 3127 -116213 -255186
18415 -255186 -438493 -38567 -202900 -57348 -100603 -16244 -131779 259066 -198050 -286639
18405 -286639 161122 -187018 96339 -273373 184305 -13487 -54663 264984 292634 -39802
18394 -125326 -143752 -1057 -153508 -136414 -78133 -280985 -41279 -67680 -4835 80985 -259870
18382 -404808 28287 -93649 221424 3483 180633 287067 -143857 57986 -386977 90039 178697
18371 178697 -33878 -208192 -280161 -32578 151868 238826 156087 17343 298065 87616 79255
18360 79255 -86461 -119816 -6813 91338 12542 304430 -79960 236227 136008 -242731 144153
$$ packed form
18436b60726a22212a6716A69737a94946A9240d42218J25741A12447b7769j99802
18426b27571j160g9835I000b41442C06936b67516A96821J7038C127a16213j38973
18415b55186j83307c8567j64333e7348m3255a6244j15535B59066a98050q8589
18405b86639A61122a87018I6339b73373A84305a3487m1176B64984K7650c9802
18394a25326j8426a057j52451J7094N8281k02852d1279k6401d835H0985b59870
18382d04808B8287i3649B21424C483J77150J06434a43857E7986c86977I0039Q8658
18371A78697c3878j74314p1969c2578A51868Q6958q2739A7343K80722H7616q361
18360G9255h6461l3355f813I1338A2542K91888g9960B36227j00219b42731A44153
$$ plain form
18348 88114 96555 -79541 211609 78835 12563 165276 79328 29415 166530 49010 65500
18337 65500 -29899 -196961 -221727 -58336 212038 -28290 94814 321594 -119483 13648 -135449
18325 -2260 113475 156104 -140853 -21922 -187927 253859 -196511 138845 -20004 55484 185199
18314 185199 -478161 27452 -23806 -59700 109495 234245 14273 -272866 268429 -11670
18303 -205993 159518 58570 -207407 163258 -253461 -66780 -123742 107276 -421238 86166
18292 20370 248350 -212931 -61148 196544 -93890 157539 -256727 -125184 -101699 -92918 -110933
18281 -110933 -34382 -283530 -371964 -319073 -242930 -427026 285578 15687 88033 14070 146002
18270 146002 -164820 97875 -195319 59502 -90653 52472 75441 -87473 70076 -252542 -225634
$$ packed form
18348H8114Q441g9541B11609G8835A2563J52713G9328B9415J37115D9010J6490
18337F5500b9899j67062k4766e8336B12038b8290I4814K26780a19483A3648a35449
18325b260A13475M2629a40853b1922j66005B53859a96511A38845b0004E5484J29715
18314A85199d78161B7452b3806l5894A09495J24750A4273b72866B68429a1670
18303b05993A59518E8570b07407A63258b53461f6780n6962A07276d21238H6166
18292B0370K27980b12931f1148A96544i3890A57539b56727a25184K3485Q781j8015
18281a10933c4382k49148q8434N2891P6143j84096B85578A5687P2346A4070J31932
18270A46002a64820I7875a95319E9502i0653E2472K2969h7473G0076b52542K6908
$$ plain form
18259 -225634 23743 73034 -17187 -37132 -59968 81114 36797 45239 -120108 4533 7244 -362447
18246 -10159 -49677 -249187 155798 -169654 28944 -143463 -104075 -379476 150482 237930
18236 237930 40174 -191669 13365 -147819 229673 34785 -231810 46035 -292076 -351907
18226 -351907 -206023 -65352 -100215 199239 219439 -68657 -132151 137224 -313544 276938
18215 20964 -313912 -145338 -264631 -191200 -153502 -178346 -370093 310542 -150890 24310
18204 207598 -388225 -175810 -120012 41753 46905 -72383 -95498 71198 76486 -66164 -108557
18193 -108557 -28404 -27723 -115997 -126561 118457 -202264 -133597 -256970 -36159 34810 136534
18182 136534 11930 63857 -66382 308624 95317 -111597 225508 -94758 92884 20999 -98357
$$ packed form
18259b25634B3743M9291a7187j9945k2836H1114C6797Q442a20108D533K711c62447
18246a0159l9518j99510A55798a69654B8944a43463L9388k75401A50482Q7448
18236B37930D0174a91669A3365a47819B29673C4785b31810D6035b92076n9831
18226c51907J45884f5352l4863A99239K0200f8657o3494A37224c13544B76938
18215B0964c13912a45338j19293P3431L7698k4844j91747C10542a50890B4310
18204B07598c88225a75810N5798D1753N152g2383k3115G1198N288f6164m2393
18193a08557b8404O81q8274j0564A18457b02264O8667j23373c6159C4810J01724
18182A36534A1930N1927f6382C08624I5317a11597B25508i4758I2884B0999i8357
$$ plain form
18170 -159731 -320062 -450482 90803 163688 -250118 -315414 -294122 -200439 156326 -52803 45144
18158 -109771 -52557 98274 14875 -69567 -130346 -297361 -68784 -37290 97127 -313716 -147668
18146 62551 48680 -122530 -236535 -87651 -66730 -236315 -251919 -157085 179511 -184639 19535
18134 118719 -194702 88300 -8569 84502 33057 -60029 133109 -312506 -144375 95747 290414
18123 290414 -126292 -162875 -49848 74917 -100533 -149823 289526 190838 -53093 -78418 386947
18111 -196 -127304 -12725 -29725 159471 -50600 -113834 -247869 -174206 32498 -261990 -380299
18100 -380299 -359961 9043 210232 -25782 -37883 247488 40071 -301251 -33589 227851 96818
18088 -39896 -175329 127215 84926 -112973 216362 -133052 8478 -444596 -268056 -72565
$$ packed form
18170a59731j60331j30420I0803P2885b50118o5296K1292R3683A56326e2803D5144
18158a09771e2557I8274A4875f9567o0779j67015f8784L1494I7127c13716a47668
18146F2551j3871a22530j14005h7651K0921j69585j5604R4834A79511a84639A9535
18134A18719a94702H8300h569H4502C3057f0029A33109c12506a44375I5747J94667
18123B90414a26292l6583d9848G4917a00533m9290B89526r8688e3093k5325C86947
18111a96j27108a2725j7000A59471e0600o3234j34035P3663C2498b61990j18309
18100c80299K0338I043K01189b5782j2101B47488D0071c01251c3589B27851I6818
18088c9896j35433A27215m2289a12973B16362a33052H478d44596J76540g2565
$$ plain form
18077 42423 168215 -41959 -36777 -83485 229772 -157442 -30352 226193 252632 65492 -6919
18065 49809 -4458 118884 -384968 -13068 104946 2004 55036 318470 -140697 -218920 168146
18053 225460 -253668 211147 100621 148524 -77781 14193 -364185 -69830 -66276 262734 -392578
18041 -142242 -164000 -101781 -68254 103539 264371 91077 -66924 -223633 -107187 73822 -219680
18029 90659 -338917 219054 -126360 -241237 78789 -48151 -18595 298159 71929 -74124 26397
18017 -81043 -15964 -150410 19867 57751 -149425 -122019 221421 -135897 37370 -103766 -213273
18006 -213273 -270027 -117801 23002 -389631 -105278 -60324 -149892 -58358 42870 37073 -297982
17994 -212896 -209730 -228262 128952 108644 22181 -519491 -138376 296225 -158650 438645
$$ packed form
18077D2423J25792d1959N182m6708B29772a57442c0352B26193K6439F5492f919
18065D9809d458A18884c84968a3068A04946B004N3032K63434a40697p8223A68146
18053B25460b53668B11147A00621M7903g7781A4193c64185f9830L554B62734c92578
18041a42242k1758O2219L3527A03539J60832I1077f6924j56709a07187G3822b19680
18029I0659c38917B19054a26360j14877G8789d8151a8595B98159G1929g4124B6397
18017h1043a5964j34446A9867L7884a49425K7406B21421a35897C7370a03766j09507
18006b13273n6754a17801B3002c89631a05278M4954q9568e8358D2870n797b97982
17994b12896L166j8532A28952k0308B2181e19491a38376B96225a58650D38645
$$ plain form
17983 21315 359397 65777 -19240 -129343 124616 5824 -139978 2861 -54297 263485 -72030
17971 148052 -83444 33194 81343 -31608 159935 -100534 -72082 -140275 -272193 167623 -222600
17959 83540 50344 -101193 -196068 -139296 158729 -146401 -516248 66898 -63046 278639 -64353
17947 -141091 -18835 102149 -241136 406621 3390 -392738 356255 -170540 -87986 47646
17936 -16809 9214 235440 104132 59786 -86074 -310723 -13554 27128 -239682 -365505 18632
17924 251356 38763 5442 -169351 3102 51844 291097 -275321 -57491 56584 -97713 -220676
17913 -220676 238776 -97490 242119 173290 -55514 339149 -139279 -341318 -171204 -400339
17903 -400339 165013 -126253 -117929 210571 -122245 219841 14260 -109505 -154342 -175489
$$ packed form
17983B1315L38082F5777a9240j10103A24616E824a39978B861e4297B63485g2030
17971A48052h3444C3194M8149c1608A59935a00534K8452o8193j31918A67623b22600
17959H3540l3196a01193r4875N6772A58729a46401l69847F6898f3046B78639f4353
17947a41091a8835A02149b41136D06621C390c92738C56255a70540Q2554D7646
17936a6809I214K26226A04132m4346h6074k24649a3554B7128b39682j25823A8632
17924B51356C8763E442a69351C102M8742K39253b75321e7491E6584i7713j22963
17913b20676B38776i7490B42119o8829e5514C39149a39279k02039J70114k29135
17903d00339A65013a26253Q324B10571a22245B19841A4260a09505m4837k1147
$$ plain form
17893 -175489 115641 -110600 242363 90493 -468020 -99723 287810 384561 -284025 8508
17882 464914 152365 131010 -158759 70399 167440 -11294 -76165 -237967 -142123 -31902 -91992
17871 -91992 -206949 162491 -100232 45970 49310 -282082 68029 335412 -208114 7778 47729
17860 47729 -153874 259494 75927 -253556 -127231 65043 51259 250261 186109 -285489
17849 -65000 142553 -33296 34470 -82641 -238442 -162471 -216825 -198560 -61807 -98691 90275
17837 129890 141249 -285200 -125418 139465 121280 -110792 -42166 83712 103048 93707 52024
17826 52024 178557 197759 -127812 -14618 54269 -131640 201136 55912 -167698 -21914 -132344
17815 -132344 -71839 -301838 -35469 -253073 25460 28385 146714 138028 128273 40126 73309
$$ packed form
17893a75489A15641a10600B42363I0493d68020i9723B87810R6751b84025H508
17882D64914A52365k1355a58759G0399R7041a1294o4871j61802R5844c1902o0090
17871i1992j14957A62491a00232D5970L340b82082F8029K67383b08114G778L9951
17860D7729a53874B59494G5927b53556J26325F5043j3784J99002o4152b85489
17849f5000A42553c3296C4470h2641j55801P5971n4354J8265f1807l6884I0275
17837A29890J1359b85200a25418A39465j8185a10792d2166H3712J9336r341m1683
17826E2024J26533J9202a27812a4618E4269a31640B01136E5912a67698b1914j10430
17815a32344O0505k29999c5469k17604B5460K925J18329q686r755D0126L3183
$$ plain form
17804 73309 65984 -230230 -171441 -125223 21900 30322 50800 111997 -376542 -24680 -41337 219266
17791 95490 269170 -162093 -365553 38898 262377 -339297 -156131 134324 1857 218106
17781 218106 2212 7269 -138482 -8539 101342 -61098 86959 -316915 -126541 93320 -181097
17769 -382508 -506936 -71886 -202058 -49225 -247233 1203 -174655 -277648 133857 -122737
17758 -143803 -589395 -114567 -360852 131152 -145604 -242513 -84819 75788 -169499 -51644
17747 -18179 194683 10380 -34124 115112 -71920 -11035 -1002 -76178 -210942 256200 285039
17736 285039 -21392 35940 237605 19206 44628 147487 -14889 124166 130960 -318291 -50827
17724 -145272 -148505 282495 123503 105488 19165 44600 -80076 -121011 374019 16618 -68439
$$ packed form
17804G3309p325b30230N8789M6218B1900Q422K0478O1197c76542b4680j6657B19266
17791I5490J73680a62093k03460C8898K23479c39297a56131A34324A857K16249
17781B18106B212N057a38482h539A01342f1098H6959c16915a26541I3320a81097
17769c82508j24428g1886j30172d9225j98008A203a74655j02993A33857a22737
17758a43803m45592a14567k46285A31152a45604r6909h4819G5788a69499e1644
17747a8179A94683A0380c4124A15112g1920a1035a002p5176j34764B56200K8839
17736B85039b1392C5940K01665A9206K5422J02859a4889A24166O794c18291e0827
17724a45272l233B82495A23503j8015A9165K5435h0076m0935C74019A6618f8439
$$ plain form
17712 165572 5826 30511 152416 139237 42159 -41501 476149 43251 -466 123000 114308 309389
17700 309389 246548 406488 -258860 -57150 -59144 -59084 -125009 71211 205847 293217 -417495
17688 -56607 -119947 -146978 -66437 327306 -36542 -7546 -295965 118589 -31471 24662 243450
17677 243450 54958 181752 -176985 11245 -333617 -136646 -80608 -136751 -168765 92814 18645
17665 58794 -132807 355789 -206607 186444 -83299 180968 -379310 -168293 -170792 185678
17654 229195 -267441 92952 39878 103670 57838 106340 101402 246118 -220428 86229 223222
17643 223222 421 229097 -205868 134342 -228113 168464 62151 -14570 -257413 -22292 -221465
17632 -221465 -81561 93854 2395 -116279 147795 -158146 -124483 79317 38310 64167 515005
$$ packed form
17712A65572E826K4685J21905j3179D2159d1501D76149D3251d66A23000q692J95081
17700C09389o2841J59940b58860e7150j994O0o5925G1211J34636Q7370d17495
17688e6607o3340k7031f6437C27306c6542g546k88419A18589c1471B4662K18788
17677B43450E4958J26794a76985A1245c33617a36646N6038n6143l2014I2814A8645
17665E8794a32807C55789b06607A86444h3299A80968c79310a68293k499A85678
17654B29195b67441I2952C9878O3792m5832M8502m938J44716b20428H6229J36993
17643B23222D21K28676b05868A34342b28113A68464F2151a4570k42843b2292j99173
17632b21465h1561I3854B395a16279A47795a58146L3663G9317C8310K5857M50838
$$ plain form
17621 515005 251042 -222920 -205457 -98125 -175158 11895 38514 143252 147251 -117428 130950
17609 230554 -28193 -16081 138354 -337192 -125795 -5003 194001 55936 116703 -128337 -163881
17598 -163881 398934 -117058 -337649 178845 28627 62735 3977 191333 230262 15670 376317
17587 376317 86128 118349 176285 -113393 141910 -105881 -125862 96251 -68024 -77225 192551
17575 399180 208145 -137335 -290202 -143770 -54840 30668 122073 -118138 123130 -139754
17564 321735 125690 -1788 -278317 304999 -118161 191390 329012 350621 175589 -17313
17553 184990 106362 -125511 115122 123714 -329237 -55046 179563 179209 160561 221788 -19336
17541 129385 -73280 -57964 18817 181195 -33397 40945 140427 5442 177716 -7630 25531
$$ packed form
17621E15005B51042b22920J7463i8125p7033A1895K6619J04738L999a17428A30950
17609B30554b8193J2112A38354c37192a25795e003A94001E5936O0767a28337l5544
17598a63881C98934a17058k20591A78845B8627L4108C977J87356L8929A5670L60647
17587C76317H6128L2221N7936a13393A41910a05881j9981I6251f8024r201A92551
17575C99180j91035a37335j52867a43770e4840C0668R1405a18138A23130a39754
17564C21735A25690a788k76529C04999a18161A91390J37622K1609j75032a7313
17553A84990p8628a25511A15122Q592c29237e5046A79563l54j8648O1227a9336
17541A29385g3280J5316A8817J62378c3397D0945R9482E442J72274g630B5531
$$ plain form
17529 -213694 -26807 -77492 204787 -257234 39676 256267 255419 137430 414564 286301 166148
17518 166148 85631 -88114 13382 -18364 -56963 -135046 26363 418338 131346 -392705 -221135
17507 -221135 -108419 330511 84957 97699 -67783 130101 119033 267694 120840 10187
17496 -214530 337665 -150650 -202478 453383 -105251 66196 28894 160871 292575 -344809
17485 439714 294524 149897 131376 91308 68725 226840 -177497 215528 45231 58444
17475 58444 43616 250968 449519 9656 -13383 336977 174632 495480 -53588 157516 167231
17464 167231 288236 -387804 337546 264830 -21410 170481 27758 319897 337025 141739
17453 36902 279369 474425 199905 240356 286793 284627 127239 479782 529361 249088 6784
$$ packed form
17529b13694b6807n0685B04787b57234C9676K16591q48j17989K77134j28263j20153
17518A66148q0517h8114A3382a8364l8599p8083B6363L91975A31346c92705J71570
17507b21135a08419C30511H4957J2742f7783A30101j1068J48661A20840A0187
17496b14530C37665a50650n1828D53383a05251F6196B8894J31977J31704c44809
17485D39714j45190j44627j8521m0068k2583J58115a77497B15528D5231J3213
17475E8444j4828K07352J98551I656a3383C36977j62345L20848e3588A57516R715
17464A67231J21005c87804C37546p2716b1410A70481B7758K92139J7128A41739
17453C6902K42467J95056A99905M0451M6437k166A27239L52543M9579B49088F784
$$ plain form
17441 -12242 191836 298051 238471 39266 299094 168551 262297 19658 253828 174289 -132575
17429 479566 300238 133141 732928 516537 383056 -101578 81200 187817 83017 327603
17419 327603 346663 301876 149419 431215 -24711 204835 632445 155836 -2846 205069
17408 -255547 296505 -193353 320440 145961 247667 459721 266975 61565 103248 -67698
17397 33729 6187 350369 246742 -134531 83450 12016 125800 94549 90761 68275 -43010
17385 282480 52557 124432 113508 -69618 5773 143431 127160 344905 244247 398234 180661
17373 206687 137881 270612 -17615 236158 250898 -236528 374568 -142562 49128 68913
17363 68913 1783 205652 -10690 294156 80480 -479140 -196632 13013 -143033 -100749 367825
$$ packed form
17441a2242A91836J06215n9580C9266K59828j30543R3746A9658K34170p9539a32575
17429D79566j79328A33141N99787k16391j33481a01578H1200J06617H3017K44586
17419C27603J9060m4787A49419K81796b4711B04835M27610A55836b846B05069
17408b55547B96505a93353C20440A45961J01706K12054j92746F1565M1683f7698
17397C3729F187L44182j03627a34531H3450A2016J13784l1251l788k2486d3010
17385B82480E2557P1875j0924f9618E773J37658j6271K17745j00658J53987A80661
17373B06687o8806J32731a7615B36158J4740b36528C74568a42562D9128J9785
17363F8913A783K03869a0690B94156H0480d79140a96632A3013a43033M2284C67825
$$ plain form
17351 55193 -143035 306629 329290 47501 264932 333828 -37537 61016 -177129 -116456 68771
17339 65865 130368 211536 -26134 262102 262944 155127 177048 24393 219732 -8164 242945
17327 63427 46535 62811 70141 223502 50465 311905 -65903 40355 429148 198768 72786
17315 8617 416274 -20189 117910 153831 -86399 112136 -276091 355876 201139 216748 567665
17304 567665 84511 -147109 212078 158805 132134 337751 -63611 198555 134605 97714 217421
17293 217421 144283 28656 158704 157920 125607 65304 337876 289193 89297 494474 283994
17282 283994 280434 -72344 77970 135507 496818 -85360 -27979 152729 227786 5205 385798
17271 385798 415859 25493 192854 282744 206876 -99321 38072 13491 160483 174207 139084
$$ packed form
17351E5193a43035C06629K2661D7501K17431O8896c7537F1016a77129O0673F8771
17339F5865O4503Q1168b6134B62102Q42j07817K1921B4393J95339h164B42945
17327F3427j6892J6276P330J53361E0465K61440f5903D0355L88793A98768G2786
17315H617M07657b0189A17910L5921h6399A12136b76091C55876j54737J5609L50917
17304E67665H4511a47109B12078n3273k6671K05617f3611A98555o3950l6891J19707
17293B17421p3138B8656J30048p84l2313o0303K72572m8683H9297M05177k10480
17282B83994l560g2344G7970N7537L61311h5360b7979A52729P5057E205L80593
17271C85798L0061B5493J67361Q9890p5868i9321C8072A3491J46992J3724l5123
$$ plain form
17260 139084 62776 416755 251885 -31560 486406 81809 -39724 -115209 492826 123726
17249 271611 -104409 170668 114280 364340 122470 88163 182612 194665 164918 423338
17239 423338 543025 -33096 221959 117939 -18627 226483 -72515 332467 317076 312822 30895
17227 139119 85236 19408 -43798 298776 568843 290677 125342 66480 551324 -93174
17216 465335 158851 -27281 244996 248794 214833 422244 98436 163117 477654 305068 77192
17204 105626 585874 81712 301209 -269796 281373 -30219 271664 260018 338430 224725
17194 224725 342664 247357 323825 677353 194631 -70532 100652 265806 168095 -182581
17183 470257 463515 390900 167315 503459 71337 356621 396531 66437 264955 257886 119256
$$ packed form
17260A39084F2776L53979j64870c1560D86406H1809c9724p5485D92826A23726
17249B71611a04409A70668n6388K50060A22470l4307R4449J2053k9747K58420
17239D23338J19687c3096B21959j04020a8627B26483g2515C32467j5391m254C0895
17227A39119n3883A9408d3798B98776K70067k78166A25342n8862M84844i3174
17216D65335A58851b7281B44996L798l3961K07411I8436O4681L14537j72586G7192
17204A05626M80248H1712K19497b69796B81373c0219B71664j1646P8412j13705
17194B24725J17939r5307P6468L53528A94631g0532A00652J65154r7711a82581
17183D70257o742p2615A67315L36144G1337K85284L9910F6437J98518p069A19256
$$ plain form
17171 319225 60143 303131 -161257 522868 23090 172758 178468 45437 92556 404894 333406
17160 333406 577338 506832 500083 203062 317252 498540 170490 118663 271744 216977
17150 216977 446924 481822 231775 286226 49455 247890 259125 442834 439661 187860 342369
17139 342369 -82211 203398 404937 278880 208690 442089 -15641 275902 318207 196607
17129 196607 568046 -32444 82644 727745 -23458 670845 377109 381461 528477 522475 362350
17118 362350 386153 235489 411901 177617 500216 451138 63529 425334 299096 637599
17108 637599 411238 -53475 165705 344910 246340 473440 415314 642077 525116 231430
17097 331586 227142 812943 596193 449576 269739 355853 412562 575712 499067 584104
$$ packed form
17171C19225F0143K42988a61257E22868B3090J49668N710D5437M7119L12338p1488
17160C33406K43932p0506o749B03062J14190J81288A70490n1827J53081n4767
17150B16977K29947L4898B31775N4451D9455J98435J1235J83709l173A87860J54509
17139C42369h2211B03398K01539j26057p0190K33399a5641B75902M2305j21600
17129A96607L71439c2444H2644O45101b3458F70845k93736M352J47016o002j60125
17118C62350K3803j50664J76412A77617L22599m9078F3529L61805j26238L38503
17108F37599k26361e3475A65705J79205r8570K27100n8126K26763j16961B31430
17097C31586j04444N85801k16750j46617j79837Q6114N6709J63150p6645Q5037
$$ plain form
17087 584104 452931 798376 632064 269523 338966 695976 289679 409919 272356 497208
17077 497208 487308 -8584 683525 713058 577372 683498 592415 679114 541361 561125 517158
17066 517158 721499 576457 404920 358090 582006 719700 336974 849044 540731 707566
17056 707566 579321 438823 647188 595926 531918 382406 549836 431207 707544 416999
17046 416999 726795 394143 903329 539860 619625 202008 700835 601202 685351 808416
17036 808416 692883 801842 638494 482735 739372 934900 701968 796205 284998 486051
17026 486051 672136 490541 686966 404298 827543 868691 626636 522404 506366 535096
17016 535096 542533 328850 731036 533570 621433 754800 612356 750092 615694 566096
$$ packed form
17087E84104j31173L45445j66312B69523O9443L57010B89679J20240j37563K24852
17077D97208r900h584F83525K9533j35686J06126r1083Q6699j37753J9764m3967
17066E17158K04341j45042j71537m6830K23916J37694C36974N12070l08313J66835
17056G07566j28245j40498K08365n1262o4008j49512J67430j18629K76337k90545
17046D16999L09796l32652N09186l63469P9765B02008M98827r9633Q4149J23065
17036H08416j15533J08959j63348j55759K56637J95528k32932R4237B84998K01053
17026D86051J86085j81595J96425k82668M23245M1148k42055j04232j6038K8730
17016E35096P437k13683M02186j97466Q7863J33367j42444J37736j34398m9598
$$ plain form
17006 566096 792184 768867 968484 868418 633630 427112 596138 668244 504201 769527
16996 769527 738692 434691 1038516 1168810 911800 676040 1016401 1032049 892797 780926
16986 780926 700012 677245 817079 798458 903085 979238 943240 831850 885682 742245 930172
16975 930172 790823 839453 986226 648857 1123647 1056870 1085680 989162 727822 972805
16965 972805 1112753 1070696 1050604 1151181 1103058 1304147 961451 1028351 1217938 1239070
16955 1239070 1359247 1228409 1008208 1344635 742433 1177557 1368688 1356891 1251652 1143322
16945 1143322 1122846 1218349 1422579 1038289 947578 1359497 1467455 1607273 1297844 1591045
16935 1591045 1222487 1415180 1408712 1376809 1813247 1148052 1202374 1431652 1741129 1708501
$$ packed form
17006E66096K26088k3317J99617j00066k34788k06518J69026P2106j64043K65326
16996G69527l0835l04001O03825J30294k57010k35760L40361J5648j39252j11871
16986G80926q0914k2767J39834j8621J04627P6153l5998j11390N3832j43437J87927
16975I30172j39349M8630J46773l37369M74790o6777K8810r6518k61340K44983
16965I72805J39948m2057k0092J00577m8123K01089l42696O6900J89587K1132
16955A239070J20177j30838k20201L36427o02202M35124J91131j1797j05239j08330
16945A143322k0476R5503K04230l84290r0711M11919J07958J39818l09429K93201
16935A591045l68558J92693o468l1903M36438o65195N4322K29278L09477l2628
$$ plain form
16925 1708501 1682801 1706478 1344056 1577773 1826565 1298201 1385909 1633780 2001322 1662467
16915 1662467 1479267 1517782 1862991 1482873 1763814 1903986 1600910 1804838 1460825 1796374
16905 1796374 1731092 1465785 1829728 1918341 2152557 1803639 1922396 1808237 1800332 1947424
16895 1947424 1902041 1780714 1687367 2099527 1874220 2132520 2154176 2183234 1934401 2140309
16885 2140309 2138978 2267381 2290339 1990726 2464879 2243425 2327687 2266220 2513981 2462967
16875 2462967 2301783 2788668 2323474 2374989 2550613 2807787 3041707 2848484 2817719 3022701
16865 3022701 2845839 2831062 2810793 3133296 3035447 3316831 3079060 3071564 3253320 3298561
16855 3298561 3533900 3649669 3363840 3635111 3519263 3435946 3512043 3631754 4045196 3986932
$$ packed form
16925A708501k5700K3677l62422K33717K48792n28364Q7708K47871L67542l38855
16915A662467j83200L8515L45209l80118K80941J40172l03076K03928l44013L35549
16905A796374o5282k65307L63943Q8613K34216l48918J18757j14159p905J47092
16895A947424m5383j21327r3347M12160k25307K58300K1656K9058k48833K05908
16885B140309j331J28403K2958k99613M74153k21454Q4262o1467K47761n1014
16875B462967j61184M86885m65194N1515J75624K57174K33920j93223l0765K04982
16865C022701j76862j4777k0269L22503r7849K81384k37771p496J81756M5241
16855C298561K35339J15769k85829K71271j15848q3317P6097J19711M13442n8264
$$ plain form
16845 3986932 3454556 4147673 3864855 4288516 4061871 4478845 3978424 4191507 3941290
16836 3941290 4486560 4424878 4452956 4926151 4616707 4937082 5146301 5120432 5074929 5413317
16826 5413317 5701834 5605969 5691083 5645923 5967398 6115012 5867126 6145678 6268451 6423043
16816 6423043 6279388 6532228 6561393 6753289 7004628 7076717 7119251 7183190 7392019 7755035
16806 7755035 7628433 8043453 8444802 8348687 8457611 8895570 9148581 9362419 9532066 9877135
16796 9877135 9856658 9962155 10392728 10921088 10993806 10829270 11450753 11534838 11929254 12485781
16786 12485781 12521958 13130573 13064588 13463279 14133978 14563320 14790632 15185637 15803884 16141240
16776 16141240 16826414 17309471 18214867 18381004 19177260 19746122 20067006 21226341 21752939
$$ packed form
16845C986932n32376O93117k82818M23661k26645M16974n00421K13083k50217
16836C941290N45270o1682K8078M73195l09444L20375K09219k5869m5503L38388
16826E413317K88517r5865Q5114m5160L21475J47614k47886K78552J22773J54592
16816F423043j43655K52840K9165J91896K51339P2089M2534O3939K08829L63016
16806G755035j26602M15020M01349r6115J08924M37959K53011K13838J69647L45069
16796I877135k0477J05497M30573N28360P2718j64536O21483Q4085L94416N56527
16786A2485781L6177O08615o5985L98691O70699M29342K27312L95005O18247L37356
16776A6141240O85174M83057R05396J66137P96256N68862L20884J159335N26598
$$ plain form
16767 21752939 22637788 23417610 24383326 25575552 26438600 27241974 28280714 29198002 30417205
16758 30417205 31481751 33016525 34324454 35677017 37159910 39012497 40886050 42589974
16750 42589974 44631309 46512331 48745231 51257350 53733763 56238102 58855737 62108198
16742 62108198 65002093 68555481 72100232 75953121 79818581 84789651 88982150 93652038
16734 93652038 98727868 104080331 109396417 115477530 121357534 127380895 133686468 139801544
16726 139801544 145982272 151857239 157638564 162805116 167875240 172155230 175428882 178415044
16718 178415044 180104543 181153682 180632406 179689547 177596889 174804859 170983335 166576304
16710 166576304 161429542 155965038 149896160 144471730 137999906 131686511 125476855 119634295
$$ packed form
16767B1752939Q84849P79822R65716J192226Q63048Q03374J038740R17288J219203
16758C0417205J064546J534774J307929J352563J482893J852587J873553J703924
16750D2589974K041335J881022K232900K512119K476413K504339K617635L252461
16742F2108198K893895L553388L544751L852889L865460M971070M192499M669888
16734I3652038N075830N352463N316086O081113N880004O023361O305573O115076
16726A39801544O180728N874967N781325N166552N070124M279990L273652K986162
16718A78415044J689499J049139n21276r42859k092658k792030l821524m407031
16710A66576304n146762n464504o068878n424430o471824o313395o209656n842560
$$ plain form
16702 119634295 113726917 107871767 102272069 96732033 91703959 86989145 82392342 77997907
16694 77997907 74676646 70459992 66933730 63900350 60428556 57501135 54665132 51752265
16686 51752265 49544206 47276257 44970157 42937613 41262184 39333943 37501380 35852211
16678 35852211 34520373 33060385 31454451 30505336 29284376 28227494 26986314 25941418
16670 25941418 25245031 24056068 23571851 22448954 21745676 21154005 20168863 19505955 18854326
16661 18854326 18296338 17872778 17078538 16713942 16146725 15672533 15370609 14817625 14190757
16652 14190757 13877123 13433327 13120297 12492605 12309999 11881455 11855083 11437206 11107763
16643 11107763 10928639 10348397 10194476 10070114 9628443 9413158 9061058 8743077 8599991
$$ packed form
16702A19634295n907378n855150n599698n540036n028074m714814m596803m394435
16694G7997907l321261m216654l526262l033380l471794k927421k836003k912867
16686E1752265k208059k267949k306100k032544j675429j928241j832563j649169
16678C5852211j331838j459988j605934r49115j220960j056882j241180j044896
16670B5941418o96387j188963m84217j122897p03278n91671r85142o62908o51629
16661A8854326n57988m23560p94240l64596n67217m74192l01924n52984o26868
16652A4190757l13634m43796l13030o27692j82606m28544k6372m17877l29443
16643A1107763j79124n80242j53921j24362m41671k15285l52100l17981j43086
$$ plain form
16634 8599991 8245609 8293789 8308938 8169573 7831940 7616275 7211880 7165557 7366674 7362177
16624 7362177 6862309 7049525 6487889 6553169 6590949 6108369 6107225 6182612 5679632 5673621 5457390
16613 5457390 5483227 5437516 5344202 5020136 4867455 4988990 4622825 4780818 4444425 4589058
16603 4589058 4357308 4387031 4293264 4069328 4231057 4057260 4021038 4146606 3840693 4212805
16593 4212805 3839043 3780599 3824632 3640955 3445911 3899931 3757467 3543796 3258087 3282135
16583 3282135 3308791 3340229 3198459 3460301 3130348 3097010 2919002 2866221 2871638 2811742 2874139
16572 2874139 2698309 2680235 2887098 2481398 2579780 2412832 2543372 2505422 2711587 2474564
16562 2474564 2377532 2379994 2391827 2236186 2453664 2592377 2259818 2196877 2289457 2275445 2075673
$$ packed form
16634H599991l54382M8180J5149j39365l37633k15665m04395m6323K01117m497
16624G362177m99868J87216n61636O5280L7780m82580j144P5387n02980o011k16231
16613E457390K5837m5711r3314l24066j52681J21535l66165J57993l36393J44633
16603D589058k31750K9723r3767k23936J61729j73797l6222J25568l05913L72112
16593D212805l73762n8444M4033j83677j95044M54020j42464k13671k85709K4048
16583C282135K6656L1438j41770K61842l29953l3338j78008n2781N417n9896O2397
16572B874139j75830j8074K06863m05700R8382j66948J30540l7950K06165k37023
16562B474564r7032K462J1833j55641K17478J38713l32559o2941R2580j4012j99772
$$ plain form
16551 2075673 2234680 1858117 2192250 1668892 2260682 1973390 2179781 2054479 2243272
16542 2243272 1730124 1873682 1938911 1815475 1910221 1978175 1617667 1821359 1834414 1561320
16532 1561320 1626342 1807451 1830352 1368434 1438814 1481715 1610585 1554211 1661560 1807583
16522 1807583 1207497 1299983 1405460 1697286 1448414 1298067 1266127 1446689 1601504 1281299
16512 1281299 1034630 1337422 1292806 1211049 1318448 1489586 1391185 1215571 1305956 1220373
16502 1220373 1205469 1315114 1079541 1291150 986712 857146 1431254 1334838 1378307 784719
16492 784719 1326059 1199747 790787 1308919 916234 1146673 1232248 1180365 1063818 1269000
16482 1269000 944043 973591 914761 1074018 1182921 1273773 1294681 1073729 992473 849358
$$ packed form
16551B075673J59007l76563L34133n23358N91790k87292K06391j25302J88793
16542B243272n13148J43558O5229j23436R4746O7954l60508K03692J3055k73094
16532A561320O5022J81109K2901m61918P0380M2901J28870n6374J07349J46023
16522A807583o00086R2486J05477K91826k48872j50347l1940J80562J54815l20205
16512A281299k46669L02792m4616q1757J07399J71138r8401j75614R0385q5583
16502A220373j4904J09645k35573K11609l04438j29566N74108r6416M3469n93588
16492G84719N41340j26312m08960N18132l92685K30439Q5575n1883j16547K05182
16482A269000l24957K9548n8830J59257J08903R0852K0908k20952q1256j43115
$$ plain form
16472 849358 919852 1086340 541323 821870 845569 707523 911487 1100922 940006 625799
16462 625799 1008957 840206 716794 844773 622757 845458 834227 584524 570009 972058
16452 972058 775943 701856 833588 758698 877266 726846 749932 639072 530163 604008
16442 604008 709015 945074 1022759 750684 937395 678172 941659 769637 986925 658792
16432 658792 504902 815847 580093 332419 455814 476664 614527 885582 748192 768514
16422 768514 435481 693841 252600 527494 901199 756588 609515 725490 670134 484372
16412 484372 306414 750935 473016 738437 568858 618864 387947 618675 551365 322951
16402 322951 651338 753457 476950 701261 434277 552424 461571 356775 479017 510199
$$ packed form
16472H49358P0494J66488E41323K80547K3699j38046K03964J89435j60916l14207
16462F25799L83158j68751j23412J27979k22016K22701j1231k49703j4515M02049
16452I72058j96115p4087J31732p4890J18568j50420K3086j10860j08909P3845
16442F04008J05007K36059P7685k72075J86711k59223K63487j72022K17288l28133
16432F58792j53890L10945k35754k47674J23395K0850J37863K71055j37390K0322
16422G68514l33033K58360B52600K74894L73705j44611j47073J15975n5356j85762
16412D84372j77958M44521k77919K65421j69579N0006k30917K30728o7310k28414
16402C22951L28387J02119k76507K24311k66984J18147r0853j04796J22242L1182
$$ plain form
16392 510199 355057 428395 612107 533145 374684 260692 438184 406305 390382 425630
16382 425630 211277 405381 376007 497241 290894 497006 374592 437744 163509 191383
16372 191383 509605 310339 346241 318158 514115 425019 344223 743958 75992 592505
16362 592505 507562 364008 234295 331087 318938 376929 386716 604968 282561 308470 47764
16350 606577 373967 101814 202266 289048 271021 505632 494115 108064 419420 282974
16340 282974 228751 444538 296816 443135 185804 119329 486043 268662 487571 365906
16330 365906 209364 223639 115381 558689 143783 225403 516535 205510 309580 123977
16319 26737 243770 591632 370940 142131 265589 508751 331020 122753 458942 223534
$$ packed form
16392E10199j55142P3338J83712p8962j58461j13992J77492l1879j5923L5248
16382D25630B11277J94104k9374J21234k06347K06112j22414O3152A63509K7874
16372A91383L18222j99266L5902k8083J95957q9096q0796L99735G5992N16513
16362E92505q4943j43554j29713R6792j2149N7991R787K18252B82561K5909D7764
16350F06577k32610A01814J00452Q6782j8027K34611j1517A08064L11356j36446
16340B82974n4223K15787j47722J46319A85804o6475L66714k17381K18909j21665
16330C65906j56542J4275j08258M43308A43783Q1620K91132B05510J04070A23977
16319B6737K17033L47862k20692A42131J23458K43162j77731A22753L36189B23534
$$ plain form
16308 185248 221885 572719 461404 229096 322304 332510 380261 489092 208122 247484
16298 247484 130609 315691 227030 241477 271982 108090 426204 86229 335969 119815
16287 369307 481268 189304 404015 111887 267866 -146164 254858 121952 326625 537366
16277 537366 253826 296278 169571 72151 3449 333048 172129 -267029 -1862 341693 167803
16265 166979 173511 378530 270532 182218 193937 281617 6850 86011 202288 -178145 38476
16253 -17665 -83645 -47666 -161303 -316241 -47861 175984 -23740 262863 166309 179202 141701
16242 141701 178097 138904 -170028 132433 317697 323322 154164 74920 103833 -177998 -46900
16230 136288 119895 272613 179452 19148 -177587 352376 293126 -58666 184016 250186 63196
$$ packed form
16308A85248L6637L50834j11315B29096R3208J0206M7751J08831B08122L9362
16298B47484j16875J85082q8661J4447L0505A08090L18114H6229K49740A19815
16287C69307J11961A89304K14711A11887J55979a46164B54858A21952K04673K10741
16277E37366B53826M2452j26707G2151C449L29599j60919b67029a862C41693A67803
16265A66979O532K05019j07998q8314J1719Q7680F850P9161J16277a78145C8476
16253a7665o5980L5979j13637j54938d7861A75984b3740B62863r6554J2893l7501
16242A41701L6396l9193a70028A32433J85264N625A54164G4920K8913a77998d6900
16230A36288j6393J52718r3161A9148a77587C52376n9250e8666A84016O6170F3196
$$ plain form
16218 102395 -221622 347232 141109 327336 -153290 154921 -23878 140778 574053 -40671
16207 491317 204236 -1266 278245 182924 308788 -60037 67720 24052 164729 218370 52240
16195 -273020 158276 142268 -150497 183441 -33475 231404 -13044 50531 193416 198247 -47694
16183 283471 499785 297474 -90223 321343 84103 187501 301286 4273 161116 347220
16173 347220 -135938 -35905 378897 114226 120568 38983 -172713 -24833 74508 79505 -28672
16161 43170 247099 -150416 -37227 244365 88439 -44800 -95695 -78026 188143 -107738 118553
16149 -89611 136843 -117060 445274 277179 425674 -14482 -177872 89744 218428 -94356
16138 61313 76333 -34050 -123106 331741 266383 -101326 40457 145479 75016 -198800 264479
$$ packed form
16218A02395b21622C47232A41109J86227a53290A54921b3878A40778M33275d0671
16207D91317B04236a266B78245r5321J25864f0037F7720B4052J40677N3641E2240
16195b73020A58276j6008a50497A83441c3475B31404a3044E0531J42885M831d7694
16183B83471K16314k02311i0223C21343H4103J03398J13785D273J56843J86104
16173C47220a35938c5905C78897A14226O342C8983a72713b4833G4508M997b8672
16161D3170K03929a50416c7227B44365H8439d4800n0895J7669A88143a07738A18553
16149h9611A36843a17060D45274j68095J48495a4482j63390H9744J28684i4356
16138F1313J5020c4050q9056C31741o5358a01326D0457J05022p0463a98800B64479
$$ plain form
16126 50549 104796 155955 -133965 125582 30173 28967 406422 -128797 -16703 29974 215177
16115 215177 203088 -374163 -127510 -62097 40559 -253846 -11636 43032 101452 193919 256768
16104 256768 363835 -4066 80901 -134199 325754 221958 226099 286830 -21543 15677 35391
16093 35391 170439 -24175 214645 -52644 -403357 -149659 145485 -181506 150789 549291
16083 549291 65314 -68809 204483 -21116 -221109 -53191 44679 255018 -267816 40142 -138881
16071 417800 -86504 -23786 49295 -90094 -35979 -133964 125732 89279 31358 9774 5506 -57640
16058 228498 -478028 195567 161919 -220191 71346 126184 243230 61645 -60618 104010
16047 -254852 -255540 -118863 -407729 174722 -260780 188698 279040 240328 147165 163096 139236
$$ packed form
16126E0549N4247N1159a33965A25582C0173j206L77455a28797a6703B9974J85203
16115B15177j2089c74163a27510f2097D0559b53846a1636D3032N8420R2467O2849
16104B56768J07067d066H0901a34199C25754j03796M141O0731b1543A5677J9714
16093C5391J35048b4175B14645e2644l50713a49659A45485a81506A50789L98502
16083E49291F5314f8809B04483b1116j99993e3191D4679K10339b67816D0142a38881
16071D17800h6504b3786D9295i0094c5979r7985A25732l6453C1358I774m268e7640
16058B28498d78028A95567l3648b20191G1346N4838J17046F1645f0618A04010
16047b54852o88a18863k88866A74722b60780A88698R0342l8712r3163J5931k3860
$$ plain form
16036 139236 102045 223516 -295893 16283 13204 -160158 -3895 -299663 -18512 108652 -8014
16024 -277218 236831 -42828 376344 28 -74270 -389462 425842 -75590 -15031 -297872 -53568
16012 120039 -156983 35974 -454996 181633 248039 -110433 101475 -78168 -202341 254974
16001 201126 108866 49898 -65097 68890 142529 -42709 -225862 261782 152647 266573 -117145
15989 -70858 -40288 52194 -34863 -41890 2408 437246 147564 373968 56130 -53882 -220140
15978 -220140 45166 27313 -13628 112208 -7092 58580 -26050 -115219 -90364 -214895 172722
15966 656464 -159506 -65626 154000 391895 223606 59653 -69655 -489284 -29475 -46113
15956 -46113 -91149 107646 293845 -71290 175074 165172 -44553 -24372 265613 272017 229041
$$ packed form
16036A39236l7191J21471b95893A6283l079a60158c895k95768a8512A08652h014
16024b77218B36831d2828C76344B8g4270l15192D25842g5590a5031k82841e3568
16012A20039a56983C5974d54996A81633O6406a10433A01475g8168j24173B54974
16001B01126r2260D9898f5097F8890P3639d2709j83153B61782j09135J13926a17145
15989g0858L0570E2194c4863p027B408M34838A47564K26404E6130e3882j66258
15978b20140D5166j7853a3628A12208g092E8580b6050q9169K4855j24531A72722
15966F56464a59506f5626A54000K37895j68289E9653f9655m19629b9475j6638
15956d6113m5036A07646J86199g1290A75074r902d4553K0181B65613O404m2976
$$ plain form
15945 229041 -137645 36254 -252737 -87085 87970 113490 74128 48616 39005 126269 85615
15934 85615 -142681 153240 69491 -240215 130171 203560 -106829 126293 -103288 316693
15923 74720 244473 328209 -256435 -195543 217293 -133676 -58261 -13144 -31951 -174142 15205
15911 91217 -96278 -92559 -151838 267274 7942 -345501 -145728 -84732 -116577 -167637 -134551
15900 -134551 30964 -98314 -73966 -37451 99994 -63813 -47631 -268281 14262 40785 239774
15889 239774 197417 -79588 500822 -47030 25362 41114 -63896 239381 -48906 264263 -80636
15877 -296632 -208603 293167 -78336 -98523 412269 36175 33556 -35579 -107444 1405 -28346
15865 130437 -326600 61575 253052 -119995 98496 19737 303197 -177762 -89406 -80167 -371916
$$ packed form
15945B29041a37645C6254b52737h7085H7970K5520l9362k5512r611Q7264m0654
15934H5615a42681A53240F9491b40215A30171P3389a06829A26293a03288C16693
15923G4720J69753Q3736b56435O0892B17293a33676e8261a3144j8807j42191A5205
15911I1217i6278L719n9279B67274G942c45501a45728O0996l1845n1060L3086
15900a34551C0964i8314K4348L6515I9994f3813J6182k20650A4262K6523J98989
15889B39774m2357g9588E00822d7030B5362J5752f3896B39381d8906B64263h0636
15877b96632Q8029B93167g8336k0187D12269C6175k619c5579p1865A405b8346
15865A30437c26600F1575J91477a19995I8496A9737K83460a77762Q8356R239k91749
$$ plain form
15854 -371916 -87137 -68820 -206519 -231593 140867 -23899 57862 75683 -79498 87211 -157103
15842 109931 240701 -75424 102123 -12597 75277 83367 -96220 -1570 -115487 -322503 -198671
15831 -198671 72606 -446829 -121035 -377650 88128 -215924 269765 197206 -104683 -293009
15821 -293009 -109233 -243846 -114410 -176466 -32485 41889 -187253 -3032 -60325 -57046 270224
15809 -323504 -187146 -9898 -169562 -185630 6910 -86015 49514 -145699 -70050 72937 268674
15798 268674 38369 -249382 -10824 151663 -95591 56639 133924 -147735 -51764 -100642 -46328
15786 11655 108667 48664 268244 106360 136526 -31740 -132880 100002 49626 19816 -84683
15774 -183141 204516 -173946 -43635 -23897 -296497 -23049 45054 -74179 53163 62644 -333764
$$ packed form
15854c71916h7137J8317j37699k5074A40867b3899E7862J7821g9498H7211a57103
15842A09931J30770g5424A02123a2597G5277Q090i6220a570j13917k07016J23832
15831a98671G2606d46829a21035k56615H8128b15924B69765p2559a04683j88326
15821b93009a09233j34613a14410o2056c2485D1889a87253c032n7293L279B70224
15809c23504J36358i898j59664j6068F910h6015D9514a45699g0050G2937J95737
15798B68674C8369b49382a0824A51663i5591E6639P7285a47735e1764m8878d6328
15786A1655R7012D8664K19580A06360L0166c1740j01140A00002D9626A9816h4683
15774a83141B04516a73946d3635J9738k72600b3049D5054g4179E3163R481c33764
$$ plain form
15762 -139102 109095 -123608 -295044 -92381 263249 -205643 -75008 112786 -1843 265345
15751 -150624 242250 -34810 205261 103591 -150987 -31445 -352287 -111791 258562 201369
15741 201369 -44866 -105295 -26726 105305 45693 2075 -162525 -192224 -55900 -150158 -155413
15730 -155413 -267671 -319272 -232290 151974 92093 -72434 -48130 178853 -115364 -90778 -93359
15719 -93359 10685 64267 -153834 -51104 -341973 94598 11325 -176836 211775 162304 8472
15707 65221 -74037 45309 15491 -13059 -262388 93973 188034 101253 120562 184314 -138034
15695 -132984 122672 1295 -77809 60764 305069 258883 109199 -20248 -123226 185787 62167
15683 -68402 57409 -42789 -13051 -94507 -212812 19204 -57683 -8850 -35901 221624 33702
$$ packed form
15762a39102A09095a23608j71436i2381B63249b05643g5008A12786a843B65345
15751a50624B42250c4810B05261j01670a50987c1445l20842a11791B58562n7193
15741B01369d4866o0429b6726A05305D5693B075a62525k9699e5900r4258n255
15730a55413j12258n1601Q6982A51974n9881g2434K4304A78853a15364K4586k581
15719i3359A0685N3582a53834e1104k90869I4598A1325a76836B11775m9471H472
15707F5221g4037D5309A5491a3059k49329I3973R4061q6781J9309O3752a38034
15695a32984A22672A295g7809F0764K44305m6186A09199b0248j02978A85787F2167
15683f8402E7409d2789a3051q1456j18305A9204e7683h850k7051B21624C3702
$$ plain form
15671 11169 -187990 231959 123409 -5149 -81305 -16764 216460 -333516 299644 -227999
15660 -40076 -263502 -113500 -74534 24422 25069 -163864 62896 23165 -284259 -104745 -203714
15649 -203714 -356090 -311723 -41837 -148844 -266920 108729 -296316 28251 214425 22962
15638 124933 204701 -112048 63162 18556 93495 -51443 -182610 -58823 62145 -10284 47822
15626 336798 -596 -108500 -186574 -215286 97115 390994 1694 43479 -1409 106142 -338735
15614 290195 121602 -175944 -60626 -140486 -211442 60958 52120 15568 -99320 -55728 199093
15602 133136 117785 -19623 36491 35647 -210326 268846 -120688 -188812 162140 23189 -137388
15590 -272026 84137 -46394 55295 -43832 -130464 97843 -163716 -44217 113427 114857 37929
$$ packed form
15671A1169a87990B31959j08550e149p6156a6764B16460c33516B99644b27999
15660d0076k23426a13500L8966B4422O47a63864F2896B3165b84259a04745r8969
15649b03714j52376M4367d1837j07007j18076A08729b96316B8251J86174B2962
15638A24933P9768a12048F3162A8556P4939e1443j31167e8823F2145a0284D7822
15626C36798e96j07904p8074k8712I7115K93879A694M1785a409A06142c38735
15614B90195A21602a75944f0626p9860p0956F0958q838A5568i9320M3592A99093
15602A33136j5351a9623C6491q44b10326B68846a20688o8124A62140B3189a37388
15590b72026H4137d6394E5295d3832q6632I7843a63716d4217A13427J430C7929
$$ plain form
15578 66257 103264 -38033 49074 -102974 -304575 -606209 8274 -25906 31456 236916 166698
15567 166698 102675 172179 123935 -253488 -195032 -26768 226366 225916 -202533 188375 -96602
15555 -125064 -56773 22352 190160 80476 358834 -35640 -168663 312588 -167264 173001
15544 -127770 -201243 -243464 18215 -435769 65064 -87876 -329703 355104 153580 -22510 210221
15532 -131278 -404190 17100 178304 142168 -147902 -245910 221160 -298731 -177710 12328
15521 5878 92041 19231 -86959 -75113 245829 85875 -338429 416651 -21687 69332 95083
15510 95083 -10261 215777 -127301 -229698 -105513 108877 274754 -10709 18218 125149
15500 125149 257429 192173 -95749 -49964 -31255 -249692 -125183 -133556 397200 37711 -2422
$$ packed form
15578F6257L7007c8033D9074a02974k01601l01634H274b5906C1456K05460p0218
15567A66698o4023O9504m8244b53488N8456b6768B26366m50b02533A88375i6602
15555a25064e6773B2352J67808H0476K78358c5640j33023C12588a67264A73001
15544a27770p3473m2221A8215d35769F5064h7876k41827C55104A53580b2510B10221
15532a31278k72912A7100J61204l6136a47902r8008B21160b98731J21021A2328
15521E878Q6163A9231h6959J1846B45829H5875c38429D16651b1687F9332K5751
15510I5083a0261B15777a27301j02397a05513A08877J65877a0709A8218J06931
15500A25149J32280o5256i5749M5785J8709k18437J24509q373C97200C7711b422
$$ plain form
15488 -77575 -91436 -75460 -153913 112712 14981 -139779 145474 -231913 -102902 -174202 -84622
15476 121166 -65994 -68551 -128079 -62408 322557 31804 -282751 371379 4890 38 55720 -225350
15463 262882 -178701 -169369 136888 1467 71153 86487 -89316 82113 -68543 -143910 92128
15451 194445 -160731 -228416 243099 163079 -387743 67060 151144 188822 351565 134253
15440 -269060 119827 -121520 254288 299323 -276509 -123953 -315366 -53246 -280874 -182026
15430 -182026 -153666 -36843 210228 390004 78264 -301921 62639 118876 -145441 -212733 -1011
15418 -25484 293441 -70326 -29470 -228221 -106150 111598 -8259 -13459 481448 13219 115364
15407 115364 41425 -180208 38462 -50593 -248801 101648 6966 206850 200230 -265820 -229023
$$ packed form
15488g7575j3861J5976p8453A12712A4981a39779A45474b31913a02902p1300h4622
15476A21166f5994k557n9528f2408C22557C1804b82751C71379D890C8N5682b25350
15463B62882a78701R332A36888A467O9686J5334h9316H2113f8543p5367I2128
15451A94445a60731o7685B43099q0020c87743F7060Q4084L7678J62743A34253
15440b69060A19827a21520B54288M5035b76509a23953j91413e3246k27628R8848
15430a82026K8360c6843B10228J79776G8264c01921F2639N6237a45441o7292a011
15418b5484B93441g0326b9470j98751a06150A11598h259n200D81448A3219J02145
15407A15364D1425a80208C8462e0593j98208A01648F966J99884o620b65820L6797
$$ plain form
15396 -229023 -107946 151890 -9629 -63000 -324719 347848 -318888 189774 247468 83092
15385 -191613 -140103 100198 -125173 31397 -545812 38014 93309 -103297 70214 208929
15375 208929 -113094 131329 35644 -116049 -92160 -227261 397436 36117 -181596 -51852
15364 -381626 217651 165257 -27718 -236381 257617 43108 -122755 171637 23596 -163107
15353 -186108 -193196 398960 -65117 25877 94915 377933 -251727 -321424 217668 -64236 -230989
15342 -230989 69499 -49747 -244500 72719 -249652 7477 174783 51565 21869 44634 -257924
15330 417857 10347 178289 485378 154525 71050 53072 113286 -14604 291089 -165624
15319 -219574 -15515 169025 -332769 -39271 -74049 57754 -27708 154170 161721 183609 -153871
$$ packed form
15396b29023a07946A51890i629n3371k61719C47848c18888A89774N7694H3092
15385a91613N1510A00198a25173C1397e45812C8014N5295a03297G0214J38715
15375B08929a13094A31329C5644a16049K3889j35101C97436C6117a81596e1852
15364c81626B17651n2394b7718k08663B57617D3108a22755A71637B3596a63107
15353a86108p088C98960f5117B5877O9038K83018b51727o9697B17668f4236j66753
15342b30989F9499d9747j94753G2719b49652G477J67306E1565B1869K2765b57924
15330D17857A0347J67942L07089A54525G1050j7978O0214a4604B91089a65624
15319b19574a5515A69025c32769c9271l4778E7754b7708A54170P551K1888a53871
$$ plain form
15307 67362 -115190 -116899 -141734 138434 82435 -287187 -175753 411045 37222 21804 -41441
15295 125181 -179886 60973 50947 17053 -75166 68127 284740 220721 211674 270174 266086
15284 266086 20487 -66152 289820 83872 14930 -20283 131357 350347 -51195 288971 227284
15273 227284 -181899 178288 -69312 253775 -85540 119231 -19127 -117146 -41893 14966 293990
15262 293990 437926 -139467 -135237 75454 134820 540203 -216761 148130 126838 -88756 -320689
15251 -320689 133403 247203 854262 1940596 1073001 1423659 1681463 393943 633056
15242 633056 364748 -22738 467897 4096 308987 -98596 136800 -88573 195257 304375
15232 304375 23112 180109 60865 43194 92712 55314 66823 -14191 45474 -107640 214329
$$ packed form
15307F7362a15190j709k4835A38434n5999b87187J11434D11045C7222j5418d1441
15295A25181a79886F0973j0026A7053g5166F8127K16613o4019r047N8500m088
15284B66086B0487f6152B89820H3872A4930b0283A31357K18990e1195B88971o1687
15273B27284a81899A78288f9312B53775h5540A19231a9127r8019d1893A4966K79024
15262B93990J43936a39467M230G5454N9366M05383b16761A48130k1292h8756k31933
15251c20689A33403J13800O07059J086334q67595L50658K57804C93943K39113
15242F33056k68308b2738D67897D096L04891i8596A36800h8573A95257J09118
15232C04375B3112J56997F0865j7671M9518l7398J1509a4191D5474a07640B14329
$$ plain form
15220 102181 46505 50895 -104620 226359 40155 179075 408601 -81151 244800 168006 -131306
15208 68369 130964 22392 -108757 34334 -32335 16323 -2691 283608 -265507 -208195 294839
15196 156532 265235 260558 23126 117446 139310 110455 120018 265931 181005 -930 35404 397129
15184 397129 61561 108416 -251801 253218 33446 -129953 -196711 -19169 87028 -64304 -76097
15173 -76097 160417 -186843 44928 -193311 141704 2688 64054 255569 332624 209371 -66147
15161 358693 122895 -65715 35365 -121203 159631 180182 246072 336969 -101650 223766
15150 435033 14226 -32916 -31165 268772 72643 75520 106614 113174 135001 231192 -87796 -12692
15137 127338 -231593 134489 -7265 115833 240119 136264 127705 -164553 -125153 -33889 -182089
$$ packed form
15220A02181D6505M390a04620B26359D0155J38920K29526h1151B44800p6794a31306
15208F8369O2595B2392a08757C4334c2335A6323b691B83608b65507N7312B94839
15196A56532J08703m677B3126R4320K1864k8855R563J45913q4926i30C5404L61725
15184C97129F1561M6855b51801B53218C3446a29953o6758a9169H7028f4304j1793
15173g6097A60417a86843D4928a93311A41704B688O1366J91515P7055j23253f6147
15161C58693A22895f5715C5365a21203A59631K0551O5890R0897a01650B23766
15150D35033A4226c2916J751B68772G2643K877L1094O560K1827R6191h7796a2692
15137A27338b31593A34489g265A15833J24286j03855q559a64553L9400c3889j48200
$$ plain form
15126 -182089 -95518 121979 51483 208215 51688 393197 165748 31366 -126707 -11835
15115 313478 82772 -18311 -2969 -12610 121855 228183 387928 25853 -269815 271900 199312
15104 199312 -188859 165854 387140 146743 220385 -132939 348884 16695 155692 292244
15094 292244 431154 289047 82523 227112 128768 317835 447935 164233 -58087 110214
15083 -71316 203278 283071 192314 330005 -66935 -170323 57425 36240 451169 -13677 76860
15071 39649 290750 -74012 21082 -9511 -69953 -155241 -87131 140508 268096 238563 92010
15059 133251 112356 169047 57074 74047 302998 280394 34057 202404 72285 349191 131179
15047 199437 137761 223789 -13653 208402 318341 226570 59876 275531 -18155 290526 -311094
$$ packed form
15126a82089Q6571A21979E1483J56732E1688L41509A65748C1366a26707a1835
15115C13478H2772a8311b969r641A21855J06328J59745B5853b69815B71900p2588
15104A99312a88859A65854K21286A46743P3642a32939C48884A6695J38997J36552
15094B92244J38910j42107H2523J44589r8344J89067J30100A64233e8087A10214
15083g1316B03278P9793r0757J37691f6935j03388E7425k1185M14929a3677G6860
15071C9649K51101g4012B1082i511o0442q5288O8110A40508J27588k9533I2010
15059A33251k0895N6691E7074J6973K28951k2604C4057J68347G2285K76906A31179
15047A99437o1676Q6028a3653B08402J09939r1771E9876K15655a8155B90526c11094
$$ plain form
15035 7562 -167962 197447 260162 52295 254645 293952 321502 377999 -39711 32027 -30609
15023 74736 -164700 131127 167016 210283 312481 166082 -4285 -8281 140526 117971 -58160
15011 213249 66134 -2918 8105 265879 619106 136460 223476 246803 276053 30930 294496
15000 294496 161047 96817 133181 290114 123377 229939 31057 126390 64485 321188
14990 321188 41399 292982 114174 154487 427415 125032 41752 613654 289063 -52524
14979 -74838 551590 115247 480395 64935 231395 53427 322219 340833 424783 394120 -117449
14967 213148 509184 153959 39228 209947 116130 230263 258394 -38570 270577 119650
14956 454474 548745 154777 156095 376487 392382 416768 25190 242706 -33565 -53753 355767
$$ packed form
15035G562a67962A97447O2715E2295K02350L9307K7550N6497c9711C2027c0609
15023G4736a64700A31127L5889M3267J02198j46399d285l996A40526k2555e8160
15011B13249F6134b918H105K57774L53227A36460Q7016K3327K9250C0930K63566
15000B94496j33449o4230L6364J56933A23377J06562C1057R5333o1905K56703
14990C21188D1399K51583A14174M0313K72928A25032D1752N71902B89063e2524
14979g4838E51590A15247L65148F4935J66460E3427K68792J8614Q3950l0663a17449
14967B13148K96036A53959C9228J70719r3817J14133K8131c8570B70577A19650
14956D54474R4271A54777J318K20392J5895K4386B5190K17516c3565k0188C55767
$$ plain form
14944 437437 114199 82069 354237 66944 473973 138082 185671 199887 246611 344588 377577
14933 377577 375221 275907 266224 140149 238479 556676 95586 144405 550330 463662 284628
14922 284628 -23149 391016 20158 297179 439142 223452 571157 108718 436066 -79784
14911 506398 162643 431467 373147 223479 594169 280278 6169 134294 308086 114291
14900 285790 337598 338721 130021 470015 354180 324428 389025 603868 334500 461962
14890 461962 448770 324252 413287 363145 469591 408581 222583 257789 609803 539421 302407
14879 302407 121305 677701 588452 304607 462071 39148 262499 317721 64578 401247
14869 401247 342186 223928 422973 421521 467324 477908 64110 470465 525090 5678 544312
$$ packed form
14944D37437A14199l2130K72168F6944M07029A38082M7589J4216M6724R7977L2989
14933C77577k356r9314r683j26075R8330L18197I5586M8819M05925q6668j79034
14922B84628b3149C91016B0158K77021J41963k15690L47705A08718L27348g9784
14911E06398A62643K68824n8320j49668L70690B80278F169J28125J73792A14291
14900B85790N1808J123A30021L39994j15835k9752O4597K14843k69368J27462
14890D61962j3192j24518Q9035n0142J06446o1010j85998L5206L52014p0382k37014
14879C02407A21305N56396q9249k83845J57464C9148K23351N5222F4578L36669
14869D01247n9061j18258J99045j452M5803J0584F4110M06355N4625E678N38634
$$ plain form
14858 544312 322249 330715 203819 335872 351092 608184 457856 509374 161905 666061
14848 666061 697027 539191 403830 405721 538922 330844 225295 384318 490969 594113
14838 594113 548901 110610 793529 194978 365617 336489 143387 186619 293754 319491
14828 319491 796030 361181 603697 771256 755263 438574 222983 597619 702749 473519
14818 473519 435402 368182 370038 408675 608816 365590 484869 466150 744322 135797 750015
14807 750015 472623 531457 464589 464155 581092 905947 377892 171598 485698 366415
14797 366415 645775 497377 473790 759336 433919 542457 168870 452656 756737 663188
14787 663188 531748 572255 332344 160497 726189 598468 464953 546245 580888 784788
$$ packed form
14858E44312k22063Q466j26896J32053J5220K57092j50328N1518A61905N04156
14848F66061L0966j57836j35361J891J33201k08078j05549J59023J06651J03144
14838E94113m5212A10610O82919A94978J70639k9128A43387M3232J07135K5737
14828C19491M76539C61181K42516J67559j5993l16689k15591L74636J05130k29230
14818D73519l8117o7220J856L8637K00141k43226J19279j8719K78172A35797O14218
14807G50015k77392N8834o6868m34J16937L24855C77892A71598L14100j19283
14797C66415K79360j48398k3587K85546l25417J08538A68870K83786L04081r3549
14787F63188j31440M0507k39911A60497N65692j27721j33515Q1292L4643K03900
$$ plain form
14777 784788 618201 601226 463835 715417 380611 855456 707173 680211 557466 718175
14767 718175 723303 146703 404389 720375 526272 354431 688475 764672 877159 499078
14757 499078 528776 685030 532400 583420 609513 503063 965650 621593 649513 730712
14747 730712 1012535 566398 391950 973784 764287 628713 853209 555143 552625 879760
14737 879760 663578 937337 516886 949323 669951 630852 805169 568643 918335 750875
14727 750875 762070 1036283 1163568 746356 757015 636441 694737 864016 842835 674308
14717 674308 681659 860039 1027534 664251 538300 740952 616450 770339 1078449 909590
14707 909590 1007367 930964 841981 589362 902455 1053186 1095349 817853 887415 743517
$$ packed form
14777G84788j66587j6975j37391K51582l34806M74845j48283k6962j22745J60709
14767G18175N128A46703K57686L15986j94103j71841L34044P6197J12487l78081
14757D99078K9698J56254j52630N1020K6093j06450M62587l44057K7920Q1199
14747G30712K81823m46137j74448N81834k09497j35574K24496k98066k518L27135
14737H79760k16182K73759m20451M32437k79372l9099J74317k36526L49692j67460
14727G50875J1195K74213J27285m17212J0659j20574N8296J69279k1181j68527
14717F74308P351J78380J67495l63283j25951K02652j24502J53889L08110j68859
14707I09590R7777p6403q8983k52619L13093J50731M2163k77496O9562j43898
$$ plain form
14697 743517 935569 1019797 824212 1226638 711699 808984 952192 944939 746285 994831
14687 994831 1227011 841204 915407 1299837 975788 747787 1166904 924481 1090606 955289
14677 955289 1298581 949099 1136917 972596 940041 1280478 1286696 1099419 747687 749522
14667 749522 1472277 960170 1011287 1165770 953829 1309605 913435 989435 833079 728056
14657 728056 1004467 1015371 1127062 967749 1195916 1312967 1570253 1171903 1230022 1060804
14647 1060804 1390954 1424077 1311263 1183874 1191734 922249 1062042 1045893 1492233 1632575
14637 1632575 1358604 1149165 1289162 1418956 1443278 1455908 1586251 1574597 1266614 1144472
14627 1144472 1574851 1308648 1400143 1386972 1481051 1504153 1303220 1568429 1514765 1322612
$$ packed form
14697G43517J92052Q4228j95585M02426n14939R7285J43208p253j98654K48546
14687I94831K32180l85807P4203L84430l24049k28001M19117k42423J66125j35317
14677I55289L43292l49482J87818j64321l2555L40437O218j87277l51732J835
14667G49522P22755n12107N1117J54483k11941L55776l96170P6000j56356j05023
14657G28056K76411J0904J11691j59313K28167J17051K57286l98350N8119j69218
14647A060804L30150L3123j12814j27389P860k69485J39793j6149M46340J40342
14637A632575k73971k09439J39997J29794K4322J2630J30343j1654l07983j22142
14627A144472M30379k66203R1495j3171R4079K3102k00933K65209n3664j92153
$$ plain form
14617 1322612 1384113 1453583 1446040 1235943 1784440 1958634 1954803 1908468 1710956 1497278 1420056
14606 1420056 1794575 1818168 1349453 1697908 1643468 1641324 1755128 1780136 1752644 1699012 1435232
14595 1435232 1776452 1482802 1827470 2025754 1826496 1643731 1782747 1812424 1869111 1608644
14585 1608644 1845295 2185929 2165501 2160026 2237650 2197009 1867105 2253549 2452902 2015770
14575 2015770 2169358 2386432 2161641 2046109 2047975 2090069 2309956 2313909 2295639 2202174 2311670
14564 2311670 2198254 2444769 2681239 2538477 2790324 2833631 2647554 3015478 3416628 3216514
14554 3216514 3553213 3633243 4186743 4636147 5645663 7374187 10778081 20255281 39731356
14545 39731356 51551320 25064450 9788570 4903157 3102389 2517107 2306018 2000159
$$ packed form
14617A322612O1501O9470p543k10097N48497J74194l831m6335j97512k13678p7222
14606A420056L74519K3593m68715L48455n4440k144J13804K5008k7492n3632k63780
14595A435232L41220k93650L44668J98284j99258j82765J39016K9677N6687k60467
14585A608644K36651L40634k0428n475P7624m0641l29904L86444J99353m37132
14575B015770J53588K17074k24791j15532J866M2094K19887L953j8270r3465J09496
14564B311670j13416K46515K36470j42762K51847M3307j86077L67924M01150k00114
14554C216514L36699Q0030N53500M49404J009516J728524L403894R477200J9476075
14545C9731356J1819964B5064450I788570m885413j800768n85282k11089l05859
$$ plain form
14537 2000159 2090679 2228587 1984959 2151208 2110261 2221798 2162413 2355454 2008801 2651097
14527 2651097 2184715 2127274 2370712 2317197 2517470 2475451 2434429 2780978 2655929 2758507
14517 2758507 2506939 2957756 2550721 3270551 2593680 2835269 2801814 2789068 3141724 3061985
14507 3061985 3096398 3158500 2943913 3146972 3010084 3127942 2999795 3407357 2791652 3280111
14497 3280111 3701234 3499800 3427076 3336505 3385975 3508266 3651670 3534825 3682924 3780314
14487 3780314 3763290 3692037 4055421 4016509 3926383 3921346 3968290 3718697 4067152 3896576 3865100
14476 3865100 4217037 4214416 4116131 4543744 4563634 4335347 4109767 4466737 4385452 4621292
14466 4621292 4715797 4856551 4768398 4685843 4850653 4855205 4636295 5094389 5180781 5101789 5233601
$$ packed form
14537B000159R0520J37908k43628J66249m0947J11537n9385J93041l46653O42296
14527B651097m66382n7441K43438n3515K00273m2019m1022L46549j25049J02578
14517B758507k51568M50817m07035P19830o76871K41589l3455j2746L52656p9739
14507C061985L4413O2102k14587K03059j36888J17858j28147M07562o15705M88459
14497C280111M21123k01434p2724r0571M9470J22291J43404j16845J48099R7390
14487C780314j7024p1253L63384l8912r0126n037M6944k49593L48455j70576l1476
14476C865100L51937k621r8285M27613J9890k28287k25580L56970q1285K35840
14466D621292R4505J40754q8153q2555J64810M552k18910M58094Q6392p8992J31812
$$ plain form
14455 5233601 5249358 5390919 5527925 5477892 5476654 5286419 5778626 5849688 5276711 6168027
14445 6168027 5589625 5908785 6184013 6165690 6192850 6449649 6175990 6354395 6655005 6796423
14435 6796423 6891327 6967069 7006342 6732854 7199569 7174160 7117507 7509537 7445644 7500644 7502203
14424 7502203 7636730 7979419 7690361 8188606 8263784 8346660 8644912 8744174 8708333 8773721
14414 8773721 9045130 9029570 9341154 9004623 9568996 9818445 9522522 9836021 9725769 10167772
14404 10167772 10487027 10614770 10821162 10765673 10965816 11310004 11474184 11395213 11937591 12099089
14394 12099089 12069734 11986311 12749470 12723466 12957433 13330591 13325692 13596319 14105986 14401069
14384 14401069 14375973 14908925 14713246 15316683 15494681 15655288 16146831 16565345 16716404
$$ packed form
14455E233601J5757J41561J37006n0033j238j90235M92207P1062n72977Q91316
14445F168027n78402L19160K75228j8323K7160K56799k73659J78405L00610J41418
14435F796423R4904P5742L9273k73488M66715k5409n6653L92030o3893N5000J559
14424G502203J34527L42689k89058M98245P5178Q2876K98252R9262l5841O5388
14414H773721K71409j5560L11584l36531N64373K49449k95923L13499j10252M42003
14404A0167772L19255J27743K06392n5489K00143L44188J64180p8971N42378J61498
14394A2099089k9355q3423P63159k6004K33967L73158m899K70627N09667K95083
14384A4401069k5096N32952j95679O03437J77998J60607M91543M18514J51059
$$ plain form
14375 16716404 16805665 17306426 17593753 17921738 18502452 18506922 19121215 19784890 19802350 20605589
14365 20605589 20522570 20949507 21805341 21824310 22402109 23016614 23597302 23834610 24363362 25286849
14355 25286849 25829947 26561928 27053352 27306395 28375737 29113792 29566759 30348980 31023677
14346 31023677 31811935 32380594 33415239 34132115 35369559 36232941 37309695 38064859 39468444
14337 39468444 39962251 41401646 42599810 43740042 45476899 46627900 48239373 49366538
14329 49366538 50780624 52577009 54040568 56061112 57832481 59660044 61919486 64027947
14321 64027947 66054773 68593324 71011846 73362989 76208648 79436051 82241080 85597849
14313 85597849 88511371 92224496 95890104 99717666 103827370 108625333 112929311 117820293
$$ packed form
14375A6716404Q9261N00761K87327L27985N80714M470O14293O63675J7460Q03239
14365B0605589q3019M26937Q55834J8969N77799O14505N80688K37308N28752R23487
14355B5286849N43098P31981M91424K53043J069342P38055M52967P82221O74697
14346C1023677P88258N68659J034645P16876J237444Q63382J076754P55164J403585
14337C9468444M93807J439395J198164J140232J736857J151001J611473J127165
14329D9366538J414086J796385J463559K020544J771369J827563K259442K108461
14321F4027947K026826K538551K418522K351143K845659L227403K805029L356769
14313H5597849K913522L713125L665608L827562M109704M797963M303978M890982
$$ plain form
14305 117820293 122926258 128387844 134182755 140421530 146931244 154165598 161361572 169260561
14297 169260561 177446083 186193196 195263505 204846289 215460138 226464729 237930020
14290 237930020 249746650 262302840 275515124 289028086 303560018 317822307 332707172
14283 332707172 347972234 363134456 378407858 393425190 407693934 421907227 434537109
14276 434537109 446661031 456895433 465283390 470921755 473016737 472972526 471385205 468900703
14268 468900703 465423178 461459288 454764902 445989291 435433055 423453652 409959752
14261 409959752 395903954 380473655 364593440 348900945 333460899 317635558 303570489
14254 303570489 289366954 275463253 261816092 249495176 237466819 225698793 214999710
$$ packed form
14305A17820293N105965N461586N794911O238775O509714P234354P195974P898989
14297A69260561Q185522Q747113R070309R582784J0613849J1004591J1465291
14290B37930020J1816630J2556190J3212284J3512962J4531932J4262289J4884865
14283C32707172J5265062J5162222J5273402J5017332J4268744J4213293J2629882
14276D34537109J2123922J0234402Q387957N638365K094982m4211j587321k484502
14268D68900703l477525l963890o694386q775611j0556236j1979403j3493900
14261D09959752j4055798j5430299j5880215j5692495j5440046j5825341j4065069
14254C03570489j4203535j3903701j3647161j2320916j2028357j1768026j0699083
$$ plain form
14247 214999710 204254807 194423425 185364142 177135332 168672592 160787930 153572687 146110069
14239 146110069 139829334 133937537 128269410 122793477 117177809 112505977 107808112 103501156
14231 103501156 99967240 95651469 92007585 88485544 85020081 81803905 78855722 76010804
14223 76010804 73119456 70685656 68108239 66110071 63929788 61664569 59530856 58161604
14215 58161604 55551239 54340323 53103708 51290883 49780190 47882078 46458723 45383894
14207 45383894 44625053 43634945 41850946 40355277 39470287 38275575 37593651 37071707 35723230
14198 35723230 34784156 33804072 32883601 32067155 31443489 30710526 29661812 28738274 28287776
14189 28287776 27721014 26993215 26261728 25750032 25201434 24580293 24075055 23141818 22856466
$$ packed form
14247B14999710j0744903r831382r059283q228810q462740p884662p215243p462618
14239A46110069o280735n891797n668127n475933n615668m671832m697865m306956
14231A03501156l533916m315771l643884l522041l465463l216176k948183k844918
14223G6010804k891348k433800k577417j998168k180283k265219k133713j369252
14215E8161604k610365j210916j236615j812825j510693j898112j423355j074829
14207D5383894p58841r90108j783999j495669q84990j194712o81924n21944j348477
14198C5723230r39074r80084r20471q16446o23666p32963j048714r23538m50498
14189B8287776n66762p27799p31487n11696n48598o21141n05238r33237k85352
$$ plain form
14180 22856466 22115689 21918138 21627160 21266016 20571082 19886741 19945646 19725235 18935736
14171 18935736 18865675 18387315 17936657 17985671 17486681 17028759 16682347 16534680 16268244 15993433
14161 15993433 15646211 15102812 15106700 14917700 14592971 14182620 13906706 13985353 13584651 12879410
14151 12879410 12910302 12856284 12527130 12277752 12647496 12227665 11865525 11740468 11816097 11003886
14141 11003886 11198853 11092287 10690007 10998661 10621405 10480717 10570955 9842012 9894805 9785044
14131 9785044 9768947 9640213 9616647 9377695 9272624 9216653 8582096 8532655 8810999 8463968
14121 8463968 8464037 8623395 8286088 8078862 8192843 7765612 7692226 7742238 7505767 7471701 7384430
14110 7384430 7274335 7387520 7228295 7243893 6838524 6993112 6965484 6800050 6648688 6468436
$$ packed form
14180B2856466p40777j97551k90978l61144o94934o84341N8905k20411p89499
14171A8935736p0061m78360m50658M9014m98990m57922l46412j47667k66436k74811
14161A5993433l47222n43399L888j89000l24729m10351k75914P8647m00702p05241
14151A2879410L0892n4018l29154k49378L69744m19831l62140j25057P5629q12211
14141A1003886J94967j06566m02280L08654l77256j40688R0238p28943N2793j09761
14131I785044j6097j28734k3566k38952j05071n5971o34557m9441K78344l47031
14121H463968O9J59358l37307k07226J13981m27231p3386N0012k36471l4066q7271
14110G384430j10095J13185j59225J5598m05369J54588k7628j65434j51362j80252
$$ plain form
14100 6468436 6450680 6112059 6500674 6610274 6374957 6122056 6308125 6182956 6091213 5947998
14090 5947998 5960940 5961025 5947077 5387059 5449010 5579366 5124840 5671307 5282600 5589678 5632509
14079 5632509 5138665 5182361 5050718 4868871 5124901 5114121 4436026 4721885 4827029 4823876
14069 4823876 4850274 4438160 4628321 4542402 4669314 4666818 4347646 4173722 4402569 4499440
14059 4499440 4268187 4391385 4395064 4404782 4045637 3933374 4215862 4124175 3905478 3740861
14049 3740861 3953354 3601676 3950192 3591871 3423405 3664401 3360887 3255479 3547766
14040 3547766 3329677 3473764 3449632 3183385 3309758 3413553 3287024 3144604 3573114 3171265
14030 3171265 3018940 3682538 3468671 3102437 3227618 3110741 3228887 2928471 3246623
$$ packed form
14100F468436j7756l38621L88615J09600k35317k52901J86069j25169r1743j43215
14090E947998J2942Q5j3948n60018O1951J30356m54526N46467l88707L07078M2831
14079E632509m93844M3696j31643j81847K56030j0780o78095K85859J05144l153
14069D823876K6398m12114J90161q5919J26912k496l19172j73924K28847R6871
14059D499440k31253J23198L679R718l59145j12263K82488r1687k18697j64617
14049C740861K12493l51678L48516l58321j68466K40996l03514j05408K92287
14040C547766k18089J44087k4132k66247J26373J03795j26529j42420M28510m01849
14030C171265j52325O63598k13867l66234J25181j16877J18146l00416L18152
$$ plain form
14021 3246623 2977415 2967054 3177995 2964895 2564010 3117836 3207115 2756412 2704561 3077636
14011 3077636 2586245 2545689 2577660 2412135 2437974 2558144 2398871 2570980 2156895 2092850
14001 2092850 2351952 2308277 1985693 2341400 2303890 2247672 2394503 1968683 2150075 2216620
13991 2216620 2327315 2867591 3459523 5365570 12570469 30420552 51478619 30268426
13983 30268426 15321885 9089049 6740515 5048645 4401029 3838601 3522218 3179001
13975 3179001 3158003 3022810 2947458 2942740 3128747 2773405 2446069 2614162 2606316 2589124 2409264
13964 2409264 2353709 2438656 2442101 2257834 2207409 2124362 2380476 2291812 2135042 2203058 2286328
13953 2286328 2196759 1969745 1867038 2065141 1785277 2236059 2114184 2041305 1640945 2113058
$$ packed form
14021C246623k69208j0361K10941k13100m00885N53826Q9279m50703n1851L73075
14011C077636m91391m0556L1971j65525K5839J20170j59273J72109m14085o4045
14001B092850K59102m3675l22584L55707l7510n6218J46831m25820J81392O6545
13991B216620J10695N40276N91932J906047P204899J7850083K1058067k1210193
13983C0268426j4946541o232836k348534j691870o47616n62428l16383l43217
13975C179001k0998j35193p5352m718J86007l55342l27336J68093p846j7192j79860
13964B409264n5555Q4947L445j84267n0425q3047K56114q8664j56770O8016Q3270
13953B286328q9569k27014j02707J98103k79864M50782j21875p2879m00360M72113
$$ plain form
13943 2113058 1909377 1795293 1868096 1656786 1995569 1689243 1897270 1640991 1736700 1864323
13933 1864323 2238135 1889394 1913543 1535131 1784462 1605708 1677000 1550100 1794041 1732664
13923 1732664 1889012 1812317 1686946 1562287 1807835 1150834 1679553 1522346 1697738 1290524
13913 1290524 1650797 1790871 1473457 1863476 1450621 1509611 1356071 1238890 1293369 1644764
13903 1644764 1264099 1713020 1462195 1271488 1319594 1617990 1627710 1328639 1562682 1264800
13893 1264800 1468803 1563700 1589699 1417320 1000857 1408145 1749467 1431681 1545586 1367125
13883 1367125 1390021 1530844 1298520 1450260 1145583 1036571 1147853 1307494 1264618 1489677
13873 1489677 1341706 1344902 1174316 1504220 1334983 952482 1181808 1231528 1143793 1045697
$$ packed form
13943B113058k03681j14084P2803k11310L38783l06326K08027k56279R5709J27623
13933A864323L73812l48741K4149l78412K49331j78754P1292j26900K43941o1377
13923A732664J56348p6695j25371j24659K45548o57001N28719j57207J75392m07214
13913A290524L60273J40074l17414L90019m12855N8990j53540j17181N4479L51395
13903A644764l80665M48921k50825j90707M8106K98396R720k99071K34043k97882
13893A264800K04003R4897K5999j72379m16463M07288L41322l17786J13905j78461
13883A367125K2896J40823k32324J51740l04677j09012J11282J59641m2876K25059
13873A489677j47971L196j70586L29904j69237l82501K29326M9720q7735r8096
$$ plain form
13863 1045697 1290744 1247067 1293227 1373051 1235824 1321759 1553027 1012402 1029736 872780
13853 872780 1302914 1054001 848481 1222976 1316804 996153 1097207 947791 838851 1203685
13843 1203685 939534 981554 1131816 1201353 1012668 960382 1286543 860034 991080 978831
13833 978831 844745 1119892 1096669 854836 841581 765975 1092747 1010582 896685 1037138
13823 1037138 707401 905115 760260 1038633 1176563 976493 869379 1019514 1029057 1111062
13813 1111062 720486 953106 666316 784117 1012698 619967 685105 840573 474460 473408
13803 473408 989843 965197 913952 701173 1039499 814328 631463 888135 902632 758549
13793 758549 492989 639738 858594 944659 637189 966219 678786 729359 684991 703151
$$ packed form
13863A045697K45047m3677M6160P9824j37227Q5935K31268n40625J7334j56956
13853H72780M30134k48913k05520L74495R3828l20651J01054j49416j08940L64834
13843A203685k64151M2020J50262O9537j88685n2286L26161m26509J31046j2249
13833I78831j34086K75147k3223k41833j3255p5606L26772q2165j13897J40453
13823A037138l29737J97714j44855K78373J37930k00070j07114J50135R543Q2005
13813A111062l90576K32620k86790J17801K28581l92731O5138J55468l66113j052
13803D73408N16435k4646n1245k12779L38326k25171j82865K56672J4497j44083
13793G58549k65560J46749K18856Q6065l07470L29030k87433N0573m4368J8160
$$ plain form
13783 703151 695829 587487 726816 595932 504398 842227 887593 899746 711766 990086
13773 990086 897599 948290 486901 698072 1047698 546004 863100 689267 790415 678391
13763 678391 794534 476826 664418 1014619 600218 906066 683901 678130 958032 567964
13753 567964 593663 1201411 977258 489836 616133 428731 664889 916604 545778 643188
13743 643188 829372 913529 762794 470307 691506 1061008 562897 538275 476431 892937
13733 892937 1002721 773911 878768 597614 758692 955328 343647 758233 489725 431148
13723 431148 753696 1028023 572454 627417 772384 543510 575107 822509 738807 332615
13712 745900 916078 667876 411913 538651 302354 516146 483864 657981 360773 685166
$$ packed form
13783G03151p322j08342J39329j30884r1534L37829M5366J2153j87980K78320
13773I90086r2487N0691m61389K11171L49626n01694L17096j73833J01148j12024
13763F78391J16143l17708J87592L50201m14401L05848k22165n771K79902l90068
13753E67964K5699O07748k24153m87422J26297j87402K36158K51715l70826R7410
13743F43188J86184Q4157j50735k92487K21199L69502m98111k4622o1844M16506
13733H92937J09784k28810J04857k81154J61078J96636C43647M14586k68508n8577
13723D31148L22548K74327m55569N4963J44967k28874L1597K47402q3702C32615
13712G45900J70178k48202k55963J26738k36297K13792l2282J74117k97208L24393
$$ plain form
13702 685166 698297 636531 370732 752670 404757 854650 689257 853684 594594 437349
13692 437349 726416 449254 562729 627655 607130 651404 841157 830032 763314 468538
13682 468538 277896 442546 383203 608663 885526 394888 571131 512731 676365 310720
13671 298787 683975 408698 573340 390472 535991 473262 614307 500162 652085 586470
13661 586470 491710 501242 879834 589107 379579 419346 510017 689338 501533 315848
13651 315848 625950 471391 406326 521744 618779 687843 497907 109360 758818 505922
13641 505922 559344 345634 623016 600941 366012 306939 409445 654354 430086 122133
13630 468796 463180 235067 351074 379747 589989 570461 276010 260057 814116 437229
$$ packed form
13702F85166J3131o1766k65799L81938l47913M49893j65393J64427k59090j57245
13692D37349K89067k77162J13475O4926k0525M4274J89753j1125o6718k94776
13682D68538j90642J64650n9343K25460K76863C94888J76243n8400J63634C10720
13671B98787L85188k75277J64642j82868J45519o2729J41045j14145J51923o5615
13661E86470r4760R532L78592k90727k09528L9767R0671J79321j87805j85685
13651C15848L10102j54559o5065J15418R7035O9064j89936A09360O49458k52896
13641E05922N3422k13710K77382k2075k34929n9073J02506K44909k24268A22133
13630D68796n616k28113J16007K8673K10242j9528B76010j5953N54059l76887
$$ plain form
13620 437229 215335 332202 237578 532528 68646 631971 404960 600178 549761 646563
13610 646563 209021 394245 148934 331756 71937 441307 168013 163451 372321 556148
13600 556148 163072 794651 449374 121879 31773 351954 314812 326015 428318 262223
13590 262223 366175 623321 342750 396220 468254 143520 28578 447984 467934 480479
13580 480479 96230 185520 337743 403094 279011 562598 186850 159332 410301 16479
13569 757138 424129 440650 88823 171570 318910 22180 174594 542445 91622 290047
13559 290047 248222 355689 551776 353332 304210 385179 94705 179732 180198 604151 253092
13547 525408 332206 277350 65921 60774 334282 340444 422344 418136 243193 385742 324991
$$ packed form
13620D37229B15335J16867r4624K94950F8646N63325k27011J95218n0417R6802
13610F46563B09021J85224A48934J82822G1937L69370A68013m562K08870J83827
13600E56148A63072O31579l45277A21879C1773L20181l7142J1203J02303j66095
13590B62223J03952K57146k80571N3470P2034A43520B8578M19406J9950J2545
13580D80479I6230Q9290J52223O5351j24083K83587A86850k7518K50969A6479
13569G57138l33009J6521H8823Q2747J47340B2180J52414L67851I1622J98425
13559B90047m1825J07467J96087j98444m9122Q0969I4705Q5027M66M23953B53092
13547E25408j93202n4856F5921n147K73508O162Q1900m208j74943J42549o0751
$$ plain form
13536 324991 515899 430249 532201 650361 88537 429435 269680 659597 280161 367926
13526 367926 309749 226261 73477 174456 219778 198079 119070 370706 227615 306903 258998
13515 258998 -73173 277207 384236 224633 441482 91534 259591 219498 22591 240554
13505 240554 144693 369815 232022 211278 210562 253578 259633 288062 301728 231811 362537
13494 362537 161054 285955 329117 83967 623954 8928 571858 419744 511541 496169 482133
13483 482133 566345 243422 395604 199869 362731 322678 189396 486138 372021 451698
13473 451698 278732 155293 189238 529999 609549 502729 228475 618183 257760 349823
13463 349823 322292 318102 376772 293399 330832 312750 376084 494670 478246 298001 321793
$$ packed form
13536C24991J90908q5650J01952J18160H8537L40898j59755L89917B80161Q7765
13526C67926n8177q3488G3477J00979M5322k1699p9009K51636j43091P9288m7905
13515B58998g3173B77207J07029j59603K16849I1534J68057m0093B2591K17963
13505B40554r5861K25122j37793k0744p16M3016O055K8429J3666o9917J30726
13494C62537A61054J24901M3162H3967N39987H928N62930j52114R1797j5372j4036
13483D82133Q4212B43422J52182j95735J62862m0053j33282K96742j14117P9677
13473D51698j72966j23439L3945L40761P9550j06820B28475L89708B57760R2063
13463C49823k7531m190N8670q3373L7433j8082O3334J18586j6424j80245K3792
$$ plain form
13452 321793 219830 276359 137867 403209 374278 344633 254061 165391 324127 327927 335157
13441 335157 237690 207440 585292 328813 307759 155286 302058 89259 324670 249519
13431 249519 287290 448693 -78438 210733 214017 207094 604318 500460 7984 103681 55568
13420 55568 175142 255395 -117115 -24962 241383 -227451 23914 387986 34642 177234
13410 177234 -52680 134231 175048 346279 -157275 -50469 289049 422598 200955 331489
13400 331489 164362 379084 145723 242955 263238 101856 310012 145917 226368 -53586
13389 326328 139569 227315 83368 108912 59267 92970 126769 406004 128338 163116 313986
13378 313986 265763 423576 -142184 268735 252882 290482 439666 285171 118000 78433
$$ packed form
13452C21793j01963N6529A37867K65342k8931k9645r0572q8670J58736L800P230
13441C35157r7467l0250L77852k56479k1054j52473J46772H9259K35411p5151
13431B49519L7771J61403g8438B10733L284o923L97224j03858G984R5697m8113
13420E5568J19574Q0253a17115b4962B41383b27451B3914L64072C4642J42592
13410A77234e2680A34231M0817J71231a57275e0469B89049J33549B00955J30534
13400C31489A64362K14722A45723R7232K0283A01856K08156A45917Q0451e3586
13389C26328A39569Q7746H3368K5544m9645L3703L3799K79235A28338L4778J50870
13378C13986m8223J57813a42184B68735j5853L7600J49184j54495A18000l9567
$$ plain form
13368 78433 514561 81695 251686 -81840 370333 336745 41659 595782 288881 113856
13357 -518 293862 383591 401921 285215 91347 138185 139990 487098 82089 -97601 -121607 328285
13344 496020 -2792 547303 267742 25811 497903 398620 -167186 320972 619282 -185110
13333 235969 314209 92982 138835 339256 383305 248122 211616 221842 52499 37473 454187
13322 454187 127184 271462 570294 251701 471305 168598 400260 311501 -325777 489990
13311 234935 298449 105298 162470 360909 130747 280891 52169 147268 198658 122931 314135
13300 314135 -10976 163250 328464 152202 -135380 462509 101726 -63933 235476 -85623
13289 -225743 28846 202664 -35051 43019 207867 341681 93907 62372 31760 619673 -331359
$$ packed form
13368G8433M36128H1695J69991h1840C70333l3588D1659N54123B88881A13856
13357e18B93862Q9729J8330j16706I1347M6838J805L47108H2089i7601k4006C28285
13344D96020b792E47303B67742B5811M72092r9283a67186C20972K98310a85110
13333B35969P8240I2982M5853K00421M4049j35183l6506J0226E2499j5026M16714
13322D54187A27184J44278K98832B51701K19604A68598K31662q8759c25777D89990
13311B34935O3514A05298N7172J98439A30747J50144E2169R5099N1390p5727J91204
13300C14135a0976A63250J65214A52202a35380D62509A01726f3933B35476h5623
13289b25743B8846J73818c5051D3019J64848J33814I3907l1535l0612N87913c31359
$$ plain form
13277 46588 3244 -40770 -13563 142368 262072 185343 214037 263272 -10352 -49098 110001
13265 -148688 82741 299673 35508 111144 256556 10044 -152369 435182 -15169 284330
13254 372011 178462 284654 390448 175095 148105 270689 103879 138185 210231 325345
13244 325345 171608 191912 227694 168562 -172545 93843 390288 -51461 29976 105339 365519
13233 365519 244776 200365 344792 150588 -15543 139727 158437 199074 418191 394276
13223 394276 -68831 211651 236033 167008 295407 99662 212759 28909 44544 196815 245350
13212 245350 117520 279725 152126 80557 81473 228863 -118885 263072 313295 -132890
13201 225683 397368 89054 -90822 -327551 225810 -41298 150506 184150 376073 165768
$$ packed form
13277D6588C244d0770a3563A42368J19704p6729K8694M9235a0352l8746A10001
13265a48688H2741K16932C5508P5636J45412A0044a52369D35182a5169B84330
13254C72011A78462J06192J05794A75095k6990J22584A03879L4306P2046J15114
13244C25345j53737K0304L5782n9132a72545I3843K96445e1461B9976P5363K60180
13233C65519j20743m4411J44427A50588a5543A39727J8710M0637K19117k3915
13223C94276f8831B11651K4382o9025J28399I9662J13097B8909J5635J52271M8535
13212B45350A17520J62205j27599p1569R16J47390a18885B63072N0223a32890
13201B25683J71685H9054i0822k36729B25810d1298A50506L3644J91923A65768
$$ plain form
13190 140797 135367 250201 -27519 23185 -21022 121626 270935 33904 -157619 349439 271370
13179 271370 250379 194952 -80191 197245 -258441 47823 191297 -135957 106887 139778
13169 139778 275113 57103 12571 138836 23586 114309 559712 114009 114850 235378 101207
13157 233746 305276 95596 97744 407284 -69601 -26105 -38036 55650 171442 -113452 -110312
13146 -110312 164796 390136 -54674 -19653 151780 -31298 29805 -136857 -1800 562990 245354
13134 273477 103148 -65720 228392 -183193 223526 127795 6041 150646 -153582 85254
13123 295821 -84354 -74747 189210 -154898 -137273 -148717 -71108 -125191 443856 57026 310649
13112 310649 13412 104815 138645 272001 -17415 91877 -109002 209880 -68681 192137 -112517
$$ packed form
13190A40797n430J14834b7519B3185b1022A21626J49309C3904a57619C49439p8069
13179B71370k0991n5427h0191A97245b58441D7823J43474a35957A06887L2891
13169A39778J35335E7103A2571J26265B3586R0723M45403A14009Q41J20528A01207
13157B33746P1530I5596K148L09540f9601b6105j1931E5650J15792a13452L140
13146a10312A64796K25340e4674a9653A51780c1298B9805a36857a800E62990B45354
13134B73477A03148f5720B28392a83193B23526r5731F041J44605a53582H5254
13123B95821h4354R607A89210a54898J7625j1444g1108n4083D43856E7026K53623
13112C10649A3412R1403L3830J33356a7415I1877a09002B09880f8681A92137a12517
$$ plain form
13100 274389 41269 70373 159479 149019 172180 95197 89190 -68201 -301098 -9275 166682
13088 346204 -68293 -79065 -25125 111760 74254 224744 133247 3070 94902 205398 61853
13076 -8684 30 165002 -14300 100243 155063 180843 -163190 -173850 103526 366731 74612
13064 46827 112373 -67725 265636 16237 66719 18689 86888 118868 319322 -136429 202405
13052 464108 -56627 132058 246188 255847 -93042 -21029 7982 112318 278845 -85010 -7160
13040 82953 -23630 299108 -98015 198668 -161915 10776 -163342 273393 211764 95636 -197003
13028 102746 147181 57120 -84610 46214 35554 106233 -121849 355692 -187122 107699 206007
13017 206007 120406 174076 380201 -58228 -23513 186453 293887 -60489 282201 37173 271655
$$ packed form
13100B74389D1269K9104Q9106j0460K3161p6983o007f8201k32897i275A66682
13088C46204f8293j0772b5125A11760l7506J50490r1497C070R1832J10496F1853
13076h684C0J64972a4300A00243N4820K5780a63190j0660A03526K63205G4612
13064D6827O5546f7725B65636A6237N0482A8689O8199L1980K00454a36429B02405
13052D64108e6627A32058J14130R659i3042b1029G982J04336J66527h5010g160
13040H2953b3630B99108i8015A98668a61915A0776a63342B73393o1629I5636a97003
13028A02746M4435E7120h4610D6214j0660P0679a21849C55692a87122A07699R8308
13017B06007q5601N3670K06125e8228b3513A86453J07434f0489B82201C7173K34482
$$ plain form
13006 271655 210784 29632 475940 -40291 330206 233208 -263437 -32870 -140735 202372
12995 -207372 89153 113727 5795 -139156 -25679 181902 -209351 232643 911 227702 -57554
12983 -116925 62583 127426 -175626 -78425 363042 -41908 187029 -167501 -20915 35195 104571
12972 104571 -90100 -204636 -151976 41556 -172204 179249 2966 207610 77390 -197870 38793
12960 74924 406272 221841 156740 62569 200032 -52144 -27284 168033 325530 90858 -103590
12948 -51222 -340751 -109317 17209 184143 78956 372514 24320 72309 171682 -23845 29350
12936 300453 40888 96644 -3017 -18856 282664 -8664 25043 1941 -213685 88001 -20432 162772
12923 66334 -208766 132885 -6207 161773 174438 171154 -136772 142481 -34770 186689 216132
$$ packed form
13006B71655o0871B9632M46308d0291C30206r6998b63437c2870j07865B02372
12995b07372H9153K4574E795a39156b5679A81902b09351B32643I11K26791e7554
12983a16925F2583O4843a75626g8425C63042d1908A87029a67501b0915C5195O9376
12972A04571i0100j14536N2660D1556a72204A79249B966K04644G7390a97870C8793
12960G4924L31348j84431o5101F2569J37463e2144K4860A68033J57497I0858a03590
12948e1222k89529a09317A7209J66934G8956K93558B4320M7989R9373b3845B9350
12936C00453D0888N5756c017j5839B82664h664B5043A941b13685H8001b0432A62772
12923F6334b08766A32885f207A61773J2665l284a36772A42481c4770A86689K9443
$$ plain form
12912 216132 -9563 246245 106034 215328 289340 23875 36866 44142 104726 52239 -20104
12900 272091 -262762 240198 215202 -69825 101621 118014 -41704 110102 279127 244085
12890 244085 74569 507032 111454 556687 56183 448510 150186 83032 282842 190769
12880 190769 11096 178123 29108 32918 -135726 -163848 -29356 33740 17488 15781 50924
12869 50924 295864 -73919 59435 -38968 60986 74531 -101616 -146511 222363 161530 160792
12858 160792 -115212 69919 218283 143128 -26488 217753 -115677 146497 148961 23243 -212113
12846 272002 88397 312839 -1720 170404 47952 -183058 -75629 2513 182111 -64089 186936
12834 -468339 147405 144031 -10015 556 -190825 -165974 -8549 -47652 203060 55291 -133928
$$ packed form
12912B16132i563B46245A06034J09294P4012B3875J2991P276O0584E2239b0104
12900B72091b62762B40198k4996f9825A01621J6393d1704A10102J69025l5042
12890B44085G4569M32463A11454M45233E6183L92327A50186o7154J99810r2073
12880A90769A1096J67027B9108L810a35726k8122b9356C3740j6252j707L5143
12869E0924K44940g3919E9435c8968F0986J3545a01616m4895B22363o0833p38
12858A60792a15212F9919J48364p5155b6488B17753a15677A46497K464B3243b12113
12846B72002H8397K24442a720A70404D7952a83058g5629B513J79598f4089A86936
12834d68339A47405l374a0015E56a90825K4851h549l9103B03060E5291a33928
$$ plain form
12822 8424 -111552 -74923 -143072 -143823 105870 -310046 124796 -15423 -80334 -174572 -154393
12811 -154393 28905 10472 -159242 -273103 -273564 118824 154180 181058 98635 -192049 194433
12799 -55264 50724 4728 -49006 362015 11358 -53232 -308709 187051 -101345 -95236 -281827
12788 -281827 133802 -22849 308954 189000 135413 257755 13237 -95935 25846 -103294
12777 50358 -101331 19725 -106073 190322 -254607 316553 -77736 5583 735 283820 115039
12765 301409 201112 90534 91228 43714 -50072 -88905 -190095 291960 -19595 69393 -66203
12753 35929 310854 44939 312715 -384039 -143217 -67442 -219442 35896 48070 87742 -163612
12741 343697 466826 261294 -21206 -211818 113048 200084 353190 132686 571211 -28856
$$ packed form
12822H424a11552L6629o8149p51A05870c10046A24796a5423o4911r4238K0179
12811a54393B8905A0472a59242j13861m61A18824L5356K6878q2423a92049A94433
12799e5264E0724D728d9006C62015A1358e3232k55477A87051a01345O109j86591
12788b81827A33802b2849C08954j19954n3587J22342A3237i5935B5846a03294
12777E0358a01331A9725a06073A90322b54607C16553g7736E583G35K83085A15039
12765C01409j00297I0534O94D3714e0072l8833j01190B91960a9595F9393f6203
12753C5929K74925D4939K67776c84039a43217f7442j52000C5896J2174L9672a63612
12741C43697J23129k05532b1206j90612A13048Q7036J53106A32686M38525b8856
$$ plain form
12730 66410 123061 -115512 -47894 145454 -142218 260463 25754 125996 -148166 110411
12719 180311 249838 -308121 168893 -119788 -144528 212325 175955 -211924 -1770 63272 208175
12708 208175 270116 168745 -74236 -89853 152845 20221 296121 -28860 362757 350344 217310
12697 217310 121460 57591 -53588 14173 157808 220470 207723 -135216 -78746 128833 179265
12686 179265 197382 254990 -86450 214175 59837 189987 246522 53075 165895 21732 128425
12675 128425 -22211 -124186 325149 387243 122639 338679 -139347 80089 -1050 129573
12664 15197 125103 231313 235511 -201349 -156684 178147 92893 40469 223513 256199 157722
12653 157722 246529 212034 100687 38453 -272157 -202028 76373 -1774 51573 305948 -21750
$$ packed form
12730F6410N6651a15512d7894A45454a42218B60463B5754J00242a48166A10411
12719A80311O9527c08121A68893a19788k4740B12325l6370b11924a770F3272J44903
12708B08175O1941j01371g4236j5617A52845B0221K75900b8860C62757j2413j33034
12697B17310r5850E7591e3588A4173J43635O2662j2747a35216N6470A28833N0432
12686A79265J8117N7608h6450B14175E9837J30150N6535E3075J12820B1732J06693
12675A28425b2211j01975C25149O2094A22639K16040a39347H0089a050A29573
12664A5197J09906J06210M198b01349M4665A78147q5254D0469J83044L2686r8477
12653A57722Q8807l4495A00687C8453b72157P0129G6373a774E1573K54375b1750
$$ plain form
12641 154085 95602 366197 205492 100396 167609 237909 -20150 203684 185794 -170626
12630 -43100 139219 106021 209483 241422 -39492 190586 35309 -56421 162177 121727 21001
12618 -226090 -64938 4282 -172357 -267382 204398 -51441 221846 -33475 -64570 325706 -118997
12606 103302 273187 -284249 391364 -229217 157867 40843 248392 372456 302330 304730
12596 304730 109138 34677 -73581 271510 406564 176616 107708 -66605 44997 85603 42160
12584 326590 131903 -19791 -52293 224928 119189 41362 -97553 57657 198887 -56649 60622
12572 39570 -130141 117715 -149987 -215522 115 -16032 -10791 168092 7927 -299924 125793
12560 -287246 91927 193726 -265314 -41147 60205 -48433 343209 77996 -28482 301890 100007
$$ packed form
12641A54085n8483K70595j60705A00396O7213P0300b0150B03684j7890a70626
12630d3100A39219l3198J03462L1939c9492A90586C5309e6421A62177m0450B1001
12618b26090f4938D282a72357r5025B04398e1441B21846c3475l1095C25706a18997
12606A03302J69885b84249C91364b29217A57867D0843K07549J24064p0126K400
12596C04730A09138C4677g3581B71510J35054A76616o8908f6605D4997M0606D2160
12584C26590A31903a9791l2502B24928j05739D1362i7553E7657J41230e6649F0622
12572C9570a30141A17715a49987o5535A15a6032N241A68092G927b99924A25793
12560b87246I1927J01799b65314d1147F0205d8433C43209G7996b8482C01890A00007
$$ plain form
12548 43641 296026 58027 82923 17042 279947 -145705 261750 130375 218675 42075 98223
12537 98223 -91556 236253 -153026 52043 -173375 57084 286180 7220 367909 95481 346431
12526 346431 -5349 -31038 41981 -151685 298879 -44509 124120 343377 -56764 -177112 332841
12514 111694 46857 137189 24662 -300578 151900 -288124 -108342 256167 -7079 141862
12503 227574 -5341 132525 -70785 356787 -336635 94270 -152203 258790 35800 109927 -45151
12491 144407 -57126 -66960 -66712 -129504 -5463 -205973 -108872 96987 -41161 -319403 171926 134960
12479 134960 111188 197267 -12376 182973 117401 48391 148708 317887 -236549 169568
12468 -10959 -107804 -126559 58310 403204 -10748 129995 27022 220149 -87174 -134868 -209551
$$ packed form
12548D3641K52385E8027K4896A7042K62905a45705B61750A30375Q8300D2075N6148
12537I8223i1556B36253a53026E2043a73375E7084K29096G220L60689I5481K50950
12526C46431e349k5689D1981a51685B98879d4509A24120K19257e6764j20348C32841
12514A11694D6857R0332B4662c00578A51900b88124a08342B56167g079A41862
12503B27574e341A32525g0785C56787c36635I4270a52203B58790C5800P4127d5151
12491A44407e7126r834K48o2792e463k00510R7101I6987d1161k78242A71926l6966
12479A34960k3772Q6079a2376A82973o5572D8391J00317J69179b36549A69568
12468a0959r6845j8755E8310L44894a0748A29995B7022J93127h7174m7694p4683
$$ plain form
12457 -209551 -1790 -89388 -21854 267500 -124886 -67435 -192788 -183315 -101523 303477 29400
12445 104176 -224445 -482022 -111807 326511 128433 43286 -2362 -174975 -181311 -80758 -86454
12434 -86454 409237 -82746 104089 86404 24197 -212779 53927 211328 38016 -161219 -114993
12423 -114993 -263262 263645 -414766 -157725 227136 77079 -80874 -110059 370529 -130780
12412 15688 163591 -277031 237125 -297569 -6373 -63388 -60318 -177844 115076 -75670 43551
12400 -38621 -7944 -11123 -36897 -83241 -166869 -370182 -247852 44293 197627 57756 83426
12389 83426 170178 -53388 340514 64615 -379328 -168356 -238210 -78553 -344904 212701 -244756
12377 -190616 34487 79284 -86273 119576 -89971 96031 -175282 269026 123299 88260 99246
$$ packed form
12457b09551a790q7598b1854B67500a24886N7451j25353R473Q1792C03477B9400
12445A04176b24445k57577a11807C26511A28433D3286b362j72613o336h0758n696
12434h6454D09237h2746A04089j7685B4197b12779E3927J57401C8016a61219M6226
12423a14993j48269B63645d14766a57725B27136G7079h0874k9185C70529a30780
12412A5688J47903b77031B37125b97569f373n7015L070j17526A15076g5670D3551
12400c8621g944l179k5774m6344q3628k03313J22330D4293J53334E7756K5670
12389H3426Q6752e3388C40514F4615c79328a68356o9854g8553k66351B12701b44756
12377a90616C4487M4797h6273A19576h9971I6031a75282B69026A23299l5039J0986
$$ plain form
12366 99246 164626 144242 339857 -120308 -32100 90069 -169627 5414 1369 311249 -78001
12354 -97363 68396 -176531 181985 -104727 53160 -87818 -111044 206112 311296 197978
12344 197978 -320411 -117423 -306700 -410797 -203526 -92074 -121325 -79773 -118456 -63209
12334 -63209 -216447 -42319 171392 85981 143631 110097 -26775 -93726 135227 81052 258370
12323 258370 -75829 186858 -189243 -61636 191782 -44564 -268559 -52178 403871 290587
12313 290587 -47226 205678 290251 -69746 -29601 -198462 77794 -73369 -318539 4814 -255634
12301 168696 -132997 230759 85571 -9661 -33806 6804 241271 86237 113516 -301909 490384
12289 102338 128857 254853 -38268 259560 -92529 74677 -132728 75374 201854 -29966 152027
$$ packed form
12366I9246O5380k0384J95615a20308c2100I0069a69627E414A369L09880g8001
12354i7363F8396a76531A81985a04727E3160h7818k3226B06112J05184j13318
12344A97978c20411a17423j89277j04097b03526i2074k9251M1552l8683N5247
12334f3209j53238d2319A71392q5411N7650l3534b6775o6951A35227n4175J77318
12323B58370g5829A86858a89243f1636A91782d4564k23995e2178D03871j13284
12313B90587d7226B05678Q4573f9746b9601j68861G7794g3369k45170D814b55634
12301A68696a32997B30759H5571i661k4145F804K34467H6237K7279c01909D90384
12289A02338K6519J25996c8268B59560i2529G4677a32728G5374J26480b9966A52027
$$ plain form
12277 250096 235189 177937 -91090 89230 392229 58159 51479 311495 52072 158551 201128
12266 201128 176189 -283946 -40254 -81682 507006 136290 151273 -197072 115101 80640
12256 80640 -145971 7156 321462 387063 146251 -195268 -81667 167086 149017 54184 -58874
12244 70372 30831 111725 -154760 -60574 177427 258508 108048 178430 105773 -63593 -5631
12232 -15256 3856 222262 -183527 56167 -102810 427092 320044 347361 -44638 409939 455094
12221 455094 64194 130411 189386 248801 284693 177364 260877 -134103 195085 257110 248402
12210 248402 257974 98124 170131 148631 -170681 26927 147780 16743 139633 305423 176168
12199 176168 -195035 44399 348519 120045 294821 -37585 221141 -69306 140835 342860
$$ packed form
12277B50096j4907n7252i1090H9230L02999E8159o680K60016E2072J06479M2577
12266B01128k4939b83946d0254m1428E07006A36290J4983a97072A15101l4461
12256H0640a45971G156L14306O5601A46251a95268h1667A67086j8069E4184e8874
12244G0372C0831Q0894a54760f0574A77427Q1081A08048P0382p2657f3593e631
12232a5256C856K18406a83527E6167a02810D27092j07048K7317d4638D09939M5155
12221D55094F4194O6217N8975N9415L5892j07329Q3513a34103A95085O2025q708
12210B48402R572I8124P2007k1500a70681B6927J20853A6743J22890J65790j29255
12199A76168a95035D4399L04120A20045J74776c7585B21141f9306A40835K02025
$$ plain form
12189 342860 58824 319245 246610 299430 -10383 -72612 191475 179651 50940 219513 193844
12178 193844 250446 74670 -35000 199385 417481 159897 173379 333211 60897 206506
12168 206506 209265 55657 -6356 241055 399985 74590 114747 81911 193741 54458 308429
12157 308429 222740 100084 -176625 60748 19093 134143 -213368 135373 13965 161283
12147 161283 -92130 223718 180407 95102 132669 250356 -2100 -3385 137711 90519 -13676
12135 1106 582569 130563 -79719 177411 -301703 -162979 -121237 -249501 19559 -281669
12124 246275 -55104 128868 94063 250248 148514 -82961 -187300 228658 177614 -33831
12113 22179 12846 120998 191457 28406 119117 113625 -176551 61502 -103980 321799 -53516
$$ packed form
12189C42860E8824K60421p2635N2820a0383o2229A91475j1824E0940J68573k5669
12178A93844N6602G4670c5000A99385K18096A59897J3482J59832F0897J45609
12168B06506K759E5657f356B41055J58930G4590M0157l2836J11830E4458K53971
12157C08429q5689A00084a76625F0748A9093J15050b13368A35373A3965J47318
12147A61283i2130B23718m3311q5305L7567J17687b100j285A37711m7192a3676
12135A106N81463A30563g9719A77411c01703J38724M1742j28264A9559b81669
12124B46275e5104A28868l4805J56185j01734h2961j04339B28658n1044c3831
12113B2179r333J08152P0459B8406R0711n492a76551F1502a03980C21799e3516
$$ plain form
12101 33561 63430 -276305 182107 -77709 121568 -301191 -52752 99484 88290 93922 -87709
12089 -394002 -191208 80711 97886 -1542 -128484 -151198 101347 13479 80152 74036 -81186
12077 139657 304056 -186050 -103045 83565 745139 1864371 1503198 268381 348616 36328
12066 -123363 -79640 220562 -70768 282807 140283 -160559 -89619 130036 -235141 -59135
12055 -46238 38681 -107475 -151556 47319 97571 -109274 -135975 81369 84790 -290837 7762
12043 -12118 185704 -398958 -33166 -134810 -264481 100627 -249816 -257838 -168206 141 -17312
12031 -177471 72884 78646 -159170 -127842 -134286 206702 -85379 -444040 -151593 144005 193981
12020 193981 44472 228796 212453 -11690 -105920 170618 -164106 -188316 -17259 139681 56490
$$ packed form
12101C3561K9869b76305A82107g7709A21568c01191e2752I9484j1194N632h7709
12089c94002a91208H0711J7175a542j26942k2714A01347A3479O6673o116h1186
12077A39657J64399a86050Q3005H3565O61574J119232l61173B68381Q0235C6328
12066a23363M3723B20562g0768B82807A40283a60559P0940A30036b35141e9135
12055d6238C8681a07475m4081D7319N0252a09274k6701H1369L421b90837G762
12043a2118A85704c98958c3166j01644j29671A00627b49816q022Q9632A41a7312
12031a77471G2884N762a59170L1328o444B06702h5379l58661a51593A44005M9976
12020A93981D4472J84324j6343a1690r4230A70618a64106k4210a7259A39681E6490
$$ plain form
12008 46112 188898 281748 -2632 -12175 -295494 -52764 -283197 -22711 -132019 -162901 148395
11996 -103495 -222223 16558 127783 -211329 -210990 -31909 -77674 -15290 -17565 -68326 -162927
11985 -162927 164795 131442 191972 -14461 13163 107251 278839 171682 -245774 -76537 80540
11973 -30040 -101954 222585 -8543 -26396 -60695 -68778 -258812 182612 45974 -81765 -241864
11962 -241864 -50274 93765 -18180 -8419 93364 326614 -144477 -36251 177583 147308 188019
11951 188019 38880 182606 -79308 44670 -8753 -241017 -28395 -117393 -278816 -66315 121533
11939 174239 -283464 -226750 153940 45898 -189691 224509 -40017 34650 -344562 47221
11928 -88680 -42902 -8449 18682 -113835 -159025 -188344 3675 227830 -124515 149799 -17979
$$ packed form
12008D6112J42786R2850b632r543k83319e2764k30433b2711j09308l0882A48395
11996a03495j18728A6558J11225b11329L39c1909m5765a5290k275n0761r4601
11985a62927A64795l3353O0530a4461A3163R4088J71588j07157b45774g6537H0540
11973c0040p1914B22585h543j7853l4299q083j90034A82612D5974h1765j60099
11962b41864e0274I3765a8180h419I3364K33250a44477c6251A77583l0275M0711
11951A88019C8880J43726g9308D4670h753k32264b8395q8998j61423f6315A21533
11939A74239b83464N6714A53940D5898a89691B24509d0017C4650c44562D7221
11928h8680d2902h449A8682a13835m5190k9319C675K24155a24515A49799a7979
$$ plain form
11916 -214323 -67849 -149019 -26849 -148534 181960 58499 90910 53554 141821 -65200 148973
11904 48792 66773 -20424 -97006 -104748 98560 296008 31067 -460052 -132768 178527 -67880
11892 -163959 202830 116891 -190724 -351942 194535 -269663 110178 -143988 -51900 65188
11881 -65744 26194 -46340 230136 34789 -279799 272140 -137606 -189842 -162836 -19429 -54686
11870 -54686 142001 -39934 91405 -99396 166052 -344825 421066 -203360 -340418 -146865
11859 -24906 -174074 130634 -155581 135667 282031 295899 -80752 -105000 -100587 -89581 -157722
11848 -157722 -38027 -113366 24828 46486 86755 -48081 114035 -113583 294482 -3477 -214126
11837 -214126 65854 318165 118583 198373 -22064 142723 -229494 147420 -99561 -88475
$$ packed form
11916b14323f7849q1170b6849j21685A81960E8499L2411l7356Q8267f5200A48973
11904D8792J7981b0424p6582p742I8560J97448C1067d60052a32768A78527f7880
11892a63959B02830q5939a90724j61218A94535b69663A10178a43988e1900F5188
11881f5744B6194d6340B30136C4789b79799B72140a37606n2236K7006a9429l5257
11870e4686A42001c9934I1405i9396A66052c44825D21066b03360j37058a46865
11859b4906j49168A30634a55581A35667J46364J3868h0752k4248M413J1006o8141
11848a57722c8027p5339B4828K1658M0269d8081A14035a13583B94482c477k10649
11837b14126F5854K52311A18583P9790b2064A42723b29494A47420i9561J1086
$$ plain form
11827 -88475 135603 -36435 -145271 161535 -19122 -291802 -302982 141718 88415 174405 160227
11816 160227 124300 -240064 -165365 26234 -271198 -165753 323928 -119621 -58133 -23934
11805 -344256 -372442 48525 -231967 117678 118883 -9920 36544 -333369 -166723 140155 -69202
11793 -78655 87994 106505 190577 87755 -372207 -150147 -48054 -89368 66897 -149561 -475333
11782 -475333 28516 183745 -39261 48021 -181638 482033 81523 -171875 37477 337382
11772 337382 38966 -394761 -155470 -191336 96434 -194647 -270445 -13928 117677 -80820 -230130
11761 -230130 202387 -79670 213715 67810 122685 -159289 -10569 -387738 -229592 295659
11750 -145542 -296107 -249571 -123177 31068 -100648 -47080 -67378 -51777 51461 -230509 206951
$$ packed form
11827h8475A35603c6435j08836A61535a9122k72680j1180A41718n3303Q5990j4178
11816A60227l5927b40064P4699B6234b71198J05445C23928a19621e8133b3934
11805c44256k8186D8525b31967A17678J205i920C6544c33369J66646A40155f9202
11793g8655H7994J8511Q4072H7755c72207a50147d8054m1314F6897a49561l25772
11782d75333B8516J55229c9261D8021a81638D82033H1523a71875C7477K99905
11772C37382C8966c94761a55470l5866I6434a94647p5798a3928A17677h0820j49310
11761b30130B02387g9670B13715F7810N4875a59289a0569l77169J58146B95659
11750a45542j50565M6536a23177C1068a00648d7080k0298J5601E1461b30509B06951
$$ plain form
11738 44132 -249043 -190954 163600 222682 -304307 238913 167413 39312 257693 11992 -66950
11726 53074 -70881 -104075 46314 105990 -242860 -157334 -141269 -64806 -276195 141097 -109575
11714 -360637 70953 101011 259399 13929 198900 -50769 -61846 314845 379628 -50182 312987
11702 -95127 138455 139820 181662 -77373 -232299 39694 -26229 97409 7045 191661 -37332
11690 123328 171887 -149143 338129 106240 78761 123731 177141 113163 -217540 319061
11679 -104934 61485 86235 -63435 -41568 147330 280547 170151 52327 165856 71457 -211015
11667 33956 1596 111175 -139133 -69980 -51750 -57223 46429 -131395 -126512 -363127 -140190
11655 57125 -134965 -162066 113631 172581 205739 -193076 362206 131084 131880 95038 -152585
$$ packed form
11738D4132b49043N8089A63600N9082c04307B38913p1500C9312K18381A1992f6950
11726E3074g0881l3194D6314N9676b42860Q5526J6065f4806k11389A41097a09575
11714c60637G0953L0058J58388A3929J84971e0769j1077C14845O4783e0182C12987
11702i5127A38455J365M1842g7373j54926C9694b6229I7409G045J84616c7332
11690A23328M8559a49143C38129A06240k7479M4970N3410o3978b17540C19061
11679a04934F1485K4750f3435K1867A47330J33217j10396E2327J13529G1457b11015
11667C3956A596J09579a39133O9153J8230n473D6429a31395M883k36615a40190
11655E7125a34965k7101A13631N8950L3158a93076C62206A31084P96l6842a52585
$$ plain form
11643 -4500 147325 -43926 146686 -252907 -22520 -127544 -39657 -251842 -324583 6202 100837
11632 100837 -263217 224268 344409 321059 143974 164197 151638 55299 21164 -68173 209398
11620 7440 110240 -194366 -95789 -110985 -158848 243836 -10025 -75335 60059 59388 -24842 64857
11607 -60327 90380 -125582 45067 182422 -39287 8206 83232 177033 -164353 215817 273172
11596 273172 29311 263015 132473 44194 -70943 223584 7804 210334 158308 71564 451700
11585 451700 235380 59907 -151360 -182246 358105 158391 -46210 -203558 169131 106978
11575 106978 35793 138745 -22659 -50125 -119529 274558 -174969 -9155 13749 47355 115221
11564 115221 91782 84752 317829 -43400 68430 29647 -3218 132851 -105444 76068 -196894
$$ packed form
11643d500A47325d3926A46686b52907b2520j05024c9657k12185p2741F202R4635
11632A00837b63217B24268J20141k3350A43974K0223j2559E5299B1164f8173B09398
11620G440J02800a94366i5789j5196m7863B43836a0025o5310F0059o71b4842F4857
11607f0327I0380a25582D5067J37355c9287H206P5026R3801a64353B15817N7355
11596B73172B9311K33704j30542D4194g0943B23584G804K02530n2026G1564L80136
11585D51700k16320E9907a51360l0886C58105A58391d6210j57348A69131o2153
11575A06978C5793J02952b2659k7466o9404B74558a74969i155A3749L3606O7866
11564A15221k3439p030K33077d3400F8430B9647c218A32851a05444G6068a96894
$$ plain form
11552 113678 -148509 -190850 442935 -28412 -79262 43759 109950 88888 -186762 127351 -25507
11540 -55470 -208037 14102 100680 -132663 -76556 44853 121456 253197 15899 44183 156078
11529 156078 -254194 -40001 -128721 160065 -31664 306856 20349 199250 -83506 42818 225448
11518 225448 128981 103966 380855 -33142 -177743 4975 361815 154942 403636 165888
11507 -30910 190805 -83493 27721 151225 4039 -201415 115783 317291 361088 52979 224905
11496 224905 217054 -119163 197917 79117 270654 407933 173503 94781 113857 40256 -167220
11484 154152 192854 -190631 -138517 -80762 230509 193229 -54013 39935 108690 359825 271379
11473 271379 113844 -139413 51531 196720 427585 -67115 6875 190731 251165 -111641
$$ packed form
11552A13678a48509m2341D42935b8412n0850D3759O6191k1062a86762A27351b5507
11540e5470j52567A4102Q6578a32663N6107D4853P6603J31741A5899K8284J11895
11529A56078b54194d0001q8720A60065c1664C06856B0349J78901h3506D2818J82630
11518B25448r6467k5015K76889c3142j44601D975L56840A54942K48694A65888
11507c0910A90805h3493B7721J23504D039b01415A15783K01508M3797E2979J71926
11496B24905p851a19163A97917G9117J91537J37279A73503p8722J9076D0256a67220
11484A54152L8702a90631N2114N7755B30509l7280e4013C9935O8755K51135q8446
11473B71379A13844a39413E1531J45189K30865f7115F875J83856O0434a11641
$$ plain form
11462 642564 176059 210674 46082 -25847 262601 55562 -38104 -227175 -189752 -151115 -117032
11451 -117032 163866 -6723 263579 170019 -12687 -144205 -36468 232407 112949 230053
11441 230053 516083 137807 110664 -149725 -11936 -33512 366801 126744 84785 213188
11431 213188 311951 53973 70515 184848 -19720 240147 176815 84228 17244 11344 -160225
11419 153516 -167935 -87187 -46094 -274511 -245129 86126 286932 -28503 25908 -55534 -216010
11408 -216010 -87471 43309 234283 -174802 66278 224743 139599 -49161 -30559 -430179 239247
11396 545009 83011 -177963 -38374 -173018 29793 -315496 -66103 205606 -59248 -261887
11386 -261887 122319 216995 -58980 -152935 140529 110359 205396 -98118 38612 -225040 86677
$$ packed form
11462F42564A76059L4615D6082b5847B62601E5562c8104j89071L7423L8637L4083
11451a17032A63866f723B63579r3560a2687j31518c6468B32407A12949J17104
11441B30053K86030A37807k7143a49725a1936k1576C66801A26744m1959J28403
11431B13188R8763E3973J6542J14333a9720B40147o3332H4228A7244n900a60225
11419A53516a67935Q0748M1093k28417K9382H6126K00806b8503B5908e5534j60476
11408b16010h7471D3309J90974a74802F6278J58465q5144d9161J8602l99620B39247
11396E45009H3011a77963c8374j34644B9793c15496f6103B05606e9248k02639
11386b61887A22319R4676e8980r3955A40529l0170R5037i8118C8612b25040H6677
$$ plain form
11374 249011 -162504 -116505 163805 196392 -82986 -31817 -112460 64562 -18149 -139084 87071
11362 181229 88867 354148 -25929 -17156 86688 -413421 -4765 53572 160013 -45613 8105
11350 99216 -192123 39749 -86790 -34281 -41558 133201 25774 99710 -152750 -16518 -340749
11339 -340749 -194235 106898 -30438 173224 -232247 230130 -213636 82798 220123 -41507
11328 145986 -38601 184861 -175763 -91901 -299607 -188094 -149795 -135916 -13511 -29590 60964
11316 -169848 -254524 -118149 -266079 -175881 216937 -194212 -353224 -40087 131436 101761
11306 101761 -309781 -211750 207922 -272214 -126249 49958 -470536 43194 96569 -39095
11295 195281 39895 -223180 44363 -87758 269607 55339 -11275 -104762 -89363 -39367 -183734
$$ packed form
11374B49011a62504M5999A63805L2587h2986c1817q0643F4562a8149j20935H7071
11362A81229H8867K65281b5929Q773H6688d13421d765E3572J06441d5613H105
11350I9216a92123C9749h6790c4281p277A33201B5774P3936a52750a6518l24231
11339c40749J46514A06898c0438A73224b32247B30130b13636H2798J37325d1507
11328A45986c8601A84861a75763Q3862k07706J11513L8299J3879a3511j6079F0964
11316a69848q4676a18149j47930R0198B16937a94212j59012d0087A31436k9675
11306A01761c09781R8031B07922b72214a26249D9958d70536D3194N3375c9095
11295A95281C9895b23180D4363h7758B69607E5339a1275r3487J5399c9367j44367
$$ plain form
11284 -183734 185584 314590 174905 242811 -42984 -28908 -164357 -243493 167302 38694
11273 47503 134356 -51652 243030 135130 -130565 -20862 -153983 -152131 -295128 83556 -94026
11261 12683 -161623 211548 -42740 -521638 -114618 -98146 186227 274398 -268394 -148538
11251 -148538 -319506 -253672 -292164 38937 528211 27916 -167906 -88951 99389 -158439 -346203
11240 -346203 -158218 113053 -52876 65475 -69014 -137975 -78830 -39342 -165877 110849 -306789
11228 -272303 18057 -115865 150157 -184390 -97709 178982 -231000 14546 -363970 -49943
11217 216434 -5520 -21195 -268907 -122710 42488 -88997 124655 -205053 -232069 184210 -46591
11205 112340 -312380 -333771 241508 113625 -220005 81318 -81889 -38943 17356 -105943
$$ packed form
11284a83734A85584J29006j39685O7906d2984J4076j35449p9136A67302C8694
11273D7503Q6853e1652B43030j07900a30565b0862j33121J852j42997H3556i4026
11261A2683a61623B11548d2740m78898a14618J6472A86227Q8171b68394J19856
11251a48538j70968O5834l8492C8937M89274B7916a67906P8955I9389a58439j87764
11240c46203a58218A13053e2876F5475f9014o8961N9145c9342j26535A10849c06789
11228b72303A8057a15865A50157a84390Q6681A78982b31000A4546c63970d9943
11217B16434e520j5675k47712a22710D2488h8997A24655b05053k7016A84210d6591
11205A12340c12380k1391B41508A13625b20005H1318h1889c8943A7356a05943
$$ plain form
11194 -86662 -270151 -36084 -129451 -124074 -132524 185947 -120 272757 109359 261740 -188732
11182 45410 337428 -149981 204691 -232043 105176 -317939 -5417 -86365 33583 102347 110954
11171 110954 291089 92660 -71274 -8041 75514 -48425 -217888 -249684 -61812 -46915 -53101
11160 -53101 -272260 6180 -157077 114732 51468 24062 -199817 47719 173630 199360 94631
11148 -144068 31423 39412 -39651 238707 -155497 10441 199819 -169569 214538 296907 -33800
11136 38210 69746 404354 221978 -101772 -301295 -141768 47459 14442 -29393 -224684
11126 -224684 338683 318898 -379727 -227341 106937 -80193 -21654 -93009 177820 171070 3146
11114 -49175 -295294 -162401 248315 146092 47589 -41165 122622 34797 179137 271313
$$ packed form
11194h6662j83489c6084r3367N377q450A85947a20B72757A09359J52381a88732
11182D5410K92018a49981B04691b32043A05176c17939e417q0948C3583O8764Q607
11171A10954J80135I2660g1274h041G5514d8425j69463l1796f1812J4897o186
11160e3101k19159F180a57077A14732E1468B4062a99817D7719J25911K5730I4631
11148a44068C1423P989c9651B38707a55497A0441J89378a69569B14538Q2369c3800
11136C8210L1536L34608j82376a01772j99523a41768D7459A4442b9393j95291
11126b24684C38683j9785c79727J52386A06937h0193b1654p1355A77820o750C146
11114d9175k46119J32893B48315j02223D7589d1165A22622C4797J44340R2176
$$ plain form
11104 271313 110034 204434 236003 231362 -67401 272149 168837 240690 -78184 62854 -96310
11092 348617 483290 -199 -117294 140827 425312 16705 54493 404346 204521 244578 -62663
11080 230415 171636 241258 163909 182604 269058 183875 348238 613788 160777 295620 249957
11069 249957 120543 190554 330906 511688 119576 362789 482320 477512 143777 653336
11059 653336 317645 443211 744318 756462 457782 466039 694781 681733 815627 1184158
11049 1184158 769746 637387 569593 617039 817381 643294 652783 648468 697860 626765 728409
11038 728409 487760 900421 591230 566341 562449 794848 727578 670367 573393 552927 689968
11027 689968 799518 497574 1104643 773109 584756 774351 590545 800529 373691 665818
$$ packed form
11104B71313A10034R4400L1569m641f7401B72149j03312P1853g8184F2854i6310
11092C48617J34673a99j17095A40827K84485A6705L7788L49853j99825M0057f2663
11080B30415n8779O9622p7349J8695Q6454q5183J64363K65550A60777J34843m5663
11069B49957A20543P0011J40352J80782A19576K43213J19531m808A43777N09559
11059F53336C17645J25566L01107J2144k98680Q257K28742j3048J33894L68531
11049A184158m14412j32359o7794M7446K00342j74087R489m315M9392p1095J01644
11038G28409k40649M12661l09191k4889l892K32399o7270n7211r6974k0466J37041
11027F89968J09550l01944O07069l31534j88353J89595j83806K09984C73691K92127
$$ plain form
11017 665818 872870 1020137 427752 715713 515042 787312 613958 791700 412842 391044
11007 391044 568372 705534 278240 331757 256958 592859 617137 571198 617602 938148
10997 938148 713388 562033 501503 905042 748040 572888 830540 581550 600122 658401
10987 658401 817230 786393 749712 1215059 791678 1028507 866651 832934 1346563 1472836
10977 1472836 1610792 1880265 1802025 2352630 2357940 2494970 2673524 2818034 2790631 2196411
10967 2196411 2247366 1844617 1984694 1193283 1615211 1661087 1476308 1667083 1497023 1409021
10957 1409021 1559374 1599180 2011414 1412637 1032252 764917 760293 1036668 705260 524961
10947 524961 574320 414633 447482 157050 126592 410870 -156906 89071 -135975 115020
$$ packed form
11017F65818K07052J47267D27752K87961k00671K72270j73354J77742l78858k1798
11007C91044J77328J37162B78240N3517p4799L35901K4278m5939M6404L20546
10997I38148k24760j51355o0530M03539j57002j75152K57652k48990J8572N8279
10987F58401J58829l0837l6681M65347m23381K36829j61856l3717N13629J26273
10977A472836J37956K69473p8240N50605N310J37030J78554J44510k7403n94220
10967B196411N0955m02749J40077p91411M21928M5876j84779J90775j70060q8002
10957A409021J50353L9806M12234n98777l80385k67335m624K76375l31408j80299
10947E24961M9359j59687L2849A57050l0458K84278a56906H9071a35975A15020
$$ plain form
10936 178703 46243 175804 256206 171486 -70120 -94477 109927 -204399 353206 134343
10925 -203414 -94000 212297 311942 80777 -80607 -85036 -88987 403606 142569 -195842 24050
10913 135837 -283290 81397 -26271 129383 -253047 29648 316749 -40604 -149251 126648
10902 317306 242271 -52882 203 -238818 110381 70900 -439714 41009 160216 -55063 -276355
10891 -276355 -172312 195812 109418 91681 -38103 19815 211201 -25457 31644 9902 49992
10880 49992 -34441 -119933 -157483 -375122 163456 238830 131746 228416 -63370 -161139 172669
10868 -267972 -65679 -248526 121026 104042 -63145 -9749 27693 -83118 -142431 179279 36243
10856 -136651 138395 -27655 -70919 -221442 -114815 197037 94210 16393 -123070 -230468
$$ packed form
10936A78703D6243J29561Q0402q4720g0120k4357A09927b04399C53206A34343
10925b03414i4000B12297R9645H0777h0607m429l951D03606A42569a95842B4050
10913A35837b83290H1397b6271A29383b53047B9648K87101d0604j08647A26648
10902C17306p5035e2882B03b38818A10381l9481d39714D1009J19207e5063k21292
10891b76355J04043A95812q6394j7737c8103A9815J91386b5457C1644I902M0090
10880D9992c4441q5492l7550k17639A63456P5374j07084R6670f3370r7769A72669
10868b67972f5679j82847A21026j6984f3145i749B7693h3118n9313A79279C6243
10856a36651A38395b7655m3264j50523J06627A97037I4210A6393a23070j07398
$$ plain form
10846 -230468 -104148 -21505 27458 188382 52412 254726 -149009 -32096 -136749 1543 115456
10835 115456 -438465 -54283 -1618 82808 -13845 234996 -55613 -5909 -59433 179559 -309804
10823 -467167 -41927 -22986 107331 -361583 -278442 -41308 -143503 197097 -64730 -346359
10813 -346359 -301185 -25725 106130 67112 231675 -144843 118402 -119492 -123514 -23655 122486
10801 112173 -177069 166844 38796 -248742 19664 20949 -185222 -479301 228690 -46983
10790 181587 -165868 -162110 329260 201778 -43857 183172 250643 151291 -84371 159638 -119004
10778 -41724 -352500 -15140 -93673 -91715 246957 -88060 -55340 125055 246458 170300 -115424
10766 -85282 127871 32672 307410 -318747 -273871 -111929 64297 5986 -4474 -18583 -421089
$$ packed form
10846b30468a04148b1505B7458J60924E2412K02314a49009c2096j04653A543J13913
10835A15456d38465e4283a618H2808a3845B34996e5613e909n3524A79559c09804
10823d67167d1927J8941A07331c61583Q3141d1308j02195A97097f4730k81629
10813c46359M5174b5725A06130l9018J64563a44843A18402a19492m022b3655A22486
10801A12173a77069A66844C8796b48742A9664J285a85222k94079B28690d6983
10790A81587a65868L758C29260j27482d3857A83172O7471r9352h4371A59638a19004
10778d1724l10776a5140p8533J958B46957h8060L2720A25055J21403p6158a15424
10766h5282A27871C2672K74738c18747M4876a11929F4297E986d474j4109m02506
$$ plain form
10755 -421089 -239040 -147688 -196633 -176768 114722 -69 -253608 222638 -10343 50779 -105752
10743 204165 209015 -25520 -243516 181731 -164781 286149 301181 93619 642 228418 -130370
10731 54407 -93519 113832 150839 -109856 -201985 -135113 -48653 -344336 -98183 -32067 -45213
10720 -45213 16232 -42956 -123801 -172676 -9590 119033 -327562 -96564 -327058 -297104 -116667
10708 679938 -463418 -70838 -77379 -123150 -237907 31036 -205122 -333431 137933 -270925
10697 -138842 -210874 71297 -238292 -29149 -1679 14312 130170 -118725 -13109 -393298 -183196
10685 40846 -71109 -226262 -72593 41926 359057 69976 -46541 -276054 216644 -50153 -109118
10674 -109118 -44015 -63888 -69162 117564 -369927 -93823 -7943 -119184 -353324 -92927 2741
$$ packed form
10755d21089J82049R1352m8945J9865A14722f9k53539B22638a0343E0779a05752
10743B04165M850b5520k17996A81731a64781B86149J5032I3619F42K27776a30370
10731E4407i3519A13832L7007a09856r2129O6872d8653k95683i8183c2067j3146
10720d5213A6232d2956q0845m8875i590A19033c27562i6564k30494K9954a16667
10708F79938d63418g0838o541m5771j14757C1036b05122j28309A37933b70925
10697a38842p2032G1297b38292b9149a679A4312J15858a18725a3109l80189a83196
10685D0846g1109j55153g2593D1926L17131F9976d6541k29513B16644e0153n8965
10674a09118d4015j9873n274A17564c69927i3823g943j11241k34140i2927B741
$$ plain form
10662 -158145 59245 -184183 -313738 -209793 88198 -67167 -81918 145849 -13853 -174575
10652 -174575 105346 -289745 -50659 -39390 -191410 87425 -23650 6938 -255679 -388031 -211340
10641 -211340 -221072 -47831 -170904 -26522 -116079 -76181 285384 126152 -104519 143055 76820
10630 76820 -41043 -494548 -31584 384326 -35205 -133632 -114484 -211274 -15709 -220043 122682
10618 -182243 347525 5870 -194290 -424181 41139 31870 -39613 -280037 127269 -57222 174062
10606 -229130 53601 208057 -295350 105074 220745 38542 -53777 248143 -180416 -114669
10596 -114669 179061 99487 131709 -220106 156241 268852 -90864 -215795 -252744 -192878
10586 -192878 -62929 -161642 -186352 -286687 22052 -26105 90500 155143 -16280 264132 -204972
$$ packed form
10662a58145E9245a84183j29555J03945H8198f7167j4751A45849a3853j60722
10652a74575A05346b89745e0659J1269j52020H7425b3650F938b55679j32352J76691
10641b11340r732d7831j23073b6522q9557L9898B85384A26152a04519A43055o6235
10630G6820d1043m53505c1584C84326c5205r8427J9148r6790a5709k04334A22682
10618a82243C47525E870a94290k29891D1139r269c9613k40424A27269e7222A74062
10606b29130E3601J54456b95350A05074J15671C8542e3777B48143a80416O5747
10596a14669A79061p9574L2222b20106A56241J12611i0864j24931l6949N9866
10586a92878f2929r8713k4710j00335B2052b6105I0500O4643a6280B64132b04972
$$ plain form
10574 260979 -113755 103504 109190 -582339 58967 -34424 -317886 175928 92088 -159182
10563 55817 -28892 -33782 -301076 -49844 -83308 -173551 -137952 -155866 -164755 -173182 -126461 -3426
10550 -62060 20546 -213450 69227 217289 -65521 -48730 238263 -270224 -298568 -153855 70264
10538 -139515 150236 -421399 17957 -156017 -361183 -86837 198809 -220650 20572 -137132
10527 130389 -23403 -215415 -58374 71057 36914 -59122 3918 57487 -221178 137219 -100290
10515 56693 -144645 282415 -89225 -165205 -70212 -34393 -46359 240964 111806 -249001 83970
10503 -19813 -152370 -167540 -234569 -45079 -230459 -15225 174983 66962 -431456 156742 -38825
10491 -55651 -57513 153444 -138930 441674 26335 241965 40468 74423 471682 30968 197495
$$ packed form
10574B60979a13755A03504N686e82339E8967c4424k83462A75928q3840a59182
10563E5817b8892m890k67294d9844l3464r0243L5599j7914q889q427M6721c426
10550f2060B0546b13450F9227J48062f5521J6791B38263b70224k8344J44713G0264
10538a39515A50236d21399A7957a56017k05166h6837A98809b20650B0572a37132
10527A30389b3403j92012e8374G1057l4143e9122C918N3569b21178A37219a00290
10515E6693a44645B82415h9225p5980g0212c4393j1966B40964A11806b49001H3970
10503a9813j32557j5170o7029d5079j85380a5225A74983F6962d31456A56742c8825
10491e5651j862A53444a38930D41674B6335K15630D0468L3955L97259C0968J66527
$$ plain form
10480 197495 378456 346413 453862 112451 359426 77567 13480 -69014 39021 676 197985
10469 197985 -300591 75106 37609 -235456 338062 21125 -131401 -177775 128557 128215 -134098
10457 -95574 -94142 -56347 -128308 -84602 -116426 -173473 -146724 201471 -276307 73385 1257 -73108
10444 278763 7264 232416 -94417 333863 -291516 -449488 -26854 9709 -65445 317333 -50660
10432 177288 -163736 114415 299384 14298 140267 -73306 107952 -231009 139849 38500
10421 -48401 -44496 -215928 11416 -64079 -59835 -62936 178054 -72960 -67754 -7072 48478 -171330
10408 12611 90448 33992 -88017 334592 -196655 -46983 110655 -15178 267704 -159814 28753
10396 -36850 -213512 274661 22610 16976 -213983 -141191 -40316 -89976 255472 146018 178261
$$ packed form
10480A97495J80961l2043J07449A12451K46975G7567A3480f9014C9021F76J97309
10469A97985c00591G5106l7497b35456C38062B1125a31401m6374A28557l42a34098
10457i5574J432L7795p1961M3706l1824n7047K6749B01471b76307G3385A257g3108
10444B78763G264K25152i4417C33863b91516j57972b6854I709f5445C17333e0660
10432A77288a63736A14415J84969A4298J25969g3306A07952b31009A39849C8500
10421d8401L905j71432A1416f4079M244l101A78054g2960N206g072D8478a71330
10408A2611P7837C3992h8017C34592a96655d6983A10655a5178B67704a59814B8753
10396c6850j76662B74661B2610n634b13983P2792d0316m9660B55472j09454L2243
$$ plain form
10385 178261 -181068 -38363 -38250 26941 144926 93904 64951 121722 80784 380186 297324
10374 297324 154828 260751 164474 -101560 165458 385888 430220 240207 304019 681926
10364 681926 385133 571090 164898 267026 242519 464601 -20294 204522 128246 -143258
10353 397421 60810 213796 270355 735543 523965 520916 664034 -61141 417099 47719 423095
10342 423095 411263 458669 3034 -20816 86365 -198641 -195636 252408 -370122 149272 236970
10331 236970 153712 31193 351631 186213 -39641 220741 3434 -94200 355394 266676 165483
10320 165483 291578 126932 164708 -16412 137429 197814 150203 136076 -121743 -162494 -265408
10309 -265408 -187970 -158046 7864 233755 52696 -92692 120719 -142952 220312 -15157 -305761
$$ packed form
10385A78261a81068c8363J13B6941J17985n1022k8953N6771m0938K99402q2862
10374B97324j42496J05923r6277a01560A65458K20430M4332j90013O3812L77907
10364F81926k96793J85957A64898J02128k4507K22082b0294B04522p6276a43258
10353C97421F0810J52986N6559M65188k11578l049J43118f1141D17099D7719L75376
10342D23095j1832M7406C034b0816H6365a98641L005B52408c70122A49272Q7698
10331B36970q3258C1193L20438j65418c9641B20741C434i4200C55394q8718j01193
10320A65483J26095A26932L7776a6412A37429O0385m7611j4127a21743m0751j02914
10309b65408P7438K9924G864K25891E2696i2692A20719a42952B20312a5157k90604
$$ plain form
10298 -305761 -134117 65621 145370 111447 -129591 21213 176422 -208233 -234018 -58645 -107277
10287 -107277 -187191 -69223 -118032 51192 -291196 -112179 220960 42791 -244765 -183933 291769
10275 -260434 -97957 72787 121350 -268122 -610355 -63069 -194268 -126883 301574 -53595 288032
10263 39597 47956 83811 -82050 387852 -24776 252769 220447 276323 300949 176532 359050
10252 359050 79436 44181 -297737 -47033 -188563 -408371 -94400 -53498 -49161 -133516 -146248
10241 -146248 97292 171512 -107522 -98943 -154721 -123443 -198675 461615 217667 130613 -50118
10229 263999 276557 116362 -7537 138457 6486 -104360 -215775 -329530 -264507 262112 18982
10217 -16300 -65225 -84094 -58511 7382 -76318 -199989 49696 -6483 255383 54043 -130799
$$ packed form
10298c05761a34117F5621P9749l3923a29591B1213J55209b08233k5785e8645m8632
10287a07277p9914f9223m8809E1192b91196a12179B20960D2791b44765O0832B91769
10275b60434i7957G2787M8563b68122l42233f3069j31199O7385C01574e3595B88032
10263C9597Q359L5855h2050C87852b4776B52769l2322N5876K4626j24417J82518
10252C59050G9436l5255b97737d7033j41530k19808i4400M0902M337q4355j2732
10241a46248I7292P4220a07522Q579n5778L1278p5232D61615B17667q7054e0118
10229B63999J2558A16362g537A38457F486a04360j11415j13755O5023B62112A8982
10217a6300m8925j8869K5583G382g6318j23671D9696f483B55383E4043a30799
$$ plain form
10205 24584 25839 -302422 191612 116402 -72052 -40260 -110482 120733 -95909 -310420 -99967
10193 -91756 -411003 -243550 -32569 -119637 -90397 -3176 -98585 194668 15651 263638 -235530
10181 -87234 -98122 -84867 -152938 -319256 -118077 -43475 -114659 129718 -331973 -42950 184211
10169 162621 60663 -241341 225332 215143 83288 -82320 -229907 41213 -75916 -202597 -59589
10157 58138 -123293 195042 -377110 140696 -292557 37038 130087 -120698 -306082 -333756
10147 -333756 -168432 -21971 125749 -52539 -245767 -52971 -218939 42966 420 56051 19760
10135 -146550 124083 -190549 188432 -31577 -45068 -197994 40748 -240889 -227578 -128653
10125 -128653 -308114 -70282 -99640 -35155 -291226 95924 268145 -111018 116527 -117475
$$ packed form
10205B4584J255c02422A91612p5210g2052L1792p0222A20733i5909k14511i9967
10193i1756l19247J67453c2569q7068K9240c176r5409A94668A5651K47987b35530
10181h7234j0888J3255o8071j66318a18077d3475p1184A29718c31973d2950A84211
10169A62621F0663b41341B25332j0189H3288h2320j47587D1213g5916j26681e9589
10157E8138a23293A95042c77110A40696b92557C7038R3049a20698j85384k7674
10147c33756J65324b1971A25749e2539j93228e2971j65968D2966D20N5631A9760
10135a46550A24083a90549A88432c1577j3491j52926D0748b40889J3311R8925
10125a28653j79461g0282k9358c5155k56071I5924J72221a11018A16527a17475
$$ plain form
10114 163075 58356 188888 36295 -189808 -2010 -78579 -111302 15940 -141789 7972 346506
10103 346506 -168690 84161 101090 -227675 -78490 -110628 20111 -48804 -226049 339965 -186445
10091 -14848 116994 -127756 -333739 -406823 -131833 -359652 -338293 -103328 -1042 -68839 42625
10079 148379 44788 -335830 113527 -294017 292995 46653 318102 -96720 14609 -4788 -182169
10068 -182169 325162 -111839 -52065 259941 -75468 154293 -150537 382797 -323008 -80474
10057 -175685 -86082 851 9169 -69277 160841 181235 -188470 -177713 -236582 -273126 -151880
10046 -151880 -161255 -38155 -90851 -164076 -283738 177800 -280332 -158591 -170959 148126 92815
10035 92815 -130148 80713 -6469 -9643 -73382 71422 -181289 -88558 -48118 10667 -210529
$$ packed form
10114A63075E8356J30532C6295a89808b010p6569l2723A5940a41789G972L38534
10103C46506a68690H4161J6929b27675g8490l2138B0111d8804j77245C39965a86445
10091a4848A16994a27756k05983p3084a31833k27819K1359a03328a042o7797D2625
10079A48379D4788c35830A13527b94017B92995D6653K71449i6720A4609d788j77381
10068a82169C25162a11839e2065B59941g5468A54293a50537C82797c23008h0474
10057a75685h6082H51Q318f9277A60841K0394a88470J0757n8869l6544J21246
10046a51880r375c8155n2696p3225j19662A77800b80332J21741j2368A48126n5311
10035I2815a30148H0713f469l174o3739G1422a81289h8558M0440A0667b10529
$$ plain form
10023 -292692 75885 -104236 238868 212657 72125 -209106 -355244 -184257 16395 38683
10013 38683 464930 -37475 -115229 -195988 -285032 -100641 -301700 -44132 38917 211921 115947
10002 115947 374445 231452 110528 196369 -103900 -420126 -124021 14652 -256122 -76153
9991 -231463 -81763 -50086 -9943 179480 -327392 179831 -354294 -64296 -37553 -140665 -62848
9979 -172529 -171205 -270149 -63272 -33398 -119024 45532 -87919 -231237 -37400 -144182 1746 323659
9967 323659 -253623 -260349 -546409 -126161 -563541 60852 -61101 -66954 -466188 149650 -12251
9955 60963 -3046 157974 -76641 -230960 -40302 125559 -6510 -132110 -8990 -53003 177903
9943 -72285 70109 -100090 336373 -74761 -314059 -194810 -93290 154699 -81032 117706 88414
$$ packed form
10023b92692G5885a04236B38868k6211G2125b09106j46138J70987A6395K2288
10013C8683M26247c7475p7754q0759q9044a00641k01059d4132C8917J73004r5974
10002A15947K58498j42993A10528Q5841a03900l16226a24021A4652b56122g6153
9991b31463h1763L1677i943A79480c27392A79831c54294f4296K6743j03112f2848
9979a72529J324r8944f3272K9874q5626D5532h7919j43318c7400j06782A746L21913
9967C23659b53623o726k86060a26161m37380F0852f1101n853l99234A49650a2251
9955F0963c046A57974g6641j54319d0302A25559f510j25600h990m4013A77903
9943g2285G0109a00090C36373g4761k39298J19249i3290A54699h1032A17706k9292
$$ plain form
9932 88414 -147000 62867 55678 -75565 -59830 97249 141549 -288951 -128071 -415372 -83493
9920 -340831 180832 13164 -45495 -130540 40210 -153046 -16464 34465 -34196 -230927 67328
9908 -218405 326402 174580 -176734 -293971 168490 -58671 -60016 4219 -202232 -366403 -154364
9896 56001 -16415 -261559 -111077 -61503 -350609 -52710 -145975 -467801 39825 -50560 267510
9884 -239681 -2377 -344602 3530 -71711 49821 173753 130565 103212 -325965 -203658 45143
9872 277700 -197165 -215731 -49874 -736 -176445 161829 -391620 52773 -78647 -255031 -10581
9860 -176077 129567 -70999 -270975 62884 -73002 155122 93843 49251 175702 -105568 -340104
9849 -340104 -17292 -459918 -60395 -238992 -142076 -76425 63946 101188 343325 -234740 110303
$$ packed form
9932H8414a47000F2867p189g5565J5735I7249M4300b88951a28071k87301h3493
9920c40831A80832A3164d5495q5045D0210a53046a6464C4465c4196j96731F7328
9908b18405C26402j51822a76734j17237A68490e8671j345D219b02232j64171a54364
9896E6001a6415k45144a11077M9574k89106e2710r3265l21826C9825e0560B67510
9884b39681b377l42225C530g1711D9821J23932m3188k7353c25965J22307D5143
9872B77700a97165j8566d9874g36j75709A61829c91620E2773g8647j76384a0581
9860a76077A29567g0999j99976F2884g3002A55122o1279m4592J26451a05568k34536
9849c40104a7292m42626f0395j78597R6916O5651F3946L7242K42137b34740A10303
$$ plain form
9837 -36631 -112332 -31483 351675 -60637 264717 -71644 -247401 124323 108456 165730 -168981
9825 -145085 -186286 -155072 -47085 -15387 10506 -107962 -208265 -283760 53520 -206493 -65304
9813 -405263 43332 -57991 -40199 84860 -157402 268931 -94093 38016 249955 -214406 -160779
9802 -160779 36581 -190518 11539 -297420 -220854 50688 -76588 175610 -371000 -94707 -55137
9791 -55137 -132397 -139868 -214077 216784 100800 253425 -30551 78330 -61407 -199383 -173667
9780 -173667 -166023 -844571 -337394 -133892 -284910 -214503 89864 127971 -244073 -238023 -76959
9768 -352203 33186 -264720 -326214 -162091 -168419 -203575 -53626 -12185 -99266 -398318 121 193209
9756 193209 -30231 -446014 -153581 -185764 81522 -18855 37677 186039 240530 -200664 25746
$$ packed form
9837c6631p5701c1483C51675f0637B64717g1644j75757A24323j5867N7274a68981
9825a45085m1201L1214d7085a5387A0506a07962j00303p5495E3520b06493f5304
9813d05263D3332e7991J7792H4860a57402B68931i4093C8016K11939b14406N3627
9802a60779C6581a90518A1539b97420P6566E0688g6588A75610c71000i4707L9570
9791e5137p7260p471p4209B16784A00800J52625c0551G8330f1407j37976K5716
9780a73667P644o78548c37394a33892j51018P0407H9864L8107b44073O050g6959
9768c52203C3186b64720o1494a62091o328l5156e3626a2185q7081k99052A21J93088
9756A93209c0231m15783a53581l2183H1522a8855C7677J48362N4491b00664B5746
$$ plain form
9744 -122711 -261639 -3342 -47235 108011 25999 -13494 -188691 -295378 -240533 2994 -94498
9732 -316888 -210227 -164728 212363 -44320 -64205 27053 -68822 -213994 -162133 75179 -206815
9720 13312 -5751 -327088 -176192 -38225 34917 59228 -334143 -116873 164619 312831 319100
9709 319100 144975 380493 -59083 13865 -96140 69524 -23350 163941 -115532 -47334 -338341
9698 -338341 -57904 -104037 120673 -139067 -177080 -294542 -400135 -257084 -30199 -17477 -206309
9687 -206309 153851 -267559 -178515 -46499 -53725 -313055 -53285 -72894 -287396 -41927 -284518
9676 -284518 -115490 -80224 168853 -206159 -147295 -371905 24706 -251905 160580 147272
9666 147272 -40524 66394 23837 -164094 160737 -81645 -92322 -58143 -126213 -3480 -109460
$$ packed form
9744a22711j38928c342m3893A08011B5999a3494j75197j06687N4845B994i4498
9732c16888J06661M5499B12363d4320j9885B7053f8822j45172N1861G5179b06815
9720A3312e751l21337J50896c8225C4917K4311c34143a16873A64619J48212O269
9709C19100A44975K35518e9083A3865i6140F9524b3350A63941a15532d7334k91007
9698c38341e7904m6133A20673a39067l8013j17462j05593J43051c0199J2722j88832
9687b06309A53851b67559Q9044d6499p226k59330e3285j9609k14502d1927k42591
9676b84518a15490L5266A68853b06159N8864k24610B4706b51905A60580j3308
9666A47272d0524F6394B3837a64094A60737h1645j0677L4179o8070c480j05980
$$ plain form
9655 -109460 -238312 621 153650 107122 15921 -159416 95102 -133961 178842 -152040 -368454
9644 -368454 13034 -106086 -187032 32480 5517 54806 -122702 -97081 -227277 -159518 -34679
9632 -69635 184820 -151259 283852 101244 -26642 206286 -118695 -103188 -43702 -61153 -16699
9620 -134966 45980 374579 -138391 -291488 207489 5942 -267851 -142319 -171624 -226899 -105919
9608 -125547 -205371 15520 -11169 -80188 325564 223984 -104976 11820 -82640 -173377 24528
9596 96833 -135673 -17367 -17830 -131185 4849 160928 220462 -80592 -103196 -342122 -116296
9584 -76458 218866 -104317 -63720 -39104 -92381 169500 253004 24332 -216733 144784 -409755
9572 -51620 -85044 -132792 -357526 16769 -199429 -98419 -173080 -253021 -173115 -8687 -111244
$$ packed form
9655a09460j28852F21J53029m6528A5921a59416I5102a33961A78842a52040k16414
9644c68454A3034a06086q0946C2480E517M9289a22702K5621j30196O7759c4679
9632f9635A84820a51259B83852A01244b6642B06286a18695J5507d3702j7451a6699
9620a34966D5980L28599a38391j53097B07489E942b67851J25532k9305n5275a05919
9608a25547p9824A5520a1169o9019C25564j01580a04976A1820h2640r0737B4528
9596I6833a35673a7367m63j13355D849J56079N9534h0592k2604k38926a16296
9584g6458B18866a04317M0597K4616n3277A69500Q3504B4332b16733A44784d09755
9572e1620l3424m7748k24734A6769a99429i8419p4661p9941P9906h687j02557
$$ plain form
9561 -111244 -180130 -81641 -372916 -176464 295064 -154081 -318163 89053 148516 -351482
9550 59200 -220047 -55394 -175844 33908 11988 -10580 -343124 -326845 -104860 -32735 -48289
9539 -48289 -33709 -122346 -277925 -200923 -342779 109460 39250 -122683 -196804 -245026 180747
9527 65586 -231043 -103956 -123564 450604 148250 -309106 13894 46566 287772 -39482 -304895
9516 -304895 227787 -11113 -126158 -150434 102382 -100073 -291371 -79615 -50050 38213 -227544
9504 -32003 -161985 -140044 -55432 -154369 -589261 -172558 -64494 -125621 -440323 -267231 140257
9492 -497194 58578 161071 -188077 -221582 -44812 -250558 196965 -399543 -36293 -104001 244562
9480 337628 90690 -363668 -33877 -138237 190559 120636 -161681 89551 1455 -174787 208412
$$ packed form
9561a11244o8886h1641k91275a76464B95064a54081j64082H9053N9463c51482
9550E9200b20047e5394j20450C3908A1988a0580l32544J6279a04860c2735j5554
9539d8289J4580q8637j55579P7002j41856A09460C9250a22683p4121m8222A80747
9527F5586b31043a03956j9608D50604A48250c09106A3894L2672K41206c9482k65413
9516c04895B27787a1113j15045k4276A02382a00073j91298g9615K9565C8213b27544
9504c2003j29982K1941e5432r8937m34892a72558f4494o1127l14702J73092A40257
9492d97194E8578J02493a88077l3505d4812k05746A96965c99543c6293o7708B44562
9480C37628I0690c63668c3877j04360A90559o9923a61681H9551A455a74787B08412
$$ plain form
9468 77001 -157033 -105379 -176821 -318146 -116166 22874 -14324 -120659 -342449 45391 107317
9457 107317 72153 -330832 3120 -174239 158831 -23578 450323 -126963 44878 -147735 275792
9445 111731 187953 10854 2741 -89158 39419 20975 -243636 -317240 -113239 61576 -68416
9433 -125206 -85560 -45221 -181530 -256588 -73753 -203751 145195 19155 -63816 -443221 -88216
9421 -601317 -114502 -278790 -214397 827 55816 236569 -27627 -187500 196594 368266 -169577
9409 195422 -272687 -574035 191443 -225849 -123630 118452 -96806 83227 206044 78395
9398 -68253 -183407 -151192 17389 -4895 -242879 50698 283263 110167 -38290 45620 -52271
9386 -103484 41064 -143765 11173 -281390 -115539 -11671 -77202 28819 56190 -259128 -9317
$$ packed form
9468G7001a57033N1654p1442j41325a16166B2874a4324j06335k21790D5391O1926
9457A07317l5164c30832C120a74239A58831b3578D50323a26963D4878a47735B75792
9445A11731P6222A0854B741h9158C9419j8444b43636p3604a13239F1576f8416
9433a25206L9646M0339j36309p5058g3753j29998A45195A9155f3816l79405h8216
9421f01317a14502j64288O4393H27N4989J80753b7627j59873A96594J71672a69577
9409A95422b72687l01348A91443b25849J02219A18452i6806H3227J22817G8395
9398f8253j15154L2215A7389d895k37984E0698K32565A10167c8290D5620e2271
9386a03484D1064a43765A1173b81390a15539a1671o5531B8819K7371b59128i317
$$ plain form
9374 -95485 -250038 -234315 236064 49917 198919 -202049 60920 17373 60032 -133995 -147033
9363 -147033 256310 -220493 -31795 -245439 -157133 79 45448 254416 238353 -88980 -103810
9352 -103810 -183857 -141639 44377 -441610 -409193 -230091 -295722 -71844 -142921 -455862 -69609
9340 -180486 -351995 139360 -28878 41893 -54879 62813 -27845 -76171 -104379 401538 129713
9328 -63720 -129278 -58600 -114028 16038 -227081 48741 125856 -307872 -142420 58385 -294484
9316 -242049 -99114 -265789 67348 915 111913 -52036 -27204 -36975 -252686 -136839 -180853
9305 -180853 -194057 19407 -111440 -128268 -133247 -176144 -101697 40822 265515 -182513 -153010
9294 -153010 23477 -72694 -222361 126889 24959 30425 -102449 -280955 218759 -249574 219188
$$ packed form
9374i5485j54553J5723B36064D9917J49002b02049F0920A7373M2659a33995j3038
9363a47033B56310b20493c1795k13644Q8306G9M5369K08968j6063h8980j4830
9352a03810q0047M2218D4377d41610L2417J79102o5631g1844p1077l12941f9609
9340a80486j71509A39360b8878D1893e4879F2813b7845m8326k8208D01538A29713
9328f3720o5558e8600n5428A6038b27081D8741P7115c07872a42420E8385b94484
9316b42049i9114j66675F7348I15J10998e2036K4832r771k15711J15847m4014
9305a80853j3204A9407a11440j6828m979m2897P4447D0822K24693a82513K9503
9294a53010B3477g2694j49667A26889B4959N466a02449j78506B18759b49574B19188
$$ plain form
9282 -141290 16519 -127250 -46472 121732 -328303 -23048 -31157 -187790 -90799 -125142 -202247
9271 -202247 147090 80756 38623 -72731 -195652 -74020 -217251 -194938 159332 -292075 105926
9259 184283 181832 -149944 22312 92875 158779 -90461 105919 -261615 -192736 -122138 -454512
9248 -454512 79291 221463 -8928 -19764 -253401 -177583 156590 42238 -11588 -284075 -544791
9237 -544791 -63239 -49396 -300486 65165 44257 -136681 -33489 32179 125340 35605 -5591
9225 227773 18182 -13810 79661 -170700 -432910 36617 51820 -239846 -238368 -333610 -222756
9214 -222756 -34030 137116 -86710 -13283 -170701 94545 -97379 34851 -22008 40994 316340
9203 316340 -128569 -342767 -1832 -325442 215014 593782 -146604 -79551 -5241 146004 -212971
$$ packed form
9282a41290A6519a27250d6472A21732c28303b3048q109j56633i0799l4343p7105
9271b02247A47090o6334C8623g2731j22921g4020j43231K2313A59332b92075A05926
9259A84283k451a49944B2312P0563O5904i0461A05919b61615O8879P0598l32374
9248d54512G9291J42172h928j0836k33637P5818A56590D2238a1588k72487k60716
9237e44791f3239J3843k51090F5165k0908a36681c3489C2179R3161C5605e591
9225B27773A8182a3810G9661a70700k62210C6617J5203b39846J478r5242J10854
9214b22756c4030A37116h6710a3283j57418I4545i7379C4851b2008D0994K75346
9203C16340a28569k14198a832l23610B15014L78768a46604O7053e241A46004b12971
$$ plain form
9191 321163 10227 359034 -69924 -228228 -423688 -37681 -181777 -53083 -153270 22522 180608
9180 180608 -160271 -29981 152307 -63614 -241426 58193 896 103758 -204901 -41872 61883
9168 -25910 109733 50967 88667 17409 35040 96671 202714 74464 -50877 -24077 151466
9156 417259 93973 -187567 -74907 100829 -218155 -376317 -211056 -95566 -24228 -179980
9146 -179980 225645 -182524 149725 -154392 -160982 -475884 -280962 -108836 -55974 103427
9135 -162561 -207674 -46179 -252522 32845 184833 141632 -14727 68419 -49322 -35165 -50564
9124 -50564 -215683 149330 53508 39943 338142 42222 -34682 159968 -142177 -133206 -149149
9113 -149149 241909 -204132 -279642 -266265 -125878 -399841 -225041 -71230 -235533 -249586
$$ packed form
9191C21163A0227L48807f9924j58304j95460c7681j44096e3083j00187B2522J58086
9180A80608a60271b9981A52307f3614j77812E8193H96J02862b04901d1872F1883
9168b5910A09733E0967L7700A7409J7631O1631J06043G4464e0877b4077A51466
9156D17259I3973a87567g4907A00829b18155j58162J65261i5566b4228j55752
9146a79980B25645a82524A49725a54392o590l14902J94922a08836N2862A03427
9135a62561m5113d6179k06343C2845J51988m3201a4727F8419d9322J4157j5399
9124e0564j65119A49330E3508j3565K98199D2222c4682A59968a42177Q971j5943
9113a49149B41909b04132p5510J3377a25878k73963J74800g1230j64303j4053
$$ plain form
9103 -249586 -133979 81083 -357034 31057 -290468 46784 -209898 18531 147658 -174481
9092 62547 202122 51486 -174672 -159610 48446 -183964 -284379 -64714 -100419 -157759 -75842
9080 -280045 164440 -69284 21701 -17064 -58658 -201194 119088 129669 233427 -159633 -107945
9069 -107945 351325 50061 -89183 -157228 406 -308845 -207886 -300194 172491 -225966 100781
9057 -75858 -58077 -152585 -102739 -181323 -323572 -105378 177675 234085 -141413 -39165 -170388
9046 -170388 141383 -283116 -267316 -270109 -185063 27724 -150968 -116951 -200332 -465651 5206
9034 -336553 89684 -194299 -27132 -171599 -49217 -90227 -83683 -214828 -139567 -378593 51117
9022 44829 213720 -200502 -296478 216845 -138217 -281254 195748 37123 -166304 -304647
$$ packed form
9103b49586J15607H1083c57034C1057b90468D6784b09898A8531J29127a74481
9092F2547J39575E1486a74672J5062D8446a83964j00415f4714l5705n7340g5842
9080b80045A64440f9284B1701a7064m1594j42536A19088J0581J03758a59633N1688
9069a07945C51325E0061h9183o8045D06c08845J00959r2308A72491b25966A00781
9057g5858J7781r4508M9846p8584j42249a05378A77675N6410a41413c9165j31223
9046a70388A41383b83116J5800k793Q5046B7724a50968L4017q3381k65319E206
9034c36553H9684a94299b7132j44467d9217m1010O544j31145P5261k39026E1117
9022D4829J68891b00502r5976B16845a38217j43037A95748C7123a66304j38343
$$ plain form
9012 -304647 -70162 -48861 -385440 -60468 4176 -327984 -175370 266673 102021 120632 -68074
9000 28356 -17853 -92096 -377850 -93287 -104404 -152400 -56969 64233 -59015 -71360 -43017 -349291
8988 -349291 77117 783 -105963 244309 -179127 -273951 -224956 -101795 221136 -102240 -220717
8977 -220717 -190742 44187 -244015 -95668 82988 -78782 88930 -285272 -481692 -116125 -171496
8966 -171496 -41491 17496 -199398 -80116 -38222 -63581 -9011 -35657 -95878 74432 85585 310729
8954 310729 191202 -191808 -18170 -15397 -113205 -206771 -200627 -69312 -108444 145046 -4079 184260
8941 -133570 -49932 -172219 -159896 7848 -201174 -11430 130430 250413 215499 -83115 23048
8929 -128332 -259932 134010 7216 87937 222096 872313 1714026 7217162 20970100 6138137
$$ packed form
9012c04647g0162K1301l36579f0468D176c27984J52614B66673A02021J8611f8074
9000B8356a7853p4243k85754i3287j1117m7996e6969F4233e9015j2345K8343l06274
8988c49291G7117G83a05963B44309a79127r4824M8995a01795B21136a02240j18477
8977b20717K9975D4187b44015i5668H2988g8782H8930b85272j96420a16125n5371
8966a71496d1491A7496a99398h0116c8222k5359i011k6646o0221G4432J1153K25144
8954C10729j19527a91808a8170K773r7808r3566O144f9312l9132A45046d079A84260
8941a33570d9932j22287J2323G848b01174a1430A30430J19983l4914h3115B3048
8929a28332j31600A34010G216Q0721J34159O50217Q41713N503136J3752938F138137
$$ plain form
8918 1738284 580318 404319 665557 165316 22469 -260395 73628 287128 133805 409191
8908 409191 490487 200981 283862 -252357 32840 7080 -317492 -100317 -139725 -34237 -23448
8897 -23448 -386215 53973 -163730 208068 210699 4080 9709 98252 6118 270401 -18880 152886
8884 -74349 -134190 192708 -70464 -83637 52650 60975 145480 238832 -32385 18042 -115084 -340024
$$ packed form
8918A738284E80318j75999K61238A65316B2469b60395G3628K13500A33805K75386
8908D09191Q1296B00981Q2881b52357C2840G080c17492a00317l9408c4237J0789
8897b3448l62767E3973a63730B08068K631D080N629Q8543F118K64283a8880A52886
8884g4349n9841A92708g0464j3173E2650Q325Q4505R3352c2385A8042a15084k24940
$$ [...]
##END NTUPLES=NMR SPECTRUM
##END=
