
##TITLE=UV1265_M12_1292-1216_20_7414333_0zVrbZ4gNm
##JCAMPDX= 6.0         $$ Bruker NMR JCAMP-DX V2.0
##DATA TYPE= NMR SPECTRUM
##DATA CLASS= NTUPLES
##ORIGIN= BRUKER
##OWNER= Administrator
$$ 1.72 TOPSPIN		Version 2.1
$$ 2013-01-25 20:43:28.798 -0500  Administrator@X
$$ Compression mode = diff/dup
##.OBSERVE FREQUENCY= 400.02188249412
##.OBSERVE NUCLEUS= ^1H
##.ACQUISITION MODE= SIMULTANEOUS (DQD)
##.ACQUISITION SCHEME= undefined
##.AVERAGES= 8
##.DIGITISER RES= 22
##SPECTROMETER/DATA SYSTEM= spect
##.PULSE SEQUENCE= zg30
##.SOLVENT NAME= COFFEE_meoh
##.SHIFT REFERENCE= INTERNAL, COFFEE_meoh, 1, 14.98509
##AUDIT TRAIL= $$ (NUMBER, WHEN, WHO, WHERE, PROCESS, VERSION, WHAT)
$$ ##TITLE= Audit trail, TOPSPIN		Version 2.1
$$ ##JCAMPDX= 5.01
$$ ##ORIGIN= Bruker BioSpin GmbH
$$ ##OWNER= Administrator
$$ $$ E:\/data/COFFEE/nmr/UV1265_M12_1292-1216_20_7414333_0zVrbZ4gNm/10/pdata/1/auditp.txt
$$ ##AUDIT TRAIL=  $$ (NUMBER, WHEN, WHO, WHERE, PROCESS, VERSION, WHAT)
(   1,<2013-01-25 20:43:20.533 -0500>,<Administrator>,<X>,<go>,<TOPSPIN 2.1>,
      <created by zg
	started at 2013-01-25 20:42:14.580 -0500,
	POWCHK enabled, PULCHK disabled,
       configuration hash MD5:
       86 BA 57 50 F2 9D 5C 9B 26 00 A9 28 5F 66 2E 89
       data hash MD5: 64K
       34 0B 52 EF C4 99 88 5F DC 56 30 A5 01 A9 82 D9>)
(   2,<2013-01-25 20:43:23.564 -0500>,<Administrator>,<X>,<proc1d>,<TOPSPIN 2.1>,
      <Start of raw data processing
       efp LB = 0 FT_mod = 6 PKNL = 1 PHC0 = 0 PHC1 = 0 SI = 32K 
       data hash MD5: 32K
       C9 C2 C9 E0 B6 6B 1E 6B EB 9A B7 C5 8B 3B 1B 5B>)
(   3,<2013-01-25 20:43:24.017 -0500>,<Administrator>,<X>,<proc1d>,<TOPSPIN 2.1>,
      <pk PHC0 = 100.2832 PHC1 = 0 
       data hash MD5: 32K
       7D 5C 33 B2 8F 2A B7 6F 0B A6 E8 47 FC 37 3E 7E>)
(   4,<2013-01-25 20:43:24.252 -0500>,<Administrator>,<X>,<proc1d>,<TOPSPIN 2.1>,
      <abs ABSG = 1 
       data hash MD5: 32K
       59 30 68 AD F1 89 3B 86 A7 3A 50 D0 55 2C 83 65>)
(   5,<2013-01-25 20:43:24.392 -0500>,<Administrator>,<X>,<proc1d>,<TOPSPIN 2.1>,
      <abs ABSG = 2 
       data hash MD5: 32K
       90 10 D1 B8 07 1F A4 7D C0 FA FA 0C 7F B9 88 28>)
(   6,<2013-01-25 20:43:24.533 -0500>,<Administrator>,<X>,<proc1d>,<TOPSPIN 2.1>,
      <abs ABSG = 3 
       data hash MD5: 32K
       89 94 33 8C 98 8E 40 DA 43 E2 3E BD 1B 1D A9 AE>)
(   7,<2013-01-25 20:43:24.689 -0500>,<Administrator>,<X>,<proc1d>,<TOPSPIN 2.1>,
      <abs ABSG = 4 
       data hash MD5: 32K
       25 D0 37 00 5A AB 92 25 78 E6 C5 29 7D 3E 36 81>)
(   8,<2013-01-25 20:43:24.830 -0500>,<Administrator>,<X>,<proc1d>,<TOPSPIN 2.1>,
      <abs ABSG = 5 
       data hash MD5: 32K
       18 DA D6 F0 73 BD 8F 42 99 D2 31 5C 68 7E 1C 95>)
$$ ##END=
$$ 
$$ $$ hash MD5
$$ $$ CD FC 9D 42 CE 9A C7 B5 03 FD BE CD E1 EB EC 6D
##$RELAX= 
##$RELAX= 
##$RELAX= 
##$RELAX= 
##$RELAX= 
##$RELAX= 
##$RELAX= 
$$ Bruker specific parameters
$$ --------------------------
##$DU= <E:\>
##$EXPNO= 10
$$ [...]
150 150 150 150 150 150 150 150
##$TP07= 0
##$TPNAME0= <>
##$TPNAME1= <>
##$TPNAME2= <>
##$TPNAME3= <>
##$TPNAME4= <>
##$TPNAME5= <>
##$TPNAME6= <>
##$TPNAME7= <>
##$TPOAL= (0..7)
0.5 0.5 0.5 0.5 0.5 0.5 0.5 0.5
##$TPOFFS= (0..7)
0 0 0 0 0 0 0 0
##$TUNHIN= 0
##$TUNHOUT= 0
##$TUNXOUT= 0
##$USERA1= <user>
##$USERA2= <user>
##$USERA3= <user>
##$USERA4= <user>
##$USERA5= <user>
##$V9= 5
##$VALIST= <valist>
##$VCLIST= <CCCCCCCCCCCCCCC>
##$VD= 0
##$VDLIST= <DDDDDDDDDDDDDDD>
##$VPLIST= <PPPPPPPPPPPPPPP>
##$VTLIST= <TTTTTTTTTTTTTTT>
##$WBST= 2048
##$WBSW= 25
##$XGAIN= (0..3)
0 0 0 0
##$XL= 0
##$YL= 0
##$YMAX_a= 633910
##$YMIN_a= -541504
##$ZGOPTNS= <>
##$ZL1= 120
##$ZL2= 120
##$ZL3= 120
##$ZL4= 120
##$ABSF1= 14.98509
##$ABSF2= -5.573092
##$ABSG= 5
##$ABSL= 3
##$ALPHA= 0
##$AQORDER= 0
##$ASSFAC= 0
##$ASSFACI= 0
##$ASSFACX= 0
##$ASSWID= 0
##$AUNMP= <proc_prof1d_extract_pilot.lims>
##$AXLEFT= 0
##$AXNAME= <>
##$AXNUC= <1H>
##$AXRIGHT= 0
##$AXTYPE= 0
##$AXUNIT= <>
##$AZFE= 0.1
##$AZFW= 0.1
##$BCFW= 0
##$BC_mod= 0
##$BYTORDP= 0
##$COROFFS= 0
##$CY= 15
##$DATMOD= 1
##$DC= 0
##$DFILT= <>
##$DTYPP= 0
##$F1P= 0
##$F2P= 0
##$FCOR= 0.5
##$FTSIZE= 32768
##$FT_mod= 6
##$GAMMA= 0
##$GB= 0
##$INTBC= 1
##$INTSCL= 1
##$ISEN= 128
##$LB= 0
##$LEV0= 0
##$LPBIN= 0
##$MAXI= 10000
##$MC2= 0
##$MEAN= 0
##$ME_mod= 0
##$MI= 0
##$NCOEF= 0
##$NC_proc= -8
##$NLEV= 6
##$NOISF1= 0
##$NOISF2= 0
##$NSP= 0
##$NTH_PI= 0
##$NZP= 0
##$OFFSET= 14.98509
##$PC= 1
##$PHC0= 100.2832
##$PHC1= 0
##$PH_mod= 1
##$PKNL= yes
##$PPARMOD= 0
##$PPDIAG= 0
##$PPIPTYP= 0
##$PPMPNUM= 2147483647
##$PPRESOL= 1
##$PSCAL= 4
##$PSIGN= 0
##$PYNMP= <proc.py>
##$REVERSE= no
##$SF= 400.02
##$SI= 32768
##$SIGF1= 0
##$SIGF2= 0
##$SINO= 400
##$SIOLD= 32768
##$SPECTYP= <>
##$SREGLST= <1H.CDCl3>
##$SSB= 0
##$STSI= 32768
##$STSR= 0
##$SW_p= 8223.68421052631
##$SYMM= 0
##$S_DEV= 0
##$TDeff= 65536
##$TDoff= 0
##$TI= <>
##$TILT= no
##$TM1= 0
##$TM2= 0
##$TOPLEV= 0
##$USERP1= <user>
##$USERP2= <user>
##$USERP3= <user>
##$USERP4= <user>
##$USERP5= <user>
##$WDW= 1
##$XDIM= 32768
##$YMAX_p= 472446261
##$YMIN_p= -792831
##$CURPLOT= <Network HP LaserJet P1505>
##$CURPRIN= <$Network HP LaserJet P1505>
##$DFORMAT= <normdp>
##$LAYOUT= <+/1D_H.xwp>
##$LFORMAT= <normlp>
##$PFORMAT= <normpl>
##$SURQMSG= 1
$$ End of Bruker specific parameters
$$ ---------------------------------
##NTUPLES= NMR SPECTRUM
##VAR_NAME=  FREQUENCY,     SPECTRUM/REAL,   SPECTRUM/IMAG
##SYMBOL=    X,             R,               I
##VAR_TYPE=  INDEPENDENT,   DEPENDENT,       DEPENDENT
##VAR_FORM=  AFFN,          ASDF,            ASDF
##VAR_DIM=   32768,         32768,           32768
##UNITS=     HZ,            ARBITRARY UNITS, ARBITRARY UNITS
##FACTOR=    0.250966925370066, 1,           1
##FIRST=     8223.43324360094, -179112,      199740
##LAST=      0,             152428,          -68469
##MIN=       0,             -792831,         0
##MAX=       8223.43324360094, 472446261,    0
$$ Real data points
##PAGE= N=1
##DATA TABLE= (X++(R..R)), XYDATA
$$ [...]
23848 -436091 -148660 -110599 68042 4989 -176036 -212407 -106894 229136 -367025 102728
23837 -338093 20590 209973 219891 -34944 -330617 -91563 -49002 -77089 205066 10606 -19376
23825 -100316 200840 237150 -195884 -244998 23649 -35149 -8308 -228398 -392503 62127 222958
23814 222958 -320147 -138390 -741 -115636 154108 -35432 228309 -137105 -128532 -14307 48956
23802 20600 -67624 166208 -88906 -109111 -57615 39301 -7702 89813 -247672 92074 -216359
23790 28970 -89196 -87499 70100 141628 -252043 328716 41294 -154765 -86880 256879 104432
23778 -234324 -163279 28777 -331054 -155091 -65178 -133741 66876 -386095 -70693 -262351 -71512
23766 10990 48921 -412774 -128406 -18677 -41560 32728 -37780 34592 35070 -106567 -217704
23755 -217704 346578 -220604 142708 -26693 190951 -160125 -196871 -3298 205834 125002
23745 125002 -293941 173374 -65730 -55622 -174737 -73878 -90606 155633 -74758 -62497 236639
23733 -230233 106274 65215 -48995 266026 67389 45446 -109191 160105 31499 -58068 40694
23721 -3709 226212 173431 -247429 -55834 24296 -181574 181900 158789 23900 121119 61796
23710 61796 -120167 156774 -70065 -177684 -147049 -83255 -612 253060 -28587 -203440 -119938
23699 -119938 67571 -159669 -35831 154456 21302 448196 587000 5934 -229692 -254360 88464
23687 77320 122837 170491 -92549 107017 -105861 -174920 82176 91426 -7871 -68814 127079
23675 36129 -179689 86445 -224840 -24435 -36780 -83709 112002 -193951 106327 63049 -67423
23663 -282148 12830 185288 -282060 223334 -348625 12017 111853 305697 474323 125924
23652 93196 -184648 -68421 115360 -21179 218448 -51350 -102119 -43966 -5255 -112986 11344
23640 197449 -145549 -474974 77711 124056 24987 366121 -118258 -130812 234177 264162
23630 264162 -199693 -238074 47519 173469 -2404 94537 -168626 -121286 -36306 -353840 55214
23618 229694 -143386 60924 -124956 115421 -30797 55237 -128257 75130 -88615 -18136 -157123
23607 -157123 -224795 76599 132435 -137069 -106564 -182055 153976 -313644 -165932 -145462 226747
23595 -319036 -145018 -74474 41693 22029 -174363 192333 -20023 -46403 -104018 204826 161736
23584 161736 -273400 -8912 -242197 -69611 88502 87826 1166 234485 -154633 -188597 -152701
23573 -152701 148320 -7849 93528 -217279 -29539 -83445 292349 34323 -338744 155918 -104753
23561 65474 47880 54330 -148535 -125496 -230170 242203 -348302 -155958 168250 239306 221657
23550 221657 -448480 -8831 -110950 2925 30985 96896 160659 61639 -36500 27953 130887
23539 130887 262239 190213 66086 72772 117181 195001 116699 -86001 75802 132156 -333899
23527 22627 120192 -26992 109919 -322808 28574 -296637 -146841 -135468 71833 -277882 433278
23515 -98740 -70601 -11110 241137 -88106 -42013 -72040 -33869 235469 268633 186437 16701
23503 202019 -194101 106704 160714 -79028 -5319 -11114 -120796 -131474 275640 266559 -54241
23491 -56803 -30202 72051 -341989 -179168 -37935 10573 -114940 224014 -27249 -345034 278940
23479 -88745 82552 80401 138509 -22487 -31772 88516 -96415 135709 79970 -156574 239912
23467 -355781 -58371 -113547 -148149 -285975 93798 -72837 -44020 258144 -18667 -177518 -63606
23455 249077 124456 -41608 64708 91613 -130286 226026 -139887 107429 27698 209136
23445 209136 -208959 -180763 107890 -162533 -150857 97792 -9940 156616 56159 -4838 -26261
23434 -26261 146227 -78041 -259790 -164328 -37694 325184 239997 -105463 152724 -83414 28316
23422 -246143 179110 86628 -141726 334471 437194 -219181 -30511 18711 166127 -149841
23411 -67855 -137192 -34034 9892 -182856 -222511 120817 222010 -252384 -293733 316430 -397275
23399 -88328 -252545 -297389 122491 -211361 -253547 198808 -365366 -82802 69164 -62611 93426
23387 146166 97961 -150463 -55071 67395 75585 313452 76865 -305759 175681 146547 -65192
23375 79060 -203149 -227257 -84251 -207257 -28124 163601 23664 6375 75878 -19358 89027
23363 -262153 167861 -242218 1137 -183998 -380223 29500 58049 90216 321515 -12524 -144414
23352 -144414 -439870 -359097 141003 35153 -22967 -275795 -269184 -193229 -161832 -170790 -164757
23341 -164757 -192486 -136945 151755 115125 -298341 -88142 222797 525300 -178741 -227042
23331 -227042 19410 108164 -80966 -312629 -75037 32819 -23624 208821 -24627 -263259 -219992
23320 -219992 102247 175801 -16877 -159728 -113079 261347 -91035 452336 -158700 -224611
23310 -224611 298910 -168902 68898 20246 37452 -199741 -121946 -116531 74841 108736 -77263
23298 54457 -10723 -57945 312373 -335852 54387 233192 276503 -49319 -123380 48393 -225105
23286 361577 73975 106530 27338 -157763 -134791 225179 65482 -145201 34649 -90020 277136
23274 -202666 -121449 -159065 -126731 -185089 -82801 -266666 -60021 -127304 158113 -166136 -31213
23262 63724 -19186 10478 64589 45363 -48218 49148 37207 262931 -26883 -1072 39457 393870
23250 393870 114591 -157456 -344464 -14173 -59916 174704 31095 -45357 31615 -211347
23239 -135586 192844 -85034 -131017 192457 311170 251668 155041 503347 -168147 -45467
23228 -156354 92145 64086 289631 -96959 88813 92049 -243589 129311 69434 -57160 35080
23216 -299480 142243 -140860 67663 13820 -251066 292414 -128262 -88233 -134985 70158
23205 -74911 -160187 -268020 35234 27104 59360 213384 -192368 82927 134808 85872 141069
23194 141069 243470 237421 -148971 173481 -286141 18738 -340374 -31167 -75486 25924 182191
23183 182191 -86205 38585 -147302 346856 -348223 -160336 -33234 22433 157968 -112102
23172 -20290 -262872 140164 -138481 -176167 45830 -109677 -305351 -122201 -19505 187830
23161 -194361 -380415 -344736 -335750 -221698 -146787 -45790 -211860 -140187 91212 -43895 -224075
23150 -224075 120155 34369 -64757 -42670 -32883 71519 23047 46123 -123417 -92672 -319460
23139 -319460 -23760 -125050 63547 -17161 66483 83390 141115 -202528 219866 -223459 78528
23127 99911 -61206 27683 -60524 66760 369310 -113468 26479 -84793 107458 315253 115233
23115 -128651 -53995 113804 -135879 103030 156160 214941 -310737 -91101 224589 120922
23105 120922 -194870 -147264 -75957 -580323 -230985 -67940 146557 66750 507816 -81943
23094 41432 -271153 -55608 296733 24020 294191 124804 -90763 164484 -388201 -102053
23083 -174363 -216030 -16054 144143 147894 213187 123614 139664 29897 159268 -24405 18682
23071 -178533 153834 -175537 -162186 -106390 -196507 39854 79705 42946 74017 -58037 -234764
23060 -234764 8063 -89289 -230089 267917 136730 -22508 -82766 -91210 160492 64263 -233917
23048 -179282 403553 -290824 -15026 526208 198855 -399672 244243 21057 179336 -164094
23037 -104074 -198357 -93263 52566 -7586 272213 -36342 -862 -47886 -34794 -297716 -126647
23025 -91254 53933 -108282 165682 -66543 -125969 -161843 -124839 -111009 -58592 5621 93632
23014 93632 188480 166803 15565 76020 -34016 81501 -74502 -410644 11899 -87674 66790
23002 -89732 -84812 -40029 98957 200387 106399 50085 -80094 -148630 72002 -316130 104811
22990 -196833 -106612 -224208 -120542 -12079 167287 227529 -20800 107550 -82647 -20806 222851
22978 -33301 -139358 11206 -134452 -35742 -165914 -196933 -82512 -14214 -57463 132346 -225448
22966 57477 -182404 243131 209498 17105 -132150 -202900 32589 -41082 6535 128721 239537
22955 239537 -273361 -165405 -28310 -351129 204336 -292066 98029 184597 420141 -170448
22944 -376229 -7265 117641 -180953 -91238 -52368 -84569 -1606 -253174 -42721 -289213 -139879
22932 -83110 182147 72569 17979 125497 -145065 -63243 -214169 -109622 146838 167282
22922 167282 36554 119954 111658 -170410 -225438 44974 -221631 202851 -275509 -165127 248133
22910 22314 -105710 -146850 59775 256455 -88248 -315984 -132704 -112387 -308742 335802
22899 248669 148474 -262155 -96218 -34678 -87727 192830 294513 -35622 -55599 -7723 19720
22887 326987 -66074 88191 8640 -152774 49083 -257897 -176398 -387052 -65382 246514 105048
22875 299271 176685 -390980 90772 -259700 -128066 61517 46486 52548 76893 -183657 -278678
22864 -278678 95018 -127700 119188 75616 108269 -277850 -265086 -188111 -47365 -203429 -19842
22852 97249 91553 165944 -216652 -99721 105988 -149341 110873 -274993 42610 -1417 184235
22840 -13943 -93860 217868 54121 -46349 137266 53373 61536 -304807 -155192 -297959 -198598
22829 -198598 57960 -53815 -313460 190913 -135422 -135752 -31362 -104854 -85320 -27218 -204292
22818 -204292 -122512 -435023 -197836 131304 -102826 -9834 -31322 327396 -65 -8317 -31139
22807 -31139 -128202 -192167 -138938 137763 155914 -11788 -72855 -168468 128568 -18610 -288369
22796 -288369 -56944 201367 -314689 175043 110359 72571 -20817 153231 -175580 -93578
22786 -93578 -92984 64211 -161754 -72719 77767 -297203 170269 153580 49775 126920 241077
22775 241077 -21531 129958 -26561 101875 99644 -243665 -210264 -189420 -38687 -224799 148532
22763 -25133 -18847 -255645 95512 -232613 86753 120269 -224574 25612 173146 -75445 -259710
22752 -259710 -202836 47570 19892 95798 11865 26812 63723 3904 211 -313108 530226 -14421
22739 -74012 -4778 72971 -168133 -51855 131883 -15426 -25420 32438 -58378 -161036 81504
22727 118563 -89800 88279 -2932 -44269 -324500 -68005 -165430 108629 -214445 188010 138761
22716 138761 -24623 11335 -225781 -191950 -195463 -229160 132655 -29882 -4917 137777 -215466
22704 -235597 -149436 -43905 96814 136403 -276522 32850 -136296 35208 36839 -52108 87826
22692 162301 211510 71306 11330 -34738 197100 -46286 -89989 398591 -202702 -265416 -213030
22681 -213030 -276203 24470 -145524 -121285 -211450 34300 237553 165543 27145 -59298 -161649
22670 -161649 2113 -145889 1412 -2014 -291505 77310 -90011 19801 -181659 -299852 3937
22658 84115 -184904 200949 -62793 -272097 -111013 -87568 -382362 -38096 -43102 -114173 347760
22646 -226420 232491 -46634 43825 -283387 121139 -234185 -6016 168729 17255 138404
22636 138404 26275 -132318 -38013 -52806 -167053 -85441 -59038 -169004 -190000 -113690 122770
22624 -215734 173481 -263237 -215252 -195843 167242 169978 66287 -153215 -162406 179 104829
22613 104829 -60834 -250176 -20242 211561 -38598 -192499 -122860 60888 48243 45995 -7942
22601 -100551 105807 -182853 197563 -54693 -151817 -242886 43710 -300945 -227465 -130869 -183938
22590 -183938 190459 68404 -53001 -248789 -343716 12356 118422 79963 -181307 -214355 -214968
22579 -214968 -16810 29637 193969 -262856 212244 -108364 59611 50914 90180 80872 -22413
22567 139672 -91049 269588 -60094 73701 137798 -241133 -99493 17567 96235 -170003 99901
22555 86354 86802 179463 176714 196616 -163359 -207146 -24787 -240869 -148892 160297 -4281 -188799
22543 -188799 -90404 -47441 -431885 329534 -167145 -209052 -126950 -218039 -49063 -69215 126550
22531 -101420 -187183 80865 130638 125377 180720 -103621 -58123 317186 122663 274837 116053
22519 -237040 -20524 -55980 -336636 171603 -14455 -413721 2837 8993 140313 -138377 217233
22507 37588 13953 -138941 -195989 466389 -72045 -183457 -32608 335622 -38301 -338457 111880
22495 -405362 -285119 57835 97255 -24304 -51914 -23879 -58135 -136682 107683 200337 58789
22483 -139487 120143 -68311 37243 66716 94469 -78241 -23300 -351253 -329767 90705 196532
22472 196532 213359 -252400 -129901 -32806 77409 285027 -201804 129422 32724 125387
22462 125387 -340029 -29476 115813 -48187 -110806 -82642 -132779 -104474 -120182 -146580 51693
22450 234764 -167982 -141792 -43167 -214096 51429 -92254 -149272 90045 -232199 8286 116221
22439 116221 -33679 -175921 -335677 -66868 208491 -100171 -155245 -182731 198226 217842
22429 217842 218186 36513 -46781 174455 -172648 228889 48195 -303501 171990 16668 -243642
22417 -285491 -255145 -235329 -165050 -109116 214257 31668 -400061 -93287 7240 -92247 120178
22405 -52730 -162515 -81734 112618 -494187 -62815 23122 -68412 265092 -100657 -141412 -325769
22394 -325769 -119043 -234089 248550 -113731 -166516 150662 -74362 18023 97451 -215130
22383 -16249 -366756 -88811 -119279 137001 -226266 62247 211463 -99717 27081 -17499 46566
22371 23724 -53965 -204289 160461 -274980 -124142 99570 32560 244617 453124 -83025
22360 -494376 84609 -198769 277091 77888 249768 53926 -124737 -252097 -14520 -180154
22350 -180154 10957 -39901 -74182 -31588 204810 113242 -187123 -160038 81861 35359 -300975
22338 -71256 -140370 -206673 -157888 -62793 -365514 545618 -51731 -169218 112026 -237576 180939
22326 -170829 101119 66857 -9754 -378197 -96356 245177 -117326 53083 238805 -162426
22315 154375 -10292 269161 -53424 -189730 197744 -338748 -49976 58231 60640 85679 235443
22304 235443 129869 -58770 26783 101835 134561 -226098 -359622 -138941 -17697 3679 -99699
22292 61385 -38296 -258865 37072 -120783 8616 -19446 -163510 -79653 94841 -81929 -119592
22281 -119592 -233290 -52248 -425611 -163480 -70595 96883 162491 -109485 277190 -68034
22270 -278246 -91386 63384 34939 -105751 -153015 298367 200753 -134101 -92451 179956 57936
22258 -187125 -99755 516084 -105218 -82406 -96861 -197130 -291098 91985 -135627 -12739 -494069
22247 -494069 -41904 -103171 -135846 -289364 -220786 186516 369036 61535 31606 122336 -155591
22235 -90767 -5755 -108036 -102932 242550 -144242 -311543 122796 -203045 20242 -292371 -53116
22223 -110772 410028 108907 -34661 46303 -118517 -252232 205768 35055 -250861 28073
22212 -119930 -337253 -207941 384594 283566 -101300 -193714 103976 -114459 56891 -423774
22201 90697 87312 58369 -274413 -87116 168275 -140957 -78218 -325565 -275943 -74447 -46275
22190 -46275 -229642 -214433 -165717 -184604 -46349 -91846 198649 -37441 24509 -218466 -48313
22178 -293997 27603 -133026 -131452 -16418 -55192 166646 -179353 -177512 -8250 33838 -9433 187046
22165 244105 -124926 118070 -50230 -280646 -368674 -67402 218559 -26646 294120 51653
22154 -351358 -228292 216285 112916 5956 152660 296332 -176152 59839 292938 134056
22143 -156210 -8384 -84764 74209 -76199 215939 316117 -184069 150030 56985 53538 -211841
22131 -130343 -17564 -310523 -5393 196710 156405 291226 127297 92265 -61183 -85217 -297086
22120 -297086 -24160 128078 143611 -80290 -285347 -435511 -75682 39356 -66590 -183542 126851
22108 183877 35507 98838 247503 -163701 -178846 113390 64117 -159440 -4895 -57455 167925
22096 -189698 -73367 238216 95453 -130613 -17545 -99030 -12730 124809 113107 64390 72328
22085 72328 -137600 -37910 113113 264946 123097 135091 -29657 -95646 230131 -209584
22074 -83643 -33836 -46387 98253 330428 328424 52648 -191966 -596221 217582 220452 -103414
22062 -8496 -103317 26536 -136245 -244252 -11352 140561 -384415 3768 -166081 -452245 294223
22050 -178173 146150 88768 -249646 -23546 18659 15905 -106219 42499 174122 -190261 -316781
22039 -316781 -224318 82150 -135476 -104995 180910 -163341 47539 70867 -26997 56501 -164535
22027 -321132 -203334 255804 -78080 -42471 -38819 -143427 271051 445841 -64321 55280 -88917
22015 -171539 -30101 117792 -100221 65085 108018 182428 -115773 77061 -143078 -237715 -278
22003 -158338 -105652 -197306 -170555 166154 168251 -159513 -109742 -89782 55824 267147 115351
21991 100887 -51431 -123692 59139 -222466 -148798 -363792 -104250 140068 456879 136166
21980 -80068 -240926 -124387 -292250 -150819 -191904 -196272 273677 137033 -240274 23899
21969 -38197 -77000 32566 32488 11785 21748 72655 -224133 83735 -261615 12807 -168312 70824
21956 144544 -280251 -15746 45278 90938 167984 37816 -96968 -190810 -235538 -32723 40342
21944 -194636 -34290 -142811 158255 -260745 -89621 95636 80573 -99679 -168342 -377960 -143648
21932 -161075 -218865 102013 88108 -131857 -472648 -125427 49082 -13 -344916 -322532 240492
21920 32623 -114700 1497 72204 -143996 -446033 -79284 143388 329690 -66168 -249149 -15313
21908 208796 -135720 81527 -223431 86585 341667 -249466 -203641 109265 11254 -292632
21897 -175823 -163222 266040 -249201 66604 46309 -49249 -134359 -178771 -85898 39696 25306
21886 25306 -126128 -550419 -56013 -48557 -223578 -258358 10805 -70120 -64633 469100 -134342
21874 -46474 -134147 218382 -19578 -104029 -254244 -286747 -73851 178649 -616 69001 6978 -172163
21861 -43084 81190 -169774 60751 27426 11629 -127829 -101487 338558 -112375 -120644 -99208
21850 -99208 -209680 22389 -158321 -90831 35889 -44292 -125863 -19613 107575 -94849 5418
21838 -78035 63993 -36583 -166753 -141155 -73048 -263295 -130707 -13842 -80449 42997 197926
21827 197926 -405480 224080 -191610 5265 -48567 64173 -161619 -42830 -138162 104368 -100748
21815 -17723 -136504 -62722 13926 134529 12799 -323680 65591 256802 508295 47022 -340191
21803 -98163 6686 198561 184568 -172317 -129783 244236 280539 -199298 336577 -98686 -474
21791 -58623 20567 -246508 424166 -149363 107624 90790 135683 -50351 -280899 89417 -80462
21779 82400 -37710 -360921 72769 -198546 47555 224375 270923 77848 1207 -181302 41330
21767 352559 -95283 -93253 -175280 57660 -142207 209978 -187993 -72158 -8510 -358287 -3219
21755 -98246 327340 187793 158248 251729 -190961 110497 47484 39463 -41364 -63610 186804
21743 122395 17323 66359 42211 -212184 288836 155001 -405099 104112 52841 133711
21733 133711 -73804 372310 2242 15208 -300 -94491 134857 23471 -128555 -280044 106254
21721 -230272 -31371 -192251 -357736 -192489 182520 -135673 63275 -27212 -33940 33897 190250
21710 190250 248341 -68208 47891 -606551 168390 164234 105042 -126510 -356562 73355 151738
21699 151738 -73242 -110440 -120721 190788 -60893 194974 213138 -115200 -199926 -31207 -35127
21688 -35127 -40778 -105112 -54514 167242 51164 -275756 -107835 -116604 66146 -57395 62373
21676 -126716 -77528 57199 149785 -7512 56378 49179 38791 17708 92678 139383 81204 362594
21664 362594 -91802 -115724 18571 -60420 -23058 340279 -159649 -224263 -171942 10610 48341
21653 48341 33087 118923 155080 -66185 44655 -181010 182288 351743 -293608 -175753 -128524
21642 -128524 -228331 278819 55725 -43951 -59883 174490 91533 150531 -242691 -135629 172503
21630 -179722 29524 13698 13696 83191 -274379 -26257 -181347 -70737 153467 103339 -107021
21618 54833 140726 -47403 45470 30192 -26511 53547 73828 235417 -2433 -306467 -185423
21607 -185423 -238351 -17292 202376 283046 -187350 17329 -18046 -34043 -415023 -380273 56108
21595 -202834 311837 -313297 -17941 -316276 12017 -311075 31988 -94133 230999 -209469
21584 -162738 13419 -30950 81781 353582 183128 -338285 -1662 -52590 -166368 193884 -147173
21572 -74838 -190575 -3589 -173646 -137925 -67903 16625 -77385 -97778 155829 -162930 -125266
21561 -125266 55106 -217508 354903 40056 -177975 -139931 -131880 163057 -48307 300922 -152131
21549 -149842 -207986 -226144 -10948 -21243 325601 295175 -113802 18503 -211284 109638 -265412
21537 -257546 -136442 -111128 -25288 -125436 -244457 1235 15062 -96178 -63083 -103616 275815
21525 48283 -221493 107171 -182840 -100309 23401 179771 139203 71758 33445 -68166 235547
21513 -115752 -112926 333824 -65195 27678 217446 300210 143947 164979 -95383 138146 177788
21502 177788 228780 -429535 -162395 -109871 -132427 62654 -9466 -71754 -259549 145076 76857
21491 76857 -16264 217341 -167108 54539 -242331 53168 -32072 40751 -271779 -134217 39664
21479 -29365 172641 -215576 11387 60206 -137103 -175287 -251181 -172871 104693 -100983 -147575
21468 -147575 -110221 2978 20200 -43288 -5822 41503 340751 -96615 -416827 -306913 -120719
21456 85771 217311 -87895 62088 -232912 -98945 -199075 111912 -80973 7292 75225 -126901
21444 -11307 -146721 157585 -233065 293405 139846 129833 177710 440701 266238 435276
21434 435276 286294 189147 26663 22664 -190796 100201 22349 190304 -11854 151821 74338
21422 -187136 -144502 -197666 43492 -332164 -625138 245034 172378 -23758 530 -239899 -418675
21411 -418675 129842 -254754 80037 -385066 -295926 183363 33545 -657128 -343532 80909
21400 53354 84773 40007 -331410 -30421 -14547 -274336 -190706 -157394 -132954 -86290 -171160
21389 -171160 292496 88747 -3761 -125054 -342504 105923 56486 -22428 23648 141117 -215856
21377 96487 -375180 96097 -26441 268636 34749 -4750 -311180 267630 137288 -121415 -8842
21365 -149376 79262 -41291 -177758 -347325 269336 -74242 56305 -60927 -178141 79053 53367
21354 53367 67245 134402 143827 -25549 -285547 -157572 -29928 -309178 -227740 -165737 -174252
21343 -174252 119753 37284 394072 -68396 -88072 -90552 180512 -51785 208005 -116109 -115751
21332 -115751 98283 50156 -149031 -211354 -183950 -51769 64661 72424 296314 -166832 190863
21320 -209137 -303355 -13621 150213 173085 -241888 147127 -79135 94983 -134750 4540 215102
21309 215102 -142575 123618 -74019 -288705 -159350 -6188 69266 -122843 97961 -177264
21298 -111433 -20998 192188 -181040 167329 107787 -335948 -46147 -69691 71786 -128873
21287 -38687 394662 289561 -137596 -422968 10860 -237921 -186547 -304802 56099 -20428
21276 -97624 -51832 105445 146388 -89926 -269306 -269046 -11649 -116497 -124131 -71010 233953
21264 309071 -52781 -176974 159831 64437 68069 81738 -107523 7677 -175481 -370455 406745
21252 96983 -109880 -36959 -69427 -212216 -6635 -58697 -138159 -172831 20816 77101 201671
21241 201671 -270214 17059 -323755 -86750 78298 -15840 -42915 -241722 -53485 188877 164962
21230 164962 -69626 75117 315731 34776 -113409 -401389 -182979 -127637 -114328 -76584 -153637
21219 -153637 -97956 -142622 -163217 -385944 166464 -60505 61766 117199 65198 3053 -68913
21207 160989 -189367 5950 -61853 6441 -162278 -188251 -124379 107320 10954 -240605 -85148
21195 -237799 -37901 -39118 245686 114444 863 -77065 20048 -315115 -108211 273719 171414
21184 171414 -96629 300982 19185 40010 -175998 171742 244047 -145890 41256 -35398 1038
21172 -257191 53983 22169 -14393 -163579 -141816 53601 -20242 25700 -11216 177746 -269491
21160 -67485 31839 24965 -263565 -213608 -325710 38276 -171730 -327659 -90413 -221707 281437
21148 81677 -109044 -125121 9446 -270443 -58257 -169142 270476 -33522 -164730 80763 -64405
21136 -119706 77099 -77119 162253 84827 -68281 -38900 204764 -31744 -113135 -410854 -165999
21124 -179559 -72420 -191044 -137716 -79054 -53949 -103336 -247329 84256 55359 211874 -118348
21112 -85981 -88288 12944 -254183 -20760 -88422 -4705 108771 -525617 113397 -311188 -195470
21101 -195470 -256993 -217297 -115913 224482 -70629 59982 42944 4040 -191453 -67857 -149209
21090 -149209 117923 75102 -181751 -99649 -92556 -12748 -75842 -146549 -205245 -103708 -124682
21079 -124682 -142555 180083 36715 1247 -151740 -195743 -331531 31863 -116496 -28731 -455998
21068 -455998 -267882 -155823 -56582 90905 -143302 -302266 -183751 87088 -100486 51209
21057 76018 218006 145525 67250 -179445 152530 -9292 379624 40614 9729 -137031 -233998
21046 -233998 -111872 -137152 90373 50084 -88164 -228469 -2895 -87127 -4631 -358513 89983
21034 -17238 70457 -111157 -169468 -272787 7419 -178589 -157144 165413 -172873 -187400 -247837
21023 -247837 27568 -16389 112644 65580 220375 67065 -442555 -42013 -4204 250616 188574
21012 188574 -104117 161512 174637 -31713 -134039 65178 380368 -69773 -251813 359060
21001 192472 50118 -71051 -56246 13503 -71019 470444 185578 122636 -70950 -1552 -89194
20990 -89194 -323538 94914 -126803 258462 -67068 -165971 -238403 -243404 -24851 -50905 -192360
20979 -192360 191986 220551 -374884 -97041 -246599 -239344 -106925 117243 32849 -204935
20968 -43699 -219296 -144438 132238 154058 -130395 -46707 184392 177994 -244729 -165182 116457
20956 322588 -94897 -285431 79562 -131824 180265 -539623 -20677 -37466 224913 -258830
20945 -147036 134329 -107780 -124330 11687 -186990 76354 -116913 -60883 73061 -12546 -43436
20934 -43436 242283 -100529 -214500 -180044 -75774 -18150 186735 318637 -79602 -88346 -119671
20923 -119671 373470 101438 -42420 299646 -137383 -342624 -6728 -163401 -102935 -76385
20913 -76385 35965 -104593 19319 -60383 40203 -26390 -166678 -153275 -211455 465239 -99825
20901 3348 -289670 -275496 -10964 204318 145924 361761 127555 -104742 -81598 -258333 58995
20889 102279 115664 -17308 131518 -127594 -272115 5932 40129 242533 -16008 -330071 -130627
20877 -62483 -181496 -223498 -195156 72271 -184095 195466 -129676 83999 -13713 -290615 -141512
20865 103219 -130551 -72218 -126425 -282454 -25441 -99730 -239423 -182413 31113 124911 -70438
20853 107699 152876 121777 36135 374960 215441 92313 -106108 249410 30280 -57588 75654
20841 68938 -332000 -25311 -201752 -82093 -185696 131143 -23386 132818 308058 -9373 -55379
20830 -55379 -43518 -365171 79766 211626 -219676 -62222 -46484 187777 -39052 189225 79956
20818 7066 71456 46352 -153981 -312875 -137957 -10522 -229442 59853 25732 -208225 -107032
20807 -107032 -148752 -287871 -96027 -156529 -166132 74723 210337 -1575 -96405 88651 -326664
20795 -88085 -204128 -49207 -127909 34370 -91669 9923 -162259 -255023 -153740 40943 147124
20784 147124 -154651 -384826 264180 17855 -306814 -188993 -288937 -199840 -134128 -6056 -228185
20773 -228185 -96663 3851 -184459 21891 138923 6070 -251554 -258268 46059 -352610 -62349
20761 -177760 42302 -300368 -66911 112274 73282 -13911 -13524 -149063 -216452 74823 -225022
20749 -53983 -141808 -103729 255975 161080 -139427 -135909 61904 38139 70492 42157 -17953
20737 -6438 -12621 -132227 170349 -340106 202250 -55902 -32888 204895 -266791 -84355 -15755
20725 -37678 -303753 -161661 25003 -123497 56173 176341 -106417 -78455 23711 49155 -56870
20713 116396 -325737 -138191 -18893 64849 -328391 86004 200442 15656 221583 -55954
20702 -189233 98665 -238950 177883 98732 145755 -94950 -78038 -74577 234311 53351 109487
20691 109487 17959 -214250 170582 205622 -91689 244563 -126829 -2380 -124326 59215 209326
20680 209326 -122709 -86110 29447 -394308 -272601 134501 -210522 218677 417201 -131975
20669 105987 225799 31287 -88386 -212148 -52692 -72802 131172 -114166 -66171 5177 -3246
20657 -151034 300493 -235098 -224987 74003 241622 -126534 -4905 -200304 -191094 -162461 -129436
20646 -129436 60848 59381 -321664 -336433 23015 -98271 -196771 -161716 203596 -54653 -305576
20635 -305576 -169645 178242 180985 -289980 -59134 23601 -499445 -185650 -319000 -2785 -159617
20624 -159617 -20845 68211 -181361 -99058 190535 265584 72049 -205882 -237021 -324622 -233261
20613 -233261 -63870 -105361 -193442 -243412 127405 161426 -162321 68878 117928 -207933 -273876
20602 -273876 -54912 -212598 62136 109255 -205186 45317 -27261 245150 5775 -101306 -392694
20591 -392694 -13312 -114713 27746 -59315 -58106 117146 -108165 -22516 381100 145668 204982
20580 204982 349943 203488 257897 115514 3747 -110437 -112419 65036 -268142 161186 -16863
20568 51002 -70942 -147920 -270312 -64264 -137324 5415 -114024 -153787 -177751 -3822 -81717 -25641
20555 -71174 -109083 14660 -53053 -197626 -65736 -111708 -152217 -290648 28643 -240956 -147727
20544 -147727 144247 87873 -32009 -48860 -32473 -337384 -104608 -168735 -128049 163990 119717
20533 119717 48440 -143071 -32314 20590 126074 217853 -56021 -125201 45751 -335067 -216604
20522 -216604 -3583 54145 193435 -36650 -67534 -208874 157935 79417 141080 -362551 49090
20510 199761 -83060 -168235 -169333 -15378 56704 -45001 142417 -493056 -109841 -68445 -184868
20499 -184868 444566 71559 128704 -63126 58744 -17136 245397 -170996 -31501 363648 60528
20487 -132389 -460777 -106041 -102549 227164 -128299 173155 -219941 -262532 51847 -22859
20476 299027 190675 -239618 -9584 40824 114042 87554 262647 44900 132603 -92546 -282291
20465 -282291 34661 157377 -61668 -454451 134550 180943 -43602 162058 -1879 201784 -120229
20453 12188 53488 -119623 108649 -103171 -56813 216671 74662 13926 77620 -149991 -89260
20442 -89260 1481 -138334 -194875 -142668 17530 -255525 -138062 -454248 6723 -247373 -64596
20430 -209552 126206 -200646 -361247 302725 -229771 -283101 -309326 -209602 -263196 -180023
20420 -180023 251808 213227 -154049 57076 -231923 -51920 -142697 -284861 -143197 -310418
20410 -310418 -281148 -2089 40282 53802 164612 -177396 35982 -290925 -202779 3505 22634
20399 22634 -90390 -38060 86303 -130434 149136 -126657 -247133 -459872 89155 -226203
20388 -373742 -95556 -86857 92388 -313922 -148219 201391 185876 108400 -185029 -143667 -290453
20377 -290453 91083 -347437 262064 -103717 -38678 177601 124739 8742 -127120 -390306
20367 -390306 169900 77775 286198 -72214 -12224 188056 106987 -144651 -73935 -78302 -311224
20356 -311224 -280711 368557 -86043 134444 1866 -173991 22936 -336641 -112818 26006 -222325
20344 -143265 -164548 4680 133708 -188919 118375 11227 -154221 -114634 -174787 -136906 -39371
20332 -173801 -96709 -2980 -160537 -93865 -116355 -121349 297922 -1046 -237767 -47651 -30819
20321 -30819 -301805 218252 3280 -31765 136516 -149300 47636 200126 15371 169357 -59181
20309 -39383 152784 138819 416156 98187 19871 -398890 -79193 -202112 -28537 326216 13983
20297 106831 -97756 -143620 -287238 -196147 171606 284676 97888 201938 -94427 -50862 -310699
20286 -310699 -152135 354551 -5054 53262 -228851 -113024 58267 220551 149323 -70480 -13495
20274 3717 -53629 339329 -489285 -320624 -58503 -348149 -281725 350 201832 -95244 128132
20262 -280146 -221312 39714 271804 -77013 -175477 -294445 -44823 -3659 -131242 -276549 -73243
20250 -30739 -70623 197271 -149114 -201295 -385159 -9153 -428552 -372771 18104 -234503 33367
20238 195131 117127 103311 -17699 -198215 -38479 18647 135724 -72514 66002 9370 -219332
20226 29387 -252308 7072 67576 -71494 -33750 36369 -84635 -194467 168570 -125627 -183370
20215 -183370 -163783 -169841 -16192 -23906 -169577 -122552 -53290 -122006 175434 20847 -233643
20203 7036 -150333 -8923 204804 -146717 -185612 144644 -120631 -203049 -34721 349136 -262263
20191 -126791 66602 -142947 -439780 -73402 -79236 -124795 -89932 -135340 -296376 -90339 152603
20179 -11931 8939 -76433 119929 -19197 23472 823 -159896 44696 32768 -105695 116254
20167 -28085 -118914 51337 199148 199993 -285857 23603 -150336 -245435 24670 270852 -262327
20155 281071 -394979 172404 18912 45573 -114201 80730 -338098 109532 -118136 138910
20144 -312947 128407 199508 -233972 104282 -21589 53887 132482 -73075 -108997 404938 -44850
20132 65596 -118309 122913 234263 -52268 -247068 147919 -132415 -72461 -278857 -275761
20122 -275761 9442 -160548 22372 -74648 -68073 -240859 -302255 131428 46048 82737 209151
20111 209151 -142321 12334 -99619 -67059 -196495 70152 -352645 22990 -53174 98312 -20164
20099 83853 -15547 -62306 -251580 -237402 -100827 -79953 -168094 -73070 -82062 -281023 -206242
20088 -206242 -202810 64785 -329584 -92271 116824 -168976 43200 -44704 -115361 -205994 93875
20076 -95976 -5537 161924 103831 -61591 21042 -186543 71358 -86327 -89514 -198696 -136628
20065 -136628 -380505 -510240 124426 -9760 38265 -229280 11781 280394 9834 -523374 -38605
20053 -58025 -426068 111748 44018 -192129 -361160 49566 -173682 -32901 -20550 268349
20042 -211516 113758 -240496 -115580 -27806 101640 96556 47725 9066 -130034 -50794 -36065
20031 -36065 197720 135935 -122687 -154890 -58606 -76560 -139033 -260345 38732 13629 -177465
20019 65914 -535199 -41937 82152 24656 -62881 93123 173329 119178 129102 27403 -261825
20007 -44444 21827 -245809 -145302 49958 -125541 -11773 -143850 -29725 90684 -98166 26432
19995 -172251 22446 69323 -430857 -64952 93426 -536869 -269587 -246373 162102 188942 -101879
19983 -257564 -15410 -224824 -114790 -81013 -15078 -111152 -105292 -450643 294532 -270284 53181
19971 186051 -103250 192427 -174515 -131870 -147473 -191948 -341985 -585289 116701 -72186
19960 131702 63770 77578 -204198 54917 -102926 321341 104189 -75244 129711 370228
19950 370228 77185 432620 -124951 -319399 159183 -113214 78678 -69564 -189942 -90405
19939 -152889 70400 -15422 161832 239203 -678416 98507 -57582 155891 -231004 -213869 -203065
19928 -203065 -32071 -13592 -244176 -350263 -229881 72941 73898 9962 -121621 -275273 88073
19916 -98413 113537 -325902 226809 -124122 -32384 121344 189576 194159 -235981 -159066 -87784
19905 -87784 275108 -129979 -228602 -11865 -91704 -366891 208661 46376 -41436 -500015 54953
19893 78473 -150503 -238599 -7888 -7335 -205908 -86444 71148 -125011 -219496 -225561 132511 56834
19880 261043 -310398 -437418 -82886 -5005 -6468 -56394 -192445 -261367 -100201 -6228 -78295
19869 -78295 -139231 287330 -245933 57862 -152002 -111265 -99162 214404 -234953 -102822
19858 104419 -312485 68268 34529 -13900 -225113 -245262 -187907 -81964 -36560 -288369 16152
19846 -33206 -433843 64804 -254239 178651 -374165 -39065 217032 143096 -363317 -175964
19835 -145616 240866 -77220 97749 -150969 -105832 -466493 -7722 129486 -26915 146385 -123752
19823 1986 22714 -146064 -62322 -132473 -178597 -269889 17464 -283318 -337833 155713 7278
19811 -334883 95258 244848 -186883 48302 -111136 -52801 55384 -448625 -145165 158533
19800 53911 -88295 -83298 -337275 -288010 8810 263716 86953 -108317 37352 -113595 -35433
19788 213014 -371227 -245747 -282182 -129198 261608 124966 -79581 33597 -55855 320945
19777 -163226 -162307 103161 -8903 -232044 232566 173743 -13648 132062 -65374 -151449 209800
19765 -165830 349080 175046 5698 -334309 36165 -223110 -203017 -110147 -318160 -109481
19754 43275 -201230 -23943 133137 36442 -164689 -72925 -34225 387400 -112602 147980
19743 59818 319562 -226624 34332 -198257 -183866 77662 85589 -205870 -65085 -171871 17498
19731 -273114 -106201 -148515 -72274 3656 -24458 -232334 251605 -278294 107080 214959
19721 214959 -53248 40296 -87497 -161278 -22904 -140316 -86780 136307 -187834 -427975 22625
19709 74211 -30239 -137908 -131243 -525476 -37650 73303 -370577 8493 -177214 -150089 -80181
19698 -80181 90986 -140393 -209437 -155722 -64708 138083 72339 -179121 438122 -86222 196725
19686 -61155 319456 176551 -89493 -170142 183790 -236877 235062 -424944 -155261 108481
19675 -18800 -21852 38688 -481915 -435091 378959 134936 -167925 96756 -127685 -15613 -257037
19664 -257037 -2119 -76749 159604 -133921 3531 -158565 -97987 -59923 130273 -21393 18548
19652 -100057 116114 120692 29945 -673536 -5192 627417 170806 92938 65460 -115344 122317
19640 -150730 -237391 -188226 -113954 -233439 70398 -138573 168707 165156 -22773 -2087 -314812
19629 -314812 79170 240574 -52264 47514 66125 -241725 64585 199931 -81350 -403592 -77204
19617 108712 22469 160612 -146633 -1436 -118014 479523 52117 -485 28621 30469 -12278
19605 -50291 -68613 -107926 45338 97548 149470 206162 -87401 -44199 -105925 -131909 -78828 160779
19592 13803 -252246 136812 -10424 143986 -163764 -130377 -139570 244726 36098 -189975 -68272
19580 205547 -78352 21438 -114801 10226 -1116 -148330 -311883 307804 20642 -88933 227623
19568 -245312 41065 14096 -181260 -86901 101514 -115488 -74315 14912 84502 -97217 -440681
19557 -440681 -169868 322595 8839 100154 -28880 213726 -14206 189188 113567 13703 -309340
19545 -305724 -260523 8596 -163285 -277846 -316628 -174176 85735 -148345 -258805 -15955 -7252
19533 -113077 -12041 -274157 -8683 -362681 -157934 -321311 27705 -218608 -54062 -104821 -11215
19521 26423 -119380 -120741 83593 -131486 -385082 15108 54298 -117326 23890 117165 -202005
19509 -197326 145559 -108986 -193189 138760 -48086 1960 -298457 247164 425 -320250 -178683
19498 -178683 10520 -272062 -151518 285801 -74618 -22216 150367 -141989 -224611 -273661
19488 -273661 -316728 -3966 -24590 -297182 -172293 77186 -20845 31370 -184789 68732 -307080
19476 -17893 -37277 -21067 -235908 -187187 -228209 -73048 25850 -76509 -141924 -215979 -85209
19464 -25737 113341 -228509 -127554 158905 -313554 86991 -345341 -208317 131604 -317766
19453 -13185 -281396 -286838 -128933 245408 -45175 -269607 -6089 -221198 -93413 16979 -236095
19441 -199987 30431 -335568 189420 -268109 49606 -152369 -231832 -254700 -278640 -125499
19430 -92303 -140363 -43686 -81180 61942 -21663 82275 38789 217182 51910 55967 -131332
19418 81234 133202 227302 -146384 -42536 -200699 -143769 -231351 -317845 16200 11365 -65541
19406 -104837 -198738 53686 25531 -236299 -204168 -145602 266173 -57351 156822 287070 -244019
19394 -32762 -179357 -201946 186416 114015 -147032 6518 31696 81805 -214101 22481 -66803
19382 -244058 -12751 -148967 -235122 21886 -92218 17865 35317 -137793 -25260 92234 1601
19370 -233578 356895 132501 -149392 -119811 -25540 -145146 17683 -4680 168440 -9037 151519
19358 -459978 136597 -47689 -97674 -34520 110692 -21918 -240313 223519 -101424 -166510
19348 -166510 -15357 154613 -4228 -175401 61691 29979 38856 -381569 105171 -214076 -216096
19337 -216096 89473 230575 -251676 -34779 31939 94014 -200471 -131654 56772 -132148 -411231
19326 -411231 43307 -165385 59593 -198711 -52414 115717 -61127 -110013 -350577 -313394 -102940
19314 126200 209646 66575 -357986 -199124 -32248 -146241 -33180 -34623 -272490 -285090 -54904
19302 -182541 -6393 -84909 187128 143378 -23693 -231192 -186263 -211337 -58729 -208022 -427473
19291 -427473 -168048 -68569 -6580 215246 40227 384929 87668 -188381 -37157 -13401 -121420
19280 -121420 -225655 163554 -6350 -196030 101973 -274355 43788 4802 -31299 -338707 -146765
19268 -280479 87853 -154503 -17349 139606 -360105 64828 -110354 -123137 -8272 27026 -23190
19256 45454 -265242 -16396 207688 45013 23195 -53738 -124371 -349509 -117495 -293544 281849
19244 197387 16389 -72071 -170172 -81652 -200642 -87043 54204 1498 192132 10170 198440
19233 198440 -194277 203549 -177640 -150084 -75446 -150301 185407 -205952 152989 -72939
19222 137281 48276 146667 -67145 -105187 -81169 253031 -13450 -177338 -323041 188465 -48222
19210 -184408 -302760 -103957 -141496 -134906 -452843 60360 136621 -129352 161677 143693 -104347
19198 -137644 320813 -57988 185862 -108712 -271215 -234699 -163225 -88663 -164694 -322981
19188 -322981 -382005 -61525 -262767 5971 31675 138789 -14025 -189512 184330 130099 -160477
19176 -163163 -297874 -223399 -40192 234629 -185635 106835 65981 -33139 -37933 -209884 -97614
19164 -138877 153604 16626 -391826 -155603 316611 174533 -49874 166462 15186 -44592
19153 178867 8224 47423 -241290 -116355 -401387 -24185 -178694 -349698 -219393 136997
19142 13108 4735 225047 -332000 -154249 -134788 -412706 11346 183584 12115 2753 -308183
19130 -164820 -167247 -300351 -170501 -103881 161572 95585 -500975 -273939 -248397 107243
19119 253571 -162405 81665 -61242 423014 -254919 -211692 -121512 117888 -51509 105046
19108 192236 -24297 -14066 -135100 294226 180952 47644 -16351 -69116 126183 -212534
19097 -64782 -47838 41106 -10697 -309730 3278 27292 123904 -275322 -360322 245373 248521
19086 248521 -259096 -97562 -422458 144259 32504 132960 -16732 226428 208235 77931
19075 191521 -81687 -235554 -258008 -52567 63125 -118298 19828 -251363 -120268 -152704 -177591
19064 -177591 100655 8301 -321758 -40470 155850 -82434 64449 23550 -423759 -70935 -60700
19053 -60700 77241 -136842 -128027 -242314 90817 -9460 -146504 -90269 70470 -167608 10863
19041 105481 -5366 -18231 90350 -424932 -27129 -50406 25731 22045 -56896 -197150 197139
19029 82474 187721 267227 -186008 -179459 -142952 12809 105541 -61856 89667 35950 -13157
19017 -271532 -75100 61160 10989 19713 -251993 -147180 -186396 -310662 1069 -247661 264426
19005 -415617 -166006 79762 58863 93239 -371273 -221489 27595 -252382 -204919 -137456 124513
18993 -292043 90224 -119554 70635 170941 16271 -251122 189763 85753 -254668 264637
18982 -181690 -281036 -144253 6443 -157971 -249866 108594 -109895 -231703 32930 167875
18972 167875 -50201 -152878 -122899 438199 172281 172013 -317531 179019 103210 -227963 -188655
18961 -188655 86560 124579 -35414 216206 -45893 353925 94649 -38493 251270 -132269 122591
18949 -166750 -247153 122334 -122301 158809 -25018 -130645 -109028 51935 -319473 -125254
18938 212224 103537 332730 -182311 -186503 151281 19145 336724 58221 -22923 197702
18927 97028 -129981 -240277 -6633 -118627 -176023 -64907 -354819 94762 -37044 234072 122353
18916 122353 -106344 -232115 -17162 84297 -147191 -263727 -289157 -42835 -90996 -46384 53223
18904 200368 -130027 -113819 184032 -54841 -35385 -83133 120918 -119574 -227746 96043
18893 6448 -309065 -240959 -19874 -253907 -223883 68566 70474 -278529 -224801 -6420 -357882
18882 -357882 37251 40307 -81312 -139431 198964 144904 20733 -73116 130050 -48358 -132936
18871 -132936 202218 67976 -205774 60718 -377887 -52043 220883 94163 -481171 -56815
18860 -168017 -455709 52221 -109790 -136669 -207776 -38526 -424611 112313 7485 57599 109407
18849 109407 154445 -23866 -34939 -35029 333190 -259941 334948 157719 -97591 88402 56245
18838 56245 -383038 -57308 -53919 -78516 -281255 -311627 30436 -39136 -156552 192975 -229105
18826 -278095 114825 -123228 -61345 118951 -68471 -300794 -453790 -7795 312007 112543
18815 178701 -116542 -144727 -153999 26679 -134563 -245105 99098 27767 -100339 -89191 66114
18803 66188 -354480 -91197 14988 -63108 -14430 3418 -163535 -188004 -86019 51764 -178577
18791 -109480 -107938 21839 -50866 5503 -60646 64615 -38411 -285011 6341 110315 172568 -228071
18778 -159926 -15787 -159199 -155987 459287 -199967 -90851 -132939 106000 38598 21329 -211400
18766 -149918 48498 -1324 91543 -172541 -64816 373996 -217054 -51302 -310964 -170308 -487931
18755 -487931 25887 -89171 33078 -252997 -343444 -122774 11953 102726 48860 176996 -119515
18743 -407688 -104837 30181 -116154 -168427 127299 -41717 -151688 -44597 -190291 181151
18732 -196410 -90721 -85516 147788 -45661 -197751 -57211 61685 46701 183070 -209364 -405320
18721 -405320 148928 62087 63336 -24554 35477 -21041 412642 181406 -131200 -91783 -61973
18710 -61973 -279117 -164481 -73821 13783 -57033 -39110 255615 -4603 -112232 -194023 -181454
18699 -181454 219394 321377 40403 -131036 -470297 -66460 3750 259390 -312518 -24738
18688 103665 -24601 -177814 -330549 10737 10902 -355504 -223437 76369 250127 277287 -293396
18676 137455 -154956 -50630 -189525 14934 -11205 199270 -87682 151941 51571 -1146 110781
18664 -134454 -98736 -227009 133163 154615 -330544 171565 -131614 286631 -76937 -306571
18654 -306571 -242993 -30787 23111 -197949 -365879 -335523 -235051 -142478 -78777 -75779 -2832
18642 167509 -192691 21774 202207 25985 -236171 113062 -160196 -27650 28934 94032
18632 94032 192283 -114198 317063 -484738 12433 -224676 116307 -17292 8519 -10574 253338
18620 -138423 159067 -140199 -337505 -53605 -61909 -84547 -127715 -246259 -176588 122409 -224595
18608 -80041 -203546 -30966 59100 26670 140623 -342 209458 58113 86562 -31045 -31345 -170791
18596 -170791 -27187 -148770 -364987 -115219 -86199 -45257 237755 -340326 -323140 -254481
18586 -254481 -178037 230097 12654 -115421 -306387 66842 -115865 -237576 79232 -67569
18575 35975 105761 -151755 -204225 146914 -185446 -211330 -161512 78698 -99064 -212206 339322
18563 -54348 23711 262187 -72141 238370 -134034 -117597 52667 -177750 -148794 -98677 299154
18551 71439 -332466 -372590 107282 -16936 -234794 -136900 -366348 -113074 -141992 -288620
18541 -288620 -112443 46204 -116923 326385 29463 136614 -7027 -51947 76880 105615 -184767
18529 -347317 -34987 499180 -47961 129744 -61856 176085 6777 60219 -103862 69620 78389
18518 78389 -134002 70869 -65559 317330 -152925 101435 -22481 -27831 88280 -159561 92388
18506 -181215 67828 -107391 21342 -42280 -150002 -231809 -79024 10541 -39295 75155 215182
18495 215182 -400867 -201331 -144706 64236 9911 -285714 -90630 -56908 80799 -66134 113438
18483 -27197 -88614 -56568 27806 -17940 -73910 -5817 -109903 175532 -98185 -331196 -4522
18471 192577 -19955 -53762 -7818 68081 -275251 101718 -252403 92196 -128049 -102765 -342277
18460 -342277 -108192 -125287 -269279 78377 -19865 -17209 5312 -77148 197794 -92773 63973
18448 64653 -282421 197764 35994 -130547 -159871 -235456 47682 -124096 -36623 -170866 68990
18436 -50941 -54922 152020 -52087 -76815 103566 -44143 -180794 -1323 -149912 165564 250476
18425 250476 193023 124770 -242397 189041 -220258 8164 202402 318846 -90276 123618
18414 153063 317199 191535 201195 -61195 -324749 166172 -199501 -228191 -143791 397822
18403 222252 -171249 -147189 -1658 13921 -22647 -301613 434420 156721 -180964 290643
18392 -238664 211588 -334784 -149399 -173783 -113728 186678 211055 -242206 -292852 -271481
18382 -271481 -173898 386018 -343795 -227334 286821 -51346 290312 129081 -42059 -137950
18372 -137950 73615 74148 197372 53411 37258 -87755 293767 98640 9519 -200041 -313572
18361 -313572 -235266 158374 -318743 58295 191445 -151843 51803 -240844 -282227 -43069
18350 -281683 2574 -296594 -293866 -176625 -249821 -22838 157625 398767 150996 -27883 9253
18338 -157977 143047 196764 -66967 -105899 -126056 -118366 236578 -44482 -19643 210114 -118256
18326 99872 76581 62372 -60978 -138997 -65527 -159886 102632 100626 -361360 -86576 -30913
18314 45588 -134057 472973 287079 -241079 -23807 -49865 -241248 -146232 -206167 -47721 -331798
18303 -331798 -235068 158975 -250782 -69645 -136689 64230 -184543 -47679 80630 -85153 -135271
18292 -135271 -284189 7986 -9171 -60244 -151042 -238062 121335 -221306 -137101 -154420 -154769 -93276
18280 -93276 104099 -166526 -34255 27851 14980 166085 21332 -94980 -462214 130232 46061
18268 -101790 253840 -156142 227134 -266392 -123051 320190 62036 -142221 241821 147979
18258 147979 -85299 -18916 221614 43667 -156197 -4606 -75166 -315966 -151224 -118093 -295325
18247 -295325 6982 -297863 -349236 39044 -98930 -95082 -93796 -197329 -63623 103672 -18402
18235 162889 -91256 95938 -134090 -119234 -127472 -104089 -286745 -127312 187823 -249065 164342
18223 -141284 252769 -428494 -130510 29137 -333555 -317977 -237612 111459 81745 -319 76532
18211 121654 403103 -117128 -210959 124792 44174 -9945 -84677 -89756 -82686 -67443 4886 -215740
18198 -163389 -333039 -48569 57441 154858 -29780 -290162 8178 -55971 139774 -338382 224964
18186 155872 -94173 32962 15945 -325007 83078 84116 -160285 -32516 -180517 240594 -29529
18174 228202 -246375 -212087 -3872 -168499 -179625 -70856 101492 58919 93158 5816 312064
18163 312064 23069 -201363 16726 -39229 -145474 -185788 -206815 415666 -475209 -111583
18152 40274 3330 183437 163437 169454 -157507 -140848 -152776 23838 162771 -277260 -428838
18141 -428838 -40849 176910 -54314 109658 -185286 -141641 -140194 310737 166000 125252 287040
18130 287040 -234957 49323 -23025 -268316 48325 -112829 -262186 -17301 -127640 38134
18119 183431 -218284 -165728 286590 238633 14511 399879 52438 -87328 -321081 8450 -241815
18107 -326101 29238 -329953 -93096 137455 31718 -118190 -104952 -153301 -28515 -65779 226803
18095 192567 80073 -34875 -66026 -9627 -76113 53024 -61297 -37349 119441 -245930 -115086
18083 -18940 75743 198480 -57343 68997 78656 -35362 82048 -40493 -415094 -93519 -156313
18072 -156313 -204 -271367 116086 126501 64707 -34059 163885 109622 -84907 -121175 -260190
18061 -260190 -184143 -207202 330436 -231560 121869 -96241 -8794 96163 -78993 270546 -92162
18049 -417292 -97408 -183589 -2181 -297008 -58049 -27331 -162250 -194764 412715 -68771 -112538
18038 -112538 9933 -92208 31933 -336643 -294930 173932 -268050 -118799 182943 -6849 152449
18026 -41629 44808 -265071 -86934 169872 -259450 -63121 259236 91576 281653 229653 173225
18015 173225 192462 113452 187084 141954 234568 -277063 -29592 -135041 -106041 184030 -145900
18003 -428535 -102243 -39167 -99871 -76629 126587 -133771 -162878 259049 -89621 -69053 -227213
17992 -227213 88652 -188376 -142492 -13341 -421424 -405404 -272775 149308 -50399 1652 -52739
17980 102112 125012 -176453 -180977 -89030 -273273 210470 -175388 46168 -273156 86309 -32197
17968 14748 -258094 -6335 -138943 39419 -57937 183407 -166792 -100647 13985 6772 -142886
17956 3522 -75851 -59316 -294085 -282707 -139551 123918 -95558 139519 246795 -127676 -4858
17944 -147059 -73784 -529590 44601 -89865 -49598 -18092 -288358 -165396 102037 -191607
17933 -41213 78495 -87611 37453 -245354 114547 149825 102177 118920 -220841 -72051 -5422
17921 -29309 -247461 96957 253933 -8435 -137110 -5765 98312 69607 99976 115196 -83927
17909 -85679 97271 -452728 9649 272455 325430 -6451 185314 31064 -4435 -55412 7718 -308492
17896 -84339 -32834 3646 -285916 -291702 -68573 -123840 259183 -21965 -32198 114084 233782
17885 233782 -167152 151269 215775 -76398 66932 203813 -222651 -367756 -56090 -77327
17875 -77327 96686 -306555 37729 113136 198246 146417 -220093 -27686 -16423 80900 74686
17864 74686 29141 69457 162638 -139054 336387 -9187 -180574 130596 -258039 140613 69607
17852 -252755 95384 -113230 122172 18100 -46957 -154519 58361 237788 177591 140758 -45802
17840 49239 -71739 -43756 1556 -106212 -100670 -93384 -41255 -124184 34474 -77178 175277 21755
17827 12076 -69629 221831 -30260 -42676 -68098 -969 105266 -37028 -50103 -408835 -21444
17815 -118733 129941 -2262 352443 4649 454398 174386 -145969 160312 156440 -26384 -228902
17804 -228902 59256 -18892 47457 266208 489291 394692 -48311 185062 56464 75487 152394
17793 152394 -53669 -12306 -371139 -110778 22991 132106 -5720 -388187 -180886 -83813 125557
17781 -70426 122178 65823 68576 -54887 -283978 -180716 -109964 301271 -79706 -147219 -104562
17770 -104562 -12049 -183304 132554 -144341 421026 51378 35463 267871 119856 -198037
17759 -106588 685 174578 17776 -52020 191929 127795 130391 -119403 -9114 197457 391789
17748 391789 12898 -192316 76137 -39580 54144 -98421 65721 225005 174280 -71751 302782
17736 -123455 179698 -191939 -5575 -243752 242685 -66863 -333690 -115006 43453 -244423
17725 249978 83460 -175911 3916 181064 -72176 -139511 -65747 55319 -130274 -27797 -19090
17714 -19090 -130944 -219781 -193975 58988 -67307 -82615 -75382 84780 280087 -313881 -171117
17703 -171117 44722 217672 142887 -105481 -161624 -218038 -291498 -214969 330327 -96841 318071
17691 -59645 -57673 190058 44046 -276916 26543 -33045 187975 -76873 344571 -157254 -230496
17680 -230496 347891 342901 247464 11392 -16695 -58383 -69205 -247012 -240816 123935 -21298
17668 215441 -1091 -113796 30446 185115 -211311 -143596 344503 242654 -226302 -77658
17657 85622 -18130 73052 -263848 3879 -205877 85929 100510 183079 167866 55900 -122131
17645 -223470 16791 -224550 152889 -53171 122425 -41101 52508 -38584 -241834 -55744 -45723
17634 -45723 90671 222214 11254 -120967 230532 -117575 -89041 163003 58444 1280 247416
17623 247416 129236 17566 146514 -27543 131101 52139 -1003 126451 -219581 -17167 135398
17611 110416 -9428 167261 104778 -161313 -18190 83119 244484 153683 69555 -46198 234911
17599 -143453 220575 54381 -166281 -79389 230594 22854 109127 360545 -95550 -143607 -224339
17588 -224339 -276850 227953 207626 -32100 288520 -173225 241618 149391 -425398 42264
17577 -84808 -254847 78933 42060 -313374 -41686 -53653 -90774 -226345 -45528 -61991 -6876
17565 56318 140836 160495 60666 -71309 175507 -92712 115376 -216622 -50413 363521 61455
17553 -107270 124332 145539 3890 -164571 138081 233581 -140824 114119 -125542 273043
17542 -131948 -432797 -267621 -75191 308364 58050 8697 177502 45993 -225427 -230373 -96413
17530 54589 71815 -294639 377698 84023 206733 280212 386797 92431 -51004 -143385 -217219
17519 -217219 73993 -71169 11509 219142 235487 92413 -16594 -198025 -214089 -509758 14678
17507 -208716 72835 93261 -80212 -59218 -291167 289891 17766 156285 188329 292577 93497
17495 311523 362226 -139285 155107 -100187 119198 172375 190381 -38249 316592 88988
17484 168278 180429 197308 -26471 130501 186682 239305 -87645 54758 224102 260601 226089
17473 226089 22863 240843 73209 -151502 -23114 -27937 -82991 211355 48723 -21736 110335
17461 275473 -80775 496829 -264247 84066 46897 28172 378805 -37352 257446 263985 436509
17450 436509 -119546 228863 447796 187181 305080 237234 249284 377678 351120 303610
17440 303610 176479 55718 82457 -243986 321232 215196 288143 271297 267556 365792 198279
17429 198279 158103 65648 27173 249298 419325 376206 285371 102212 -195039 231828
17418 61627 251309 14341 252290 174277 215378 543774 217417 103014 -259678 107696
17407 75566 259545 128575 -128660 346995 263885 -242346 -126492 -12930 55336 -78794
17396 346711 97452 725360 72014 -130192 194452 92510 410434 285839 389496 119461
17385 265972 165244 88270 232766 211547 109723 187685 -173197 37609 47345 -68432 83053
17373 222517 165622 238249 -144136 65691 -77702 8194 -54141 24402 230672 258194 80222
17361 139400 249177 -160187 34598 222616 327058 165543 289395 -260393 -9572 216786
17350 99223 172254 -307993 92729 588821 218411 25728 -39566 215986 144373 231638 99811
17338 264340 102557 49725 188452 292073 -215561 -248148 -123331 -64633 57696 -362 538320
17326 252356 -13973 35239 76980 379521 213436 15361 213781 95948 246730 -43151 233097
17314 -7991 125045 -100917 4343 102392 144178 36437 118914 77637 -132405 91172 361251
17303 361251 338867 350824 211598 378870 191952 311545 79985 197330 142336 -19253
17292 26662 241732 57755 191518 301600 -4466 102541 448662 187008 340976 -81800
17281 -164642 -80601 265210 50706 24897 -257037 511877 81609 448816 403006 442779 115748
17269 66510 -11735 396183 442728 23668 158170 -39682 533790 282066 215698 264131 133445
17258 133445 230654 164852 229578 -86226 114911 160979 385916 460675 463127 68260 139163
17247 139163 28436 373959 295882 54629 384018 35248 216842 20954 545944 440752
17237 440752 236668 499430 59153 283509 -39857 239044 28476 96867 -311699 -41918
17226 -263598 570037 -220807 142164 255139 176536 413570 320405 59280 401215 182133
17215 136145 196788 264051 -52073 -284898 218504 332916 233977 113855 192432 229254 100023
17203 -13665 -23865 222459 75060 324037 -138488 83689 311659 356436 241326 293169 519639
17192 519639 167107 219282 229362 418911 331999 544080 468267 429853 403227 56501 202326
17181 202326 191441 248325 148569 194244 -57563 114691 125528 197173 178702 21675 525853
17170 525853 6094 230506 346900 476023 530425 528492 -61822 430020 262546 268345 74133
17158 -2295 61900 -174461 308579 460176 270994 500240 464853 419203 68885 281722 -43308
17146 371304 293564 235056 91500 217813 329969 382610 -182289 236972 33259 132400 543854
17135 543854 397835 400938 135293 174371 349507 319164 308585 375537 151453 141129 431121
17124 431121 443578 111472 -24329 5551 411435 325599 407480 583189 597842 351932 298690
17113 298690 246606 192895 420475 209517 283881 460292 371955 233736 672312 264837
17102 218748 564145 418178 239239 309293 133288 338866 88473 36353 442117 413232
17092 413232 277346 489633 329546 596698 346206 327921 245598 668060 360243 325785
17082 325785 492758 308010 648021 453646 357994 281249 616279 583296 489247 539936
17072 539936 368429 416918 178447 405472 202610 546769 216608 692621 613510 394444
17062 394444 403530 195473 391510 285451 526037 580018 423674 476776 675377 448364
17052 448364 721691 657598 677656 389699 404797 424580 564334 328436 612311 274023
17041 468898 530979 427295 435218 526840 567348 575245 495155 632213 809340 181988 457092
17030 457092 451177 523715 612704 813734 686121 457956 626880 538848 618607 539308 669134
17019 669134 594521 878328 763106 639763 757427 544470 633226 605395 412298 745586
17009 745586 353863 734181 796045 664124 664214 789188 468440 757858 803501 809607 732605
16998 732605 961320 828374 893809 802289 556801 867893 878786 921755 813905 1074482
16988 1074482 825996 936548 1090017 973307 722542 834079 763740 1043409 845480 618730
16978 618730 904668 726322 764741 790248 919242 696123 822263 574058 1060095 1181892
16968 1181892 800740 1192487 1032679 1211431 886537 1325923 889959 1088291 606114
16959 606114 1058369 1016224 1327918 1266275 696212 1170992 1129772 903142 1003195 1209919
16949 1209919 1260458 1074432 1164860 1075113 1135410 1152880 846135 1300310 1254355 1177532 1492708
16938 1492708 1086848 1255509 1089716 1555521 1338824 1124115 1630027 1029972 1291158
16929 1291158 1543406 1031166 1281104 1495054 1299965 1435282 1247161 1485334 1119096
16920 1119096 1328170 1338655 1195310 1548879 1725732 1935511 1611305 1801019 1643825 1577399
16910 1577399 1628808 1457522 1668109 1837487 1777097 1605561 1965120 1869319 2212881 1715824
16900 1715824 2036593 1853665 2048241 1765479 2084816 1949835 2205750 2071883 2289982
16891 2289982 1451097 2097838 2258295 2010410 2009189 2153698 2382824 2218479 1844091 2208526
16881 2208526 2444063 2179505 2289319 2277721 2277147 2317261 2239698 2638146 2624913 2442344 2719782
16870 2719782 2041002 2744103 2940021 2684945 2805597 2655980 2844571 2734791 2969861
16861 2969861 2964374 2778073 2857631 2926535 3094906 3175358 2944268 3435837 3236144 3047244
16851 3047244 3454622 3329346 3590314 3468533 3441882 3649218 3558541 3553693 3984601 3595656
16841 3595656 3731332 4142237 4119549 4071996 4135991 4083784 4293721 4693390 4416247 4428356
16831 4428356 4571618 4670518 4935802 5187296 4473756 4865827 5301272 5196581 5481898 5383107
16821 5383107 5599621 5517755 5765764 5779841 5791076 5909405 6086229 6589228 6170796 6624317
16811 6624317 6962387 6798755 7208611 7121061 7167299 7474932 7421104 7708974 7605317 8417372
16801 8417372 8112639 8206085 8858620 8808118 8868349 9120715 9649999 10083485 10210488 10769695
16791 10769695 10622254 10583390 11239964 11495876 11926395 12018854 12317383 12981691 13174508 13524739
16781 13524739 13948875 14310853 14522627 15124510 15526388 16118637 16477447 17329119 17693399
16772 17693399 17949154 18846491 19491324 20188372 20923562 21371109 22175110 22927742 24276324
16763 24276324 24868856 25887708 26795582 27794154 29242376 30398792 31884368 33268216
16755 33268216 34311428 35726797 37347266 39161801 41011936 42726828 44975338 47020945
16747 47020945 49338725 51719837 54638337 57131848 60263984 63272294 66554889 70347759
16739 70347759 74109931 78099200 82350196 86932531 91450659 96916179 101679676 107155622
16731 107155622 112661281 118447108 124161362 130140534 135952958 142237380 147562179 152552508
16723 152552508 157211410 161474586 164823688 167797056 169539903 170493122 170716607 169768004
16715 169768004 168114458 165546483 162044705 158110042 153509052 148403817 142665460 136907118
16707 136907118 131683819 125204960 119818283 113951652 108078259 102861565 97111936 92237659
16699 92237659 87944705 82801564 78717731 74587859 70936804 67130903 63821507 60620041
16691 60620041 57377447 54823385 52167229 49732278 47126236 44752255 42932371 41354554
16683 41354554 39038046 37241359 35622854 33928612 32725235 31347486 30170053 28650221
16675 28650221 27833962 26689612 25547369 24387106 23674311 22648439 22138423 21019563
16667 21019563 20301305 19915167 18883679 18373414 18080940 17133272 16520021 16264819 15850294
16658 15850294 15376111 14612419 14435383 13786468 13811019 12728643 12706612 12498488 11972516
16649 11972516 11598397 11316806 10572210 10673023 10620395 10352636 9908394 9968432 9568214 9077737
16639 9077737 9096114 8564123 8611519 8476148 8105881 8107634 7510633 7465105 7565909 7253768
16629 7253768 6946353 6892625 6630308 6209681 6516567 6506772 6199094 6063046 5892080 5744729
16619 5744729 5731314 5404263 5419804 5259867 5012878 5504859 5054228 4886801 5082628 4942759
16609 4942759 4721733 4347237 4519416 4085706 4573514 4356814 4097874 4347022 4034215
16600 4034215 4013783 4338894 3917892 3611591 3742434 3889176 3946105 3706663 3385856 3359666
16590 3359666 3551538 3197249 3352932 3179902 3153542 3144767 3237335 3392070 3058558 2889459
16580 2889459 2664868 2609378 3000119 2954460 2646178 2655629 2602325 2709379 2436400 2309425
16570 2309425 2569056 2335395 2626181 2324206 2262910 2621601 2416215 2481905 2320450 2288927
16560 2288927 2511490 2229948 2018832 2481761 1903070 2318093 2246240 2119982 2003705 1683782
16550 1683782 1844672 1910270 2020627 1715759 1763138 1510490 1667131 1972572 1904638 1608238
16540 1608238 1673664 1706554 1759399 1595187 1645804 1568199 1676985 1607482 1349576 1526071
16530 1526071 1356979 1676142 1509475 1672663 1452780 1316186 1199078 1383513 1411688 1620592
16520 1620592 1433804 1323111 1311593 1470577 1343281 1597375 1322178 1433290 1364161 1382359
16510 1382359 1065518 1479365 1316017 1532637 1108354 1047311 1101326 1219200 925422 1418920
16500 1418920 713693 943247 1038370 1100961 1187510 1055709 1301839 1557879 784536 1262833
16490 1262833 1167467 898241 816099 969514 1188356 988590 884364 983052 927564 1043729
16480 1043729 693517 1234888 992554 999440 696858 1218778 635294 931037 722421 678319
16470 678319 1028064 723812 842643 959225 1284908 879956 809650 742872 501829 701787
16460 701787 822629 869794 475401 891526 925561 593858 648521 602727 514151 575326 647472
16449 647472 899444 539187 638029 744792 824331 579473 825145 540649 487361 688713
16439 688713 784366 547002 664896 740662 700819 243502 539096 649734 774956 411046
16429 411046 517733 329882 563751 324157 655930 487891 629104 450036 143274 528579
16419 528579 603183 331602 481576 186823 596999 348152 451331 712806 698532 529672
16409 529672 517915 226299 744760 701493 688992 474511 701365 584523 757592 399742
16399 399742 663323 578685 453633 491240 468782 542399 385136 432878 533327 562333 237032
16387 371535 771888 172468 151765 251973 548805 499844 648663 479711 348799 347142
16377 347142 721011 222631 358536 484852 361780 318100 458753 434970 282580 743047
16367 743047 417551 111832 133110 400654 131707 355694 126079 357514 498935 475658
16357 475658 189576 160589 196479 194114 470610 514089 425994 -60614 456726 382306 492372
16346 492372 81319 278057 413065 524589 263057 572581 506809 428499 323864 168862
16336 168862 213074 573481 136635 48494 34918 201372 323625 583098 321792 97313
16325 419146 72128 36316 187184 264948 331394 307385 232800 146341 328783 568838 346237
16314 346237 422201 -79653 104189 470814 377573 238539 -34008 206915 83620 254645
16304 254645 376641 48196 -34593 284674 -20870 174871 97598 92013 333212 553661 317465
16293 317465 199515 187561 184083 247591 75627 523437 450211 319462 82597 231232 201788
16282 201788 304808 31095 247820 199965 218978 245929 260011 136206 264439 -43391 222848
16270 373529 354350 223039 5794 90513 274900 224617 569629 117403 77777 204319 385548
16259 385548 236034 286549 -177970 -111962 210265 269142 223860 191080 333182 513579
16249 513579 134232 191881 229724 258691 -2882 557462 -280058 275077 113936 96462 -231402
16237 185620 170863 307923 72683 119633 257932 206210 152778 65693 -106172 48924 40906
16226 40906 -148492 296554 144160 201146 386582 158358 97805 -75621 203169 416486
16216 416486 239969 -114665 -174703 298454 174514 503923 232671 88932 360623 322208
16206 322208 233018 165628 150655 55416 -143610 -91209 341258 333023 221783 300222 25107
16194 73675 187855 279932 355988 -101604 3899 71997 45498 117850 71478 -145784 -41119
16182 128884 -349370 70844 314333 152432 23394 -477277 90484 38655 152965 219772
16172 219772 24108 49815 85502 21633 216153 5724 106311 -92356 -5686 -73003 -100391
16161 -100391 282990 228738 61398 213304 416483 239978 -208921 394113 240003 -108168
16150 129383 109576 402330 24268 79747 256135 123619 -70767 216600 -167634 130885
16139 18172 49384 -253733 -159012 74416 -58941 -137278 -16296 -32387 46203 -14567 52514
16127 -23894 -108319 -221723 -166913 -239161 -43949 -253938 12125 -154528 60870 31039 101175
16116 101175 22405 150406 9582 -42099 113353 12807 -15856 166796 315696 -201526 -17712
16104 106382 -57453 35473 165408 225592 -113992 152325 -98746 92637 138324 196322 -96320
16092 389528 145605 176348 18944 -278853 -74247 520969 -222391 -128517 29663 -17949 -87588
16081 -87588 168593 -33783 81029 -76902 125714 29198 -142101 -79686 -73337 145209 59541
16069 -104363 -104742 131290 467526 -115113 276827 4627 -26385 56765 35534 26595 -28785
16057 125645 -59884 -75050 -158186 128739 141876 45081 -85056 134151 332156 -169143 -138061
16046 -138061 -275128 122712 -221450 191124 -212165 -171477 805 -2109 94695 -179272 74058
16034 322014 -151682 73057 -32026 189898 -112134 154501 56167 -4635 105737 -98707 -109720
16023 -109720 -51303 279181 80747 -250747 274014 -182912 27178 222168 158293 -186676
16012 -146273 -42808 124739 -287709 -73751 -46886 -35931 -96105 -8835 -108357 23522 225592
16001 225592 -104625 203156 -193839 224788 213006 5907 14687 310465 -212002 68190 -108030
15989 217740 -76791 -421056 27726 86100 41950 -42363 353132 41656 185783 38379 118788
15978 118788 69978 35252 -35499 18541 5497 -123163 274907 -38110 307762 224098 -157858
15966 251079 202601 170645 66123 -89631 -105133 -75739 -34335 -28320 185318 156864 53095
15954 232886 127694 106208 6600 102815 -379311 -113872 -20220 4866 -138621 -81885 -525209
15943 -525209 5631 -210629 -221151 81499 -102576 72139 -37201 -22587 191035 -103593 -267185
15932 -267185 41590 -364335 108633 121988 -149304 57273 183173 -147589 -111124 -70951
15922 -70951 -226608 107885 -55134 149433 -58388 -127603 -95674 136884 3944 -48645 -120737
15911 -120737 184831 101021 -142900 59813 -143694 106039 -168135 68074 209914 -29670
15900 27118 -301689 -86407 60346 78870 141696 -185298 24182 -63875 30816 152493 85217
15889 85217 -115964 -205737 -186822 -246588 -218716 -44257 61358 -71054 -22676 -20872 15404 165686
15877 165686 -42232 -465978 5592 -102580 -20217 -17367 -150129 -143119 53194 -97150 -54272
15866 -54272 206717 -52630 214171 90220 287303 -132120 38187 -44884 -116823 -24391 58620
15854 -38739 -130942 -196219 65679 -18206 64274 73012 7364 -39260 -284808 -203042 -425811 -71568
15841 -176385 -124899 -573261 109578 9216 -362925 62535 -140039 -173970 -149578 -25540 209853
15829 -287444 -270725 -82264 -153714 -14569 -323088 -38915 427566 -293457 -576757 -109066
15818 204831 230430 -193973 -408348 238714 -41672 181079 -263194 -33140 -246327 185883
15807 177764 6584 -52255 129311 31157 -256356 194374 25188 501080 -184799 78669 -281928
15795 -22391 114962 204071 158751 80423 -235439 -34640 -111834 -176576 -145172 -171703 -104372
15784 -104372 -74337 435969 112282 12174 -40017 -180594 -19415 -201542 80032 -67971 -24439
15772 -233535 -13050 -187225 24333 62904 69831 -361210 80180 101616 74293 -9929 233296
15760 256477 -345274 60685 104481 357205 289443 173453 259362 -18049 -60769 85510 -44663
15748 -49646 28024 119957 -341211 141698 59683 -200018 19181 -325019 -21737 -282376 -574201
15737 -574201 -9744 436541 64366 -133551 17513 -37071 -166178 103589 1036 206230 -399854
15725 25087 138819 373870 144082 -397596 -289697 99845 -150503 -221294 31685 -41415
15714 -39175 -530576 -613435 -73689 213040 170278 -30365 -40954 -146882 262654 265765 -1548
15702 -67852 -283906 -34698 1138 -230850 -240176 4526 48813 150351 284986 82257 8335 14879
15690 14879 -239877 93141 201945 -249631 4424 215282 -362087 25810 262039 -354294
15679 80341 -130332 115023 -121909 18232 125577 106744 626383 -122420 -99464 -312980
15669 -312980 124813 135532 22427 -43897 -252757 -35300 -154399 270057 26777 -363880
15658 16560 129922 -49567 119280 -265680 -36492 298392 306564 274060 -63469 -9938 -239507
15647 -239507 396411 237493 198006 -120700 219477 -55880 95095 -239998 46691 383356
15637 383356 -95805 16999 -422235 14031 -441 172441 -249978 -64308 63959 -131119 169801
15625 -118749 4787 -248880 39018 137666 -277961 -113692 -85064 41628 34613 184414 -107992
15613 307556 30626 295955 -177938 -45732 208288 -187958 -58760 -98299 170719 224563
15603 224563 -21093 -86902 82827 -139313 -3055 8549 -90509 244463 220949 56759 -33307
15591 -85546 237720 48569 -286071 -254155 78561 122636 -79724 267114 47710 -522469 -64108
15579 -248591 77137 -127276 24014 88085 381568 193678 297605 -136636 -164465 -228701
15569 -228701 208303 -169328 -118771 297421 318714 -16982 -34552 -108610 120447 -74340 176950
15557 -55445 99305 -67345 185585 -150693 206051 -240393 257317 420269 -331831 -38381
15546 -12478 -214416 199216 -65092 -17796 27544 -224819 37846 -120396 -100614 1391 -276727
15534 -24294 -86212 -99706 54432 32940 -34267 -285123 -320359 -140304 -85294 138537 -112688
15522 100460 71680 -60311 -154702 169356 -56022 30865 -257243 311588 84449 -374945 -45579
15510 71026 -51281 228445 149073 -280344 819 -184777 -176776 217913 95209 142679 55137
15498 37258 -15641 48388 -119385 -138377 156052 -495314 271921 -184052 -239773 -230684 10378
15486 208895 140635 56672 -161350 16812 -111080 -77416 185836 -95249 152733 -85124 714
15474 -162099 57646 69584 -192436 -131439 -132192 12620 -59150 207282 242711 162666 20544
15462 -72272 72932 350556 330156 -180271 -296706 103696 172605 88309 9718 215025 364453
15451 364453 -57772 -162781 203070 -107264 -310110 -384671 38961 -98773 -105116 -23482 -104663
15440 -104663 -116073 57613 12669 -81094 -54175 124762 -90800 102301 -6840 -185098 -1466
15428 71287 138085 -138595 -105674 -168015 -317418 -241357 -26831 -260578 -46830 155423 -199340
15416 -522273 -8589 363835 -133570 239780 -242399 -177326 179960 182761 -38488 -277114 63825
15404 -67547 -87229 -42264 -447636 168620 -91384 245399 63407 -90085 -34038 -134686 -58079
15392 551266 82631 -76825 -142622 -189073 -93090 -26929 161971 -319258 -110016 -52466 140012
15380 -189411 -369646 -90114 212227 145286 282787 -44206 -105742 -73211 -242090 -115456
15369 -141168 -26436 253851 -154462 10295 117407 574332 91577 41464 50223 111808 42904
15357 41492 310214 -93924 -248560 -62169 -103990 -77775 -68315 -194531 -38411 398596 106211
15345 471383 30564 -163299 -493821 -38115 -29021 -154131 177939 75068 -213911 87552 141646
15334 141646 -73500 112208 -151229 194347 6515 45308 -138755 210812 31988 -40038 357862
15322 130561 -23827 -123181 -137021 -208639 -172889 -54251 -357661 -112105 129600 -23794 -347018
15311 -347018 86974 -120968 52119 242270 54224 121418 -75921 316868 -426366 -36293 -214070
15300 -214070 131657 107247 55245 294937 67547 177075 -142347 -232747 -83989 88810 57409
15289 57409 293886 177428 344629 253983 -154515 125098 -79432 61568 33364 202538
15279 202538 283977 -107004 167803 -47815 -47652 86360 -148713 168795 -117341 -9061 186398
15267 -437627 -158680 -158740 -231749 37670 -173625 -5356 -106497 192722 437424 25424 22142
15256 22142 -40393 213837 218706 288483 98513 256910 49207 420189 1157686 1815012 967457
15245 967457 1531446 1162987 171904 598508 201129 306263 56755 257639 -23116 -89320
15235 -89320 144805 52302 111006 370445 145022 18069 -25376 30039 -279145 165521 253440
15224 253440 -26381 -140318 29496 450415 153581 149640 -23991 52137 -230770 -176683 273539
15212 -159505 36919 3863 -131791 164036 80773 32412 -177309 -84365 -200686 -213517 133413
15200 -135965 32561 -394125 116244 78251 175650 -251838 483690 358582 189566 115029
15190 115029 -102851 -122791 -88603 29512 -47819 354845 22974 38358 370341 -70209 324865
15178 43463 181522 -100109 262915 91286 -150858 99147 186823 -223489 -21110 193401
15167 -344231 165025 -63005 62858 152231 -108775 235589 41019 -50573 259472 62874 -13194
15155 293714 51042 203167 189321 353715 67115 -212244 -251324 67028 -8569 453709 -308892
15143 173718 44260 37386 -55347 -214307 403566 368023 139427 141134 -51750 -47043 -43433 23266
15130 511959 159825 231202 -66735 64583 308897 244114 144319 207003 155767 310900 -3874
15118 -229592 271625 121376 17348 74765 -69791 370189 -90406 245416 -50276 206363
15107 348929 277625 146692 179485 -102695 -72812 49919 158430 157949 -28367 131736 70287
15096 70287 -68490 134985 96596 35801 -56761 353806 146970 3658 300706 128317 448473
15085 448473 -76728 -297165 -129716 258991 557905 199709 417604 282189 51558 158778
15075 158778 7607 343039 294665 -53223 -43105 -146348 -531 -97273 105080 279376 -283446
15063 258707 -18116 -12300 248486 84202 78177 -63544 232380 20017 243498 -51817 124398
15051 -167035 177038 86125 20822 100847 -9120 94175 28062 60384 113488 362309 441155
15040 441155 26680 207025 137977 152283 142851 297600 93438 -68804 165672 185597 147064
15029 147064 264093 135804 299400 43188 60523 294299 349089 68217 189711 229560
15019 229560 51390 78938 284582 -295006 297746 187121 101706 304440 -597 298934 333366
15008 333366 -140562 -243152 201755 -142904 269731 230063 441211 123239 -42343 10878
14997 214435 204124 22042 305033 424154 -264972 250669 279191 360137 257166 352042
14987 352042 142972 256005 226085 336624 118498 300165 77176 167699 530389 232559
14976 439692 223158 153590 243384 13628 354995 487220 225657 98927 -139540 223513
14965 97182 32582 709065 -140481 77981 48470 104681 -34831 413256 348204 556378 327246
14954 327246 72250 339346 144014 324318 322811 404716 170470 147253 424637 -18250 196625
14942 385581 230727 305182 499894 272358 -170783 38976 -148243 196327 241210 249261
14932 249261 52768 270192 408546 243253 220332 309503 405741 359234 587980 588594 -21903
14920 271224 450040 19619 349389 353221 290742 319422 319805 304690 333849 -31195 197313
14908 336807 319432 220419 499753 451243 103203 133077 142196 32398 400112 301614 36181
14896 379011 213656 536366 62703 228359 342249 251797 -98927 105122 410682 332510
14886 332510 66568 275565 304160 384679 228898 226940 523693 297050 99522 192002 85523
14874 -37475 64395 571528 702086 496828 20473 279292 298721 310697 175017 288314
14864 288314 724870 437447 699358 105222 297192 317954 375689 325802 507284 365994
14854 365994 296675 293821 326221 382543 452223 519593 289369 481599 298589 354301 369347
14843 369347 71917 356826 129017 190365 507812 475387 617108 270838 229111 114514
14832 84385 265525 523480 472048 520954 352380 502679 205016 438578 343640 621240
14822 621240 218567 298066 690066 570985 724267 120906 561427 351880 391482 184172
14811 344458 772794 401865 137896 194182 379838 623758 600944 668259 308325 539525
14801 539525 590991 819941 426161 190888 34341 570920 191628 447541 406812 561322
14791 561322 457703 779750 422494 349665 411173 657438 494843 351538 716316 813770
14781 813770 537336 342263 308295 243986 629993 760831 368986 469294 482678 843907
14771 843907 554727 671081 664546 485593 449013 759531 321569 745189 702057 505333
14761 505333 589308 988660 547085 680044 835828 618174 503159 420088 622819 486433
14751 486433 478479 287016 834853 545089 579264 149257 483219 418384 200497 572703
14741 572703 650616 717289 483103 569038 446850 619615 598382 778736 666913 381351
14731 381351 489659 541298 813093 611328 356079 602806 751169 637227 607647 669791
14721 669791 505951 673571 672553 940057 526877 719870 692341 484662 487987 824015
14711 824015 1018292 768588 838562 1024379 548823 927682 1030386 391707 691331 769465
14701 769465 1130773 957339 779625 550474 872159 599987 746777 826175 906561 699585
14691 699585 664412 799542 883829 926721 1224389 1044731 930597 988623 1025656 627690
14681 627690 964528 545741 1155954 849159 935722 764748 839785 1287429 1076651 862236
14671 862236 970870 659779 858815 1095017 931421 687374 875033 924238 999913 835341
14661 835341 951028 935528 981375 971895 647868 896512 818126 1312281 891171 1517276
14651 1517276 807162 936687 982895 1032413 708943 990101 990966 1143096 975342 1239499
14641 1239499 1189513 1089163 1182217 1144064 1067255 1216781 1121915 997455 1072482 1052576 1019196
14630 1019196 1328339 1240438 1316586 1014918 1227691 1332892 1189520 1387156 1521406 1077094
14620 1077094 1296395 1233816 945067 1284511 1269132 1288379 1353724 1476549 1381870 1454188
14610 1454188 1231170 1220405 1726658 1202196 1407187 1368147 1694673 1370694 1463347 1492632
14600 1492632 1232492 1597956 1354265 1713833 1382641 1746214 1770918 1334236 1743160 1590483
14590 1590483 1526674 1798414 1992199 1493018 1513107 1718270 1279431 1457315 1801722 1859982
14580 1859982 1824620 1746826 1709963 1885126 1851739 1893940 1834756 2096693 1728185 2019507
14570 2019507 1906114 1989102 2169875 2267598 2099056 2365022 2179773 2060109 2242220 2328600
14560 2328600 2040348 2243258 2409441 2746836 2782900 2970121 2798468 3431211 3764854 4328921
14550 4328921 5157537 6925381 10573422 19720229 38069099 48969743 21926075 8714560
14541 3990440 2741385 2252363 2126126 2173626 1921116 1626985 1913177 1630871 1638558 1847166
14531 1847166 1848837 2058725 2488703 2172974 2245640 2298396 2287471 1866121 2275106 2103000
14521 2103000 1989024 2181621 2147540 2288067 2277559 2241196 2496398 2507414 2457738 2734063
14511 2734063 2642785 2572386 2548673 2947909 2326156 2647065 2816938 2787525 2676383 2759399
14501 2759399 3072696 2915068 3129346 3093784 2945111 3241055 3024126 2940676 2628022 2905492
14491 2905492 3540666 3159402 2779915 3308509 3436519 3361758 3119748 3338853 3208226 3314923
14481 3314923 3675306 3207845 3342130 3459774 3696124 3801242 3788518 3833495 3580889 3838634
14471 3838634 4023523 4097823 3939403 3764971 4292980 4301032 3918040 3907076 4219209 4301900
14461 4301900 4360154 4276114 4614905 4509170 4283511 4502065 4653220 4762930 4521183 4706574
14451 4706574 4809294 4906029 4819127 5061025 5086954 5386215 5253241 5328157 5312178 5537442
14441 5537442 5537260 5468694 5437226 5921402 5680922 5807822 6083142 6500517 5982576 6019633
14431 6019633 6193632 6579129 6471954 6718923 6280573 6630188 6679492 6943029 6501688 6993437
14421 6993437 7109363 7001639 7198635 7329438 7530174 7426701 7523229 7872073 7900933 8032950
14411 8032950 7975156 7976004 8362205 8661229 8743622 9122130 8736973 9328919 9464313 9103458
14401 9103458 9276277 9452248 9713394 9835523 10249451 10197505 10462283 10213125 10653439 10640827
14391 10640827 10937118 11428013 11521085 11658322 11655372 11989939 12236712 12440813 13004822 13023340
14381 13023340 13301434 13463520 13666458 13749325 14133698 14178478 14641817 14642516 14995967 15532625
14371 15532625 15684410 16289736 16354368 16759521 17259709 17692487 17793240 18257283 18622173
14362 18622173 19123829 19555536 19804940 20347617 20886910 21231047 21839767 22292207 23064267
14353 23064267 23447929 23901830 24266395 24968236 25893961 26127540 26819648 27575021 28313447
14344 28313447 28700348 29683227 30650056 31436955 32216511 33162985 33853767 35117069 36238603
14335 36238603 36910018 38464450 38882345 40683165 41702179 43295759 44506019 46048627
14327 46048627 47198786 48675995 50348533 52145846 53774298 55727208 57320275 60089981
14319 60089981 61618619 63860451 66293678 68931091 71588028 74504831 77485790 80389248
14311 80389248 83947614 87166700 91019061 94682694 98865290 103443445 107688132 112832984
14303 112832984 117959556 123786902 129903828 136006169 142656509 150085042 157581158 165975538
14295 165975538 174372131 183500873 193430598 203987881 215428428 227058844 239359136
14288 239359136 252100520 265728977 280335653 295425255 311024543 327033123 343396553
14281 343396553 360043049 376642178 392886949 409039062 424164365 438611484 450998835
14274 450998835 461013741 466062729 469566524 470816393 470426016 472446261 471328511 467265975
14266 467265975 459821910 450008602 438653931 425586751 411303024 395653539 379344753
14259 379344753 362596479 345637123 329153574 312817250 297093111 283093742 268983009
14252 268983009 254621002 241385875 228905024 216859096 205718412 195261593 185078173
14245 185078173 175671755 167740333 159703944 151340795 144068152 137318424 131098244 125279772
14237 125279772 119616509 114376417 108931504 104417003 99837171 95460969 92334055 88486732
14229 88486732 84659715 81107812 77803637 75320802 72072627 69598566 66643058 63973326
14221 63973326 62158443 60340918 58054008 55903161 53897182 51992572 50514440 49576861
14213 49576861 47989693 46096747 44675650 42992889 42028412 40760542 40419718 39132103
14205 39132103 37863778 36394212 35740221 34306054 33532269 33117288 31797490 31076326 30230913
14196 30230913 29333976 28609149 28195555 27204534 26763045 26162847 25061163 24808570 24267865
14187 24267865 23641540 22908595 22673486 21907920 21765941 20926812 20770806 20302339 19804447
14178 19804447 19168121 18793931 18641249 18054554 17576928 17580062 17047359 16420423 16381562 16112595
14168 16112595 15376290 15660622 14934875 15041320 14746122 14114212 13874672 13854737 13700315
14159 13700315 13259748 13048608 12979276 12827544 12564923 12007748 12420072 12186510 11572782
14150 11572782 11637480 11394641 11126152 10845988 10848815 10630651 10534593 10177057 10238423 10212626
14140 10212626 9786215 9472654 9598778 9154765 9047963 9090406 8737078 8873784 8976491
14131 8976491 8477453 8539975 7818712 8130390 8261434 8309884 7715612 7780711 7901470 7530436
14121 7530436 7579394 7534386 7447640 7455220 6965042 7004627 6779884 7079387 6841627 6645542
14111 6645542 6569694 6214981 6372854 6227166 6307427 6073904 5945177 5944843 6007172 5874238
14101 5874238 5540679 5996141 5734258 5883782 5645302 5305901 5193374 5148715 5320743 5439562
14091 5439562 5260962 4977828 4790114 5138314 4760248 4840175 4828867 4700319 4583856 5015772
14081 5015772 4378725 4842999 4398497 4444983 4272638 4524059 4673851 3950787 4145909 4625922
14071 4625922 4082589 4125605 4026214 3956675 3804827 3740261 3939446 3687665 3683458 3779392 3579231
14060 3579231 3696806 3603862 3795585 3604587 3757719 3803087 3377837 3416710 3749281 3783754
14050 3783754 3397524 3376497 3527312 3141998 3170636 3060452 3093931 2971783 3205388 3346509
14040 3346509 2874951 2816860 2922483 3070008 3132223 3133456 3130856 3019253 3153759 3120359 2961560
14029 2961560 2970025 2605836 2757100 2511100 2968947 2464187 2460507 2524091 2474821 2722528
14019 2722528 2478027 2527483 2360345 2345866 2321648 2380122 2116011 2101202 2142461 2523892
14009 2523892 2227533 2195537 2404169 2060570 1951815 2175938 2262772 1899938 1902358 1965045
13999 1965045 2120503 1926868 1572915 2176999 1615516 1709683 2085750 1533884 1916630 2260077
13989 2260077 3573624 5888250 12683380 30581131 50761086 27108281 12401338 7387649
13981 7387649 5749936 4633958 4047097 3466491 3414184 3251976 2616154 3132985 2854225
13972 2854225 2772930 2681747 2315437 2220891 2022123 2149169 2028237 2198042 2264194 2151176
13962 2151176 2042001 2357749 2020219 2148362 2313865 1946527 1783721 2146619 1855692
13953 1855692 1492709 1704074 1754369 1797371 1983371 1678492 1792205 1535431 1922384 1595964
13943 1595964 1760324 1710123 1904413 1877153 1533890 1769223 1765333 1598193 1703749 1583171
13933 1583171 1346685 1448342 1819721 1507398 1449121 1888763 1687155 1486036 1668253 1638183
13923 1638183 1681050 1466381 1573257 1528212 1540888 1054447 1359516 1373860 1523707 1556146
13913 1556146 1292480 1244313 1343583 1709981 1276371 1115180 1093338 1197268 1382346 1296435
13903 1296435 1705637 1447006 1152123 1468183 963299 1167331 1447580 1610313 1274128
13894 1274128 1424302 1769106 1300968 1196618 1190058 1482334 1052619 1073661 1341321 1297825
13884 1297825 1163736 1253865 785180 1136265 1359488 1403608 1215062 1336780 1072083 1104758
13874 1104758 878383 1011941 1411542 910025 733483 945547 976029 697241 1328272 840440
13864 840440 1150773 789929 1139793 1002946 1132788 1322259 1040979 856598 1107257 987825
13854 987825 1150820 961461 1189181 780302 851047 1072154 1285760 927373 1231731 929604
13844 929604 673341 1027749 974344 1297722 626825 1154592 1273230 682870 879758 380925
13833 966635 1145878 962231 968361 820704 881083 756498 620323 716397 606938 1014002
13823 1014002 629539 1142674 782762 640254 853327 621635 753208 604723 1096064
13814 1096064 944892 1082936 433322 573834 828267 939722 767144 932659 801406
13805 801406 782051 216432 825219 502017 723346 822339 704902 577782 778218 962164
13795 962164 813480 548562 948428 468942 939598 587086 569572 576758 1039760 588192
13785 588192 809437 890962 890833 507222 815567 766409 663858 559440 627256 671351 533937
13774 533937 898860 692965 983201 61977 654247 662531 658137 949726 395292 664257
13764 664257 877759 657740 525805 1006758 608342 1124213 483929 637369 706064 601135
13754 601135 643900 545694 590761 549115 415752 423312 583925 1008716 441320 491602 432458
13743 432458 586475 457720 605967 657049 477027 689286 705936 525733 382925 680409
13733 680409 563310 521561 317910 560499 514668 576544 508696 483548 433088 785725 538603
13722 538603 425734 532168 980365 529804 732050 683593 700475 599062 887387 502004
13712 502004 710713 713977 590406 580126 437858 667487 448525 501269 461194 463274 335665
13701 335665 679307 520837 383563 197854 577974 585214 755549 470424 360819 317629
13691 317629 451528 903228 418568 681213 570654 485390 487566 379732 325711 779588
13681 779588 297546 383213 706729 486055 349054 409252 392394 561563 643016 457918
13671 457918 262837 812384 597094 466352 427597 162914 606230 314380 377048 412543
13661 412543 520612 655767 251858 375400 334567 285185 499388 442990 552380 656770
13651 656770 592151 407298 289668 409927 465785 416719 295963 333292 610558 302622
13640 812797 503045 299110 283584 245801 321227 452791 307045 529490 651016 638933
13630 638933 -24410 477545 595673 418230 524288 566998 68651 400977 102281 380166
13620 380166 593940 179510 523717 216037 293129 604289 521419 256621 55078 175397
13610 175397 569855 477269 321837 384606 402695 198334 335004 609997 171065 227597
13600 227597 140441 565515 104673 421022 507660 162910 333814 515950 538058 371130
13590 371130 -99187 523095 425024 215799 233754 309658 153790 258292 502733 288658
13580 288658 218967 232131 305728 181282 245129 559108 211314 141108 328326 82804 368036
13569 368036 266613 334185 474589 378768 454866 476404 188997 548091 205712 368307
13559 368307 79351 384483 581841 56276 492233 478705 163279 88144 316708 162392
13549 162392 163398 -5005 339839 292967 612158 273979 174346 491931 306512 413316 294732
13538 294732 101110 88557 320229 632788 379333 392666 499149 118560 246168 277685
13528 277685 263315 259302 372986 374717 241820 39855 109180 558607 341016 291340 457065
13517 457065 424247 278060 328444 308280 491959 566870 447780 401922 283893 230443 223547
13506 223547 243292 278259 62277 334736 460219 194034 241058 232262 318339 256356 77037
13494 204643 197038 436083 159935 157295 -72010 215870 113912 317114 369916 43657 96523
13483 96523 -90298 234951 552967 199368 169120 177481 129007 160381 87256 136961 407487
13472 407487 119181 243029 143010 57602 248211 241928 472212 121641 320456 83050
13461 246606 337776 492871 307952 234388 267631 -12707 19414 -26538 404490 91842 216742
13450 216742 330505 168684 246082 -4918 505689 275577 59221 83664 365389 56016 152387
13439 152387 276911 353715 303892 61291 16922 265947 153857 301818 -9610 338030 222749
13428 222749 100395 122814 216839 144055 148106 98908 212273 -118121 498735 318792 117131
13416 247798 294479 152867 -29834 354044 157301 161758 -43778 250782 252047 202623 445299
13405 445299 -26549 430635 580567 44081 306520 151962 -6240 98439 255982 120336
13394 140032 260129 101545 44887 35363 24772 251137 267206 302989 238258 -20746 -17977
13383 -17977 -35554 268761 199175 -26621 91276 240192 -42968 342521 111642 186112 128203
13372 128203 20951 39792 51997 405402 103070 11960 46201 320570 167736 343560
13362 343560 541209 154577 317832 375363 335533 -18194 454017 -27783 186079 26417
13351 46924 53605 72357 531284 535810 79340 81682 355750 -62024 368459 -185990 357977
13339 -82540 179962 634674 156110 171077 125936 73930 263513 319193 8956 -43572 44580
13327 167739 29650 389663 48730 193538 355232 107201 243039 11703 464246 559614
13317 559614 -61771 457193 113412 126560 116165 169462 132597 128695 43938 410012 -7371
13305 312348 35173 5919 438159 190663 36057 53833 39843 17255 -66877 -29085 214322
13293 17012 225768 111930 418424 287040 163224 268175 21771 -25766 -83509 -87366 215322
13281 317336 268285 433236 349880 217875 148726 79381 -15195 60078 -240953 275492 419539
13270 419539 351505 -60987 20520 -122110 -64558 -73126 -6946 75503 100523 36538 377521
13259 377521 374240 -39297 -14608 188956 170667 30970 329 135144 -173389 131623 280248
13248 280248 336789 -98989 291325 -69889 -101314 67310 98701 51489 144719 68984 242988
13237 242988 240456 -21540 407157 183670 59633 210522 55651 66163 -44455 187770 316076
13226 316076 -44867 197769 164023 -109070 129382 466999 192506 -62336 185173 514975
13216 514975 123796 242901 190952 271064 401603 -162256 337496 45921 188095 219611
13206 219611 333170 33383 339293 34036 -188797 -116522 33627 122548 221861 92150 -86934
13194 120318 -148144 -95784 279172 342419 35819 60053 -137475 -86307 -96848 217447 49950
13182 -123198 421519 460190 -80620 200615 89348 278458 2840 -50787 -181528 101564 -254481
13170 324156 73142 -103911 377437 -12825 -16173 78467 -61947 5990 -6537 -119872 16357
13158 -33008 -318460 -259258 131688 217088 399547 310185 252369 -102480 188034 -154691
13147 -36890 -14989 88763 -207571 -118813 -201668 -127328 122108 -99121 -86218 138979 -12772
13135 -131906 171557 -11292 226956 216876 -23727 450770 167372 307854 86904 92435 -79316
13123 318641 -194297 241860 154996 -80795 -218453 102822 -100147 -247312 65251 85186
13113 85186 123227 123893 213273 53505 102151 32992 349347 173492 33074 284396 122173
13101 68426 8114 182294 239049 61068 162071 92648 107423 139818 -258798 105270 38284
13089 260469 216708 -28863 -297778 141929 -34966 108433 272591 21419 138808 13884
13078 263322 -45805 300492 -273656 -102444 160837 -98834 40963 -133157 -108520 62442
13067 210373 207029 -55357 271728 -95464 211646 182772 128469 -149137 -215836 62116 -66344
13055 135003 63253 252150 149982 72913 298350 -253514 499280 56350 -56102 40928
13044 159646 100975 254284 188553 246200 120503 -129667 169694 -288551 72654 108245
13034 108245 39653 -271652 77970 111871 -36553 -47176 362218 -116057 -259518 233812
13023 139200 111215 183485 301346 127915 -79832 83096 53388 -18474 84685 -88282 228608
13011 265452 90532 -20861 352863 126406 -154242 -244482 297766 -101787 123481 66558
13001 66558 7957 124332 340691 7109 43905 260387 105570 297276 13646 -216140 -297013
12990 -297013 -58083 -10635 -100198 63101 20958 279235 7718 129006 5274 47151 280374
12979 280374 -2396 -7877 -83645 182144 230947 160173 75754 191928 -305736 176555 210310
12968 210310 -25268 242603 39856 -292202 35920 -164310 -230723 -281485 90879 -37894 170400
12956 -323505 -102473 145313 -27167 -4962 362115 148691 -23902 -12630 -84298 106485 57477
12945 57477 45604 2419 -105329 -164989 -36642 68425 19482 120612 -24333 24598 2913 150769
12933 150769 140477 -189913 -154432 73300 -121354 -62324 128042 71322 192141 12193 57855
12922 57855 165249 -7844 -43494 245062 61896 194887 -22337 41215 -137845 115666 -259072
12910 -21081 279099 170994 146234 200288 97916 310533 -235276 -335028 56431 -175354 42341
12898 61022 54238 26498 449246 -32507 56009 -7553 205506 292847 309708 -302145 149013
12886 -74911 -154987 236736 -179980 377948 100304 -124759 11276 11116 193187 74926 26435
12874 150921 -119873 -86488 74893 99714 110102 161507 -4497 167411 -55635 74911 -210341
12862 107790 -230410 -57344 114652 75410 -95775 -264819 -183349 -108717 8675 218868 100629
12850 112246 218647 -41615 88016 271236 22132 31001 78143 22085 -172216 121888 16690
12838 117786 -154778 237970 329769 162761 108521 -228691 -4023 52262 -223286 -137391 -236
12826 -100766 156590 -2254 222858 323762 394473 30275 65139 400643 -111551 238760
12815 -19866 -365812 -101790 155932 148272 -201546 160660 -25115 -231140 171811 -251240
12804 98130 -356531 297596 167981 -66400 -356086 -92978 69351 3909 -242293 -49786 213506
12792 208903 71654 -64992 42946 -110885 164320 119947 -89202 232313 -78805 -158347 128847
12780 145794 250557 386768 -37711 194839 -102671 -185199 -161230 -187994 -177575 -127624 66209
12768 212450 43952 -142766 -40192 47456 200404 235936 -247667 -130888 58573 -103782
12757 46619 330943 -268421 -317708 50979 70760 32703 -107098 434287 -86450 -24436 228867
12745 332760 24295 -212097 -144838 -187027 25067 32057 113819 266732 326270 -117935 276525
12733 -101311 -121315 101134 87254 87346 -192 -206580 294623 -197857 129981 -322328 -144172
12721 78261 148954 -144915 -277662 445097 -107320 -66188 220926 81453 -57725 -83633 133478
12709 156007 -100323 320036 297009 468539 385698 263506 138711 262206 136691 -279406
12698 -333316 -35346 307704 218943 -135601 319570 -61461 394990 245585 190697 -86754
12687 -111353 190841 240952 67325 43645 186782 -88274 89463 -67852 28557 70748 255930
12676 255930 -21458 -152649 -69972 88519 -411320 -181586 6871 -488787 -175097 98873 -76371
12664 44130 -140758 271478 -84992 -142389 201806 308303 130531 217052 288848 2362 -4349
12652 -37761 98380 -387313 93069 -101129 132856 -169355 171950 -50672 -74550 -59413 -77689
12641 -77689 -227141 91248 108524 15438 -80480 18340 -44028 -140703 181638 -172688 235920
12629 -101875 326827 424481 -8083 207976 404407 -75684 204044 136341 153056 -20299 26733
12617 280621 83754 -86372 174619 -42418 -155487 216483 188485 -44336 77315 20609 48768
12606 48768 58274 36194 -5496 -12299 -108483 74906 111937 -2721 192343 190536 -89033 22187
12593 55077 139968 -241207 7275 -13034 -53097 5948 165905 -124030 -21533 42409 34288 -51517
12580 -14911 173713 -165519 -251824 154847 -120829 -8673 126353 72306 -64775 25231 168944
12569 168944 62492 -205215 34095 127926 -117056 35861 -137369 -100202 -279061 110493
12558 -36663 186492 208147 57134 -191360 109024 -34977 129557 223015 73790 112240 133798
12547 133798 40772 -89016 55788 -122656 264 40669 140331 155468 15565 49550 -223197
12535 158723 -141403 -186194 287526 137973 41563 29644 -3372 555707 336237 94582 165375
12524 165375 -113239 19398 289936 -236248 -149594 -123660 -100922 -22971 530462 251924
12513 300933 151338 -318622 370231 -45011 251788 -55540 127529 -235665 113006 138517
12503 138517 -83102 105008 224082 -272826 -398882 302419 139606 234030 -253568 -146931
12493 -146931 -60228 -115325 -296097 303020 -212197 227873 -41098 74725 -245605 73004
12482 -83911 237968 86134 -193005 -205414 -114670 143598 -18408 75899 111977 -124496 71125
12470 54946 154244 -13814 -71823 142707 -3614 106332 112895 35428 -158618 57160 73391
12459 73391 -32945 284253 45474 -85916 419545 -229324 -318543 -112194 51985 178540 35439
12447 -367801 -159250 154545 115773 137976 -47465 61802 -202954 -31880 -227517 11600 71924
12436 71924 56295 -6066 59883 58181 -227943 -83923 238786 -31659 58794 117846 -58531 -169051
12424 -169051 -258997 -64870 144569 317011 127027 -50412 -187884 -192564 -156712 157757 6395
12412 -125696 15533 -266017 -90427 36719 -354272 124205 33274 -48290 -71177 -175306 -191751
12401 -191751 74923 249646 -185819 -281164 -54252 1817 -39034 -70561 207657 -28543 225450
12389 35547 43304 -143490 46441 -147757 187762 -76736 243358 319745 125770 176913 40009
12377 1707 48596 -293926 -161947 -290054 43152 -266863 -118339 269629 96104 -125638
12366 156116 -233208 137944 145902 13304 -89368 160921 -61349 73647 7665 98349 -72238
12354 -289656 151081 -354535 10314 76014 -55099 167812 -108127 -102591 -88591 -263040 23348
12342 96417 159003 184746 114494 -72787 -77095 -28541 72429 261581 -252997 3422 -23740 -156099
12330 -156099 -17834 -140594 85872 -45315 68643 -132470 164947 207392 81436 63203 -4379
12318 -11503 338888 -11116 -180703 -98984 195980 221686 -391532 45117 -75299 -94513 287959
12306 270856 -71105 -43726 75490 -114073 -23343 15596 169515 -54076 63653 129656 7607
12294 -72050 -203226 118474 98818 -13897 151849 -44741 152676 -12190 -43905 53401 -116816
12282 42720 79987 -203455 -44617 204008 -12920 89649 107576 177055 69739 -42672 40111
12270 12245 195756 -138965 29329 134503 -85338 599910 -261505 169810 -55405 -38107
12260 -38107 122722 320116 -21700 -84301 -33899 -76900 -37740 68918 358237 -242917 176907
12248 591108 -91799 2917 13594 85200 2768 -87352 202229 217019 346822 143106 -170700
12236 -262125 158589 9897 30158 547623 91285 344414 154260 -188620 -332026 133214
12225 22137 405285 406584 418948 45226 148059 118510 293438 32259 -109266 194576 429539
12214 429539 -12010 -14796 76008 -7078 108399 216797 -303376 203583 -57891 -17664 500648
12202 46731 126905 372941 309744 -11824 210856 92499 -13262 254887 289797 122796 361850
12191 361850 253379 282213 55017 3075 135879 149942 298370 58539 -2060 -228941 61395
12179 164489 181462 80541 47183 -86751 -55488 -179720 -47296 193103 12254 -142176 444600
12167 45996 61273 72394 170885 -85439 15914 58449 87677 41011 278588 144294 211859
12156 211859 -162668 51089 -106015 66600 194394 221972 63142 -67359 -175529 254953
12145 38962 -42881 29205 80091 168586 156628 293775 -88666 20903 75246 116289 297966
12134 297966 148942 -30600 -31894 305848 -41872 -135980 -105780 -83988 -91137 27832 180647
12123 180647 44239 257894 43155 62116 112217 199178 -25839 51072 -55881 255625 309674
12112 309674 -197196 299240 -18678 258512 -62637 -149690 -49647 -204836 -184491 -70072 -102901
12101 -102901 -12346 180974 17013 -116805 -287271 24080 125972 15578 55203 -27225 -228164
12090 -228164 -28212 -8488 -40592 -49496 122779 69470 151859 193936 -217080 90886 -222238
12078 29656 -152648 -180505 27847 121594 870760 1178931 2256439 952973 199221 295297
12068 295297 -119446 157265 -68237 -210251 -264208 271446 178116 89451 29301 288766
12058 288766 -260384 206074 -248746 -177419 34436 126479 60393 -78669 -179918 -149801 85135
12046 -119602 -125312 -219390 -334465 -198342 10257 184389 222233 30159 89691 -62076 27199
12034 7762 -62645 208071 -381772 235974 -38217 139585 -68219 -39597 267948 -58983 -121467
12023 -121467 -126075 -167412 -93895 -55356 143349 -260256 116140 64381 34136 92714 -185796
12011 -38553 14171 250110 -273222 -159774 74043 -122331 -128802 -16253 -130625 -43363 -188345
12000 -188345 -324819 -8355 -163406 -20484 7121 -16344 37807 74492 -40009 117806 -166935
11988 2806 137863 187857 -79117 58752 267001 -95368 75847 125121 -55498 -400867 -100828
11976 54698 -15343 304485 -189186 185677 2172 -404063 64592 -188272 -90029 34257 -97005
11964 -68346 269275 -153622 -81252 -302060 -181531 -203221 -323003 -1271 -49936 -109610 71831
11952 -7918 -128565 -76868 18667 93942 67900 -201548 -88650 -75048 -116004 360170 22120
11940 155553 -234586 -152653 101691 167757 -93491 -327633 -106028 174269 54681 -171790
11929 5651 -38225 36278 -166327 178538 68827 32296 -128528 -76713 226179 75905 163900
11918 163900 137001 128109 -115240 222998 -131310 -38572 26108 -19963 58320 -78196 86810
11906 118082 -45854 -96758 57934 255934 -30105 -23750 168496 -87829 150534 9279 123036
11895 123036 -8986 -40100 141554 25774 -106108 153271 321729 -284820 77197 -181292
11884 100678 -2367 133812 -38337 -263105 273418 15763 -23531 -108550 249405 -255294 -128299
11873 -128299 7997 -189578 40762 -259786 -43699 28885 -300164 61915 130581 -126861 291122
11861 -122001 127198 -150299 57794 281293 10733 80402 -209224 43879 -212804 -184051
11851 -184051 -202795 -143275 120233 -37129 42233 346916 94887 289782 -110807 71679 -259979
11839 360333 -484989 -107612 80080 -93889 -1515 164779 -213527 -122588 -191314 5738 9473
11828 9473 140224 -408758 161420 54182 181391 263925 -234804 -192180 -205492 -425201 -7192
11816 92326 -270159 150452 113159 -45923 -96542 -144798 126196 89958 -44348 -968 12691
11804 37706 33214 56865 -93903 -225261 -30902 -86475 10933 109150 -248636 -224368 -75973
11792 -165371 138948 -113073 33038 -101060 -198832 22614 79089 2974 371620 143722 -8899
11780 -413523 -155022 -23972 131172 172946 173954 -62257 -10884 35378 103797 158763 -57994
11768 214420 -2309 -20967 347229 109983 -48091 -223275 320072 25395 -116766 8103 -86409
11756 248785 -125817 234010 -156642 63643 -166446 -338002 40833 38957 -20866 -165095
11746 -165095 -117017 62525 -169291 -339337 -29716 -48232 211934 60023 44328 202546 -130998
11734 157701 98841 167260 130799 29451 -95548 166579 -122725 188176 -83413 -246476 76251
11722 -370223 40408 160958 393543 -220929 227245 57025 -47526 -127642 161005 -319275
11711 -82237 300933 -78948 217543 49776 -34534 -169695 -87 -83939 -89479 -134981 76780 239997
11699 239997 -138113 8959 104250 -4365 -35492 340380 -69367 77455 -189414 208112 -174529
11687 331089 129044 303075 -13096 -124950 176673 6689 21566 157815 -213535 -345079
11677 -345079 260224 280560 11329 131014 -98202 192821 121519 -33898 -141835 -134201 -180512
11666 -180512 312418 -44733 218099 53051 16908 -150556 60301 251318 -13890 15168 -78291
11654 -381690 157318 145894 -289972 43285 67783 40985 64454 -332121 148650 241441 159823
11643 159823 182405 -242828 64291 -341070 121918 21813 37918 -8483 -21626 215836 270783
11632 270783 88853 528630 -124955 -50979 -138435 -37618 -119178 171450 96692 94983 233591
11621 233591 98344 134427 128755 -275217 21085 -190537 166036 105509 13378 113414 -265255
11609 175607 -119888 -185542 -121545 -156714 339329 44604 228383 172567 -124782 -69793 91552
11597 -171540 105525 -120643 -107885 -186669 -342821 -148979 -158698 384036 -129750 -343648
11587 -343648 90384 106417 464028 -40467 -39493 175581 -7419 96601 89433 125946 -204473 16970
11574 25623 135586 137620 287157 82665 88259 231928 2876 84199 162465 13376 2072 99579
11562 99579 -262739 254689 -83344 354351 -253153 40161 106287 191594 120593 -12117 74639
11550 -65272 210531 228907 280996 340888 -52677 302412 -11372 181211 -98066 -104333 309888
11538 -7227 260279 100525 83505 152789 -16109 -135725 150001 274744 167876 36906 259452
11527 259452 176837 -6191 -200971 -73817 -379380 -7865 12012 68835 415825 25231 -131941
11515 -407841 48250 272246 286120 -196434 45199 783 -156367 171075 20164 -39338 -12892
11503 237771 185433 221501 91130 201038 283120 -44658 -121546 301889 -157426 295033 14685
11491 316514 314604 -142579 214942 105566 -50475 186221 5327 -115083 193956 -258806
11480 -70610 121677 149380 -62620 148699 452035 43778 -172173 58025 -297652 344642
11469 3006 179284 -502 145024 -60322 -22966 -36072 -108061 168275 330284 -224784 37291
11457 -90380 104524 164454 -89306 67270 -373307 383317 110881 85090 122962 132061 149409
11446 149409 57353 291337 164564 26913 217800 182773 254351 203486 48192 36089 129177
11435 129177 124279 214852 174495 21163 37301 -83948 60266 -12891 258587 -186418 -169845
11424 -169845 -138844 -186925 187219 101262 34167 -64316 54755 82135 90049 87703 166589 -242447
11411 -220780 -143625 156924 -29572 156697 -21924 19097 158113 -191105 177331 -66471
11400 -172529 373015 -26801 123422 320585 232940 -122457 -96375 -139075 -77461 181358
11389 -84358 -110989 20100 -2386 -46221 -4187 -15179 19370 78687 -48973 -142883 -72856 -58078
11377 -58078 -71893 227345 172962 106652 261319 -26756 24162 256394 -149703 -44967 60643
11365 44301 4586 23929 -69748 -258545 47431 -144286 159575 -7045 -307881 -144215 43730
11353 36345 31172 -349461 -29552 81546 149082 -19217 -96881 101224 138169 -109805 -132385
11342 -132385 -165588 246982 228573 -221157 350708 -163439 178600 57867 41666 -378878
11331 -150852 103772 -317383 180877 -35662 -91345 118371 127360 -8121 136692 -26423 -120619
11320 -120619 -187601 -305679 -180187 -190513 93863 -61077 -23524 -18286 96645 -74323 164359
11308 194639 27615 -88115 -30858 285190 399195 -317312 154295 -296452 -341975 229895
11297 -15495 -145612 4384 33092 -613 -233285 -28384 -40198 384927 42879 195909 -221560
11285 122881 -55307 -181098 -95834 232456 -111982 -78783 -183890 168570 -115839 59411
11274 165768 167226 -138096 187593 232886 76516 125134 -38773 131537 93483 13598 -259980
11262 -95366 -186410 5647 -119309 -287458 184329 113029 -329228 -91611 -73071 -377425 44221
11250 -122230 257110 -334871 111782 -148863 7898 53047 -290226 -209850 256707 -246397
11239 39985 186116 9344 -52878 -152285 -25815 66272 -62478 73019 -135196 -99742 155403
11227 51874 -212529 -40632 -185193 -156364 -184995 -273381 -168210 162459 -99326 297704 186022
11216 186022 -232400 -182689 326384 -62474 -54281 87279 -185560 26919 -72031 5612 127242
11205 127242 26466 -31470 36679 109861 -83847 -88327 200090 -2131 -262621 -88968 -335381
11194 -335381 172539 -172267 -148312 44522 55836 124682 89895 -211359 48682 42633 -275716
11182 24560 -104697 11835 -85068 183320 -233093 145485 -166592 32765 -266095 -71259
11171 -100049 25611 153561 -85324 -169150 -173789 -89131 -86170 -151048 462233 -109989 -208637
11160 -208637 89486 -95920 -29412 6134 -158429 103514 -152406 96041 -106849 102570 -405703
11148 -24411 -225510 -117321 -307561 -126042 -62470 234919 126673 7104 230652 -141312
11137 77177 -21115 168772 -38127 418102 -103841 77363 -157149 -304320 303982 -1452 113927
11125 325611 149234 137436 17593 -265925 50239 61682 -71694 11367 -253982 116438 354520
11114 354520 155846 254884 260717 52442 -150482 253927 192425 311944 -60626 327255 -86113
11102 269196 411465 221726 -73224 127994 -112190 97040 233142 18676 178075 315865
11092 315865 372590 262485 219744 171004 203719 -117917 516231 512704 243819 206770 109819
11081 109819 153882 144648 275829 177258 -131796 252597 330032 159775 338422 188085
11071 188085 234401 487436 260864 213785 217229 310312 221688 509557 368182 439475 537403
11060 537403 400134 354063 854105 1002912 376841 567090 507683 728810 498587 743966
11050 743966 633033 671741 546908 734855 677320 459284 748971 602967 699502 479449
11040 479449 817695 559982 717400 772966 864418 542602 514498 533930 242046 705448
11030 705448 773436 617858 803363 508342 643888 444877 755180 686573 812625 621853
11020 621853 609789 482244 579977 351459 783875 452751 505404 586955 541485 394705
11010 394705 477460 358239 452499 316468 399505 599184 687749 716995 390893 556779
11000 556779 717208 405562 464570 582131 655120 825730 668603 692909 289119 690698
10990 690698 573222 829606 877036 818799 940203 873007 992326 1145674 838476 1084534
10980 1084534 1054684 1150427 1135877 1333818 1584500 1829754 1853519 2491577 2483325 2756576
10970 2756576 2583756 2787095 2277341 1920681 2208954 1956745 1902689 1820122 1691941 1481739
10960 1481739 1464784 1402365 1918614 1832024 1312687 2022914 1101957 1171564 1090347 811057
10950 811057 457794 726943 685812 392399 620808 194524 554874 550952 348298 175822
10940 175822 148370 203951 74576 -41558 -20292 -39932 63856 256997 -162525 47822 -19314
10928 164877 38239 44075 -23922 18473 243520 -170075 137396 12822 348954 -172567 390130
10916 -80388 -335570 304959 -148407 117274 8575 112354 268106 113478 -409830 -92741
10905 25483 -478271 -131718 46665 -97390 -19708 -172976 -14240 34187 170562 283627 42715
10893 -174572 30213 -296149 -136265 242773 -248063 -41768 -192195 -160784 220159 -228528
10882 265870 -93772 70204 -28595 36119 103919 62388 176404 -142757 -85735 -18128 -74589
10871 -74589 -27966 -17989 -125091 -83643 110938 -49146 -239754 -232261 -72628 109604 377754
10860 377754 -300697 45829 196903 -200544 -165567 22728 -146155 -255582 86069 258465
10850 258465 -257808 321489 258370 215853 20243 147730 82276 -174227 184864 40835
10839 117635 -26242 5744 103563 -359081 -231527 423671 66640 324189 -62492 -431990 -77626
10827 -124040 -136894 -179544 -5641 12017 185762 -324120 67092 72246 -302258 209700 -20666
10815 -199267 -85375 283141 -20020 -157354 -47286 -138230 -549 344334 -24192 205772 169957
10804 169957 68180 65194 -50445 14075 20134 9890 94471 -128808 -41547 -41347 39375 166660
10792 166660 -252264 -303238 -271501 339624 98249 182566 201080 -283813 103940 -78723 37852
10780 129753 -107431 -16089 -145763 -638762 207517 -162881 63490 31996 -250248 -161146
10770 -161146 26546 90270 137209 246256 -29856 -21292 -258354 74900 -82016 171883 -159375
10758 248337 -459129 -25289 -230084 -212065 -168656 195323 -131711 -172114 -117288 82926 208027
10747 208027 88705 56368 127828 -65310 -91969 -147666 98147 148942 -89014 170337 -70223
10735 -83561 -9329 -168009 -194411 -282390 109892 -152365 158088 59146 -257139 118961 -49816
10723 2456 -271766 -78597 20612 -106948 -105564 -93798 -264338 -382753 70252 216520 -213460
10711 -91452 162002 -33363 74633 28954 -87562 -381588 4173 -165281 347013 -204072 15879
10699 -36895 -228479 -107764 -96152 -162125 -451488 -158134 -357585 105231 45990 -241621
10688 319643 140867 87196 15572 908 251653 -227745 172387 91444 -229087 -276865 -100001
10676 -202756 -184941 146162 -97065 -282780 59398 -2695 -108243 -56625 -45888 -150117 -151176
10665 -151176 302533 149704 -218435 -228462 -27653 -225940 -155758 -114487 471995 -216614
10654 99120 112126 136456 -508983 159250 -197862 -472836 -16218 -15795 33004 215981 138215
10643 138215 -72163 87572 -37365 4902 -167374 140644 33685 69966 31783 123775 -2459
10631 -135726 13468 -445683 -141939 164143 -116112 -375 -261795 -209157 -244400 -277438 257228
10619 -209768 31253 -92856 -211613 -315316 -235952 95010 -326105 305345 430294 -93031
10608 -36140 -223270 39429 -300092 9243 50489 -94874 -149289 178751 2107 47961 -269933
10596 -126974 358509 -230722 -82339 23276 379043 -291733 127908 35612 22933 -625538
10585 144682 -63519 320741 -292605 90416 33331 -48445 29342 3551 -75584 213720 240344
10574 240344 185203 -59020 -36716 219014 336242 -66554 -214061 -182419 -324629 -251341 -39303
10562 100355 -78813 -87524 -67595 205878 556800 -380395 75488 -239875 -77755 -10339 96180
10550 -325367 -362482 95357 387532 48250 -165353 257039 85733 -113733 -126526 16149 -367493
10538 88667 66655 76162 289457 70918 2111 -173093 376269 -3644 -412386 -155485 -297183
10527 -297183 49636 44483 7118 -88269 -194458 -65143 74220 -1478 -102516 -192172 -122277 -162277
10515 -162277 -168133 -58677 205760 85973 -143451 -184947 -172099 208200 89093 -155140 -136679
10504 -136679 -133614 -30725 -90758 133661 -36091 -164418 -423279 53042 -124790 -13381 -25556
10493 -25556 24379 26914 184693 -237964 -186215 191194 182335 311699 -4132 -143179 41026
10481 216903 407754 170467 473565 389991 69289 360010 127219 -243691 -98986 201594
10470 -296981 208587 -26675 192391 157360 106561 -182264 -135082 -173110 175221 -149909
10459 149694 -67134 109193 157673 71800 -81455 -208148 -51810 -18401 -91158 -56559 43863
10447 -1041 88803 102624 -390397 -121147 -220022 100797 -54442 -389617 182998 -76005 118861
10435 -339181 -217307 -45903 -149458 283109 -62325 -291470 185220 -92325 50202 153158
10425 153158 108430 63509 -223705 123701 89535 -73611 236093 -5492 -39698 93408 31112
10413 53168 -148362 299131 -155504 13194 144983 -46966 -43805 -319358 372723 -72857 -257731
10402 -257731 -220304 -128512 -84675 17062 122516 -33457 171078 73515 126561 187635 142781
10391 142781 322778 195924 -96428 106162 -82604 -372537 -80536 233644 298670 17799
10380 252821 -34388 220222 340120 604182 137517 303702 64010 467812 234819 150296
10370 150296 -9406 134701 337209 274651 263558 528284 366062 175121 543106 289420
10360 289420 387010 302201 146649 -178012 -240300 195968 91484 109949 301863 442371
10350 442371 322848 794386 449364 396891 427271 321408 194935 403127 264591 324276
10340 324276 135236 509 102037 207598 234868 83509 379226 118575 112389 276885 147777
10329 147777 -706 32738 -180546 -203883 7256 75411 153055 135993 377487 451926 362876 230078
10317 230078 158609 79576 214527 202091 -39539 -205825 -133439 27552 -29334 -96514 -28466
10305 -105146 -36396 142492 -54393 114497 111250 38827 -272154 318591 135907 226324 45809
10293 -32673 -75474 -180484 -274972 -324195 241742 -78498 -8237 -124622 7030 -56663 -40267
10282 -40267 -595 -224718 14680 120146 105030 -73507 -31026 38 -161909 150073 -19757 452477
10269 -21815 -80503 -406302 -395734 167755 -161826 -15025 -30414 -282170 315008 -71986 252884
10257 377965 115289 277741 680881 312242 134028 -11589 296251 -63690 -44943 249399
10246 51983 -217483 -5204 211903 -61340 -54426 -340029 46578 144954 -291176 -246308 77268
10234 132290 -138445 -20554 -30562 -268363 187635 -1855 -104270 -76398 -27515 -183615 75907
10222 28993 102034 79444 -57307 -359916 -68772 -161713 -396889 31415 -147038 38123 79283
10211 79283 -107937 388378 -17197 -15207 260206 158976 422872 -306399 -142952 -488795
10201 -488795 -74732 35598 31483 -38377 275 -105549 -205408 -209150 -326300 21647 -178414 -194989
10189 -194989 4675 10619 316428 -70464 -430674 -27160 282994 -277089 42420 67996 172940
10178 172940 -6113 -21143 -133683 -25491 209120 161725 -150105 -102466 75068 277661 -170878
10166 -134757 73241 -169346 -262135 -109011 -5359 201543 17820 -170445 7680 10096 96797
10155 96797 -294939 -458988 53467 115295 107649 -560651 -336334 -170769 -81915 -190458 332976
10143 -176268 -148432 18207 -202594 -72460 -155047 -177505 -287558 -196114 57841 -350710 4530
10131 232698 38438 -133856 -13683 -43106 201866 -174912 -175110 74140 -159852 -77561 -79589
10120 -79589 -494621 -60666 152674 -81865 -160126 -104044 -38407 -306184 -12542 -305029 -4549
10108 312972 104549 -353498 -146154 -866 290295 8025 -271594 -211380 -131464 76302 223963
10097 223963 -3478 203869 -131377 -63212 -104383 -105050 87919 -199025 -58746 184963 -278070
10085 174044 -111650 32685 80684 -65229 184666 -153917 -98312 28403 -321899 -96273 7348
10073 81296 -315748 97910 -141923 -105456 93198 -97926 198146 132155 -18779 -122165 -37648
10061 103832 -32132 -68553 -96349 -2850 222560 -281928 -212377 -280517 5839 99724 13542
10049 -172687 -364268 -195669 141634 10670 298426 -194084 -378140 -283637 -132613 -90393
10039 -90393 -156105 -171371 18774 -3754 -138259 -128688 -45073 300166 25148 -236879 39374
10027 -264636 -219191 -20898 -37596 -3826 -154967 -63867 198766 21610 153910 -178614 -151279
10016 -151279 307874 75483 72906 -282819 -32927 -211602 -133828 192992 -24229 -267746 -285662
10005 -285662 -293263 -242706 11527 -143449 67865 -792831 121899 295205 -291486 41802 -191300
9993 19581 -265174 67163 -71629 35737 287945 116417 -160172 -292138 -280491 -107410 -130091
9982 -130091 -38309 161264 -100679 237199 -78194 220697 129455 -143477 236313 117263
9971 29328 -365104 13195 46470 -286846 -132448 -322898 -100136 -336227 -237265 -234798 -107628
9959 25965 -172240 -277697 -249564 -2609 -35793 -428718 93418 14856 -200855 -361290 -26580
9947 280785 141462 -219114 -467285 96272 -47496 171680 17447 -140804 35326 -214405
9936 196956 -53801 -143771 -76055 -93773 30542 45205 -190621 -60382 -121150 -117505 -113412 -44131
9923 -44544 -183225 158962 73838 15947 195150 -101581 -130088 -99936 -55176 170388 163965
9912 163965 -8502 125164 -34373 -101256 -132561 -296299 -56647 -171319 45266 -91176 -161214
9901 -161214 -343348 -192166 -10496 -108889 57305 41661 -49075 -32601 26681 -50453 -137270
9890 -137270 -69923 53563 63976 115999 -192937 2670 34241 -180801 -124163 -194023 -471668
9879 -471668 -213836 36590 -102736 -28934 -115821 -185856 -146679 -69341 -125396 -71762 117775
9867 113386 177852 -64546 -35963 -294675 116191 72136 26519 532 112119 242521 123238
9856 123238 274511 -175979 97456 -5877 -381105 -167204 -326850 -189199 -48510 -225605
9846 -225605 -384893 -84986 86956 -404635 293570 124655 -66104 -28079 313942 -169531
9835 179160 -76738 -64217 -131794 -95874 -188545 -144254 22169 -239768 -130283 -301539 -7551
9823 -89333 140366 -102323 -16310 -10363 -84937 -112605 207322 -61173 18992 -50396 -4684 -250070
9811 -250070 -136729 -259508 -252502 -25302 165988 107017 -227670 -141311 -189867 -208871 -256681
9800 -256681 2881 -208651 38713 46982 263154 -158084 -313876 -303320 19555 -96056 67886
9788 82357 -318978 354813 208240 6633 54023 -245316 -104527 -60094 -469217 -22916 245227
9776 242215 -128904 -254161 -397705 -183307 -190096 -337830 -229746 -164508 -13392 -136934
9766 -136934 -224430 34605 -111006 -246937 -340578 59530 -101028 -103059 169000 -74602 101150
9754 -433892 -183855 239381 -321554 -286236 255563 221523 -198997 -19681 324249 -287350
9743 128892 -472759 191726 106272 -160544 -6823 -195761 220151 20489 -60889 100923 169769
9732 169769 -44317 70057 -287963 -300379 -33084 -547402 -18355 42226 -64412 -72188 85211
9720 -446850 -20097 -18173 -183450 94890 152493 91159 22919 -92934 -3302 -300780 92463 -254988
9707 -148044 -3705 -71552 88941 -215290 -79104 -47482 36428 -217581 -155824 -197556 247074
9695 -44854 156452 3548 -421056 69437 23395 -145875 -33228 -73542 -61156 -40318 -33194 -97410
9683 -97410 -399082 -89357 -310743 271362 -54808 143987 -97215 59107 25305 -13613 -74350
9672 -74350 -347745 414905 236860 -169476 -245601 30155 29244 266780 29010 -458477 -310718
9661 -310718 -145616 177210 77797 -248836 -298058 -45166 43638 176734 3411 -128950 -56836
9649 -553415 -52376 -153741 25667 -80198 -107911 -194644 -231888 -35931 -73550 -62591 170312
9637 -229096 -40575 186042 -14429 40934 -207847 -301602 118739 -47142 -240185 -244819 -66117
9625 -129488 -380271 15638 78574 -94382 -288851 -193675 24009 -299248 -4766 -83068 176937
9613 207104 -113436 -221362 -298948 -176339 -73760 -141130 -68268 20071 -108310 -154427 167659
9601 226517 -179906 44696 -55179 -124721 244166 -85533 162669 -223675 -393698 -216945
9591 -216945 38647 -67063 -172047 -90904 -191057 -264485 -21343 -197441 38551 -164314 69955
9579 172229 -265275 -75135 -127698 -250337 49312 -68332 43777 189917 -128774 -253549 190666
9567 -70115 74894 -205465 -114136 -2639 -270194 -278663 256904 -132522 -169097 14254 178201
9556 178201 112025 56809 55653 -268893 100493 -93334 145760 -149236 -88760 101468 -224190
9544 84152 108840 92065 -35615 19455 126760 -207037 -226263 -171321 54923 -63856 89748
9532 79178 188936 -61571 -249997 -4450 181661 41253 272680 -389899 -267310 -265158 -64787
9520 194423 -131326 132073 -226706 -32137 -114547 -205462 308797 122858 -22413 -335400
9510 -335400 -206088 226076 -41553 -26428 -75309 23249 -7805 84483 -131779 -19470 -232285
9499 -232285 -285178 -412842 -40997 108027 35443 -92309 -369629 -103973 -181977 -302882 -4982
9487 134959 316941 -170923 -364816 31396 -60366 98420 103942 -79917 -47163 -294627 445470
9475 -112241 -204086 230500 158691 -42005 43265 -134322 -174079 234459 284548 -69134 -295477
9464 -295477 -146327 -194934 75137 222715 -185164 14047 157648 290168 -275057 -139175
9454 -139175 -233311 91037 -272683 -172456 -393982 243856 -72541 502157 -45337 -77668 -102751
9443 -102751 -68053 -151449 -140929 -14232 -173728 151423 -220426 -260997 192615 -173597 -302199
9432 -302199 212609 -64416 -139879 216784 -196305 -71304 -222724 67281 235555 -178793
9421 18810 53517 39523 -28341 -67129 -137078 -234722 31931 -117553 -63325 -99444 -308700
9410 -308700 134692 58910 2851 -176454 106519 -122863 -462229 92760 -23022 -228617 -104861
9398 398 -56626 3405 -144102 -43330 147222 -152403 65057 -282756 170054 -310593 83580
9386 -197878 -178 -33550 -21908 120815 231848 202428 -35 -239896 81633 191181 21893 62384
9374 62384 113636 -197958 -184792 -243013 -27061 -166030 -26277 -328150 -247984 116389 51640
9362 -171817 -111102 -88611 68623 72316 -176098 261318 -71115 -19706 -86506 -17641 -426202
9351 -426202 -21604 222232 -142974 -42524 -181427 -237381 276011 -67737 -119930 -168421 -79160
9339 179444 -135436 -30823 -13341 -238304 -46613 105142 -200695 -138201 -304481 -72532 -94408
9328 -94408 34498 193460 59694 142609 -48470 -233516 -105898 -254225 -241112 -298164 -252484
9317 -252484 314729 57277 61351 -278074 -397953 295453 -168643 -199120 -306535 -256686 -100021
9305 -166315 96855 -37627 194397 -226476 -190302 -79991 -194762 130061 -317265 77043 -176999
9293 -129407 10065 -264301 -88504 116221 -5368 -413772 163475 -193296 -83789 197026 -101481
9281 -62492 125718 138158 338321 -15426 -41255 352522 -38642 -99973 12228 13733 -100460
9269 137181 -308804 -103809 -262907 -274783 -74405 -100521 -105930 -18705 9586 -319482 -29744
9257 -70651 -178253 207442 -78798 -24818 -221071 190630 72902 -81542 -4258 -37085 96733
9245 177649 -98564 -321113 362606 19699 108354 3075 64522 -150687 -187617 -106346 37163
9233 5207 -37361 94403 -161421 -210947 -292663 -47055 -46667 94451 -56236 -551676 -246602 11794
9220 -154481 -140207 83992 -162851 14938 -55291 -39177 -55592 42556 228741 -239909 150865
9208 -249004 6722 -163560 -142726 -131509 9595 -290468 66222 -144063 36684 -242728 -111993
9196 -136906 -129753 -327535 50934 -101400 31400 -61220 -101702 -43827 -125833 23368 -205552
9184 163971 -64958 -28260 136644 -143148 -156340 107307 -77078 20084 -5679 -148295 197562
9172 -209113 149641 19924 -135117 -14104 -38173 215829 -175429 -30653 -78148 -33712 295087
9160 -359537 -90773 176427 -207210 -114415 -50351 278974 -46350 205218 -95317 31299 109860
9149 109860 31761 -95149 -99591 333427 147518 -256445 -384083 -119758 -193517 70325 -350687
9137 -380194 14459 130826 -3817 -266026 -25774 -77677 108501 -10105 103328 96254 213005
9126 213005 -121273 -151658 -172001 -92010 144177 -79070 63050 -195610 84271 -40554 -175247
9115 -175247 -280814 213906 -245508 8400 247747 32927 -522211 -120272 -129590 -300694 -113605
9103 -287797 114319 116475 -344736 184804 -317338 163523 -33111 -176936 163128 -9346 -132538
9092 -132538 175364 -371397 -361597 -115516 -129541 256208 -117449 -37424 173091 -377077
9081 -165412 -119835 88507 -187641 86477 -246412 -216453 -214958 -47511 139129 -69848 -105129
9070 -105129 -202547 106446 305298 56709 143709 -195901 -131110 -13993 47096 8688 55978
9059 55978 -177500 37849 -136671 169571 134519 -179403 -194139 42775 -35579 -15948 201982
9047 -293349 8195 108274 -386368 -239512 -217803 181424 -75110 -87176 -38457 -224906 -123143
9036 -123143 -239126 -27672 277603 -172196 -152478 -233223 -5048 -48882 -124880 -185789 49700
9024 -84318 -173 -90492 -104712 195146 -43055 2966 -283437 -219037 120117 -259499 -127491
9012 -105124 -112345 -8698 -123986 -309966 37737 -98315 -214870 -141120 -204971 -229060 -17529
9000 34157 176648 -82088 29099 162743 -106959 -145587 -196198 -136212 256128 62545 -78276
8988 55648 44306 -64853 12812 29055 -65005 63326 -162989 146155 49987 105964 -151699
8976 257314 -182510 -162524 -29527 47562 -387825 3769 196396 -32559 -269551 -34873 7455
8964 -115186 -35921 32490 48146 49094 -383356 33772 -73361 -103661 -175261 -18379 114662 66723
8952 66723 53952 -83796 225164 47534 149860 -244387 -160260 -209131 -136123 -155095 -86837
8941 -86837 -113278 -328351 332077 141074 152903 60594 162776 245770 -100766 -153360 -31671
8929 -171827 21756 -43091 60976 160542 276619 1228005 2546678 7554430 18919637 5891841
8918 982610 217581 527049 382425 225221 211630 143444 -274904 159613 103004 -159733
8907 323379 -51552 -142397 -216920 92299 118313 -8508 -78709 200312 186250 -168627 -5683 -54502
8895 -54502 33990 52390 82759 -8389 -169536 -172111 29216 -111547 181530 -67229 -86308 -391850
8883 -391850 -313698 -283031 -172711 -12249 -349318 2427 -14932 -348124 40819 38240 112349
8872 112349 -218395 -201240 -107145 -484230 -261373 53797 -164732 -19668 157256 90862 -332134
8860 -342218 -909 -137047 -97775 -107254 25222 74079 -321384 -152384 -246884 -292639 -197804 -158211
8848 -158211 -73556 67808 -175298 -196665 -43137 -273540 -231861 -157745 288462 181998 -81063
8836 5267 324040 51685 -463270 -127909 16935 247773 56234 -202218 -257232 -29551 -317
8824 199030 -175588 227496 185234 -92113 -131446 -155299 -96122 32894 121137 -20180 -187022
8813 -187022 -75584 -185517 57463 -137951 -194287 -291700 -112551 40488 -64466 -27462 80603
8801 -184390 180368 -256004 128642 -177623 -228490 281310 -42455 -194014 103369 177520
8791 177520 -88070 -143365 -315594 46652 -86452 58910 -196800 125530 -76590 -18669 -82934
8780 -82934 -139047 157474 -90563 -291955 -185043 76547 349564 -16664 -129565 -117886 -223916
8769 -223916 183194 -249179 -150721 -181184 6320 -189375 -156534 58145 15579 144617 185703
8758 185703 -507948 5167 -270617 -58985 -97612 257307 52495 -201983 -157069 43699 -312124
8746 -285903 -191711 141963 47742 -255800 76410 126087 143179 -15588 -34484 75341 -140449
8734 133582 -181875 -7587 -228289 163963 -131842 160720 -292267 86038 121387 81234 115916
8723 115916 -56035 -69168 -78152 319087 -257528 155673 -111104 63215 143821 83968 -16524
8711 133034 -120596 -72342 40186 66669 -210206 38028 -206482 77130 276041 30670 -56839
8699 -166502 -34741 -132557 -68200 85434 110823 337816 -202921 -69681 -32905 -85277 -123858
8688 -123858 -107994 -409864 -342669 19598 123583 -58246 170876 -83166 -27590 61301 13536
8676 54596 359402 -527312 383157 -190130 -19243 80447 -56083 -167589 72369 -278932 29612
8664 -15214 43256 -7711 -20667 1525 -380476 -4183 -266466 118815 -112674 109105 -138405
8652 358301 -140349 66712 228539 220671 -240912 171539 6571 -237473 -261941 130417 -133383
8640 -5675 39931 -199218 89107 -207993 -173579 51046 -80905 -108852 234089 -525989 36269
8628 142939 -58978 -271277 -60937 284561 69343 -319260 62568 -141720 -33211 -223226 2051
8616 97109 210450 -202115 46274 13634 -176250 -110286 -87550 77467 -273304 -30972 -43040
8605 -43040 -34714 270686 -404369 -38423 34919 -9524 -184895 260003 -91377 161365 -29733
8593 253919 -237944 85259 -93259 -354375 -174199 -303486 -25319 53154 -28528 249410 17131
8581 -127709 -38783 -127466 -93921 14324 -77561 86869 -294952 71981 34826 -1894 66147 -136110
8568 267692 79978 256533 -130233 -140247 -76513 104121 -130453 -343874 -90491 42381 -323918
8556 156336 -111150 -168729 86880 205949 -149258 -342061 -195214 -358235 -275981 117782
8545 -312504 -88234 119744 193032 165957 188580 -78598 -20928 -259294 -147955 117046 18187
8533 -174176 -143387 119327 20977 176417 -374500 137781 -32339 -409234 -119893 -34128
8522 42792 38419 -268034 59977 44745 -200964 506251 -52036 28337 -9197 -289302 203339
8510 -69777 259143 -7182 -130805 -299077 599328 -181810 -340836 -81990 -210619 325401
8499 -11139 -99106 185575 21132 -128319 -103358 -241414 -429815 -202413 127817 76677 12900
8487 -326539 69063 -185620 127161 -48955 -79970 262215 8145 -46377 95732 98985 180542
8476 180542 -477579 208966 -310425 -78573 3710 54599 -42612 -308905 -18653 81094 174555
8465 174555 -18471 -360160 -139601 -231171 -48821 -67986 -72590 -176277 205230 -174827 -147370
8454 -147370 30183 16618 335349 201949 181519 -100831 25531 -432529 120137 -212573
8443 -27626 368900 -242539 -185926 3550 227107 -193353 -80981 64789 -274753 -188101 -228311
8432 -228311 -81178 -187702 -332016 -91823 30298 4149 -60501 -71386 140984 -237705 22017
8420 -189878 -262537 -31480 37067 38602 -250487 -150313 109761 -308982 -137047 102786 -230799
8408 66798 82058 -107940 -46051 -191237 32429 -57189 -93281 3987 72319 -48611 -74567 -91463
8396 -91463 64303 -160517 77641 -392122 -204261 -3963 -1543 -175087 -209104 138156 -198257
8384 -273206 1547 -80226 -94097 17979 -43612 60806 -471476 20491 -145258 73090 -311108
8372 157643 168834 186419 -39152 1161 68675 -107115 -89857 -469735 63546 -48437 62241
8360 150740 -198184 -3805 20264 149063 -42710 14240 -150250 42219 76485 22171 26560
8349 26560 -96377 221244 -304130 -167645 14369 -123339 -110337 -166063 19274 101438 -82090
8337 177327 134039 99751 -10716 384641 252757 116616 146858 15662 -232103 31574 -318364
8325 -55318 -19300 -330287 4525 -64052 73424 -22193 -223735 159899 251266 209737 43836
8313 -70209 68354 15046 -295213 -83761 98507 69609 -195353 103826 -250983 39171 172251
8302 172251 110332 -216311 -227375 8812 123714 -486919 24556 -51459 -154317 -96372 -145571
8291 -145571 -208828 -137017 113144 50251 -227459 -55026 -103544 -49442 -172892 81141 -70125
8279 145458 192990 -432697 15644 -82935 -30150 -365389 -87131 -400022 -226768 -376637 -36351
8267 -114695 227805 -55323 52815 338471 -233711 -8756 209552 -151063 222912 -69660 244992
8255 -224062 -205597 -340837 83419 -196352 -110683 -418645 -220812 226233 957 -91601 -251099
8244 -251099 7594 -72921 42312 175221 185139 -118090 -76430 -18652 334896 -126547 77294
8232 42839 -216733 189999 -115600 -20955 140445 574198 -107478 -167633 27159 -25957 -260800
8221 -260800 -96714 13830 97677 -349685 -194834 -36174 -95988 -76418 -165587 -353721 157113
8209 70408 -69737 -180238 42570 -101862 -159462 119413 42386 -530056 -122630 -345768 -228926
8198 -228926 166477 32137 -280007 -125238 -454148 -118436 -51735 303922 176261 389382
8188 389382 191637 -181042 86641 -165610 -61773 233452 -113606 47002 53855 -319958 -84129
8176 -48430 7700 206689 16509 29917 -7153 -392659 4950 -127631 67481 -87794 -357857 232298
8163 141968 95540 333445 -108205 -37077 -95666 104862 -62575 -374662 84573 -35667 -89165
8152 -89165 -11576 -23201 -437710 -247965 13465 119928 -44228 -209658 -60709 7672 147079
8141 147079 -130902 213043 -280683 -111205 -477136 -2389 180239 -56407 183138 -129791
8130 44283 -36417 -278291 128917 -201703 -186410 11217 137243 235384 -25313 -192983 -118788
8119 -118788 -215653 40269 98001 92625 -439713 -53141 194335 -95220 -92924 -175638 -177204 175914
8106 -31593 -211330 9089 -18878 13711 37217 -234542 221714 105685 -63456 -147854 -142748
8095 -142748 -37738 -168425 -156083 -21063 17730 -101902 171445 57024 -144349 -380169 -24062
8083 -130570 -470367 -188818 -237555 -70848 52456 12181 142193 -174677 -72257 126671 -185233
8071 17583 -248218 -255862 -163270 -161648 -39394 -122097 -214191 251442 -295816 45389 -93609 152141
8058 -245289 -118197 -75357 -155829 -59133 -391926 -117496 -164685 114152 105792 -209124 -88248
8046 42668 -45433 70837 -136872 -87613 -55322 108463 -110674 -232953 158771 3215 20244
8035 20244 12871 -65560 -47810 213823 90730 -27598 41023 -158059 332935 -178128 77327
8023 -272572 -155525 -41958 -68574 84044 40257 44279 196069 187195 132448 -39016 25373 -100976
8010 49032 -97864 -96734 -106391 -6962 264705 -379916 -372032 -162109 165350 -6639 115978 -33133
7997 -19519 142804 73569 228307 -93526 157439 -351364 -184710 -59225 149127 -178379
7986 -143673 59546 -6432 319575 257327 164747 -555 -208236 195405 -238705 30446 -390529
7974 -133466 -90110 415349 2622 130440 -95782 131018 -87949 81707 -275907 -364885 -67866
7962 -285470 112948 182770 -89201 104675 -38514 -114455 210314 186528 -93058 19772 -46253
7950 102337 -2777 -25789 -309697 180931 87035 -102784 202265 22641 209972 5693 -26400
7938 205850 -312339 -106288 -185981 -205070 -77464 -63098 181761 -149446 -48314 -106687 153801
7926 51559 -14598 46899 -194455 -51891 142622 143967 -165114 153931 -180580 249964 159448
7915 159448 -129579 -80755 -319415 -167232 56080 51132 -198615 -106845 99811 -138069 35873
7903 -210668 -71638 -200172 182012 -133355 13929 -677547 43831 -230863 -150143 -81639 15734
7891 -37594 39970 -85417 14806 -260995 83406 135998 -346609 -292595 148022 57871 -141314
7879 50429 -85609 215337 -93696 108870 -297720 -61906 -255974 -105475 -210222 11296 31290
7868 31290 -194468 45720 -78204 79135 -61153 18542 -136972 -339799 -52929 -135047 8851
7856 -125328 -290860 194543 -280906 -142336 309345 198592 -8127 137115 -295791 49378
7845 238203 478815 -164309 31837 109789 329022 42059 -9864 -65128 59983 48691 -290166
7833 -4253 51332 257146 33476 314912 112864 107393 -119993 -23031 -127863 -238219 34073
7821 39665 -63593 -161591 -210067 -295970 -28981 12666 -170662 -88159 163368 -161473 44418
7809 -156914 -74580 -108114 -203675 11240 -225151 -154882 31420 -116691 -179827 -442539 -56036
7797 -188636 -90319 -114428 -149728 -216561 -39767 116706 -305964 60021 -293063 -347869 57637
7785 149469 227 44930 12734 -114048 44543 -6664 -85265 277599 188263 33412 76871 -95114
7772 -260836 24840 -73370 -70642 -56556 -326189 201139 -177695 -201864 24904 -379948 11645
7760 19720 -203290 -226060 -286 -106486 108969 -25235 -128871 -199383 -92236 -22638 45585
7748 -54844 117136 264500 352 188689 22588 -108046 -262796 -25151 58986 -178039 53152
7736 167494 78728 -71106 -80566 -179444 125746 156272 -95847 -166129 -128556 -214240 200428
7724 90695 -298196 164747 92518 -150479 90047 -223177 -85834 209803 6792 417753 50417
7712 296869 -69737 -321500 54516 120962 -89680 100065 61697 407042 21782 -125244 -165931
7701 -165931 120590 -60530 117022 180417 -149812 -263845 -9292 -80797 -169864 -22230 -109993
7690 -109993 61734 -254168 118140 170092 69934 65581 255792 75095 50346 -33520 21709
7678 17166 -284801 65092 24303 -66049 89614 274103 -388244 -22572 -1736 99822 -305743
7666 -315235 -393682 -88105 -122686 -21649 135529 77672 -279077 140561 -93640 180494 12722
7654 -103646 140764 -59166 -70645 -201483 -66105 -21885 156136 73190 -215874 -152201 -68776
7642 -17391 -233269 444535 -265140 40427 67966 -325037 -163612 -70262 -68470 -120095 188145
7630 -473402 306014 -155252 127509 80641 131697 -121766 -233142 103533 -263012 -258931
7620 -258931 86833 207127 -148376 19833 42072 -223874 95966 319509 31157 -326475 189493
7608 -414753 178777 -140803 108310 77021 92599 -71221 312955 362611 -31394 65455 -114537
7596 103700 -71352 182981 35561 42245 57812 38009 -36278 -23892 165169 -127932 -147201
7585 -147201 -554822 -140088 160321 -131715 120049 167069 -501720 -1760 -138460 84149
7574 -120368 202674 -177961 112724 -87846 -198424 -329081 181994 76725 110618 -45016
7563 -96359 -37135 -193032 -251044 6666 -332556 -78444 156891 215562 -61805 -111628 -58373
7552 -58373 -102103 139165 -52400 -122934 -136213 -79412 96472 -410841 -281234 -85090 -183525
7541 -183525 290329 -104906 -90302 5625 -112205 -167857 187026 334560 -247248 27585 165734
7530 165734 228067 128413 155902 326734 -178615 -43587 64393 -611649 -357417 -46901 -175016
7519 -175016 -213773 -43407 199028 -49033 169503 -259615 110642 -309067 105435 -18717
7508 -48528 -53987 -107879 -78007 -12412 -195185 -259311 230421 128115 39347 -314194 16524
7496 -77600 -117947 -27626 -36162 -114319 53827 -147845 348532 -282593 -9857 255283 185525
7485 185525 1603 28872 19766 -42449 -377456 -283107 -93380 -221650 -134219 -179272 178966
7473 55633 95281 -119652 284033 102398 -167497 -186449 -66792 -29160 10470 415315 121425
7461 -196162 -182512 -299847 -48332 -1165 154387 82002 -20424 -83327 145412 266483 4715
7449 186281 104145 277538 63536 317432 -209906 200787 135736 11917 -243865 8419 -63937
7437 46904 -123055 202788 -169433 -112870 -216465 -172192 33072 -5800 -153276 -57044 -104646
7426 -104646 -115373 -45251 -50024 -260112 -491696 -57813 81429 -23111 -108271 121472 435831
7415 435831 -158767 -84221 -37041 -182124 -255973 -89417 -235217 99496 -108489 -21588 185850
7403 -91521 -98333 -193841 13113 -60820 179492 -51700 -58881 235872 -97974 -174248 21087 84807
7391 84807 -118836 63908 -93681 -173506 -234592 2641 8663 -42065 15713 -17984 31824 58677
7379 58677 -524159 1157 103881 136362 3349 304188 -174227 -47129 264137 120579 -47329
7367 -105142 98994 72660 16161 -453156 70572 -81314 2297 197304 486143 60524 -41268
7355 166825 -13578 -110104 -41396 449129 271738 244398 -249624 -104121 -63470 30926 172077
7344 172077 -106238 70050 281974 92438 -48108 -127693 33148 -185951 -151985 103002 39534
7332 -76436 -7530 -58825 -22553 -50587 -142669 -104416 -115644 72220 170780 5778 -287666 -208425
7320 -208425 249820 70548 -239704 -42351 176315 129907 34502 46603 169215 108437 74313
7309 74313 -56527 -370752 133558 -58457 261819 -163805 -151330 180981 -379284 -72629 -91085
7298 -91085 -121 -154193 124099 -257598 -113585 254695 444531 -224560 -119054 -72938 130825
7286 -87241 -188821 -150844 -267475 85379 104583 -209347 155345 -277541 -274485 -235742 22776
7274 -189656 -148506 -43073 280180 119782 -82106 -41669 4266 -185299 -195395 -64577 -14294
7262 -290874 -2865 -36104 -244654 -307434 -28515 -24076 348351 -44850 -133651 -90976 -128004 -98419
7250 -98419 246061 -323051 99955 -60525 -14191 -79258 -179836 223703 -73791 159140 -135299
7238 11737 125002 166904 332891 185477 26029 -17566 -238013 -142944 -406932 -308531 -139863
7226 263936 -95415 156928 -213140 -335015 -157209 -255325 88149 -236215 -207381 92141 -217556
7214 156347 -33865 154496 -45618 -143520 295256 44947 189946 -117893 -535215 212127
7203 -51903 -10022 -35302 -345740 70710 24884 -88866 -414058 -483 -110507 -147482 -237596 974
7190 58298 -234708 -516897 50609 159299 -25678 -118554 -88947 -257536 -101949 -245488 9056
7178 -121878 -473444 155763 -80119 -401824 -112393 198921 -3430 -96488 -9382 55737 -10044
7166 265432 60132 -361985 -309352 -109723 95505 -257269 15068 -63732 -115534 82690 -68447
7154 -52818 -302338 352808 -151752 -130611 -39622 -113074 -212200 130780 112580 -72474 77967
7142 -79499 -36671 -274925 194587 509 -94650 259981 -28513 93225 163053 -112013 -198143
7131 -198143 -3718 29730 40772 269360 -388437 212081 57637 -286601 -250516 -16639 -144262
7120 -144262 -4869 -30104 3389 125302 127428 28851 259989 -69442 -180323 -419293 -91652
7108 -269909 259553 -8861 -74730 -70497 25018 -393435 -125423 -86396 16338 -92746 -132496
7097 -132496 193462 -126392 -163470 65476 249327 -81155 -179640 -338923 247383 -192316
7086 233506 -44308 -211473 197151 100636 104224 -97730 -268224 67092 -231788 149731 -16961
7074 -27333 129195 124587 -155505 12064 90489 -7987 -274894 -74839 227832 -155291 49163
7062 57203 -204726 42333 32229 -140577 170820 197486 -126400 -176484 -18300 -362553 130672
7050 -59403 11673 -29174 143428 234069 -16123 -33560 -360953 -129121 66566 -93903 -230527
7039 -230527 -434029 7138 -288897 -202909 -327629 31589 44457 127004 41322 150312 290783
7028 290783 130158 140283 19619 -112589 8866 407505 41051 -6612 -36374 -9729 -190907
7017 -190907 -149925 153852 -227636 -101227 -29371 184378 320072 -346811 29714 -32028
7006 -79978 -136969 92607 -21825 179504 -55283 123556 -234597 38623 -44704 67767 -315580
6994 -125491 -24929 61360 -154233 -124721 -135846 -56930 126336 -15517 -329688 96388 -76910
6982 91639 243992 123552 59156 -13249 137889 -172454 90076 12299 -40338 -154045 140515
6970 -158378 -70511 -293752 -40 139545 -87707 87123 -10700 40418 129229 -54007 -79125 29548
6957 -158223 72844 71537 91197 26188 -51200 261532 72469 82799 246302 -179712 -22984
6945 -60921 89350 154554 57327 326881 142555 140810 -178964 -312300 36064 22718 -125163
6933 386677 -24996 -133248 -219893 -10702 27296 -99437 177730 131150 -109351 -186524 50877
6921 -31457 177661 29037 72075 59992 -162831 72185 -84573 32259 -183040 -150988 1063
6909 -83455 3879 -14950 -43628 -470590 -522485 -25509 151657 -40293 -32831 -290788 -82885 -174076
6897 -174076 -283666 80255 -44575 -321049 37701 -162893 -41555 -109431 99142 59745 149872
6886 149872 179125 85325 -308345 20554 146245 -289457 -162594 -319062 228271 -66659
6875 2841 -91125 -97236 240263 -111981 -341697 -165514 46766 188521 56747 68461 -283950
6863 74037 118842 -120181 86044 -79178 14699 38184 -210213 191400 -242211 -119975 -95401
6852 -95401 -87410 27687 10855 -162454 -245229 3757 132169 77834 -330662 -278215 -223125 -79600
6839 -172601 -158288 -101527 -248164 167682 -247489 215632 77328 -72705 -77260 130602 37199
6827 281541 335648 104555 192847 -10910 -22251 -364548 66908 -109202 -83828 -359545 124257
6815 -58539 -324652 -98624 -11804 -89160 -211372 182713 65629 17442 -34288 199525 -74726
6803 -331589 110538 33818 -108223 47443 -65268 -137948 -72481 -311252 -266770 20743 55342
6792 55342 246231 157009 61660 -134490 -311329 8616 -221627 184103 303070 -48360 -72492
6781 -72492 122510 145026 -110627 -34995 260521 -86810 310273 -221356 -100440 180901
6770 -22967 397569 -205585 23490 136509 -30107 303015 289651 -3561 -129702 332371 250041
6759 250041 -237674 33680 72803 188421 148605 277592 -79520 -17654 220267 209801 193829
6748 193829 268780 -16542 226387 -82734 16021 319125 -79842 -223858 139286 -192003 63808
6736 -313706 -59182 -101456 -56291 71801 209038 221878 -51716 -19812 279298 -116312 -85335
6725 -85335 42194 -30746 115274 36446 -1864 99127 -18535 -131228 -19208 -124090 194261
6713 61883 98454 -277906 107033 191881 -227841 72246 362892 -276348 -263961 394175 -45900
6701 39580 -75985 -184852 -46628 -20901 -31903 -323037 101844 174003 -87854 33660 -237566
6689 8870 -126172 -38790 67261 -48130 297242 270703 -97559 359983 161110 84790 175433
6678 175433 80104 249320 54909 11886 -85455 27007 296105 208500 27972 -23101 96688
6666 -139226 44684 18337 328820 -112644 -330743 -40421 -165920 -129830 -558333 -276546
6655 -21009 2616 274631 57980 37495 164937 -93472 -133327 30662 -114470 192296 -277030
6643 -229178 -64755 -124321 -162770 139342 -69031 78831 26796 129877 -15868 82175 61177
6632 61177 -6935 -129689 -235800 -305332 21315 -130389 235037 -107568 3669 101487 22877
6620 -79710 -34054 -260369 -142550 187974 30603 6640 -1536 -128738 33381 -170902 -327276
6609 -327276 -64534 -165348 12840 102192 83509 55031 -251239 -153219 -21275 318441 -54212
6597 -493455 -113170 256537 -20095 38581 249949 68169 296518 -205734 -395021 45501
6586 -40152 -33051 -115343 135504 -93089 -40009 89614 135903 284705 157548 -220212 87173
6574 -229293 -52552 -32254 74341 -376054 -16274 -289778 -388363 -18850 -18082 -44262 287583
6562 -262437 -8224 131958 40600 -222509 -139186 134398 206562 -102438 -169093 67134 -166370
6550 98730 -103521 -83643 167767 -58186 109843 -10610 38004 -53413 -17132 -7321 -463804
6539 -463804 194849 126299 -1779 -143789 189799 -369412 97531 -236591 -3298 178146 -196918
6527 -396542 152090 -51383 -99546 154249 72784 125410 337099 10897 -78813 -233886 109997
6515 142440 46625 -172578 -194113 55627 66295 -97943 40919 145827 -224028 -200603 -68301
6503 -211873 -103254 288927 129149 -235876 -48768 89879 245876 -364390 35837 181977
6493 181977 56512 65720 145136 -199901 8460 33363 6903 180471 -234232 248054 -100287
6481 9816 -190413 -128566 141593 25930 -57517 -121291 234735 -165838 102539 -108261 -52990
6469 -434843 87732 -15259 271524 -42054 -535724 -31001 133700 -41538 67652 -191401 -256825
6458 -256825 -212553 -158673 -67879 156689 75331 17565 -161137 104518 -228528 -100139 -39215
6446 23570 240782 6140 -49377 69055 143252 -123307 69220 -15424 -185020 -115060 -53000
6434 -55521 170459 311697 -299838 337809 107778 291562 55323 55271 -285255 48743 -90049
6422 292219 322014 504716 95817 -30034 -32889 -85653 -50247 -217747 -469831 89311 -202705
6410 79536 127830 114887 -140036 -336060 183210 27266 -210120 -90341 133497 -35938 -58548
6399 -58548 -27134 -43954 116455 -110834 -198236 -4107 15035 140003 -89316 -255485 136980
6387 91158 -3357 -94724 -128143 76712 -71324 -47300 156957 78765 -39724 -82675 12711 51490
6375 51490 -115460 -75291 -245590 88336 -245031 -12671 -156507 233577 -184298 -53627 168462
6363 -147750 -105627 208065 60933 371223 -182725 218736 -188511 478993 45216 -172254
6352 -69218 153652 10131 -92889 -15815 60884 -225595 -147468 -66838 28295 -348526 30845
6340 202135 -229766 -47967 26753 226445 92030 -231851 -9526 -171270 4181 -130343 -71302
6329 -71302 -294632 202936 -141601 -88167 68487 348770 -223243 -176883 -47970 90050 -279432
6317 -88519 -393011 -129558 -166758 112291 351295 193918 -73586 169958 -71679 -114409 125890
6305 282367 -56900 14109 -222646 145865 -276844 55070 -78859 -76654 -22675 57439 159687
6294 159687 172375 112838 88122 319509 68061 -7198 139810 389840 25662 -445985 27046
6282 -200790 23194 -229343 -112468 -113624 -19907 -19994 340982 -158523 206596 -112660 -126634
6271 -126634 -258310 112484 -395044 228053 -132862 -11140 -76317 -12293 206865 -110655
6260 -2376 9127 -253059 257647 -306216 52724 67207 -365191 -208642 -74413 -219288 -347679
6249 -347679 17823 -253637 -82591 46014 9525 -342951 -77348 -30179 -400157 219333 -4060
6237 -208528 -199881 -98167 -230630 -34653 -99232 -304203 -150034 -159359 190683 688740 237221
6225 -87138 -207834 383 -72378 187320 -216240 -261945 -244856 -45537 -310323 -151480 -10925
6213 -57059 -96003 -209604 -297021 112142 -53274 -185264 -38048 211526 101771 170494 165315
6202 165315 -363582 -163958 -114339 53132 22435 192494 63923 31109 -233894 40827 56605
6191 56605 -232035 -62998 260204 -56279 116892 193455 392720 147409 25249 -140751 -105446
6180 -105446 894 10544 147852 -277893 360289 272602 24876 275730 260621 102394 140176
6169 140176 167739 -132195 213139 56159 -224219 52983 -27962 60454 -408271 -426542 313977
6157 121034 43556 75661 -250284 405559 318799 -33520 496078 -97338 84631 -25377 -21401
6146 -21401 -117395 -321859 164344 -51873 -86304 487317 284304 305419 -339361 -79778 99004
6134 83649 326170 5204 111013 -181755 70751 -91105 281068 51291 -47511 -39696 36670
6122 204490 269261 181698 -134659 -145138 -179459 -73193 14609 108365 94841 -119229 -267626
6111 -267626 65900 -118370 68968 -113069 25066 -17154 183561 -98271 -82100 207554 378818
6100 378818 -102313 -92811 -187923 77660 175492 -20096 6251 -175758 -37237 -53076 -22605 82662
6087 141575 -148809 44408 -200594 298613 107482 -181718 -119558 49929 107881 -292116
6076 204152 134608 183888 -36215 -83394 -30565 -74442 -204114 -224261 -230920 43417 223603
6065 223603 166036 40461 292052 67264 -447166 62534 -22425 203437 -203456 8471 109045
6054 109045 90957 104563 -205385 129299 -338838 158394 -153942 -109757 406650 215882
6044 215882 430351 -6255 104488 -13644 -133609 -108686 -146515 189733 -7349 62218 -352890
6032 176374 -208130 49252 -298468 -58042 101964 99068 -259356 4045 255814 -162206 -293323
6021 -293323 141175 -118321 -77567 -50328 -61340 -102996 -138827 178712 36243 -234778 191207
6009 -25910 24327 -319121 -197585 -110786 322473 -109461 105247 150205 96870 53020 -96240
5997 -235224 -143553 100122 -252491 -33101 242404 -6768 -120008 -36262 286636 -80557 -95105
5986 -95105 15827 240399 -226519 2376 -152269 -73518 141333 272657 -86398 429410 276942
5975 276942 155287 2040 262465 -214990 -243772 -92107 6874 -59509 4229 -15488 -326896
5964 -326896 -223011 9647 -88359 -44580 193519 361020 -32311 136797 -16697 29343 -63405
5952 -484152 -226983 -98623 370128 -11113 388227 46420 -128867 -251518 -2665 308964 192040
5941 192040 242206 245290 -112602 96849 -46594 -234705 285426 36430 2405 47371 -158873
5929 280109 -67321 -53549 160186 -146616 180335 -79027 46757 -18161 -112280 333974 69700
5917 -30274 -119667 212317 62015 13521 -53357 60174 335993 -157561 -94939 -20043 55271
5905 908 -368598 -61829 -112529 173571 -76338 -155997 254738 -143529 -92600 484256 -138515
5893 129636 -119484 -48677 45229 -266916 -235933 -44399 -119101 -246931 -146210 -277934 259508
5881 242743 -136902 59273 158543 -192993 48386 -138819 -258130 -8270 281579 82623 356882
5870 356882 421229 135108 298862 -24159 162962 -8938 109768 288768 33391 -108300 -98815
5859 -98815 20162 -186486 72750 28716 131950 266009 113638 -45407 -231573 -227081 -88705
5847 -192597 56596 -141206 -104108 -111463 -4545 11006 -15275 28321 56009 -8863 339137 -57160
5834 259988 -23249 75798 111697 20799 280853 -200460 63264 -56068 -274052 -202723 45706
5822 -17914 383165 -243554 29344 132761 47733 11431 -71384 -121646 -113752 124479 -167360
5810 -99444 -221780 351440 -83728 -163000 216327 -1383 134089 -298136 -159985 -21322 656
5798 340074 -33342 180762 -101745 -320853 69165 -290399 -346326 -622 85109 -111653 -37452
5786 -74312 -249301 -222502 -130214 -180466 -130383 249705 -221642 -529667 92653 -28910 60243
5774 167061 196138 -231825 -149308 73836 -242089 85411 -71104 -292944 -51707 -22104 163418
5762 242034 -28028 -80916 119296 127874 -25565 110097 239394 18214 133350 -43968 71853
5750 -176549 255112 -258338 445803 -73655 -16275 15293 -289075 -90941 -27853 -535664 -289471
5739 -289471 249743 -59386 -286725 67006 254159 171138 -200429 -226978 112246 179788 -190685
5727 -146993 -86280 -55523 197670 321457 -396672 124640 93442 53390 -152198 -38074 52894
5715 -356320 -7388 -67310 -149215 -147402 23734 5217 54743 -50418 -126414 -7772 -38501 -7829 26374
5701 415696 -16119 156259 -275178 78719 -12334 -5954 -395907 15578 -135634 -162632 176477
5689 -164828 111071 160736 76239 264868 170867 -97533 172256 16030 74596 -28956 -246798
5678 -246798 104366 -72483 98786 217461 40544 128416 -167895 -583989 18955 223395 12481
5666 -47736 -452177 49075 264188 249507 272775 -270139 11773 20979 4902 228621 -198362
5654 134914 -78828 -74708 232374 108490 -654802 78601 167898 -40932 -87296 163940 111676
5643 111676 10380 -78156 236199 9900 35163 190676 -93496 243789 -167368 99988 350927
5632 350927 36593 -153240 -11602 197905 -87876 195424 70328 -108239 400151 146626
5621 -41753 -311056 456220 134486 -68559 -266319 105529 -113600 321038 -165016 132930
5610 24505 154204 -32113 -264752 103011 -9157 -265001 332917 -172543 -250446 -44172 -281153
5599 -281153 10694 92609 17227 64553 -69527 -217635 -265735 59204 226898 40179 -201191
5587 271222 230912 -201363 177874 -71110 325677 363215 248492 175454 -268475 140494
5576 -76999 -44232 -123682 -43963 -159750 223136 71441 31811 186121 233699 241802 127070
5565 127070 -59512 -19432 430247 110716 -3628 209027 -80258 -150627 153438 366857 -203395
5553 -118092 -80560 -119623 109786 -272102 -200585 -158727 111222 285934 -244903 -76526 -134454
5542 -134454 46717 59296 -26734 -237423 -18242 188468 336849 -75739 -237397 34002 156735
5531 156735 -106487 -289652 -259433 55066 345624 261698 1711 68388 9447 -65657 -317560
5520 -317560 368833 191944 193598 199040 3116 117055 22231 -180122 -14483 -146701 -271503
5509 -271503 15046 404612 133215 128103 -265271 -25561 264966 171745 -227426 -209373 -9236
5497 -77649 18346 -14531 231751 -431630 106852 187127 -127435 -120814 -259421 -277982 64498
5485 222714 -42368 296329 -116437 -188650 65294 434460 -68360 70686 -182385 140054 21943
5473 12556 -62818 -66005 -181367 -60548 -194583 39363 -48830 182597 -183210 -197079 129707
5461 4763 -64649 300748 -297747 109105 56368 -128826 -129710 117495 26217 -140504 74556
5449 102160 -124915 -50857 -56094 -500231 16500 131051 166465 -136727 24441 -574586 24622
5437 414801 -191964 210326 -242993 273506 -175437 8529 14206 65300 161708 127591 -202705
5425 114150 -128596 -142582 -257005 146422 204310 -222408 -156069 -411831 80853 -200360
5414 66699 418882 171804 -74924 -73308 -35684 248572 246885 125201 -419211 93337 -454471
5402 -222232 -138950 350902 91119 -232773 -156598 -167310 1431 122748 219103 -202093 12360
5390 -72817 249376 -52589 -109784 -397818 156552 137224 -66192 -159832 -15916 -21568 162787
5378 -45140 -107960 -24847 64589 194102 147721 -322730 -68467 155816 99236 27262 -53916
5366 -97901 72230 206753 -216100 -107325 -131088 150191 96971 -210068 -61680 75815 -158168
5354 -63420 6717 -48024 353885 181252 21742 -36502 -130959 -25910 55093 85447 1526 275160
5342 275160 69399 138207 283024 -234932 -191620 53998 -159637 -112941 139856 270620 137832
5331 137832 6672 -409547 -71989 114071 94722 -123679 36174 -41248 -203026 29384 -18898
5319 -163438 240255 87521 -133215 -60675 146330 -3791 171922 85543 -38980 85981 -72277
5307 5556 -425909 -135369 22242 34205 -359919 51914 -73838 3003 -181283 -74274 70863
5295 -166382 -225401 -26366 -78713 56342 161705 -32342 194324 82512 -7139 108028 -42178
5283 189242 -133611 303017 -42204 26519 306565 -90932 39825 16821 41619 226841 417898
5272 417898 -16757 -195661 271288 -2563 236941 -129969 108557 -128757 -210053 -265282 -69575
5260 -311182 146134 -248636 -206586 174067 -59057 -117113 6450 126248 -12524 84059 25287
5248 -13799 -26540 -157059 -196597 5928 91874 3068 152496 -176741 -59834 -274696 6752 145876
5236 145876 -53919 96246 -54062 -270308 -320365 -91838 -161956 277297 -391035 25783 62176
5225 62176 -134992 -138700 13178 93319 -372419 -51588 -182525 149290 141210 144047 121878 149675
5213 149675 -257926 -178309 -213819 13680 -28185 -186822 7784 213613 -106321 182841 -100879
5201 -224173 44298 62828 79926 -104279 59420 -107617 194558 -121404 -248719 -197098 -183683
5190 -183683 -412513 112495 -147942 347539 58385 26358 -112106 -181927 157277 24425
5179 -104141 247978 157797 66333 302770 144 -55794 -347152 -72104 350593 -69319 -233633
5168 -233633 -104619 49124 48478 -66544 -84667 169719 78104 -139131 127483 -174365 187805
5156 333468 270198 -74637 -189004 166145 -42188 60805 220289 84798 -83004 3025 -8043
5144 -75712 10363 -188425 149286 89294 -164425 134839 52316 7221 -32557 -129049 378020
5132 -81408 -131865 -117181 176975 -66131 -244819 -78060 -137644 -69250 91258 19449 39524
5121 39524 116207 140806 34320 131234 -46587 -361522 42487 304335 -157748 -306504 -165409
5110 -165409 371119 -131135 60950 -6859 252188 110192 149549 -75425 -336508 -25962 -75346
5099 -75346 159733 -39655 -27018 -210072 -15561 321044 -10122 41691 -54502 55430 -267470
5087 15877 -118213 -83561 46688 63636 -178556 -51936 -2878 84970 -132968 5197 61568 -14280
5074 219360 45494 161112 -122942 -83133 -25970 -244002 43056 335159 59343 -179242 99443
5062 -62417 54626 -151224 -230729 -264186 139238 185416 105266 14650 -72016 282378 162137
5051 162137 -199394 88923 -149319 -1658 -371973 -38448 132320 -32189 -11526 -176553 -189078
5040 -189078 -85489 16594 -93718 257467 13326 -69291 -285115 410882 136511 -210186 245918
5028 18785 -189553 76437 98542 198968 -22813 13275 92356 76471 -82499 -7400 -136050
5017 -136050 -59541 20703 279027 124223 -112759 -74682 -329730 251523 -119395 128119
5006 -35892 206630 -84908 -180857 -14960 -63015 223450 -45098 -135771 -118438 114480 -164803
4994 -3031 -94227 32387 -33561 -166163 -76947 146360 -130465 -146739 -294688 221797 317771
4983 317771 279830 250020 -61255 -318754 249919 176000 444708 121986 -31443 324003 -85583
4971 206876 310473 31529 -20172 128020 -303576 295941 78651 52838 56292 189433 45770
4959 -144186 132068 55221 -25805 -176616 79253 -300970 79737 251859 143897 5963 -45428
4947 -128878 -61229 -99939 191060 161485 175762 -132342 48093 364827 96636 184166 100809
4936 100809 -135179 -322716 102254 -118106 -125672 -227610 179217 -197628 39169 -127410
4925 24833 88529 137352 127125 -67180 57101 210723 376501 386120 -72968 146914 57832
4913 47683 23626 152274 -64237 283302 297063 2146 78352 -201232 -121588 -150424 29592
4901 -96600 -133066 -259075 47322 36129 216860 177864 49693 -199633 126822 42967 104439
4890 104439 5086 33704 -200110 -195288 184192 -70031 -111644 -182303 255912 38235 -62428
4878 -131328 118532 -101868 -213278 -198781 204048 24239 -49572 -240136 105909 -347834
4867 -52836 -367432 -208600 -120115 17799 258049 138747 144868 -7082 -59323 178825 18398
4855 110308 382214 77909 117514 296701 101029 128870 -19747 -162016 -120446 201518 -194029
4843 260410 68674 94216 -178486 325738 -8752 167291 -295927 -361699 34974 -231077 107754
4831 -133729 74081 30940 171919 -21098 -238787 -169947 -255528 32150 72678 -187293 406252
4819 -96948 88245 -206795 111068 -201665 -163527 -43745 -82436 -103473 424977 96594 -169497
4807 114336 -131040 367066 137379 6539 -95061 8699 60520 108888 137191 -12486 25641
4795 66739 -16957 -250068 114281 300606 159221 -299235 -338083 188660 -21185 -78360 71273
4783 -82421 80503 -156169 20305 275127 93751 -211126 66786 80472 -276551 -43832 -314902
4772 -314902 -220285 -169978 181760 293908 119937 43087 -183077 148819 -55510 29874 -77640
4760 -172876 -231691 -168112 122077 -116086 -19404 -109760 -65140 -92893 -55879 -230120 -332078
4749 -332078 90534 55396 -223239 -92051 -301911 226950 -22173 -274739 -44430 194705 -255742
4737 519803 -82800 236948 -37206 -123326 90664 -50042 21781 -23222 141712 -77895 -146979
4726 -146979 -16700 226286 30661 -163407 131483 -24262 259374 -35076 319124 119989
4715 -86141 156379 85223 166422 99130 124407 98146 31381 -55533 278534 10265 170695
4704 170695 314688 195895 217879 -279272 58607 -97378 -81622 -184657 73322 201254 -187499
4692 -189062 -288810 -74758 -6354 124042 -135723 -63973 443502 244936 39389 58991 -63616
4680 -253065 -102118 160040 -3439 197512 214663 -330233 41713 117638 -22630 -169157 -3864
4668 -87386 -63125 45193 4605 -199920 -16788 220153 190920 -31979 114148 88808 372613
4657 372613 -48044 -124742 216042 220437 -45050 246675 -166279 143945 118692 -112044 213648
4645 185037 -318728 -118126 -124448 -107981 152046 -144646 -239486 -132782 -226122 -82086 77423
4633 -12844 20173 -3399 14365 84993 -103719 313442 282380 22522 45763 118196 -200259
4621 -104177 -352842 -20336 -76419 32175 -231363 160032 273134 166276 -159197 136214
4610 -113393 -78871 45917 -19756 17368 -123431 -61619 -168583 -184758 106067 -4133 269148
4598 -215535 291741 6212 101687 -46060 -366275 -73877 8573 34734 54914 -275463 -149106
4587 -149106 -8711 -155686 269157 59195 -88644 -53957 -83202 201089 89227 -57683 142033
4575 -275772 -82086 -76305 267889 27823 -252576 222124 242281 -135546 103119 252683 -137439
4563 -159379 -174098 54535 -228406 24773 75604 27393 -62862 -269973 82035 50498 -268733
4551 12072 179916 218210 223225 -777 22179 -495526 124736 74121 43300 -250149 109663
4539 -6882 112615 -177155 212507 -216272 -212945 79903 -136851 127635 227423 -76881 18209
4527 -12290 -402672 125397 292209 -165318 157453 132542 114534 -96972 -122415 8528 183076
4516 183076 99944 35299 167185 23971 -33175 -80558 96515 -29389 100463 36996 -215281
4504 6850 -12101 -25928 192370 92935 -65057 -154926 155865 285393 -277927 15478 -36210
4492 413186 -311978 -13195 337104 -132888 372874 176676 -168764 115484 -174763 -104461
4482 -104461 350560 41700 -317855 -192094 -91954 -279698 -15401 80900 347679 135186
$$ [...]
##END NTUPLES=NMR SPECTRUM
##END=
