
##TITLE=UV1265_M12_1292-1216_20_7414333_0zVrbZ4gNm
##JCAMPDX= 6.0         $$ Bruker NMR JCAMP-DX V2.0
##DATA TYPE= NMR SPECTRUM
##DATA CLASS= NTUPLES
##ORIGIN= BRUKER
##OWNER= Administrator
$$ 1.72 TOPSPIN		Version 2.1
$$ 2013-01-25 20:56:31.111 -0500  Administrator@X
$$ Compression mode = diff/dup
##.OBSERVE FREQUENCY= 400.02188249412
##.OBSERVE NUCLEUS= ^1H
##.ACQUISITION MODE= SIMULTANEOUS (DQD)
##.ACQUISITION SCHEME= undefined
##.AVERAGES= 64
##.DIGITISER RES= 22
##SPECTROMETER/DATA SYSTEM= spect
##.PULSE SEQUENCE= noesygpps1d.comp
##.SOLVENT NAME= COFFEE_meoh
##.SHIFT REFERENCE= INTERNAL, COFFEE_meoh, 1, 14.96123
##AUDIT TRAIL= $$ (NUMBER, WHEN, WHO, WHERE, PROCESS, VERSION, WHAT)
$$ ##TITLE= Audit trail, TOPSPIN		Version 2.1
$$ ##JCAMPDX= 5.01
$$ ##ORIGIN= Bruker BioSpin GmbH
$$ ##OWNER= Administrator
$$ $$ E:\/data/COFFEE/nmr/UV1265_M12_1292-1216_20_7414333_0zVrbZ4gNm/12/pdata/1/auditp.txt
$$ ##AUDIT TRAIL=  $$ (NUMBER, WHEN, WHO, WHERE, PROCESS, VERSION, WHAT)
(   1,<2013-01-25 20:56:25.361 -0500>,<Administrator>,<X>,<go>,<TOPSPIN 2.1>,
      <created by zg
	started at 2013-01-25 20:44:55.345 -0500,
	POWCHK enabled, PULCHK disabled,
       configuration hash MD5:
       86 BA 57 50 F2 9D 5C 9B 26 00 A9 28 5F 66 2E 89
       data hash MD5: 64K
       2D 23 C9 9B 5D 42 78 A4 5F 6B AA 06 FB F1 43 FA>)
(   2,<2013-01-25 20:56:28.392 -0500>,<Administrator>,<X>,<proc1d>,<TOPSPIN 2.1>,
      <Start of raw data processing
       efp LB = 0.3 FT_mod = 6 PKNL = 1 PHC0 = 0 PHC1 = 0 SI = 128K 
       data hash MD5: 128K
       9E 81 59 5A 26 DE C8 05 79 44 65 C0 CC 7C E8 6B>)
(   3,<2013-01-25 20:56:29.423 -0500>,<Administrator>,<X>,<proc1d>,<TOPSPIN 2.1>,
      <pk PHC0 = -77.6239 PHC1 = 0 
       data hash MD5: 128K
       67 DB 9A 19 98 66 B2 73 A8 76 30 A9 58 F7 F2 4B>)
(   4,<2013-01-25 20:56:30.048 -0500>,<Administrator>,<X>,<proc1d>,<TOPSPIN 2.1>,
      <abs ABSG = 1 
       data hash MD5: 128K
       6C 90 0F A7 95 C1 EA 8F 7E 01 01 3F 31 CD C5 BD>)
(   5,<2013-01-25 20:56:30.220 -0500>,<Administrator>,<X>,<proc1d>,<TOPSPIN 2.1>,
      <abs ABSG = 2 
       data hash MD5: 128K
       0B 61 F6 BE C5 3D 78 9F 13 42 9F CC 6C AA D4 EF>)
(   6,<2013-01-25 20:56:30.408 -0500>,<Administrator>,<X>,<proc1d>,<TOPSPIN 2.1>,
      <abs ABSG = 3 
       data hash MD5: 128K
       AE E1 FF C8 01 49 51 1F 06 D5 32 89 F3 7D 42 D3>)
(   7,<2013-01-25 20:56:30.580 -0500>,<Administrator>,<X>,<proc1d>,<TOPSPIN 2.1>,
      <abs ABSG = 4 
       data hash MD5: 128K
       BE 23 16 E8 BE 0F F2 E7 83 DF 5F E2 9D 15 DD 8C>)
(   8,<2013-01-25 20:56:30.767 -0500>,<Administrator>,<X>,<proc1d>,<TOPSPIN 2.1>,
      <abs ABSG = 5 
       data hash MD5: 128K
       66 F9 E6 39 5E 15 DA 9B ED 38 84 78 C9 78 DE D4>)
$$ ##END=
$$ 
$$ $$ hash MD5
$$ $$ 0E B5 88 6D A7 0A B5 CE 2C E9 16 81 1F BB 06 EB
##$RELAX= 
##$RELAX= 
##$RELAX= 
##$RELAX= 
##$RELAX= 
##$RELAX= 
##$RELAX= 
##$RELAX= 
$$ Bruker specific parameters
$$ --------------------------
##$DU= <E:\>
##$EXPNO= 12
$$ [...]
##$TP07= 0
##$TPNAME0= <>
##$TPNAME1= <>
##$TPNAME2= <>
##$TPNAME3= <>
##$TPNAME4= <>
##$TPNAME5= <>
##$TPNAME6= <>
##$TPNAME7= <>
##$TPOAL= (0..7)
0.5 0.5 0.5 0.5 0.5 0.5 0.5 0.5
##$TPOFFS= (0..7)
0 0 0 0 0 0 0 0
##$TUNHIN= 0
##$TUNHOUT= 0
##$TUNXOUT= 0
##$USERA1= <user>
##$USERA2= <user>
##$USERA3= <user>
##$USERA4= <user>
##$USERA5= <user>
##$V9= 5
##$VALIST= <valist>
##$VCLIST= <CCCCCCCCCCCCCCC>
##$VD= 0
##$VDLIST= <DDDDDDDDDDDDDDD>
##$VPLIST= <PPPPPPPPPPPPPPP>
##$VTLIST= <TTTTTTTTTTTTTTT>
##$WBST= 2048
##$WBSW= 25
##$XGAIN= (0..3)
0 0 0 0
##$XL= 0
##$YL= 0
##$YMAX_a= 6087671
##$YMIN_a= -12310553
##$ZGOPTNS= <>
##$ZL1= 120
##$ZL2= 120
##$ZL3= 120
##$ZL4= 120
##$ABSF1= 14.96123
##$ABSF2= -5.596951
##$ABSG= 5
##$ABSL= 3
##$ALPHA= 0
##$AQORDER= 0
##$ASSFAC= 0
##$ASSFACI= 0
##$ASSFACX= 0
##$ASSWID= 0
##$AUNMP= <proc_prof1d_extract.lims>
##$AXLEFT= 0
##$AXNAME= <>
##$AXNUC= <1H>
##$AXRIGHT= 0
##$AXTYPE= 0
##$AXUNIT= <>
##$AZFE= 0.1
##$AZFW= 0.1
##$BCFW= 0
##$BC_mod= 0
##$BYTORDP= 0
##$COROFFS= 0
##$CY= 15
##$DATMOD= 1
##$DC= 0
##$DFILT= <>
##$DTYPP= 0
##$F1P= 0
##$F2P= 0
##$FCOR= 0.5
##$FTSIZE= 131072
##$FT_mod= 6
##$GAMMA= 0
##$GB= 0
##$INTBC= 1
##$INTSCL= 1
##$ISEN= 128
##$LB= 0.3
##$LEV0= 0
##$LPBIN= 0
##$MAXI= 10000
##$MC2= 0
##$MEAN= 0
##$ME_mod= 0
##$MI= 0
##$NCOEF= 0
##$NC_proc= -2
##$NLEV= 6
##$NOISF1= 0
##$NOISF2= 0
##$NSP= 0
##$NTH_PI= 0
##$NZP= 0
##$OFFSET= 14.96123
##$PC= 1
##$PHC0= -77.6239
##$PHC1= 0
##$PH_mod= 1
##$PKNL= yes
##$PPARMOD= 0
##$PPDIAG= 0
##$PPIPTYP= 0
##$PPMPNUM= 2147483647
##$PPRESOL= 1
##$PSCAL= 4
##$PSIGN= 0
##$PYNMP= <proc.py>
##$REVERSE= no
##$SF= 400.020009545562
##$SI= 131072
##$SIGF1= 0
##$SIGF2= 0
##$SINO= 400
##$SIOLD= 131072
##$SPECTYP= <>
##$SREGLST= <1H.CDCl3>
##$SSB= 0
##$STSI= 131072
##$STSR= 0
##$SW_p= 8223.68421052631
##$SYMM= 0
##$S_DEV= 0
##$TDeff= 65536
##$TDoff= 0
##$TI= <>
##$TILT= no
##$TM1= 0
##$TM2= 0
##$TOPLEV= 0
##$USERP1= <user>
##$USERP2= <user>
##$USERP3= <user>
##$USERP4= <user>
##$USERP5= <user>
##$WDW= 1
##$XDIM= 131072
##$YMAX_p= 446606489
##$YMIN_p= -12171
##$CURPLOT= <Network HP LaserJet P1505>
##$CURPRIN= <$Network HP LaserJet P1505>
##$DFORMAT= <normdp>
##$LAYOUT= <+/1D_H.xwp>
##$LFORMAT= <normlp>
##$PFORMAT= <normpl>
##$SURQMSG= 1
$$ End of Bruker specific parameters
$$ ---------------------------------
##NTUPLES= NMR SPECTRUM
##VAR_NAME=  FREQUENCY,     SPECTRUM/REAL,   SPECTRUM/IMAG
##SYMBOL=    X,             R,               I
##VAR_TYPE=  INDEPENDENT,   DEPENDENT,       DEPENDENT
##VAR_FORM=  AFFN,          ASDF,            ASDF
##VAR_DIM=   131072,        131072,          131072
##UNITS=     HZ,            ARBITRARY UNITS, ARBITRARY UNITS
##FACTOR=    0.0627417313425164, 1,          1
##FIRST=     8223.62146879497, -2752,        -59352
##LAST=      0,             95,              -60516
##MIN=       0,             -12171,          0
##MAX=       8223.62146879497, 446606489,    0
$$ Real data points
##PAGE= N=1
##DATA TABLE= (X++(R..R)), XYDATA
$$ [...]
$$ plain form
61717 495048 497942 500441 502597 504869 507585 510314 512161 512809 512801 512526 511389 508564 504327 499948 496173
61702 496173 492387 487654 482117 476861 472546 468778 464938 461124 457853 455093 452093 448266 443905 439867
61688 439867 436677 434081 431387 428131 424415 420649 417113 413949 411435 409857 408850 407285 404284 400264
61674 400264 396507 393837 392185 391292 391145 391542 391863 391656 391031 390222 389147 387744 386410 385756 386105 387365
61658 387365 389051 390355 390593 389892 389067 388645 388476 388543 389456 391644 394536 397224 399622 402380 405907 410035
61642 410035 414513 419210 423850 427980 431239 433395 434260 433857 432475 430261 427013 422649 417612 412491 407535
61627 407535 402922 399028 395948 393128 390093 387244 385319 384365 383915 383892 384508 385391 385671 385019 383939 382875
61611 382875 381621 379708 376823 372784 367603 361729 355815 350199 344999 340523 336995 333949 330662 327246
$$ packed form
61717D95048K894K499K156K272K716K729J847O48qk75j137k825m237m379l775
61702D96173l786m733n537n256m315l768l840l814l271k760l000l827m361m038
61688D39867l190k596k694l256l716l766l536l164k514j578j007j565l001m020
61674D00264l757k670j652q93j47L97L21k07o25q09j075j403j334o54L49J260
61658C87365J686J304K38p01q25m22j69O7R13K188K892K688K398K758L527M128
61642D10035M478M697M640M130L259K156Q65m03j382k214l248m364n037n121m956
61627D07535m613l894l080k820l035k849j925r54m50k3O16Q83K80o52j080j064
61611C82875j254j913k885m039n181n874n914n616n200m476l528l046l287l416
$$ plain form
61597 327246 324539 322706 320722 317722 314265 311702 310565 310057 308983 306818 303959 301226 299205 297987
61583 297987 297388 297197 297138 296833 296075 294941 293493 291671 289753 288443 288030 287840 287158 286313 286097 286344 286008
61566 286008 284624 282889 281695 281330 281715 282648 283641 284257 284846 286247 288519 290674 291939 292585 293230 294057
61550 294057 295132 296712 298619 299899 299857 299115 299002 300010 301316 301743 300906 299634 299478 301582 305708 310518
61534 310518 314896 318608 321639 323592 324287 324461 325140 326410 327353 327148 325802 323846 321734 319678 317788
61519 317788 316138 314721 313400 311999 310503 309159 308271 307924 308027 308505 309223 309854 310133 310179 310252 310285 310062 309782
61501 309782 309907 310390 310570 310014 309052 308324 308177 308592 309275 309676 309435 308996 309291 310595 312203 313461 314526
61484 314526 315735 316800 317233 317165 317146 317339 317524 317771 318582 320258 322507 324737 326511 327680 328251 328186 327315
$$ packed form
61597C27246k707j833j984l000l457k563j137n08j074k165k859k733k021j218
61583B97987n99j91n9l05p58j134j448j822j918j310m13j90o82q45k16K47l36
61566B86008j384j735j194l65L85R33R93O16N89J401K272K155J265O46O45Q27
61550B94057J075J580J907J280m2p42j13J008J306M27q37j272j56K104M126M810
61534C10518M378L712L031J953O95J74O79J270R43k05j346j956k112k056j890
61519C17788j650j417j321j401j496j344q88l47J03M78P18O31K79M6P3L3k23k80
61501C09782J25M83J80n56r62p28j47M15O83M01k41m39K95J304J608J258J065
61484C14526J209J065M33o8j9J93J85K47Q11J676K249K230J774J169N71o5q71
$$ plain form
61467 327315 325579 323400 321587 320669 320490 320526 320446 320196 319778 319207 318607 318223 318360 319303 321074 323199 324973
61450 324973 326138 327084 328280 329694 330969 331976 333007 334427 336297 338354 340360 342435 344930 347972
61436 347972 351416 355345 360171 365812 371121 374841 377005 378793 381039 383514 385752 387832 390057 392441
61422 392441 394855 397283 399667 401854 403875 405873 407597 408478 408450 408221 408421 408868 408924 408151 406324 403300
61406 403300 399306 395101 391481 388762 386829 385347 383812 381831 379609 377750 376410 375044 373243 371270
61392 371270 369518 367939 366424 365277 364903 365316 366208 367149 367554 367022 366059 365870 366977 368581 369731 370494
61376 370494 371402 372374 373038 373698 375077 377210 379426 381381 383427 385944 388867 391879 394579 396525 397665
61361 397665 398689 400433 402926 405582 408355 412098 417587 424614 432342 440248 448467 457395 467187 477577
$$ packed form
61467C27315j736k179j813r18j79L6q0k50m18n71o00l84J37R43J771K125J774
61450C24973J165R46J196J414J275J007J031J420J870K057K006K075K495L042
61436C47972L444L929M826N641N309L720K164J788K246K475K238K080K225K384
61422C92441K414K428K384K187K021J998J724Q81k8k29K00M47N6p73j827l024
61406D03300l994m205l620k719j933j482j535j981k222j859j340j366j801j973
61392C71270j752j579j515j147l74M13Q92R41M05n32r63j89J107J604J150P63
61376C70494R08R72O64O60J379K133K216J955K046K517K923L012K700J946J140
61361C97665J024J744K493K656K773L743N489P027P728P906Q219Q928R792J0390
$$ plain form
61347 477577 488010 497856 506478 513283 518097 521549 524713 528113 531390 534190 536895 539994 543029 544878
61333 544878 545124 544595 544375 544553 544129 542004 537971 532849 527735 523142 518917 514903 511333 508526 506572
61318 506572 505495 505338 505853 506503 507188 508611 511489 515622 520266 525239 531140 538523 547316 557100 567526
61303 567526 578310 589074 599313 608414 615738 620769 623142 622514 618767 612591 605545 599080 593517 588182
61289 588182 582375 575957 569241 562729 556903 551908 547463 543326 539706 536984 535181 534125 534013 535331
61275 535331 538154 541841 545576 549040 552474 556298 560724 565624 570722 575896 581250 586899 592909 599522
61261 599522 607246 616516 627399 639644 652751 665848 677824 687895 695925 702057 706288 708545 708900
61248 708900 707401 703964 698731 692325 685412 678131 670192 661453 652211 643120 634980 628362 623201 618946
$$ packed form
61347D77577J0433R846Q622O805M814L452L164L400L277K800K705L099L035J849
61333E44878K46n29k20J78m24k125m033n122n114m593m225m014l570k807j954
61318E06572j077j57N15O50O85J423K878M133M644M973N901P383Q793R784J0426
61303E67526J0784J0764J0239R101P324N031K373o28l747o176p046o465n563n335
61289E88182n807o418o716o512n826m995m445m137l620k722j803j056j12J318
61275E35331K823L687L735L464L434L824M426M900N098N174N354N649O010O613
61261E99522P724R270J0883J2245J3107J3097J1976J0071Q030O132M231K257L55
61248G08900j499l437n233o406o913p281p939q739r242r091q140o618n161m255
$$ plain form
61234 618946 615224 612069 609345 606461 603079 599776 597503 596574 596613 597334 598927 601705 605687 610446 615164
61219 615164 619089 622239 625518 629814 635134 640831 646406 651708 656576 660703 663850 665998 667424 668775
61205 668775 670702 673208 675702 678019 681006 685745 692618 701530 712613 726065 741614 758750 777265
61192 777265 796974 817065 836270 853542 868096 879165 886507 891051 894296 897030 899138 900493 901235
61179 901235 901086 899211 895039 888703 880490 870468 858907 846601 834411 822675 811197 799531 787245
61166 787245 774205 760682 746875 732489 717229 701638 686855 673484 661246 649862 639618
61155 639618 630820 623363 617291 613280 611944 612932 615235 618270 622078 626377 629841 630674 627857 621791 613794
61140 613794 605112 596396 587862 579670 572068 565422 560293 557255 556469 557646 560657 565937 573890 584014
$$ packed form
61234F18946l722l155k724k884l382l303k273r29L9P21J593K778L982M759M718
61219F15164L925L150L279M296N320N697N575N302M868M127L147K148J426J351
61205F68775J927K506K494K317K987M739O873Q912J1083J3452J5549J7136J8515
61192G77265J9709K0091J9205J7272J4554J1069P342M544L245K734K108J355P42
61179I01235j49j875m172o336q213j0022j1561j2306j2190j1736j1478j1666j2286
61166G87245j3040j3523j3807j4386j5260j5591j4783j3371j2238j1384j0244
61155F39618q798p457o072m011j336R88K303L035L808M299L464Q33k817o066p997
61140F13794q682q716q534q192p602o646n129l038p86J177L011N280P953J0124
$$ plain form
61126 584014 595152 606710 619259 633761 650385 668332 686757 705712 726036 748329 772153
61115 772153 796465 820684 844960 869381 893526 917030 939980 962190 982555 999861 1014092
61104 1014092 1026269 1037089 1046276 1053091 1056724 1056193 1050753 1040728 1027342 1011379 992586 970719
61092 970719 946559 921372 895808 869970 844205 819120 794905 771308 748406 726854 707187
61081 707187 689327 673069 658614 646233 635629 626176 617770 611000 606253 602929 599884 596529 593241
61068 593241 590669 588939 587736 587012 587294 589093 592195 595831 599625 604040 609738 616829 625060 634380 644800
61053 644800 655916 667349 679630 693865 710321 728150 746805 766859 788834 812075 835614
61042 835614 859518 884480 910585 937437 965162 994179 1024167 1054288 1084464 1115499 1147843
$$ packed form
61126E84014J1138J1558J2549J4502J6624J7947J8425J8955K0324K2293K3824
61115G72153K4312K4219K4276K4421K4145K3504K2950K2210K0365J7306J4231
61104A014092J2177J0820R187O815L633n31n440j0025j3386j5963j8793k1867
61092I70719k4160k5187k5564k5838k5765k5085k4215k3597k2902k1552j9667
61081G07187j7860j6258j4455j2381j0604r453q406o770m747l324l045l355l288
61068E93241k572j730j203p24K82J799L102L636L794M415N698P091Q231R320J0420
61053F44800J1116J1433J2281J4235J6456J7829J8655K0054K1975K3241K3539
61042H35614K3904K4962K6105K6852K7725K9017K9988L0121L0176L1035L2344
$$ plain form
61031 1147843 1181034 1214511 1248306 1282918 1319060 1357477 1398401 1441256 1485301 1530312 1576238
61020 1576238 1622953 1671229 1723310 1781605 1847507 1922472 2009262 2110653 2227879 2362075 2516509
61009 2516509 2695768 2904204 3147971 3437918 3788030 4212640 4729469 5364819 6150447
61000 6150447 7112819 8265942 9610238 11131396 12805104 14618674 16587830 18719701
60992 18719701 20921762 22948595 24482701 25315792 25474017 25176686 24689711 24222950 23924425
60983 23924425 23885581 24080217 24295857 24182343 23433049 21960424 19921968 17599431 15255858
60974 15255858 13069173 11136224 9493320 8131287 7014646 6103737 5364706 4766478
60966 4766478 4279410 3880279 3553783 3287220 3067244 2882738 2726690 2593365 2476616
$$ packed form
61031A147843L3191L3477L3795L4612L6142L8417M0924M2855M4045M5011M5926
61020A576238M6715M8276N2081N8295O5902P4965Q6790J01391J17226J34196J54434
61009B516509J79259K08436K43767K89947L50112M24610N16829O35350P85628
61000F150447R62372J153123J344296J521158J673708J813570J969156K131871
60992A8719701K202061K026833J534106Q33091J58225k97331m86975m66761k98525
60983B3924425l8844J94636K15640j13514p49294j472625k038456k322537k343573
60974A5255858k186685j932949j642904j362033j116641r10909p39031n98228
60966D766478m87068l99131l26496k66563k19976j84506j56048j33325j16749
$$ plain form
60957 2476616 2372393 2279999 2199210 2128269 2065654 2011305 1964831 1924537 1889173 1858350 1830185
60946 1830185 1800817 1767531 1730456 1690282 1646623 1599895 1552526 1506546 1461586 1416637 1372101
60935 1372101 1328678 1285853 1243116 1201368 1161698 1123959 1087761 1053631 1021937 991897 962868
60924 962868 935474 910377 887146 865367 845581 827956 811328 794811 779161 765413 753319
60913 753319 742301 732632 724378 716428 708039 700374 695122 692367 691009 690288 689754 688763 687284 686332 686368
60898 686368 686109 684020 680079 675071 669300 663130 657543 652734 647269 640178 632880 627484 624047 621073
60884 621073 617808 614346 610217 604814 598794 593361 588370 582626 575812 568767 562056 555592 549431 543689
60870 543689 537918 531662 525403 519917 515139 510723 507169 505159 504166 503032 501582 500520 500110 500136 500725
$$ packed form
60957B476616j04223r2394q0789p0941o2615n4349m6474m0294l5364l0823k8165
60946A830185k9368l3286l7075m0174m3659m6728m7369m5980m4960m4949m4536
60935A372101m3423m2825m2737m1748l9670l7739l6198l4130l1694l0040k9029
60924I62868k7394k5097k3231k1779j9786j7625j6628j6517j5650j3748j2094
60913G53319j1018r669q254p950q389p665n252k755j358p21n34r91j479r52L6
60898F86368k59k089l941n008n771o170n587m809n465p091p298n396l437k974
60884F21073l265l462m129n403o020n433m991n744o814p045o711o464o161n742
60870E43689n771o256o259n486m778m416l554k010r93j134j450j062m10K6N89
$$ plain form
60855 500725 501869 502480 501334 498839 496653 495625 495239 494954 494881 495152 495593 496018 496026 494760 491792 488009 484658
60838 484658 481817 478645 474785 470527 465970 461139 456629 453098 450326 447752 445620 444687 445102 446509 448811
60823 448811 451808 454602 456469 457883 459546 460881 460743 459177 457183 455128 452778 450554 449287 448833 448308
60808 448308 447541 446989 446365 444783 442186 439329 436491 433557 431196 430323 430362 429581 427343 424542 421646 417986
60792 417986 413354 408744 404847 401138 397118 393234 389869 386537 382865 379468 377108 375708 374784 374136 373548
60777 373548 372468 370622 368467 366655 365461 364996 365380 366434 367637 368689 369798 371372 373819 377546 382546
60762 382546 388025 392990 397132 400676 403653 406058 408398 411221 414243 416829 419149 421877 424871 427183
60748 427183 428362 428717 428411 427374 426221 426021 426776 427097 425680 422380 417676 412009 405894 399836 393826
$$ packed form
60855E00725J144O11j146k495k186j028l86k85p3K71M41M25Qj266k968l783l351
60838D84658k841l172l860m258m557m831m510l531k772k574k132r33M15J407K302
60823D48811K997K794J867J414J663J335j38j566j994k055k350k224j267m54n25
60808D48308p67n52o24j582k597k857k838k934k361q73L9p81k238k801k896l660
60792D17986m632m610l897l709m020l884l365l332l672l397k360j400r24o48n88
60777C73548j080j846k155j812j194m65L84J054J203J052J109J574K447L727N000
60762C82546N479M965M142L544K977K405K340K823L022K586K320K728K994K312
60748D27183J179L55l06j037j153k00P55L21j417l300m704n667o115o058o010
$$ plain form
60733 393826 387539 381096 374940 369042 363104 357441 352706 348752 344856 341159 338715 337876 337649 337031 336011
60718 336011 334958 333923 332897 331941 330807 329241 327811 327484 328162 328646 328305 327829 327975 328586 329275 330179 331469
60701 331469 332929 334415 336070 337699 338692 338954 339242 340231 341875 343939 346452 349365 352428 355699 359551
60686 359551 363992 368647 373461 378654 383907 388510 392504 396762 401687 406673 411124 415137 418901 422268
60672 422268 425194 427791 429739 430534 430451 430285 429914 428191 424598 419942 415072 410030 405007 400940 398355
60657 398355 396498 394321 391647 388767 385747 382879 381034 380768 381534 382443 383339 384586 386199 387672 388366
60642 388366 387744 385690 382808 379972 377411 374745 371875 369103 366384 363409 360601 358987 358761 358932 358723
60627 358723 358408 358315 358075 357452 357093 357794 359625 362206 365191 368068 370216 371573 372629 373498 373758 373401 373034
$$ packed form
60733C93826o287o443o156n898n938n663m735l954l896l697k444q39k27o18j020
60718C36011j053j035j026r56j134j566j430l27O78M84l41m76J46O11O89R04J290
60701C31469J460J486J655J629R93K62K88R89J644K064K513K913L063L271L852
60686C59551M441M655M814N193N253M603L994M258M925M986M451M013L764L367
60672D22268K926K597J948P95q3j66l71j723l593m656m870n042n023m067k585
60657C98355j857k177k674k880l020k868j845k66P66R09Q96J247J613J473O94
60642C88366o22k054k882k836k561k666k870k772k719k975k808j614k26J71k09
60627C58723l15r3k40o23l59P01J831K581K985K877K148J357J056Q69K60l57l67
$$ plain form
60610 373034 372875 372465 371682 371005 370507 369678 368669 368527 369629 371015 371873 372564 373517 374315 374665 375191 376384
60593 376384 377810 379211 381313 384544 387962 390567 392709 395063 397041 397553 396754 395810 395368 395333 395699 396503
60577 396503 397319 397852 398776 401067 404746 409107 413936 419685 426664 434823 444140 454603 465989 478156
60563 478156 491286 505418 520086 534724 548858 561504 571140 576911 579211 578548 574606 567199 557428
60550 557428 547042 537219 528708 522428 518893 517484 517262 518208 521007 526042 533361 543177 555637 570488
60536 570488 587576 607192 629275 652832 676793 700724 723876 744276 759826 769867 774793 774770
60524 774770 769843 760839 749028 735254 720365 705993 693694 683480 674289 665731 658398 652605 647939
60511 647939 644146 641580 640615 641329 643753 647846 653330 660135 668933 680714 696038 715248 739019 768035
$$ packed form
60610C73034j59m10p83o77m98q29j009j42J102J386Q58O91R53P98L50N26J193
60593C76384J426J401K102L231L418K605K142K354J978N12p99r44m42l5L66Q04
60577C96503Q16N33R24K291L679M361M829N749O979Q159R317J0463J1386J2167
60563D78156J3130J4132J4668J4638J4134J2646R636N771K300o63l942p407r771
60550E57428j0386r823q511o280l535j409k22R46K799N035P319R816J2460J4851
60536E70488J7088J9616K2083K3557K3961K3931K3152K0400J5550J0041M926k3
60524G74770m927r004j1811j3774j4889j4372j2299j0214r191q558p333n793m666
60511F47939l793k566r65P14K424M093N484O805Q798J1781J5324J9210K3771K9016
$$ plain form
60497 768035 802397 841970 886966 937464 992687 1051460 1112985 1176239 1238866 1297597 1349795
60486 1349795 1394011 1429192 1454057 1467140 1466872 1451911 1422200 1379625 1327115 1267162 1201610 1132479
60474 1132479 1062214 993285 927957 868114 814708 767608 726308 690330 658687 629872 603215
60463 603215 579592 559910 543541 529143 516348 505513 496270 487571 478956 470783 463436 457172 452402
60450 452402 449056 445974 441973 437343 433318 430343 427902 425741 424119 422960 421885 420996 420580 420143 418927
60435 418927 417318 416596 417207 418382 419534 420833 422186 422825 422354 421238 419836 417805 414921 411775 409153
60420 409153 407235 405789 404728 404220 404550 405996 408447 411158 413249 414441 415050 415531 416393 418114 420457
60405 420457 422233 422503 421785 421299 421375 421438 421273 421258 421503 421808 422484 424138 426568 428782 430317 431706 433515
$$ packed form
60497G68035L4362L9573M4996N0498N5223N8773O1525O3254O2627N8731N2198
60486A349795M4216L5181K4865J3083k68j4961k9711m2575n2510n9953o5552o9131
60474A132479p0265o8929o5328n9843n3406m7100m1300l5978l1643k8815k6657
60463F03215k3623j9682j6369j4398j2795j0835r243q699q615q173p347o264m770
60450D52402l346l082m001m630m025k975k441k161j622j159j075q89m16m37j216
60435D18927j609p22O11J175J152J299J353O39m71j116j402k031k884l146k622
60420D09153j918j446j061n08L30J446K451K711K091J192O09M81Q62J721K343
60405D20457J776K70p18m86P6O3j65j5K45L05O76J654K430K214J535J389J809
$$ plain form
60388 433515 435761 438363 441340 444364 446917 449062 451338 453755 455682 456921 458164 460085 462541 464893
60374 464893 466685 467930 469172 471197 474181 477230 479369 480734 482096 483458 484100 483933 483823 484466 485734
60359 485734 487293 489038 490848 492699 495198 499267 505155 512371 520561 529681 539370 549070 558851 569125
60345 569125 579344 587877 593554 596539 597364 595913 591820 585288 577066 567988 558807 550087 542077 534884
60331 534884 528695 523407 518350 513027 507942 503942 500932 498077 495132 492626 490711 488885 487025 485705
60317 485705 485221 485149 485164 485585 486814 489008 492501 497855 505253 514523 525866 539781 556174 574355 594108
60302 594108 615845 639430 663697 687406 709694 729178 743588 751024 751030 744004 730303 710596 686566
60289 686566 660543 634606 610273 588510 569592 553240 539295 527940 519032 511645 504687 497806
$$ packed form
60388D33515K246K602K977L024K553K145K276K417J927J239J243J921K456K352
60374D64893J792J245J242K025K984L049K139J365J362J362O42j67j10O43J268
60359D85734J559J745J810J851K499M069N888P216Q190R120R689R700R781J0274
60345E69125J0219Q533N677K985Q25j451m093o532q222r078r181q720q010p193
60331E34884o189n288n057n323n085m000l010k855k945k506j915j826j860j320
60317D85705m84p2J5M21J229K194L493N354P398R270J1343J3915J6393J8181J9753
60302E94108K1737K3585K4267K3709K2288J9484J4410P436Op026j3701j9707k4030
60289F86566k6023k5937k4333k1763j8918j6352j3945j1355q908p387o958o881
$$ plain form
60277 497806 491423 486058 481734 477889 473903 469852 466557 464576 463400 462138 460702 459678 459239 458913 458364
60262 458364 457694 456987 456208 455562 455284 455113 454593 453836 453341 453174 453105 453442 454827 457194 459660 461531 462729
60245 462729 463321 463493 463890 465071 466514 466996 466048 464322 462669 461724 462193 464320 466992 468533 468699 468879
60229 468879 470161 472240 474477 476900 479687 482555 485151 487379 489185 490756 492929 496373 500287 503091
60215 503091 504648 506627 510318 515295 520688 526535 533149 540165 547012 553590 559902 565667 570758 575376
60201 575376 579520 583062 586480 590450 594430 596827 597035 596179 595292 593933 591288 587581 583624 579847 576451
60186 576451 573640 571106 568213 565238 563386 562901 562294 560222 557095 553979 551037 548098 545706 544396 543695
60171 543695 542950 542407 542394 542246 541325 540433 540822 542197 543023 542680 542051 541948 542084 541777 540905 539953 539570 540156 541472
$$ packed form
60277D97806o383n365m324l845l986m051l295j981j176j262j436j024m39l26n49
60262D58364o70p07p79o46k78j71n20p57m95j67o9L37J385K367K466J871J198
60245D62729N92J72L97J181J443M82r48j726j653r45M69K127K672J541J66J80
60229D68879J282K079K237K423K787K868K596K228J806J571K173L444L914K804
60215E03091J557J979L691M977N393N847O614P016O847O578O312N765N091M618
60201E75376M144L542L418L970L980K397K08q56q87j359k645l707l957l777l396
60186E76451k811k534k893k975j852m85o07k072l127l116k942k939k392j310p01
60171E43695p45n43j3j48r21q92L89J375Q26l43o29j03J36l07q72r52l83N86J316
$$ plain form
60152 541472 542794 543735 544689 546168 548113 550233 552555 555212 558086 561116 564558 568509 572639 576772 581206
60137 581206 586083 591024 595907 601344 607775 614611 620845 626148 630828 635186 639332 643083 645649 646064
60123 646064 644551 642785 642193 642515 642628 642196 641820 641990 642540 642773 641833 639445 636665 635162 635332 635849 635475
60106 635475 634314 632715 630129 626092 621442 617353 613833 610250 606727 603870 601535 599077 596580 594823
60092 594823 594185 594510 595812 598285 601774 606032 611194 617190 622921 626973 629078 630210 631349 632782 634344
60077 634344 635587 635804 634480 631638 627286 620934 612326 602314 592330 583121 574600 566581 559083 552113
60063 552113 545786 540450 536168 532342 528327 524189 520386 517059 514077 511396 508895 506315 503814 502104
60049 502104 501531 501614 502008 503224 505707 508818 511621 514129 516952 520127 523173 525861 528097 529417 529468 528685
$$ packed form
60152E41472J322R41R54J479J945K120K322K657K874L030L442L951M130M133M434
60137E81206M877M941M883N437O431O836O234N303M680M358M146L751K566M15
60123F46064j513j766n92L22J13m32l76J70N50K33r40k388k780j503J70N17l74
60106F35475j161j599k586m037m650m089l520l583l523k857k335k458k497j757
60092E94823o38L25J302K473L489M258N162N996N731M052K105J132J139J433J562
60077F34344J243K17j324k842m352o352q608j0012r984r209q521q019p498o970
60063E52113o327n336m282l826m015m138l803l327k982k681k501k580k501j710
60049E02104n73Q3L94J216K483L111K803K508K823L175L046K688K236J320N1p83
$$ plain form
60033 528685 527714 526470 524496 521865 518935 515569 511468 506984 502713 498541 493878 488660 483344 478108
60019 478108 472839 467756 463329 459601 456169 452712 449095 445158 440935 436856 433349 430552 428632 427800
60005 427800 427632 427074 425689 424262 423615 423573 423747 424431 425912 427652 429091 430506 432181 433484 433862 434038
59989 434038 435066 436888 438942 441491 444991 448754 451693 453925 456190 458086 458419 457142 455401 453768
59975 453768 451877 449767 448087 446799 445115 442984 441428 441110 441667 442694 444214 445960 447340 448506 450365
59960 450365 453102 455580 456707 456652 456340 456387 456846 457389 457451 456687 455493 454663 454540 454928 455605 456351 456683 456272
59942 456272 455458 454654 453519 451513 448974 446730 444839 442733 440518 439077 438899 439742 441491 444331 447956
59927 447956 451520 454636 457730 461328 465657 470923 477193 483984 490647 497119 503710 510420 517147 524199
$$ packed form
60033E28685r71j244j974k631k930l366m101m484m271m172m663n218n316n236
60019D78108n269n083m427l728l432l457l617l937m223m079l507k797j920q32
60005D27800j68n58j385j427o47m2J74O84J481J740J439J415J675J303L78J76
59989D34038J028J822K054K549L500L763K939K232K265J896L33j277j741j633
59975D53768j891k110j680j288j684k131j556l18N57J027J520J746J380J166J859
59960D50365K737K478J127n5l12M7M59N43O2p64j194q30j23L88O77P46L32m11
59942D56272q14q04j135k006k539k244j891k106k215j441j78Q43J749K840L625
59927D47956L564L116L094L598M329N266O270O791O663O472O591O710O727P052
$$ plain form
59913 524199 531635 538396 543179 546017 547943 549348 549829 549530 549255 549188 548729 547824 547164 546764 545568 542961
59897 542961 539741 537094 535381 534279 533403 532532 531840 532061 533770 536558 539632 543033 547256 551784 555295
59882 555295 557515 559668 562754 566507 570469 574961 580370 586303 592024 597098 601191 603862 604949 604650
59868 604650 603078 600331 597024 593955 591097 587753 583852 580289 577739 575887 574018 571686 568748 565538
59854 565538 563081 562270 562754 563493 564423 566541 570292 575073 580623 587760 597128 608042 618914 628043 633856
59839 633856 635513 633789 630522 626894 623186 620348 620280 623624 628287 631174 630826 627691 622587 615942 608173
59824 608173 599863 591468 583291 575633 568766 562867 558032 554130 550711 547489 544837 543273 542513 541639 540183
59809 540183 538443 536768 535270 534170 533599 533052 531801 529883 527894 525855 523245 520201 517582 515614 513479
$$ packed form
59913E24199P436O761M783K838J926J405M81k99k75o7m59r05o60m00j196k607
59897E42961l220k647j713j102q76q71o92K21J709K788L074L401M223M528L511
59882E55295K220K153L086L753L962M492N409N933N721N074M093K671J087k99
59868F04650j572k747l307l069k858l344l901l563k550j852j869k332k938l210
59854E65538k457q11M84P39R30K118L751M781N550P137R368J0914J0872R129N813
59839F33856J657j724l267l628l708k838o8L344M663K887l48l135n104o645p769
59824F08173q310q395q177p658o867n899m835l902l419l222k652j564p60q74j456
59809E40183j740j675j498j100n71n47j251j918j989k039k610l044k619j968k135
$$ plain form
59794 513479 510612 507542 505044 503241 501828 500486 498758 496220 493035 489819 486919 484437 482836 482622
59780 482622 483413 484218 484670 485080 485363 485031 484325 484209 485067 486455 488310 491236 495365 500039 504782 509523
59764 509523 513768 516898 519490 522878 527045 530460 532548 534724 538111 541724 544007 545069 546256 548380
59750 548380 551382 555011 558883 562458 565717 569311 573491 577593 581076 584292 587600 590557 592613 593851
59736 593851 594410 593927 592249 589997 587860 585913 584114 582714 581714 580651 579366 578198 577100 575456 573189
59721 573189 571047 569333 567461 565237 563452 562492 561535 559860 557856 555955 553737 551099 549156 548829 549446
59706 549446 549888 550295 551452 553258 555071 557024 559744 563058 566083 568363 570067 571316 572172 573004 574093
59691 574093 575080 575437 575225 574899 574709 574726 574991 575197 574753 573660 572722 572371 571908 570448 567975 564926 561339
$$ packed form
59794E13479k867l070k498j803j413j342j728k538l185l216k900k482j601k14
59780D82622P91Q05M52M10K83l32p06j16Q58J388J855K926M129M674M743M741
59764E09523M245L130K592L388M167L415K088K176L387L613K283J062J187K124
59750E48380L002L629L872L575L259L594M180M102L483L216L308K957K056J238
59736E93851N59m83j678k252k137j947j799j400j000j063j285j168j098j644k267
59721E73189k142j714j872k224j785r60r57j675k004j901k218k638j943l27O17
59706E49446M42M07J157J806J813J953K720L314L025K280J704J249Q56Q32J089
59691E74093R87L57k12l26j90J7K65K06m44j093r38l51m63j460k473l049l587
$$ plain form
59674 561339 557069 552256 547007 541153 534862 528884 523686 518938 514343 510312 507325 505332 504199 503999
59660 503999 504401 504632 504574 505027 506367 507886 509066 510468 512653 515239 517807 520729 524149 527093 528635
59645 528635 529160 529480 529441 528379 526280 523496 520002 515891 512021 509195 507191 505425 503957 503071 502543 502131
59629 502131 502084 502358 502033 500417 498004 495435 492341 488228 483790 480189 477573 475340 473326 471722 470251
59614 470251 468418 466258 464160 462454 461738 462779 465326 467866 469416 470738 472908 475680 478259 480701
59600 480701 483282 485422 486559 487249 488082 488360 487404 486418 487273 489833 492144 493065 493170 493197 493110 492776 492291 491500
59582 491500 490237 488976 488350 488144 487656 486756 485629 483920 481289 478498 476652 475559 474072 471919 469982
59567 469982 468774 467815 466626 465342 464180 463198 462662 462918 463897 465304 467127 469338 471433 473014 474425
$$ packed form
59674E61339m270m813n249n854o291n978n198m748m595m031k987j993j133k00
59660E03999M02K31n8M53J340J519J180J402K185K586K568K922L420K944J542
59645E28635N25L20l9j062k099k784l494m111l870k826k004j766j468q86n28m12
59629E02131m7K74l25j616k413k569l094m113m438l601k616k233k014j604j471
59614D70251j833k160k098j706p16J041K547K540J550J322K170K772K579K442
59600D80701K581K140J137O90Q33K78r56r86Q55K560K311R21J05K7q7l34m85p91
59582D91500j263j261o26k06m88r00j127j709k631k791j846j093j487k153j937
59567D69982j208r59j189j284j162r82n36K56R79J407J823K211K095J581J411
$$ plain form
59552 474425 476070 477582 478574 479709 481959 485170 488469 491817 496050 501593 508320 516643 527501 541002
59538 541002 555957 571271 587298 605381 625762 645632 659550 663048 656479 644722 632800 622782
59526 622782 615001 610162 608705 609506 611025 612954 615286 616742 615968 613595 611223 608821 604979 599335 592855
59511 592855 585763 577108 566633 555522 544991 535409 526925 519692 513294 507108 501363 496824 493511
59498 493511 490758 488376 486558 484829 482394 479501 477236 475913 474790 473362 471866 470616 469889 470289 472086
59483 472086 474404 476165 477549 479349 481339 482784 484282 487394 492457 498262 503914 509483 514765 519054
59469 519054 522453 525918 529622 532607 534419 535754 537182 538544 540045 542647 546804 551915 557514 563975
59455 563975 571588 579891 588391 597119 606038 614653 622507 629447 635241 639607 642555 643931 642737 637943
$$ packed form
59552D74425J645J512R92J135K250L211L299L348M233N543O727Q323J0858J3501
59538E41002J4955J5314J6027J8083K0381J9870J3918L498o569j1757j1922j0018
59526F22782p781m839j457Q01J519J929K332J456p74k373k372k402l842n644o480
59511E92855p092q655j0475j1111j0531r582q484p233o398o186n745m539l313
59498D93511k753k382j818j729k435k893k265j323j123j428j496j250p27M00J797
59483D72086K318J761J384J800J990J445J498L112N063N805N652N569N282M289
59469E19054L399L465L704K985J812J335J428J362J501K602M157N111N599O461
59455E63975P613Q303Q500Q728Q919Q615P854O940N794M366K948J376j194m794
$$ plain form
59441 637943 630002 620647 611180 601915 593179 585598 579173 573179 567369 562466 559229 557829 558222 560347
59427 560347 563758 567849 572665 578921 587228 597791 610609 625310 640991 656996 673687 691912
59415 691912 711940 733278 755027 776063 795713 814531 832885 847860 853431 845676 826942 803501
59403 803501 780459 760609 746214 738679 737093 739880 747318 759376 771419 775619 767695 749937 727312
59390 727312 703402 680715 661592 646674 634328 623254 614269 608450 605057 602599 600645 599459 598982
59377 598982 599134 600114 601685 603156 604582 606767 609634 611937 613115 614112 615840 618201 621134 625155 630156
59362 630156 635049 639341 643878 649435 655818 662808 670626 679002 687166 695345 704827 716014 727869 739849
59348 739849 752797 767284 782586 798043 813821 829546 843766 855683 865965 874887 881173 883650
$$ packed form
59441F37943p941r355r467r265q736p581o425n994n810m903l237j400L93K125
59427E60347L411M091M816O256Q307J0563J2818J4701J5681J6005J6691J8225
59415F91912K0028K1338K1749K1036J9650J8818J8354J4975N571p755j8734k3441
59403H03501k3042j9850j4395p535j586K787P438J2058J2043M200p924j7758k2625
59390G27312k3910k2687j9123j4918j2346j1074q985n819l393k458j954j186m77
59377E98982J52R80J571J471J426K185K867K303J178R97J728K361K933M021N001
59362F30156M893M292M537N557O383O990P818Q376Q164Q179R482J1187J1855J1980
59348G39849J2948J4487J5302J5457J5778J5725J4220J1917J0282Q922O286K477
$$ plain form
59336 883650 882693 879009 872411 862894 851585 839411 825909 810482 793813 776996 760282 743750
59324 743750 728300 714890 703418 693170 683715 674789 666155 658117 651319 645621 640078 634342 628955
59311 628955 624016 618951 614001 610420 608658 607805 607418 608290 610800 614216 618458 624784 633643 643540 653325
59296 653325 664062 677113 691398 703713 710766 710146 700947 685016 666531 648902 632708 617425
59284 617425 603841 593503 586887 583511 583016 584972 588392 592635 598169 605597 614662 624955 636594
59271 636594 649398 662350 674735 686913 699191 710900 721279 730151 737025 740739 740875 738441 734464
59258 734464 729079 722592 715890 708955 700589 690694 681236 673739 667346 660764 654640 650419 648043 646417
59244 646417 645198 644751 645268 647243 651774 658960 666888 673567 679068 684601 690443 696041 701175 705644 708620
$$ packed form
59336H83650r57l684o598r517j1309j2174j3502j5427j6669j6817j6714j6532
59324G43750j5450j3410j1472j0248r455q926q634q038o798n698n543n736n387
59311F28955m939n065m950l581j762q53l87Q72K510L416M242O326Q859R897R785
59296F53325J0737J3051J4285J2315P053o20r199j5931j8485j7629j6194j5283
59284F17425j3584j0338o616l376m95J956L420M243N534P428R065J0293J1639
59271F36594J2804J2952J2385J2178J2278J1709J0379Q872O874L714J36k434l977
59258G34464n385o487o702o935q366r895r458p497o393o582o124m221k376j626
59244F46417j219m47N17J975M531P186P928O679N501N533N842N598N134M469K976
$$ plain form
59229 708620 709605 709257 708176 705728 701145 694865 687728 679842 671375 663345 656409 649867 642995 636286 630252
59214 630252 624226 617625 611231 605813 600661 594902 589150 584362 580173 575871 571970 569272 567404 565815
59200 565815 565131 565874 566886 566844 566473 567380 569453 571279 572559 574261 576696 579112 581023 582602 583978 585343
59184 585343 587354 590406 593925 597327 600937 605068 609070 612384 615642 619671 624375 629653 636217 644233
59170 644233 652357 659527 666580 674672 683282 691301 698858 706383 712969 717409 719843 720740 719312 714759
59156 714759 708005 700350 691401 680305 668041 656422 645606 634627 623688 613892 605354 597492 590571
59143 590571 584967 579594 572988 565465 558309 551552 544490 537742 532675 529212 526236 523714 522496 522477 522931
59128 522931 524153 526800 530099 532780 535363 539463 545226 551585 558613 567403 577805 588503 599255
$$ packed form
59229G08620R85l48j081k448m583o280p137p886q467q030o936o542o872o709o034
59214F30252o026o601o394n418n152n759n752m788m189m302l901k698j868j589
59200E65815o84P43J012m2l71R07K073J826J280J702K435K416J911J579J376J365
59184E85343K011L052L519L402L610M131M002L314L258M029M704N278O564Q016
59170F44233Q124P170P053Q092Q610Q019P557P525O586M440K434Q97j428m553
59156G14759o754p655q949j1096j2264j1619j0816j0979j0939r796q538p862o921
59143E90571n604n373o606p523p156o757p062o748n067l463k976k522j218j9M54
59128E22931J222K647L299K681K583M100N763O359P028Q790J0402J0698J0752
$$ plain form
59115 599255 610994 623720 636277 648212 660021 671624 682455 692910 703835 714708 724145 731977
59103 731977 738960 744783 748429 750278 751665 752384 750795 746481 740805 734775 728437 722482 718310 716049
59089 716049 714313 712217 710011 707725 704988 702259 700350 698527 694877 688750 681192 672979 664047 654919
59075 654919 646726 639567 632589 625840 620260 615746 611024 605643 600357 595437 590420 585653 582134 579602
59061 579602 576626 572832 569266 566367 563453 560449 558251 556979 555709 554298 553673 553928 553854 552860 551770
59046 551770 551339 551475 552159 553495 554646 554387 553047 552291 552754 553466 553807 554276 555101 555853 556798 558988 562662
59029 562662 567095 572194 578587 586003 593385 600911 610140 621815 635114 649242 663983 678365 690617
59016 690617 699941 706789 711166 712346 710493 706877 702196 696343 689999 684689 680996 678414 677087 677876
$$ packed form
59115E99255J1739J2726J2557J1935J1809J1603J0831J0455J0925J0873R437P832
59103G31977O983N823L646J849J387P19j589m314n676o030o338n955m172k261
59089G16049j736k096k206k286k737k729j909j823l650o127p558q213q932r128
59075F54919q193p159o978o749n580m514m722n381n286m920n017m767l519k532
59061E79602k976l794l566k899k914l004k198j272j270j411o25K55p4r94j090
59046E51770m31J36O84J336J151k59j340p56M63P12L41M69Q25P52R45K190L674
59029E62662M433N099O393P416P382P526R229J1675J3299J4128J4741J4382J2252
59016F90617R324O848M377J180j853l616m681n853o344n310l693k582j327P89
$$ plain form
59002 677876 680555 683849 687517 692542 699022 705780 712253 718792 724903 729310 732139 734883 737739 739058
58988 739058 737951 735365 732009 727303 721078 714398 708013 701799 696241 692541 690726 689638 689334 691449
58974 691449 696564 703345 710960 720182 731223 742563 753026 763223 774012 785252 796903 809573
58962 809573 823010 835655 846445 855592 863115 868329 871257 872592 871672 866488 856409 843038 827745
58949 827745 810442 791461 772476 754571 737361 720894 706469 694668 684456 675164 667480 661687
58937 661687 656817 652361 648841 645962 642403 638324 635804 635649 635942 634940 633316 632243 631318 629770 627924
58922 627924 626114 623848 621203 619277 618223 616742 614586 613466 614303 615675 616403 617579 620435 624104 627182
58907 627182 629898 633206 637312 642560 650231 660892 673285 686100 699516 713897 728566 743009
$$ packed form
59002F77876K679L294L668N025O480O758O473O539O111M407K829K744K856J319
58988G39058j107k586l356m706o225o680o385o214n558l700j815j088l04K115
58974F91449N115O781P615R222J1041J1340J0463J0197J0789J1240J1651J2670
58962H09573J3437J2645J0790R147P523N214K928J335r20n184j0079j3371j5293
58949H27745j7303j8981j8985j7905j7210j6467j4425j1801j0212r292p684n793
58937F61687m870m456l520k879l559m079k520j55K93j002j624j073r25j548j846
58922F27924j810k266k645j926j054j481k156j120Q37J372P28J176K856L669L078
58907F27182K716L308M106N248P671J0661J2393J2815J3416J4381J4669J4443
$$ plain form
58895 743009 757702 772678 786970 800598 815386 832607 851540 871414 892872 916201 939951
58884 939951 962575 983751 1002795 1017686 1027071 1031576 1032015 1028183 1020501 1010714 999455 985169 966982
58871 966982 946695 926532 907014 888597 873070 861312 851577 841971 832906 825266 818069 809973 801434
58858 801434 793344 785084 775842 766300 757166 747601 736986 726690 718156 710666 702817 694709 686877 678691
58844 678691 669741 661318 654509 648209 640850 632687 624617 616285 607282 598724 591738 585801 580427 576806
58830 576806 575777 575747 574769 573260 572641 572813 573159 574545 577952 582268 585742 588655 592471 597414 602744 608280
58814 608280 613686 617517 618982 619548 620926 622714 623840 624808 626355 627347 626405 624453 623335 622895 621651
58799 621651 619333 616616 613317 608998 604419 600382 596099 590725 585425 581824 579435 576681 573494 570895
$$ packed form
58895G43009J4693J4976J4292J3628J4788J7221J8933J9874K1458K3329K3750
58884I39951K2624K1176J9044J4891R385M505M39l832p682r787j1259j4286j8187
58871I66982k0287k0163j9518j8417j5527j1758r735r606r065p640p197q096q539
58858H01434q090q260r242r542r134r565j0615j0296q534p490p849q108p832q186
58844F78691q950q423o809o300p359q163q070q332r003q558o986n937n374l621
58830E76806j029l0r78j509o19J72L46J386L407M316L474K913L816M943N330N536
58814F08280N406L831J465N66J378J788J126R68J547R92r42j952j118m40j244
58799F21651k318k717l299m319m579m037m283n374n300l601k389k754l187k599
$$ plain form
58785 570895 569038 567744 567936 570349 573753 576508 579028 582711 587376 591764 595659 599479 602655 604294
58771 604294 604607 603913 601288 596055 589591 583785 578758 573715 568756 564080 558879 553021 548381 546487 546251
58756 546251 546083 546587 548903 551986 554090 555553 557594 559743 561068 562661 566177 571011 575538 580077 585964
58741 585964 592781 599233 605830 613974 623165 631688 639309 646899 654285 660955 667953 676610 686186 695151
58727 695151 703695 712587 720746 726656 731113 735862 740480 743413 745161 747700 751624 756497 762949 771474
58713 771474 780069 786085 789747 793075 796147 797317 796280 793836 789261 780980 769390 756226 741688
58700 741688 725006 707096 689659 672201 653016 632710 613830 597377 582492 569150 558313
58689 558313 549775 542551 536952 533576 530907 526733 521387 516818 513119 508933 504551 501551 499851 498174
$$ packed form
58785E70895j857j294J92K413L404K755K520L683M665M388L895L820L176J639
58771F04294L13o94k625n233o464n806n027n043m959m676n201n858m640j894k36
58756E46251j68N04K316L083K104J463K041K149J325J593L516M834M527M539N887
58741E85964O817O452O597Q144R191Q523P621P590P386O670O998Q657R576Q965
58727F95151Q544Q892Q159N910M457M749M618K933J748K539L924M873O452Q525
58713G71474Q595O016L662L328L072J170j037k444m575q281j1590j3164j4538
58700G41688j6682j7910j7437j7458j9185k0306j8880j6453j4885j3342j0837
58689E58313q538p224n599l376k669m174n346m569l699m186m382l000j700j677
$$ plain form
58675 498174 496973 497909 500850 504252 507987 513005 518912 524891 532226 542766 555658 568783 582498
58662 582498 598414 615187 629226 639098 645655 648451 646018 639469 631890 624093 614567 603551 593369
58649 593369 584656 576016 567548 561005 556260 551330 546184 542912 541858 541262 540958 542652 546106 548912 550666
58634 550666 553591 558269 562303 564086 564472 563982 561876 558877 557433 558219 559371 559910 560931 562811 564467
58619 564467 566043 569182 573951 578534 582529 587407 593268 598329 602123 605875 609261 610266 608908 607669
58605 607669 607456 606453 603726 600574 597666 594171 590483 588350 587525 585683 582468 580191 579755 579413 578524
58590 578524 578964 581731 585606 590352 597799 608399 619893 630707 641712 653509 664921 675225 685069
58577 685069 694303 701767 707890 714498 721549 727239 731808 737815 746121 755229 765261 778750 796559
$$ packed form
58675D98174j201R36K941L402L735N018N907N979P335J0540J2892J3125J3715
58662E82498J5916J6773J4039R872O557K796k433o549p579p797r526j1016j0182
58649E93369q713q640q468o543m745m930n146l272j054n96l04J694L454K806J754
58634E50666K925M678M034J783L86m90k106k999j444P86J152N39J021J880J656
58619E64467J576L139M769M583L995M878N861N061L794L752L386J005j358j239
58605F07669k13j003k727l152k908l495l688k133q25j842l215k277m36l42q89
58590E78524M40K767L875M746P447J0600J1494J0814J1005J1797J1412J0304R844
58577F85069R234P464O123O608P051N690M569O007Q306R108J0032J3489J7809
$$ plain form
58564 796559 816663 837966 861679 887847 914148 939217 963612 986489 1005036 1018341 1028242 1035279
58552 1035279 1037550 1034611 1028751 1021275 1011388 999859 989614 981221 971755 959739 947295 935803 923333
58539 923333 908209 891391 873602 853821 832490 812625 795938 781133 767507 756602 748803 742098
58527 742098 735899 732342 732132 732846 733069 734441 737796 741017 742597 743674 744779 744310 742024 740283 739945
58512 739945 738782 735718 732827 731231 728869 724377 719431 715327 710968 706081 702562 700723 698031 693470
58498 693470 689314 686774 683891 679647 676082 674376 672877 670975 670782 673019 675401 677069 680337 686134
58484 686134 692234 698030 706401 718603 731949 744810 759079 775316 790404 802645 814101 825119
58472 825119 831732 831714 828276 824402 818404 808552 797261 787044 776885 766258 758176 754548 752851 750981
$$ packed form
58564G96559K0104K1303K3713K6168K6301K5069K4395K2877J8547J3305R901P037
58552A035279K271k939n860p476r887j1529j0245q393r466j2016j2444j1492j2470
58539I23333j5124j6818j7789j9781k1331j9865j6687j4805j3626j0905p799o705
58527G42098o199l557k10P14K23J372L355L221J580J077J105m69k286j741l38
58512G39945j163l064k891j596k362m492m946m104m359m887l519j839k692m561
58498F93470m156k540k883m244l565j706j499j902j93K237K382J668L268N797
58484F86134O100N796Q371J2202J3346J2861J4269J6237J5088J2241J1456J1018
58472H25119O613j8l438l874n998r852j1291j0217j0159j0627q082l628j697j870
$$ plain form
58458 750981 750937 754213 758283 761476 766742 776462 787849 797405 805615 813433 818608 819547 818546 817251 813333
58443 813333 805543 797482 792210 787736 782020 777713 777474 779166 780237 782312 786867 791022 792505 794314
58429 794314 799580 806215 811578 817855 827623 838462 847313 855924 866622 876826 883192 887096 890668
58416 890668 891550 887185 880255 874254 867661 858145 848423 841913 836384 827960 817916 809628 802387 794231
58402 794231 787366 784670 784046 782226 780979 783685 788939 793325 797320 802725 807626 809722 811332 815239
58388 815239 818976 819062 817454 817853 819134 818551 817934 820452 824515 827084 829785 835674 843288 849981 857622
58373 857622 868738 880556 889195 896281 905177 914451 921475 928621 939118 950543 959277 967589 979369
58360 979369 992619 1003316 1012900 1024592 1036101 1043516 1048780 1055676 1062025 1063675 1062778 1064231 1067231
$$ packed form
58458G50981m4L276M070L193N266R720J1387R556Q210P818N175R39j001j295l918
58443H13333p790q061n272m474n716m307k39J692J071K075M555M155J483J809
58429G94314N266O635N363O277R768J0839Q851Q611J0698J0204O366L904L572
58416H90668Q82m365o930o001o593r516r722o510n529q424j0044q288p241q156
58402G94231o865k696o24j820j247K706N254M386L995N405M901K096J610L907
58388H15239L737Q6j608L99J281n83o17K518M063K569K701N889P614O693P641
58373H57622J1116J1818Q639P086Q896R274P024P146J0497J1425Q734Q312J1780
58360I79369J3250J0697R584J1692J1509P415N264O896O349J650q97J453L000
$$ plain form
58347 1067231 1068216 1068784 1072766 1078697 1083078 1087857 1096755 1107669 1116768 1126601 1141875 1160608 1177735
58334 1177735 1193970 1212662 1231510 1246148 1258449 1272533 1286087 1294494 1299889 1307038 1313923 1315805
58322 1315805 1314902 1316483 1319017 1317967 1315708 1317698 1322399 1325191 1328658 1338457 1352413 1364365 1375392
58309 1375392 1390433 1407256 1420018 1430562 1444956 1462008 1476520 1490507 1509363 1530149 1545788
58298 1545788 1557908 1573327 1590931 1604625 1616379 1633326 1654482 1673229 1690472 1712280 1736923
58287 1736923 1757633 1775934 1798917 1825610 1849455 1871779 1899057 1929388 1955763 1980228 2010454
58276 2010454 2044944 2076382 2106847 2144370 2187065 2226520 2264403 2309406 2360051 2407264 2451863
58265 2451863 2502439 2557919 2609791 2659739 2717085 2780337 2839491 2895046 2956147 3021516 3081467
$$ packed form
58347A067231R85N68L982N931M381M779Q898J0914R099R833J5274J8733J7127
58334A177735J6235J8692J8848J4638J2301J4084J3554Q407N395P149O885J882
58322A315805r03J581K534j050k259J990M701K792L467R799J3956J1952J1027
58309A375392J5041J6823J2762J0544J4394J7052J4512J3987J8856K0786J5639
58298A545788J2120J5419J7604J3694J1754J6947K1156J8747J7243K1808K4643
58287A736923K0710J8301K2983K6693K3845K2324K7278L0331K6375K4465L0226
58276B010454L4490L1438L0465L7523M2695L9455L7883M5003N0645M7213M4599
58265B451863N0576N5480N1872M9948N7346O3252N9154N5555O1101O5369N9951
$$ plain form
58254 3081467 3137348 3199313 3266304 3328481 3388115 3457142 3535230 3611795 3688387 3776624 3875073
58243 3875073 3971564 4067743 4177359 4300656 4425198 4551567 4692542 4846961 5001245 5157129
58233 5157129 5330281 5520971 5714762 5912963 6132428 6374111 6623034 6880887 7166193
58224 7166193 7480358 7807508 8150288 8530407 8951184 9396863 9872010 10402232 10992253
58215 10992253 11624896 12305971 13066650 13916905 14843578 15860373 17010451 18314018 19767534
58206 19767534 21402829 23291310 25484949 28018846 30981106 34508033 38697304 43604172
58198 43604172 49341003 56102267 64090502 73539541 84856153 98640784 115536772 136148264
58190 136148264 161043930 190559445 224486531 262180034 302976550 345840681 387838121
$$ packed form
58254C081467N5881O1965O6991O2177N9634O9027P8088P6565P6592Q8237R8449
58243C875073R6491R6179J09616J23297J24542J26369J40975J54419J54284J55884
58233E157129J73152J90690J93791J98201K19465K41683K48923K57853K85306
58224G166193L14165L27150L42780L80119M20777M45679M75147N30222N90021
58215A0992253O32643O81075P60679Q50255R26673J016795J150078J303567J453516
58206A9767534J635295J888481K193639K533897K962260L526927M189271M906868
58198D3604172N736831O761264P988235R449039J1316612J3784631J6895988K0611492
58190A36148264K4895666K9515515L3927086L7693503M0796516M2864131M1997440
$$ plain form
58183 387838121 423096748 444349005 446606489 429923158 398937743 360021991 318605651
58176 318605651 278150548 240414495 206116512 175530749 148814596 126000683 106860674
58169 106860674 90944643 77775632 66940135 58032769 50650364 44478256 39308967
58162 39308967 34962066 31254835 28059202 25313183 22954521 20897539 19084414 17499498
58154 17499498 16116419 14881435 13762031 12762818 11878465 11074964 10330911 9655171 9049573
58145 9049573 8492649 7973452 7504819 7089746 6708213 6349452 6025077 5738646 5472971
58136 5472971 5218797 4986261 4776766 4572208 4363692 4164164 3981570 3805431 3630737
58127 3630737 3469738 3328444 3194925 3062040 2939487 2832671 2731220 2628999 2534911 2453538
$$ packed form
58183C87838121L5258627K1252257K257484j6683331l0985415l8915752m1416340
58176C18605651m0455103l7736053l4297983l0585763k6716153k2813913j9140009
58169A06860674j5916031j3169011j0835497q907366p382405o172108n169289
58162C9308967m346901l707231l195633k746019k358662k056982j813125j584916
58154A7499498j383079j234984j119404r99213q84353q03501p44053o75740o05598
58145I049573n56924n19197m68633m15073l81533l58761l24375k86431k65675
58136E472971k54174k32536k09495k04558k08516j99528j82594j76139j74694
58127C630737j60999j41294j33519j32885j22553j06816j01451j02221r4088q1373
$$ plain form
58117 2453538 2374832 2293151 2217604 2153642 2092623 2029067 1970552 1921165 1872332 1819283 1770023
58106 1770023 1728942 1687693 1641224 1597084 1559951 1522226 1478925 1437235 1402470 1368675 1331737
58095 1331737 1298083 1271786 1246236 1216903 1189651 1168407 1147178 1122197 1099699 1083775 1068448
58084 1068448 1049457 1032186 1020232 1007544 989478 970646 954492 936089 912616 890165 872815
58073 872815 855379 834145 814424 800191 786434 769124 752961 741973 731962 719377 708362
58062 708362 701931 695334 685172 676196 672109 668335 660738 652847 647687 641057 629795 618433 610801
58049 610801 603134 592248 582540 578001 575001 569662 564802 562974 560186 553275 546235 542645 538879 531231
58035 531231 522724 516557 509944 500792 493264 490083 486264 477226 466470 458653 451717 442616 434323 430116
$$ packed form
58117B453538p8706q1681p5547o3962o1019o3556n8515m9387m8833n3049m9260
58106A770023m1081m1249m6469m4140l7133l7725m3301m1690l4765l3795l6938
58095A331737l3654k6297k5550k9333k7252k1244k1229k4981k2498j5924j5327
58084A068448j8991j7271j1954j2688j8066j8832j6154j8403k3473k2451j7350
58073H72815j7436k1234j9721j4233j3757j7310j6163j0988j0011j2585j1015
58062G08362o431o597j0162q976m087l774p597p891n160o630j1262j1362p632
58049F10801p667j0886r708m539l000n339m860j828k788o911p040l590l766p648
58035E31231q507o167o613r152p528l181l819r038j0756p817o936r101q293m207
$$ plain form
58021 430116 426928 421156 415269 412141 408678 401738 394744 391833 390794 388171 385852 386200 386151 382762 379432
58006 379432 380034 381918 381257 380290 382629 386104 386972 386760 388466 390322 389750 389307 392229 396161 397554 398345
57990 398345 401925 406299 407569 406656 406398 405438 401149 395484 391957 389696 385923 381297 377485 372723 365153
57975 365153 357513 353219 350909 347801 345067 344722 344678 342267 339460 339329 340506 340252 339659 340550 340666 337488
57959 337488 333683 333190 334837 335236 334974 336367 337925 336787 334183 333047 332627 330682 328534 328580 329278 327987
57943 327987 326539 328658 333916 339349 344923 352305 360365 367080 373987 383755 395238 405717 415951
57930 415951 428095 440628 450292 457157 462928 466280 464838 459991 454829 449066 440777 431323 423627 417225
57916 417225 409839 402195 396541 392085 386680 381481 379190 379144 378755 378196 379107 380376 379914 378959 379800 380880
$$ packed form
58021D30116l188n772n887l128l463o940o994k911j039k623k319L48m9l389l330
58006C79432O02J884o61r67K339L475Q68k12J706J856n72m43K922L932J393P91
57990C98345L580M374J270r13k58r60m289n665l527k261l773m626l812m762p570
57975C65153p640m294k310l108k734l45m4k411k807j31J177k54n93Q91J16l178
57959C37488l805m93J647L99k62J393J558j138k604j136m20j945k148M6O98j291
57943C27987j448K119N258N433N574P382Q060O715O907R768J1483J0479J0234
57930D15951J2144J2533R664O865N771L352j442m847n162n763q289r454p696o402
57916D17225p386p644n654m456n405n199k291m6l89n59R11J269m62r55Q41J080
$$ plain form
57900 380880 379031 375017 371899 369419 365124 359772 356364 354755 352255 348782 346535 345310 342986 340054
57886 340054 338961 339484 339289 338501 339220 341059 341574 340665 340324 340558 339677 337964 336941 335752 332438 328059
57870 328059 325296 323817 321295 318177 316983 317624 317980 318468 321410 326362 330756 334793 341050 349335 356578
57855 356578 361869 367095 372450 375829 377049 378419 380561 381611 380974 380136 379417 377614 375085 373486 372222
57840 372222 368758 362660 355939 349446 342481 335790 331163 328046 324235 319970 317592 317165 316327 314649 314230
57825 314230 315622 316905 317255 317800 318536 317932 316073 314851 314676 314259 313761 314711 316640 317309 316468 315808 315049
57808 315049 311734 305309 297837 290337 282028 273571 267298 263571 260424 257432 256392 257562 258789 259179
57794 259179 260216 262456 264466 265912 268431 272495 276503 279793 283614 288383 292984 297394 302954 309450
$$ packed form
57900C80880j849m014l118k480m295n352l408j609k500l473k247j225k324k932
57886C40054j093N23j95p88P19J839N15r09l41K34q81j713j023j189l314m379
57870C28059k763j479k522l118j194O41L56M88K942M952M394M037O257Q285P243
57855C56578N291N226N355L379J220J370K142J050o37q38p19j803k529j599j264
57840C72222l464o098o721o493o965o691m627l117l811m265k378m27q38j678m19
57825C14230J392J283L50N45P36o04j859j222j75m17m98R50J929O69q41o60p59
57808C15049l315o425p472p500q309q457o273l727l147k992j040J170J227L90
57794B59179J037K240K010J446K519M064M008L290L821M769M601M410N560O496
$$ plain form
57780 309450 314970 319292 324298 330466 336093 340623 345527 351137 355778 358868 361728 364500 365396 363847
57766 363847 361330 358261 353203 346073 338992 332903 326335 318592 311256 305423 300260 295289 291370 288486
57752 288486 285290 281804 279861 280046 280855 281570 283149 285593 287392 288340 289895 292015 292783 292018 292045 293813
57736 293813 295460 295870 296515 298497 300778 302676 305090 307967 309540 309485 309876 311623 312930 312722 312482 313035
57720 313035 312552 309669 305847 302702 299542 295411 291102 287262 282840 277279 272049 268266 264873 260815
57706 260815 256851 253631 250160 245798 241681 238634 235727 232343 229524 227832 226035 223403 221171 220274
57692 220274 219808 219124 219145 220151 220632 219927 219658 220891 222239 222568 223254 225819 229592 233737 239488 248228
57676 248228 259242 271627 286796 307018 332933 364397 402303 447618 499739 557452 620403
$$ packed form
57780C09450N520M322N006O168N627M530M904N610M641L090K860K772Q96j549
57766C63847k517l069n058p130p081o089o568p743p336n833n163m971l919k884
57752B88486l196l486j943J85Q09P15J579K444J799R48J555K120P68p65K7J768
57736B93813J647M10O45J982K281J898K414K877J573n5L91J747J307k08k40N53
57720C13035m83k883l822l145l160m131m309l840m422n561n230l783l393m058
57706B60815l964l220l471m362m117l047k907l384k819j692j797k632k232q97
57692B20274m66o84K1J006M81p05k69J233J348L29O86K565L773M145N751Q740
57676B48228J1014J2385J5169K0222K5915L1464L7906M5315N2121N7713O2951
$$ plain form
57665 620403 688050 757740 824091 878624 910114 909014 874333 815003 743227 667960 594942 529044
57653 529044 473288 427251 388970 357466 332089 311301 294055 280809 271495 264167 257320 251700
57641 251700 248097 245251 241898 238997 237752 237113 235504 233554 232839 233155 233231 233068 233532 234442 234906 234791 234386
57624 234386 233571 232558 232277 232755 232472 230597 228341 226703 224657 221207 217527 215165 213623 211631 209467
57609 209467 208129 207470 206936 206894 207488 207420 205698 203429 202184 201779 201258 200803 200948 201100 200544 199726 199045 197646
57591 197646 194934 191821 188982 185523 181100 177527 176205 175521 173098 169240 165940 163772 162029 160769
57577 160769 160293 159530 157253 154206 151953 150418 148528 146459 145212 144694 144143 143741 143973 144144 143397 142407
57561 142407 142332 142884 143159 143408 144199 144761 144058 142626 141599 140870 140043 140091 142051 145007 147351 149141 151201
$$ packed form
57665F20403O7647O9690O6351N4533L1490j100l4681n9330p1776p5267p3018o5898
57653E29044n5756m6037l8281l1504k5377k0788j7246j3246r314p328o847n620
57641B51700l603k846l353k901j245o39j609j950p15L16P6j63M64R10M64j15m05
57624B34386q15j013k81M78k83j875k256j638k046l450l680k362j542j992k164
57609B09467j338o59n34m2N94o8j722k269j245m05n21m55J45J52n56q18o81j399
57591A97646k712l113k839l459m423l573j322o84k423l858l300k168j743j260
57577A60769m76p63k277l047k253j535j890k069j247n18n51m02K32J71p47r90
57561A42407p5N52K75K49P91N62p03j432j027p29q27M8J960K956K344J790K060
$$ plain form
57544 151201 152912 153158 152671 153235 155111 157282 159470 161897 163750 164114 163838 164375 165252 164748 162622 160219
57528 160219 158319 156849 156160 156631 157423 157498 157415 158397 160236 161895 163422 165361 167064 167708 168277 170389 173695
57511 173695 176528 178456 180124 181310 181477 181620 183055 184807 184736 182949 181587 181372 180910 179460 177877 176518
57495 176518 174515 171607 168716 166325 163999 161710 159942 158443 156511 154449 153044 151880 149980 147869
57481 147869 146952 147085 146821 145959 145674 146193 146526 146563 147221 148342 148664 148116 147987 148482 148296 147080 146214 146494
57463 146494 146980 146795 146272 145708 144692 143324 142512 142399 141948 140662 139386 138953 139258 139998 140987 141570 141081
57446 141081 140059 139745 140325 141034 141807 143192 144732 145261 144989 145402 146875 148114 148321 148171 148254 148245 148056 148198
57428 148198 148572 148412 147787 147698 148371 148988 149296 149891 150661 150676 149943 149598 149926 149878 148997 148163 147970 147949 147890 148300
$$ packed form
57544A51201J711K46m87N64J876K171K188K427J853L64k76N37Q77n04k126k403
57528A60219j900j470o89M71P92P5q3R82J839J659J527J939J703O44N69K112L306
57511A73695K833J928J668J186J67J43J435J752p1j787j362k15m62j450j583j359
57495A76518k003k908k891k391k326k289j768j499j932k062j405j164j900k111
57481A47869r17J33k64q62k85N19L33L7O58J121L22n48j29M95j86j216q66K80
57463A46494M86j85n23n64j016j368q12j13m51j286j276m33L05P40R89N83m89
57446A41081j022l14N80P09P73J385J540N29k72M13J473J239K07j50Q3rj89J42
57428A48198L74j60o25q9O73O17L08N95P70J5p33l45L28m8q81q34j93k1n9M10
$$ plain form
57408 148300 149030 149027 148072 147255 147194 147228 146917 146782 146976 146706 145682 144763 144544 144525 144289 144257 144755 145456 146212 147307
57388 147307 148570 149356 149629 149904 150088 149732 149407 150237 151959 153140 153474 154193 155986 158250 160658 163494
57372 163494 166081 166912 166004 165269 165813 166647 166789 166779 167199 167467 167078 166517 165987 164776 162833 161519 161810 163047
57354 163047 164317 165718 167422 168836 169625 170362 171407 172267 172718 173323 174325 175360 176694 179145 182209
57339 182209 183978 183702 182766 182363 181966 181041 180406 180634 180728 179772 178495 177879 177434 176234 174547 173246 172528
57322 172528 172274 172676 173537 173961 173650 173533 174299 175430 176385 177487 178795 179465 179185 178960 179460 179834 179227 178246
57304 178246 177889 178123 178565 179422 180776 182049 183085 184604 186690 188135 188296 188292 189278 190779 191823 192459 193048
57287 193048 193361 193562 194826 197713 201105 204016 207215 211773 217198 222440 227613 233242 238777 243362 247269
$$ packed form
57408A48300P30lr55q17o1L4l11j35J94k70j024r19k19j9k36l2M98P01P56J095
57388A47307J263P86K73K75J84l56l25Q30J722J181L34P19J793K264K408K836
57372A63494K587Q31r08p35N44Q34J42j0M20K68l89n61n30j211j943j314K91J237
57354A63047J270J401J704J414P89P37J045Q60M51O05J002J035J334K451L064
57339A82209J769k76r36m03l97r25o35K28R4r56j277o16m45j200j687j301p18
57322A72528k54M02Q61M24l11j17P66J131R55J102J308O70k80k25N00L74o07r81
57304A78246l57K34M42Q57J354J273J036J519K086J445J61mR86J501J044O36N89
57287A93048L13K01J264K887L392K911L199M558N425N242N173N629N535M585L907
$$ plain form
57272 247269 251161 254711 257256 259116 261021 262879 264188 265028 265659 265871 265600 265330 265082 264062 262169 260621
57256 260621 260147 259870 259070 258629 259378 260381 260466 260274 261158 262987 264586 265540 266112 266263 266151 266753 268611 270831
57238 270831 272591 274548 277353 279960 281048 281062 281083 280713 279004 276688 275499 275793 276675 277968 280186 282916
57222 282916 285052 286508 288205 290558 293389 296947 301554 306501 310720 314303 318042 321814 324794 327025
57208 327025 329454 332553 336035 339687 343560 347663 352300 358070 364685 370636 375017 378772 383033 387414
57194 387414 391360 395923 402372 409914 416669 422279 427808 433705 439696 446239 454250 463711 474091 485707
57180 485707 499132 513805 528906 545018 563191 582882 602646 622347 642801 663637 683529
57169 683529 702366 721300 740728 759989 778926 798009 817117 835925 855304 876442 898690
$$ packed form
57272B47269L892L550K545J860J905J858J309Q40O31K12k71k70k48j020j893j548
57256B60621m74k77q00m41P49J003Q5j92Q84J829J599R54N72J51j12O02J858K220
57238B70831J760J957K805K607J088J4K1l70j709k316j189K94Q82J293K218K730
57222B82916K136J456J697K353K831L558M607M947M219L583L739L772K980K231
57208C27025K429L099L482L652L873M103M637N770O615N951M381L755M261M381
57194C87414L946M563O449P542O755N610N529N897N991O543Q011R461J0380J1616
57180D85707J3425J4673J5101J6112J8173J9691J9764J9701K0454K0836J9892
57169F83529J8837J8934J9428J9261J8937J9083J9108J8808J9379K1138K2248
$$ plain form
57158 898690 920100 940007 959303 978347 996689 1014946 1034777 1056421 1078001 1097890 1116373
57147 1116373 1134622 1153451 1173447 1195013 1217820 1241185 1265098 1289983 1315653 1341578 1367823
57136 1367823 1394544 1421091 1447007 1473356 1501495 1531114 1561290 1592873 1627668 1665540 1704570
57125 1704570 1744206 1786156 1831921 1881324 1933735 1989033 2047127 2108227 2173799 2245632 2323909
57114 2323909 2407759 2497615 2595377 2702504 2819929 2949799 3095341 3259095 3443394 3652811
57104 3652811 3894387 4175733 4505222 4894286 5357648 5911403 6572779 7361297 8297497
57095 8297497 9400323 10687421 12176871 13885399 15824881 18002295 20420038 23069774
57087 23069774 25924103 28936677 32048837 35192794 38295779 41297905 44170780 46900164
$$ packed form
57158H98690K1410J9907J9296J9044J8342J8257J9831K1644K1580J9889J8483
57147A116373J8249J8829J9996K1566K2807K3365K3913K4885K5670K5925K6245
57136A367823K6721K6547K5916K6349K8139K9619L0176L1583L4795L7872L9030
57125A704570L9636M1950M5765M9403N2411N5298N8094O1100O5572P1833P8277
57114B323909Q3850Q9856R7762J07127J17425J29870J45542J63754J84299K09417
57104C652811K41576K81346L29489L89064M63362N53755O61376P88518R36200
57095H297497J102826J287098J489450J708528J939482K177414K417743K649736
57087B3069774K854329L012574L112160L143957L102985L002126K872875K729384
$$ plain form
57079 46900164 49426916 51600011 53199809 54021465 53949902 52976781 51171654 48647882 45543836
57070 45543836 42014270 38222600 34331054 30488583 26818483 23410584 20320899 17576146
57062 17576146 15178998 13113196 11349548 9852272 8584164 7510068 6598751 5823419
57054 5823419 5161492 4594247 4106133 3683747 3315490 2992346 2708251 2458866 2240102
57045 2240102 2048065 1879633 1732203 1603120 1490049 1391480 1306153 1232283 1168070 1112674
57035 1112674 1065875 1026929 994521 967873 947300 933621 927567 929897 941434 962338 991508 1027667
57023 1027667 1071473 1124813 1184892 1238047 1262482 1241257 1173904 1074959 962348 848710 741391
57012 741391 645127 562038 491318 431318 381251 340204 306194 277491 253552 233713 216476
$$ packed form
57079D6900164K526752K173095J599798Q21656p1563r73121j805127k523772l104046
57070D5543836l529566l791670l891546l842471l670100l407899l089685k744753
57062A7576146k397148k065802j763648j497276j268108j074096r11317p75332
57054E823419o61927n67245m88114m22386l68257l23144k84095k49385k18764
57045B240102j92037j68432j47430j29083j13071r8569q5327p3870o4213n5396
57035A112674m6799l8946l2408k6648k0573j3679o054K330J1537K0904K9170L6159
57023A027667M3806N3340O0079N3155K4435k1225o7353r8945j12611j13638j07319
57012G41391r6264q3089p0720o0000n0067m1047l4010k8703k3939j9839j7237
$$ plain form
57001 216476 201164 188761 179727 172344 164559 156283 148570 141776 135875 131412 128625 126588 124634 123748
56987 123748 125247 129063 134656 142619 153792 167402 181388 193740 202256 204058 197321 183285 165335
56974 165335 146420 128313 112341 99188 88294 78848 71194 66319 64463 65208 68385 73927 81520
56961 81520 91417 104764 122006 141834 162896 185429 209506 232348 249145 256376 253201 240479
56949 240479 220298 196217 172170 150601 132302 117549 106275 97689 91116 87036 86293 88791 94120
56936 94120 102874 115988 133229 153706 177448 205044 235911 267950 298266 322841 336411 335021
56924 335021 319173 293272 261997 228347 194594 162951 134722 110099 89222 72416 59234
56913 59234 48449 39296 31889 26239 21761 17881 14402 11292 8696 6954 5893 4509 2166 -308
$$ packed form
57001B16476j5312j2403r034p383p785q276p713o794n901m463k787k037j954q86
56987A23748J499L816N593P963J1173J3610J3986J2352Q516J802o737j4036j7950
56974A65335j8915j8107j5972j3153j0894r446p654m875j856P45L177N542P593
56961H1520R897J3347J7242J9828K1062K2533K4077K2842J6797P231l175j2722
56949B40479k0181k4081k4047k1569j8299j4753j1274q586o573m080p43K498N329
56936I4120Q754J3114J7241K0477K3742K7596L0867L2039L0316K4575J3570j390
56924C35021j5848k5901l1275l3650l3753l1643k8229k4623k0877j6806j3182
56913E9234j0785r153p407n650m478l880l479l110k596j742j061j384B166c08
$$ plain form
56898 -1657 -1848 -1669 -1179 334 3261 7657 14068 23205 35126 49673 67227 87880 110487 133788
56884 133788 157825 182560 205512 222513 230966 231112 224594 213465 200449 188225 177917 169435
56872 169435 163343 160950 162549 167184 174531 185626 201417 221952 247446 278831 316655 360459
56860 360459 409687 464095 522322 580257 631031 666637 680676 671348 642471 601068 553828 505803
56848 505803 461068 422651 391743 368328 352724 345637 347001 356140 373080 398705 433811 479091
56836 479091 535572 603565 681387 766457 856883 949423 1035323 1100450 1131505 1122560 1076639 1003139
56824 1003139 914135 820837 731177 649881 580080 523729 480675 448966 426815 413645 409363
56813 409363 413894 427764 451978 486771 531098 583398 642119 705311 770004 831195 880518 907272
$$ packed form
56898a657j91J79M90C34K927M396O411R137J1921J4547J7554K0653K2607K3301
56884A33788K4037K4735K2952J7001Q453J46o518j1129j3016j2224j0308q482
56872A69435o092k393J599M635P347J1095J5791K0535K5494L1385L7824M3804
56860C60459M9228N4408N8227N7935N0774L5606J4039r328k8877m1403m7240m8025
56848E05803m4735l8417l0908k3415j5604p087J364R139J6940K5625L5106M5280
56836D79091N6481O7993P7822Q5070R0426R2540Q5900O5127L1055q945m5921p3500
56824A003139q9004r3298q9660q1296o9801n6351m3054l1709k2151j3170m282
56813D09363M531J3870K4214L4793M4327N2300N8721O3192O4693O1191M9323K6754
$$ plain form
56801 907272 903520 869275 812054 741646 666200 592060 524163 465304 416254 377100 347450 325522
56789 325522 308975 297241 291715 293329 301406 315147 334576 359412 388473 420676 454972 488449
56777 488449 515679 530912 530532 513754 482652 441960 397315 352682 309974 270802 236892 208601
56765 208601 184776 164630 148323 135353 124169 114081 106001 100502 96557 92905 89357 86020 82591
56752 82591 79117 76218 73912 71467 68898 67243 66767 66289 64916 63065 61237 59277 57511 56958 57538
56737 57538 57618 56296 54753 54335 54653 54630 54199 53858 53610 53356 53412 53877 54415 55224 57072 59768 61870 62643
56719 62643 63055 64137 65630 66945 68168 69358 70120 70589 71555 72986 73812 73722 73651 73886 73482 72365 72127
56702 72127 73614 75521 76538 77149 78037 78493 77955 77501 78156 79099 79144 78670 78527 78324 77511 76938 77589 78777
$$ packed form
56801I07272l752l4245n7221p0408p5446p4140o7897n8859m9050l9154k9650k1928
56789C25522j6547j1734n526J614Q077J3741J9429K4836K9061L2203L4296L3477
56777D88449K7230J5233l80j6778l1102m0692m4645m4633m2708l9172l3910k8291
56765B08601k3825k0146j6307j2970j1184j0088q080n499l945l652l548l337l429
56752H2591l474k899k306k445k569j655m76m78j373j851j828j960j766n53N80
56737E7538Q0j322j543m18L18k3m31l41k48k54N6M65N38Q09J848K696K102P73
56719F2643M12J082J493J315J223J190P62M69R66J431Q26r0p1K35m04j117k38
56702G2127J487J907J017O11Q88M56n38m54O55R43M5m74j43k03q13n73O51J188
$$ plain form
56684 78777 79280 79345 79920 80750 80885 80391 80032 79900 79779 80213 81826 84138 86206 87868 89394 90706 91937
56667 91937 93855 96694 99486 101495 103258 105254 106813 107510 108316 110052 111997 113347 114669 116414 117448
56652 117448 116798 115579 115269 115286 114289 112900 112964 114771 116973 118707 119979 120532 120190 119848 120408 121172 120951
56635 120951 120170 120174 120915 121081 120159 118756 117216 115519 114134 113404 112427 110107 107049 104913 104188 104006 103812
56618 103812 103788 103945 104152 104781 106088 107376 107912 108124 108632 108852 107981 106625 105836 105159 103309 100353 97626
56601 97626 95870 94922 94802 95553 96410 96600 96585 97129 97688 97231 96173 95889 96763 98188 99984 102207 104023
56584 104023 104468 104009 103844 104037 103912 103827 104857 106981 109142 110865 112408 113710 114644 115904 118129 120659
56568 120659 122598 124522 127509 131051 133792 135848 138541 142167 145912 149784 154786 161151 167923 174230
$$ packed form
56684G8777N03O5N75Q30J35m94l59j32j21M34J613K312K068J662J526J312J231
56667I1937J918K839K792K009J763J996J559O97Q06J736J945J350J322J745J034
56652A17448o50j219l10J7r97j389O4J807K202J734J272N53l42l42N60P64k21
56635A20951p81MP41J66r22j403j540j697j385p30r77k320l058k136p25j82j94
56618A03812k4J57K07O29J307J288N36K12N08K20q71j356p89o77j850k956k727
56601I7626j756r48j20P51Q57J90j5N44N59m57j058k84Q74J425J796K223J816
56584A04023M45m59j65J93j25q5J030K124K161J723J543J302R34J260K225K530
56568A20659J939J924K987L542K741K056K693L626L745L872N002O365O772O307
$$ plain form
56554 174230 179634 183573 185913 187739 190214 193109 195726 198452 201755 204453 204997 203897 202910 202291 200813
56539 200813 198145 195227 192588 190176 188485 187953 187628 186264 184322 182996 181863 179633 176651 174310 172364
56524 172364 169316 165287 162000 159898 157634 154628 151906 150142 148889 147906 147281 146268 143988 141271 139751
56509 139751 139257 138222 136588 135976 136964 138458 139832 141438 142927 143385 143296 144076 145513 146025 145547 145719 146950
56492 146950 147816 147759 147908 148665 148864 147963 146857 146017 144994 144201 144885 146751 147845 147395 146648 146496 146519 146756
56474 146756 148008 149789 150367 149510 148880 149175 149340 149148 149925 151809 152892 152221 151308 151584 152553 153490 154746
56457 154746 156269 156971 156692 156792 157851 158767 158990 159456 160394 160488 159325 158448 158862 159645 160112 161186 163351
56440 163351 165367 166299 166842 167462 167246 165833 164521 164224 164229 164099 164737 166306 167188 166481 165632 166160 167481 168375
$$ packed form
56554A74230N404L939K340J826K475K895K617K726L303K698N44j100r87o19j478
56539B00813k668k918k639k412j691n32l25j364j942j326j133k230k982k341j946
56524A72364l048m029l287k102k264l006k722j764j253r83o25j013k280k717j520
56509A39751m94j035j634o12R88J494J374J606J489M58q9P80J437N12m78J72J231
56492A46950Q66n7J49P57J99r01j106q40j023p93O84J866J094m50p47j52K3K37
56474A46756J252J781N78q57o30K95J65j92P77J884J083o71r13K76R69R37J256
56457A54746J523P02k79J00J059R16K23M66R38R4j163q77M14P83M67J074K165
56440A63351K016R32N43O20k16j413j312k97Nj30O38J569Q82p07q49N28J321Q94
$$ plain form
56422 168375 168945 169774 170663 171411 172375 173312 173265 172483 172661 174356 175964 176149 175378 174237 172358 170069 168963
56405 168963 169625 170719 171381 172469 174428 176102 176904 177989 179966 181524 181714 181567 182125 182882 183411 184513
56389 184513 186434 187948 188514 189311 190977 192462 193384 195184 198466 201454 202640 202868 203333 203708 203712 204278 205593
56372 205593 206181 205542 205483 207154 209042 209580 209456 209554 208960 207036 205307 205170 205639 205322 204738 204816 205007 204785
56354 204785 205153 206885 209052 210914 213263 216352 218665 219436 220185 222030 223809 224566 225385 226885 227567 226763
56338 226763 226554 228385 230403 230752 230984 233360 237084 240185 243013 246832 250778 253270 254882 257009 259162
56323 259162 260285 261296 263627 266588 268670 270086 271675 272760 272480 271802 271945 272363 272490 273636 276736
56308 276736 279947 281035 280651 280836 281902 283166 285080 288198 291558 294381 297712 302235 306364 308865 311330
$$ packed form
56422A68375N70Q29Q89P48R64R37m7p82J78J695J608J85p71j141j879k289j106
56405A68963O62J094O62J088J959J674Q02J085J977J558J90j47N58P57N29J102
56389A84513J921J514N66P97J666J485R22J800L282K988J186K28M65L75MN66J315
56372B05593N88o39n9J671J888N38j24R8n94j924j729j37M69l17n84P8J91k22
56354B04785L68J732K167J862K349L089K313P71P49J845J779P57Q19J500O82q04
56338B26763k09J831K018L49K32K376L724L101K828L819L946K492J612K127K153
56323B59162J123J011K331K961K082J416J589J085k80o78J43M18J27J146L100
56308B76736L211J088l84J85J066J264J914L118L360K823L331M523M129K501K465
$$ plain form
56293 311330 315519 320264 323714 326721 331142 336499 341135 345123 349460 353921 358199 363424 370192 376933
56279 376933 382567 388642 396418 404241 410544 417033 425888 436110 445778 455628 467169 479415 490916
56266 490916 502981 517568 534004 551038 569950 592244 616491 641161 668421 701358 739442
56255 739442 780518 825328 876184 933118 995306 1064423 1142482 1228099 1318902 1415832 1520907
56244 1520907 1632544 1747274 1864318 1983937 2102852 2215855 2320672 2416801 2500968 2568408
56234 2568408 2617589 2649186 2661569 2651956 2621202 2572983 2509129 2430173 2339586 2242714 2141953
56223 2141953 2037124 1929975 1824074 1720938 1620373 1523965 1434063 1350089 1269908 1194123
56213 1194123 1125094 1062775 1005492 953557 907854 866240 825946 788322 756559 729917 705031
$$ packed form
56293C11330M189M745L450L007M421N357M636L988M337M461M278N225O768O741
56279C76933N634O075P776P823O303O489Q855J0222R668R850J1541J2246J1501
56266D90916J2065J4587J6436J7034J8912K2294K4247K4670K7260L2937L8084
56255G39442M1076M4810N0856N6934O2188O9117P8059Q5617R0803R6930J05075
56244A520907J11637J14730J17044J19619J18915J13003J04817R6129Q4167O7440
56234B568408M9181L1597J2383r613l0754m8219o3854p8956r0587r6872j00761
56223B141953j04829j07149j05901j03136j00565r6408q9902q3974q0181p5785
56213A194123o9029o2319n7283n1935m5703m1614m0294l7624l1763k6642k4886
$$ plain form
56202 705031 681714 662326 646361 630929 615975 603810 593958 583588 572745 564120 557846 551321
56190 551321 543943 537349 531440 524884 519034 516519 516409 515508 513764 513561 514528 514210 513160 514060 516363 517140
56174 517140 516659 517761 520310 521773 522662 525702 530117 532634 533785 537205 542867 547095 549334 552888 558743
56159 558743 564579 570174 577933 587720 596895 605645 616711 629934 642933 656954 675790 699011 722740
56146 722740 747215 777026 813664 854602 900218 954810 1019983 1093622 1176010 1270112 1374823
56135 1374823 1484447 1595551 1707546 1815851 1911876 1991422 2056819 2110100 2151215 2183867
56125 2183867 2215296 2247867 2276960 2298273 2310706 2311547 2296842 2268624 2234834 2200080 2162566 2120519
56113 2120519 2073913 2018713 1947802 1860192 1762624 1660730 1556013 1452560 1358006 1275379 1201753
$$ packed form
56202G05031k3317j9388j5965j5432j4954j2165r852j0370j0843q625o274o525
56190E51321p378o594n909o556n850k515j10r01j744k03R67l18j050R00K303P77
56174E17140m81J102K549J463Q89L040M415K517J151L420N662M228K239L554N855
56159E58743N836N595P759R787R175Q750J1066J3223J2999J4021J8836K3221K3729
56146G22740K4475K9811L6638M0938M5616N4592O5173P3639Q2388R4102J04711
56135A374823J09624J11104J11995J08305R6025P9546O5397N3281M1115L2652
56125B183867L1429L2571K9093K1313J2433Q41j4705k8218l3790l4754l7514m2047
56113B120519m6606n5200p0911q7610r7568j01894j04717j03453r4554q2627p3626
$$ plain form
56102 1201753 1136942 1085405 1047326 1016257 988481 966804 952432 941195 930772 923787 920831 918124
56090 918124 914810 914701 918207 920604 920874 923877 931074 937694 941975 948367 958384 967217 972880 979868
56076 979868 990162 999429 1005833 1013783 1025221 1036041 1044850 1056265 1071775 1086494 1098798 1113801
56064 1113801 1133312 1151785 1166302 1180983 1197522 1211357 1221537 1234093 1250999 1265992 1276067
56053 1276067 1286687 1300835 1313704 1323406 1335898 1353673 1370528 1383365 1398169 1418328 1438223
56042 1438223 1454620 1473182 1497267 1521505 1542987 1567376 1597265 1626133 1650667 1677371 1710094
56031 1710094 1743026 1773009 1806338 1846096 1885523 1921318 1960369 2005647 2049143 2087002 2127633
56020 2127633 2176196 2225337 2270356 2318832 2375571 2432929 2486200 2543588 2610439 2678837 2743590
$$ packed form
56102A201753o4811n1537l8079l1069k7776k1677j4372j1237j0423o985k956k707
56090I18124l314j09L506K397K70L003P197O620M281O392J0017Q833N663O988
56076I79868J0294R267O404P950J1438J0820Q809J1415J5510J4719J2304J5003
56064A113801J9511J8473J4517J4681J6539J3835J0180J2556J6906J4993J0075
56053A276067J0620J4148J2869R702J2492J7775J6855J2837J4804K0159J9895
56042A438223J6397J8562K4085K4238K1482K4389K9889K8868K4534K6704L2723
56031A710094L2932K9983L3329L9758L9427L5795L9051M5278M3496L7859M0631
56020B127633M8563M9141M5019M8476N6739N7358N3271N7388O6851O8398O4753
$$ plain form
56009 2743590 2812772 2891285 2970227 3044415 3123888 3215706 3311245 3404323 3504349 3617986 3735677
55998 3735677 3850641 3973075 4110815 4254559 4397516 4550360 4720821 4898525 5076757
55989 5076757 5268554 5483703 5711275 5943251 6192999 6471168 6766904 7073395 7407300
55980 7407300 7781177 8182659 8604153 9065877 9584572 10148203 10748613 11409329 12152400
55971 12152400 12969685 13858428 14852310 15984444 17255839 18677267 20305625 22202411
55963 22202411 24400719 26957337 29990671 33617744 37904130 42932106 48867202 55907183
55955 55907183 64247690 74192734 86246082 101014017 119074478 140964985 167081478
55948 167081478 197372732 231254862 267985338 306713815 345375432 379336852 401957028
$$ packed form
56009B743590O9182P8513P8942P4188P9473R1818R5539R3078J00026J13637J17691
55998C735677J14964J22434J37740J43744J42957J52844J70461J77704J78232
55989E076757J91797K15149K27572K31976K49748K78169K95736L06491L33905
55980G407300L73877M01482M21494M61724N18695N63631O00410O60716P43071
55971A2152400Q17285Q88743R93882J132134J271395J421428J628358J896786
55963B2202411K198308K556618L033334L627073M286386N027976N935096P039981
55955E5907183Q340507R945044J2053348J4767935J8060461K1890507K6116493
55948A67081478L0291254L3882130L6730476L8728477L8661617L3961420K2620176
$$ plain form
55941 401957028 407608501 394806250 366710684 328976123 287219650 245787700 207588417
55934 207588417 174169975 145909912 122466971 103254387 87628496 74910188 64480388
55927 64480388 55883112 48781146 42863666 37864914 33618901 30016241 26933354 24254314
55919 24254314 21921219 19903423 18143601 16580273 15192991 13978043 12904229 11933748
55911 11933748 11061599 10293918 9609300 8978495 8401026 7886873 7421581 6983134 6574803
55902 6574803 6208979 5875517 5556734 5257510 4991000 4749374 4516849 4297542 4103330
55893 4103330 3927260 3754958 3590043 3443538 3309996 3177943 3052520 2944712 2849023 2754044
55883 2754044 2664423 2590678 2527651 2464374 2405174 2359542 2320216 2272311 2216142 2161191 2105574
$$ packed form
55941D01957028N651473j2802251k8095566l7734561m1756473m1431950l8199283
55934B07588417l3418442k8260063k3442941j9212584j5625891j2718308j0429800
55927F4480388q597276p101966n917480m998752m246013l602660l082887k679040
55919B4254314k333095k017796j759822j563328j387282j214948j073814r70481
55911A1933748q72149p67681o84618o30805n77469n14153m65292m38447m08331
55902F574803l65824l33462l18783k99224k66510k41626k32525k19307j94212
55893D103330j76070j72302j64915j46505j33542j32053j25423j07808r5689r4979
55883B754044q9621p3745o3027o3277n9200m5632l9326m7905n6169n4951n5617
$$ plain form
55872 2105574 2041140 1971499 1905792 1841234 1770057 1697129 1632874 1575045 1514793 1454545 1402828
55861 1402828 1357283 1309738 1262588 1223801 1190908 1155955 1121247 1094412 1072655 1047442 1020305
55850 1020305 998766 980807 958339 932268 909561 889054 864418 837802 816541 799404 779501
55839 779501 757721 740194 725573 707951 689345 676360 667225 654849 640090 629460 622190 612068
55827 612068 599925 591963 587562 580652 571451 565219 560947 552773 541171 531734 524248 513815 501440
55814 501440 492766 487520 480541 472097 467061 465187 462183 459153 460975 466534 470330 472677 478722 488509
55800 488509 497471 505506 516000 526950 532515 532518 531325 528492 519771 506311 493577 482049 468104
55787 468104 453105 442322 435583 428151 420135 415704 413485 407125 395517 383622 373252 361811 350200
$$ packed form
55872B105574o4434o9641o5707o4558p1177p2928o4255n7829o0252o0248n1717
55861A402828m5545m7545m7150l8787l2893l4953l4708k6835k1757k5213k7137
55850A020305k1539j7959k2468k6071k2707k0507k4636k6616k1261j7137j9903
55839G79501k1780j7527j4621j7622j8606j2985r135j2376j4759j0630p270j0122
55827F12068j2143p962m401o910r201o232m272q174j1602r437p486j0433j2375
55814E01440q674n246o979q444n036j874l004l030J822N559L796K347O045R787
55800D88509Q962Q035J0494J0950N565Lj193k833q721j3460j2734j1528j3945
55787D68104j4999j0783o739p432q016m431k219o360j1608j1895j0370j1441j1611
$$ plain form
55774 350200 343110 340978 339888 339722 344346 353512 362464 369521 376104 379573 374605 362113 348691 336835
55760 336835 323662 309447 298876 292861 287158 280309 275475 273342 270664 266900 265132 265292 263489 258959
55746 258959 254808 251136 244492 235106 227673 223883 220763 217326 216081 217000 216622 214261 212762 212271 209718
55731 209718 205261 202749 202904 202398 200438 199787 200486 199155 195368 192193 189556 183884 175381 168850 166002
55716 166002 163623 160732 160673 164288 167694 169013 171160 175793 180347 183163 185975 189376 191322 191863 193902
55701 193902 197477 198690 195916 191741 187377 180857 172379 165658 161962 158216 152940 148765 147175 146020
55687 146020 144188 143620 144830 145475 145156 146610 150443 153815 155992 159877 166212 171605 174299 176658 179800
55672 179800 181047 179032 176304 174490 171762 167458 164388 164000 163808 162048 160497 160471 160475 160093 161731 166109
$$ packed form
55774C50200p090k132j090j66M624R166Q952P057O583L469m968j2492j3422j1856
55760C36835j3173j4215j0571o015n703o849m834k133k678l764j768J60j803m530
55746B58959m151l672o644r386p433l790l120l437j245R19l78k361j499m91k553
55731B09718m457k512J55n06j960o51O99j331l787l175k637n672q503o531k848
55716A66002k379k891n9L615L406J319K147M633M554K816K812L401J946N41K039
55701A93902L575J213k774m175m364o520q478o721l696l746n276m175j590j155
55687A46020j832n68J210O45l19J454L833L372K177L885O335N393K694K359L142
55672A79800J247k015k728j814k728m304l070l88j92j760j551k6Ml82J638M378
$$ plain form
55656 166109 170289 172504 174775 178619 182457 185456 189590 195424 199971 201093 200168 198338 194211 187473
55642 187473 180672 175175 169244 162127 156000 151777 147128 140879 135295 131798 128497 124266 121144 120335
55628 120335 119842 118461 118150 119924 121287 120297 118478 117291 115486 112384 109985 109233 107847 104396 100956
55613 100956 99310 98094 96122 94835 94921 94231 91721 89866 90375 91041 89670 87751 87291 87290 86267 85277 85495
55596 85495 85622 84391 82959 82423 81719 80247 79614 80453 80583 78696 76839 76871 77483 77076 76533 76737 76473 75233
55578 75233 74982 76613 77766 76760 75585 76354 77869 78454 79126 81043 82727 82782 82702 84111 85798 86259 86612
55561 86612 88211 89850 90009 89481 89215 88118 85554 83491 83508 84153 83733 83179 83571 83587 82182 81214 82506
55544 82506 84672 85594 85744 86379 86804 86196 85881 87088 88622 89287 90304 92763 95058 95500 95149 95401 95141
$$ packed form
55656A66109M180K215K271L844L838K999M134N834M547J122r25j830m127o738
55642A87473o801n497n931p117o127m223m649o249n584l497l301m231l122q09
55628A20335m93j381l11J774J363r90j819j187j805l102k399p52j386l451l440
55613A00956j646j216j972j287Q6o90k510j855N09O66j371j919m60jj023r90K18
55596H5495J27j231j432n36p04j472o33Q39J30j887j857L2O12m07n43K04k64j240
55578G5233k51J631J153j006j175P69J515N85O72J917J684N5q0J409J687M61L53
55561H6612J599J639J59n28k66j097k564k063J7O45m20n54L92J6j405r68J292
55544H2506K166R22J50O35M25o08l15J207J534O65J017K459K295M42l51K52k60
$$ plain form
55527 95141 93053 90475 89198 88534 87152 85582 84371 82222 78686 76171 76386 77140 75679 72870 71003
55512 71003 69759 67594 65075 63577 62449 60549 58857 58602 58580 57234 55639 55453 55739 54797 53426 53305
55496 53305 53797 53364 52624 53048 54075 54352 54410 55416 56745 57465 58573 61042 63296 63449 62426 62092 61927
55479 61927 60500 58599 57855 57676 56539 55052 54866 55726 56322 56783 57713 58126 56996 55527 55289 55549 54961
55462 54961 54229 54435 54452 52975 51427 51808 53179 53388 52821 53239 54262 54274 53649 53811 54161 53140 51460 51124
55444 51124 52030 52525 52577 53469 55105 56372 57433 59011 60322 60350 60080 60801 61416 60399 59159 60188 62798
55427 62798 64054 63302 62568 62890 63357 63505 63785 63829 62894 61773 61866 62736 62931 62611 63021 64012 64512 64699 65275
55408 65275 65408 63908 61730 60812 61205 61753 62628 64546 66378 66373 65000 63989 63380 62292 61660 63145 65895
$$ packed form
55527I5141k088k578j277o64j382j570j211k149l536k515K15P54j461k809j867
55512G1003j244k165k519j498j128j900j692k55k2j346j595j86K86r42j371j21
55496E3305M92m33p40M24J027K77N8J006J329P20J108K469K254J53j023l34j65
55479F1927j427j901p44j79j137j487j86Q60N96M61R30M13j130j469k38K60n88
55462E4961p32K06J7j477j548L81J371K09n67M18J023J2o25J62L50j021j680l36
55444E1124R06M95N2Q92J636J267J061J578J311K8k70P21O15j017j240J029K610
55427F2798J256p52p34L22M67J48K80M4r35j121R3Q70J95l20M10R91N00J87N76
55408F5275J33j500k178r18L93N48Q75J918J832nj373j011o09j088o32J485K750
$$ plain form
55391 65895 67363 66971 66225 65672 64522 62885 61710 60800 59366 58075 58125 58862 58778 58160 58321 59006 59175 59430
55373 59430 60887 62532 62699 62351 63722 66274 67274 66006 64280 63000 61392 59579 58854 59235 59415 59200
55357 59200 59480 59949 59424 58225 57749 57994 57951 57964 59034 60336 60223 59153 58817 58992 58252 57232 57871 59784
55339 59784 60667 60177 60081 60706 60583 59713 59759 60701 60608 59172 58353 59005 59828 60197 61067 62547 63358 63253 63313 63482
55319 63482 62544 60896 60530 61818 63035 63404 63843 64420 64019 63002 63214 64761 65674 65347 65421 66559 67236
55302 67236 66666 66152 66590 67154 67320 67766 68496 68470 67774 67749 68445 68468 67786 68011 69308 69928 69522 69995 72018
55283 72018 73555 73041 71445 69963 68207 65970 64396 64002 63665 62773 62426 63429 65049 66669 68586 70342
55267 70342 70483 69010 67919 68308 69009 69011 69049 69739 70183 69680 68976 68790 68830 69066 70173 71897 72842 72619 72368
$$ packed form
55391F5895J468l92p46n53j150j637j175r10j434j291N0P37q4o18J61O85J69K55
55373E9430J457J645J67l48J371K552J000j268j726j280j608j813p25L81J80k15
55357E9200K80M69n25j199m76K45m3J3J070J302j13j070l36J75p40j020O39J913
55339E9784Q83m90r6O25j23q70M6R42r3j436q19O52Q23L69Q70J480Q11j05O0J69
55319F3482r38j648l66J288J217L69M39N77m01j017K12J547R13l27P4J138O77
55302F7236n70n14M38N64J66M46P30k6o96k5O96K3o82K25J297O20m06M73K023
55283G2018J537n14j596j482j756k237j574l94l37q92l47J003J620J620J917J756
55267G0342J41j473j091L89P01KL8O90M44n03p04j86M0K36J107J724R45k23k51
$$ plain form
55248 72368 72603 72491 71838 71615 71877 71341 69835 68924 69302 69722 69349 68976 69023 68566 67383 66818 67533 68377 68480
55229 68480 68485 68871 69052 69003 69713 71130 71693 70774 69572 68865 68061 67162 67272 68219 68098 66291 64591 64277 64390
55210 64390 64077 64192 65226 66011 65929 66220 67627 68877 68981 68889 69380 69441 68394 67563 68085 68897 68638 67823 67518
55191 67518 67465 67134 67043 67512 67580 66625 65598 65390 65511 65612 66629 69027 71566 73174 74444 75919 76566 75470
55173 75470 73547 72125 71217 70520 70620 71857 73302 74186 75033 76219 76893 76438 75599 75052 74321 73196 72697
55156 72697 73470 74695 75559 76342 77214 77640 77784 78665 80005 79961 78014 76046 75439 75258 74572 74282 75095 75837
55138 75837 75477 74857 74768 74316 72903 71860 72305 73236 73585 74231 76038 77683 77548 76230 75187 74444 73537
55121 73537 73207 74111 75187 75229 74793 74825 74825 74210 74000 75265 77145 78242 78633 78827 78272 76765 75829 76644 77991
$$ packed form
55248G2368K35j12o53k23K62n36j506r11L78M20l73l73M7m57j183n65P15Q44J03
55229F8480NL86J81m9P10J417N63r19j202p07q04q99J10R47j21j807j700l14J13
55210F4390l13J15J034P85q2K91J407J250J04r2M91O1j047q31N22Q12k59q15l05
55191F7518n3l31r1M69O8r55j027k08J21J01J017K398K539J608J270J475O47j096
55173G5470j923j422r08o97J00J237J445Q84Q47J186O74m55q39n47p31j125m99
55156G2697P73J225Q64P83Q72M26J44Q81J340m4j947j968o07j81o86k90Q13P42
55138G5837l60o20q9m52j413j043M45R31L49O46J807J645j35j318j043p43r07
55121G3537l30R04J076M2m36L2%o15k10J265J880J097L91J94n55j507r36Q15J347
$$ plain form
55102 77991 78255 78028 78661 79649 79732 79376 79876 80977 81594 81996 83140 84660 85537 85996 86849 87785 88161 88612
55084 88612 89962 91388 91533 90686 90037 89613 88756 87805 87458 87234 86390 85616 85987 86924 86937 85825 84504 83325
55066 83325 82105 81155 80826 80751 80804 81837 84065 85910 86026 85322 85323 85690 85190 84052 83449 83513 83689 84137 85056
55047 85056 85559 84994 84415 85011 86058 86232 85846 85897 86011 85380 84676 84904 85258 84258 82237 80577 79281 77467
55029 77467 75565 74804 75084 75429 75957 77369 79064 79814 79846 80307 81255 82037 82943 84429 85454 84754 83214
55012 83214 82743 83354 83612 83472 84249 85973 87191 87478 87999 89402 90984 92085 92665 92487 91315 89858 89096
54995 89096 88922 88737 88791 89469 89952 89344 88443 88579 89370 89509 89114 89250 89706 89401 88563 88380 88827 88927 88829 89557
54975 89557 90975 92065 92955 94589 96612 97701 97834 98181 98895 99068 98757 98978 99716 99959 99622 99546 99761 99705
$$ packed form
55102G7991K64k27O33R88Q3l56N00J101O17M02J144J520Q77M59Q53R36L76M51
55084H8612J350J426J45q47o49m24q57r51l47k24q44p74L71R37J3j112j321j179
55066H3325j220r50l29p5N3J033K228J845J16p04JL67n00j138o03O4J76M48R19
55047H5056N03n65n79N96J047J74l86N1J14o31p04K28L54j000k021j660j296j814
55029G7467j902p61K80L45N28J412J695P50L2M61R48P82R06J486J025p00j540
55012H3214m71O11K58j40P77J724J218K87N21J403J582J101N80j78j172j457p62
54995H9096j74j85N4O78M83o08r01J36P91J39l95J36M56l05q38j83M47J00r8P28
54975H9557J418J090Q90J634K023J089J33L47P14J73l11K21P38K43l37p6K15n6
$$ plain form
54957 99705 99936 101431 103337 103673 102343 101252 101248 101123 99955 98373 97126 96294 96238 97542 99652 101239 102075
54940 102075 102982 103955 104111 103529 103279 103529 103470 103164 103619 104894 106034 107028 108990 112193 115776 119487 123919
54923 123919 128927 133757 138894 145760 154242 162367 168711 173342 176276 176942 175553 173053 169362 163421
54909 163421 155388 147014 139543 132968 127486 123708 121090 118073 114341 111190 109293 107865 106443 105689
54895 105689 105943 106625 107494 108874 110424 111334 111962 113538 116073 118417 120450 123227 126760 129868 132566
54880 132566 136404 141875 147695 153175 159092 165450 170637 173760 175758 177162 176746 173546 168421 162556
54866 162556 156100 149329 143399 138804 134543 129886 125558 122213 119248 116079 113164 110786 108266 105351
54852 105351 102986 101724 100720 99214 97686 96597 95361 93629 92323 92370 93438 94770 96202 97515 97980
$$ packed form
54957I9705K31J495J906L36j330j091mj25j168j582j247q32n6J304K110J587Q36
54940A02075R07R73J56n82k50K50n9l06M55J275J140R94J962L203L583L711M432
54923A23919N008M830N137O866Q482Q125O344M631K934O66j389k500l691n941
54909A63421q033q374p471o575n482l778k618l017l732l151j897j428j422p54
54895A05689K54O82Q69J380J550R10O28J576K535K344K033K777L533L108K698
54880A32566L838N471N820N480N917O358N187L123J998J404m16l200n125n865
54866A62556o456o771n930m595m261m657m328l345k965l169k915k378k520k915
54852A05351k365j262j004j506j528j089j236j732j306M7J068J332J432J313M65
$$ plain form
54837 97980 97410 96639 96169 95421 94007 92648 92072 92000 91941 92019 92427 92977 93680 94814 96057 96609 96409 96132 95807
54818 95807 94797 93350 92651 93011 93496 93678 94188 95177 95942 96498 97746 99491 100138 99116 97880 97675 97958
54801 97958 97912 97838 98086 98136 97726 97496 97608 97200 96021 95145 95197 95418 95361 95901 97499 99079 99772 100411 102043
54782 102043 104260 106137 107635 108989 109879 110213 110691 111713 112813 113957 116113 119768 124155 128748 134114
54767 134114 140537 147278 154021 161430 169301 175807 179662 181517 182080 180560 176344 170662 165022 159334
54753 159334 153039 146867 141916 138023 134523 131627 129689 127987 125604 122772 120256 118224 116686 116053
54739 116053 116253 116264 115497 114645 114320 114058 113562 113647 114883 116635 118519 121432 125933 130971 135513 140106 145522
54722 145522 151244 156740 162820 169985 176580 180315 180746 178743 174617 168462 161477 155112 149502 144118
$$ packed form
54837I7980n70p71m70p48j414j359n76p2n9P8M08N50P03J134J243N52k00k77l25
54818I5807j010j447o99L60M85J82N10R89P65N56J248J745O47j022j236k05K83
54801I7958m6p4K48N0m10k30J12m08j179q76N2K21n7N40J598J580O93O39J632
54782A02043K217J877J498J354Q90L34M78J022J100J144K156L655M387M593N366
54767A34114O423O741O743P409P871O506L855J855N63j520m216n682n640n688
54753A59334o295o172m951l893l500k896j938j702k383k832k516k032j538o33
54739A16053K00J1p67q52l25k62m96Q5J236J752J884K913M501N038M542M593N416
54722A45522N722N496O080P165O595L735M31k003m126o155o985o365n610n384
$$ plain form
54708 144118 139280 135611 132722 129934 127606 126374 125756 124824 123569 122337 120813 118912 117731 118063 118793
54693 118793 118371 117156 116662 117170 117750 118112 118661 118997 118083 115913 113674 112241 111575 111365 111270 110738 109555
54676 109555 108305 107549 107023 106348 105807 105537 104811 103186 101637 101408 102397 103696 104919 105928 106085 105101 104002
54659 104002 104004 104946 105840 106286 106294 105609 104401 103804 104504 105530 105683 105368 105750 106915 108220 109575 110946 111415
54641 111415 110370 108978 108863 109793 110232 109697 109046 108771 108502 107912 106872 105047 102600 100811 100745 101783 102705
54624 102705 103572 105101 106802 107365 106561 105280 103972 102545 101514 101741 103083 104520 105545 106358 106995 107384
54608 107384 107899 108773 109426 109447 109574 110517 111476 111277 110272 109639 109431 108923 108356 108508 108941 108524 107566 107543 108682
54589 108682 109574 109421 109030 109259 109895 110511 111155 111747 111825 111281 110634 110328 110375 110611 110706 110166 109031 108220 108462
$$ packed form
54708A44118m838l669k889k788k328j232o18r32j255j232j524j901j181L32P30
54693A18793m22j215m94N08N80L62N49L36r14k170k239j433o66k10r5n32j183
54676A09555j250p56n26o75n41k70p26j625j549k29R89J299J223J009J57r84j099
54659A04002KR42Q94M46Qo85j208n97P00J026J53l15L82J165J305J355J371M69
54641A11415j045j392j15R30M39n35o51k75k69n90j040j825k447j789o6J038R22
54624A02705Q67J529J701N63q04j281j308j427j031K27J342J437J025Q13O37L89
54608A07384N15Q74O53K1J27R43R59j99j005o33k08n08n67J52M33m17r58k3J139
54589A08682Q92j53l91K29O36O16O44N92P8n44o47l06M7K36R5n40j135q11K42
$$ plain form
54570 108462 109300 109876 110097 110224 110136 110022 110955 113459 116200 117408 116989 115893 114204 111513 108570 106837
54554 106837 106620 107153 108158 109761 111289 111889 112143 113405 115632 117449 118258 118733 119321 119828 120426 121529
54538 121529 122625 122754 122210 122288 123270 124058 123885 123032 121840 120369 119093 118605 118556 118130 117474 117348 117510 116922
54520 116922 115536 114355 113781 113422 113577 115205 118028 120175 120290 118895 117307 116265 115873 115885 115764 115195
54504 115195 114557 114208 113694 112614 111745 112116 113397 114497 115281 116251 117037 116862 116097 115705 115467 114579 113691 114356
54486 114356 116516 118536 119764 120992 122275 122510 121615 121061 121550 121993 121507 120724 120427 120554 121306 123561 127272
54469 127272 130817 132851 133697 134223 134603 134907 135679 137092 138391 138849 138560 137920 137134 136415 135800 134696 132642
54452 132642 130432 129275 128956 128246 127061 126630 127358 128212 128465 128434 128174 127190 125860 125416 125919 125907 124714 123539
$$ packed form
54570A08462Q38N76K21J27q8j14R33K504K741J208m19j096j689k691k943j733
54554A06837k17N33J005J603J528O00K54J262K227J817Q09M75N88N07N98J103
54538A21529J096J29n44P8R82P88j73q53j192j471j276m88m9m26o56j26J62n88
54520A16922j386j181n74l59J55J628K823K147J15j395j588j042l92J2j21n69
54504A15195o38l49n14j080q69L71J281J100P84R70P86j75p65l92k38q88q88O65
54486A14356K160K020J228J228J283K35q95n54M89M43m86p83k97J27P52K255L711
54469A27272L545K034Q46N26L80L04P72J413J299M58k89o40p86p19o15j104k054
54452A32642k210j157l19p10j185m31P28Q54K53l1k60r84j330m44N03j2j193j175
$$ plain form
54434 123539 123499 124128 124603 125007 125563 125929 126006 126201 126320 125562 124245 124042 125737 128075 129631 130432 130969 131033
54416 131033 130477 129880 129527 128884 127931 127719 128655 129458 128851 127278 126017 125563 125772 126602 127795 128716 129330 130491
54398 130491 132580 134761 136254 137363 138588 139754 140709 141841 143149 143798 143306 142301 141495 140866 140376 140361
54382 140361 140618 140305 139327 138666 138672 138390 137310 136434 136691 137577 138364 139409 141203 143217 144825 146350 148175
54365 148175 149755 150573 151100 151878 152595 153088 154193 156468 158995 160585 161464 162706 164767 167488 170741 174061
54349 174061 176419 177385 177807 178456 178729 177544 174732 170725 165787 160440 155732 152090 148796 145489 143156
54334 143156 142495 142356 141139 138995 137295 136588 136390 136502 137203 138415 139672 140709 141320 141150 140314 139632 139479
54317 139479 139130 138020 136797 136182 135652 134381 132740 131685 131262 130858 130372 130024 129555 128765 128346 129027 130284
$$ packed form
54434A23539m0O29M75M04N56L66P7J95J19p58j317k03J695K338J556Q01N37O4
54416A31033n56n97l53o43r53k12R36Q03o07j573j261m54K09Q30J193R21O14J161
54398A30491K089K181J493J109J225J166R55J132J308O49m92j005q06o29m90j5
54382A40361K57l13r78o61Ok82j080q76K57Q86P87J045J794K014J608J525J825
54365A48175J580Q18N27P78P17M93J105K275K527J590Q79J242K061K721L253L320
54349A74061K358R66M22O49K73j185k812m007m938n347m708l642l294l307k333
54334A43156o61j39j217k144j700p07j98J12P01J212J257J037O11j70q36o82j53
54317A39479l49j110j223o15n30j271j641j055m23m04m86l48m69p90m19O81J257
$$ plain form
54300 130284 130970 130890 130726 130808 130993 131382 132121 132770 132814 132515 132377 132164 131379 130387 130087 130675 131589 132378 132895 132972
54280 132972 132709 132707 133216 133527 133017 132303 132398 133152 133590 133431 133192 133008 132504 131779 131469 131686 131777 131397 131188 132060
54260 132060 134148 136605 138281 138734 138655 139067 140035 140652 140405 139836 139619 139800 140328 141517 143311 144829 145318
54243 145318 144983 144312 143284 141898 140732 140241 140050 139650 139197 138970 138692 138115 137689 137845 138158 137997 137552 137475
54225 137475 137903 138461 138843 138895 138604 138424 138999 140181 141060 141362 141929 143266 144619 145150 145071 144861 144357 143476
54207 143476 142909 143137 143580 143556 143219 142720 141496 139413 137545 136668 135921 134220 132081 130668 129853 128766 127628
54190 127628 127481 128449 129735 131071 132794 134637 135726 135761 135254 134624 133924 133247 132619 131753 130621 129830 129740
54173 129740 129773 129387 129109 129691 130864 131815 132345 132615 132425 131745 131326 131800 132771 133683 134793 136297 137445 137735
$$ packed form
54300A30284O86q0j64Q2J85L89P39O49M4k99j38k13p85r92l00N88R14P89N17P7
54280A32972k63kN09L11n10p14R5P54M38j59k39j84n04p25l10K17R1l80k09Q72
54260A32060K088K457J676M53p9M12R68O17k47n69k17J81N28J189J794J518M89
54243A45318l35o71j028j386j166m91j91m00m53k27k78n77m26J56L13j61m45p7
54225A37475M28N58L82N2k91j80N75J182Q79L02N67J337J353N31p9k10n04q81
54207A43476n67K28M43k4l37m99j224k083j868q77p47j701k139j413q15j087j138
54190A27628j47R68J286J336J723J843J089L5n07o30p00o77o28q66j132p91r0
54173A29740L3l86k78N82J173R51N30K70j90o80m19M74R71R12J110J504J148K90
$$ plain form
54155 137735 138020 139060 139928 139466 138494 138667 139684 139623 137920 136121 135525 135707 135703 135361 135179 135797 137711 140602
54137 140602 143071 143925 143540 143063 142774 142319 142045 142639 143750 144380 144552 145227 146600 147766 148171 148249 148528 149087
54119 149087 149857 150575 150619 149791 149013 149331 150577 151914 153144 154410 155232 155126 154695 154776 155018 154651 154066 154054
54101 154054 154069 153071 151710 151721 153279 154837 155551 156010 156479 156419 156074 156641 158299 159761 160341 160951 162458 164525
54083 164525 166709 169353 172748 176657 181254 187359 195142 203677 212213 220731 228697 234442 236549 235030
54069 235030 230760 224629 217710 211236 205762 200902 196195 191611 187168 182973 179667 177867 177076 176148 174905
54054 174905 174208 174330 174498 174351 174655 176109 178412 180894 183254 185428 187587 190405 194413 199115 203688
54039 203688 208527 214830 222623 230536 237747 244774 252039 259024 265349 271459 277671 283515 288574 293042
$$ packed form
54155A37735K85J040Q68m62r72J73J017o1j703j799n96J82ml42j82O18J914K891
54137A40602K469Q54l85m77k89m55k74N94J111O30J72O75J373J166M05P8K79N59
54119A49087P70P18M4q28p78L18J246J337J230J266Q22j06m31Q1K42l67n85j2
54101A54054J5r98j361J1J558J558P14M59M69o0l45N67J658J462N80O10J507K067
54083A64525K184K644L395L909M597O105P783Q535Q536Q518P966N745K107j519
54069B35030m270o131o919o474n474m860m707m584m443m195l306j800p91r28j243
54054A74905o97J22J68j47L04J454K303K482K360K174K159K818M008M702M573
54039B03688M839O303P793P913P211P027P265O985O325O110O212N844N059M468
$$ plain form
54025 293042 297135 300855 304597 308899 313368 316926 319366 321524 323685 325088 325316 324795 323448 320188 314482
54010 314482 307317 299909 292437 284641 276668 268734 260760 252887 245583 238948 232704 227033 222422 218549
53996 218549 214549 210563 207675 205958 204026 201055 197896 195561 193981 192914 192679 193118 193090 191943 190435
53981 190435 189365 188373 186950 185521 184555 183602 182214 180923 180326 180039 179495 179021 179155 179617 179854 180017 180461
53964 180461 180850 180615 179866 179225 179145 179848 181324 182972 183991 184547 185755 188029 190419 192140 193715 195906
53948 195906 198486 201025 203966 207887 212348 216463 220151 224020 228480 233759 240328 248563 258298 269205
53934 269205 281175 293957 306956 319875 333001 346452 359643 371679 381468 387319 387604 382510
53922 382510 374320 365499 357332 350661 346528 345214 345754 347333 350235 354686 359837 364950 370586 377447
$$ packed form
54025B93042M093L720L742M302M469L558K440K158K161J403K28n21j347l260n706
54010C14482p165p408p472p796p973p934p974p873p304o635o244n671m611l873
53996B18549m000l986k888j717j932k971l159k335j580j067k35M39k8j147j508
53981A90435j070r92j423j429r66r53j388j291n97k87n44m74J34M62K37J63M44
53964A80461L89k35p49o41q0P03J476J648J019N56J208K274K390J721J575K191
53948A95906K580K539K941L921M461M115L688L869M460N279O569Q235R735J0907
53934B69205J1970J2782J2999J2919J3126J3451J3191J2036R789N851K85n094
53922C82510q190q821q167o671m133j314N40J579K902M451N151N113N636O861
$$ plain form
53908 377447 384812 391246 396213 399921 402248 402960 402541 401704 400408 398210 395197 391755 387854 383341 378510
53893 378510 373632 368440 362768 357120 351854 346377 339945 332716 325202 317311 308795 300137 292144 285136
53879 285136 279285 274992 272005 268859 264373 259243 255004 251818 248510 244547 240724 237756 235264 232448
53865 232448 229079 225545 222347 219725 217529 215457 213464 211625 209636 207088 204382 202559 201819 201090 199581
53850 199581 197877 196768 195920 194626 193158 192291 191974 191470 190527 189537 188843 188583 188878 189522 189905 189855 190016 190730
53832 190730 191200 190577 189243 188102 187236 186292 185671 186166 187671 189325 190747 192178 193562 194479 194967 195570
53816 195570 196555 197713 198870 199999 201106 202562 205214 209410 214189 218171 221071 223742 227068 231464
53802 231464 237040 243357 249261 253842 257511 261468 266252 271437 276502 281234 285404 288826 291725 294440
$$ packed form
53908C77447P365O434M967L708K327P12m19q37j296k198l013l442l901m513m831
53893C78510m878n192n672n648n266n477o432p229p514p891q516q658p993p008
53879B85136n851m293k987l146m486n130m239l186l308l963l823k968k492k816
53865B32448l369l534l198k622k196k072j993j839j989k548k706j823p40p29j509
53850A99581j704j109q48j294j468q67l17n04r43r90o94k60K95O44L83n0J61P14
53832A90730M70o23j334j141q66r44o21M95J505J654J422J431J384R17M88O03
53816A95570R85J158J157J129J107J456K652M196M779L982K900K671L326M396
53802B31464N576O317N904M581L669L957M784N185N065M732M170L422K899K715
$$ plain form
53788 294440 296799 298233 298456 297637 296165 294597 293497 292818 291777 289712 286733 283141 278844 273871 268832
53773 268832 264157 259426 254207 249009 244591 240736 236633 232128 227762 223849 220323 217252 214698 212287
53759 212287 209608 206880 204596 202772 201193 199985 199234 198380 196826 194876 193322 192309 191354 190285 189426
53744 189426 188986 188874 188968 189110 189107 189184 189943 191329 192213 191745 190629 190295 191272 193127 195389 197579 198833 198686
53726 198686 198033 198262 199555 200939 201859 202732 203948 205216 206025 206108 205459 204476 204029 204868 206963 209767 212759
53709 212759 215412 217187 218150 219104 220524 221917 222896 224206 226796 230472 234309 237865 241119 243876 246277
53694 246277 249281 253454 257794 260919 262908 264708 266248 266651 266084 265806 266296 266718 266357 265361 263947 262071
53678 262071 260086 258590 257463 256152 255009 255117 256502 257708 257607 256646 255806 255298 254877 254724 255260 256530
$$ packed form
53788B94440K359J434K23q19j472j568j100o79j041k065k979l592m297m973n039
53773B68832m675m731n219n198m418l855m103m505m366l913l526l071k554k411
53759B12287k679k728k284j824j579j208p51q54j554j950j554j013r55j069q59
53744A89426m40j12R4J42lP7P59J386Q84m68j116l34R77J855K262K190J254j47
53726A98686o53K29J293J384R20Q73J216J268Q09Q3o49r83m47Q39K095K804K992
53709B12759K653J775R63R54J420J393R79J310K590L676L837L556L254K757K401
53694B46277L004M173M340L125J989J800J540M03n67k78M90M22l61r96j414j876
53678B62071j985j496j127j311j143J08J385J206j01r61q40n08m21j53N36J270
$$ plain form
53662 256530 258173 259750 260868 261334 261353 261262 261089 260632 259813 258608 256890 254888 253517 253607 254921 256479 257593
53645 257593 258110 258056 257730 257760 258296 258547 257931 257274 257842 259526 261108 262142 263398 265406 267637 269297 270070
53628 270070 270007 269472 269331 270419 272704 275477 278273 281030 283649 286143 288951 292330 295778 298864 302195
53613 302195 306491 311157 315056 318466 322916 329086 336120 343060 349732 356033 361605 366573 371571 376644
53599 376644 380942 383773 385202 385531 384971 383943 382860 381522 379486 377034 374945 373362 371747 369931 368327
53584 368327 367111 366052 365081 364130 362606 359983 356818 354161 352181 350406 348938 348123 347312 345580 343612
53569 343612 343225 344731 346356 346650 346003 345265 344417 343320 342513 342407 342640 342852 343235 343867 344387 344779 345520 346598
53551 346598 347347 347592 347958 348706 349359 349808 350642 351967 353105 353917 355219 357295 359258 360559 361941 364132
$$ packed form
53662B56530J643J577J118M66J9r1j73m57q19j205j718k002j371R0J314J558J114
53645B57593N17n4l26L0N36K51o16o57N68J684J582J034J256K008K231J660P73
53628B70070o3n35j41J088K285K773K796K757K619K494K808L379L448L086L331
53613C02195M296M666L899L410M450O170P034O940O672O301N572M968M998N073
53599C76644M298K831J429L29n60j028j083j338k036k452k089j583j615j816j604
53584C68327j216j059r71r51j524k623l165k657j980j775j468q15q11j732j968
53569C43612l87J506J625K94o47p38q48j097q07j06K33K12L83O32N20L92P41J078
53551C46598P49K45L66P48O53M49Q34J325J138Q12J302K076J963J301J382K191
$$ plain form
53535 364132 366761 369438 372808 377526 383099 388748 394729 401794 409918 418394 426718 434744 442513 450609
53521 450609 460141 471759 485055 499274 514012 528954 543754 558666 574521 591648 609598 628316
53509 628316 648543 670488 693082 715313 737386 759800 782233 804271 826417 849291 872413
53498 872413 894773 916100 936676 956422 975217 993754 1013042 1033144 1053234 1072779 1091925
53487 1091925 1110764 1129012 1146552 1163763 1181087 1198544 1215767 1232404 1248485 1264390 1280404
53476 1280404 1296398 1312146 1327652 1342755 1356636 1368346 1377680 1384934 1390051 1392759 1393339 1392268 1389155
53463 1389155 1383124 1374326 1363914 1352323 1338792 1323042 1306305 1290030 1274444 1258943 1243061 1226433
53451 1226433 1208558 1189191 1168516 1146696 1123953 1101278 1080060 1060609 1041890 1023141 1004838
$$ packed form
53535C64132K629K677L370M718N573N649N981P065Q124Q476Q324Q026P769Q096
53521D50609R532J1618J3296J4219J4738J4942J4800J4912J5855J7127J7950J8718
53509F28316K0227K1945K2594K2231K2073K2414K2433K2038K2146K2874K3122
53498H72413K2360K1327K0576J9746J8795J8537J9288K0102K0090J9545J9146
53487A091925J8839J8248J7540J7211J7324J7457J7223J6637J6081J5905J6014
53476A280404J5994J5748J5506J5103J3881J1710R334P254N117K708N80j071l113
53463A389155o031q798j0412j1591j3531j5750j6737j6275j5586j5501j5882j6628
53451A226433j7875j9367k0675k1820k2743k2675k1218j9451j8719j8749j8303
$$ plain form
53440 1004838 987712 971815 957090 943957 932725 923221 915423 909594 905416 901979 899073 897447 897300
53427 897300 897700 898193 899785 903436 908591 914212 920466 928382 938465 950488 964065 978709 993936
53414 993936 1009940 1027510 1046828 1067147 1088168 1110703 1135272 1161138 1187562 1215050 1244447
53403 1244447 1275703 1308512 1343278 1380408 1419418 1459752 1501814 1546223 1592731 1640816 1690549
53392 1690549 1741896 1793938 1845884 1898218 1951787 2006370 2061165 2115990 2170892 2225142 2277775
53381 2277775 2328596 2377572 2423825 2466469 2505994 2543560 2579190 2611758 2640458 2665179 2685684
53370 2685684 2701515 2712614 2719146 2720867 2717406 2708793 2694899 2674784 2647576 2613667 2574134 2529434
53358 2529434 2479768 2426394 2371390 2316125 2260870 2205787 2151361 2097942 2045737 1995268 1947110
$$ packed form
53440A004838j7126j5897j4725j3133j1232r504p798n829m178l437k906j626j47
53427H97300M00M93J592L651N155N621O254P916J0083J2023J3577J4644J5227
53414I93936J6004J7570J9318K0319K1021K2535K4569K5866K6424K7488K9397
53403A244447L1256L2809L4766L7130L9010M0334M2062M4409M6508M8085M9733
53392A690549N1347N2042N1946N2334N3569N4583N4795N4825N4902N4250N2633
53381B277775N0821M8976M6253M2644L9525L7566L5630L2568K8700K4721K0505
53370B685684J5831J1099O532J721l461q613j3894k0115k7208l3909l9533m4700
53358B529434m9666n3374n5004n5265n5255n5083n4426n3419n2205n0469m8158
$$ plain form
53347 1947110 1901213 1857039 1814179 1772345 1731061 1689996 1649276 1608976 1568790 1528779 1489876
53336 1489876 1452947 1417976 1384892 1354437 1327267 1302868 1280410 1260007 1241982 1225577 1209801
53325 1209801 1195088 1182583 1171906 1161070 1148659 1134928 1120726 1106602 1093095 1080760 1069505
53314 1069505 1058798 1048736 1040093 1033203 1027639 1023195 1020375 1019646 1020784 1023256 1026789 1031445 1037456 1044930
53300 1044930 1053538 1062760 1072787 1084658 1098970 1114981 1131655 1149173 1168589 1190398 1214204 1239446
53288 1239446 1265634 1292197 1318854 1345851 1373105 1399560 1424121 1446768 1467921 1487286 1504378
53277 1504378 1519654 1533881 1546642 1556621 1563163 1566462 1566457 1562813 1555978 1547031 1536356 1523422 1507989
53264 1507989 1490547 1471418 1450312 1427001 1401777 1375157 1347676 1319879 1291918 1263346 1233912
$$ packed form
53347A947110m5897m4174m2860m1834m1284m1065m0720m0300m0186m0011l8903
53336A489876l6929l4971l3084l0455k7170k4399k2458k0403j8025j6405j5776
53325A209801j4713j2505j0677j0836j2411j3731j4202j4124j3507j2335j1255
53314A069505j0707j0062q643o890n564m444k820p29J138K472L533M656O011P474
53300A044930Q608R222J0027J1871J4312J6011J6674J7518J9416K1809K3806K5242
53288A239446K6188K6563K6657K6997K7254K6455K4561K2647K1153J9365J7092
53277A504378J5276J4227J2761R979O542L299nl644o835q947j0675j2934j5433
53264A507989j7442j9129k1106k3311k5224k6620k7481k7797k7961k8572k9434
$$ plain form
53253 1233912 1204268 1175238 1146773 1118413 1090319 1062977 1036292 1009984 984480 960336 937117
53242 937117 913899 890493 867067 843080 818030 793007 769969 749463 730405 712073 694860
53231 694860 678887 663370 647818 632743 618726 605821 594126 583947 575055 566649 558266 549930
53219 549930 541438 532514 523555 514963 505685 493932 479729 465351 452601 440951 429139 417474
53207 417474 407416 399543 392959 386498 379783 373210 367275 361966 356767 351324 345854 340592 335206 329316
53193 329316 323226 317473 312050 306825 302272 298808 295771 292202 288349 285234 282907 280436 277544 274879
53179 274879 272637 270320 267994 266346 265219 263507 260943 258599 257076 255517 253140 250519 248508 246878
53165 246878 244922 242665 240672 239167 237957 236821 235617 234481 234056 234860 236273 236945 236378 235315 234420
$$ packed form
53253A233912k9644k9030k8465k8360k8094k7342k6685k6308k5504k4144k3219
53242I37117k3218k3406k3426k3987k5050k5023k3038k0506j9058j8332j7213
53231F94860j5973j5517j5552j5075j4017j2905j1695j0179q892q406q383q336
53219E49930q492q924q959q592r278j1753j4203j4378j2750j1650j1812j1665
53207D17474j0058p873o584o461o715o573n935n309n199n443n470n262n386n890
53193C29316o090n753n423n225m553l464l037l569l853l115k327k471k892k665
53179B74879k242k317k326j648j127j712k564k344j523j559k377k621k011j630
53165B46878j956k257j993j505j210j136j204j136m25Q04J413O72n67j063q95
$$ plain form
53150 234420 233507 232271 230848 229354 227726 226300 225615 225467 225086 224433 224227 224523 224497 223978 223945 225017 226625
53133 226625 228188 229848 231459 232160 231802 231609 232500 233865 234873 235855 237250 238169 237445 235582 234400 234974
53117 234974 236846 238967 240526 241123 240928 240612 240618 240686 240375 239626 238509 237008 235473 234555 234169 233268 231292
53100 231292 229164 228035 227655 226893 225492 224358 224253 224919 225506 225368 224476 223393 222747 222645 222746 222945 223434
53083 223434 224056 224237 223846 223481 223612 224036 224440 224835 225109 224894 224269 223883 223924 223660 222476 220712 218992 217421
53065 217421 216009 215135 214875 214473 213251 211647 210687 210698 211086 211096 210356 209045 207880 207618 208233 208951 209290 209526
53047 209526 209913 210155 210004 209767 209810 210113 210585 211179 211396 210495 208647 207107 206749 207180 207700 208293 209033 209381
53029 209381 208875 207896 207032 206246 205302 204429 203915 203649 203690 204646 206770 209268 211184 212380 213032 212875 211818
$$ packed form
53150B34420r13j236j423j494j628j426o85j48l81o53k06K96k6n19l3J072J608
53133B26625J563J660J611P01l58j93Q91J365J008R82J395R19p24j863j182N74
53117B34974J872K121J559N97j95l16OO8l11p49j117j501j535r18l86r01j976
53100B31292k128j129l80p62j401j134j05O66N87j38q92j083o46j02J01J99M89
53083B23434O22J81l91l65J31M24M04L95K74k15o25l86M1k64j184j764j720j571
53065B17421j412q74k60m02j222j604r60J1L88J0p40j311j165k62O15P18L39K36
53047B09526L87K42j51k37M3L03M72N94K17r01j848j540l58M31N20N93P40L48
53029B09381n06r79q64p86r44q73n14k66M1R56K124K498J916J196O52j57j057
$$ plain form
53012 211818 210665 210241 210285 210096 209875 210437 211848 213272 214099 214447 214591 214512 214111 213484 213004 213174 214089 214978
52994 214978 214910 214109 213815 214489 215107 214799 214277 214806 216534 218738 221047 223437 225529 226891 227690 228289 228560
52977 228560 228416 228523 229580 231256 232739 233960 235341 236648 237158 236878 236641 236930 237355 237345 236730 235654 234489
52960 234489 233771 233678 233633 232948 231734 230634 229819 228775 227057 224819 222663 221280 221086 221852 222804 223308 223300 222953
52942 222953 222388 221841 221599 221486 220966 220015 219226 218763 218004 216629 215258 214447 213895 213319 213296 214382 216043 217272
52924 217272 217682 217289 215968 213998 212467 212139 212444 212429 212137 212122 212287 212274 212396 212997 213429 212894 211923 211737 212407
52905 212407 212895 212689 212163 211460 210312 209041 208527 208945 209514 209695 209783 210174 210827 211530 212047 212059 211673 211843 213457
52886 213457 216100 218439 219700 219994 219490 218226 216610 215164 213871 212651 212213 213321 215383 216926 217488
$$ packed form
53012B11818j153m24M4j89k21N62J411J424Q27L48J44p9m01o27m80J70R15Q89
52994B14978o8q01k94O74O18l08n22N29J728K204K309K390K092J362P99N99K71
52977B28560j44J07J057J676J483J221J381J307N10k80k37K89M25j0o15j076j165
52960B34489p18r3m5o85j214j100q15j044j718k238k156j383j94P66R52N04ql47
52942B22953n65n47k42j13n20r51p89m63p59j375j371q11n52n76k3J086J661J229
52924B17272M10l93j321j970j531l28L05j5k92j5J65j3J22O01M32n35r71j86O70
52905B12407M88k06n26p03j148j271n14M18N69J81Q8L91O53P03N17J2l86J70J614
52886B13457K643K339J261K94n04j264j616j446j293j220m38J108K062J543N62
$$ plain form
52871 217488 217871 218530 218975 219015 219382 220745 223103 226458 230925 235728 239223 240591 240706 240778 240951 240772 240171
52854 240171 239187 237392 234437 230796 227319 224309 221602 219212 217302 215691 213913 211771 209505 207443
52840 207443 205703 204257 203100 202302 201951 202056 202559 203378 204275 204733 204433 203986 204653 206910 209730 211702 212421
52823 212421 212276 211418 209733 207498 205300 203480 202363 202658 204704 207512 209587 210743 212229 215002 218714
52808 218714 222418 225328 226678 225816 222947 219212 215617 212332 209197 206324 203889 201824 200009 198417
52794 198417 196985 195721 194992 195177 195963 196494 196358 195947 195768 195874 196093 196308 196396 196374 196649 197640 199098 200291
52776 200291 200937 201375 201768 201813 201469 201357 202051 203381 204773 205881 206546 206412 205038 202449 199448 197342 197116
52759 197116 198671 200956 203020 204725 206217 207133 206852 205368 203372 201559 200267 199722 200122 201450 203513
$$ packed form
52871B17488L83O59M45M0L67J363K358L355M467M803L495J368J15P2J73j79o01
52854B40171r84j795k955l641l477l010k707k390j910j611j778k142k266k062
52840B07443j740j446j157p98l51J05N03Q19Q97M58l00m47O67K257K820J972P19
52823B12421j45q58j685k235k198j820j117K95K046K808K075J156J486K773L712
52808B18714L704K910J350q62k869l735l595l285l135k873k435k065j815j592
52794A98417j432j264p29J85P86N31j36m11j79J06K19K15Q8k2K75R91J458J193
52776B00291O46M38L93M5l44j12O94J330J392J108O65j34j374k589l001k106k26
52759A97116J555K285K064J705J492R16k81j484j996j813j292n45M00J328K063
$$ plain form
52744 203513 206085 208767 210950 212307 213079 213614 213937 214116 214533 215272 215748 215640 215679 216726 218507 220207 221865
52727 221865 224077 226554 228258 228966 229556 230460 230967 230435 229261 228158 227227 226228 225175 224163 223030 221620
52711 221620 220113 218822 217871 217124 216219 214793 213010 211708 211525 212046 212362 212338 212666 213691 214851 215411 215254
52694 215254 214884 214998 216002 217543 218696 218921 218570 218147 217572 216750 216201 216389 216966 217562 218650 220530 222001
52677 222001 221516 219402 217519 216794 216511 216023 215649 215622 215613 215791 217062 219632 222361 224085 224661 224372 223355
52660 223355 222101 221517 221955 222963 224308 226278 228655 230544 231742 233179 235375 237468 238454 238403 237715 236159
52644 236159 233569 230708 228463 226733 224915 223021 221630 221122 221548 222812 224517 226136 227741 229900 232463
52629 232463 234330 235023 235641 237427 239982 241770 241848 240325 237646 234352 231214 228754 226755 224841 223241
$$ packed form
52744B03513K572K682K183J357P72N35L23J79M17P39M76j08L9J047J781J700J658
52727B21865K212K477J704P08N90R04N07n32j174j103r31r99j053j012j133j410
52711B21620j507j291r51p47r05j426j783j302j83N21L16k4L28J025J160N60j57
52694B15254l70J14J004J541J153K25l51m23n75q22n49J88N77N96J088J880J471
52677B22001m85k114j883p25k83m88l74k7rJ78J271K570K729J724N76k89j017
52660B23355j254n84M38J008J345J970K377J889J198J437K196K093R86n1o88j556
52644B36159k590k861k245j730j818j894j391n08M26J264J705J619J605K159K563
52629B32463J867O93O18J786K555J788P8j523k679l294l138k460j999j914j600
$$ plain form
52614 223241 222398 222131 221867 221402 220870 220222 219443 219023 219510 220684 221772 222429 222977 223694 224420 224901 225104 225127
52596 225127 225079 225114 225381 225927 226727 227726 228775 229690 230473 231264 232077 232794 233500 234476 235742 236854 237327 237019
52578 237019 236115 234981 234089 233781 233995 234433 234995 235779 236746 237659 238272 238346 237711 236625 235767 235450 235192 234564
52560 234564 233985 234021 234348 234242 233723 233254 232708 231742 230874 230903 231377 231028 229743 228733 228509 228193 227252 226501 226704
52541 226704 227342 227489 226981 226096 225036 224272 224462 225425 226077 225928 225749 226285 227329 228559 230149 231861 232682
52524 232682 232258 231713 232084 232818 232757 231830 230876 230464 230827 232248 234604 237028 238840 240378 242280 244538 246879
52507 246879 249352 251856 253799 254929 255785 256647 256806 255660 253675 251458 248720 245148 241517 238938 237569
52492 237569 237015 237250 238135 238743 238323 237402 236873 236579 235945 235432 236048 237735 239472 240806 242072 243289 244011
$$ packed form
52614B23241q43k67k64m65n32o48p79m20M87J174J088O57N48P17P26M81K03K3
52596B25127m8L5K67N46Q00R99J049R15P83P91Q13P17P06R76J266J112M73l08
52578B37019r04j134q92l08K14M38N62P84R67R13O13P4o35j086q58l17k58o28
52560B34564n79L6L27j06n19m69n46r66q68K9M74l49j285j010k24l16r41p51K03
52541B26704O38J47n08q85j060p64J90R63O52j49j79N36J044J230J590J712Q21
52524B32682m24n45L71P34o1r27r54m12L63J421K356K424J812J538J902K258K341
52507B46879K473K504J943J130Q56Q62J59j146j985k217k738l572l631k579j369
52492B37569n54K35Q85O08m20r21n29k94o34n13O16J687J737J334J266J217P22
$$ plain form
52475 244011 244330 244980 246337 248057 249710 251115 252129 252730 253194 253723 254225 254918 256619 259654 263005 265320
52459 265320 266377 266828 267031 267002 266947 266855 265961 263631 260396 257191 254018 250480 247136 245042 244109 243184 241710
52442 241710 240179 238957 237799 236720 236316 236917 238080 239048 239216 238353 237023 236435 237108 238034 238055 237615 237964
52425 237964 239048 239592 239244 239115 239894 240784 240845 240325 240089 240518 241575 243280 245631 248479 251862 256048 261111
52408 261111 266889 273458 281138 289948 299525 309517 319466 328356 334975 338751 339693 337594 332148 323953
52394 323953 314582 305384 296798 288998 282452 277518 274055 271751 270445 269844 269342 268475 267396 266735 267052
52379 267052 268353 270018 271392 272571 274255 276610 278882 280588 282456 285445 289292 292884 295679 297855
52365 297855 299387 300025 300091 300278 300682 300902 301079 301793 302890 303440 303131 302778 303097 303795 304276 304545 305016 306006
$$ packed form
52475B44011L19O50J357J720J653J405J014O01M64N29N02O93J701L035L351K315
52459B65320J057M51K03k9n5r2q94k330l235l205l173l538l344k094r33r25j474
52442B41710j531j222j158j079m04O01J163R68J68q63j330n88O73R26K1m40L49
52425B37964J084N44l48j29P79Q90O1n20k36M29J057J705K351K848L383M186N063
52408B61111N778O569P680Q810R577R992R949Q890O619L776R42k099n446q195
52394C23953r371r198q586p800o546m934l463k304j306o01n02q67j079o61L17
52379B67052J301J665J374J179J684K355K272J706J868K989L847L592K795K176
52365B97855J532O38O6J87M04K20J77P14J097N50l09l53L19O98M81K69M71R90
$$ plain form
52347 306006 307711 310108 312586 314244 314969 315718 317380 319785 322194 324358 326721 329795 333705 338240 343173
52332 343173 348561 354709 361780 369517 377573 385921 394729 404009 413726 424058 435215 447067 459274
52319 459274 471589 483828 495837 507771 520101 532982 546007 558979 572484 587190 602958
52308 602958 619210 635732 652553 669391 685965 702531 719451 736452 752918 768599 783414
52297 783414 796970 808998 819844 829742 838003 843825 847578 850347 852390 853044 851994 849648 846317 842003
52283 842003 837069 832243 827873 823857 820238 817157 814375 811703 809816 809680 811147 812996 814541 816368
52269 816368 819337 823570 828612 833964 839262 844440 849809 855693 862098 869145 877411 887341 898625 910719
52255 910719 923537 937045 950799 964684 979403 995159 1010448 1023358 1033664 1042405 1049860 1055374
$$ packed form
52347C06006J705K397K478J658P25P49J662K405K409K164K363L074L910M535M933
52332C43173N388O148P071P737Q056Q348Q808R280R717J0332J1157J1852J2207
52319D59274J2315J2239J2009J1934J2330J2881J3025J2972J3505J4706J5768
52308F02958J6252J6522J6821J6838J6574J6566J6920J7001J6466J5681J4815
52297G83414J3556J2028J0846R898Q261N822L753K769K043O54j050k346l331m314
52283H42003m934m826m370m016l619l081k782k672j887j36J467J849J545J827
52269H16368K969M233N042N352N298N178N369N884O405P047Q266R930J1284J2094
52255I10719J2818J3508J3754J3885J4719J5756J5289J2910J0306Q741P455N514
$$ plain form
52243 1055374 1058902 1061213 1062565 1062580 1061452 1059924 1057986 1054891 1050588 1045854 1040991 1035680 1030159 1025113
52229 1025113 1020205 1014236 1007107 1000190 994345 988900 983048 977013 971383 966509 962932 961155 960532 959664
52215 959664 958356 957954 959347 961973 965223 969298 974028 978366 981951 985801 990502 995030 998483 1001755
52201 1001755 1006228 1011759 1017238 1022412 1027915 1034006 1040390 1046945 1053763 1060710 1067515 1073887 1079171 1082540
52187 1082540 1084009 1084578 1084810 1084009 1081309 1076789 1071029 1064427 1057572 1051315 1045691 1039626 1032557 1025484 1019539
52172 1019539 1014298 1008582 1002326 996599 992143 988799 986081 983577 981066 978880 977856 978404 979980 981839
52158 981839 983787 985764 987353 988270 988761 989036 988946 988686 989039 990294 991695 992670 993787 995738 998078 999891
52142 999891 1001082 1002069 1002658 1002119 1000159 997106 993449 989762 986741 984760 983715 983681 985214 988617 993536
$$ packed form
52243A055374L528K311J352J5j128j528j938l095m303m734m863n311n521n046
52229A025113m908n969p129o917n845n445n852o035n630m874l577j777o23q68
52215I59664j308m02J393K626L250M075M730M338L585L850M701M528L453L272
52201A001755M473N531N479N174N503O091O384O555O818O947O805O372N284L369
52187A082540J469N69K32q01k700m520n760o602o855o257n624o065p069p073n945
52172A019539n241n716o256n727m456l344k718k504k511k186j024N48J576J859
52158I81839J948J977J589R17M91K75r0k60L53J255J401R75J117J951K340J813
52142I99891J191R87N89n39j960l053l657l687l021j981j045l4J533L403M919
$$ plain form
52127 993536 999706 1007398 1016700 1027211 1039042 1053189 1070086 1088589 1107193 1125553 1144018 1162486
52115 1162486 1180724 1199142 1218163 1237329 1255899 1273798 1291126 1307451 1322603 1337523 1353176
52104 1353176 1369117 1384253 1398519 1412594 1426313 1438663 1449236 1458470 1466414 1472264 1475237 1475090
52092 1475090 1471784 1465497 1456930 1446861 1435380 1422263 1408068 1394170 1381655 1370657 1360652 1350962
52080 1350962 1341253 1332086 1324622 1319273 1315020 1310750 1306751 1304106 1303083 1303114 1304071 1306522 1310713 1316207 1322549
52065 1322549 1329604 1337197 1345124 1353551 1362877 1373266 1384740 1397476 1411340 1425310 1438035 1448947
52053 1448947 1458361 1466639 1473793 1479643 1483773 1485522 1484552 1481293 1476389 1470048 1462377 1453893 1444999 1435344
52039 1435344 1424455 1412823 1401624 1391528 1382284 1373192 1363436 1352331 1339950 1327289 1315214 1303472
$$ packed form
52127I93536O170P692R302J0511J1831J4147J6897J8503J8604J8360J8465J8468
52115A162486J8238J8418J9021J9166J8570J7899J7328J6325J5152J4920J5653
52104A353176J5941J5136J4266J4075J3719J2350J0573R234P944N850K973j47
52092A475090l306o287q567j0069j1481j3117j4195j3898j2515j0998j0005r690
52080A350962r709r167p464n349m253m270l999k645j023L1R57K451M191N494O342
52065A322549P055P593P927Q427R326J0389J1474J2736J3864J3970J2725J0912
52053A448947R414Q278P154N850M130J749r70l259m904o341p671q484q894r655
52039A435344j0889j1632j1199j0096r244r092r756j1105j2381j2661j2075j1742
$$ plain form
52027 1303472 1291164 1277759 1263162 1247449 1231344 1216355 1203471 1192068 1180920 1169854 1159504
52016 1159504 1149936 1140660 1131751 1123812 1116869 1110224 1103333 1096007 1087878 1078523 1067955 1056165 1042398
52003 1042398 1025866 1007053 987374 967718 948311 929800 913230 898758 885442 872505 859892
51992 859892 847360 834005 819195 803334 787363 771898 756930 741919 726244 710028 694285
51981 694285 679617 665047 649017 631425 613784 597421 582538 569113 557743 549164 543563 540589
51969 540589 539572 539728 540760 543237 547713 553566 559375 564407 568971 573386 577428 580766 583021 583269 580445
51954 580445 574560 566856 558611 550468 542932 536652 531866 528356 526237 526190 528671 533497 540419 549432 560284
51939 560284 572326 585130 598702 612773 626377 638426 648311 655755 660512 662423 661548 658154 652789
$$ packed form
52027A303472j2308j3405j4597j5713j6105j4989j2884j1403j1148j1066j0350
52016A159504r568r276q909p939o943o645o891p326q129r355j0568j1790j3767
52003A042398j6532j8813j9679j9656j9407j8511j6570j4472j3316j2937j2613
51992H59892j2532j3355j4810j5861j5971j5465j4968j5011j5675j6216j5743
51981F94285j4668j4570j6030j7592j7641j6363j4883j3425j1370q579n601k974
51969E40589j017J56J032K477M476N853N809N032M564M415M042L338K255K48k824
51954E80445n885p704q245q143p536o280m786l510k119m7K481M826O922R013J0852
51939E60284J2042J2804J3572J4071J3604J2049R885P444M757J911q75l394n365
$$ plain form
51926 652789 646127 638404 629327 619115 609237 601308 595522 591099 588163 588044 591565 598124 606804 617411
51912 617411 629683 642098 652087 657289 656527 650086 639406 626196 611645 596546 581822 568246
51900 568246 555763 543753 532006 520715 509575 497724 484797 471401 458344 446045 434844
51889 434844 425181 417243 410985 406633 404564 404513 405674 407833 411716 417823 425502 433653 441948 450965 461318
51874 461318 472812 484233 493899 500707 504634 505991 504518 499763 492201 483299 474495 466660 460321 455598
51860 455598 451915 448629 446019 444961 445527 446673 447418 447560 447118 445893 443843 441157 437699 433084 427527
51845 427527 421930 416853 412075 407388 403047 399109 395057 390601 386319 383095 381343 381010 381819 383245 384764
51830 384764 386407 388584 391173 393318 394402 394662 394589 394220 393333 391900 390115 388322 387058 386724 387127 387787
$$ packed form
51926F52789o662p723r077j0212r878p929n786m423k936j19L521O559Q680J0607
51912F17411J2272J2415R989N202p62o441j0680j3210j4551j5099j4724j3576
51900E68246j2483j2010j1747j1291j1140j1851j2927j3396j3057j2299j1201
51889D34844r663p938o258m352k069n1J161K159L883O107P679Q151Q295R017J0353
51874D61318J1494J1421R666O808L927J357j473m755p562q902q804p835o339m723
51860D55598l683l286k610j058N66J146P45J42m42j225k050k686l458m615n557
51845D27527n597n077m778m687m341l938m052m456m282l224j752l33Q09J426J519
51830C84764J643K177K589K145J084K60p3l69q87j433j785j793j264l34M03O60
$$ plain form
51814 387787 388690 390176 392070 393604 394326 394390 393816 392223 389598 386645 384069 382026 380495 379569 379095 378618
51798 378618 377999 377639 377840 378403 378915 378963 378019 375840 373079 370860 369597 368825 368265 368228 368808 369511 369970 370257
51780 370257 370269 369626 368557 368056 368738 370224 372082 374663 378532 383729 389967 396966 404260 411349 418382
51765 418382 425943 433730 440225 444122 445413 444660 442056 437850 432875 427823 422559 416833 411149 406157
51751 406157 401652 396976 392084 387525 383590 380181 377293 375032 373272 371874 371180 371857 374220 377911 382181
51736 382181 386368 390349 394605 399547 404643 408657 410930 411958 412490 412540 411715 410182 408925 409133 411346
51721 411346 414833 417788 418613 417235 414832 412411 410239 408554 407860 408184 408767 408963 408862 408685 408249 407520
51705 407520 407210 408312 411239 415542 419993 422848 422792 420137 416674 414038 412610 412120 412608 414318 417072
$$ packed form
51814C87787R03J486J894J534P22O4n74j593k625k953k576k043j531r26m74m77
51798C78618o19l60K01N63N12M8r44k179k761k219j263p72n60l7N80P03M59K87
51780C70257J2o43j069n01O82J486J858K581L869N197O238O999P294P089P033
51765D18382P561P787O495L897J291p53k604m206m975n052n264n726n684m992
51751D06157m505m676m892m559l935l409k888k261j760j398o94O77K363L691M270
51736C82181M187L981M256M942N096M014K273J028N32N0q25j533j257K08K213
51721D11346L487K955Q25j378k403k421k172j685o94L24N83J96j01j77m36p29
51705D07520l10J102K927M303M451K855n6k655l463k636j428m90M88J710K754
$$ plain form
51690 417072 420115 422328 422569 420317 416105 410891 405114 398979 393394 389520 387306 385565 383736 382474
51676 382474 382184 382194 381949 381890 382390 382895 382961 383304 384909 387843 391800 397109 404205 412525 420731 427657 432474
51659 432474 434535 433876 431507 428604 425798 423740 423611 426300 431513 438400 446572 455818 465220 473183 478026
51644 478026 478191 472587 461570 447182 431801 416806 402853 390650 380735 373019 367301 363780 362468
51631 362468 362602 363297 364259 365314 365857 365531 364908 364767 365094 365401 365465 365098 363838 361644 359370 357808 356834
51614 356834 356104 355849 356130 356095 355127 354095 354266 355361 355904 355309 354477 354473 355608 357792 360832 364373 368298
51597 368298 373143 379434 386844 394682 402937 411894 420859 428129 432269 432804 429894 424207 417112 410223
51583 410223 404646 401055 400235 402813 408490 416253 425365 435812 447923 462004 478017 495132 511884
$$ packed form
51690D17072L043K213K41k252m212n214n777o135n585l874k214j741j829j262
51676C82474k90J0k45n9N00N05O6L43J605K934L957N309P096Q320Q206O926M817
51659D32474K061o59k369k903k806k058j29K689N213O887Q172R246R402P963M843
51644D78026J65n604j1017j4388j5381j4995j3953j2203r915p716n718l521j312
51631C62468J34O95R62J055N43l26o23j41L27L07O4l67j260k194k274j562r74
51614C56834p30k55K81l5r68j032J71J095N43n95q32mJ135K184L040L541L925
51597C68298M845O291P410P838Q255Q957Q965P270M140N35k910n687p095o889
51583D10223n577l591q20K578N677P763R112J0447J2111J4081J6013J7115J6752
$$ plain form
51570 511884 527421 542365 557962 574543 591197 606511 619351 629717 639626 652583 671291 696130
51558 696130 726330 761712 802131 845714 888799 927466 958434 979292 989370 990241 984078 971355
51546 971355 951049 922884 888243 848996 806634 762737 719110 677073 637378 600973 569018
51535 569018 541942 519263 500458 485272 473028 462538 453032 444604 437499 431571 426688 423075 420915
51522 420915 419912 419430 418934 418311 417987 418554 420047 421814 423295 424464 425184 424775 422812 419767 416186 411835
51506 411835 406512 401082 396624 392975 389230 385415 382521 381006 380304 379750 378948 377321 374414 370738 367378
51491 367378 364689 362276 360213 359189 359309 359732 359745 359358 358661 357460 355850 354399 353440 352756 352035 351093 349610
51474 349610 347366 344787 342641 341151 339987 338949 337939 336451 334010 331160 329182 328679 329122 329753 330219
$$ packed form
51570E11884J5537J4944J5597J6581J6654J5314J2840J0366R909J2957J8708K4839
51558F96130L0200L5382M0419M3583M3085L8667L0968K0858J0078Q71o163j2723
51546I71355k0306k8165l4641l9247m2362m3897m3627m2037l9695l6405l1955
51535E69018k7076k2679j8805j5186j2244j0490r506q428p105n928m883l613k160
51522D20915j003m82m96o23l24N67J493J767J481J169P20m09j963l045l581m351
51506D11835n323n430m458l649l745l815k894j515p02n54q02j627k907l676l360
51491C67378k689k413k063j024J20M23J3l87o97j201j610j451r59o84p21r42j483
51474C49610k244k579k146j490j164j038j010j488k441k850j978n03M43O31M66
$$ plain form
51459 330219 330386 330370 330773 332147 334200 336224 338171 340544 343457 346691 350517 355454 361320 367605 374675
51444 374675 383494 394147 405832 418250 431554 444624 454863 460493 462118 461535 459988 458137 456617
51431 456617 455544 453887 450037 442885 432322 419307 405687 393281 382781 373935 366791 361969 359636
51418 359636 358988 359064 359474 360240 361579 363920 367359 371074 374072 376433 378871 381114 382039 381653 381598 383082
51402 383082 385376 387036 387637 387646 387462 387461 388388 390844 394676 399265 404114 408934 413751 419171 426028 434637
51386 434637 445000 457790 474124 494189 517142 542893 572985 609060 651154 698057 748620
51375 748620 802047 857412 913322 967488 1016350 1056005 1084179 1100819 1106532 1101275 1085054 1058937
51363 1058937 1024521 982972 935319 883307 829283 775509 723874 675755 631743 591943 556805
$$ packed form
51459C30219J67j6M03J374K053K024J947K373K913L234L826M937N866O285P070
51444C74675Q819J0653J1685J2418J3304J3070J0239N630J625n83j547j851j520
51431D56617j073j657l850p152j0563j3015j3620j2406j0500q846p144m822k333
51418C59636o48P6M10P66J339K341L439L715K998K361K438K243R25l86n5J484
51402C83082K294J660O01Rj84jR27K456L832M589M849M820M817N420O857Q609
51386D34637J0363J2790J6334K0065K2953K5751L0092L6075M2094M6903N0563
51375G48620N3427N5365N5910N4166M8862L9655K8174J6640N713n257j6221k6117
51363A058937l4416m1549m7653n2012n4024n3774n1635m8119m4012l9800l5138
$$ plain form
51352 556805 527024 502371 481448 463126 447474 434729 424130 414524 405531 397319 389735 382400
51340 382400 375329 368819 362970 357811 353563 350272 347561 345202 343494 342550 341587 339572 336461 333299 331174
51325 331174 330290 329941 329218 327992 327187 327770 329492 331205 332449 334011 336750 340576 344900 349359 353743
51310 353743 357821 361641 365426 368779 370578 370105 367822 364761 361625 358769 356383 354326 352203 349835
51296 349835 347159 343654 338759 333111 328456 325830 324530 323343 322065 321375 321921 324024 327617 331921 335762
51281 335762 338734 341567 345076 349304 353897 358469 362286 364475 365043 364963 364864 364519 363944 363894 364692 365616 366232
51264 366232 367313 369554 372223 374046 374629 374149 372484 369745 366986 365242 364283 363281 362259 361879 362137
51249 362137 362226 361546 360141 358389 356836 355942 355450 354431 352554 350704 349752 349322 348465 346915 344902 342408
$$ packed form
51352E56805k9781k4653k0923j8322j5652j2745j0599r606q993q212p584p335
51340C82400p071o510n849n159m248l291k711k359j708r44r63k015l111l162k125
51325C31174q84l49p23j226q05N83J722J713J244J562K739L826M324M459M384
51310C53743M078L820L785L353J799m73k283l061l136k856k386k057k123k368
51296C49835k676l505m895n648m655k626j300j187j278o90N46K103L593M304L841
51281C35762K972K833L509M228M593M572L817K189N68q0r9l45n75n0P98R24O16
51264C66232J081K241K669J823N83m80j665k739k759j744r59j002j022l80K58
51249C62137Q9o80j405j752j553q94m92j019j877j850r52m30q57j550k013k494
$$ plain form
51233 342408 339528 337010 335539 334915 334763 335433 337233 339357 340729 341529 342749 344523 346016 346816 347316 347796
51217 347796 348182 348795 350384 353174 356567 359916 363014 365840 368433 371080 374110 377389 380383 382642 384003
51202 384003 384529 384563 384526 384403 383804 382705 381587 380510 378851 376451 374241 373073 372685 372517 372705 373298 373347
51185 373347 371982 369882 368475 368100 368113 368437 369635 371550 373197 374194 375186 376604 377905 378379 378016 377284
51169 377284 376558 375980 375525 375121 374873 374986 375290 375239 374734 374483 375122 376478 378050 379568 380619 380617 379856 379706
51151 379706 380847 382197 382572 382523 383083 383512 381994 378244 373749 369501 365110 360296 355749 352136 349464
51136 349464 347747 347170 347295 347165 346590 346384 346956 347655 347890 348029 348762 350330 352766 356185 360375 364639 368491
51119 368491 372113 375942 380150 384589 388818 392207 394596 396845 400090 404344 408408 411212 412717 413431
$$ packed form
51233C42408k880k518j471o24j52O70J800K124J372Q00J220J774J493Q00N00M80
51217C47796L86O13J589K790L393L349L098K826K593K647L030L279K994K259J361
51202C84003N26L4l7j23n99j099j118j077j659k400k210j168l88j68J88N93M9
51185C73347j365k100j407l75J3L24J198J915J647R97R92J418J301M74l63p32
51169C77284p26n78m55m04k48J13L04n1n05k51O39J356J572J518J051kp61j50
51151C79706J141J350L75m9N60M29j518l750m495m248m391m814m547l613k672
51136C49464j717n77J25j30n75k06N72O99K35J39P33J568K436L419M190M264L852
51119C68491L622L829M208M439M229L389K389K249L245M254M064K804J505P14
$$ plain form
51105 413431 413668 413486 412970 412317 411785 411450 410934 409756 408174 407142 407012 406917 405999 404606 403519 402748 401974
51088 401974 401519 401714 401890 401273 400487 400749 401798 402091 401078 399907 399693 400347 401404 402817 404521 406140
51072 406140 407539 408975 410588 412442 415022 418812 423425 428017 432556 437719 443732 450324 457713 466493
51058 466493 476651 487876 500611 515229 530181 542762 552269 560916 571127 583339 597008 612027
51046 612027 627927 642932 655154 664138 670320 673618 673367 669063 660514 647896 632438 616525 602406
51033 602406 590923 581576 573092 563796 552525 539867 527797 517602 508979 501570 496260 494091 494725
51020 494725 496893 499791 503276 507314 512074 517964 524826 531572 537387 542777 548676 555026 561120 566996
51006 566996 573539 581405 590606 601021 612592 625039 637999 651397 665252 679126 692205 703853
$$ packed form
51105D13431K37j82n16o53n32l35n16j178j582j032j30r5r18j393j087p71p74
51088D01974m55J95J76o17p86K62J049K93j013j171k14O54J057J413J704J619
51072D06140J399J436J613J854K580L790M613M592M539N163O013O592P389Q780
51058D66493J0158J1225J2735J4618J4952J2581R507Q647J0211J2212J3669J5019
51046F12027J5900J5005J2222Q984O182L298k51m304q549j2618j5458j5913j4119
51033F02406j1483r347q484r296j1271j2658j2070j0195q623p409n310k169O34
51020D94725K168K898L485M038M760N890O862O746N815N390N899O350O094N876
51006E66996O543P866R201J0415J1571J2447J2960J3398J3855J3874J3079J1648
$$ plain form
50994 703853 713800 721907 728122 732660 735931 738246 739580 739566 737819 734588 731024 728423 727309 727757 730389
50979 730389 736151 744925 755170 765393 775416 785914 797432 810431 825791 844633 867767 895493
50967 895493 927624 963545 1002658 1044964 1090839 1140189 1192334 1246723 1303047 1360490 1417590
50956 1417590 1473147 1526588 1577175 1623598 1664779 1700582 1731438 1757865 1780576 1800313 1817222
50945 1817222 1831074 1842429 1852907 1864039 1876544 1890785 1906643 1922278 1934165 1939543 1938388 1932339
50933 1932339 1922448 1908796 1891593 1871445 1848633 1822921 1793872 1760833 1722985 1680064 1632806
50922 1632806 1582171 1528533 1472185 1414201 1356121 1299106 1244000 1191859 1143731 1100074 1060892
50911 1060892 1026115 995330 967516 941704 917695 895690 875592 857244 840866 826528 813499
$$ packed form
50994G03853R947Q107O215M538L271K315J334j4j747l231l564k601j114M48K632
50979G30389N762Q774J0245J0223J0023J0498J1518J2999J5360J8842K3134K7726
50967H95493L2131L5921L9113M2306M5875M9350N2145N4389N6324N7443N7100
50956A417590N5557N3441N0587M6423M1181L5803L0856K6427K2711J9737J6909
50945A817222J3852J1355J0478J1132J2505J4241J5858J5635J1887N378j155o049
50933A932339r891j3652j7203k0148k2812k5712k9049l3039l7848m2921m7258
50922A632806n0635n3638n6348n7984n8080n7015n5106n2141m8128m3657l9182
50911A060892l4777l0785k7814k5812k4009k2005k0098j8348j6378j4338j3029
$$ plain form
50900 813499 800909 788873 778234 769250 761226 753473 746058 739559 734495 731027 728843 727313 726026
50887 726026 725111 724891 725465 726813 728965 731744 734683 737572 740789 744772 749517 754941 761368 769192 778390
50872 778390 788752 800262 812842 826111 839928 854878 871686 890398 910580 932046 955040
50861 955040 980022 1007766 1039353 1075469 1115912 1160195 1208380 1260941 1318246 1380824 1449800
50850 1449800 1526304 1610504 1701775 1799748 1904565 2016104 2133417 2255040 2379468 2505319
50840 2505319 2631274 2755772 2876483 2990222 3093645 3184022 3259320 3318181 3360403 3387326
50830 3387326 3401276 3404657 3399778 3389176 3375510 3361211 3348579 3340066 3337917 3343317 3355981 3374471
50818 3374471 3396636 3419808 3440755 3455531 3459689 3449212 3421682 3376501 3314073 3235180 3141028
$$ packed form
50900H13499j2590j2036j0639q984q024p753p415o499n064l468k184j530j287
50887G26026r15k20N74J348K152K779K939K889L217L983M745N424O427P824R198
50872G78390J0362J1510J2580J3269J3817J4950J6808J8712K0182K1466K2994
50861I55040K4982K7744L1587L6116M0443M4283M8185N2561N7305O2578O8976
50850A449800P6504Q4200R1271R7973J04817J11539J17313J21623J24428J25851
50840B505319J25955J24498J20711J13739J03423R0377P5298N8861M2222K6923
50830C387326J3950L381m879j0602j3666j4299j2632q513k149N400J2664J8490
50818C374471K2165K3172K0947J4776M158j0477k7530m5181o2428p8893r4152
$$ plain form
50807 3141028 3033257 2913603 2784136 2648052 2509585 2372637 2239886 2113408 1995399
50798 1995399 1887646 1790801 1704888 1630177 1566864 1514170 1470500 1434557 1405927 1384642 1370494
50787 1370494 1362682 1359845 1360504 1363479 1367673 1371604 1373806 1373823 1372129 1368907 1363691 1356483 1348185 1339308 1329105
50772 1329105 1316775 1302741 1287815 1271731 1253579 1233209 1211171 1187599 1162297 1135867 1109646
50761 1109646 1084435 1060071 1036399 1013968 993639 976069 961636 950375 941974 936222 933309 933224
50749 933224 935148 938165 942453 949162 959131 972393 988852 1008755 1032359 1059749 1091130 1126863
50737 1126863 1167069 1211583 1260323 1313338 1370346 1430567 1493084 1557280 1622978 1690286 1759006
50726 1759006 1827978 1895384 1960085 2022271 2082293 2139186 2190889 2235549 2271909 2298703 2314693
$$ packed form
50807C141028j07771j19654j29467j36084j38467j36948j32751j26478j18009
50798A995399j07753r6845q5913p4711o3313n2694m3670l5943k8630k1285j4148
50787A370494p812k837O59K975M194L931K202J7j694l222n216p208q298q877j0203
50772A329105j2330j4034j4926j6084j8152k0370k2038k3572k5302k6430k6221
50761A109646k5211k4364k3672k2431k0329j7570j4433j1261q401n752k913q5
50749I33224J924L017M288O709R969J3262J6459J9903K3604K7390L1381L5733
50737A126863M0206M4514M8740N3015N7008O0221O2517O4196O5698O7308O8720
50726A759006O8972O7406O4701O2186O0022N6893N1703M4660L6360K6794J5990
$$ plain form
50715 2314693 2319544 2314089 2299603 2277395 2249304 2218138 2187292 2160031 2138932 2125380 2119279 2119483
50703 2119483 2124765 2134394 2147769 2163649 2179794 2193344 2201582 2202292 2193440 2172992 2139712 2094111
50691 2094111 2038009 1973204 1901352 1825296 1749365 1677524 1611669 1552138 1499166 1453090 1413855
50680 1413855 1381378 1356171 1338846 1329260 1326892 1331763 1344155 1363595 1388965 1419514 1454947 1494476
50668 1494476 1536474 1579173 1621058 1660526 1695866 1725984 1750944 1771682 1789345 1804739 1818072
50657 1818072 1829213 1838306 1845923 1852448 1857726 1861616 1864488 1866725 1868187 1868786 1869420 1871792 1877438 1887274
50643 1887274 1901779 1921057 1944819 1972772 2004921 2041165 2080757 2122410 2164740 2206476 2246649
50632 2246649 2284903 2321355 2356094 2389209 2421188 2452406 2482153 2509238 2533495 2554721 2569037
$$ packed form
50715B314693M851n455j4486k2208k8091l1166l0846k7261k1099j3552o101K04
50703B119483N282R629J3375J5880J6145J3550Q238P10q852k0448l3280m5601
50691B094111n6102o4805p1852p6056p5931p1841o5855n9531n2972m6076l9235
50680A413855l2477k5207j7325r586k368M871J2392J9440K5370L0549L5433L9529
50668A494476M1998M2699M1885L9468L5340L0118K4960K0738J7663J5394J3333
50657A818072J1141R093P617O525N278L890K872K237J462N99O34K372N646R836
50643A887274J4505J9278K3762K7953L2149L6244L9592M1653M2330M1736M0173
50632B246649L8254L6452L4739L3115L1979L1218K9747K7085K4257K1226J4316
$$ plain form
50621 2569037 2568131 2544528 2497793 2434814 2364926 2295942 2233464 2181040 2139883 2109564 2089412 2078633
50609 2078633 2075287 2076607 2080647 2086700 2094005 2100951 2105560 2105681 2098586 2081562 2053469 2015138 1968092
50596 1968092 1913596 1853017 1788218 1721254 1654198 1589256 1528207 1471580 1418970 1370233 1325715
50585 1325715 1285424 1248806 1215441 1185138 1157276 1130884 1105677 1082433 1062169 1045439 1032361
50574 1032361 1022755 1016213 1012564 1012172 1015171 1020643 1027301 1034854 1043981 1055119 1068104 1082828 1099386
50561 1099386 1117624 1137437 1159436 1184570 1213139 1244839 1279452 1316570 1354982 1393499 1432180
50550 1432180 1471585 1510985 1548624 1583791 1617227 1649337 1679369 1706849 1732690 1758424 1785280
50539 1785280 1814415 1847100 1884173 1925956 1972770 2024748 2081214 2141303 2205349 2274655 2349978
$$ packed form
50621B569037r06k3603m6735o2979o9888o8984o2478n2424m1157l0319k0152j0779
50609B078633l346J320M040O053P305O946M609J21p095j7024k8093l8331m7046
50596A968092n4496o0579o4799o6964o7056o4942o1049n6627n2610m8737m4518
50585A325715m0291l6618l3365l0303k7862k6392k5207k3244k0264j6730j3078
50574A032361r606o542l649l92K999N472O658P553R127J1138J2985J4724J6558
50561A099386J8238J9813K1999K5134K8569L1700L4613L7118L8412L8517L8681
50550A432180L9405L9400L7639L5167L3436L2110L0032K7480K5841K5734K6856
50539A785280K9135L2685L7073M1783M6814N1978N6466O0089O4046O9306P5323
$$ plain form
50528 2349978 2431450 2519884 2616438 2720546 2829662 2941637 3055958 3171978 3287342 3398971
50518 3398971 3504313 3600731 3684922 3754141 3807216 3843416 3861176 3858913 3836381 3794400 3734067
50507 3734067 3657168 3566651 3465742 3357146 3243848 3129995 3020013 2917407 2825143 2746449
50497 2746449 2684082 2639156 2611561 2601143 2607610 2629573 2664558 2709757 2762052 2817480 2871257
50486 2871257 2918206 2952849 2969631 2963960 2933244 2877069 2797045 2696922 2582080 2458019 2329297
50475 2329297 2199904 2073649 1953472 1840934 1737034 1642934 1559197 1484923 1418606 1359610
50465 1359610 1308087 1263810 1225871 1193354 1165651 1142251 1122883 1107694 1096683 1088961 1083012 1077642
50453 1077642 1072478 1067820 1064345 1062631 1062605 1063673 1065614 1068948 1074091 1080703 1088328 1097257 1108136 1120904
$$ packed form
50528B349978Q1472Q8434R6554J04108J09116J11975J14321J16020J15364J11629
50518C398971J05342R6418Q4191O9219N3075L6200J7760k263k2532m1981o0333
50507C734067p6899r0517j00909j08596j13298j13853j09982j02606r2264p8694
50497B746449o2367m4926k7595j0418O467K1963L4985M5199N2295N5428N3777
50486B871257M6949L4643J6782n671l0716n6175q0024j00123j14842j24061j28722
50475B329297j29393j26255j20177j12538j03900r4100q3737p4274o6317n8996
50465A359610n1523m4277l7939l2517k7703k3400j9368j5189j1011p722n949n370
50453A077642n164m658l475j714k6J068J941L334N143O612P625Q929J0879J2768
$$ plain form
50439 1120904 1134599 1148048 1160465 1171598 1181636 1190829 1199166 1206744 1214371 1223179 1233487 1244688
50427 1244688 1256407 1268867 1281862 1294423 1306242 1318554 1332748 1348743 1365737 1384073 1405311
50416 1405311 1430585 1459755 1492269 1528206 1568346 1613605 1664389 1720152 1779570 1841262 1904171
50405 1904171 1967249 2029209 2088859 2145246 2197242 2243401 2282510 2313915 2337062 2351138 2355291
50394 2355291 2348739 2330503 2299710 2256457 2201896 2137489 2065085 1987937 1910490 1836309 1766803
50383 1766803 1702473 1644620 1595167 1555522 1526343 1507824 1499448 1499910 1507938 1522789 1543451 1567902
50371 1567902 1593661 1618384 1639464 1653814 1658879 1653368 1636547 1607810 1567806 1519240 1465507 1408923
50359 1408923 1351008 1293643 1238780 1187393 1139686 1095894 1056016 1019266 984884 953121 924511
$$ packed form
50439A120904J3695J3449J2417J1133J0038R193Q337P578P627Q808J0308J1201
50427A244688J1719J2460J2995J2561J1819J2312J4194J5995J6994J8336K1238
50416A405311K5274K9170L2514L5937M0140M5259N0784N5763N9418O1692O2909
50405A904171O3078O1960N9650N6387N1996M6159L9109L1405K3147J4076M153
50394B355291o552j8236l0793m3253n4561o4407p2404p7148p7447p4181o9506
50383A766803o4330n7853m9453l9645k9179j8519q376M62Q028J4851K0662K4451
50371A567902K5759K4723K1080J4350N065n511j6821k8737m0004m8566n3733n6584
50359A408923n7915n7365n4863n1387m7707m3792l9878l6750l4382l1763k8610
$$ plain form
50348 924511 898770 875628 856340 842881 835582 832756 832800 835582 841548 850510 861719 874296 887007
50335 887007 897940 904818 905746 900082 889063 875364 861449 848372 836371 826037 818224 813181 810545
50322 810545 810032 811451 814291 818014 822704 828827 836445 845040 853845 861871 868127 872512 876133 880121
50308 880121 884509 888869 893447 898664 904006 908552 912458 916758 921666 926047 928729 929632 929526 929472 930441
50293 930441 932721 935552 937905 939613 941183 942678 943574 943679 943511 943620 944044 944352 943779 941636 938268 935380
50277 935380 934788 937056 941899 949317 959342 971003 982739 993850 1004577 1014876 1024082 1031749 1037771
50264 1037771 1041683 1043016 1042531 1041995 1042366 1043174 1044040 1045795 1049466 1054947 1061352 1068205 1075817 1084961 1096646
50249 1096646 1111814 1130757 1152908 1177337 1203339 1230605 1259164 1289133 1320123 1350915 1380123
$$ packed form
50348I24511k5741k3142j9288j3459p299k826M4K782N966Q962J1209J2577J2711
50335H87007J0933O878R28n664j1019j3699j3915j3077j2001j0334p813n043k636
50322H10545n13J419K840L723M690O123P618Q595Q805Q026O256M385L621L988
50308H80121M388M360M578N217N342M546L906M300M908M381K682R03j06n4R69
50293I30441K280K831K353J708J570J495Q96J05j68J09M24L08n73k143l368k888
50277I35380n92K268M843P418J0025J1661J1736J1111J0727J0299R206P667O022
50264A037771L912J333m85n36L71Q08Q66J755L671N481O405O853P612R144J1685
50249A096646J5168J8943K2151K4429K6002K7266K8559K9969L0990L0792K9208
$$ plain form
50238 1380123 1407155 1432239 1455809 1478367 1500597 1522710 1543525 1560696 1571741 1574510 1567249 1549452
50226 1549452 1522708 1489811 1452878 1413070 1372044 1332431 1296391 1264493 1236412 1211916 1190636
50215 1190636 1171398 1152266 1130922 1105077 1073445 1036989 998732 961826 927882 897226 869997
50204 869997 846446 826498 809552 794719 781145 768392 756673 746460 737721 729832 722329 715417
50192 715417 709561 704817 700725 696690 692452 688308 684793 681980 679287 676211 673047 670480 668719 667503
50178 667503 666784 666849 667747 669058 670215 670820 670856 670940 672008 674273 676755 678369 679221 680230 681877 684014 686557
50161 686557 689522 692589 695594 699324 704850 712061 719816 727592 735992 745391 755112 764392 773325 782269
50147 782269 790896 798437 804566 809676 814483 819588 825231 831475 838870 848840 863011 882242 906603
$$ packed form
50238A380123K7032K5084K3570K2558K2230K2113K0815J7171J1045K769p261j7797
50226A549452k6744l2897l6933l9808m1026l9613l6040l1898k8081k4496k1280
50215A190636j9238j9132k1344k5845l1632l6456l8257l6906l3944l0656k7229
50204H69997k3551j9948j6946j4833j3574j2753j1719j0213q739p889p503o912
50192G15417n856m744m092m035m238m144l515k813k693l076l164k567j761j216
50178F67503p19O5Q98J311J157O05L6Q4J068K265K482J614Q52J009J647K137K543
50161F86557K965L067L005L730N526P211P755P776Q400R399R721R280Q933Q944
50147G82269Q627P541O129N110M807N105N643O244P395R970J4171J9231K4361
$$ plain form
50134 906603 936104 970936 1011187 1056884 1108135 1164602 1224997 1287642 1351349 1415115 1477335
50123 1477335 1536320 1591617 1644044 1694535 1743687 1792175 1840344 1887032 1929499 1964593 1989332
50112 1989332 2000649 1995973 1974625 1938024 1888449 1828359 1760802 1689141 1615782 1541912 1468809
50101 1468809 1398501 1332771 1272356 1217575 1168912 1126400 1089115 1055807 1025654 998114 972682
50090 972682 949138 927647 908369 891416 877195 866114 857838 851515 846813 844024 843104 843495 844980
50077 844980 847795 851718 856017 860527 865823 872012 878333 884256 889876 894849 898118 899395 899860 900597 901169
50062 901169 900577 898812 896579 894103 891115 887596 883805 879869 875873 871964 867903 863040 857261 851499
50048 851499 846828 843526 841460 840822 841878 844430 848101 852847 858846 866257 875297 886048 897909 909905
$$ packed form
50134I06603K9501L4832M0251M5697N1251N6467O0395O2645O3707O3766O2220
50123A477335N8985N5297N2427N0491M9152M8488M8169M6688M2467L5094K4739
50112A989332J1317m676k1348l6601m9575o0090o7557p1661p3359p3870p3103
50101A468809p0308o5730o0415n4781m8663m2512l7285l3308l0153k7540k5432
50090I72682k3544k1491j9278j6953j4221j1081q276o323m702k789r20L91J485
50077H44980K815L923M299M510N296O189O321N923N620M973L269J277M65P37N72
50062I01169n92j765k233k476k988l519l791l936l996l909m061m863n779n762
50048H51499m671l302k066o38J056K552L671M746N999P411R040J0751J1861J1996
$$ plain form
50034 909905 921924 934897 949301 964176 978255 991490 1004742 1018358 1031693 1043756 1053869
50023 1053869 1061956 1068502 1074029 1078523 1081809 1084495 1087860 1092615 1098508 1105367 1113815 1124768 1139120
50010 1139120 1158060 1182527 1211746 1243219 1274834 1306214 1337532 1368164 1397278 1424839 1451121
49999 1451121 1476072 1499958 1523693 1547308 1568679 1584660 1592879 1591522 1578366 1551723 1512278 1462865
49987 1462865 1406334 1344471 1278825 1211676 1146030 1085016 1030863 983811 942350 905177 872590
49976 872590 845362 822910 803542 786172 770851 757828 747027 738289 731287 725250 719495 714129
49964 714129 709586 705688 702028 699114 698223 699941 703499 707699 712136 717532 725183 735801 748419 760709
49950 760709 770900 779066 786033 791570 794623 795095 794259 793164 791400 787745 781537 773118 763286 752554
$$ packed form
50034I09905J2019J2973J4404J4875J4079J3235J3252J3616J3335J2063J0113
50023A053869Q087O546N527M494L286K686L365M755N893O859Q448J0953J4352
50010A139120J8940K4467K9219L1473L1615L1380L1318L0632K9114K7561K6282
49999A451121K4951K3886K3735K3615K1371J5981Q219j357j3156k6643l9445m9413
49987A462865n6531o1863o5646o7149o5646o1014n4153m7052m1461l7173l2587
49976H72590k7228k2452j9368j7370j5321j3023j0801q738p002o037n755n366
49964G14129m543l898l660k914q91J718L558M200M437N396P651J0618J2618J2290
49950G60709J0191Q166O967N537L053M72q36j095j764l655o208q419r832j0732
$$ plain form
49936 752554 740864 727945 713905 699219 684164 668757 653432 639203 626789 616076 606819 599311
49924 599311 593845 590089 587575 586299 586208 586676 587224 588281 590417 593231 595884 598343 601208 604630 608396
49909 608396 612971 619403 628114 638582 650306 663283 677369 691873 706102 719820 732902 744801
49897 744801 754534 761146 764336 764745 763256 759835 753533 743948 732039 718972 704877 689518 673643
49884 673643 658636 645158 633058 622353 613211 605008 596506 587288 578340 570941 565500 561527 558212
49871 558212 554951 551788 549424 548460 548724 549755 551714 555201 560321 566587 573716 581948 591545 602528
49857 602528 614900 628556 642892 656872 669632 680801 690365 698461 705116 709904 712174 711892 709886
49844 709886 706867 702586 696379 687995 677450 664774 650733 637254 626054 617102 609305 602438 597397
$$ packed form
49936G52554j1690j2919j4040j4686j5055j5407j5325j4229j2414j0713r257p508
49924E99311n466l756k514j276r1M68N48J057K136K814K653K459K865L422L766
49909F08396M575O432Q711J0468J1724J2977J4086J4504J4229J3718J3082J1899
49897G44801R733O612L190M09j489l421o302r585j1909j3067j4095j5359j5875
49884F73643j5007j3478j2100j0705r142q203q502r218q948p399n441l973l315
49871E58212l261l163k364r64K64J031J959L487N120O266P129Q232R597J0983
49857F02528J2372J3656J4336J3980J2760J1169R564Q096O655M788K270k82k006
49844G09886l019m281o207q384j0545j2676j4041j3479j1200q952p797o867n041
$$ plain form
49831 597397 594664 593613 593462 594073 595618 598149 601674 606151 611358 617278 624461 633372 643525 653928
49817 653928 664303 675141 686582 697908 708178 716778 723424 728293 732042 735097 736959 736822 734664
$$ packed form
49831E97397k733j051j51O11J545K531L525M477N207N920P183Q911J0153J0403
49817F53928J0375J0838J1441J1326J0270Q600O646M869L749L055J862j37k158
$$ [...]
##END NTUPLES=NMR SPECTRUM
##END=
