
##TITLE=UV1267_M12_1292-1216_50_7414289_y3Ng7DHpK0
##JCAMPDX= 6.0         $$ Bruker NMR JCAMP-DX V2.0
##DATA TYPE= NMR SPECTRUM
##DATA CLASS= NTUPLES
##ORIGIN= BRUKER
##OWNER= Administrator
$$ 1.72 TOPSPIN		Version 2.1
$$ 2013-01-25 19:44:10.172 -0500  Administrator@X
$$ Compression mode = diff/dup
##.OBSERVE FREQUENCY= 400.02188249412
##.OBSERVE NUCLEUS= ^1H
##.ACQUISITION MODE= SIMULTANEOUS (DQD)
##.ACQUISITION SCHEME= undefined
##.AVERAGES= 64
##.DIGITISER RES= 22
##SPECTROMETER/DATA SYSTEM= spect
##.PULSE SEQUENCE= noesygpps1d.comp
##.SOLVENT NAME= COFFEE_meoh
##.SHIFT REFERENCE= INTERNAL, COFFEE_meoh, 1, 14.96104
##AUDIT TRAIL= $$ (NUMBER, WHEN, WHO, WHERE, PROCESS, VERSION, WHAT)
$$ ##TITLE= Audit trail, TOPSPIN		Version 2.1
$$ ##JCAMPDX= 5.01
$$ ##ORIGIN= Bruker BioSpin GmbH
$$ ##OWNER= Administrator
$$ $$ E:\/data/COFFEE/nmr/UV1267_M12_1292-1216_50_7414289_y3Ng7DHpK0/12/pdata/1/auditp.txt
$$ ##AUDIT TRAIL=  $$ (NUMBER, WHEN, WHO, WHERE, PROCESS, VERSION, WHAT)
(   1,<2013-01-25 19:44:04.531 -0500>,<Administrator>,<X>,<go>,<TOPSPIN 2.1>,
      <created by zg
	started at 2013-01-25 19:32:34.937 -0500,
	POWCHK enabled, PULCHK disabled,
       configuration hash MD5:
       86 BA 57 50 F2 9D 5C 9B 26 00 A9 28 5F 66 2E 89
       data hash MD5: 64K
       22 DF 24 F5 DA 59 A6 F6 DE 8B 56 6B C9 7F F3 B3>)
(   2,<2013-01-25 19:44:07.500 -0500>,<Administrator>,<X>,<proc1d>,<TOPSPIN 2.1>,
      <Start of raw data processing
       efp LB = 0.3 FT_mod = 6 PKNL = 1 PHC0 = 0 PHC1 = 0 SI = 128K 
       data hash MD5: 128K
       2B 78 3A 15 7D 8C 7B 1B 6E 91 62 3D B0 E7 92 B9>)
(   3,<2013-01-25 19:44:08.547 -0500>,<Administrator>,<X>,<proc1d>,<TOPSPIN 2.1>,
      <pk PHC0 = -77.59094 PHC1 = 0 
       data hash MD5: 128K
       10 8C A2 77 6E 30 77 60 75 3B D7 34 14 1E 70 35>)
(   4,<2013-01-25 19:44:09.203 -0500>,<Administrator>,<X>,<proc1d>,<TOPSPIN 2.1>,
      <abs ABSG = 1 
       data hash MD5: 128K
       12 93 A7 3D F2 4D 88 5B 98 24 9A 3D 68 29 64 AA>)
(   5,<2013-01-25 19:44:09.390 -0500>,<Administrator>,<X>,<proc1d>,<TOPSPIN 2.1>,
      <abs ABSG = 2 
       data hash MD5: 128K
       1E A3 46 C4 15 28 07 2E FB 86 BB 30 38 ED 31 C7>)
(   6,<2013-01-25 19:44:09.547 -0500>,<Administrator>,<X>,<proc1d>,<TOPSPIN 2.1>,
      <abs ABSG = 3 
       data hash MD5: 128K
       28 71 D3 4A DB 2B 0D 08 80 56 D7 EA A5 77 53 BE>)
(   7,<2013-01-25 19:44:09.687 -0500>,<Administrator>,<X>,<proc1d>,<TOPSPIN 2.1>,
      <abs ABSG = 4 
       data hash MD5: 128K
       D2 B6 A1 D6 AC 47 A4 62 5A 22 DC 08 98 70 65 63>)
(   8,<2013-01-25 19:44:09.828 -0500>,<Administrator>,<X>,<proc1d>,<TOPSPIN 2.1>,
      <abs ABSG = 5 
       data hash MD5: 128K
       73 0D FA 66 31 83 8C 23 72 A6 0F 16 30 A9 C3 71>)
$$ ##END=
$$ 
$$ $$ hash MD5
$$ $$ 4F 72 56 E1 7A 33 AA AA 56 4F AB 7C 2A 80 15 43
##$RELAX= 
##$RELAX= 
##$RELAX= 
##$RELAX= 
##$RELAX= 
##$RELAX= 
##$RELAX= 
##$RELAX= 
$$ Bruker specific parameters
$$ --------------------------
##$DU= <E:\>
##$EXPNO= 12
$$ [...]
##$TP07= 0
##$TPNAME0= <>
##$TPNAME1= <>
##$TPNAME2= <>
##$TPNAME3= <>
##$TPNAME4= <>
##$TPNAME5= <>
##$TPNAME6= <>
##$TPNAME7= <>
##$TPOAL= (0..7)
0.5 0.5 0.5 0.5 0.5 0.5 0.5 0.5
##$TPOFFS= (0..7)
0 0 0 0 0 0 0 0
##$TUNHIN= 0
##$TUNHOUT= 0
##$TUNXOUT= 0
##$USERA1= <user>
##$USERA2= <user>
##$USERA3= <user>
##$USERA4= <user>
##$USERA5= <user>
##$V9= 5
##$VALIST= <valist>
##$VCLIST= <CCCCCCCCCCCCCCC>
##$VD= 0
##$VDLIST= <DDDDDDDDDDDDDDD>
##$VPLIST= <PPPPPPPPPPPPPPP>
##$VTLIST= <TTTTTTTTTTTTTTT>
##$WBST= 2048
##$WBSW= 25
##$XGAIN= (0..3)
0 0 0 0
##$XL= 0
##$YL= 0
##$YMAX_a= 5683736
##$YMIN_a= -11839689
##$ZGOPTNS= <>
##$ZL1= 120
##$ZL2= 120
##$ZL3= 120
##$ZL4= 120
##$ABSF1= 14.96104
##$ABSF2= -5.597142
##$ABSG= 5
##$ABSL= 3
##$ALPHA= 0
##$AQORDER= 0
##$ASSFAC= 0
##$ASSFACI= 0
##$ASSFACX= 0
##$ASSWID= 0
##$AUNMP= <proc_prof1d_extract.lims>
##$AXLEFT= 0
##$AXNAME= <>
##$AXNUC= <1H>
##$AXRIGHT= 0
##$AXTYPE= 0
##$AXUNIT= <>
##$AZFE= 0.1
##$AZFW= 0.1
##$BCFW= 0
##$BC_mod= 0
##$BYTORDP= 0
##$COROFFS= 0
##$CY= 15
##$DATMOD= 1
##$DC= 0
##$DFILT= <>
##$DTYPP= 0
##$F1P= 0
##$F2P= 0
##$FCOR= 0.5
##$FTSIZE= 131072
##$FT_mod= 6
##$GAMMA= 0
##$GB= 0
##$INTBC= 1
##$INTSCL= 1
##$ISEN= 128
##$LB= 0.3
##$LEV0= 0
##$LPBIN= 0
##$MAXI= 10000
##$MC2= 0
##$MEAN= 0
##$ME_mod= 0
##$MI= 0
##$NCOEF= 0
##$NC_proc= -2
##$NLEV= 6
##$NOISF1= 0
##$NOISF2= 0
##$NSP= 0
##$NTH_PI= 0
##$NZP= 0
##$OFFSET= 14.96104
##$PC= 1
##$PHC0= -77.59094
##$PHC1= 0
##$PH_mod= 1
##$PKNL= yes
##$PPARMOD= 0
##$PPDIAG= 0
##$PPIPTYP= 0
##$PPMPNUM= 2147483647
##$PPRESOL= 1
##$PSCAL= 4
##$PSIGN= 0
##$PYNMP= <proc.py>
##$REVERSE= no
##$SF= 400.020009620558
##$SI= 131072
##$SIGF1= 0
##$SIGF2= 0
##$SINO= 400
##$SIOLD= 131072
##$SPECTYP= <>
##$SREGLST= <1H.CDCl3>
##$SSB= 0
##$STSI= 131072
##$STSR= 0
##$SW_p= 8223.68421052631
##$SYMM= 0
##$S_DEV= 0
##$TDeff= 65536
##$TDoff= 0
##$TI= <>
##$TILT= no
##$TM1= 0
##$TM2= 0
##$TOPLEV= 0
##$USERP1= <user>
##$USERP2= <user>
##$USERP3= <user>
##$USERP4= <user>
##$USERP5= <user>
##$WDW= 1
##$XDIM= 131072
##$YMAX_p= 399674643
##$YMIN_p= -13368
##$CURPLOT= <Network HP LaserJet P1505>
##$CURPRIN= <$Network HP LaserJet P1505>
##$DFORMAT= <normdp>
##$LAYOUT= <+/1D_H.xwp>
##$LFORMAT= <normlp>
##$PFORMAT= <normpl>
##$SURQMSG= 1
$$ End of Bruker specific parameters
$$ ---------------------------------
##NTUPLES= NMR SPECTRUM
##VAR_NAME=  FREQUENCY,     SPECTRUM/REAL,   SPECTRUM/IMAG
##SYMBOL=    X,             R,               I
##VAR_TYPE=  INDEPENDENT,   DEPENDENT,       DEPENDENT
##VAR_FORM=  AFFN,          ASDF,            ASDF
##VAR_DIM=   131072,        131072,          131072
##UNITS=     HZ,            ARBITRARY UNITS, ARBITRARY UNITS
##FACTOR=    0.0627417313425164, 1,          1
##FIRST=     8223.62146879497, -339,         -54131
##LAST=      0,             491,             -54623
##MIN=       0,             -13368,          0
##MAX=       8223.62146879497, 399674643,    0
$$ Real data points
##PAGE= N=1
##DATA TABLE= (X++(R..R)), XYDATA
$$ [...]
$$ plain form
63952 541794 570647 603264 639886 681771 730409 786853 852195 928331 1017502 1121022 1238899
63941 1238899 1370642 1515823 1673730 1843090 2022497 2210677 2405982 2605881 2807060
63932 2807060 3005596 3196800 3375342 3536029 3674520 3787486 3872683 3929106 3956574 3954783
63922 3954783 3923071 3861324 3770709 3653399 3512258 3351295 3175841 2991478 2802689 2612642
63912 2612642 2423773 2238200 2058012 1885749 1724243 1575452 1439720 1316688 1206595
63903 1206595 1109961 1026290 953921 891258 837499 792051 753797 721216 692931 667951 645608
63892 645608 625432 607041 590202 574940 561285 548776 536558 524242 512371 501775 492770 485292
63880 485292 479384 475139 472509 471669 473252 477676 484441 492512 501123 509791 518080 526124 535097 546326
$$ packed form
63952E41794K8853L2617L6622M1885M8638N6444O5342P6136Q9171J03520J17877
63941A238899J31743J45181J57907J69360J79407J88180J95305J99899K01179
63932B807060J98536J91204J78542J60687J38491J12966Q5197N6423K7468j791
63922C954783l1712o1747r0615j17310j41141j60963j75454j84363j88789j90047
63912B612642j88869j85573j80188j72263j61506j48791j35732j23032j10093
63903A206595r6634q3671p2369o2663n3759m5448l8254l2581k8285k4980k2343
63892F45608k0176j8391j6839j5262j3655j2509j2218j2316j1871j0596r005p478
63880D85292n908m245k630q40J583M424O765Q071Q611Q668Q289Q044Q973J1229
$$ plain form
63866 546326 560018 575505 592508 611271 631534 652414 673569 695686 719355 744059 768682
63855 768682 792564 815675 837933 858671 876666 890726 900505 906704 910198 911010 908418 901814 891124
63842 891124 876599 858762 838358 815747 790500 762322 732238 701977 672123 641808 610529
63831 610529 579390 550110 523450 499115 476589 455448 435286 415977 397876 381420 366651
63820 366651 353318 341183 330027 319678 310250 302057 295021 288471 281778 275001 268768 263740 260216
63807 260216 257828 255536 252423 248701 245514 243532 242261 240903 239258 237312 234634 230959 227048 224237
63793 224237 223109 223067 223094 222413 220530 217324 213339 209569 206628 204305 202095 200022 198668 198416 198892 199318
63777 199318 199278 198891 198258 197227 195928 195110 195421 196518 197396 197459 196769 195446 193564 191683 190656 190608 190772
$$ packed form
63866E46326J3692J5487J7003J8763K0263K0880K1155K2117K3669K4704K4623
63855G68682K3882K3111K2258K0738J7995J4060R779O199L494Q12k592o604j0690
63842H91124j4525j7837k0404k2611k5247k8178l0084l0261k9854l0315l1279
63831F10529l1139k9280k6660k4335k2526k1141k0162j9309j8101j6456j4769
63820C66651j3333j2135j1156j0349r428q193p036o550o693o777o233n028l524
63807B60216k388k292l113l722l187j982j271j358j645j946k678l675l911k811
63793B24237j128m2K7o81j883l206l985l770k941k323k210k073j354k52M76M26
63777A99318m0l87o33j031j299q18L11J097Q78O3o90j323j882j881j027m8J64
$$ plain form
63760 190772 190598 190382 190454 190486 190196 190103 190811 191954 192626 192620 192524 192735 193144 193755 194849 196350 197612 198185 198352
63741 198352 198710 199543 200886 202771 205049 207195 208719 209779 211031 212791 214612 215904 216735 217741 219335
63726 219335 221404 223845 226942 230895 235345 239802 244294 249016 253513 256924 259197 261355 264225 267358
63712 267358 269669 270715 270876 270555 269753 268414 266708 264871 262994 261094 259235 257555 256206 255229 254525
63697 254525 254071 254162 255165 256983 259015 260810 262504 264483 266844 269427 272110 274780 277170 279026 280343
63682 280343 281245 281722 281742 281546 281540 281846 282156 282129 281827 281686 282053 282822 283592 284197 284935 286157 287762 289296 290476
63663 290476 291407 292282 293052 293398 292845 291046 288109 284541 280650 276207 271109 266096 262223 259637 257481
63648 257481 255093 252741 251000 249947 249263 248691 248062 247260 246452 246059 246271 246847 247576 248578 250060 252170
$$ packed form
63760A90772j74k16P2L2k90r3P08J143O72or6K11M09O11J094J501J262N73J67
63741A98352L58Q33J343J885K278K146J524J060J252J760J821J292Q31J006J594
63726B19335K069K441L097L953M450M457M492M722M497L411K273K158K870L133
63712B67358K311J046J61l21q02j339j706j837j877j900j859j680j349r77p04
63697B54525m54R1J003J818K032J795J694J979K361K583K683K670K390J856J317
63682B80343R02M77K0j96oL06L10k7l02j41L67P69P70O05P38J222J605J534J180
63663B90476R31Q75P70L46n53j799k937l568l891m443n098n013l873k586k156
63648B57481k388k352j741j053o84n72o29q02q08l93K12N76P29J002J482K110
$$ plain form
63632 252170 255207 259441 264507 269535 274265 279487 285955 293343 300818 308244 316205 325084 334767 345186
63618 345186 356599 369305 383426 398989 415983 434392 454371 476216 499998 525422 552252
63607 552252 580589 610414 640984 670891 698483 722087 740297 752561 759401 761836 760749 756941
63595 756941 751361 744935 738393 732378 727255 722412 716269 707441 695585 680822 662987 642125 619254
63582 619254 595783 572439 549502 527833 508687 492452 478339 465511 453951 444117 436394 431085
63570 431085 428389 428101 429589 432230 435669 439689 444221 449424 455370 461665 467774 473702 480007 487232
63556 487232 495772 506122 518672 533198 549143 566547 586212 608883 634851 664505 698549 737000
63544 737000 778013 817948 852581 878510 894125 899803 897253 888597 876085 862280 849686 839685
$$ packed form
63632B52170L037M234N066N028M730N222O468P388P475P426P961Q879R683J0419
63618C45186J1413J2706J4121J5563J6994J8409J9979K1845K3782K5424K6830
63607E52252K8337K9825L0570K9907K7592K3604J8210J2264O840K435j087l808
63595G56941n580o426o542o015n123m843o143q828j1856j4763j7835k0862k2871
63582F19254k3471k3344k2937k1669j9146j6235j4113j2828j1560r834p723n309
63570D31085k696k88J488K641L439M020M532N203N946O295O109N928O305P225
63556D87232Q540J0350J2550J4526J5945J7404J9665K2671K5968K9654L4044L8451
63544G37000M1013L9935L4633K5929J5615N678k550q656j2512j3805j2594j0001
$$ plain form
63532 839685 832042 825702 819855 814094 807821 799927 789126 774515 755848 733418 707799 679757 650288
63519 650288 620468 591068 562527 535408 510570 488558 469067 451378 435148 420434 407138
63508 407138 394928 383672 373490 364347 355994 348329 341483 335573 330599 326533 323189 320187 317353
63495 317353 314936 312999 310956 308349 305782 304239 303583 302733 301476 301030 302327 304616 306458 307461 308379
63480 308379 309929 312230 315118 318326 321437 324204 326859 329727 332628 335003 336502 337083 336678 335177 332733
63465 332733 329724 326353 322548 318261 313700 309215 305037 301103 297104 292939 289210 287016 286965 288514 290489
63450 290489 292127 293470 294997 297210 300497 305077 310986 318260 327029 337296 348767 361170 374735
63437 374735 390163 408193 429394 454276 483017 514655 546543 575014 597050 611781 620585 625857
$$ packed form
63532H39685p643o340n847n761o273p894j0801j4611j8667k2430k5619k8042k9469
63519F50288k9820k9400k8541k7119k4838k2012j9491j7689j6230j4714j3296
63508D07138j2210j1256j0182r143q353p665o846n910m974m066l344l002k834
63495C17353k417j937k043k607k567j543o56q50j257m46J297K289J842J003R18
63480C08379J550K301K888L208L111K767K655K868K901K375J499N81m05j501k444
63465C32733l009l371l805m287m561m485m178l934l999m165l729k194n1J549J975
63450B90489J638J343J527K213L287M580N909P274Q769J0267J1471J2403J3565
63437C74735J5428J8030K1201K4882K8741L1638L1888K8471K2036J4731Q804N272
$$ plain form
63425 625857 629578 632900 636695 642064 650200 661954 677821 698196 723386 753185 786478 821342
63413 821342 855651 887616 915756 938542 954534 963205 965593 963830 959961 955215 950092 944622 938433
63400 938433 930933 921656 910250 896079 878168 855816 829163 799117 766983 734247 702310 671958
63388 671958 643165 615707 589926 566612 546190 528341 512519 498573 486684 476916 469126 463298
63376 463298 459654 458288 458802 460548 463194 466921 472057 478708 486798 496311 507338 520032 534608 551242
63362 551242 569783 589742 610798 633297 658050 685667 716255 749573 785045 821386 856517
63351 856517 888213 914954 936065 951136 959656 961551 958066 951648 944525 937449 930023 922004 913655
63338 913655 904800 894225 880410 862502 840353 814195 784827 753752 722441 691550 661287 632318
$$ packed form
63425F25857L721L322L795N369Q136J1754J5867K0375K5190K9799L3293L4864
63413H21342L4309L1965K8140K2786J5992Q671K388j763l869m746n123n470o189
63400I38433p500r277j1406j4171j7911k2352k6653l0046l2134l2736l1937l0352
63388F71958k8793k7458k5781k3314k0422j7849j5822j3946j1889r768p790n828
63376D63298l644j366N14J746K646L727N136O651Q090R513J1027J2694J4576J6634
63362E51242J8541J9959K1056K2499K4753K7617L0588L3318L5472L6341L5131
63351H56517L1696K6741K1111J5071Q520J895l485o418p123p076p426q019q349
63338I13655q855j0575j3815j7908k2149k6158k9368l1075l1311l0891l0263k8969
$$ plain form
63326 632318 605800 582639 563206 547636 535870 527526 522162 519487 518621 517306 512734 503464 490129
63313 490129 474325 457453 440640 424795 410163 396314 382982 370560 359583 350273 342847 337622
63301 337622 334331 331793 328855 325315 321571 317813 314154 311088 309019 307416 305143 301722 297801 294310
63287 294310 291605 289494 287599 285498 282901 280049 277705 276458 276108 275966 275738 275813 276550 277517 277806 277159
63271 277159 276458 276850 278531 280648 282247 282987 283061 282852 282739 282872 282940 282436 281268 279889 278788 278182 278336
63254 278336 279753 282648 286423 289995 292697 294711 296715 299181 301956 304493 306609 308954 312488 317433
63240 317433 323046 328505 333780 339509 346308 354423 363743 373922 384625 395902 408153 421513 435380
63227 435380 448856 461635 474240 487288 500658 513497 525072 535554 545858 556751 568327
$$ packed form
63326F32318k6518k3161j9433j5570j1766q344n364k675q66j315m572r270j3335
63313D90129j5804j6872j6813j5845j4632j3849j3332j2422j0977r310p426n225
63301C37622l291k538k938l540l744l758l659l066k069j603k273l421l921l491
63287B94310k705k111j895k101k597k852k344j247l50j42k28P5P37R67K89o47
63271B77159p01L92J681K117J599P40P4k09j13J33O8n04j168j379j101o06J54
63254B78336J417K895L775L572K702K014K004K466K775K537K116K345L534M945
63240C17433N613N459N275N729O799Q115R320J0179J0703J1277J2251J3360J3867
63227D35380J3476J2779J2605J3048J3370J2839J1575J0482J0304J0893J1576
$$ plain form
63216 568327 580315 592548 604890 617040 628746 639981 650502 659420 665684 668878 669150 666586 661242
63203 661242 653645 644528 634053 621963 608568 594846 581405 568150 555307 544031 535522 530052
63191 530052 527276 526890 528553 531765 536527 543732 554233 567694 582875 598876 615671 633616 652859
63178 652859 673138 693811 714219 734211 754112 774025 793607 812725 831764 850867 869377
63167 869377 886559 902365 916844 929183 938101 942913 943510 939525 930317 915780 896517 873256 846733
63154 846733 818044 788344 758067 727065 695621 664710 635167 607332 581688 559086 539812
63143 539812 522978 507482 493262 481116 471449 463720 457085 451066 445439 439864 434071 428364 423595
63130 423595 420370 418457 417239 416684 417379 419502 422241 424660 426749 429151 432058 435055 438014 441484 445893
$$ packed form
63216E68327J1988J2233J2342J2150J1706J1235J0521Q918O264L194K72k564n344
63203F61242p597r117j0475j2090j3395j3722j3441j3255j2843j1276q509n470
63191E30052k776l86J663L212M762P205J0501J3461J5181J6001J6795J7945J9243
63178F52859K0279K0673K0408J9992J9901J9913J9582J9118J9039J9103J8510
63167H69377J7182J5806J4479J2339Q918M812N97l985r208j4537j9263k3261k6523
63154H46733k8689k9700l0277l1002l1444l0911k9543k7835k5644k2602j9274
63143E39812j6834j5496j4220j2146r667p729o635o019n627n575n793n707m769
63130D23595l225j913j218n55O95K123K739K419K089K402K907K997K959L470M409
$$ plain form
63115 445893 450815 455409 459335 462939 466678 470658 474646 478269 481219 483477 485428 487622 490328 493346
63101 493346 496282 498836 500754 501705 501595 501038 501135 502485 504649 506779 508510 509939 511029 511608 511764 511684
63085 511684 511157 509879 508297 507445 507692 508226 508024 506859 505115 503209 501555 500546 500158 499978 499920 500453 501766
63068 501766 503357 504931 507131 510733 515605 521156 527422 534952 543871 553846 564832 577168 591012
63055 591012 606316 623234 642003 662551 684818 709308 736599 766287 797050 827797 858346
63044 858346 889069 920441 952766 985695 1018061 1048853 1078330 1107541 1136864 1165797 1194220
63033 1194220 1222867 1252201 1281524 1309583 1335450 1358436 1377714 1392511 1402287 1406388 1403928 1394444
63021 1394444 1378384 1356618 1329766 1298369 1263442 1226487 1188987 1152069 1116485 1082799 1051749
$$ packed form
63115D45893M922M594L926L604L739L980L988L623K950K258J951K194K706L018
63101D93346K936K554J918R51j10n57R7J350K164K130J731J429J090N79J56q0
63085E11684n27j278j582q52K47N34k02j165j744j906j654j009l88j80n8N33J313
63068E01766J591J574K200L602M872N551O266P530Q919R975J0986J2336J3844
63055E91012J5304J6918J8769K0548K2267K4490K7291K9688L0763L0747L0549
63044H58346L0723L1372L2325L2929L2366L0792K9477K9211K9323K8933K8423
63033A194220K8647K9334K9323K8059K5867K2986J9278J4797R776M101k460r484
63021A394444j6060k1766k6852l1397l4927l6955l7500l6918l5584l3686l1050
$$ plain form
63010 1051749 1024467 1002040 984770 972229 964178 961009 963096 970199 981971 998678 1020726 1047507
62998 1047507 1077329 1108789 1141844 1177161 1214620 1253023 1291352 1329756 1368826 1408244 1446860
62987 1446860 1484057 1520284 1555963 1590489 1622686 1651582 1676135 1694667 1705323 1706968 1699185 1681784
62975 1681784 1654896 1619279 1575956 1525900 1470622 1412505 1353599 1294436 1235047 1176847 1122206
62964 1122206 1072112 1025552 981494 940248 902440 867796 835721 806145 779073 753999 730516
62953 730516 708823 688952 670107 651508 633313 615967 599233 582747 567005 552816 540003
62942 540003 527616 515346 503831 493619 484609 476516 469079 461731 453907 445922 438815 433006 427691
62929 427691 422026 416335 411660 408468 406339 404713 403377 402240 401162 400182 399576 399437 399378 398892 397923 396843
$$ packed form
63010A051749k7282k2427j7270j2541q051l169K087P103J1772J6707K2048K6781
62998A047507K9822L1460L3055L5317L7459L8403L8329L8404L9070L9418L8616
62987A446860L7197L6227L5679L4526L2197K8896K4553J8532J0656J645p783j7401
62975A681784k6888l5617m3323n0056n5278n8117n8906n9163n9389n8200n4641
62964A122206n0094m6560m4058m1246l7808l4644l2075k9576k7072k5074k3483
62953G30516k1693j9871j8845j8599j8195j7346j6734j6486j5742j4189j2813
62942E40003j2387j2270j1515j0212r010q093p437p348p824p985p107n809n315
62929D27691n665n691m675l192k129j626j336j137j078r80o06j39n9m86r69j080
$$ plain form
62913 396843 395895 394916 393704 392414 391403 390784 390282 389459 388003 386026 384192 383321 383544 384062 384048 383633 383577
62896 383577 384160 384976 385880 387475 390293 393829 396772 398122 397969 397257 396873 396866 396628 395910 395312 395383 395517 394505
62878 394505 392126 389479 387546 386143 384616 382848 381048 379127 376950 374875 373375 372251 370764 368525
62864 368525 365831 363204 361007 359460 358636 358285 357945 357263 356162 354788 353520 352884 353175 354090 354926 355167
62848 355167 354850 354406 354260 354535 355033 355470 355708 355712 355410 354758 353854 352772 351358 349483 347413 345611 344169
62831 344169 342880 341813 341318 341312 341172 340647 340403 341216 342963 344799 346144 347084 347948 348824 349497 349769 349921 350806
62813 350806 353111 356477 359775 362449 365040 368140 371436 374377 377296 381057 385735 390388 394321 398012
62799 398012 402532 408368 415017 421499 427118 431839 436173 440783 446185 452704 460544 469872 480876 493721
$$ packed form
62913C96843r48r79j212j290j011o19n02q23j456j977j834q71K23N18j4m15n6
62896C83577N83Q16R04J595K818L536K943J350j53p12l84pk38p18n98P1J34j012
62878C94505k379k647j933j403j527j768j800j921k177k075j500j124j487k239
62864C68525k694k627k197j547q24l51l40o82j101j374j268o36K91R15Q36K41
62848C55167l17m44j46K75M98M37K38Ml02o52r04j082j414j875k070j802j442
62831C44169j289j067m95oj40n25k44Q13J747J836J345R40Q64Q76O73K72J52Q85
62813C50806K305L366L298K674K591L100L296K941K919L761M678M653L933L691
62799C98012M520N836O649O482N619M721M334M610N402O519P840R328J1004J2845
$$ plain form
62785 493721 508372 524661 542786 563542 587654 614993 645008 677875 714519 755346 799626
62774 799626 846402 895270 945732 996346 1045198 1090968 1133038 1170770 1203160 1228984 1246966
62763 1246966 1256082 1256221 1248345 1233680 1212937 1186561 1155211 1119486 1079618 1036150 990666 945140
62751 945140 900621 857085 814482 773345 734439 698350 665457 635799 608922 584236 561519
62740 561519 540806 522015 505133 490473 478161 467524 457659 448576 441071 435458 431139 427534 424727
62727 424727 422904 421771 420924 420327 420088 420188 420820 422624 426114 431031 436562 442139 447787 453892 460874
62712 460874 469029 478519 489531 502497 517964 536114 556595 579027 603618 631088 661973 696195
62700 696195 733464 774005 818647 867993 921771 979385 1041017 1107527 1178994 1253825 1329689
$$ packed form
62785D93721J4651J6289J8125K0756K4112K7339L0015L2867L6644M0827M4280
62774G99626M6776M8868N0462N0614M8852M5770M2070L7732L2390K5824J7982
62763A246966R116J39p876j4665k0743k6376l1350l5725l9868m3468m5484m5526
62751I45140m4519m3536m2603m1137l8906l6089l2893k9658k6877k4686k2717
62740E61519k0713j8791j6882j4660j2312j0637r865r083p505n613m319l605k807
62727D24727j823j133q47n97k39J00O32J804L490M917N531N577N648O105O982
62712D60874Q155R490J1012J2966J5467J8150K0481K2432K4591K7470L0885L4222
62700F96195L7269M0541M4642M9346N3778N7614O1632O6510P1467P4831P5864
$$ plain form
62689 1329689 1404883 1478154 1547498 1609902 1662418 1703089 1730880 1745335 1746462 1734508 1709696
62678 1709696 1672546 1624488 1567744 1504395 1435985 1364141 1291006 1218673 1148430 1080902 1016678
62667 1016678 956383 900327 848515 801019 757980 719192 683953 651524 621622 594388 569981
62656 569981 548343 529300 512647 498071 485110 473318 462367 451936 441691 431577 422006 413475
62644 413475 406067 399575 394006 389559 386100 383131 380342 377818 375648 373782 372357 371568 371033 369918 368013
62629 368013 366073 364607 362970 360270 356691 353209 350387 348207 346778 346352 346732 347361 347984 348668 349351 350044
62613 350044 351236 353308 355623 357103 357763 358779 360845 363353 365530 367638 370548 374737 380170 386734
62599 386734 394363 403072 413157 425012 438556 453336 469438 487721 508729 531774 555539 579230
$$ packed form
62689A329689P5194P3271O9344O2404N2516M0671K7791J4455J127j1954k4812
62678A709696l7150m8058n6744o3349o8410p1844p3135p2333p0243o7528o4224
62667A016678o0295n6056n1812m7496m3039l8788l5239l2429k9902k7234k4407
62656E69981k1638j9043j6653j4576j2961j1792j0951j0431j0245j0114r571q531
62644D13475p408o492n569m447l459k969k789k524k170j866j425p89n35j115j905
62629C68013j940j466j637k700l579l482k822k180j429m26L80O29O23O84O83O93
62613C50044J192K072K315J480O60J016K066K508K177K108K910M189N433O564
62599C86734P629Q709J0085J1855J3544J4780J6102J8283K1008K3045K3765K3691
$$ plain form
62587 579230 602733 625975 648590 669953 689127 704936 716506 723628 726354 724511 718000 707406
62575 707406 693839 678162 660615 641159 619988 597766 575560 554411 534811 516654 499786
62564 499786 484325 470232 456921 443764 430895 419137 409093 400654 393477 387560 383083 379836
62552 379836 377107 374229 371094 368067 365547 363787 363017 363360 364499 365709 366490 367015 367690 368426 368685 368200
62536 368200 367356 366868 367299 368812 371062 373368 375266 376962 379051 381941 385811 390921 397457 405127 413440
62521 413440 422442 432819 445199 459819 476853 496545 518884 543684 571180 602012 636318 673327
62509 673327 712137 752430 793980 835913 876953 916109 952588 985224 1012554 1033440 1047305
62498 1047305 1053877 1053101 1045339 1031359 1012142 988918 963248 936730 910500 885169 861209 839254
$$ packed form
62587E79230K3503K3242K2615K1363J9174J5809J1570P122K726j843o511j0594
62575G07406j3567j5677j7547j9456k1171k2222k2206k1149j9600j8157j6868
62564D99786j5461j4093j3311j3157j2869j1758j0044q439p177n917m477l247
62552C79836k729k878l135l027k520j760p70L43J139J210P81N25O75P36K59m85
62536C68200q44m88M31J513K250K306J898J696K089K890L870N110O536P670Q313
62521D13440R002J0377J2380J4620J7034J9692K2339K4800K7496L0832L4306L7009
62509F73327L8810M0293M1550M1933M1040L9156L6479L2636K7330K0886J3865
62498A047305O572p76p762j3980j9217k3224k5670k6518k6230k5331k3960k1955
$$ plain form
62486 839254 820112 804670 793654 787196 784736 785645 789988 798290 810314 824234 837245 847098 853084
62473 853084 855745 855881 853795 849117 840950 828225 810346 787791 761952 734170 705067 674946 644484
62460 644484 614640 586023 558843 533507 510726 490847 473435 457797 443763 431745 422194 415096
62448 415096 409894 405850 402541 400064 398644 398122 398021 398125 398773 400596 404075 409185 415199 420914 425413
62433 425413 428605 430800 431898 431455 429488 426685 423627 420147 415654 409859 403100 396199 389956 384513
62419 384513 379237 373571 367878 362991 359070 355524 352067 349149 347154 345822 344760 343896 343077 341833 340033
62404 340033 338343 337547 337722 338465 339564 341021 342757 344678 346766 348814 350441 351719 353307 355515 357724
62389 357724 359342 360907 363492 367303 371701 376449 382032 388512 394893 400107 404269 408534 413937 420646
$$ packed form
62486H39254j9142j5442j1016o458k460R09M343Q302J2024J3920J3011R853N986
62473H53084K661J36k086m678q167j2725j7879k2555k5839k7782k9103l0121l0462
62460F44484k9844k8617k7180k5336k2781j9879j7412j5638j4034j2018r551p098
62448D15096n202m044l309k477j420n22j01J04O48J823L479N110O014N715M499
62433D25413L192K195J098m43j967k803l058l480m493n795o759o901o243n443
62419C84513n276n666n693m887l921l546l457k918j995j332j062q64q19j244j800
62404C40033j690p96J75P43J099J457J736J921K088K048J627J278J588K208K209
62389C57724J618J565K585L811M398M748N583O480O381N214M162M265N403O709
$$ plain form
62375 420646 428185 436102 444405 453433 463372 473962 484819 495944 507711 520388 533905 548232
62363 548232 563810 581412 601651 624850 651488 682519 718827 760347 806119 855312 907640
62352 907640 962413 1017743 1071395 1122023 1168684 1209413 1241581 1264029 1277897 1284887 1285599 1280063
62340 1280063 1268888 1252814 1231652 1204734 1172299 1135739 1096678 1056481 1016460 977768 941005
62329 941005 906425 874512 845840 820398 797481 776223 755933 736116 716644 697779 679609
62318 679609 661630 643337 624900 606699 588481 569756 550963 533402 517896 504234 492045
62307 492045 481426 472420 464551 457409 451198 446225 442201 438574 435403 433378 432914 433527 434240 434544 434829
62292 434829 435837 437739 439996 442192 444662 448006 452226 456800 461472 466416 471565 476296 480050 482961
$$ packed form
62375D20646P539P917Q303R028R939J0590J0857J1125J1767J2677J3517J4327
62363E48232J5578J7602K0239K3199K6638L1031L6308M1520M5772M9193N2328
62352I07640N4773N5330N3652N0628M6661M0729L2168K2448J3868O990P12n536
62340A280063j1175j6074k1162k6918l2435l6560l9061m0197m0021l8692l6763
62329I41005l4580l1913k8672k5442k2917k1258k0290j9817j9472j8865j8170
62318F79609j7979j8293j8437j8201j8218j8725j8793j7561j5506j3662j2189
62307D92045j0619r006p869p142o211m973m024l627l171k025m64O13P13L04K85
62292D34829J008J902K257K196K470L344M220M574M672M944N149M731L754K911
$$ plain form
62278 482961 485602 488311 490994 493482 495911 498728 502309 506607 511296 516353 522313 529758 538795 549291
62264 549291 561440 575800 592888 613096 636821 664330 695649 731017 771228 816925 867606
62253 867606 921900 978718 1037318 1096069 1152026 1202334 1245592 1281407 1309147 1327922 1337601 1339048
62241 1339048 1333149 1320014 1299349 1271299 1236690 1196603 1151940 1103507 1052409 1000201 948462
62230 948462 898283 850283 805054 763294 725399 691218 660451 633107 609353 589042 571724
62219 571724 557046 544815 534592 525608 517321 509848 503537 498241 493352 488543 484094 480383 477429
62206 477429 475208 474013 474044 474831 475606 476256 477495 480045 484089 489571 496517 504828 514194 524497 535904
62191 535904 548304 561074 573851 587179 601895 617994 634535 650600 665960 680827 695234
$$ packed form
62278D82961K641K709K683K488K429K817L581M298M689N057N960P445R037J0496
62264E49291J2149J4360J7088K0208K3725K7509L1319L5368M0211M5697N0681
62253H67606N4294N6818N8600N8751N5957N0308M3258L5815K7740J8775R679J447
62241A339048n899j3135k0665k8050l4609m0087m4663m8433n1098n2208n1739
62230I48462n0179m8000m5229m1760l7895l4181l0767k7344k3754k0311j7318
62219E71724j4678j2231j0223q984q287p473o311n296m889m809m449l711k954
62206D77429k221j195L1P87P75O50J239K550M044N482O946Q311R366J0303J1407
62191E35904J2400J2770J2777J3328J4716J6099J6541J6065J5360J4867J4407
$$ plain form
62180 695234 708728 720479 729700 736034 739514 740351 739201 737569 737226 738867 741911 746142 753011 764602
62166 764602 781653 803351 828862 858278 891971 929615 969917 1010825 1049902 1084983 1114687
62155 1114687 1138293 1155449 1166372 1171882 1172480 1167580 1156377 1139331 1117958 1093175 1064798 1032809
62143 1032809 998182 962046 924991 887871 852548 820953 793677 770139 749842 732797 718892
62132 718892 707549 698167 690384 683728 677416 670808 663967 657614 652538 649072 647113 646572 647687 650799
62118 650799 655907 662632 670692 680216 691373 703585 715163 723956 728654 729633 728474 726660 724915 723559
62104 723559 722852 722607 721896 719618 715169 708366 699340 689085 679609 672535 667640 663538 659783 657361 657081
62089 657081 658515 660954 664505 669544 675703 682225 689072 697042 706870 718628 731949 746480 762171
$$ packed form
62180F95234J3494J1751R221O334L480Q37j150j632l43J641L044M231O869J1591
62166G64602J7051K1698K5511K9416L3693L7644M0302M0908L9077L5081K9704
62155A114687K3606J7156J0923N510N98m900j1203j7046k1373k4783k8377l1989
62143A032809l4627l6136l7055l7120l5323l1595k7276k3538k0297j7045j3905
62132G18892j1343r382p783o656o312o608o841o353n076l466j959n41J115L112
62118F50799N108O725Q060R524J1157J2212J1578Q793M698R79j159j814j745j356
62104G23559p07k45p11k278m449o803r026j0255r476p074m895m102l755k422k80
62089F57081J434K439L551N039O159O522O847P970R828J1758J3321J4531J5691
$$ plain form
62076 762171 779394 798669 820053 842839 866012 888955 911704 934755 958730 983920 1009977
62065 1009977 1036178 1062147 1088191 1114864 1142339 1170214 1197595 1223274 1246046 1265035 1279635
62054 1279635 1289314 1293840 1293712 1289893 1282960 1272777 1259025 1241574 1220249 1194794 1165433 1133130
62042 1133130 1098961 1063485 1026927 989633 952091 914829 878573 844188 812108 782023 753400
62031 753400 726188 700899 678237 658762 642503 628651 615947 603655 591883 580828 570194
62020 570194 559679 549505 539886 530323 520094 509324 499024 490039 482402 475734 469800 464546 459980
62007 459980 456288 453878 453010 453322 453908 454118 454363 455896 459471 464364 469021 472517 474898 476251 476279 475010
61991 475010 473179 471313 468967 465428 460797 455764 450619 445115 439099 432629 425580 417800 409710 402182
$$ packed form
62076G62171J7223J9275K1384K2786K3173K2943K2749K3051K3975K5190K6057
62065A009977K6201K5969K6044K6673K7475K7875K7381K5679K2772J8989J4600
62054A279635R679M526j28l819o933j0183j3752j7451k1325k5455k9361l2303
62042A133130l4169l5476l6558l7294l7542l7262l6256l4385l2080l0085k8623
62031G53400k7212k5289k2662j9475j6259j3852j2704j2292j1772j1055j0634
62020E70194j0515j0174r619r563j0229j0770j0300q985p637o668n934n254m566
62007D59980l692k410q68L12N86K10K45J533L575M893M657L496K381J353K8j269
61991D75010j831j866k346l539m631n033n145n504o016o470p049p780q090p528
$$ plain form
61977 402182 395642 389731 383995 378598 374159 371070 369079 367463 365603 363560 361967 361229 360978 360539 359749
61962 359749 358963 358430 358141 358271 359276 361373 364259 367534 371205 375579 380785 386604 392683 398846 405170
61947 405170 411855 419038 426780 435240 444779 455824 468635 483154 498985 515619 532869 550991
61935 550991 570133 589720 608817 627096 644954 662514 679123 694206 708090 721321 733468
61924 733468 743222 749677 752993 753775 752274 748341 741918 733461 723992 714711 706396 699332 693892 690942
61910 690942 691392 695582 703335 714321 727945 743220 759298 775996 793229 809930 824106 834090
61898 834090 839416 840520 838026 832384 823739 812046 797578 781259 764093 746344 727803 708856
61886 708856 690659 674063 658976 644949 631799 619292 606833 593977 580896 567859 554660
$$ packed form
61977D02182o540n911n736n397m439l089j991j616j860k043j593p38k51m39p90
61962C59749p86n33k89J30J005K097K886L275L671M374N206N819O079O163O324
61947D05170O685P183P742Q460R539J1045J2811J4519J5831J6634J7250J8122
61935E50991J9142J9587J9097J8279J7858J7560J6609J5083J3884J3231J2147
61924G33468R754O455L316P82j501l933o423q457r469r281q315p064n440k950
61910F90942M50M190P753J0986J3624J5275J6078J6698J7233J6701J4176R984
61898H34090N326J104k494n642q645j1693j4468j6319j7166j7749j8541j8947
61886G08856j8197j6596j5087j4027j3150j2507j2459j2856j3081j3037j3199
$$ plain form
61875 554660 541158 528125 516847 507864 500616 494358 488937 484538 481142 478540 476681 475771 476090 477864
61861 477864 481237 486253 492813 500724 509883 520509 533162 548284 565701 584912 606052 630171
61849 630171 658125 689406 722554 756548 791068 825420 858137 888104 915333 939902 960638
61838 960638 975780 984722 988248 987115 981426 971672 959474 946692 934450 923564 915291 910841 910529
61825 910529 914141 921860 933971 949719 967241 984706 1000843 1014317 1023449 1026971 1024538 1016268 1002362
61812 1002362 983450 960676 934974 906697 876457 845742 816057 787708 760133 733268 707933
61801 707933 684920 664341 646006 629806 615482 602414 590061 578462 568070 559199 551762 545417
61789 545417 539723 534231 528603 522808 517159 512092 507819 504185 500841 497539 494226 490913 487580 484303
$$ packed form
61875E54660j3502j3033j1278q983p248o258n421m399l396k602j859r10L19J774
61861D77864L373N016O560P911R159J0626J2653J5122J7417J9211K1140K4119
61849F30171K7954L1281L3148L3994L4520L4352L2717K9967K7229K4569K0736
61838I60638J5142Q942L526j133n689r754j2198j2782j2242j0886q273m450l12
61825I10529L612P719J2111J5748J7522J7465J6137J3474R132L522k433q270j3906
61812A002362j8912k2774k5702k8277l0240l0715k9685k8349k7575k6865k5335
61801G07933k3013k0579j8335j6200j4324j3068j2353j1599j0392q871p437o345
61789E45417n694n492n628n795n649n067m273l634l344l302l313l313l333l277
$$ plain form
61775 484303 481390 479260 478049 477297 476147 474123 471730 470010 469357 469016 468038 466443 465103 464676 465122 466131
61759 466131 467448 468803 470097 471772 474418 477735 480452 481679 481990 482752 484611 486938 488608 488936 487976
61744 487976 486195 483933 481153 477749 474005 470458 467432 465000 463315 462431 461833 460801 459426 458627 458886
61729 458886 459620 460159 460649 461470 462436 463325 464691 467266 470784 474241 477216 480163 483365 486304 488324 489407
61713 489407 490090 490894 491985 493139 493954 494159 493656 492230 489592 485960 482208 478952 475805 472045 467813
61698 467813 464057 461351 459343 457370 455125 452690 450383 448612 447503 446616 445303 443319 440840 438092
61684 438092 435349 433109 431710 430841 429963 429151 428945 429270 429152 427760 425337 422781 420566 418317 415385 411702
61668 411702 408042 405332 403698 402504 401408 400835 401061 401401 401017 400112 399483 399179 398543 397537 396972 397235 397710
$$ packed form
61775D84303k913k130j211p52j150k024k393j720o53l41r78j595j340m27M46J009
61759D66131J317J355J294J675K646L317K717J227L11P62J859K327J670L28r60
61744D87976j781k262k780l404l744l547l026k432j685q84n98j032j375p99K59
61729D58886P34N39M90Q21R66Q89J366K575L518L457K975K947L202K939K020J083
61713D89407O83Q04J091J154Q15K05n03j426k638l632l752l256l147l760m232
61698D67813l756k706k008j973k245k435k307j771j109q87j313j984k479k748
61684D38092k743k240j399q69q78q12k06L25j18j392k423k556k215k249k932l683
61668D11702l660k710j634j194j096n73K26L40l84r05o29l04o36j006n65K63M75
$$ plain form
61651 397710 397801 397706 397793 398025 398489 399804 402308 405395 408305 411173 414573 418339 421616 424026 426038 428027
61635 428027 429516 429705 428422 426243 423786 421215 418484 415794 413499 411619 409753 407595 405196 402526
61621 402526 399241 395346 391746 389531 388789 388708 388774 389157 389870 390255 389644 387933 385220 381436 376767 371950
61605 371950 367646 363750 359756 355557 351434 347480 343504 339455 335548 331926 328483 325090 321779 318648
61591 318648 315650 312515 308947 304986 301157 298108 296058 294730 293803 293156 292670 292093 291269 290250 289021
61576 289021 287322 284953 282167 279599 277820 277002 276966 277518 278669 280420 282359 283773 284385 284639 285005 285325
61560 285325 285274 285117 285347 285769 285683 284960 284172 283578 282807 281791 281213 281550 282334 282900 283423 284585 286540 288755
61542 288755 290632 291873 292450 292711 293352 294799 296668 298224 299288 300380 301981 303946 305697 306799 307286
$$ packed form
61651C97710R1r5Q7K32M64J315K504L087K910K868L400L766L277K410K012J989
61635D28027J489J89j283k179k457k571k731k690k295j880j866k158k399k670
61621D02526l285l895l600k215p42q1O6L83P13L85o11j711k713l784m669m817
61605C71950m304l896l994m199m123l954l976m049l907l622l443l393l311l131
61591C18648k998l135l568l961l829l049k050j328r27o47m86n77q24j019j229
61576B89021j699k369k786k568j779q18l6N52J151J751J939J414O12K54L66L20
61560B85325n1j57K30M22q6p23p88n94p71j016n78L37P84N66N23J162J955K215
61542B88755J877J241N77K61O41J447J869J556J064J092J601J965J751J102M87
$$ plain form
61527 307286 307468 307459 306994 305870 304380 302985 301703 300340 299241 299083 299722 299964 298929 297101 295602 294915
61511 294915 294818 295004 295120 294612 293288 291855 291253 291596 292309 293020 293654 293846 293146 291831 290775 290368 290235 290114
61493 290114 290249 290642 290701 290131 289599 289894 290817 291536 291778 292082 292909 294080 295216 296305 297594 299160 300778
61476 300778 302117 302928 303180 303117 303177 303708 304654 305506 305669 305056 304338 304344 305117 305754 305477 304688 304530 305395 306416
61457 306416 306683 306443 306574 307175 307477 307123 306774 307129 307942 308518 308755 309158 310071 311443 313194 315267 317379
61440 317379 319271 321251 323975 327581 331477 335099 338390 341382 343836 345695 347504 349876 352695 355215
61426 355215 356873 357699 358004 358059 358111 358420 359147 360382 362340 365221 368650 371474 372580 372039 371078 370754 370991
61409 370991 371196 371376 371939 372564 372146 370167 367429 365026 363179 361538 360024 358752 357533 356183 355015
$$ packed form
61527C07286J82rm65j124j490j395j282j363j099j58O39K42j035j828j499o87
61511B94915r7J86J16n08j324j433o02L43P13P11O34J92p00j315j056m07j33j21
61493B90114J35L93N9n70n32K95R23P19K42L04Q27J171J136J089J289J566J618
61476C00778J339Q11K52o3O0N31R46Q52J63o13p18OP73O37k77p89j58Q65J021
61457C06416K67k40J31O01L02l54l49L55Q13N76K37M03R13J372J751K073K112
61440C17379J892J980K724L606L896L622L291K992K454J859J809K372K819K520
61426C55215J658Q26L05N5N2L09P27J235J958K881L429K824J106n41r61l24K37
61409C70991K05J80N63O25m18j979k738k403j847j641j514j272j219j350j168
$$ plain form
61394 355015 354426 354258 354233 354630 355741 356924 357199 356654 356292 356471 356570 356426 357041 359287 362684 365941 368183
61377 368183 369278 369639 370109 371454 373488 375186 375986 376398 377050 377888 378776 380124 382155 384203 385553 386545
61361 386545 387994 389845 391307 392231 393505 395892 399137 402473 405653 409151 413527 418798 424590 430890
61347 430890 438363 447491 457508 466777 474338 480550 486082 490977 495049 498501 501545 503940 505492 506669
61333 506669 508169 510112 512028 513289 513238 511455 508444 505524 503469 501697 499340 496507 493743 490890 487552
61318 487552 484355 482606 482713 483877 485385 487313 489892 493029 496699 501103 506252 511967 518463 526283
61304 526283 535580 546068 557715 570728 584553 597610 608402 616450 621922 624960 625756 624779 622429
61291 622429 618765 613862 608116 601867 595069 587685 580156 573156 567062 561877 557439 553447 549529 545589
$$ packed form
61394C55015n89j68k5L97J111J183K75n45l62J79R9j44O15K246L397L257K242
61377C68183J095L61M70J345K034J698Q00M12O52Q38Q88J348K031K048J350R92
61361C86545J449J851J462R24J274K387L245L336L180L498M376N271N792O300
61347D30890P473R128J0017R269P561O212N532M895M072L452L044K395J552J177
61333E06669J500J943J916J261n1j783l011k920k055j772k357k833k764k853l338
61318D87552l197j749J07J164J508J928K579L137L670M404N149N715O496P820
61304E26283R297J0488J1647J3013J3825J3057J0792Q048N472L038P96r77k350
61291F22429l664m903n746o249o798p384p529p000o094n185m438l992l918l940
$$ plain form
61277 545589 541960 539009 536757 535091 534151 534292 535719 538324 541725 545313 548483 551060 553398 555949 558906
61262 558906 562437 566959 572765 579546 586772 594569 603695 614349 625378 635094 642714 648543 652872 655321
61248 655321 655529 653984 651669 649063 645870 641614 636154 629739 622922 616360 610314 604496 598769 593748
61234 593748 590108 587420 584492 581018 578177 577258 578334 580579 583232 585816 588094 590449 593842 598769
61220 598769 604603 610428 616140 622185 628643 635223 641804 648341 654551 660324 666148 672370 678262 682565
61206 682565 684865 685719 685658 684913 684105 684292 686112 689522 694445 700971 708826 717460 726957 738125 751362
61191 751362 766094 781661 797990 814727 830264 842503 850621 855643 859296 862633 865590 867477 867765
61178 867765 866571 864411 861471 857260 851104 842892 833229 822935 812530 802134 791705 781241 770662
$$ packed form
61277E45589l629k951k252j666r40J41J427K605L401L588L170K577K338K551K957
61262E58906L531M522N806O781P226P797R126J0654J1029R716P620N829M329K449
61248F55321K08j545k315k606l193m256n460o415o817o562o046n818n727n021
61234E93748l640k688k928l474k841r19J076K245K653K584K278K355L393M927
61220E98769N834N825N712O045O458O580O581O537O210N773N824O222N892M303
61206F82565K300Q54o1p45q08J87J820L410M923O526P855Q634R497J1168J3237
61191G51362J4732J5567J6329J6737J5537J2239Q118N022L653L337K957J887K88
61178H67765j194k160k940m211o156q212r663j0294j0405j0396j0429j0464j0579
$$ plain form
61165 770662 759540 747246 733560 719009 704335 689758 675019 660059 645309 631315 618414
61154 618414 606872 597078 589394 583919 580437 578552 577888 578256 579575 581586 583740 585388 585878 584473 580632
61139 580632 574693 567929 561508 555604 549897 544608 540452 537736 536180 535671 536567 539081 542868 547548 553344
61124 553344 560919 570750 582763 596428 611155 626769 643655 662246 682411 703561 725290 747593
61112 747593 770475 793669 816814 839607 861711 882734 902373 920326 936154 949584 961054
61101 961054 971500 981263 989382 994253 994916 991459 984300 973455 958802 940881 921045 900569 879772
61088 879772 858230 835685 812415 788848 765346 742505 721145 701682 683869 667391 652395
61077 652395 639064 627076 615990 605976 597608 590996 585571 580754 576485 572975 570265 568231 566859
$$ packed form
61165G70662j1122j2294j3686j4551j4674j4577j4739j4960j4750j3994j2901
61154F18414j1542r794p684n475l482j885o64L68J319K011K154J648M90j405l841
61139E80632n939o764o421n904n707n289m156k716j556n09Q96K514L787M680N796
61124E53344P575R831J2013J3665J4727J5614J6886J8591K0165K1150K1729K2303
61112G47593K2882K3194K3145K2793K2104K1023J9639J7953J5828J3430J1470
61101I61054J0446R763Q119M871O63l457p159j0845j4653j7921j9836k0476k0797
61088H79772k1542k2545k3270k3567k3502k2841k1360j9463j7813j6478j4996
61077F52395j3331j1988j1086j0014q368o612n425m817m269l510k710k034j372
$$ plain form
61064 566859 566313 566684 567759 569217 571080 573751 577430 581748 586318 591418 597661 605162 613606 623022 633756
61049 633756 645641 658033 670881 685029 701069 718601 737017 756348 776880 798550 821233
61038 821233 845129 870329 896379 922727 949281 976294 1004134 1033361 1064493 1097482 1131947
61027 1131947 1168072 1206538 1247438 1289980 1333392 1377224 1420786 1463573 1506655 1552550 1603411
61016 1603411 1660519 1725595 1800803 1886850 1982667 2087603 2202450 2328456 2468319 2629457
61006 2629457 2823879 3063985 3361909 3734557 4205307 4798341 5536133 6446386 7566525
60997 7566525 8936938 10596413 12586330 14930132 17556571 20217765 22517891 24093376
60989 24093376 24820636 24871687 24580588 24264318 24144780 24357583 24931439 25710754 26337388
$$ packed form
61064E66859n46L71J075J458J863K671L679M318M570N100O243P501Q444R416J0734
61049F33756J1885J2392J2848J4148J6040J7532J8416J9331K0532K1670K2683
61038H21233K3896K5200K6050K6348K6554K7013K7840K9227L1132L2989L4465
61027A131947L6125L8466M0900M2542M3412M3832M3562M2787M3082M5895N0861
61016A603411N7108O5076P5208Q6047R5817J04936J14847J26006J39863J61138
61006B629457J94422K40106K97924L72648M70750N93034P37792R10253J120139
60997G566525J370413J659475J989917K343802K626439K661194K300126J575485
60989B4093376P27260N1051k91099l16270j19538K12803N73856P79315O26634
$$ plain form
60980 26337388 26391361 25617023 24048989 21944181 19609008 17274032 15072734 13072516
60972 13072516 11299408 9750825 8410684 7262496 6290405 5474973 4794959 4231937 3769439
60963 3769439 3389499 3073916 2808189 2581830 2386322 2215310 2065465 1934479 1818946
60954 1818946 1715909 1624939 1546355 1478571 1419285 1367928 1324459 1286646 1250960 1215538 1180232
60943 1180232 1144618 1108260 1072371 1038854 1007899 978374 950146 924016 899732 876150 853246
60932 853246 832080 812786 794422 776749 760427 745343 730472 715612 701751 689501 678401
60921 678401 667964 658182 648972 640171 632095 625065 618523 611706 604985 599416 595204 591789 589125 587603
60907 587603 586990 586752 587220 589098 591987 594810 597561 601266 606182 611385 616167 620563 624479 627550 630026
$$ packed form
60980B6337388N3973p74338j568034k104808k335173k334976k201298k000218
60972A3072516j773108j548583j340141j148188r72091q15432o80014n63022m62498
60963C769439l79940l15583k65727k26359j95508j71012j49845j30986j15533
60954A818946j03037r0970p8584o7784n9286n1357m3469l7813l5686l5422l5306
60943A180232l5614l6358l5889l3517l0955k9525k8228k6130k4284k3582k2904
60932H53246k1166j9294j8364j7673j6322j5084j4871j4860j3861j2250j1100
60921F78401j0437r782r210q801q076p030o542o817o721n569m212l415k664j522
60907E87603o13k38M68J878K889K823K751L705M916N203M782M396L916L071K476
$$ plain form
60892 630026 632636 635561 638610 642322 647646 654533 662020 669753 678259 687754 697876 708573 720049
60879 720049 731874 743431 755270 768688 783882 799716 815408 831120 846857 862143 877004
60868 877004 892003 907076 921480 934983 947811 959389 968589 975449 981175 986100 989073 989218 986828
60855 986828 982051 974212 963131 949816 935099 918769 900758 882022 863459 845012 826508 808301
60843 808301 790359 771835 752420 733126 714820 696825 677998 658475 639404 621510 604741
60832 604741 588872 573710 559098 545310 533022 522491 513255 505044 498275 493139 488856 484475 479874
60819 479874 475421 471207 467259 464034 461967 460821 459914 458755 457139 455040 452796 451047 450176 450139 450941
60804 450941 452748 455307 457887 460034 461902 463588 464809 465501 466048 466584 466703 466296 466027 466472 467254 467439
$$ packed form
60892F30026K610K925L049L712N324O887P487P733Q506R495J0122J0697J1476
60879G20049J1825J1557J1839J3418J5194J5834J5692J5712J5737J5286J4861
60868H77004J4999J5073J4404J3503J2828J1578R200O860N726M925K973J45k390
60855I86828m777p839j1081j3315j4717j6330j8011j8736j8563j8447j8504j8207
60843H08301j7942j8524j9415j9294j8306j7995j8827j9523j9071j7894j6769
60832F04741j5869j5162j4612j3788j2288j0531r236q211o769n136m283m381m601
60819D79874m453m214l948l225k067j146r07j159j616k099k244j749q71l7Q02
60804D50941J807K559K580K147J868J686J221O92N47N36J19m07k69M45P82J85
$$ plain form
60788 467439 466384 463970 460510 456786 453625 451129 448668 445823 442761 439587 436044 432138 428375 425015
60774 425015 421725 418230 414648 410894 406513 401563 396965 393473 390827 388365 385874 383473 381230 379387
60760 379387 378351 378032 377674 376802 375808 375251 375089 375039 375103 375274 375278 375115 375447 376953 379695 383388 387802 392512
60742 392512 396731 399925 402263 404137 405566 406363 406499 406011 404907 403343 401582 399686 397697 396042 395098
60727 395098 394277 392291 388499 383352 377548 371608 366361 362688 360376 358185 355481 352858 350763 348617
60713 348617 345977 343454 341635 339999 337854 335569 333858 332482 330732 328765 327417 326882 326482 325694 324718
60698 324718 324061 324021 324484 324902 324674 323791 322845 322288 322196 322834 324644 327286 329499 330444 330609 330933 331777 333264
60680 333264 335792 339508 343903 348607 353981 360250 366709 372507 377664 382624 387423 392028 396847 401980
$$ packed form
60788D67439j055k414l460l724l161k496k461k845l062l174l543l906l763l360
60774D25015l290l495l582l754m381m950m598l492k646k462k491k401k243j843
60760C79387j036l19l58q72r94n57j62n0O4J71Mj63L32J506K742L693M414M710
60742C92512M219L194K338J874J429P97J36m88j104j564j761j896j989j655r44
60727C95098q21j986l792n147n804n940n247l673k312k191k704k623k095k146
60713C48617k640k523j819j636k145k285j711j376j750j967j348n35m00p88r76
60698C24718o57m0M63M18k28q83r46n57r2O38J810K642K213R45J65L24Q44J487
60680C33264K528L716M395M704N374O269O459N798N157M960M799M605M819N133
$$ plain form
60666 401980 406527 409554 411335 412775 414005 414444 413990 413298 413012 413423 414563 415961 416612 415993 414936 414828
60650 414828 416108 418032 419580 420039 419139 417333 415647 414558 413288 410776 407008 402772 398527 394203 389762
60635 389762 385227 380470 375639 371442 368344 365838 363262 360920 359584 359229 359174 359238 359848 361073 362382 363345
60619 363345 363920 364096 363934 363854 364257 364927 365372 365618 366081 366852 367647 368323 368911 369352 369749 370584 372073 373552
60601 373552 374154 373959 373903 374773 376731 379506 382432 384650 385951 387183 389228 391858 394152 395633 396328 396175
60585 396175 395234 394176 393701 393665 393529 393403 393861 395013 396598 398782 402023 406279 411146 416602 422871 429777
60569 429777 437101 445424 455792 468684 484029 501947 522515 544938 567763 589694 609343 624602
60557 624602 633597 636393 634773 630205 622851 612573 599942 586193 573067 562641 556253 553360 552338
$$ packed form
60666D01980M547L027J781J440J230M39m54o92k86M11J140J398O51o19j057j08
60650D14828J280J924J548M59r00j806j686j089j270k512l768m236m245m324m441
60635C89762m535m757m831m197l098k506k576k342j336l55n5O4O10J225J309R63
60619C63345N75J76j62q0M03O70M45K46M63P71P95O76N88M41L97Q35J489J479
60601C73552O02j95n6Q70J958K775K926K218J301J232K045K630K294J481O95j53
60585C96175r41j058m75l6j36j26M58J152J585K184L241M256M867N456O269O906
60569D29777P324Q323J0368J2892J5345J7918K0568K2423K2825K1931J9649J5259
60557F24602Q995K796j620m568p354j0278j2631j3749j3126j0426o388k893j022
$$ plain form
60544 552338 552517 554633 559406 566875 577339 591748 610609 633424 659600 689110 721727 756324
60532 756324 791221 824560 854043 877231 892766 900792 901902 896315 884567 868342 849963 831258
60520 831258 813124 795813 779329 763867 749958 737888 727129 717008 707904 701054 697054 695329
60508 695329 695227 696775 700106 705065 711911 721681 735255 752671 773992 800349 833443 874207 922462
60495 922462 977680 1039510 1107577 1181029 1258253 1336837 1413893 1486554 1552323 1609297 1656430
60484 1656430 1693410 1719840 1734522 1735916 1723154 1696163 1655028 1600065 1532752 1456075 1373717
60473 1373717 1289151 1205336 1124597 1048460 977861 913478 855637 804117 758529 718690 684150
60462 684150 653746 626442 602331 581899 564480 548572 533696 520774 510383 501765 493984 486935
$$ packed form
60544E52338J79K116M773P469J0464J4409J8861K2815K6176K9510L2617L4597
60532G56324L4897L3339K9483K3188J5535Q026J110n587j1748j6225j8379j8705
60520H31258j8134j7311j6484j5462j3909j2070j0759j0121r104o850m000j725
60508F95329j02J548L331M959O846R770J3574J7416K1321K6357L3094M0764M8255
60495I22462N5218O1830O8067P3452P7224P8584P7056P2661O5769N6974M7133
60484A656430L6980K6430J4682J394j2762k6991m1135n4963o7313p6677q2358
60473A373717q4566q3815q0739p6137p0599o4383n7841n1520m5588l9839l4540
60462F84150l0404k7304k4111k0432j7419j5908j4876j2922j0391q618p781p049
$$ plain form
60450 486935 480615 474418 468025 462233 457981 455044 452447 449717 446950 444043 440804 437779 436142 436493
60436 436493 438090 439406 439304 437801 435923 434807 434772 435240 435466 435148 434374 433329 432090 430475 428089 424874
60420 424874 421557 419140 417906 417296 416824 416621 417045 418181 419830 421529 422526 422240 420893 419334 418174 417536
60404 417536 417565 418505 420103 421546 422278 422428 422271 421766 420902 420047 419685 420091 421293 422983 424458 425223 425751
60387 425751 427074 429458 432044 433961 435233 436362 437667 439303 441349 443484 445036 445747 446099 446620 447282
60372 447282 447825 448252 448648 448909 448945 448905 449017 449478 450562 452374 454370 455640 455900 455826 456199 457147 458361 459596
60354 459596 460780 462086 464074 467341 471815 476887 482345 488686 496249 504509 512430 519072 523727 526025
60340 526025 526233 524993 522561 518712 513597 508154 503392 499584 496345 493040 489044 484190 479244 475452
$$ packed form
60450D86935o320o197o393n792m252k937k597k730k767k907l239l025j637L51
60436D36493J597J316j02j503j878j116l5M68K26l18p74j045j239j615k386l215
60420D24874l317k417j234o10m72k03M24J136J649J699R97k86j347j559j160o38
60404D17536K9R40J598J443P32J50j57n05q64q55l62M06J202J690J475P65N28
60387D25751J323K384K586J917J272J129J305J636K046K135J552P11L52N21O62
60372D47282N43M27L96K61L6m0J12M61J084J812J996J270K60p4L73R48J214J235
60354D59596J184J306J988L267M474N072N458O341P563Q260P921O642M655K298
60340E26025K08j240k432l849n115n443m762l808l239l305l996m854m946l792
$$ plain form
60326 475452 473318 472175 471093 469767 468403 467258 466483 465967 465215 463882 462461 461897 462425 463459 464730
60311 464730 466798 470201 474845 480665 488199 498098 510517 525373 542790 563087 586649 613716 643485
60298 643485 673298 699585 720022 734195 741952 742062 733134 715372 690993 663346 635767 610546
60286 610546 588389 569046 552444 538735 527460 517679 509116 502198 496740 491648 486359 481522 477738
60273 477738 474576 471430 468408 465727 463079 460306 457906 456249 455053 454160 453915 454203 454165 453655 453811 455226
60257 455226 456610 456542 455612 455420 456138 456592 456312 455993 456013 455960 455703 455722 456132 456352 456013 455456 455093 454991 455186 455835
60237 455835 456882 458023 459071 460004 460725 461226 461896 463256 465375 467851 470293 472633 475136 478234 481981
60222 481981 485569 487866 488636 488721 488899 489331 490335 492616 496100 499447 501534 502767 504228 506369 509331
$$ packed form
60326D75452k134j143j082j326j364j145p75n16p52j333j421n64N28J034J271
60311D64730K068L403M644N820P534R899J2419J4856J7417K0297K3562K7067K9769
60298F43485K9813K6287K0437J4173P757J10q928j7762k4379k7647k7579k5221
60286F10546k2157j9343j6602j3709j1275r781q563o918n458n092n289m837l784
60273D77738l162l146l022k681k648k773k400j657j196q93k45K88l8n10J56J415
60257D55226J384o8r30j92P18M54k80l19K0n3k57J9M10K20l39n57l63j02J95O49
60237D55835J047J141J048R33P21N01O70J360K119K476K442K340K503L098L747
60222D81981L588K297P70Q5J78M32J004K281L484L347K087J233J461K141K962
$$ plain form
60207 509331 513631 519383 525498 530826 535560 540401 544895 547901 549401 550580 552221 554082 555726 556876
60193 556876 557065 556030 554463 553433 553041 552516 551507 550377 549247 547711 545526 542782 539448 535600 532015
60178 532015 529636 528433 527599 526760 526119 525562 524668 523592 522910 522493 521546 519893 518313 517386 516917 516648 516564
60161 516564 516294 515164 513254 511579 510870 510926 511463 512791 515144 518010 520692 523053 525368 527864 530763
60146 530763 534293 538368 542610 546959 551915 557920 564794 571864 578447 584255 589696 595690 602718 610117
60132 610117 616763 622317 627184 631427 634487 635982 636032 634670 631714 627421 622553 617536 612193 606660 601907
60117 601907 598889 597601 597417 598023 599557 602000 604778 607093 608599 609766 611385 613648 615858 617250 617739
60102 617739 617642 617068 615997 614526 612482 609243 604601 599512 595239 592048 589547 588000 588277 590491 593622
$$ packed form
60207E09331M300N752O115N328M734M841M494L006J500J179J641J861J644J150
60193E56876J89j035j567j030l92n25j009j130j130j536k185k744l334l848l585
60178E32015k379j203q34q39o41n57q94j076o82m17r47j653j580r27m69k69q4
60161E16564k70j130j910j675p09N6N37J328K353K866K682K361K315K496K899
60146E30763L530M075M242M349M956O005O874P070O583N808N441N994P028P399
60132F10117O646N554M867M243L060J495N0j362k956m293m868n017n343n533m753
60117F01907l018j288j84O06J534K443K778K315J506J167J619K263K210J392M89
60102F17739r7n74j071j471k044l239m642n089m273l191k501j547K77K214L131
$$ plain form
60087 593622 596716 599691 602849 606339 610308 614960 620118 625167 629550 633013 635431 636840 637444 637125 635146
60072 635146 630973 625087 618368 611033 603032 595074 588083 581736 574770 566800 558710 551084 543441 535453
60058 535453 527818 521337 515892 510885 505975 501011 495887 490890 486592 483113 480038 477274 475321 474518
60044 474518 474767 476123 478760 482105 484994 487138 489532 492893 496564 499570 501910 504025 505648 506050 505058
60029 505058 503113 500609 497725 494641 491365 487538 482803 477182 470927 464305 457666 451307 445156 439097
60015 439097 433700 429935 427899 426499 424793 423014 421875 421538 421729 422257 422828 422819 421848 420296 418854 417917
59999 417917 417656 418124 418892 419140 418669 418368 419140 420779 422414 423638 424695 425918 427654 430449 434609 439580
59983 439580 444202 447556 449389 449977 449954 450068 450704 451654 452489 453016 453310 453580 454085 454856 455371 454975 453786 452759
$$ packed form
60087E93622L094K975L158L490L969M652N158N049M383L463K418J409O04l19j979
60072F35146m173n886o719p335q001p958o991o347o966p970q090p626p643p988
60058E35453p635o481n445n007m910m964n124m997m298l479l075k764j953q03
60044D74518K49J356K637L345K889K144K394L361L671L006K340K115J623M02r92
60029E05058j945k504k884l084l276l827m735n621o255o622o639o359o151o059
60015D39097n397l765k036j400j706j779j139l37J91N28N71rr71j552j442r37
59999D17917k61M68P68K48m71l01P72J639J635J224J057J223J736K795M160M971
59983D39580M622L354J833N88k3J14O36R50Q35N27K94K70N05P71N15l96j189j027
$$ plain form
59965 452759 452714 453717 455556 458168 461314 464474 467501 470871 474801 478598 481448 483472 485421 487574 489437
59950 489437 490383 490204 489227 488247 488138 489165 490723 491950 492384 491946 490738 489232 488231 488120 488271 487597 485667
59933 485667 483016 480455 478352 476640 475290 474596 474818 475596 476019 475513 474374 473159 472039 471261 471746 474265
59917 474265 478125 481646 484044 486068 488683 492095 496290 501553 507873 514566 520994 527113 532848 537582
59903 537582 540753 542584 543808 545034 546541 548147 549069 548529 546807 545089 544088 543482 542981 543001 543871 545169
59887 545169 546462 547965 549860 551645 552857 553919 555614 558168 561411 565320 569792 574321 578444 582084
59873 582084 585034 586686 586801 585945 584567 582256 578582 574084 569714 565708 561766 557872 554177 550473 546608
59858 546608 543146 540838 539642 538977 538759 539500 541428 544102 546977 550056 554047 560020 568573 579160 590565
$$ packed form
59965D52759m5J003J839K612L146L160L027L370L930L797K850K024J949K153J863
59950D89437R46j79r77r80j09J027J558J227M34m38j208j506j001j11J51o74j930
59933D85667k651k561k103j712j350o94K22P78M23n06j139j215j120p78M85K519
59917D74265L860L521K398K024K615L412M195N263O320O693O428O119N735M734
59903E37582L171J831J224J226J507J606R22n40j722j718j001o06n01K0Q70J298
59887E45169J293J503J895J785J212J062J695K554L243L909M472M529M123L640
59873E82084K950J652J15q56j378k311l674m498m370m006l942l894l695l704l865
59858E46608l462k308j196o65k18P41J928K674K875L079L991N973Q553J0587J1405
$$ plain form
59843 590565 602051 613318 623261 629935 632468 632236 631396 631031 631433 633221 636837 641342 644865 646048 644245
59828 644245 638901 629993 618982 608124 598620 590111 581851 573494 564863 555969 547423 540094 534173 529220
59814 529220 525131 522373 521100 520655 520194 519358 518289 517318 516739 516539 516337 515764 514756 513343 511542 509691
59798 509691 508387 507655 506688 504909 502798 501063 499560 497738 495683 493874 492235 490303 488086 485952 483876
59783 483876 481539 478935 476180 473042 469447 466146 463987 462729 461462 459948 458659 457683 456614 455430
59769 455430 454493 453756 452915 452307 452588 453423 453576 452555 451225 450568 450718 451524 453115 455450 458045 460602 463436
59752 463436 466947 471164 475951 481115 486181 490645 494614 498620 502727 506482 509812 513131 516392 518886
59738 518886 520383 521609 523074 524170 524120 523246 522531 522306 522095 521670 521518 522115 523147 523771 523521 522720 521942
$$ packed form
59843E90565J1486J1267R943O674K533k32q40l65M02J788L616M505L523J183j803
59828F44245n344q908j1011j0858r504q509q260q357q631q894q546p329n921m953
59814E29220m089k758j273m45m61q36j069r71n79k00k02n73j008j413j801j851
59798E09691j304p32r67j779k111j735j503j822k055j809j639j932k217k134k076
59783D83876k337k604k755l138l595l301k159j258j267j514j289r76j069j184
59769D55430r37p37q41o08K81Q35J53j021j330o57J50Q06J591K335K595K557K834
59752D63436L511M217M787N164N066M464L969M006M107L755L330L319L261K494
59738E18886J497J226J465J096n0q74p15k25k11m25j52N97J032O24k50q01p78
$$ plain form
59721 521942 521252 520359 519421 519150 519784 520468 520141 518672 516573 514056 511175 508627 507402 507513 507903 507842 507811
59704 507811 508744 510965 514032 517133 519427 520513 520802 521115 521816 522680 523603 524896 526775 528946 530827 531856
59688 531856 531678 530514 529321 529079 529834 530811 531387 531487 531159 530450 529682 529210 528788 527739 525835 523430 520699
59671 520699 517394 513435 509122 504615 499817 494954 490727 487689 485902 485230 485387 485674 485406 484792 484747 485603
59655 485603 486720 487593 488649 490492 493005 495665 498297 501030 503817 506374 508342 509310 509007 507678 505924
59640 505924 503984 501576 498573 495399 492561 490200 488341 487075 486273 485526 484640 483868 483385 482887 481935 480374
59624 480374 478264 475788 473346 471359 469749 468013 466014 464243 463042 461984 460324 457871 455106 452687
59610 452687 451004 450048 449572 449513 450197 451879 454216 456546 458632 460628 462430 463689 464499 465366 466283 466416
$$ packed form
59721E21942o90q93r38k71O34O84l27j469k099k517k881k548j225J11L90o1l1
59704E07811R33K221L067L101K294J086K89L13P01Q64R23J293J879K171J881J029
59688E31856j78j164j193k42P55R77N76J00l28p09p68m72m22j049j904k405k731
59671E20699l305l959m313m507m798m863m227l038j787o72J57K87k68o14m5Q56
59655D85603J117Q73J056J843K513K660K632K733K787K557J968R68l03j329j754
59640E05924j940k408l003l174k838k361j859j266q02p47q86p72m83m98r52j561
59624D80374k110k476k442j987j610j736j999j771j201j058j660k453k765k419
59610D52687j683r56m76n9O84J682K337K330K086J996J802J259Q10Q67R17J33
$$ plain form
59594 466416 465121 462841 460682 459371 458864 458685 458435 458150 458230 458886 459813 460650 461408 461995 461711 460011 457549
59577 457549 455540 454194 452726 450946 449669 449226 448682 447123 444866 442806 441281 440212 439606 439279 438688
59562 438688 437707 437074 437388 438171 438526 438283 437897 437689 437892 439017 441378 444491 447569 450367 452918 454867
59546 454867 455906 456734 458718 462524 467734 473887 481251 490420 501827 515983 533547 554312 575950
59533 575950 594253 605280 607780 603648 596061 587308 578467 570519 564681 561398 559883 559255 559698 561835
59519 561835 565332 568794 570969 571436 570180 567163 562497 556598 549867 542478 534686 527095 520379 514711
59505 514711 509626 504452 498904 493253 487990 483333 479056 474788 470451 466375 462939 460111 457499 455037
59491 455037 453416 453375 454481 455190 454446 452801 451528 451026 450755 450450 450594 451646 453521 456006 459100 462668
$$ packed form
59594D66416j295k280k159j311n07j79k50k85Q0O56R27Q37P58N87k84j700k462
59577D57549k009j346j468j780j277m43n44j559k257k060j525j069o06l27n91
59562D38688r81o33L14P83L55k43l86k08K03J125K361L113L078K798K551J949
59546D54867J039Q28J984L806N210O153P364R169J1407J4156J7564K0765K1638
59533E75950J8303J1027K500m132p587q753q841p948n838l283j515o28M43K137
59519E61835L497L462K175M67j256l017m666n899o731p389p792p591o716n668
59505E14711n085n174n548n651n263m657m277m268m337m076l436k828k612k462
59491D55037j621m1J106P09p44j645j273n02k71l05J44J052J875K485L094L568
$$ plain form
59475 462668 466220 469383 472278 475162 477901 480085 481580 482773 484265 486328 488721 491114 493610 496506
59461 496506 499564 502157 504432 507669 512831 519259 525615 531686 538360 545981 553783 561054 567948 574851
59447 574851 581665 588007 593569 597991 600780 601452 599514 594491 586643 577483 568819 561248 554200 547400
59433 547400 541383 536504 532349 528467 524979 522248 520603 520604 522790 526865 531834 537249 543708 551856 561574
59418 561574 572531 584916 599202 615535 633695 653525 675358 700007 727481 754783 775661
59407 775661 784282 779696 766003 748382 730190 713535 700425 692267 689556 692790 702087 714638 723924
59394 723924 723455 711363 690814 666653 642574 620510 601000 583812 568946 557048 548533 542755
59382 542755 538631 535592 533418 531761 530566 530427 531774 534111 536747 539752 543429 547368 550895 554123
$$ packed form
59475D62668L552L163K895K884K739K184J495J193J492K063K393K393K496K896
59461D96506L058K593K275L237N162O428O356O071O674P621P802P271O894O903
59447E74851O814O342N562M422K789O72j938n023p848r160q664p571p048o800
59433E47400o017m879m155l882l488k731j645JK186M075M969N415O459Q148R718
59418E61574J0957J2385J4286J6333J8160J9830K1833K4649K7474K7302K0878
59407G75661Q621m586j3693j7621j8192j6655j3110q158k711L234R297J2551R286
59394G23924m69j2092k0549k4161k4079k2064j9510j7188j4866j1898q515n778
59382E42755m124l039k174j657j195j39J347K337K636L005L677L939L527L228
$$ plain form
59368 554123 557742 562039 566867 572255 578276 584595 590920 597634 605200 613144 620417 626644 632358 638133
59354 638133 644178 650729 658127 666475 675635 685585 696407 708064 720521 733914 748166 762634 776485
59341 776485 789273 800833 810895 819050 824836 827696 827275 824023 818970 812627 804713 795222 784916
59328 784916 774184 762308 748726 734442 721234 709858 699861 690752 682443 674766 667451 660563 654288
59315 654288 648480 643020 638386 635096 632756 630367 627537 624800 622821 621914 622271 624073 627331 632043 638461
59300 638461 646782 656683 667716 680238 695443 713977 734235 751967 762012 761332 750830 734118
59288 734118 714701 694627 675205 657468 641553 626802 613204 601926 593901 588762 585790 584934
59276 584934 586121 588528 591527 595686 601824 609670 618389 627799 638138 649062 659795 669812 678570
$$ packed form
59368E54123L619M297M828N388O021O319O325O714P566P944P273O227N714N775
59354F38133O045O551P398Q348R160R950J0822J1657J2457J3393J4252J4468J3851
59341G76485J2788J1560J0062Q155N786K860m21l252n053o343p914r491j0306
59328G84916j0732j1876j3582j4284j3208j1376r997r109q309p677p315o888o275
59315F54288n808n460m634l290k340k389k830k737j979r07L57J802L258M712O418
59300F38461Q321R901J1033J2522J5205J8534K0258J7732J0045o80j0502j6712
59288G34118j9417k0074j9422j7737j5915j4751j3598j1278q025n139k972q56
59276E84934J187K407K999M159O138P846Q719R410J0339J0924J0733J0017Q758
$$ plain form
59263 678570 685135 689000 690791 691313 690401 687580 683211 677911 671429 663259 654001 644965 636635 628517 620306
59248 620306 612284 604845 598471 593841 591090 589375 588047 587770 589471 592737 596429 600418 605470 611614
59234 611614 617916 623735 629035 633567 636818 638712 639401 638589 636128 632955 630277 627931 624733 620320 615538
59219 615538 611086 606924 603010 599511 596297 593195 590715 589493 589202 589040 589093 590039 591710 593186 594205
59204 594205 595181 595917 595675 594615 593831 593812 594079 594395 594996 595521 595127 593973 593289 593610 594200 594548 595171 596464
59186 596464 597940 599162 600364 601695 602813 603681 604801 606264 607516 608351 609240 610408 611635 613201 615863
59171 615863 619573 623382 627045 631540 637448 643990 650286 656541 663283 670395 677582 684939 692324 698834
59157 698834 703527 706114 706601 704999 701739 697569 692670 686660 679748 672922 666604 660041 652530 644386
$$ packed form
59263F78570O565L865J791N22r12k821m369n300o482q170r258r036q330q118q211
59248F20306q022p439o374m630k751j715j328k77J701L266L692L989N052O144
59234F11614O302N819N300M532L251J894O89q12k461l173k678k346l198m413m782
59219F15538m452m162l914l499l214l102k480j222k91j62N3R46J671J476J019
59204E94205R76P36k42j060p84j9K67L16O01N25l94j154o84L21N90L48O23J293
59186E96464J476J222J202J331J118Q68J120J463J252Q35Q89J168J227J566K662
59171F15863L710L809L663M495N908O542O296O255O742P112P187P357P385O510
59157F98834M693K587M87j602l260m170m899o010o912o826o318o563p511q144
$$ plain form
59143 644386 636261 628439 621240 615133 609881 604459 598366 592192 586421 580675 574681 568971 563909 558957
59129 558957 553740 549105 546280 545535 546259 547738 549366 550858 552858 556617 562504 569467 576512 583910 592431
59114 592431 602224 613053 624828 637148 649082 660127 670667 680886 690036 697580 704195 710683
59102 710683 716544 720635 722780 723753 724073 723645 722308 719920 716123 710765 704428 697998 691985 686637 682319
59087 682319 679167 676708 674316 671801 669187 666307 662983 659129 654365 648021 639995 631182 622675 615051
59073 615051 608640 603734 600041 596632 593003 589582 586676 583687 580009 576015 572356 568865 565008 560990
59059 560990 557552 554876 552395 549506 545990 542020 538250 535572 534300 533875 533704 533863 534583 535603 536552
59044 536552 537503 538595 539456 539594 539042 538178 537232 536417 536131 536603 537601 538839 540257 541662 542683 543515 545169
$$ packed form
59143F44386q125p822p199o107n252n422o093o174n771n746n994n710n062m952
59129E58957n217m635k825p45P24J479J628J492K000L759N887O963P045P398Q521
59114E92431R793J0829J1775J2320J1934J1045J0540J0219R150P544O615O488
59102G10683N861M091K145R73L20m28j337k388l797n358o337o430o013n348m318
59087F82319l152k459k392k515k614k880l324l854m764o344q026q813q507p624
59073F15051o411m906l693l409l629l421k906k989l678l994l659l491l857m018
59059E60990l438k676k481k889l516l970l770k678j272m25j71J59P20J020R49
59044E36552R51J092Q61J38n52q64r46q15k86M72R98J238J418J405J021Q32J654
$$ plain form
59027 545169 548497 553352 559147 565752 573425 582263 592150 602865 613918 624660 634816 644450 653219
59014 653219 660291 665232 668294 669611 668928 666502 663448 660605 657766 654522 651274 648888 647979 648903 651726
58999 651726 655780 660000 664145 668862 674202 679105 682898 686164 689412 691966 693119 693336 693180 691954 688658
58984 688658 683671 678201 672606 666490 660159 654742 650922 648518 647230 647044 647975 650153 654008 659774 667045
58969 667045 675320 684641 695131 706359 717807 729531 741739 754111 766202 778061 789757 800694
58957 800694 810020 817309 822247 824202 822823 818554 811873 802546 790393 776254 761369 746224 730771
58944 730771 715328 700474 686508 673790 663177 655189 649092 643622 638329 633518 629275 625411 622045
58931 622045 619418 617353 615525 613948 612660 611325 609757 608303 607084 605481 603072 600479 598487 596962
$$ packed form
59027E45169L328M855N795O605P673Q838R887J0715J1053J0742J0156R634Q769
59014F53219P072M941L062J317o83k426l054k843k839l244l248k386r09R24K823
58999F51726M054M220M145M717N340M903L793L266L248K554J153K17j56j226l296
58984F88658m987n470n595o116o331n417l820k404j288j86R31K178L855N766P271
58969F67045Q275R321J0490J1228J1448J1724J2208J2372J2091J1859J1696J0937
58957H00694R326P289M938J955j379m269o681r327j2153j4139j4885j5145j5453
58944G30771j5443j4854j3966j2718j0613p988o097n470n293m811m243l864l366
58931F22045k627k065j828j577j288j335j568j454j219j603k409k593j992j525
$$ plain form
58917 596962 595476 594261 593610 592992 591899 590980 591160 592112 592817 593266 594390 596631 599779 604070 610156 617980
58901 617980 626744 636017 645968 656567 667477 678727 690625 702979 715202 727111 739010 751244
58889 751244 764483 780097 799162 821118 844190 867020 889079 909661 927523 941687 951987
58878 951987 958850 963011 965153 965134 961791 954115 942384 927681 910897 892951 875295 859161 844663
58865 844663 831484 819912 810190 801434 792464 783349 774866 766826 758235 748938 739657 730440 720464 709528
58851 709528 698493 688023 678007 668487 660066 653047 647066 641809 637223 632766 627391 620664 613227
58838 613227 605889 598828 591915 585234 579041 573546 568780 564387 559831 555247 551664 549738 548658 547171
58824 547171 545367 544495 545135 546541 547842 548996 550456 552522 555214 558286 561407 564555 567923 571131 573209
$$ packed form
58917E96962j486j215o51o18j093r19J80R52P05M49J124K241L148M291O086P824
58901F17980Q764R273R951J0599J0910J1250J1898J2354J2223J1909J1899J2234
58889G51244J3239J5614J9065K1956K3072K2830K2059K0582J7862J4164J0300
58878I51987O863M161K142j9l343p676j1731j4703j6784j7946j7656j6134j4498
58865H44663j3179j1572r722q756q970r115q483q040q591r297r281r217r976j0936
58851G09528j1035j0470j0016r520q421p019n981n257m586m457n375o727p437
58838F13227p338p061o913o681o193n495m766m393m556m584l583j926j080j487
58824E47171j804q72O40J406J301J154J460K066K692L072L121L148L368L208K078
$$ plain form
58809 573209 573969 574707 576650 579306 581307 582358 583222 584218 584890 584918 584223 582403 579143 575035 570973 566941
58793 566941 562356 557408 552990 549495 546674 544539 543366 542944 542785 542950 543805 545203 546803 548891 551951
58778 551951 555736 559712 563903 568305 572060 574418 576017 577788 579032 578079 574613 569899 564913 559760
58764 559760 554746 550482 546781 542852 538658 534874 531612 528498 525901 524686 524800 525440 526521 528575 531305
58749 531305 533698 535521 537307 538973 540103 541508 544735 549885 555560 561198 567729 575631 584029 592214
58735 592214 600474 608913 616949 624498 632291 640514 648444 655849 663384 671123 678005 683225 687038 689838
58721 689838 691692 693119 695072 697788 700818 704323 709025 714763 720578 726375 732898 739827 745601 749514
58707 749514 752254 753924 753318 749843 744458 737867 729314 718016 704449 689395 673042 655698 638149
$$ packed form
58809E73209P60P38J943K656K001J051Q64R96O72K8o95j820l260m108m062m032
58793E66941m585m948m418l495k821k135j173m22j59J65Q55J398J600K088L060
58778E51951L785L976M191M402L755K358J599J771J244r53l466m714m986n153
58764E59760n014m264l701l929m194l784l262l114k597j215J14O40J081K054K730
58749E31305K393J823J786J666J130J405L227N150N675N638O531P902Q398Q185
58735E92214Q260Q439Q036P549P793Q223P930P405P535P739O882N220L813K800
58721F89838J854J427J953K716L030L505M702N738N815N797O523O929N774L913
58707G49514K740J670o06l475n385o591q553j1298j3567j5054j6353j7344j7549
$$ plain form
58694 638149 620690 603107 586065 571056 558458 547184 536811 528287 521808 515807 509080 502359
58682 502359 496708 491894 487441 483861 481601 480035 478550 477424 476705 475624 474224 474170 476683 480888 485444
58667 485444 490605 497370 505682 514854 524874 535935 547329 557933 567127 574349 578568 579212 576950
58654 576950 572796 567260 561007 555201 550266 545322 539839 534786 531173 528422 525264 521390 517265 513249
58640 513249 509922 508302 508604 509544 509890 510003 510893 512563 514245 515541 516391 516595 516287 516266 517072 518323 519530
58623 519530 520787 522102 523046 523774 525403 528632 532877 537456 542529 548124 553400 557893 562427 567706 572841
58608 572841 576260 577406 576727 574771 572075 569226 566323 563044 559653 557004 555151 553119 550594 548530
58594 548530 547520 546866 546005 545525 545970 547029 548733 552088 557556 564227 571461 579963 590244 601327 612053
$$ packed form
58694F38149j7459j7583j7042j5009j2598j1274j0373q524o479o001o727o721
58682E02359n651m814m453l580k260j566j485j126p19j081j400n4K513M205M556
58667D85444N161O765Q312R172J0020J1061J1394J0604R194P222M219O44k262
58654E76950m154n536o253n806m935m944n483n053l613k751l158l874m125m016
58640E13249l327j620L02R40L46J13Q90J670J682J296Q50K04l08k1Q06J251J207
58623E19530J257J315R44P28J629L229M245M579N073N595N276M493M534N279N135
58608E72841L419J146o79j956k696k849k903l279l391k649j853k032k525k064
58594E48530j010o54q61m80M45J059J704L355N468O671P234Q502J0281J1083J0726
$$ plain form
58579 612053 622373 632348 641205 648499 654914 660914 665967 670130 674859 681044 687666 693724 700070 708075
58565 708075 717871 729201 742630 758521 776172 795214 816323 839179 861317 880567 897099 911520
58553 911520 922670 929262 932161 932966 931664 927779 922539 917580 912473 905679 897168 888028 878282 867194
58539 867194 855036 842495 828904 813119 795748 778674 762771 747811 734116 722495 712820 704304
58527 704304 696952 691356 687464 684812 683508 683805 685342 687864 691856 697211 702255 705413 706908 707616 707473
58512 707473 706434 705590 705559 704948 702307 698485 695165 692118 688012 683009 678471 674761 671234 667735 664354
58497 664354 660460 655748 651396 648464 646103 643142 640348 639162 639277 639594 640543 643254 647292 651413 655744
58482 655744 661087 667004 672903 680085 690178 702308 714214 725471 737040 748313 757281 763385 767669
$$ packed form
58579F12053J0320R975Q857P294O415O000N053M163M729O185O622O058O346Q005
58565G08075R796J1330J3429J5891J7651J9042K1109K2856K2138J9250J6532J4421
58553I11520J1150O592K899Q05j302l885n240m959n107o794q511r140r746j1088
58539H67194j2158j2541j3591j5785j7371j7074j5903j4960j3695j1621r675q516
58527G04304p352n596l892k652j304K97J537K522L992N355N044L158J495P08j43
58512G07473j039q44l1o11k641l822l320l047m106n003m538l710l527l499l381
58497F64354l894m712m352k932k361k961k794j186J15L17R49K711M038M121M331
58482F55744N343N917N899P182J0093J2130J1906J1257J1569J1273Q968O104M284
$$ plain form
58469 767669 770297 770280 767484 762734 756220 747930 739293 732189 726701 721908 718334 717325 718490 720215 722369
58454 722369 726214 731935 738597 746055 754492 762406 767547 769734 770473 770121 767764 763611 759089 754754 750354
58439 750354 746633 744743 744163 743492 742909 743487 744685 745108 745315 747135 750585 754204 758170 764174 772304 780898
58423 780898 789497 799189 809909 820037 828740 836202 841622 843626 842636 840316 836877 831546 825315 820198
58409 820198 815906 810306 803141 796287 790298 783949 777343 772308 769364 767334 766280 767700 771436 775503
58395 775503 779467 784906 791990 798708 804094 809177 814139 817578 819321 821063 823536 825847 828204 832273
58381 832273 838104 843606 847786 851732 855790 858769 860639 863124 866822 870478 873702 877557 881989 885683
58367 885683 889001 893999 900927 907822 914114 921401 930032 938328 945990 954911 965588 975943 984679 992716
$$ packed form
58469G67669K628j7k796m750o514q290q637p104n488m793l574j009J165J725K154
58454G22369L845N721O662P458Q437P914N141K187P39l52k357m153m522m335m400
58439G50354l721j890n80o71n83N78J198M23K07J820L450L619L966O004Q130Q594
58423G80898Q599R692J0720J0128Q703P462N420K004r90k320l439n331o231n117
58409H20198m292n600p165o854n989o349o606n035k944k030j054J420L736M067
58395G75503L964N439P084O718N386N083M962L439J743J742K473K311K357M069
58381H32273N831N502M180L946M058K979J870K485L698L656L224L855M432L694
58367H85683L318M998O928O895O292P287Q631Q296P662Q921J0677J0355Q736Q037
$$ plain form
58353 992716 1000464 1006917 1012279 1018252 1024892 1030423 1034861 1040326 1047014 1052613 1056664 1061676 1068791 1076219
58339 1076219 1083336 1092424 1104692 1118194 1131390 1145291 1160460 1175327 1189149 1203317 1218158 1231740
58327 1231740 1243273 1254334 1265318 1274235 1280515 1286405 1293063 1298827 1302901 1307093 1312271 1316800 1320175
58314 1320175 1324570 1331114 1338211 1345144 1353624 1364272 1375363 1386558 1399908 1415656 1431131 1445414
58302 1445414 1460821 1478135 1494831 1509842 1525599 1543340 1560940 1577447 1595099 1614721 1633800
58291 1633800 1651418 1670308 1691665 1712800 1732337 1752805 1775536 1798135 1819738 1843502 1870877
58280 1870877 1898623 1924677 1951789 1982081 2013285 2043915 2076887 2114264 2153436 2192169 2232390
58269 2232390 2275362 2318369 2360060 2403925 2452572 2503642 2555089 2609185 2667535 2727651 2788253
$$ packed form
58353I92716P748O453N362N973O640N531M438N465O688N599M051N012P115P428
58339A076219P117R088J2268J3502J3196J3901J5169J4867J3822J4168J4841J3582
58327A231740J1533J1061J0984Q917O280N890O658N764M074M192N178M529L375
58314A320175M395O544P097O933Q480J0648J1091J1195J3350J5748J5475J4283
58302A445414J5407J7314J6696J5011J5757J7741J7600J6507J7652J9622J9079
58291A633800J7618J8890K1357K1135J9537K0468K2731K2599K1603K3764K7375
58280A870877K7746K6054K7112L0292L1204L0630L2972L7377L9172L8733M0221
58269B232390M2972M3007M1691M3865M8647N1070N1447N4096N8350O0116O0602
$$ plain form
58258 2788253 2852209 2920245 2987779 3052132 3116827 3184565 3252507 3318994 3388092 3462518 3538833
58247 3538833 3614849 3694899 3782382 3874164 3967910 4067638 4176125 4289371 4404893 4527840
58237 4527840 4662344 4804685 4951890 5108942 5280087 5461257 5648878 5847850 6062821
58228 6062821 6290257 6527651 6781674 7058389 7354508 7667463 8004456 8371861 8765967
58219 8765967 9184690 9637846 10134771 10672980 11251154 11881721 12577725 13339692 14169730
58210 14169730 15086143 16109258 17246586 18508732 19926356 21534583 23357038 25425970
58202 25425970 27803075 30561017 33765760 37506908 41934613 47250986 53698015 61590502
58194 61590502 71333898 83366447 98104418 115976605 137461401 163014258 192958015
$$ packed form
58258B788253O3956O8036O7534O4353O4695O7738O7942O6487O9098P4426P6315
58247C538833P6016Q0050Q7483R1782R3746R9728J08487J13246J15522J22947
58237D527840J34504J42341J47205J57052J71145J81170J87621J98972K14971
58228F062821K27436K37394K54023K76715K96119L12955L36993L67405L94106
58219H765967M18723M53156M96925N38209N78174O30567O96004P61967Q30038
58210A4169730R16413J023115J137328J262146J417624J608227J822455K068932
58202B5425970K377105K757942L204743L741148M427705N316373O447029P892487
58194F1590502R743396J2032549J4737971J7872187K1484796K5552857K9943757
$$ plain form
58187 192958015 227379222 265754323 306106635 344298220 374602621 391856063 393856010
58180 393856010 382166824 360822102 334132271 305179587 275598086 246174151 217511243
58173 217511243 190312833 165271233 142832868 123116249 106020767 91357860 78890179
58166 78890179 68336335 59413997 51882505 45533208 40166937 35608777 31728854 28425681
58158 28425681 25601121 23168235 21067113 19251274 17668046 16268608 15025817 13924163
58150 13924163 12940161 12047666 11233970 10495083 9821471 9201804 8634180 8120288 7653525
58141 7653525 7224329 6831681 6478113 6158467 5864027 5592531 5343725 5110024 4882116
58132 4882116 4659966 4448923 4248915 4056484 3873328 3703506 3545397 3394830 3252961
$$ packed form
58187A92958015L4421207L8375101M0352312L8191585L0304401J7253442J999947
58180C93856010j1689186k1344722k6689831k8952684k9581501k9423935k8662908
58173B17511243k7198410k5041600k2438365j9716619j7095482j4662907j2467681
58166G8890179j0553844q922338p531492o349297n366271m558160l879923l303173
58158B8425681k824560k432886k101122j815839j583228j399438j242791j101654
58150A3924163r84002q92495q13696p38887o73612o19667n67624n13892m66763
58141G653525m29196l92648l53568l19646k94440k71496k48806k33701k27908
58132D882116k22150k11043k00008j92431j83156j69822j58109j50567j41869
$$ plain form
58123 3252961 3123036 3002675 2887300 2778079 2678755 2587618 2500218 2417186 2341887 2272843
58113 2272843 2205828 2141179 2081980 2027063 1972612 1918849 1868635 1821244 1773747 1726840 1683175
58102 1683175 1641548 1598649 1555014 1513522 1473567 1432392 1390810 1352041 1316104 1280741 1246742
58091 1246742 1217080 1191657 1167793 1144954 1124318 1104746 1083985 1063041 1044832 1029170 1013234
58080 1013234 996144 979047 961628 942622 922882 904183 885880 866383 846754 829211 813376
58069 813376 797661 782954 771067 760855 749791 738226 728296 719820 711064 702369 695184 688676 681117
58056 681117 673404 667247 661079 651950 640569 630318 622018 613748 605232 598236 592862 587376 581600 576854
58042 576854 572661 566984 559689 552497 545726 538261 530474 523853 518016 511248 503790 497442 492180 486253
$$ packed form
58123C252961j29925j20361j15375j09221r9324r1137q7400q3032p5299o9044
58113B272843o7015o4649n9199n4917n4451n3763n0214m7391m7497m6907m3665
58102A683175m1627m2899m3635m1492l9955m1175m1582l8769l5937l5363l3999
58091A246742k9662k5423k3864k2839k0636j9572k0761k0944j8209j5662j5936
58080A013234j7090j7097j7419j9006j9740j8699j8303j9497j9629j7543j5835
58069H13376j5715j4707j1887j0212j1064j1565r930q476q756q695p185o508p559
58056F81117p713o157o168r129j1381j0251q300q270q516o996n374n486n776m746
58042E76854m193n677p295p192o771p465p787o621n837o768p458o348n262n927
$$ plain form
58028 486253 479418 472995 466904 459688 451349 443274 435570 427309 419084 412434 407047 401359 395572 391176
58014 391176 387950 384447 381012 379179 378420 376727 374197 372772 372430 371015 368037 365444 364253 363448 362606
57999 362606 362686 363612 363881 363097 362423 362146 361319 360151 360222 361870 363678 364849 365794 366292 365516 364028 363258 362835
57981 362835 360924 357399 354069 351527 348437 344359 340611 337758 334714 330969 327441 324555 321700 319090
57967 319090 317933 318205 318351 317630 316725 315829 314401 313065 313380 315233 316769 317290 317907 318920 319049 317893
57951 317893 316733 316217 315520 314493 314296 315139 315769 316098 318000 322486 328163 333572 339020 345134 351627 358602
57935 358602 367168 377609 388592 399197 410063 421638 432987 443197 452267 459747 464293 465567
57923 465567 464879 462981 458905 452010 443483 434578 424870 413474 400753 387771 375166 363490 353505
$$ packed form
58028D86253o835o423o091p216q339q075p704q261q225o650n387n688n787m396
58014C91176l226l503l435j833p59j693k530j425l42j415k978k593j191q05q42
57999C62606Q0R26K69p84o74k77q27j168P1J648J808J171R45M98p76j488p70m23
57981C62835j911l525l330k542l090m078l748k853l044l745l528k886k855k610
57967C19090j157K72J46p21r05q96j428j336L15J853J536N21O17J013J29j156
57951C17893j160n16o97j027j97Q43O30L29J902M486N677N409N448O114O493O975
57935C58602Q566J0441J0983J0605J0866J1575J1349J0210R070P480M546J274
57923D65567o88j898m076o895q527q905r708j1396j2721j2982j2605j1676r985
$$ plain form
57910 353505 345289 338045 331435 326043 322107 319039 316543 314865 313632 311964 310071 309039 308715 307633
57896 307633 305540 304024 303946 304253 304219 304864 307077 310135 313235 316761 320923 324790 327918 331292 335422 339062
57880 339062 341099 342144 342931 342685 340585 337474 334499 331197 326495 320620 314569 308567 302430 296653 291767
57865 291767 287252 282263 276863 271697 267153 263677 261919 261646 261443 260480 259752 260687 263417 267206 271522
57850 271522 275812 279345 282289 285872 290467 294595 296839 297632 297992 297745 296435 294893 294275 294170 293217 291125
57834 291125 288731 286450 283922 280993 277952 274993 272309 270492 270155 271367 273885 277392 281181 284431
57820 284431 287279 290746 295088 299337 303038 307110 312063 316705 319864 322204 324859 327152 327226 324374 319427
57805 319427 313361 306808 300524 295053 290166 285541 281625 278932 277023 275152 273350 271885 270265 267906
$$ packed form
57910C53505q216p244o610n392l936l068k496j678j233j668j893j032l24j082
57896C07633k093j516p8L07l4O45K213L058L100L526M162L867L128L374M130L640
57880C39062K037J045P87k46k100l111k975l302m702n875o051o002o137n777m886
57865B91767m515m989n400n166m544l476j758k73k03r63p28R35K730L789M316
57850B71522M290L533K944L583M595M128K244P93L60k47j310j542o18j05r53k092
57834B91125k394k281k528k929l041k959k684j817l37J212K518L507L789L250
57820B84431K848L467M342M249L701M072M953M642L159K340K655K293P4k852m947
57805C19427o066o553o284n471m887m625l916k693j909j871j802j465j620k359
$$ plain form
57791 267906 265346 263651 262901 262254 261211 259898 258425 256811 255325 254244 253665 254093 256503 261055 266443
57776 266443 271358 275922 280889 286268 291717 297415 303324 308261 311070 312196 312977 313867 314514 314990 315551
57761 315551 315561 314075 311323 308420 305816 303200 300774 299317 298987 299079 298986 298466 297153 294811 292003 289578
57745 289578 287558 285378 282990 280803 278708 276214 273430 270980 269007 267163 265488 264344 263499 262157
57731 262157 259989 257447 255132 253491 252887 253204 253596 253402 253041 253227 253689 253603 253025 252839 253398 254183 254710 254846
57713 254846 254271 252616 250229 247972 246173 244455 242527 240449 238194 235653 233006 230517 228159 226031
57699 226031 224752 224710 225254 225481 225433 225669 226021 225753 224705 223344 221954 220731 220283 220922 221775 221825 221625 222723
57681 222723 225502 228925 232499 237131 243825 252770 264063 278280 295959 317542 344189 377817 419939
$$ packed form
57791B67906k560j695p50o47j043j313j473j614j486j081n79M28K410M552N388
57776B66443M915M564M967N379N449N698N909M937K809J126P81Q90O47M76N61
57761C15551J0j486k752k903k604k616k426j457l30R2r3n20j313k342k808k425
57745B89578k020k180k388k187k095k494k784k450j973j844j675j144q45j342
57731B62157k168k542k315j641o04L17L92j94l61J86M62q6n78j86N59P85N27J36
57713B54846n75j655k387k257j799j718j928k078k255k541k647k489k358k128
57699B26031j279m2N44K27m8K36L52k68j048j361j390j223m48O39Q53N0k00J098
57681B22723K779L423L574M632O694Q945J1293J4217J7679K1583K6647L3628M2122
$$ plain form
57668 419939 471174 531976 602598 681273 762220 835448 888828 912265 902408 864374 808247 743478
57656 743478 676430 611525 552119 499677 453803 414038 380694 353629 331537 313161 298153
57645 298153 286101 275818 266393 258084 251348 245828 241089 237586 235890 235463 235158 234691 234768 235862 237560
57630 237560 239146 240310 241153 241745 241881 241308 240186 239018 237951 236480 234294 232005 230425 229403 228133
57615 228133 226402 224663 223051 221285 219552 218459 217943 217189 215876 214595 213801 213256 212780 212579 212433 211525
57599 211525 209620 207647 206599 206489 206812 207217 207268 206372 204596 202968 202310 202190 201522 199763 197103 194019
57583 194019 191055 188645 186774 185148 183858 183314 183366 183170 182210 180776 179211 177424 175550 174240 173795 173660
57567 173660 173243 172575 171743 170462 168795 167521 167092 166857 166039 164914 164254 164167 164295 164728 165860 167512 168967
$$ packed form
57668D19939N1235O0802P0622P8675Q0947P3228N3380K3437r857l8034n6127o4769
57656G43478o7048o4905n9406n2442m5874l9765l3344k7065k2092j8376j5008
57645B98153j2052j0283r425q309o736n520m739l503j696m27l05m67P7J094J698
57630B37560J586J164Q43N92J36n73j122j168j067j471k186k289j580j022j270
57615B28133j731j739j612j766j733j093n16p54j313j281p94n45m76k01j46r08
57599B11525j905j973j048j10L23M05N1q96j776j628o58j20o68j759k660l084
57583A94019k964k410j871j626j290n44N2j96r60j434j565j787j874j310m45j35
57567A73660m17o68q32j281j667j274m29k35q18j125o60q7J28M33J132J652J455
$$ plain form
57550 168967 169835 170323 170793 171466 172477 173828 175342 176849 178186 178965 178881 178431 178740 180304 182461 184435
57534 184435 186254 188124 189661 190499 191176 192582 194779 197024 198791 200166 201448 202911 204811 207098 209204
57519 209204 210529 211054 211185 211196 211157 211180 211384 211656 211669 211039 209466 207032 204376 202144 200170 197630 194086
57502 194086 189870 185495 181339 177870 175286 172860 169678 166316 164543 164802 165240 164138 162205 161305 161802
57487 161802 162460 162464 162188 162249 162879 164127 165745 166987 167339 167378 168196 170186 172932 175882 178361 179422 178677
57470 178677 177089 176073 176012 176394 176967 177802 178532 178700 178729 179456 180741 181558 181423 180704 179530 177588 175223
57453 175223 173576 173192 173423 173602 173932 174694 175421 175517 175194 175151 175680 176514 177279 177695 177599 177066 176413 175929 175744
57434 175744 175947 176568 177424 178248 178935 179440 179603 179412 179168 178986 178457 177435 176843 177809 180053 182035 182862 183191
$$ packed form
57550A68967Q68M88M70O73J011J351J514J507J337P79q4m50L09J564K157J974
57534A84435J819J870J537Q38O77J406K197K245J767J375J282J463J900K287K106
57519B09204J325N25J31J1l9K3K04K72J3o30j573k434k656k232j974k540l544
57502A94086m216m375m156l469k584k426l182l362j773K59M38j102j933r00M97
57487A61802O58Mk76O1O30J248J618J242L52L9Q18J990K746K950K479J061p45
57470A78677j588j016o1L82N73Q35P30J68K9P27J285Q17j35p19j174j942k365
57453A75223j647l84K31J79L30P62P27R6l23m3N29Q34P65M16r6n33o53m84j85
57434A75744K03O21Q56Q24O87N05J63j91k44j82n29j022n92R66K244J982Q27L29
$$ plain form
57416 183191 183956 185047 185748 185875 185866 186051 186279 186166 185478 184421 183596 183431 183646 183615 183227 182938 182968 182943 182511 181849
57396 181849 181362 181259 181589 182318 183174 183696 183637 183152 182573 182207 182260 182603 182731 182403 182250 183206 185311 187595 189289
57377 189289 190625 192257 194304 196239 197476 197913 198042 198482 199221 199505 198803 197634 196940 196955 197304 197964 199291
57360 199291 201091 202595 203516 204385 205581 206779 207626 208296 209005 209592 209961 210458 211457 212938 214689 216478
57344 216478 217877 218498 218562 218660 218848 218693 218392 218890 220430 221850 222060 221461 221103 221055 220599 219681 219162 219582 220501
57325 220501 221180 221356 221203 220989 220950 221155 221390 221340 220941 220418 220006 219793 219753 219796 219846 219943 220197 220598 221064 221663 222508
57304 222508 223365 223686 223153 221997 220704 219692 219307 219752 220863 222229 223586 224870 226031 227208 229014
57289 229014 232019 235967 240132 244452 249471 255007 259889 263478 266523 269909 273358 276239 278942 282420
$$ packed form
57416A83191P65J091P01J27rJ85K28j13o88j057q25j65K15l1l88k89L0k5m32o62
57396A81849m87j03L30P29Q56N22n9m85n79l66N3L43J28l28j53R56K105K284J694
57377A89289J336J632K047J935J237M37J29M40P39K84p02j169o94J5L49O60J327
57360A99291J800J504R21Q69J196J198Q47O70P09N87L69M97R99J481J751J789
57344B16478J399O21O4R8J88j55l01M98J540J420K10n99l58m8m56r18n19M20R19
57325B20501O79J76j53k14l9K05K35n0l99n23m12k13m0M3N0R7K54M01M66N99Q45
57304B22508Q57L21n33j156j293j012l85M45J111J366J357J284J161J177J806
57289B29014L005L948M165M320N019N536M882L589L045L386L449K881K703L478
$$ plain form
57275 282420 286748 291107 295058 298971 303208 307549 311417 314154 315253 314880 314054 313746 313868 313599 312470
57260 312470 310630 308309 305768 303573 302154 301111 299698 297947 296587 295845 295145 294170 293406 293325 293770 294506
57244 294506 295753 297649 299773 301742 303844 306525 309596 312552 315419 318563 321742 324065 325180 325983
57230 325983 327792 331021 334988 338837 342308 345630 348980 352240 355138 357484 359289 360727 361936 362886
57216 362886 363567 364303 365628 367717 370264 373125 376712 381245 385933 389628 392296 395074 398669 402466 405614
57201 405614 408351 411592 415657 420132 424689 429317 433770 437512 440374 442799 445345 448374 452274 457378
57187 457378 463411 469389 474492 478877 483311 488194 493251 498110 502819 507652 512655 517639 522482 527173
57173 527173 531533 535248 538382 541625 545751 550980 557218 564748 574166 585565 598254 611519 625346
$$ packed form
57275B82420M328M359L951L913M237M341L868K737J099l73q26l08J22k69j129
57260C12470j840k321k541k195j419j043j413j751j360p42p00r75p64q1M45P36
57244B94506J247J896K124J969K102K681L071K956K867L144L179K323J115Q03
57230C25983J809L229L967L849L471L322L350L260K898K346J805J438J209R50
57216C62886O81P36J325K089K547K861L587M533M688L695K668K778L595L797L148
57201D05614K737L241M065M475M557M628M453L742K862K425K546L029L900N104
57187D57378O033N978N103M385M434M883N057M859M709M833N003M984M843M691
57173E27173M360L715L134L243M126N229O238P530R418J1399J2689J3265J3827
$$ plain form
57160 625346 640261 656729 674927 694765 715887 737919 760980 785739 812794 842104 873153
57149 873153 905348 938163 971332 1005200 1040525 1077571 1115611 1153669 1191467 1229287 1267242
57138 1267242 1305223 1343485 1382710 1423406 1465581 1509099 1554123 1601135 1650680 1703081 1758310
57127 1758310 1816184 1876707 1940064 2006203 2074755 2145681 2219830 2298512 2382557 2472035 2566817
57116 2566817 2667166 2773781 2887525 3009333 3140440 3282692 3438450 3609981 3799082
57107 3799082 4007672 4238889 4497406 4788818 5119237 5495733 5927136 6424810 7003719
57098 7003719 7683569 8489185 9450199 10600957 11980542 13631533 15597004 17916496 20620938
57089 20620938 23726222 27227480 31097463 35288952 39737321 44361220 49063240 53730966
$$ packed form
57160F25346J4915J6468J8198J9838K1122K2032K3061K4759K7055K9310L1049
57149H73153L2195L2815L3169L3868L5325L7046L8040L8058L7798L7820L7955
57138A267242L7981L8262L9225M0696M2175M3518M5024M7012M9545N2401N5229
57127A758310N7874O0523O3357O6139O8552P0926P4149P8682Q4045Q9478R4782
57116B566817J00349J06615J13744J21808J31107J42252J55758J71531J89101
57107C799082K08590K31217K58517K91412L30419L76496M31403M97674N78909
57098G003719O79850Q05616R61014J150758J379585J650991J965471K319492K704442
57089B0620938L105284L501258L869983M191489M448369M623899M702020M667726
$$ plain form
57081 53730966 58235528 62429126 66151035 69248390 71602404 73141815 73836559 73682634
57073 73682634 72693239 70900464 68361467 65162019 61414029 57247139 52797569 48198931
57065 48198931 43577160 39047445 34710230 30646473 26914114 23546775 20554808 17928976
57057 17928976 15646333 13676186 11984310 10535756 9297268 8238967 7334530 6560651
57049 6560651 5897063 5326879 4836081 4412373 4044759 3724008 3442812 3195077 2975396
57040 2975396 2779366 2603967 2447005 2306202 2179102 2063838 1959718 1867008 1786329 1718137
57030 1718137 1662568 1619905 1591435 1579503 1586364 1613752 1664654 1743897 1852136 1975607 2083608
57019 2083608 2141612 2131026 2057637 1942644 1807773 1667839 1531620 1404212 1287942 1183551
$$ packed form
57081E3730966M504562M193598L721909L097355K354014J539411O94744j53925
57073G3682634r89395j792775k538997l199448l747990m166890m449570m598638
57065D8198931m621771m529715m337215m063757l732359l367339k991967k625832
57057A7928976k282643j970147j691876j448554j238488j058301r04437p73879
57049F560651o63588n70184m90798m23708l67614l20751k81196k47735k19681
57040B975396j96030j75399j56962j40803j27100j15264j04120r2710q0679o8192
57030A718137n5569m2663k8470j1932O861K7388N0902P9243J08239J23471J08001
57019B083608N8004j0586p3389j14993j34871j39934j36219j27408j16270j04391
$$ plain form
57009 1183551 1091579 1012212 944451 886783 838451 798932 766637 739447 716344 697205 681158
56998 681158 666513 652377 639036 626616 614596 602843 591906 582032 573003 565257 559993 557679
56986 557679 557425 558357 560704 565003 570932 577275 582236 583451 578684 567328 550842 531408 510671 489908
56972 489908 470373 452846 437384 424003 413063 404698 398592 394793 394004 396577 401856 409119 418679
56959 418679 431437 447799 467491 489903 513694 536086 553089 560881 557501 543933 523691 500706
56947 500706 477221 453810 431092 410477 393099 378963 367655 359192 353771 351325 351851 355694 363198
56934 363198 374590 390492 411840 438771 469986 503188 535178 561213 575711 575204 560668 536447
56922 536447 507125 475703 443914 413054 384305 358635 336441 317239 300137 284865 271874
$$ packed form
57009A183551r1972p9367o7761n7668m8332l9519l2295k7190k3103j9139j6047
56998F81158j4645j4136j3341j2420j2020j1753j0937r874r029p746n264k314
56986E57679k54R32K347M299N929O343M961J215m767j1356j6486j9434k0737k0763
56972D89908j9535j7527j5462j3381j0940q365o106l799p89K573N279P263R560
56959D18679J2758J6362J9692K2412K3791K2392J7003P792l380j3568k0242k2985
56947E00706k3485k3411k2718k0615j7378j4136j1308q463n421k446N26L843P504
56934C63198J1392J5902K1348K6931L1215L3202L1990K6035J4498n07j4536k4221
56922E36447k9322l1422l1789l0860k8749k5670k2194j9202j7102j5272j2991
$$ plain form
56911 271874 261279 252355 244479 237818 232580 228189 223884 219641 215865 212637 209885 207896 207023 207176
56897 207176 208145 210132 213433 217988 223753 231192 240900 253098 267976 286094 307853 332791 359794
56884 359794 387410 413379 434460 447798 452571 449921 441581 429115 414134 398374 383354 370236
56872 370236 359826 352374 347670 345762 347390 353368 363906 379038 399395 426095 460056 501805
56860 501805 551547 608628 670563 732414 786955 826097 843768 838806 815141 778966 735932 690598
56848 690598 646827 607364 573454 545676 524785 511272 504906 505767 515294 535435 567097 610199
56836 610199 664829 731526 810639 901786 1002597 1106177 1199940 1268927 1302061 1296372 1256754
56825 1256754 1192846 1115341 1032914 951015 872956 801441 738516 684855 640462 606014 582489
$$ packed form
56911B71874j0595q924p876o661n238m391m305m243l776l228k752j989q73J53
56897B07176R69J987L301M555N765P439R708J2198J4878J8118K1759K4938K7003
56884C59794K7616K5969K1081J3338M773k650q340j2466j4981j5760j5020j3118
56872C70236j0410p452m704j908J628N978J0538J5132K0357K6700L3961M1749
56860E01805M9742N7081O1935O1851N4541L9142J7671m962k3665l6175m3034m5334
56848F90598m3771l9463l3910k7778k0891j3513o366Q61R527K0141L1662M3102
56836F10199N4630O6697P9113R1147J00811J03580R3763O8987L3134n689l9618
56825A256754o3908p7505q2427q1899p8059p1515o2925n3661m4393l4448k3525
$$ plain form
56814 582489 569658 566190 571534 586772 613326 651683 701522 761990 830791 902881 970107 1022350
56802 1022350 1050248 1048831 1019703 969662 906955 838506 769529 703962 644426 592157 547430
56791 547430 509973 479234 454858 437030 426123 422183 425156 435274 452591 476301 505099 537851
56779 537851 572886 606560 633442 648439 648685 633900 606032 568833 526884 484217 443566 406465
56767 406465 373409 343974 317407 293408 272113 253625 237951 225145 214896 206224 198218 190914
56755 190914 184765 179475 174210 168889 164387 161318 159267 157346 154944 151897 148485 145297 142622 140164
56741 140164 137859 136622 137334 139266 140553 140401 139872 140208 141112 141156 139358 136135 132992 131371 131370 131685 131151
56724 131151 130083 129547 129726 129899 129796 129931 130551 131263 131902 132924 134677 136957 139413 141653 142915 142463
$$ packed form
56814E82489j2831l468N344J5238K6554L8357M9839O0468O8801P2090O7226N2243
56802A022350K7898j417k9128n0041o2707o8449o8977o5567n9536n2269m4727
56791E47430l7457l0739k4376j7828j0907l940K973J0118J7317K3710K8798L2752
56779E37851L5035L3674K6882J4997K46j4785k7868l7199m1949m2667m0651l7101
56767D06465l3056k9435k6567k3999k1295j8488j5674j2806j0249q672q006p304
56755A90914o149n290n265n321m502l069k051j921k402l047l412l188k675k458
56741A40164k305j237P12J932J287j52n29L36R04M4j798l223l143j621jL15n34
56724A31151j068n36J79J73j03J35O20P12O39J022J753K280K456K240J262m52
$$ plain form
56708 142463 140583 138493 137091 136403 136284 136798 137720 138457 138754 138803 138564 137715 136456 135503 135068 134642 134048 133906
56690 133906 134650 135840 136870 137730 138672 139695 140726 141773 142614 142886 142735 142840 143520 144340 144818 144976 144915
56673 144915 144389 143155 141360 139409 137719 136601 135964 135216 133934 132464 131284 130013 127926 125274 123086
56658 123086 121664 120340 118869 117946 117998 118510 119033 120014 122053 125056 128594 132476 136515 140277 143507 146328
56642 146328 148857 151112 153445 156388 159890 163363 166569 169718 172615 174640 175893 177381 179651 182013
56628 182013 183569 184270 184556 184604 184431 184136 183662 182779 181531 180124 178298 175518 171911 168250 164908 161726
56612 161726 159003 157539 157336 157275 156527 155397 154416 153601 153026 153099 153652 153756 153067 152550 153189 154813 156763 158857
56594 158857 160995 162596 163250 163413 163740 164226 164540 164702 164929 165229 165491 165534 164936 163556 162329 162639 164618
$$ packed form
56708A42463j880k090j402o88j19N14R22P37K97M9k39q49j259r53m35m26n94j42
56690A33906P44J190J030Q60R42J023J031J047Q41K72j51J05O80Q20M78J58o1
56673A44915n26j234j795j951j690j118o37p48j282j470j180j271k087k652k188
56658A23086j422j324j471r23N2N12N23R81K039L003L538L882M039L762L230K821
56642A46328K529K255K333K943L502L473L206L149K897K025J253J488K270K362
56628A82013J556P01K86M8j73k95m74q83j248j407j826k780l607l661l342l182
56612A61726k723j464k03o1p48j130r81q15n75P3N53J04o89n17O39J624J950K094
56594A58857K138J601O54J63L27M86L14J62K27L00K62M3n98j380j227L10J979
$$ plain form
56577 164618 166945 168593 169766 170879 171819 172684 173991 175531 176221 175801 175554 176562 178412 180425 182948
56562 182948 186395 190127 193495 197136 202055 208098 214409 220650 226755 232167 236442 240054 243679 247239
56548 247239 250450 253527 256411 258174 258358 258143 258931 260390 261214 261217 261278 261607 261518 260819 260048 259240 257631 254845
56530 254845 251554 248718 246751 245484 244435 243075 241229 239099 236746 234021 231242 229272 228347 227456 225496
56515 225496 222479 219085 215689 212496 209903 207973 206072 203813 201764 200425 199162 197024 194116 191335
56501 191335 189168 187553 186415 185586 184610 183337 182228 181505 180628 179207 177707 176551 175372 174007 173329
56486 173329 174044 175402 176189 176426 176993 178102 179197 179916 180257 180234 180183 180831 182238 183401 183747 184188 185681
56469 185681 187640 188969 189794 190834 191830 192068 191844 191873 191833 191062 190269 190891 192910 194883 196031 196793 197333
$$ packed form
56577A64618K327J648J173J113R40Q65J307J540O90m20k47J008J850K013K523
56562A82948L447L732L368L641M919O043O311O241O105N412M275L612L625L560
56548B47239L211L077K884J763J84k15P88J459Q24LO1L29q9o99p71q08j609k786
56530B54845l291k836j967j267j049j360j846k130k353k725k779j970r25q91j960
56515B25496l017l394l396l193k593j930j901k259k049j339j263k138k908k781
56501A91335k167j615j138q29r76j273j109p23q77j421j500j156j179j365o78
56486A73329P15J358P87K37N67J109J095P19L41k3n1O48J407J163L46M41J493
56469A85681J959J329Q25J040R96K38k24K9m0p71p93O22K019J973J148P62N40
$$ plain form
56452 197333 197078 196006 195028 194686 194531 194164 194046 194916 196971 199744 202382 204205 205454 207150 209695 212121
56436 212121 213366 213668 213907 214186 214003 213285 212258 210838 209130 208023 208257 209341 210298 210913 211339 211264 210596
56419 210596 210230 210857 211717 211770 211455 211817 212568 212554 211711 210983 210611 210036 209262 208818 208537 207707 206330 205067 204231
56400 204231 204008 205178 208186 211825 214239 215023 215186 215470 216020 217155 218962 220524 221015 221208 222448 224674
56384 224674 226918 229138 231840 234442 235945 236879 238634 241114 242977 243992 245226 247000 248620 250047
56370 250047 251826 253413 253596 252706 252333 252655 252116 250104 247941 246738 246154 245794 246052 246917 247605 247965 248807
56353 248807 250372 251868 252859 253715 254491 254809 255031 255973 257320 257926 257768 257951 258646 258947 258922 259824 261856 263652
56335 263652 264495 265228 266490 267898 269495 272125 275732 279076 281780 284905 288860 292514 295155 297559 300350
$$ packed form
56452A97333k55j072r78l42j55l67j18Q70K055K773K638J823J249J696K545K426
56436B12121J245L02K39K79j83p18j027j420j708j107K34J084R57O15M26p5o68
56419B10596l66O27Q60N3l15L62P51j4q43p28l72n75p74m44k81q30j377j263q36
56400B04231k23J170L008L639K414P84J63K84N50J135J807J562M91J93J240K226
56384B24674K244K220K702K602J503R34J755K480J863J015J234J774J620J427
56370B50047J779J587J83q90l73L22n39k012k163j203n84l60K58Q65O88L60Q42
56353B48807J565J496R91Q56P76L18K22R42J347O06j58J83O95L01k5R02K032J796
56335B63652Q43P33J262J408J597K630L607L344K704L125L955L654K641K404K791
$$ plain form
56320 300350 302911 304741 306310 307798 308517 308353 308297 308838 309290 309332 309709 310842 312238 313821 316179 318954
56304 318954 320752 321315 322101 324019 326385 328770 331935 335950 339299 341041 342306 344522 347627 351012 354710
56289 354710 358562 361647 363643 365551 368176 371119 374053 377615 382198 387204 392260 397905 404379 411088
56275 411088 417902 425448 433545 440978 447550 454702 463320 472609 481905 491865 502959 514532 526405
56262 526405 539754 555350 572487 590657 610705 633344 658105 684865 714945 749719 789557
56251 789557 834906 886858 945709 1010594 1081374 1159240 1244596 1336081 1432520 1533968 1639814
56240 1639814 1747687 1855290 1961462 2064315 2160147 2245376 2317849 2375367 2415019 2435350
56230 2435350 2437407 2422568 2391215 2344600 2285791 2217351 2140068 2055301 1966353 1875937 1784387
$$ packed form
56320C00350K561J830J569J488P19j64n6N41M52M2L77J133J396J583K358K775
56304C18954J798N63P86J918K366K385L165M015L349J742J265K216L105L385L698
56289C54710L852L085J996J908K625K943K934L562M583N006N056N645O474O709
56275D11088O814P546Q097P433O572P152Q618R289R296R960J1094J1573J1873
56262E26405J3349J5596J7137J8170K0048K2639K4761K6760L0080L4774L9838
56251G89557M5349N1952N8851O4885P0780P7866Q5356R1485R6439J01448J05846
56240A639814J07873J07603J06172J02853R5832Q5229P2473N7518L9652K0331
56230B435350K057j4839l1353m6615n8809o8440p7283q4767q8948r0416r1550
$$ plain form
56219 1784387 1692000 1601038 1513650 1429833 1349387 1273978 1205198 1142260 1083569 1029051 979146
56208 979146 933085 890084 850887 816405 786183 759577 736764 717145 698662 680363 663800
56197 663800 650243 638477 627120 616908 608671 601146 593058 585498 579855 575201 570111 565353 562313
56184 562313 560336 558107 556220 555810 555988 555139 553634 552931 553090 553437 554450 556683 558919 559702 559724 560635 562517
56167 562517 564561 567075 570718 574853 578675 582881 588338 594306 599894 605913 613364 621454 629118 637139
56153 637139 646710 657287 667875 679020 691544 704854 718510 733944 752621 774170 798321 826864
56141 826864 861537 901999 948240 1002995 1069173 1146740 1234563 1332989 1441283 1554092 1663640
56130 1663640 1764360 1853291 1928316 1989653 2041654 2089676 2135722 2179103 2219112 2253868 2278589
$$ packed form
56219A784387r2387r0962q7388q3817q0446p5409o8780o2938n8691n4518m9905
56208I79146m6061m3001l9197l4482l0222k6606k2813j9619j8483j8299j6563
56197F63800j3557j1766j1357j0212q237p525q088p560n643m654n090m758l040
56184E62313j977k229j887m10J78q49j505p03J59L47J013K233K236P83K2R11J882
56167E62517K044K514L643M135L822M206N457N968N588O019P451Q090P664Q021
56153F37139R571J0577J0588J1145J2524J3310J3656J5434J8677K1549K4151K8543
56141H26864L4673M0462M6241N4755O6178P7567Q7823R8426J08294J12809J09548
56130A663640J00720Q8931P5025O1337N2001M8022M6046M3381M0009L4756K4721
$$ plain form
56119 2278589 2289061 2286245 2274778 2258335 2239047 2219067 2198395 2172065 2133246 2078817 2009580
56108 2009580 1926948 1833160 1733549 1634692 1540568 1453048 1374657 1307513 1250654 1201784 1160686
56097 1160686 1127959 1101836 1079659 1061295 1047836 1038259 1030708 1025683 1024406 1025327 1025763 1025771 1026983 1029068
56083 1029068 1030876 1033612 1039117 1046357 1053170 1060003 1068300 1076924 1084106 1091228 1100600 1111221 1120876 1130644
56069 1130644 1142934 1156866 1170232 1184270 1201597 1220994 1239301 1257059 1277063 1298665 1318798
56058 1318798 1337625 1357752 1378738 1397668 1414466 1431458 1448437 1463391 1477399 1493546 1511627
56047 1511627 1529012 1545940 1564805 1585102 1604439 1623588 1645069 1667772 1688676 1709037 1733020
56036 1733020 1760927 1789621 1818823 1850984 1885623 1919818 1953744 1989873 2027506 2064138 2101264
$$ packed form
56119B278589J0472k816j1467j6443j9288j9980k0672k6330l8819n4429o9237
56108B009580q2632r3788r9611r8857r4124q7520p8391o7144n6859m8870m1098
56097A160686l2727k6123k2177j8364j3459r577p551n025j277R21M36QJ212K085
56083A029068J808K736N505P240O813O833Q297Q624P182P122R372J0621R655R768
56069A130644J2290J3932J3366J4038J7327J9397J8307J7758K0004K1602K0133
56058A318798J8827K0127K0986J8930J6798J6992J6979J4954J4008J6147J8081
56047A511627J7385J6928J8865K0297J9337J9149K1481K2703K0904K0361K3983
56036A733020K7907K8694K9202L2161L4639L4195L3926L6129L7633L6632L7126
$$ plain form
56025 2101264 2142605 2187559 2232694 2278545 2328279 2380937 2433022 2485642 2542847 2604011 2665329
56014 2665329 2727704 2795397 2867951 2941436 3016705 3098153 3185261 3273832 3364590 3461724 3563942
56003 3563942 3666168 3769307 3878980 3995434 4114468 4237446 4370204 4512739 4660434
55994 4660434 4814733 4981755 5161105 5347468 5542588 5753838 5981600 6220447 6472092
55985 6472092 6744248 7037353 7346195 7674006 8030595 8417236 8828799 9270194 9754166
55976 9754166 10283217 10851366 11464041 12137748 12879920 13689088 14575945 15563520 16665778
55967 16665778 17888665 19254062 20799772 22555767 24547679 26826660 29469930 32554137
55959 32554137 36164927 40441793 45588197 51846557 59510813 68965801 80661762 95039436
$$ packed form
56025B101264M1341M4954M5135M5851M9734N2658N2085N2620N7205O1164O1318
56014B665329O2375O7693P2554P3485P5269Q1448Q7108Q8571R0758R7134J02218
56003C563942J02226J03139J09673J16454J19034J22978J32758J42535J47695
55994D660434J54299J67022J79350J86363J95120K11250K27762K38847K51645
55985F472092K72156K93105L08842L27811L56589L86641M11563M41395M83972
55976I754166N29051N68149O12675O73707P42172Q09168Q86857R87575J102258
55967A6665778J222887J365397J545710J755995J991912K278981K643270L084207
55959C2554137L610790M276866N146404O258360P664256R454988J1695961J4377674
$$ plain form
55951 95039436 112524764 133584045 158696539 188235617 222356476 260723330 301758787
55944 301758787 341741565 374917279 395368467 399674643 388334504 364958457 334211090
55937 334211090 300166297 265746981 232822280 202436719 175052748 150803285 129651204
55930 129651204 111427598 95861236 82651666 71512234 62154293 54285490 47649819
55923 47649819 42045708 37298925 33248899 29770474 26779259 24202528 21965128 20008619
55915 20008619 18298606 16802916 15481606 14304625 13258987 12330613 11496296 10739449
55907 10739449 10056334 9440149 8874783 8350149 7868365 7428751 7021081 6639304 6287980
55898 6287980 5968923 5674050 5397101 5140503 4905235 4685248 4477138 4284656 4108719
$$ packed form
55951I5039436J7485328K1059281K5112494K9539078L4120859L8366854M1035457
55944C01758787L9982778L3175714K0451188M306176j1340139k3376047l0747367
55937C34211090l4044793l4419316l2924701l0385561k7383971k4249463k1152081
55930A29651204j8223606j5566362j3209570j1139432r357941p868803o635671
55923D7649819n604111m746783m050026l478425k991215k576731k237400j956509
55915B0008619j710013j495690j321310j176981j045638r28374q34317p56847
55907A0739449o83115o16185n65366n24634m81784m39614m07670l81777l51324
55898F287980l19057k94873k76949k56598k35268k19987k08110j92482j75937
$$ plain form
55889 4108719 3943173 3785083 3639271 3508264 3387385 3274190 3173423 3088202 3015167 2952308
55879 2952308 2902524 2864898 2830834 2793285 2752200 2707202 2653099 2586989 2512437 2432593 2346267
55868 2346267 2254433 2163243 2076492 1991755 1907629 1828022 1755515 1687156 1620778 1559231 1504526
55857 1504526 1453794 1404822 1359839 1320245 1283254 1247295 1215099 1187799 1161402 1132732 1103746
55846 1103746 1076567 1049430 1021045 993962 969944 946635 922231 898953 878633 859317 839430
55835 839430 820916 805088 789699 773261 758036 745658 733996 721417 709964 701195 692983 683618
55823 683618 675013 668511 661419 651137 639222 628070 616968 604649 592464 581821 571546 560770
55811 560770 551416 544933 539556 533620 528569 525915 524180 521738 519855 520169 521901 524219 528557 535796
$$ packed form
55889D108719j65546j58090j45812j31007j20879j13195j00767q5221p3035o2859
55879B952308m9784l7626l4064l7549m1085m4998n4103o6110p4552p9844q6326
55868B346267r1834r1190q6751q4737q4126p9607p2507o8359o6378o1547n4705
55857A504526n0732m8972m4983l9594l6991l5959l2196k7300k6397k8670k8986
55846A103746k7179k7137k8385k7083k4018k3309k4404k3278k0320j9316j9887
55835H39430j8514j5828j5389j6438j5225j2378j1662j2579j1453q769q212r365
55823F83618q605o502p092j0282j1915j1152j1102j2319j2185j0643j0275j0776
55811E60770r354o483n377n936n051k654j735k442j883L14J732K318M338P239
$$ plain form
55797 535796 543732 549961 554813 559001 561038 559576 555807 551068 544511 535553 526171 518370 511688 505259
55783 505259 499731 494803 487600 476120 462021 447751 433448 418934 406112 396617 389390 383176 379282
55770 379282 379356 382472 386738 391616 396342 398371 396047 390959 385339 379133 371808 364734 359078 353366 345822
55755 345822 337406 329949 322969 314903 305975 297387 289003 280127 271336 263494 256267 249435 244095 240740
55741 240740 237768 233781 229680 226659 223953 220581 217490 215833 214869 213648 213026 213857 214893 214747 214229
55726 214229 214522 214658 213132 210427 207626 204071 198902 193456 189634 187122 184655 182754 182673 183709 184207
55711 184207 184456 186114 189333 192708 195534 198096 200249 201668 202996 204966 206778 206868 204793 201060 195905
55696 195905 189595 183099 177119 171311 165603 161049 158151 155685 152704 150316 149902 150894 151940 152964 154408
$$ packed form
55797E35796P936O229M852M188K037j462l769m739o557q958r382p801o682o429
55783E05259n528m928p203j1480j4099j4270j4303j4514j2822r495p227o214l894
55770C79282P4L116M266M878M726K029k324n088n620o206p325p074n656n712p544
55755C45822q416p457o980q066q928q588q384q876q791p842p227o832n340l355
55741B40740k972l987m101l021k706l372l091j657r64j221o22Q31J036j46n18
55726B14229K93J36j526k705k801l555n169n446l822k512k467j901q1J036M98
55711A84207K49J658L219L375K826K562K153J419J328J970J812R0k075l733n155
55696A95905o310o496n980n808n708m554k898k466k981k388m14R92J046J024J444
$$ plain form
55681 154408 155777 156753 158462 161822 165778 168924 171623 174704 177316 178100 177361 176156 174295 171222 167858
55666 167858 165570 164093 162311 160283 158793 157794 156950 156772 157611 158626 159424 161442 165881 171500 176338
55651 176338 180334 184217 187229 188351 188632 189744 190996 190290 187354 183659 179689 174759 169158 164130 159820
55636 159820 155268 150234 145247 140222 134900 130185 127117 125002 122506 120026 118889 118644 117426 114836
55622 114836 112314 110685 109362 108036 107192 106757 105944 104640 103470 102500 101269 99918 98856 97604 95435
55607 95435 92833 90799 89190 87358 85944 86160 87616 88689 88904 89073 89311 88840 87819 87474 88188 88975
55591 88975 89067 88592 87682 86311 84999 84328 83804 82495 80602 79092 78175 77578 77841 79599 81927 83164 83177
55574 83177 83062 82918 81880 80280 79656 80376 81135 81169 81218 81863 82599 83046 83591 84387 85013 85526 86533 87921
$$ packed form
55681A54408J369R76J709L360L956L146K699L081K612P84p39j205j861l073l364
55666A67858k288j477j782k028j490r99q44j78Q39J015P98K018M439N619M838
55651A76338L996L883L012J122K81J112J252p06k936l695l970m930n601n028m310
55636A59820m552n034m987n025n322m715l068k115k496k480j137k45j218k590
55622A14836k522j629j323j326q44m35q13j304j170r70j231j351j062j252k169
55607I5435k602k034j609j832j414K16J456J073K15J69K38m71j021l45P14P87
55591H8975R2m75r10j371j312o71n24j309j893j510r17n97K63J758K328J237J3
55574H3177j15j44j038j600o24P20P59L4M9O45P36M47N45P96O26N13J007J388
$$ plain form
55556 87921 88752 88721 88502 88437 88115 87477 87108 87158 87104 86779 86599 86665 86719 86942 87692 88446 88241 87180 86376 86374 86781
55535 86781 87317 88000 88418 88114 87622 87858 88622 89009 89094 89721 90759 91155 90723 90298 90067 89329 88026 86912
55517 86912 86042 84724 83248 83013 84416 86056 86546 85868 84586 83031 81614 80633 79397 76811 73190 70216
55501 70216 68725 67826 66565 65171 64179 63559 63229 63383 63872 64218 64477 65028 65448 64807 63216 61820 61104
55484 61104 60624 60533 61735 64031 65665 65426 63942 62368 61090 60341 60686 62032 63216 63402 63014 62739 62566
55467 62566 62348 62307 62388 62045 61194 60499 60252 59899 59072 58205 57732 57599 57860 58699 59600 59651 59057 59115 60208 61129
55447 61129 61001 60614 61033 61987 62513 62328 61762 61133 60904 61681 63312 64634 64733 63870 62733 61495 60117 58915
55429 58915 58303 58452 59366 60710 61549 61147 60079 59595 59843 59904 59598 59818 60755 61322 60966 60633 61160 62000 62362
$$ packed form
55556H7921Q31l1k19o5l22o38l69N0n4l25j80O6N4K23P50P54k05j061q04kM07
55535H6781N36O83M18l04m92K36P64L87Q5O27J038L96m32m25k31p38j303j114
55517H6912q70j318j476k35J403J640M90o78j282j555j417r81j236k586l621k974
55501G0216j491q99j261j394r92o20l30J54M89L46K59N51M20o41j591j396p16
55484F1104m80r1J202K296J634k39j484j574j278p49L45J346J184J86l88k75j73
55467F2566k18m1Q1l43q51o95k47l53q27q67m73j33K61Q39R01N1n94N8J093R21
55447F1129j28l87M19R54N26j85n66o29k29P77J631J322R9q63j137j238j378j202
55429E8915o12J49R14J344Q39m02j068m84K48O1l06K20R37N67l56l33N27Q40L62
$$ plain form
55410 62362 62450 62696 62799 62470 62169 62242 62158 61387 60166 58702 56672 54320 53062 53962 56374 58967 61285
55393 61285 63419 64971 65429 65022 64277 63266 62045 61230 61262 61633 61604 61263 61185 61632 62676 64478 66708 68306
55375 68306 68535 67807 66872 65918 65073 65007 66112 67634 68434 68168 67116 65511 63779 62816 63110 64039 64692 64907
55357 64907 64850 64328 63354 62759 63238 64246 64756 64657 64551 64564 64369 64084 64177 64607 64895 64949 65147 65692 66493 67532
55337 67532 68732 69627 69716 69042 68011 66924 66041 65694 65795 65642 64781 63765 63440 63809 64181 64176 63994 63929 64119
55318 64119 64557 64949 64867 64477 64693 66055 67822 68711 68223 66791 65037 63532 62862 63192 63893 64183 63980 63653
55300 63653 63224 62438 61457 60867 61012 61733 62685 63534 63981 63942 63620 63180 62580 61940 61726 62208 63048 63755 64268
55281 64268 64766 65247 65685 66293 67160 67869 67884 67209 66317 65550 64835 63950 62917 62158 62157 62767 63121 62694 62199 62737
$$ packed form
55410F2362Q8K46J03l29l01P3q4p71j221j464k030k352j258R00K412K593K318
55393F1285K134J552M58m07p45j011j221q15L2L71k9l41p8M47J044J802K230J598
55375F8306K29p28r35r54q45o6J105J522Q00k66j052j605j732r63K94R29O53K15
55357F4907n7n22r74n95M79J008N10r9j06J3j95k85R3M30K88N4J98N45Q01J039
55337F7532J200Q95Q9o74j031j087q83l47J01j53q61j016l25L69L72nj82o5J90
55318F4119M38L92q2l90K16J362J767Q89m88j432j754j505o70L30P01K90k03l27
55300F3653m29p86r81n90J45P21R52Q49M47l9l22m40o00o40k14M82Q40P07N13
55281F4268M98M81M38O08Q67P09J5o75q92p67p15q85j033p59jO10L54m27m95N38
$$ plain form
55261 62737 64182 65314 65600 65787 66484 67162 67176 66895 67112 67967 69054 70058 70755 70896 70636 70611 71135 71821
55243 71821 72306 72749 73173 73034 72028 70729 69893 69641 69750 70117 70440 70179 69412 69050 69573 70212 70080 69407
55225 69407 68944 68810 68746 68910 69492 69981 69705 68810 67977 67507 67311 67459 68054 68877 69730 70746 71814 72293 71893
55206 71893 71304 71226 71360 71143 70867 71189 71983 72610 72940 73217 73257 72749 72072 71901 72184 72340 72248 72235 72264 72009 71572
55185 71572 71390 71521 71758 72262 73356 74766 75798 76198 76289 76357 76454 76596 76626 76178 75296 74737 75015 75525 75319
55166 75319 74427 73693 73649 74227 75194 76120 76312 75653 75107 75567 76519 76718 75802 74356 72844 71510 70943 71469
55148 71469 72185 71841 70598 69777 69948 70496 71027 71803 72617 72640 71885 71582 72462 73690 74112 73697 73083 72520 71961
55129 71961 71629 71757 72109 72276 72165 71893 71611 71652 72407 73777 75226 76559 78044 79540 80225 79677 78600
$$ packed form
55261F2737J445J132K86J87O97O78J4k81K17Q55J087J004O97J41k60k5N24O86
55243G1821M85M43M24j39j006j299q36k52J09L67L23k61p67l62N23O39j32o73
55225F9407m63j34o4J64N82M89k76q95q33m70j96J48N95Q23Q53J016J068M79m00
55206G1893n89p8J34k17k76L22P94O27L30K77M0n08o77j71K83J56r2j3K9k55m37
55185G1572j82J31K37N04J094J410J032M00R1O8R7J42L0m48q82n59K78N10k06
55166G5319q92p34m4N78R67R26J92o59n46M60R52J99r16j446j512j334n67N26
55148G1469P16l44j243q21J71N48N31P76Q14K3p55l03Q80J228M22m15o14n63n59
55129G1961l32J28L52J67j11k72k82M1P55J370J449J333J485J496O85n48j077
$$ plain form
55112 78600 77868 77339 76351 75055 74511 75449 77453 79407 80358 79943 78463 76762 75752 75703 76065 76127 75858 75872
55094 75872 76565 77562 78243 78591 79088 79887 80611 81044 81493 82214 82931 83219 82993 82344 81301 80092 79265 79120
55076 79120 79312 79339 79116 78853 78762 79176 80420 82126 83197 83009 82250 81981 82358 82849 83248 83666 83877 83487 82637
55057 82637 81759 80783 79284 77401 75897 75302 75487 76104 76922 77716 78277 78529 78469 78191 78181 79105 80862 82305
55039 82305 82441 81536 80507 79695 78915 78245 77945 77882 77828 78047 78854 79889 80579 81056 81798 82608 82806 82247 81376
55020 81376 80475 79599 78953 78541 77803 76606 76145 77681 80554 82677 83013 82389 81915 81863 82282 83420 85065
55003 85065 86474 87357 88056 88504 88031 86589 85235 84925 85607 86801 88134 88941 88349 86450 84620 84022 84402
54986 84402 84867 85191 85742 86672 87864 89283 90786 91881 92164 91785 91177 90642 90407 90697 91420 92105 92419 92483
$$ packed form
55112G8600p32n29r88j296n44R38K004J954R51m15j480j701j010m9L62O2k69J4
55094G5872O93R97O81L48M97P99P24M33M49P21P17K88k26o49j043j209q27j45
55076G9120J92K7k23k63r1M14J244J706J071j88p59k69L77M91L99M18K11l90q50
55057H2637q78r76j499j883j504n95J85O17Q18P94N61K52o0k78j0R24J757J443
55039H2305J36r05j029q12p80o70l00o3n4K19Q07J035O90M77P42Q10J98n59q71
55020H1376r01q76o46m12p38j197m61J536K873K123L36o24m74n2M19J138J645
55003H5065J409Q83O99M48m73j442j354l10O82J194J333Q07n92j899j830n98L80
54986H4402M65L24N51R30J192J419J503J095K83l79o08n35k35K90P23O85L14O4
$$ plain form
54968 92483 92538 92721 93296 94568 96293 97627 98039 97969 98238 99001 99552 99075 97500 95696 94727 94773 95049 95007 95164
54949 95164 96154 97433 97820 97144 96456 96559 97233 98028 98901 99793 100339 100385 100199 99894 99257 98418 98054 98639 99992
54930 99992 101828 104184 107039 110052 113003 116118 119696 123799 128454 133808 139939 146806 154357 162369
54916 162369 170302 177737 184610 190409 193540 192494 187608 180795 173537 166022 158193 150486 143264 136486
54902 136486 130306 125161 121038 117426 114222 111856 110392 109352 108651 108673 109203 109261 108429 107401 106916 107070
54886 107070 107947 109796 112123 113781 114623 116034 119148 123553 128459 134130 141216 149513 158265 167013 175302
54871 175302 182207 186938 189401 189527 186872 181647 175330 169248 163175 156282 148842 141946 135936 130269
54857 130269 124710 119709 115616 112319 109570 107142 104773 102436 100483 99152 98252 97661 97655 98289 98966 99139
$$ packed form
54968I2483N5J83N75J272J725J334M12p0K69P63N51m77j575j804r69M6K76m2J57
54949I5164R90J279L87o76o88J03O74P95Q73Q92N46M6j86l05o37q39l64N85J353
54930I9992J836K356K855L013K951L115L578M103M655N354O131O867P551Q012
54916A62369P933P435O873N799L131j046m886o813p258p515p829p707p222o778
54902A36486o180n145m123l612l204k366j464j040p01K2N30N8q32j028m85J54
54886A07070Q77J849K327J658Q42J411L114M405M906N671P086Q297Q752Q748Q289
54871A75302O905M731K463J26k655n225o317o082o073o893p440o896o010n667
54857A30269n559n001m093l297k749k428k369k337j953j331r00n91oO34O77J73
$$ plain form
54841 99139 98973 98799 98427 97568 96388 95105 93567 91788 90346 89667 89522 89712 90514 91742 92279 91485 90327
54824 90327 90086 90568 90719 90399 90273 90360 90061 89432 89149 89244 89065 88620 88809 90077 91737 92900 93372 93466 93653
54805 93653 94487 96189 98170 99536 100108 100316 100242 99563 98475 97757 97698 97746 97510 97424 98042 99172 100120 100437 100205
54786 100205 99856 99947 100813 102266 103739 104769 105236 105241 105004 104785 104764 105122 106306 108791 112340 115993 119245
54769 119245 122784 127553 133478 139799 146331 153617 161911 170623 178708 185148 189219 190871 190735 189334
54755 189334 186494 181978 176266 170088 163627 156987 151006 146535 143052 139156 134562 130564 128157 126647
54741 126647 124642 121806 119083 117608 117822 119342 121291 122866 123786 124173 124096 123565 122950 123053 124604 127828
54725 127828 132418 137806 143612 150013 157338 165119 172029 177271 181491 185637 189297 191057 190298 187696
$$ packed form
54841I9139j66j74l72q59j180j283j538j779j442o79j45J90Q02J228N37p94j158
54824I0327k41M82J51l20j26Q7k99o29k83R5j79m45J89J268J660J163M72R4J87
54805I3653Q34J702J981J366N72K08p4o79j088p18n9M8k36q6O18J130R48L17k32
54786A00205l49R1Q66J453J473J030M67Nk37k19k1L58J184K485L549L653L252
54769A19245L539M769N925O321O532P286Q294Q712Q085O440M071J652j36j401
54755A89334k840m516n712o178o461o640n981m471l483l896m594l998k407j510
54741A26647k005k836k723j475K14J520J949J575R20L87p7n31o15J03J551L224
54725A27828M590N388N806O401P325P781O910N242M220M146L660J760p59k602
$$ plain form
54711 187696 183980 179164 173250 166852 160667 154834 149144 143514 138075 133128 129104 126195 124041 122178
54697 122178 120659 119722 118924 117354 114826 112211 110367 109337 108774 108541 108547 108505 108222 107736 106890 105187 102538
54680 102538 99864 98473 98816 100118 101212 101583 101522 101429 101201 100539 99673 99323 99815 100649 101189 101359 101358 101202 100978
54661 100978 101040 101364 101167 99893 98238 97403 97561 97873 97838 97702 97580 97144 96390 95898 96042 96527 96939 97200 97358
54642 97358 97481 97878 98867 100212 101381 102352 103497 104565 104653 103487 102023 101328 101454 101792 102038 102288 102586
54625 102586 102835 102928 102715 102080 101280 100867 101052 101384 101244 100412 99050 97441 95896 94645 93723 93225 93619 95317
54607 95317 97883 100143 101307 101651 101966 102709 103807 104908 105618 105797 105766 106022 106738 107791 109083 110439 111326
54590 111326 111232 110321 109228 108265 107403 106920 107238 108009 108144 107048 105230 103497 102193 101459 101527 102287 103128 103627
$$ packed form
54711A87696l716m816n914o398o185n833n690n630n439m947m024k909k154j863
54697A22178j519r37p98j570k528k615j844j030n63k33Om2k83m86q46j703k649
54680A02538k674j391L43J302J094L71o1r3k28o62q66l50M92Q34N40J70jj56k24
54661A00978O2L24j97j274j655q35J58L12l5j36j22m36p54m92J44M85M12K61J58
54642I7358J23L97R89J345J169R71J145J068Q8j166j464o95J26L38K46K50K98
54625A02586K49R3k13o35q00m13J85L32j40q32j362j609j545j251r22m98L94J698
54607I5317K566K260J164L44L15P43J098J101P10J79l1K56P16J053J292J356Q87
54590A11326r4r11j093r63q62m83L18P71J35j096j818j733j304p34O8P60Q41M99
$$ plain form
54572 103627 103968 104332 104391 103862 103113 102752 102891 103209 103498 103830 104352 105151 106128 106962 107474 107996 108910 109798 109655
54553 109655 108174 106205 104694 103726 103002 102693 103278 104825 106873 108834 110303 111201 111796 112308 112495 112096
54537 112096 111629 112034 113350 114534 115009 115590 117241 119580 121389 122170 122375 122325 121748 120395 118596 117069
54521 117069 116450 116896 117900 118625 118682 118424 118320 118376 118419 118602 119173 119996 120688 121041 120983 120336 119017 117338 115810
54502 115810 114764 114343 114575 115160 115469 115143 114568 114432 114928 115639 116038 115941 115658 115879 117090 118886 120137 120161
54484 120161 119459 119064 119488 120587 122055 123570 124687 125079 124851 124342 123738 123103 122571 122216 121916 121656 121791
54467 121791 122704 124364 126362 128209 129424 129708 129357 129195 129752 130730 131540 132024 132215 131775 130327 128280 126748
54450 126748 126433 126951 127401 127339 126988 126643 126165 125269 124234 123871 124523 125368 125235 123985 122538 121649 121294 121295 121692
$$ packed form
54572A03627L41L64N9n29p49l61J39L18K89L32N22P99R77Q34N12N22R14Q88j43
54553A09655j481j969j511r68p24l09N85J547K048J961J469Q98N95N12J87l99
54537A12096m67M05J316J184M75N81J651K339J809P81K05n0n77j353j799j527
54521A17069o19M46J004P25N7k58j04N6M3J83N71Q23O92L53n8o47j319j679j528
54502A15810j046m21K32N85L09l26n75j36M96P11L99r7k83K21J211J796J251K4
54484A20161p02l95M24J099J468J515J117L92k28n09o04o35n32l55l00k60J35
54467A21791R13J660J998J847J215K84l51j62N57R78Q10M84J91m40j448k047j532
54450A26748l15N18M50o2l51l45m78q96j035l63O52Q45j33j250j447q89l55JL97
$$ plain form
54431 121692 122287 122582 122556 122813 123463 123583 122403 120521 119250 119210 120146 121630 123234 124356 124696 124704 124921 125063
54413 125063 124401 122893 121294 120268 119994 120429 121309 122000 122068 121994 122707 124389 126322 127961 129496 131228 132955
54396 132955 134247 134978 135422 136059 137268 138901 140203 140507 139984 139432 139396 139882 140695 141567 142107 142149 142125 142493
54378 142493 142838 142187 140338 138242 136871 136252 135934 135826 136170 137014 138189 139611 141233 142793 143928 144553
54362 144553 144961 145494 146170 146632 146492 145799 145115 145011 145498 146063 146204 145878 145445 145301 145469 145547 145148 144488 144294
54343 144294 145119 146986 149730 153178 156741 159320 160183 159717 158921 158340 157860 157200 156028 153814 150296 146110
54327 146110 142458 140061 138802 138238 137897 137111 135270 132557 129994 128509 128160 128410 128822 129306 129888 130429
54311 130429 130595 130215 129733 129960 131087 132242 132428 131673 130727 129977 129346 129079 129700 131050 132138 132208 131324 129776
$$ packed form
54431A21692N95K95k6K57O50J20j180j882j271m0R36J484J604J122L40QK17J42
54413A25063o62j508j599j026k74M35Q80O91O8p4P13J682J933J639J535J732J727
54396A32955J292P31M44O37J209J633J302L04n23n52l6M86Q13Q72N40M2k4L68
54378A42493L45o51j849k096j371o19l18j08L44Q44J175J422J622J560J135O25
54362A44553M08N33O76M62j40o93o84j04M87N65J41l26m33j44J68P8l99o60j94
54343A44294Q25J867K744L448L563K579Q63m66p96n81m80o60j172k214l518m186
54327A46110l652k397j259n64l41p86j841k713k563j485l49K50M12M84N82N41
54311A30429J66l80m82K27J127J155J86p55r46p50o31k67O21J350J088P0q84j548
$$ plain form
54293 129776 127696 125620 124594 125062 126182 126829 126875 126860 126837 126352 125394 124600 124452 124830 125469 126302 127164 127662
54275 127662 127653 127563 127859 128373 128471 127842 126856 126103 125868 126135 126873 128028 129372 130607 131647 132595 133505 134404 135486
54256 135486 136811 137750 137295 135263 132720 130806 129606 128744 128603 129906 132182 133706 133409 132098 131284 131360
54240 131360 131495 130937 129758 128445 127344 126546 125936 125316 124663 124264 124369 124747 124885 124608 124293 124386 124871 125344
54222 125344 125481 125318 125095 124933 124770 124613 124763 125626 127256 129205 130863 131861 132144 131807 131008 129946 128775
54205 128775 127606 126654 126318 126916 128326 130049 131689 133224 134715 135928 136492 136401 136113 136026 136072 135910 135326
54188 135326 134271 132722 130770 128736 126950 125473 124292 123611 123578 123848 123838 123443 123047 122866 122785 122921 123694
54171 123694 125158 126814 128383 130121 132019 133290 133273 132329 131235 130067 128450 126537 124946 123881 123137
$$ packed form
54293A29776k080k076j026M68J120O47M6j5k3m85r58p94j48L78O39Q33Q62M98
54275A27662rr0K96N14R8o29r86p53k35K67P38J155J344J235J040R48R10Q99J082
54256A35486J325R39m55k032k543j914j200q62j41J303K276J524k97j311q14P6
54240A31360J35n58j179j313j101p98o10o20o53l99J05L78J38k77l15R3M85M73
54222A25344J37j63k23j62j63j57J50Q63J630J949J658R98K83l37p99j062j171
54205A28775j169r52l36N98J410J723J640J535J491J213N64r1k88q7M6j62n84
54188A35326j055j549j952k034j786j477j181o81l3K70j0l95l96j81q1J36P73
54171A23694J464J656J569J738J898J271j7r44j094j168j617j913j591j065p44
$$ plain form
54156 123137 122880 123525 124714 125266 124531 123181 122322 122322 122887 123755 124774 125622 125985 125980 126040 126366 126756 127004 127252
54137 127252 127883 129108 130673 132031 132790 133008 132990 132906 132678 132169 131355 130381 129524 129001 128671 128130 127239 126443
54119 126443 126329 126953 127792 128305 128435 128651 129574 131329 133171 134043 133658 132738 132052 131696 131618 132179 133608 135279
54101 135279 136297 136597 136821 137263 137680 138070 138840 140049 141076 141303 140743 139923 139440 139585 140004 139850 138715
54084 138715 137259 136423 136256 136163 136057 136324 136791 136833 136690 137590 140064 143053 145242 146506 147394 147953 147919 147633
54066 147633 147865 148875 150259 151587 152705 153561 154254 155220 156926 159383 162258 165410 169086 173649 179234
54051 179234 185586 192193 198883 206366 215665 226697 237727 246541 251887 253648 252192 248223 243034 238250
54037 238250 235070 233850 234232 235501 237100 239117 242094 246096 250265 253652 256228 258620 261036 263024
$$ packed form
54156A23137k57O45J189N52p35j350q59%N65Q68J019Q48L63nO0L26L90K48K48
54137A27252O31J225J565J358P59K18j8q4k28n09q14r74q57n23l30n41q91p96
54119A26443j14O24Q39N13J30K16R23J755J842Q72l85r20o86l56p8N61J429J671
54101A35279J018L00K24M42M17L90P70J209J027K27n60q20m83J45M19j54j135
54084A38715j456q36j67r3j06K67M67M2j43R00K474K989K189J264Q88N59l4k86
54066A47633K32J010J384J328J118Q56O93R66J706K457K875L152L676M563N585
54051A79234O352O607O690P483R299J1032J1030Q814N346J761j456l969n189m784
54037B38250l180j220L82J269J599K017K977M002M169L387K576K392K416J988
$$ plain form
54023 263024 264315 265419 267120 269599 272279 274454 275862 276556 276348 274779 271853 268465 265580 263104 260102
54008 260102 256116 251632 247141 242463 237353 232157 227393 223149 219302 215916 212963 210088 207115 204379
53994 204379 202061 199695 196960 194478 193026 192307 191334 189830 188299 186807 184730 182008 179680 178702 178790
53979 178790 178927 178545 177792 176990 176267 175524 174471 172904 171148 169898 169348 168826 167704 166381 165866 166469 167422
53962 167422 167905 168012 168475 169738 171663 173986 176629 179488 182198 184398 186117 187711 189451 191391 193600
53947 193600 196319 199789 204076 209068 214490 219910 224972 229615 233863 237352 239460 240090 240032 240225 240852
53932 240852 241460 241818 242313 243523 245664 248496 251599 254741 258047 261787 265952 270241 274693 280038 286959
53917 286959 295005 302713 309079 314621 320647 327644 334847 341488 347954 355263 363589 371903 379163 385321
$$ packed form
54023B63024J291J104J701K479K680K175J408O94k08j569k926l388k885k476l002
54008B60102l986m484m491m678n110n196m764m244l847l386k953k875k973k736
53994B04379k318k366k735k482j452p19r73j504j531j492k077k722k328r78Q8
53979A78790J37l82p53q02p23p43j053j567j756j250n50n22j122j323n15O03R53
53962A67422M83J07M63J263J925K323K643K859K710K200J719J594J740J940K209
53947A93600K719L470M287M992N422N420N062M643M248L489K108O30n8J93O27
53932B40852O08L58M95J210K141K832L103L142L306L740M165M289M452N345O921
53917B86959Q046P708O366N542O026O997P203O641O466P309Q326Q314P260O158
$$ plain form
53903 385321 390881 396010 400707 405572 411697 419782 429807 441421 453863 465260 472718 473695 467331
53890 467331 454591 437701 419399 401828 385464 369432 353230 337748 324210 312647 302039
53879 302039 291668 281737 272815 265246 259043 253915 249380 245169 241418 238217 235166 231752 227968 224208
53865 224208 220730 217586 214857 212532 210352 208193 206362 205019 203574 201302 198475 196184 195000 194427
53851 194427 193815 193154 192737 192580 192566 192748 193109 193249 192738 191744 191043 191315 192487 193739 194204 193746 192993 192611
53833 192611 192692 192996 193470 194216 195131 195985 196767 197567 198171 198168 197420 196086 194271 192097 190139 189253 189814 191441
53815 191441 193517 195516 196766 196581 195117 193698 193787 195721 198685 201733 204490 207046 209623 212447 215681
53800 215681 219368 223544 228400 234173 240748 247437 253289 257775 261221 264463 267973 271391 274015 275660
$$ packed form
53903C85321N560N129M697M865O125Q085J0025J1614J2442J1397P458R77o364
53890D67331j2740j6890j8302j7571j6364j6032j6202j5482j3538j1563j0608
53879C02039j0371r931q922p569o203n128m535m211l751l201l051l414l784l760
53865B24208l478l144k729k325k180k159j831j343j445k272k827k291j184n73
53851A94427o12o61m17j57j4J82L61J40n11r94p01K72J172J252M65m58p53l82
53833A92611Q1L04M74P46R15Q54P82Q00O04lp48j334j815k174j958q86N61J627
53815A91441K076J999J250j85j464j419Q9J934K964L048K757K556K577K824L234
53800B15681L687M176M856N773O575O689N852M486L446L242L510L418K624J645
$$ plain form
53786 275660 276869 278327 280241 282241 283616 283636 281937 278808 275020 271256 267654 263859 259460 254408 249121
53771 249121 244169 239785 235755 231845 228199 225135 222662 220447 218169 215688 212894 209719 206397 203465
53757 203465 201332 199937 198899 197857 196619 195125 193460 191913 190881 190598 190909 191346 191510 191307 190764 189769
53741 189769 188265 186688 185763 185770 186266 186721 187080 187490 187819 187797 187444 187005 186625 186370 186372 186685 187169 187754 188557 189436
53721 189436 189843 189550 189229 189702 190867 192003 192974 194348 196342 198406 200034 201349 202621 203800 204891
53706 204891 206312 208479 211303 214379 217371 219979 221868 222985 223792 224961 226886 229546 232623 235643
53692 235643 238260 240502 242602 244528 245956 246721 247013 247070 246988 246880 246854 246760 246279 245400 244405 243379 242183 241065
53674 241065 240781 241712 243187 244014 243511 241860 239836 238370 238001 238373 238557 238126 237604 237541 237580 236914 235488 234200
$$ packed form
53786B75660J209J458J914K000J375K0j699l129l788l764l602l795m399n052n287
53771B49121m952m384m030l910l646l064k473k215k278k481k794l175l322k932
53757B03465k133j395j038j042j238j494j665j547j032k83L11M37J64k03n43r95
53741A89769j504j577r25PM96M55L59M10L29k2l53m39l80k55KL13M84N85Q03Q79
53721A89436M07k93l21M73J165J136R71J374J994K064J628J315J272J179J091
53706B04891J421K167K824L076K992K608J889J117Q07J169J925K660L077L020
53692B35643K617K242K100J926J428P65K92N7q2j08k6r4m81q79r95j026j196j118
53674B41065k84R31J475Q27n03j651k024j466l69L72J84m31n22o3L9o66j426j288
$$ plain form
53656 234200 233910 234602 235573 236174 236304 236289 236317 236109 235361 234433 234122 234641 235373 235916 236719 238182 239601 239892 239135
53637 239135 238626 239266 240560 241374 241171 240275 239422 239363 240603 243085 246135 248856 250621 251347 251572 252253 254098
53620 254098 256898 259757 262105 264298 267069 270622 274543 278351 281800 284692 286833 288430 290258 293119
53606 293119 297091 301525 305801 309856 313872 317709 320963 323489 325558 327461 329226 330796 332198 333439
53592 333439 334521 335726 337552 340037 342322 343329 342951 342262 342453 343724 345250 346055 345780 344719 343253
53577 343253 341356 338706 335213 331293 327509 324074 320817 317556 314333 311357 308827 306803 305088 303281
53563 303281 301160 299022 297489 296922 297202 298061 299393 301106 302846 304162 304876 305110 304963 304450 303790 303500
53547 303500 303940 304913 305961 307008 308434 310519 313119 315992 319179 322836 326888 331081 335281 339493 343750
$$ packed form
53656B34200k90O92R71O01J30j5K8k08p48r28l11N19P32N43Q03J463J419K91p57
53637B39135n09O40J294Q14k03q96q53n9J240K482L050K721J765P26K25O81J845
53620B54098K800K859K348K193K771L553L921L808L449K892K141J597J828K861
53606B93119L972M434M276M055M016L837L254K526K069J903J765J570J402J241
53592C33439J082J205J826K485K285J007l78o89J91J271J526Q05k75j061j466
53577C43253j897k650l493l920l784l435l257l261l223k976k530k024j715j807
53563C03281k121k138j533n67K80Q59J332J713J740J316P14K34j47n13o60k90
53547C03500M40R73J048J047J426K085K600K873L187L657M052M193M200M212M257
$$ plain form
53532 343750 348162 353065 358850 365706 373637 382579 392295 402320 412350 422627 433582 445139 456746
53519 456746 468140 479690 491897 504933 518785 533510 549090 565351 582295 600322 619900
53508 619900 641190 664175 688797 714627 740595 765510 788903 811099 832538 853313 873335
53497 873335 892606 911160 929017 946335 963490 980841 998537 1016646 1035228 1054028 1072246
53486 1072246 1089033 1104408 1119361 1134802 1150616 1166087 1181090 1196305 1212183 1228253 1243733
53475 1243733 1258349 1272121 1284604 1294910 1302429 1307131 1309230 1308956 1306628 1302580 1296914 1289535 1280355
53462 1280355 1269252 1256080 1241132 1225408 1209868 1194507 1178668 1162178 1145468 1128542 1110666
53451 1110666 1091389 1071247 1051049 1031007 1010974 991016 971316 951971 933279 915735 899223
$$ packed form
53532C43750M412M903N785O856P931Q942R716J0025J0030J0277J0955J1557J1607
53519D56746J1394J1550J2207J3036J3852J4725J5580J6261J6944J8027J9578
53508F19900K1290K2985K4622K5830K5968K4915K3393K2196K1439K0775K0022
53497H73335J9271J8554J7857J7318J7155J7351J7696J8109J8582J8800J8218
53486A072246J6787J5375J4953J5441J5814J5471J5003J5215J5878J6070J5480
53475A243733J4616J3772J2483J0306P519M702K099k74k328m048n666p379r180
53462A280355j1103j3172j4948j5724j5540j5361j5839j6490j6710j6926j7876
53451A110666j9277k0142k0198k0042k0033j9958j9700j9345j8692j7544j6512
$$ plain form
53440 899223 882802 865981 849876 836322 826027 818281 812314 808008 805204 803127 800997 798872 797579
53427 797579 797999 800496 804749 810047 815987 822888 831313 841297 852461 864824 878942 895090 912824
53414 912824 931630 951505 972553 994430 1016818 1040209 1065577 1093154 1122053 1151360 1181190
53403 1181190 1212372 1245437 1280419 1317484 1357102 1399300 1443303 1488400 1534925 1583789 1635117
53392 1635117 1687860 1740852 1793688 1846388 1898717 1950336 2001371 2052349 2103548 2154573 2204412
53381 2204412 2251752 2295516 2335512 2372465 2407087 2439146 2467651 2491823 2511636 2527545 2540033
53370 2540033 2549323 2555145 2556704 2553085 2543693 2528108 2505735 2476052 2439305 2396650 2349531 2299222
53358 2299222 2246913 2193717 2140251 2086563 2032802 1979761 1928385 1878869 1830693 1783591 1738089
$$ packed form
53440H99223j6421j6821j6105j3554j0295p746n967m306k804k077k130k125j293
53427G97579M20K497M253N298N940O901Q425R984J1164J2363J4118J6148J7734
53414I12824J8806J9875K1048K1877K2388K3391K5368K7577K8899K9307K9830
53403A181190L1182L3065L4982L7065L9618M2198M4003M5097M6525M8864N1328
53392A635117N2743N2992N2836N2700N2329N1619N1035N0978N1199N1025M9839
53381B204412M7340M3764L9996L6953L4622L2059K8505K4172J9813J5909J2488
53370B540033R290N822J559l619r392j5585k2373k9683l6747m2655m7119n0309
53358B299222n2309n3196n3466n3688n3761n3041n1376m9516m8176m7102m5502
$$ plain form
53347 1738089 1694761 1653221 1612194 1570580 1528150 1485230 1442191 1399635 1358751 1320832 1286200
53336 1286200 1253945 1222920 1192814 1164150 1137526 1113088 1090648 1070121 1051807 1036214 1023304
53325 1023304 1011950 1000506 988145 975379 963110 951601 940687 930564 921753 914410 908182 902726
53313 902726 897921 893670 890018 887549 887136 889057 892700 897348 902909 909650 917558 926381 936194 947545
53299 947545 960971 976539 993890 1012559 1032195 1052605 1073762 1095844 1119173 1143982 1170147
53288 1170147 1197179 1224554 1251999 1279377 1306275 1331788 1354840 1374844 1392156 1407740 1422219
53277 1422219 1435258 1445990 1453930 1459198 1461890 1461683 1458272 1451870 1443039 1432225 1419699 1405653 1389927
53264 1389927 1371832 1350758 1327058 1301996 1276651 1251076 1224659 1197138 1169034 1141062 1113321
$$ packed form
53347A738089m3328m1540m1027m1614m2430m2920m3039m2556m0884l7919l4632
53336A286200l2255l1025l0106k8664k6624k4438k2440k0527j8314j5593j2910
53325A023304j1354j1444j2361j2766j2269j1509j0914j0123q811p343o228n456
53313I02726m805m251l652k469m13J921L643M648N561O741P908Q823R813J1351
53299I47545J3426J5568J7351J8669J9636K0410K1157K2082K3329K4809K6165
53288A170147K7032K7375K7445K7378K6898K5513K3052K0004J7312J5584J4479
53277A422219J3039J0732P940N268K692k07l411o402q831j0814j2526j4046j5726
53264A389927j8095k1074k3700k5062k5345k5575k6417k7521k8104k7972k7741
$$ plain form
53253 1113321 1085311 1056811 1028470 1001183 975034 949380 924027 899685 876877 854888 832388
53242 832388 808829 784675 760449 736261 712321 689288 667764 647812 629198 611853 595904
53231 595904 581434 568365 556442 545230 534324 523713 513836 505138 497612 490808 484139 477102 469338
53218 469338 460674 451179 441129 430796 420236 409358 398311 387691 378120 369618 361677 353980 346700
53205 346700 339955 333391 326655 320011 314059 309020 304647 300723 297171 293696 289742 285005 279777 274694
53191 274694 270267 266690 263856 261443 259060 256399 253336 249934 246406 242998 239950 237615 236394 236205
53177 236205 236201 235514 234297 233435 233153 232666 231573 230768 231262 232624 233427 232955 231709 230393 229225 228173 227176
53160 227176 225970 224257 222209 220357 218996 218026 217315 216766 216077 214966 213590 212388 211512 210794 210110 209381
$$ packed form
53253A113321k8010k8500k8341k7287k6149k5654k5353k4342k2808k1989k2500
53242H32388k3559k4154k4226k4188k3940k3033k1524j9952j8614j7345j5949
53231E95904j4470j3069j1923j1212j0906j0611r877q698p526o804o669p037p764
53218D69338q664r495j0050j0333j0560j0878j1047j0620r571q502p941p697p280
53205C46700o745o564o736o644n952n039m373l924l552l475l954m737n228n083
53191B74694m427l577k834k413k383k661l063l402l528l408l048k335j221j89
53177B36205mo87j217q62k82m87j093q05M94J362Q03m72j246j316j168j052r97
53160B27176j206j713k048j852j361r70p11n49o89j111j376j202q76p18o84p29
$$ plain form
53144 209381 208435 207383 206848 207192 207813 207911 207754 208282 209616 210909 211684 212300 212958 213246 213036 212890 213133 213321
53126 213321 213099 212810 212817 212891 212814 212906 213411 213959 214195 214372 214760 215016 214813 214582 214985 215939 216815 217305 217512 217422 216838
53105 216838 215696 214042 211919 209634 207863 207056 206924 206855 206565 206078 205489 205082 205260 205926 206318 205920 205147
53088 205147 204672 204448 203947 203012 201944 200975 200168 199565 198999 198063 196729 195622 195206 195073 194662 194247 194547 195667
53070 195667 197131 198648 200115 201106 201234 200917 200999 201571 201851 201183 199560 197299 194962 193496 193564 194560 194989
53053 194989 194022 192126 190206 188894 188719 190065 192561 195148 197117 198570 199669 200105 199671 198763 197876 197047
53037 197047 196185 195519 195305 195410 195531 195558 195411 194845 193716 192238 190780 189685 189365 190026 191059 191216 189905
53020 189905 187932 186506 185787 184938 183438 181755 180723 180680 181342 182244 183121 183999 185012 186126 187063 187501 187329
$$ packed form
53144B09381r46j052n35L44O21R8j57N28J334J293P75O16O58K88k10j46K43J88
53126B13321k22k89PP4p7R2N05N48K36J77L88K56k03k31M03R54Q76M90K07r0n84
53105B16838j142j654k123k285j771q07j32o9k90m87n89m07J78O66L92l98p73
53088B05147m75k24n01r35j068r69q07o03n66r36j334j107m16j33m11m15L00J120
53070A95667J464J517J467R91J28l17Q2N72K80o68j623k261k337j466O8R96M29
53053A94989r67j896j920j312j75J346K496K587J969J453J099M36m34r08q87q29
53037A97047q62o66k14J05J21K7j47n66j129j478j458j095l20O61J033J57j311
53020A89905j973j426p19q49j500j683j032m3O62R02Q77Q78J013J114R37M38j72
$$ plain form
53003 187329 186736 186134 185915 186147 186551 186919 187393 188129 188901 189446 190050 191213 192666 193345 192638 191173 190040
52986 190040 189632 189599 189593 189592 189663 189810 190070 190487 191045 191731 192567 193499 194432 195425 196602 197800 198702 199460 200761 202906
52966 202906 205196 206645 207101 207268 207722 208303 208467 207973 207151 206561 206331 205875 204562 202654 201094 200220 199308
52949 199308 197760 196156 195443 195543 195609 195469 195826 196891 197662 197012 195018 192817 191424 190963 190831 190342 189354
52932 189354 188391 188014 188070 187757 186468 184249 181479 178521 175844 174082 173633 174314 175577 176913 178033 178955
52916 178955 180016 181492 183059 183961 183879 183333 182995 182915 182733 182324 181859 181453 181127 181017 181225 181594 181929 182303
52898 182303 182788 182981 182319 180886 179492 178876 179172 180201 181870 184024 186223 187971 189076 189650 189885 189932
52882 189932 189832 189437 188587 187444 186490 186055 186004 185995 185913 185902 186136 186643 187228 187539 187468 187594 188861 191571 194935
$$ packed form
53003A87329n93o02k19K32M04L68M74P36P72N45O04J163J453O79p07j465j133
52986A90040m08l3ojP1J47K60M17N58O86Q36R32R33R93J177J198R02P58J301K145
52966B02906K290J449M56J67M54N81J64m94q22n90k30m56j313j908j560q74r12
52949A99308j548j604p13J00O6j40L57J065P71o50j994k201j393m61j32m89r88
52932A89354r63l77N6l13j289k219k770k958k677j762m49O81J263J336J120R22
52916A78955J061J476J567R02q2n46l38q0j82m09m65m06l26j10K08L69L35L74
52898A82303M85J93o62j433j394o16K96J029J669K154K199J748J105N74K35M7
52882A89932j00l95q50j143r54m35n1rq2j1K34N07N85L11p1J26J267K710L364
$$ plain form
52863 194935 197967 200586 203397 206525 209146 210305 209805 208182 206108 204065 202334 200928 199527 197729
52849 197729 195502 193286 191513 190038 188212 185680 182979 181104 180480 180587 180630 180248 179478 178435 177361 176700
52833 176700 176739 177294 178064 179059 180340 181525 182085 182033 181850 181782 181682 181449 181024 179964 177838 175254 173726 174067
52815 174067 175484 176799 177950 179603 181788 183899 185918 188648 192410 196188 198519 198826 197565 195369
52801 195369 192580 189490 186597 184412 183121 182519 182196 181772 181093 180330 179843 179813 179947 179677 178749 177509 176507
52784 176507 175951 175684 175534 175413 175232 175023 175054 175439 175658 175002 173567 172369 172220 172910 173728 174330 174767 175045
52766 175045 175166 175329 175650 175819 175468 174806 174478 174882 175886 177081 178015 178347 178184 178173 178877 180077 181033 181312
52748 181312 180982 180148 178787 177167 175937 175635 176310 177677 179332 180767 181530 181525 181099 180819 181269 182830 185286
$$ packed form
52863A94935L032K619K811L128K621J159n00j623k074k043j731j406j401j798
52849A97729k227k216j773j475j826k532k701j875o24J07M3l82p70j043j074o61
52833A76700L9N55P70R95J281J185N60n2j83o8j00k33m25j060k126k584j528L41
52815A74067J417J315J151J653K185K111K019K730L762L778K331L07j261k196
52801A95369k789l090k893k185j291o02l23m24o79p63m87l0J34k70r28j240j002
52784A76507n56k67j50j21j81k09L1L85K19o56j435j198j49O90Q18O02M37K78
52766A75045J21J63L21J69l51o62l28M04J004J195R34L32j63j1P04J200R56K79
52748A81312l30q34j361j620j230l02O75J367J655J435P63nm26k80M50J561K456
$$ plain form
52731 185286 187746 189359 190130 190718 191513 192366 193173 194144 195230 195792 195187 193505 191474 189795 188695 187906
52715 187906 186971 185745 184667 184289 184496 184535 183930 183038 182501 182531 183004 183913 185267 186698 187622 187829 187637 187382
52697 187382 187035 186433 185717 185292 185389 185809 186254 186790 187774 189283 190878 192103 193015 193963 194996 195793 196137 196194
52679 196194 196332 196820 197629 198300 198127 196805 194832 193033 191824 191203 191198 191797 192540 192839 192799 193119 194033 194899
52661 194899 195081 194750 194532 194837 195785 197334 199143 200737 202177 204146 206994 210062 212345 213480 213624 212761
52645 212761 210752 207893 204870 202203 200091 198548 197250 195488 192912 190262 188766 188786 189583 190476 191610
52630 191610 193433 195984 199018 202365 205765 208653 210529 211452 211824 211752 210902 209000 206274 203386 201030
52615 201030 199513 198542 197405 195581 193336 191610 191197 191978 193096 193836 194181 194469 194847 195311 196080 197454
$$ packed form
52731A85286K460J613P71N88P95Q53Q07R71J086N62o05j682k031j679j100p89
52715A87906r35j226j078l78K07L9o05q92n37L0M73R09J354J431R24K07j92k55
52697A87382l47o02p16m25R7M20M45N36R84J509J595J225R12R48J033P97L44N7
52679A96194J38M88Q09O71j73j322j973j799j209o21nN99P43K99m0L20R14Q66
52661A94899J82l31k18L05R48J549J809J594J440J969K848L068K283J135J44q63
52645B12761k009k859l023k667k112j543j298j762k576k650j496K0P97Q93J134
52630A91610J823K551L034L347L400K888J876R23L72p2q50j902k726k888k356
52615B01030j517r71j137j824k245j726m13P81J118P40L45K88L78M64P69J374
$$ plain form
52599 197454 199270 200919 202024 202775 203408 203722 203445 202805 202339 202292 202512 202873 203483 204453 205708 207047 208240
52582 208240 209152 209897 210762 211783 212575 212786 212559 212245 211903 211420 210997 211014 211463 211931 212172 212228 211966 211089 209833
52563 209833 209090 209391 210084 209905 208288 205801 203518 202263 202289 203248 204439 205402 206266 207318 208352 208795 208481
52546 208481 207901 207515 207195 206587 205751 205061 204640 204248 203781 203551 203942 204988 206361 207636 208444 208593 208260 207953
52528 207953 208036 208290 208132 207311 206178 205251 204695 204395 204375 204902 206110 207676 209016 209811 210282 210957 212226 214122
52510 214122 216371 218520 220155 221282 222453 224179 226098 227066 226368 224540 222650 221041 219274 217157 215181
52495 215181 213774 212660 211302 209631 208088 207170 207150 207987 209212 210136 210465 210603 211112 212036 212958 213522 213656
52478 213656 213392 212828 212198 211749 211605 211928 213022 214918 217007 218504 219292 219906 220700 221500 222236 223413 225556
$$ packed form
52599A97454J816J649J105P51O33L14k77o40m66m7K20L61O10R70J255J339J193
52582B08240R12P45Q65J021P92K11k27l14l42m83m23J7M49M68K41N6k62q77j256
52563B09833p43L01O93j79j617k487k283j255K6R59J191R63Q64J052J034M43l14
52546B08481n80l86l20o08q36o90m21l92m67k30L91J046J373J275Q08J49l33l07
52528B07953Q3K54j58q21j133r27n56l00k0N27J208J566J340P95M71O75J269J896
52510B14122K249K149J635J127J171J726J919R68o98j828j890j609j767k117j976
52495B15181j407j114j358j671j543r18k0Q37J225R24L29J38N09R24R22N64J34
52478B13656k64n64o30m49j44L23J094J896K089J497P88O14P94Q00P36J177K143
$$ plain form
52461 225556 228419 231172 233301 234971 236486 237717 238182 237482 235577 232830 229951 227668 226168 224900 223206
52446 223206 221177 219588 218897 218630 217985 216796 215516 214420 213335 212176 211294 211058 211372 211834 212148 212206 212011
52429 212011 211755 211846 212577 213842 215287 216627 217663 218226 218339 218340 218576 219012 219361 219509 219611 219841 220405 221757
52411 221757 224423 228346 232666 236494 239925 244082 250052 257912 266851 276016 284885 292792 298523 300795
52397 300795 299108 293945 286321 277424 268523 260669 254296 249378 245921 243880 242565 240825 238213 235582
52383 235582 234088 233896 234323 234955 236052 237871 240116 242211 243885 245400 247324 250019 253251 256361 258957
52368 258957 261170 263074 264247 264370 263974 263980 264567 265050 265019 264964 265489 266385 266902 266756 266459 266671 267513 268595 269504
52349 269504 270146 270657 271149 271650 272255 273177 274579 276417 278487 280559 282471 284248 286194 288697 291891 295625
$$ packed form
52461B25556K863K753K129J670J515J231M65p00j905k747k879k283j500j268j694
52446B23206k029j589o91k67o45j189j280j096j085j159q82k36L14M62L14N8j95
52429B12011k56R1P31J265J445J340J036N63J13JK36M36L49J48J02K30N64J352
52411B21757K666L923M320L828L431M157N970P860Q939R165Q869P907N731K272
52397C00795j687n163p624q897q901p854o373m918l457k041j315j740k612k631
52383B35582j494j92M27O32J097J819K245K095J674J515J924K695L232L110K596
52368B58957K213J904J173J23l96ON87M83l1n5N25Q96N17j46k97K12Q42J082R09
52349B69504O42N11M92N01O05R22J402J838K070K072J912J777J946K503L194L734
$$ plain form
52333 295625 299772 304306 309085 313915 319050 325253 333056 342178 351948 362057 372548 383302 393957
52320 393957 404276 414270 424061 433894 444088 454693 465323 475675 486015 496750 507729 518438
52308 518438 528809 539325 550351 561803 573493 585316 597030 608277 618954 629223 639058 648120
52296 648120 656235 663699 670895 677739 683539 687324 688484 687394 685309 683357 681723 680008 678114 676303
52282 676303 674606 672781 670856 669183 667923 666948 666279 666086 666285 666641 667320 668750 670924 673463 676479 680639
52266 680639 686108 692119 697956 703739 709822 716052 722243 728943 737037 746704 757246 767829 778099
52253 778099 788189 798418 808881 819199 828823 837603 845737 853067 858954 863021 865559 866939 867158
52240 867158 866387 865486 865360 865985 866472 865949 864114 861208 857857 854759 852232 850151 848390 847021 845957 844962
$$ packed form
52333B95625M147M534M779M830N135O203P803R122R770J0109J0491J0754J0655
52320C93957J0319R994R791R833J0194J0605J0630J0352J0340J0735J0979J0709
52308E18438J0371J0516J1026J1452J1690J1823J1714J1247J0677J0269R835R062
52296F48120Q115P464P196O844N800L785J160j090k085j952j634j715j894j811
52282F76303j697j825j925j673j260r75o69j93J99L56O79J430K174K539L016M160
52266F80639N469O011N837N783O083O230O191O700Q094R667J0542J0583J0270
52253G78099J0090J0229J0463J0318R624Q780Q134P330N887M067K538J380K19
52240H67158p71r01j26O25M87n23j835k906l351l098k527k081j761j369j064r95
$$ plain form
52224 844962 844193 844143 844671 844727 843619 842048 841295 841807 843208 845204 847726 850475 853200 856293 860417 865666
52208 865666 871690 878372 885606 892627 898486 903165 907430 911604 915413 919125 923808 930019 936993 943617
52194 943617 949646 955549 961712 968232 975063 981823 987732 992090 994683 995619 995112 993506 991135 987947 983679
52179 983679 978479 972853 966851 959932 951998 943948 936728 930303 924134 918295 913459 909932 907289 904946
52165 904946 902727 900908 899954 900060 900706 900946 900477 900164 901112 903445 906370 909132 911287 912286 911678 909878
52149 909878 908146 907508 908079 909552 911792 914578 917263 919188 920264 920725 920491 919164 916625 913247 909506
52134 909506 905733 902301 899679 898041 897077 896485 896568 898100 901731 907781 916472 927845 941265 955526
52120 955526 969873 984692 1000729 1017835 1034974 1051388 1067135 1082363 1096743 1110058 1122778
$$ packed form
52224H44962p69n0N28N6j108j571p53N12J401J996K522K749K725L093M124N249
52208H65666O024O682P234P021N859M679M265M174L809L712M683O211O974O624
52194I43617O029N903O163O520O831O760N909M358K593R36n07j606k371l188m268
52179I83679n200n626o002o919p934q050p220o425o169n839m836l527k643k343
52165I04946k219j819r54J06O46K40m69l13R48K333K925K762K155R99o08j800
52149I09878j732o38N71J473K240K786K685J925J076M61k34j327k539l378l741
52134I09506l773l432k622j638r64n92Q3J532L631O050Q691J1373J3420J4261
52120I55526J4347J4819J6037J7106J7139J6414J5747J5228J4380J3315J2720
$$ plain form
52109 1122778 1135419 1147586 1158298 1167297 1175436 1183716 1192444 1201453 1210651 1219889 1228658 1236363 1242899
52096 1242899 1248627 1253757 1257922 1260324 1260092 1256658 1250141 1241541 1232247 1223091 1213918 1204253 1194252 1184735
52082 1184735 1176318 1168830 1161790 1155210 1149635 1145431 1142371 1140029 1138367 1137747 1138460 1140453 1143438 1147085
52068 1147085 1151114 1155500 1160651 1167143 1175047 1183668 1192159 1200272 1208226 1215939 1222898 1228949 1234773 1241151
52054 1241151 1247941 1254245 1259469 1263710 1267036 1268950 1268923 1267069 1263829 1259119 1252249 1242825 1231411 1219218
52040 1219218 1207281 1195993 1185238 1174783 1164617 1154991 1146225 1138440 1131463 1124890 1118234 1111193 1103825
52027 1103825 1096341 1088646 1080320 1071249 1062055 1053586 1046067 1039105 1032415 1026103 1020155 1014115 1007540 1000483
52013 1000483 993280 986115 979025 972135 965486 958729 951313 942990 933821 923669 911934 897949 881524
$$ packed form
52109A122778J2641J2167J0712Q999Q139Q280Q728R009R198R238Q769P705O536
52096A242899N728N130M165K402k32l434o517q600r294r156r173r665j0001r517
52082A184735q417p488p040o580n575m204l060k342j662o20P13J993K985L647
52068A147085M029M386N151O492P904Q621Q491Q113P954P713O959O051N824O378
52054A241151O790O304N224M241L326J914k7j854l240m710o870r424j1414j2193
52040A219218j1937j1288j0755j0455j0166r626q766p785o977o573o656p041p368
52027A103825p484p695q326r071r194q469p519o962o690o312n948o040o575p057
52013A000483p203p165p090o890o649o757p416q323r169j0152j1735j3985j6425
$$ plain form
52000 881524 863031 843208 823009 803497 785537 769470 755108 742022 729740 717715 705378
51989 705378 692520 679570 667197 655529 643963 631963 619835 608391 597869 587563 576583
51978 576583 564669 552058 538938 525465 512226 500178 489964 481535 474660 469651 467321 468174 471791
$$ packed form
52000H81524j8493j9823k0199j9512j7960j6067j4362j3086j2282j2025j2337
51989G05378j2858j2950j2373j1668j1566j2000j2128j1444j0522j0306j0980
51978E76583j1914j2611j3120j3473j3239j2048j0214q429o875n009k330Q53L617
$$ [...]
##END NTUPLES=NMR SPECTRUM
##END=
