
##TITLE=UV1268_M12_1292-1216_70_7414245_V4fIW9ki2v
##JCAMPDX= 6.0         $$ Bruker NMR JCAMP-DX V2.0
##DATA TYPE= NMR SPECTRUM
##DATA CLASS= NTUPLES
##ORIGIN= BRUKER
##OWNER= Administrator
$$ 1.72 TOPSPIN		Version 2.1
$$ 2013-01-25 21:19:09.660 -0500  Administrator@X
$$ Compression mode = diff/dup
##.OBSERVE FREQUENCY= 400.02188249412
##.OBSERVE NUCLEUS= ^1H
##.ACQUISITION MODE= SIMULTANEOUS (DQD)
##.ACQUISITION SCHEME= undefined
##.AVERAGES= 8
##.DIGITISER RES= 22
##SPECTROMETER/DATA SYSTEM= spect
##.PULSE SEQUENCE= zg30
##.SOLVENT NAME= COFFEE_meoh
##.SHIFT REFERENCE= INTERNAL, COFFEE_meoh, 1, 14.98509
##AUDIT TRAIL= $$ (NUMBER, WHEN, WHO, WHERE, PROCESS, VERSION, WHAT)
$$ ##TITLE= Audit trail, TOPSPIN		Version 2.1
$$ ##JCAMPDX= 5.01
$$ ##ORIGIN= Bruker BioSpin GmbH
$$ ##OWNER= Administrator
$$ $$ E:\/data/COFFEE/nmr/UV1268_M12_1292-1216_70_7414245_V4fIW9ki2v/10/pdata/1/auditp.txt
$$ ##AUDIT TRAIL=  $$ (NUMBER, WHEN, WHO, WHERE, PROCESS, VERSION, WHAT)
(   1,<2013-01-25 21:19:01.831 -0500>,<Administrator>,<X>,<go>,<TOPSPIN 2.1>,
      <created by zg
	started at 2013-01-25 21:17:55.800 -0500,
	POWCHK enabled, PULCHK disabled,
       configuration hash MD5:
       86 BA 57 50 F2 9D 5C 9B 26 00 A9 28 5F 66 2E 89
       data hash MD5: 64K
       75 AD 0D 6C 0D 94 10 8D 50 5D 95 77 38 BA E4 95>)
(   2,<2013-01-25 21:19:04.769 -0500>,<Administrator>,<X>,<proc1d>,<TOPSPIN 2.1>,
      <Start of raw data processing
       efp LB = 0 FT_mod = 6 PKNL = 1 PHC0 = 0 PHC1 = 0 SI = 32K 
       data hash MD5: 32K
       28 AF 8F BF C4 C2 25 96 FB 13 25 D8 98 48 1C BF>)
(   3,<2013-01-25 21:19:05.206 -0500>,<Administrator>,<X>,<proc1d>,<TOPSPIN 2.1>,
      <pk PHC0 = 98.50891 PHC1 = 0 
       data hash MD5: 32K
       35 1B B8 43 2C AE EB 60 50 58 FD 67 11 41 7D F7>)
(   4,<2013-01-25 21:19:05.441 -0500>,<Administrator>,<X>,<proc1d>,<TOPSPIN 2.1>,
      <abs ABSG = 1 
       data hash MD5: 32K
       9B DA 8F F6 80 5B E5 BC A2 28 4B A8 F5 1E 01 40>)
(   5,<2013-01-25 21:19:05.581 -0500>,<Administrator>,<X>,<proc1d>,<TOPSPIN 2.1>,
      <abs ABSG = 2 
       data hash MD5: 32K
       EB 10 78 74 FF 30 BB 3A 32 84 85 0E AD E0 2E 8F>)
(   6,<2013-01-25 21:19:05.722 -0500>,<Administrator>,<X>,<proc1d>,<TOPSPIN 2.1>,
      <abs ABSG = 3 
       data hash MD5: 32K
       6A 8B C2 A9 15 E7 60 2D 7A ED 48 C1 20 7F 44 F5>)
(   7,<2013-01-25 21:19:05.863 -0500>,<Administrator>,<X>,<proc1d>,<TOPSPIN 2.1>,
      <abs ABSG = 4 
       data hash MD5: 32K
       3B 95 48 B4 35 7A 73 CA B5 20 2A 47 6A 49 8B 33>)
(   8,<2013-01-25 21:19:06.035 -0500>,<Administrator>,<X>,<proc1d>,<TOPSPIN 2.1>,
      <abs ABSG = 5 
       data hash MD5: 32K
       93 FA A3 A4 CA 81 B1 D2 56 BA 7E E5 EF 92 96 30>)
$$ ##END=
$$ 
$$ $$ hash MD5
$$ $$ 1B 03 EF 91 26 92 BF FB 70 B0 DE B4 FB 6C B0 94
##$RELAX= 
##$RELAX= 
##$RELAX= 
##$RELAX= 
##$RELAX= 
##$RELAX= 
##$RELAX= 
$$ Bruker specific parameters
$$ --------------------------
##$DU= <E:\>
##$EXPNO= 10
$$ [...]
150 150 150 150 150 150 150 150
##$TP07= 0
##$TPNAME0= <>
##$TPNAME1= <>
##$TPNAME2= <>
##$TPNAME3= <>
##$TPNAME4= <>
##$TPNAME5= <>
##$TPNAME6= <>
##$TPNAME7= <>
##$TPOAL= (0..7)
0.5 0.5 0.5 0.5 0.5 0.5 0.5 0.5
##$TPOFFS= (0..7)
0 0 0 0 0 0 0 0
##$TUNHIN= 0
##$TUNHOUT= 0
##$TUNXOUT= 0
##$USERA1= <user>
##$USERA2= <user>
##$USERA3= <user>
##$USERA4= <user>
##$USERA5= <user>
##$V9= 5
##$VALIST= <valist>
##$VCLIST= <CCCCCCCCCCCCCCC>
##$VD= 0
##$VDLIST= <DDDDDDDDDDDDDDD>
##$VPLIST= <PPPPPPPPPPPPPPP>
##$VTLIST= <TTTTTTTTTTTTTTT>
##$WBST= 2048
##$WBSW= 25
##$XGAIN= (0..3)
0 0 0 0
##$XL= 0
##$YL= 0
##$YMAX_a= 681447
##$YMIN_a= -580272
##$ZGOPTNS= <>
##$ZL1= 120
##$ZL2= 120
##$ZL3= 120
##$ZL4= 120
##$ABSF1= 14.98509
##$ABSF2= -5.573092
##$ABSG= 5
##$ABSL= 3
##$ALPHA= 0
##$AQORDER= 0
##$ASSFAC= 0
##$ASSFACI= 0
##$ASSFACX= 0
##$ASSWID= 0
##$AUNMP= <proc_prof1d_extract_pilot.lims>
##$AXLEFT= 0
##$AXNAME= <>
##$AXNUC= <1H>
##$AXRIGHT= 0
##$AXTYPE= 0
##$AXUNIT= <>
##$AZFE= 0.1
##$AZFW= 0.1
##$BCFW= 0
##$BC_mod= 0
##$BYTORDP= 0
##$COROFFS= 0
##$CY= 15
##$DATMOD= 1
##$DC= 0
##$DFILT= <>
##$DTYPP= 0
##$F1P= 0
##$F2P= 0
##$FCOR= 0.5
##$FTSIZE= 32768
##$FT_mod= 6
##$GAMMA= 0
##$GB= 0
##$INTBC= 1
##$INTSCL= 1
##$ISEN= 128
##$LB= 0
##$LEV0= 0
##$LPBIN= 0
##$MAXI= 10000
##$MC2= 0
##$MEAN= 0
##$ME_mod= 0
##$MI= 0
##$NCOEF= 0
##$NC_proc= -8
##$NLEV= 6
##$NOISF1= 0
##$NOISF2= 0
##$NSP= 0
##$NTH_PI= 0
##$NZP= 0
##$OFFSET= 14.98509
##$PC= 1
##$PHC0= 98.50891
##$PHC1= 0
##$PH_mod= 1
##$PKNL= yes
##$PPARMOD= 0
##$PPDIAG= 0
##$PPIPTYP= 0
##$PPMPNUM= 2147483647
##$PPRESOL= 1
##$PSCAL= 4
##$PSIGN= 0
##$PYNMP= <proc.py>
##$REVERSE= no
##$SF= 400.02
##$SI= 32768
##$SIGF1= 0
##$SIGF2= 0
##$SINO= 400
##$SIOLD= 32768
##$SPECTYP= <>
##$SREGLST= <1H.CDCl3>
##$SSB= 0
##$STSI= 32768
##$STSR= 0
##$SW_p= 8223.68421052631
##$SYMM= 0
##$S_DEV= 0
##$TDeff= 65536
##$TDoff= 0
##$TI= <>
##$TILT= no
##$TM1= 0
##$TM2= 0
##$TOPLEV= 0
##$USERP1= <user>
##$USERP2= <user>
##$USERP3= <user>
##$USERP4= <user>
##$USERP5= <user>
##$WDW= 1
##$XDIM= 32768
##$YMAX_p= 469658567
##$YMIN_p= -707276
##$CURPLOT= <Network HP LaserJet P1505>
##$CURPRIN= <$Network HP LaserJet P1505>
##$DFORMAT= <normdp>
##$LAYOUT= <+/1D_H.xwp>
##$LFORMAT= <normlp>
##$PFORMAT= <normpl>
##$SURQMSG= 1
$$ End of Bruker specific parameters
$$ ---------------------------------
##NTUPLES= NMR SPECTRUM
##VAR_NAME=  FREQUENCY,     SPECTRUM/REAL,   SPECTRUM/IMAG
##SYMBOL=    X,             R,               I
##VAR_TYPE=  INDEPENDENT,   DEPENDENT,       DEPENDENT
##VAR_FORM=  AFFN,          ASDF,            ASDF
##VAR_DIM=   32768,         32768,           32768
##UNITS=     HZ,            ARBITRARY UNITS, ARBITRARY UNITS
##FACTOR=    0.250966925370066, 1,           1
##FIRST=     8223.43324360094, 72692,        -236170
##LAST=      0,             -221360,         -166703
##MIN=       0,             -707276,         0
##MAX=       8223.43324360094, 469658567,    0
$$ Real data points
##PAGE= N=1
##DATA TABLE= (X++(R..R)), XYDATA
$$ [...]
23837 -59253 -118254 -80265 -134529 -56396 -275203 229772 105057 143785 70202 -179009 72097
23825 72467 -293212 -293627 179823 -84337 -129984 -376574 97105 7110 -31139 -58954 97445 -190880
23812 -165055 -407080 -172712 21763 -193234 130935 74348 -99617 51338 428735 -312226
23801 -38816 -147982 126752 -113862 185973 -204739 -301235 93706 -54962 479030 53851
23790 31491 163793 239377 -234951 -64057 48259 259184 -113324 -40495 83714 -83697 192106
23778 417254 -195813 34366 -258468 84721 303245 22286 -332485 72285 137348 -80902 -47481
23767 -47481 408025 144588 -61338 102442 -77771 -157656 -127974 -5351 -126117 -44633 -273245
23756 -273245 -57663 -84059 300446 -41816 61964 123325 -305508 99956 -389976 -8941 178437
23744 77551 -46404 -237522 90835 158940 -1217 -211129 -36203 -14865 294217 -66238 113911
23732 -303657 -54814 -17889 -154084 -32029 76660 -145634 73317 116871 216105 93143 -291143
23720 -164939 -173373 -274849 -184215 305245 -53291 381219 -12771 357618 269266 -321616 -387359
23709 -387359 3930 120006 -158310 -116387 -12458 -13250 171052 26765 146775 -34029 -9587
23697 -181090 -99502 220008 -53645 -3884 -71327 -115768 149881 -244638 -39456 -148414 224395
23685 -273998 23515 -63164 -8569 137230 -63459 -244218 -46458 -117021 -66512 72669 -156761
23673 164471 -21435 239029 4031 30577 142286 -176687 -46107 -43410 113203 -30217 38048
23661 20928 -7126 195107 48648 -113350 300116 -37486 -69197 -67394 8936 -117970 51538
23649 -83758 73726 322430 -12660 -172556 -234795 -177388 71255 -140142 -218865 -189487 69399
23637 2140 105614 428921 -56017 70463 -299240 -34576 -408927 -356419 106924 38223 59719
23626 59719 -78487 172463 -79459 174109 -73328 27951 322667 53696 258180 -10915 -23856
23615 -23856 56658 -95859 -205733 -60463 -211508 -212853 122614 213656 -345776 -195501 -272390
23604 -272390 63788 419087 205311 -135225 -244192 -111225 -205357 40215 119745 138057
23594 138057 -40538 149722 -271241 85528 192052 95336 -273911 12064 102191 -77717 -44887
23583 -44887 -107715 80304 65206 170424 -146783 132720 89634 92099 211772 -312069 334131
23571 -25074 -269279 -99598 -105822 265459 361999 15389 223273 -156698 -87056 102714 -218298
23559 -299286 -121426 -18588 219499 -162970 154588 107250 -285566 55062 -181440 -225738
23549 -225738 393767 28952 40147 77336 146903 -256964 71544 252124 -113244 -315285
23539 -315285 49983 -31882 329937 -74610 -96905 239121 137548 720 -58361 160733 -235273
23527 -11857 41898 160354 -170284 137923 -20669 -41922 8837 210410 -9146 330233 -162311
23515 -19199 150769 -317020 225524 -235384 -325697 -111277 223754 -131660 -178368 -285164
23505 -285164 -82633 -80135 -2836 -61137 -250394 108196 20659 -175197 94657 -53030 393334
23493 34448 -132201 6863 -196066 176364 -65282 8011 142482 -154538 -192892 274663 -116647
23481 -147972 20494 96270 -152629 44104 -12909 -331704 -42860 168587 -302482 -84330 -79346
23470 -79346 -24242 -534475 -142604 134174 -18791 260451 129390 4723 63276 108614 10084
23458 -249039 -97266 -20820 -64245 -40376 92352 -242512 -187794 21921 -138439 19423 84092
23447 84092 -42989 -155596 -55006 -85554 -63100 -9516 30231 267896 18557 26460 -90708 -144672
23435 -144672 -154701 181159 -308898 -24455 142410 108230 86142 -319087 43095 212674
23425 212674 -100876 -3307 -457538 -211975 239855 -47064 -49727 36722 -57828 102636 -19170
23413 -22780 -204454 18128 -234550 81182 -226721 269678 -34513 -345974 -61331 -50659 263681
23401 -309687 171844 -208202 115386 -135264 36764 -41604 -162838 -39269 -16686 -61840
23391 -61840 349133 15177 -97443 -163252 25385 432375 -167850 -107359 -164491 -269667 -86059
23379 -9134 -246435 -19463 -1265 307092 -254076 45981 333752 -60811 280697 -66020 -45096
23368 -45096 444759 56707 256629 -223154 -88826 135786 220451 -4945 45897 -39327 829
23356 102538 175418 203147 120690 160539 -30604 58651 42786 -11941 -33107 -69700 93961
23344 106655 -240429 29972 -2589 -6851 153191 237325 -265951 -382294 -144336 123082 -18221
23332 -149323 -59992 -47400 60422 116624 265633 20295 72301 289196 -251456 263029 522597
23321 522597 135616 -77273 -223327 147558 -14870 93674 -272891 -56024 -158660 -38129
23310 -195265 -118804 -167268 126686 -298304 3146 -152652 -106042 -139872 3394 80938 -242698
23298 -157786 62031 13421 -176936 17665 -151561 -4815 -10628 -76890 -116595 -411088 -119559
23286 -31726 -193765 -173369 -181278 43538 -118476 189392 -9047 -7524 106208 -111975 185161
23274 134186 -153360 -361906 -212537 128191 185707 -329372 -31721 -24853 53259 -141015
23263 -111979 371556 -50906 45031 -152188 -265719 -43749 15596 -374965 -65091 253631
23252 -151979 164708 234876 133218 -89277 26656 218299 15158 -343302 -118375 335646
23241 -330573 -338038 -227458 116540 175348 7544 -134727 132321 95015 -13499 -34167 6932
23229 117102 59604 -153632 205844 -47219 -202028 30894 -129115 -139676 245638 9426 224889
23218 224889 25866 -348836 229523 -2990 -267379 -97949 108501 224855 -111349 370232
23207 -183075 153636 -99821 -33235 208204 35774 -95945 274006 52771 -115688 64227 242696
23196 242696 -216342 -85853 -57146 -58193 -261244 279649 102354 41277 279545 -124122
23185 -256903 -258383 57767 -317133 129587 247675 171758 141384 9831 19964 272848 44801
23173 -159256 -30313 239000 -106462 22425 66947 -36259 105353 -51960 -159278 42379 132342
23162 132342 -56377 -47231 -216473 35153 12855 -117621 -355484 -185326 -415943 -310720
23152 -310720 -416351 -22931 -145043 -18447 273776 171481 -107628 162235 392474 -8758
23141 24803 -130300 -189298 48367 184674 50165 -275898 -147500 213762 -204036 154908
23130 -25179 -2096 24856 -34342 181751 175357 115295 80160 -130744 -112665 137551 62287
23118 -131828 -198008 329309 -246836 -88117 -271473 192049 -220872 151731 132392 -59197
23107 208945 -23325 54792 -497057 35764 -34816 182070 213699 -153750 -33452 91888 -30532
23095 182861 -417979 19505 302989 -101400 150033 -100021 -157217 149790 -17751 -146922
23085 -146922 249640 -54806 -69383 119139 5959 162999 152773 -492701 219910 112675
23075 112675 271370 25203 353017 -137224 -94449 12077 -281524 5526 76723 -121911 86184
23063 -89607 -80296 -139568 -26975 -171082 62979 -124118 204274 72156 190801 99026 -65660
23051 -90637 -70888 -10267 -65620 41382 590762 -35495 -112218 225685 -31347 -122445 219287
23039 -12464 -90629 12671 -50267 -9461 405720 68707 -308490 21796 -149485 179187 -257039
23027 43927 -76727 -135668 -23871 239238 117614 -5238 -147514 -40622 -121872 -19576 -102775
23016 -102775 143695 -194163 47094 -441742 14187 -161205 -187714 -5222 492464 -52941 -67608
23005 -67608 136526 -96513 -83127 -13203 -98323 -88287 -152188 70161 72037 18314 -440190
22993 -373640 37401 8737 291081 -80493 46417 46930 168378 63110 218826 -26348 -146936
22982 -146936 -373453 -57763 -136704 -126082 185595 -117755 -282000 286608 44414 -87410
22971 181313 139014 205987 -43205 -120458 131386 -83966 -263881 6259 -31984 -236757 -14990
22959 -239148 -78616 -137001 62759 44003 76311 -30816 8168 139093 45320 234860 -83560
22947 -58317 -286140 -157005 -13302 279627 58911 54617 155110 28406 19153 230250 47642
22935 -384618 -116110 -55917 29239 197917 -96825 -64538 -10917 -278136 -184480 -4483 147346
22923 384026 -131253 -82210 -200183 100306 177122 -124863 48087 100204 49341 -35380 161704
22911 -7004 -11589 -477972 -36337 -100338 15019 142484 -167630 7792 -275450 -127869 -27412
22899 1898 223183 129116 230360 -256248 -221487 -360949 -91277 34945 -180188 -267152 -48501
22887 375586 136143 -34300 110688 -84844 -179142 -53834 204248 -116420 131331 -29648
22876 21926 -240345 257839 -178232 -302932 -155258 -125499 -89641 -42759 -24630 18663 -27532
22864 83640 112051 121706 205223 215571 -189652 -30170 -413986 -88681 80211 -134752 136134
22852 -107092 -47052 -135862 63892 -21932 29355 129121 -168877 -81758 107682 -106685 -145311
22841 -145311 104483 -190906 -24221 -259581 -43445 245010 40340 95262 -26925 -15670 42507
22829 -25742 94720 5065 -161898 48050 -294573 -181193 6232 -75291 -156121 -352696 -27841
22817 -206150 -196775 -134255 -155085 -2846 -160281 -73057 103771 -46252 -63580 -184658 -56922
22805 305261 70073 210193 -34076 109760 -113651 -145519 343135 -83529 -43398 255244
22794 98984 191920 -110266 -303255 -338112 -67659 -18868 -261636 -216987 41958 16724 235050
22783 235050 36104 -195852 30425 -139730 9186 143505 277145 -99855 -251118 109635
22772 50617 -17936 -4664 -9407 33402 -66614 -180723 -29402 178753 -173669 -15566 -244524
22761 -244524 132413 16753 -206880 -238867 -73645 22039 -136555 -328568 -217629 285923
22750 142646 -61771 -106166 67046 103126 144054 -110011 -88290 -29960 -141455 -152503 136622
22738 -98176 168674 -121649 120098 -68874 -133783 168362 145171 -184848 73081 78326 -32367
22726 -3672 -184394 -171858 -188868 -457115 -133619 -69725 104193 -348745 -53884 81889 -45630
22714 20808 118622 -14883 -130086 209933 144565 175440 -212766 -264314 -8716 -156540 -17676
22702 -33190 220779 -165694 63592 -106040 -114370 -111549 37555 -240796 102793 318769 -50855
22690 -89846 -5663 -76374 -59137 111268 97460 -263948 -68138 -70613 -56356 36939 -53292 26941
22677 214735 70905 -23531 44944 -142007 -87468 320630 -233850 130737 20288 212607
22667 212607 63198 -4153 -29111 -87877 107603 78158 -104478 -241296 85245 -366983 74538
22655 -215621 -25585 -90627 175710 -295267 -40462 -127429 57935 -104211 66951 -179940 146094
22643 167739 137385 770 -287897 -247036 -136346 287333 -231566 -153377 3026 -223724 311142
22631 27904 -266742 38807 -116751 -103936 -52415 -69441 -84919 -27695 -50366 -216431 9349
22619 352324 177748 232398 128498 212428 228885 345146 119085 89716 227859 -97025
22608 -10890 -188215 -25427 -170412 75775 50515 2670 -281426 154580 230302 -160141 35212
22596 119693 220707 -71475 -324614 252913 119010 -92698 72350 250102 42331 -211432
22585 -80770 56170 308664 -195223 184828 2702 -429161 -119447 -121217 541 -109790 -305787
22574 -305787 187814 110795 -41585 51097 188242 -447827 160887 -2208 -215159 90465 192832
22563 192832 96739 -137703 -495311 -23479 -142228 -191216 44916 -55830 89965 -224803 -228095
22552 -228095 -165259 -104411 -245319 -77842 -260213 116398 32709 5503 141018 -141305 -80799
22541 -80799 335 -147372 42092 -60604 36536 3836 6857 119624 105124 107172 -26409 201720
22528 30663 9325 46559 -76833 -183799 24497 64878 276797 61659 -190555 13552 -240481
22516 -36754 -144934 62845 -42732 -360810 -274685 -71206 341992 -207907 137010 -85413 -98698
22505 -98698 117624 -359585 -75045 144930 523 273880 -121957 -156781 -58129 -80818 -40000
22493 130331 316045 39563 8250 337051 150416 36466 172602 113938 279177 -231239
22482 -87378 391389 -212336 -59393 -192148 49657 -378886 -240333 -181249 -218217 54307 -339481
22470 294717 138602 -93471 -35047 -110201 63315 -103277 53475 -259368 -172374 -260211 267849
22458 -334488 -164712 -88044 -144081 -60002 -237131 128885 101181 -84513 -59816 -154739 -38489
22446 -236572 -269449 347334 37132 179715 -7325 -85163 68901 -110496 27205 -211162 -335741
22435 -335741 -5838 45298 -177092 -35690 -97661 227802 160338 123025 -79142 37439 -91789
22423 -102944 -211142 271341 -336709 173534 87406 -163358 215355 344913 -204668 -284046
22413 -284046 342967 78388 -230886 -298278 -103273 298929 34490 15290 -7703 -85013 139096
22401 -255799 -278422 -208089 -40519 40943 247717 38645 77393 160471 -115939 6226 249952
22390 249952 -77767 82796 -13564 -208769 -78102 -44301 -94699 160491 -257881 51233 140990
22379 140990 -177337 -73058 -105515 -87010 -430351 -312438 -155325 112982 -82951 67085
22368 90056 -415127 -169786 157847 -23354 -11337 -100670 -159438 184381 -250912 -56928 -262653
22357 -262653 -181629 -280036 -112553 -166955 1551 -311924 -69224 -182321 -74395 -7680 227164
22345 64825 -315149 73123 66993 254646 -14571 18165 -113706 -105467 -53266 -384970 70982
22333 143122 -158862 -20227 187141 85490 -98542 -60125 -261001 -303401 43678 -116585 -301166
22322 -301166 93559 -412457 -260599 -114893 58410 -82533 161456 193873 -56566 9403 113434
22311 113434 59970 -384470 -349198 76265 33016 -116607 101237 36683 130323 158011 -61979
22299 313264 -55923 -89418 -70984 -253788 158660 19149 -258401 46724 296043 -11915 -69877
22288 -69877 -62840 -131050 -201185 -26574 87826 130586 -73241 -348225 -33981 -1017 -37086 191806
22275 -305858 35299 240409 -48010 176703 318282 -111624 -3535 65713 -145723 70638 8634
22263 62351 -401075 -350996 43512 148282 -246302 -152379 -41042 16495 88655 2996 -15927
22251 240500 2954 -4934 -47519 210818 2906 -338291 64580 108537 -13415 -265004 293620
22239 -78464 -146866 -75271 20787 -62105 -97249 -4073 -148007 134896 168961 -84606 -88286 36361
22226 -70799 169462 236414 132583 -139317 -335589 -170026 -189294 -50871 63683 -239864
22215 -203328 -120852 -165201 -369096 -210536 -108300 62167 62619 -42007 -28458 150297 -277973
22203 117191 104336 -61228 214381 -259400 207414 -149610 -106465 308451 211770 -6889 -11173
22192 -11173 -26668 170922 -170730 -325109 203511 26748 51792 -111317 -88006 -84743 -162897
22181 -162897 -216093 -276564 183675 84322 -52880 277760 -38896 123793 -424927 -160349
22170 172430 -87227 -30969 37722 -295958 105222 33721 -25334 -105682 -29182 -8167 102198
22158 -60672 56272 -29711 251602 386526 17164 -25010 209320 -59389 322081 -255819 -7237
22146 -47833 -148354 58395 7379 -135413 -176804 39039 -359701 154690 -470190 202300 130396
22135 130396 -34326 144786 -190094 56272 -45860 -348553 -193052 59000 -179211 -243941
22125 -243941 168182 36100 -25771 91924 -337511 -369299 -98732 194778 -164523 245012
22114 187593 -229633 17545 -348472 -133382 -24123 -148146 127026 18691 -132249 -69037
22104 -69037 375351 58366 -397179 -51194 -119528 6498 -388688 -304997 -103862 -90305 121011
22092 156733 -33427 -27180 94107 61586 163066 83603 54465 -174590 97653 -29647 -74341
22081 -74341 289641 70996 67463 -150415 106564 -191366 -58229 62064 60333 87793 -147269
22069 -81361 -332448 -41943 -300628 401180 -118761 -25051 -339246 74481 -31970 -222363
22059 -222363 -2211 111552 -166637 -377994 -144990 -408298 276181 -45050 -108778 -43247
22048 -125414 65893 -79266 -62958 2862 -407560 104181 -239227 276855 3161 -48041 92071
22036 70350 -190938 112817 -63760 -158006 -220446 108742 24686 -70721 223017 -200581 -119814
22025 -119814 95963 -188457 40976 -101910 165248 -16618 -333 -74282 -110849 -262439 3740
22013 -181760 -104347 17763 -157568 116075 -143825 -207106 65730 -266627 101526 20921
22002 -109978 301253 -257263 790 124682 -112691 131553 -103496 -288062 -145602 -141196
21992 -141196 -52896 43313 -117054 -103113 254240 105019 111247 -55076 -270855 193905 126833
21981 126833 -168958 2538 22509 -284681 14764 -75661 -51446 -59267 271830 141278 39122
21969 215214 -4597 28161 -16966 -52555 143538 -438500 -261551 -118165 72871 -301843 -37976
21957 -93304 112828 -260036 26920 -207213 20137 60460 -227986 -87503 -81194 -51633 -268412
21946 -268412 10781 -8043 -62037 -197162 283232 -295067 218232 -276992 110233 -236514
21935 -272289 -233263 33089 202060 -15116 -370102 102501 -284226 -55033 -226048 -26535
21924 -83486 -144261 104852 79734 -103776 400918 55702 -108757 -316948 -391306 -172199
21913 -99417 -45206 40493 -173595 -189894 -68228 -20723 81980 -284563 -271226 195400 171001
21902 171001 -34487 380796 -128667 -198763 -112364 -210950 141744 89185 90721 -54573 -166942
21891 -166942 -49961 -17731 45388 129718 -175823 -258721 -116933 -78481 22591 75475 -90886
21879 40603 5055 -193655 -397966 -340484 396526 158744 -214880 -184815 -37765 24102 192564
21868 192564 -57179 131167 -144905 -147863 118192 205951 241196 79808 -360900 281399 -41311
21856 -51745 308109 91367 78767 -208631 -267906 -198985 -99308 119574 74249 -201568 296591
21844 148870 -299413 -85437 -72218 -183548 92632 127505 -28737 -462752 46041 33429 129668
21833 129668 -410739 -215876 -194597 34714 -243498 34524 -69209 -154891 -214900 113613 11631
21821 -242929 -262306 -81082 -34650 254475 -142003 -109769 80363 125267 126756 96945 61263
21810 61263 -136417 -240655 259896 -440083 25504 -80302 139789 -224956 18276 -134137
21799 236294 -201820 -121043 -294953 -96035 -191040 -311176 -486562 413770 319675 319425 54822
21787 -116218 43912 32346 -26782 -38268 153611 785 15289 -102688 -311201 -69844 237889
21775 -3844 11666 259606 -227086 -478460 151860 176552 94666 -65570 76736 18369 81908
21764 81908 -169690 123607 -33209 76498 -489322 -151654 -142052 -34010 -144926 98893 146684
21753 146684 -54697 15493 -270086 102952 186776 -154689 -135926 231855 181332 -20365 -82867
21742 -82867 -163889 225549 -209363 -149922 -429595 109144 167359 176803 -288174 -304223 -91308
21730 -108958 167039 -107345 -115332 -224951 -127911 -175464 -228120 111439 -6729 -186185 14433
21718 9149 -100686 278103 55768 25291 124094 -220486 -69489 -25115 -100519 -24704 -5615
21706 8637 -214879 -28340 -66320 177020 -107435 -318495 98992 407553 -108559 87303 963
21694 -193706 -175189 -69055 -116920 -105344 150465 165436 81339 -251748 -54227 -74565 -255305
21683 -255305 87443 -34192 -59401 -110260 78538 -47117 225964 -98944 -216384 -36738 54107
21671 43513 122984 145020 -91205 15748 140713 -105879 -175923 -221653 -24339 217765 -440339
21659 16030 -75880 283824 -173304 -336618 10475 -102689 46408 -184368 -22674 -68444 -145816
21648 -145816 96897 -43537 -20300 -15588 24298 -66706 131862 -111667 125750 -334602 -267069
21637 -267069 -11720 220209 -208433 195302 170829 -155620 -9574 -89914 -297543 -50170 -291176
21626 -291176 -65977 30088 -76082 -38386 36934 -280510 -356515 -338081 276588 -25082 -298230
21615 -298230 -80319 -238709 -232621 -66157 170692 -25797 -87910 -216638 210206 -26099 235851
21603 133432 -63129 -469018 281196 -168122 153972 -374693 16229 -63144 4933 -111400
21592 14308 -181216 -24549 -147039 -57048 -115597 161496 46953 181797 -481363 -41152 163413
21580 -73645 47800 135097 140139 -87667 -98251 -47055 -155914 79643 -191864 9381 324750
21569 324750 92678 -4225 -101316 40653 -160590 -231604 -119607 72929 93460 -59596 -332138
21558 -332138 -393958 55686 134761 -317106 -197647 249044 -44918 76511 68003 164813 -294979
21546 84407 -251913 -124385 12 21975 105018 -100560 -200389 -421837 -216039 -164185 56681
21534 112291 149746 -27770 13212 -247965 -242966 -88137 -30779 -183439 -19804 -150165 239165
21522 -13953 357385 38813 132342 -167641 -371915 83989 -10912 142998 -10280 80643 61761
21511 61761 -156647 100936 -11582 72923 428 -167136 -267895 -80974 57099 -8210 298081
21499 -122045 -80388 258054 17458 -187527 -229225 -254361 -90062 -72281 57252 -109944 242323
21487 -123377 -118538 -193456 12597 -111404 -55487 -80091 -125932 251181 -24575 -102039 -124656
21476 -124656 -12557 -47831 -255590 -305589 218867 27875 -51011 -5959 24860 123087 -77633
21464 -239204 -281371 -191014 -155766 24097 -82755 -77174 -187042 -222569 182900 -138525 -70656
21453 -70656 -19744 -320186 65818 266175 -72770 40769 55956 -287941 175677 31838 135260
21442 135260 159519 227443 -19912 483163 245492 387450 226870 308573 450618 -152010
21431 306637 89300 220309 -29793 18326 155134 168222 -3423 50836 -33591 156711 -118751
21419 -35420 229413 -94990 -101165 182805 61981 223237 -94993 80601 145072 -120748 -39888
21407 -166216 -63408 185369 -299962 48706 -101327 19948 -149613 202385 24330 -255986
21396 -20201 56723 -13572 92215 -34823 169485 -84207 -291833 -287849 -75009 184150 29417
21384 12304 -8560 -74481 72644 30883 137428 92659 275830 349261 -247961 34027 71045
21373 71045 -231898 -44246 -99874 98003 343753 95335 -169746 -247109 -187548 -39749 -46779
21362 -46779 62560 -308501 225845 -305236 -241007 -112986 193838 3853 -251455 41595 -327722
21350 101692 -234098 -188567 -226313 -146858 56622 66742 -67421 179665 -37927 -82449 11296
21338 232536 -176483 -226645 328949 -119324 -64841 -107649 -72754 124420 37207 159186
21328 159186 -248853 -270054 -77643 101597 111638 -73322 -34418 11974 -186854 -331449 -270670
21317 -270670 371558 -60939 -166785 -243326 53550 -284580 327556 -70551 -167572 -133604 321964
21305 156647 -130877 25866 -33758 -148346 -152930 35473 -117656 -317026 -269673 -94420 208553
21293 -82564 -120440 309064 -47585 -85934 -51613 -114784 -138949 -75856 -133838 65709 -57184
21281 1259 18277 92867 -157967 -225682 -135169 -96991 -113258 112030 145367 -184668 -68836
21269 89585 -45519 16685 72252 -66308 -34677 -111018 -27134 -26063 12111 -33130 221830 33977
21256 35553 -36874 21177 -38865 48852 -185764 76263 280729 255226 -209211 59290 -290297
21244 300750 279061 113532 -37132 -98647 -117609 -29178 43713 -410560 -139357 -250193 -265686
21233 -265686 -138171 -311557 -52078 -21516 -150432 -473106 17554 153652 -75097 -512019
21223 -512019 5036 -235393 -306676 -108899 -156603 -175037 -278057 -322617 -154968 -130418 -12054
21211 126294 125699 -132121 382552 -289229 -399173 -135780 -13179 -104706 64167 347548 -62476
21199 508682 -55592 -26753 60161 -172039 -28234 7938 3923 117804 106368 -116819 27227
21187 -185393 -292239 146452 -186258 -76689 133983 -236130 53480 30487 -101178 138600
21176 169363 310348 -160215 113959 -140356 -101893 113254 212529 -4336 -66946 10177 30205
21165 30205 -27378 -9930 62153 -114199 -158624 -313258 155189 -95477 -174909 30415 64967
21154 64967 247997 67104 -219231 -109574 -51321 47084 258995 438179 -161576 -246185
21144 -246185 -159004 -133018 -120571 47421 -47488 122082 -121258 -423774 -23606 -27642 -44324
21133 -44324 200881 191934 481861 -177949 81807 -69440 -32852 -65353 -171975 -94736 -179945
21122 -179945 -59043 -7350 68256 -94377 -222572 -270770 -211345 -219707 220505 20948 -54942
21110 88546 -251194 46039 95307 -253947 -236198 -290160 -198680 -44465 -234646 -87505 156110
21098 -314608 79783 -2402 -30321 -78246 79750 -299102 -176171 27431 -149749 -146984 49491
21086 -170318 -286936 -78020 -205713 195312 -413372 7089 -114042 -14811 31067 20632 58861
21075 58861 -60986 77355 35193 200554 119036 -183772 123800 173570 -181029 -465000 79971
21063 236580 84915 -80089 -118675 198123 -109152 -75118 -45373 36758 44913 57952 -224375
21051 46288 140721 -254736 -50482 304137 -334702 101722 -126666 -131612 12256 -109048 101683
21039 -219039 92505 145978 82966 392123 135702 -75592 104095 69918 -152538 144156
21028 57401 353847 -204971 -231893 128469 -160273 88099 60910 -71065 272191 -105585
21017 18905 111033 -165993 -160913 -93714 -81359 -21618 -95101 -78371 37444 -101505 257810
21005 -15710 -189461 106108 -246883 -100024 -145540 92374 27446 97681 -157199 -325564
20995 -325564 -128246 -41122 -22392 -34609 -67659 -374512 -185511 -158198 93313 -12010 89405
20983 -217451 -175008 -68960 -22478 -514059 -330974 -136165 76272 -430614 -123279 -40705
20972 33519 1662 6998 -43307 -15985 -607 375465 -350530 -259651 -223956 -103966 24438 68706
20960 68706 -88182 -131853 173866 -383580 -195517 -155702 -228720 -155586 -285338 99543 -122807
20948 68229 97406 92335 -146627 213568 3284 -213428 -53588 -116841 168337 -118418 -184650
20937 -184650 -132292 -23594 -356463 -178034 -35386 144366 -250723 -98704 109048 -31540
20926 -280454 -104291 -254320 -95371 -100398 -11782 -471043 -174233 -157081 -113596 -49818 46690
20914 -357563 -195289 95391 -299292 -126478 347273 -39309 1601 -115840 -37053 262385
20903 -80933 -340362 -20996 -89054 32237 -303556 -74097 19665 -371635 -52821 -440775 196379
20891 -231189 -209959 -153432 -163242 38632 -177334 -165002 77825 -290168 182507 60600 -116769
20879 241499 -141469 -238642 155110 -308945 -285650 397308 -173433 -23036 -345231 -87690
20868 -161662 -325607 -37363 166780 -337908 47293 40680 68219 -26493 -61750 -47570 -183996
20857 -183996 209970 6364 -223908 208785 218082 8891 140486 74841 -23832 -319283 149883
20845 -257933 191854 392997 -68634 -251526 -17754 5700 208881 -53930 -180090 28037 -75887
20833 -58303 -221631 -25831 158559 37934 -138450 -350856 -181386 -100659 22418 6960 -16546
20821 -344193 155089 -197033 -51182 -115305 177997 -134200 -220177 45399 68346 -80165 -137600
20810 -137600 -93935 -450946 232122 139731 41372 -213626 -189488 -22709 -138393 -99333 239681
20798 -106288 -67030 -525565 -80616 -319728 15750 -138023 47151 -137208 22330 -296275
20787 133217 25839 -173390 -69800 -145816 -236540 111257 -13015 -128439 106738 45816 -82126
20775 -165220 40903 147262 268404 -132726 -158219 -290666 -109114 -163525 -132795 -262335
20765 -262335 -129623 -103473 197922 -105519 -302995 94602 126404 84099 -57530 -398221
20755 -398221 -54853 133912 501222 -304306 -169254 172128 -270909 -302890 329559 -79481
20744 -155117 36614 -117776 -96958 -3731 -305699 35295 88906 -368839 -27256 188216 104959
20733 104959 131332 118713 -157382 -18822 104226 -30227 -270966 -79891 -32857 4347 -143602
20721 -184875 127954 119809 -354016 329878 -220459 -217177 320387 204262 48652 -252899
20710 207871 -6347 14678 40750 -167533 -250185 -612275 -200167 -148370 -11292 -234995 -153831
20699 -153831 -22242 -15334 323788 -63834 -127983 -255316 -190520 -84301 80967 -94938 -19970
20687 -81216 -89850 -255918 -90327 -221509 57383 142564 -123844 -47011 -281389 53834 -73294
20675 44220 -106100 -373746 -172822 -167022 -175029 -189031 -50197 -64858 -111188 -322076 -51558
20663 59656 189808 -276041 96505 -294069 -142395 -17312 -85926 -194087 -185704 -16853 101610
20651 -98780 -169141 214098 133518 -516198 26318 -70129 -178175 207358 94332 -107910 -147905
20640 -147905 -221803 -14978 -39281 72233 -129874 -316451 -45950 85114 70949 214820 -37033
20628 -59382 156272 39700 -58430 -101892 -52850 -68969 -206789 98302 82094 -161752 207248
20616 -228379 -7527 -487556 66302 -80820 -514284 252512 -339055 -414781 115222 -212817
20605 -81138 -79532 248448 -224436 -72783 -59914 221320 -67316 -11317 -76743 -149487 -155349
20594 -155349 -344049 75988 -286813 146086 -34928 449792 154568 124392 59384 36002
20584 36002 -256812 -75253 -158723 -90437 34952 28139 -27726 -270865 218720 199507 -19081
20572 -165791 119452 -53418 93985 168620 113316 -56658 -325194 -467843 297262 16237 109573
20561 109573 -44918 107028 -185704 -139043 -75076 -71371 -55038 -204794 174396 -331760 218440
20549 199165 98445 105205 -11730 93595 -376300 467084 106767 -24022 -52325 -136390 -110480
20538 -110480 147181 221567 -119173 -107696 74412 -81749 109972 -125178 -88371 -200337
20528 -200337 -37852 -83545 90574 -190841 11805 135074 -222557 -29130 -257737 -12258 -171155
20517 -171155 -149768 -18292 -20792 -86225 109494 213534 -187938 228914 305734 -210746 -353101
20506 -353101 -337136 30725 -76925 -120437 -5065 3005 -110234 -79076 -205932 -140369 -36363
20494 148858 198858 -242361 -22591 52411 -102412 -192150 92403 105990 -189617 -189722 -91188
20482 -70791 139755 -102736 -212914 -89921 137149 -243917 -71496 253936 152201 -74766
20471 -112560 7023 1290 235614 -52309 -257978 27370 -234598 -27378 135671 -24391 144928
20459 400872 84283 102711 202993 155196 192933 -232991 130002 -515281 141019 160697
20449 160697 -140267 -29150 -335007 -22881 67047 163337 279854 -245267 -326878 179033
20438 -139628 25222 -129945 -154461 -132987 -140164 -196369 -305696 -316302 -24639 -103978 78691
20426 82842 38548 86683 26802 72325 -200533 -524655 -316275 -231478 -132181 -192100 62974
20414 -235676 -382975 -60231 -21209 -263816 131157 -227252 -138288 218932 -135945 119715
20403 77981 13856 7260 -320234 -88983 247242 -230824 -229309 -216986 130797 60466 -136225
20391 -352963 121346 -13395 23351 -116105 228895 51931 207506 -208681 114149 -115632
20380 -34078 40760 -54760 -489532 -26779 -337689 -266920 -330424 -248567 -116562 -62979 -73225
20369 -73225 28094 -268828 165535 -15300 -14623 -165062 -117254 -133350 -37115 -65651 105362
20357 -27850 -29482 -11283 81182 -147335 -23085 262850 -106929 -43558 -40557 -6357 -189742
20346 -189742 -23325 211397 120443 -117862 38122 -73221 -114600 -143269 -19236 -327041 229275
20334 -136487 42729 -374716 40785 312542 -300340 -87688 196921 -62316 -6433 -187752 474336
20322 197221 754 -107092 11184 68622 174602 -109244 -4650 4656 19493 -142586 -90774
20311 -90774 39803 -196176 -15587 335352 -270802 -9444 -442667 36171 -260999 -194110 101005
20299 -78401 -130533 -334307 215831 35254 175733 21267 -197853 -193328 -90717 -6201 33765
20287 -40383 125169 121513 -337257 34191 138740 -101680 -176174 -79559 -79500 202238 -386251
20275 -125997 -21804 -481757 108082 -103568 -18190 -367345 -4495 316763 -264796 -30207
20264 -34607 132311 186303 -106381 -183405 -236453 -590392 -23511 -307902 124634 89400 -180497
20252 -81715 -73736 -272882 -353479 -244164 -129358 139092 -31191 155328 393586 91845 -33252
20240 -159607 -345846 208990 -183700 -164522 -85296 -55649 4301 -440398 -46206 10036 -32539
20228 33540 18385 -77096 -65365 -237999 -165759 -8991 -29350 -190187 -57820 -171977 -335455
20217 -335455 93360 -67789 -174870 -177603 40583 39963 9186 323773 -175715 537209 77851
20205 -193602 76503 58035 -162986 -140045 10256 -171291 4080 -117516 -75255 11212 -148936
20193 152999 -246271 -183476 -117116 180144 -227339 52421 -22329 -53073 195328 -59633 -72209
20182 -72209 15749 77223 59362 -103925 6544 -412233 -187165 -222663 -100039 -42607 91385
20170 -187675 -121935 97312 111263 -45037 311273 -140294 -39866 204818 54731 -158660 -212300
20159 -212300 -474378 -204724 -102992 24365 257222 -134813 -180239 53894 -42835 1066 267215
20148 267215 -174961 -60414 -223618 -84150 -296690 -202293 100595 -40901 237230 183142
20138 183142 -126821 -102722 80708 -120778 -65927 -195625 38700 142109 -65238 -312276
20128 -312276 -244756 -78393 98531 123392 143561 -153805 -371674 -97708 138900 47507 -130957
20116 9178 -225086 221372 -20127 -250258 144775 -164483 -197970 -168137 -199130 -340410 -352448
20105 -352448 -215038 -189154 -30899 197887 -112724 -185106 -58349 -100607 -102155 -101354 152266
20093 37183 -98216 -197642 27765 124 -100381 63469 -251051 114050 137752 -16479 3806 43801
20081 43801 7750 -177129 31829 -317817 170548 -23859 147005 -296576 -8948 52262 -285027
20069 91933 -158537 -131794 -43193 -156683 -344804 -122932 55017 20067 37437 93406 5266
20057 -308793 -386775 16281 9091 -235735 -309894 -41506 21789 -201879 -58055 149341 145431
20046 145431 62584 83076 133805 -65330 -230847 142545 36779 -88398 -146473 78044 -208279
20034 221192 282981 5430 18918 310270 418124 -6290 -55159 -263008 -70545 -81003 -120161
20023 -120161 -126612 -332136 -79698 -290366 279131 -122471 -144092 -179163 107961 -182942
20012 -150131 -106429 -8941 135537 -247589 27021 -186766 -82456 -179526 -52819 -148406 301826
20000 -226801 -274113 -86290 30822 -162870 -181173 289369 -237162 76133 138488 -222301 -61923
19988 -90589 99156 339301 292508 -86133 -107633 -319712 14690 -35221 -293496 -269150 -194641
19977 -194641 211716 -155522 20607 -292855 84195 -117799 -428391 -114032 -199679 166400
19966 38557 240660 -109878 35155 139242 -63047 -220798 173740 182204 207666 -22812 -287652
19955 -287652 -106008 -36412 230999 270805 -248770 36552 417311 18503 -90879 -134482 -36671
19943 27260 -67891 -91124 -337441 50266 -41157 53967 124340 -63024 88840 -105043 18110
19931 -132352 152342 -363659 -82943 -152527 -284153 184998 28635 24905 -136072 151919
19920 8247 -198297 -46238 4800 -330291 -155062 -172289 137396 -65129 218677 -87359 -65639
19909 -65639 -162658 -181215 -174792 -169701 -120603 222492 -42692 -154683 -24213 -70977 -197020
19898 -197020 200394 -110687 -213525 59819 131226 -315711 -97491 36386 -181833 94883
19887 -203532 14986 112429 -239389 -205622 101022 -322056 267458 -272838 51938 6489 249553
19876 249553 5054 136902 128850 119089 -203101 -406524 -82569 128768 119223 -163573 186114
19864 -406707 27358 -214857 -189014 -150290 90321 156753 86198 -244166 116376 292455 -179119
19852 -355480 -59528 -263074 21374 -384312 -50035 -47450 -10115 109592 -208588 -31327 12099
19840 -126650 -25347 82554 -124104 -104891 11745 161791 -77326 108312 147983 -29937 129788
19828 -372184 -430111 22808 -255066 118435 -125026 25195 -170589 -227781 -148989 91799 60206
19817 60206 16458 80501 -252802 122301 -285522 -104178 20288 151730 -190591 -2299 -317683
19806 -317683 40595 -127871 -60198 -194103 117630 -349805 -80210 -247881 -461 215307 -177038
19794 81377 -3047 146077 -102597 -190131 -86449 -120837 -99476 -58705 -53537 -66040 -162946 -68845
19781 -227198 -82797 -438244 -32306 173902 -110087 155790 269746 -132711 -104517 -392515
19771 -392515 -156273 -44995 -4669 65185 106173 -97473 113075 -81868 72432 67121 153991
19760 153991 299265 -279849 -134385 29822 -53231 96909 -397038 -47309 -72209 -188509
19750 -188509 -132382 324560 -60184 108686 -402106 -81899 12974 -9194 -282784 -42315 -150976
19739 -150976 -97521 153327 -11094 78887 -104687 -246277 -7683 70546 -48693 -75073 29837
19727 -71377 -124575 -117445 88505 64070 -1105 -15908 208137 -213912 62424 95703 -111710
19715 78255 -180440 -353234 -78817 -46880 -113957 171532 -115595 165635 -174244 -296018
19705 -296018 -242731 218613 -86047 -128891 93594 3549 154303 -198370 -295027 230013 -123000
19693 -34121 7998 -188402 -241069 -13850 -110405 10907 5020 -235574 5324 -263412 -340956 -465386
19681 -465386 -28546 -14860 -103681 -203492 161393 -38472 -23290 204873 -86668 -484858 266330
19669 -268618 -80181 18244 -22206 266097 -163687 130789 104127 -127579 27255 21399 -208992
19657 22261 220082 -112414 175685 -195911 190073 -38727 136399 96009 -75677 -147705
19647 -147705 -276323 -106635 -90781 184292 325469 -45825 -30313 21401 49446 138628 82161
19636 82161 -242682 51135 -73456 122809 254498 -231130 247048 95569 -67805 -317875
19626 -317875 -9779 -410047 14848 -122179 -251964 -132725 -400361 -56234 -269421 109199
19615 -153575 -507730 398263 -435831 89246 -75546 -197633 -398147 -173496 43558 -200360
19604 34435 267962 -174074 -64471 -94787 125132 111793 -66855 -95572 108700 -193919 -49308
19592 1359 -68403 -166050 82893 -103364 36688 375982 -260003 -120526 -83670 233556 208968
19581 208968 -26707 -220682 -259479 71126 13958 40148 -98631 32578 208686 -334772 51606
19569 192689 -13069 102293 -112652 -160645 -151639 -184177 -217691 -48260 -493743 322828 163547
19558 163547 -18818 67546 -102944 -165503 -1334 -125118 403158 124249 -141328 -169496 -254101
19547 -254101 -219108 -70584 -58433 -1602 -259112 69532 77198 -48281 -236537 -179227 -124663
19536 -124663 -203632 82561 9473 -302613 -294782 223332 -361259 -69868 -44932 125388 335489
19525 335489 196601 38157 -411212 -266584 -129192 65137 -166053 182029 -1983 -12280
19515 -12280 45327 -179228 -155268 -134082 -15560 125085 142363 -13611 -46086 -24013 -142332
19504 -142332 221636 -154099 39689 27884 36074 -137729 -144443 -299754 248670 -114129 100016
19492 -208575 -116763 216674 49091 212025 -437313 -17718 -6183 -228390 -151044 -203715 -169151
19481 -169151 391778 -220444 262534 -123758 -131534 -116248 -161164 80435 -118712 -166389 -361289
19470 -361289 251659 90650 -277380 -289429 -202620 -136511 -68561 -73055 233446 -209436 -406952
19459 -406952 -322686 -67802 56895 7183 -300875 148986 67944 76283 -114305 -165705 -71361
19447 -170991 -95637 -56790 70458 -129569 -148642 -339271 -352324 -212863 -488657 -78171 -405967
19436 -405967 -415356 307020 -85485 -64080 79510 -313545 -312474 -427317 -147375 -42144 -34992
19425 -34992 -50967 36989 -12076 26682 82815 -78013 97909 -254539 -95738 334589 160383
19413 -220641 39773 -356088 46427 -180962 135643 44685 54523 -178815 202379 -67057 -202838
19402 -202838 57922 -330155 -103082 22904 -188484 -199701 -16458 27757 45846 132207 -109969
19390 -45888 -107871 46487 198119 -170223 79471 -8302 -137827 190907 -51540 11669 24201
19379 24201 87605 -83777 22894 110606 -444838 78104 -157389 -50609 27964 193048 -293769
19367 -46680 -311207 -142733 191214 -147910 -20935 -105200 325955 -122640 -81553 67200
19356 -150259 133530 -185527 82501 -143538 12570 305918 43399 -326996 -216012 -254051
19346 -254051 250177 -11284 50239 130303 60358 364817 -146807 141831 -42189 142563
19335 214091 -129326 -151627 -104136 127566 -129751 -199758 -68525 -193670 -135658 -302350
19325 -302350 -263971 43260 -136986 74277 122098 38467 114554 -136777 -366266 69888 350315
19314 350315 -242747 -239398 -255516 237210 108479 137122 -73930 -58413 -106448 -233745 133181
19302 -489239 -382008 -250675 85137 -102360 -76520 -42582 180291 134006 -83228 250062
19291 64108 -55478 -420468 -219738 91332 -79276 -33654 -116414 178352 227881 4242 -96334
19279 159802 23452 -18037 24707 -2513 -27225 -168941 -39989 -335098 102924 207384 27540
19267 -19795 30026 201685 308882 212995 -233347 354334 122742 -99153 46682 -138482
19256 -80989 -323618 -206136 -349450 -179933 -215721 619986 -185775 -141055 130132 -317830
19245 111225 -85375 -300317 -9380 116163 -139252 -246477 90768 -305248 184549 -142881
19234 -197867 128523 -61686 -94030 -222639 101092 -178332 108126 236554 36801 -128019
19223 -346640 289647 -209817 130507 -277121 -219738 -38698 -276657 3088 -392697 -409675
19213 -409675 -216822 162487 336589 -11585 267635 247790 81854 -7467 278606 -249060
19202 -4295 -394448 -155857 73461 -205759 -282383 188302 107732 -189041 -447432 321394
19191 347195 -200491 -251521 -58818 74210 204498 -33642 -335494 -43081 96478 -63118 27872
19179 156507 -73504 40823 39988 -176135 -19514 216862 90211 -176718 73404 10576 249816
19168 249816 -31630 181889 -153890 -2808 14779 -49347 146545 -257573 -289596 -188441 279191
19156 189643 44077 -316920 -79690 -101261 66631 -168782 -319086 -275122 47863 28087 105954
19145 105954 -77149 -99993 -124248 83390 -8802 -139466 -127716 111865 -304234 105035 147146
19134 147146 -317738 118600 90485 -77541 -151860 -8255 -102993 222552 75073 -120301 -34250
19122 -377605 -281592 288687 154676 -36979 -20654 93177 -40423 -131542 107753 -110070 -157491
19111 -157491 71348 28991 -118135 -32506 194165 146665 -51530 82871 -233944 -135901 -334381
19100 -334381 153317 -128698 -474179 30185 134943 -111407 -244065 194534 39619 249870
19090 249870 80024 -177178 -26203 54924 -97838 -212885 37654 -121039 -125511 -135223 219799
19078 -20997 -33565 157593 50033 -15975 -56326 120216 106166 -101022 -54764 419342 165736
19066 -76856 -84296 -275602 -135559 -51347 -98688 -72122 -459632 386215 35808 -158641 -27372
19054 77525 -228174 70898 -77557 39777 -53626 -120304 198833 60914 -287452 -192934 -175341
19043 -175341 -183845 81056 130781 -209823 117973 -136997 -30511 -88700 103249 -329792 193706
19031 68257 248791 -120743 -261629 -197205 -4082 76933 415512 -239212 46809 -118152 -36762
19019 -73944 -367093 115732 -127854 144636 -92878 -150624 -35537 60044 -66656 1785 -75768
19007 -198125 -231230 208342 -239704 -8510 -156349 -505373 9049 -149336 201001 -71153 -48290
18996 -48290 -128379 -121464 39792 -173262 -195160 97831 109845 -394020 259335 95177 -264142
18984 -7226 187770 -181097 -255168 3733 -103463 -70883 19694 -95812 -30750 -29257 91819 -188941
18971 -33528 172209 -60113 -58146 213108 -27724 231033 -19123 -133019 -126489 83068 -199809
18959 100812 121562 -79356 -85767 50948 1284 178514 256540 -35492 -47693 -160771 187020
18947 -250529 6337 38928 73095 -131823 64887 -143626 -44234 -290126 -155100 201084 -133193
18935 -228257 -99543 188726 -171083 -224039 -62952 -197733 -57126 -8680 -261031 17101 -124457
18923 136359 -418340 -220034 99245 153480 -54807 39953 95273 -387995 -42500 -25773 -222274
18912 -222274 -194213 -149487 248852 -71912 20538 247311 -109547 -148925 -260317 -14081 -85783
18901 -85783 126426 183502 -86602 157338 -146978 -94397 -151938 -14501 517529 94989 19273
18889 -190038 -227488 -15545 -149862 49198 -42188 -114822 -13995 50645 -196349 75308 -235544
18877 -53292 226498 -103210 -165213 159391 -222410 17348 114017 -259913 -8032 93872 -321383
18865 -106842 -43464 -347466 -205085 114180 147867 -84875 12417 217196 -50547 -176450
18855 -176450 5426 -22268 -106949 144433 229847 -32474 55795 -176982 -213596 -96504 -121192
18844 -121192 -46172 -183097 193862 33559 -16039 -63982 -340742 229468 158815 43942 -127840
18832 -230946 -299218 65173 107145 -215544 -34309 -340301 64509 -42931 -63930 45014 213635
18821 213635 -30675 9685 -67423 165210 76377 -97323 4232 -81682 -270660 312765 300 -9472
18808 683581 102980 174320 109072 21972 -193952 -163814 -169750 -121579 -23153 -218941 118145
18796 195981 -88073 -182363 149945 16255 -134200 59753 -23733 -160960 -68183 -55140 -129124
18785 -129124 279209 -8612 197963 -183205 -202373 -113776 -47966 240306 44153 -129648 193681
18773 61307 33448 161935 -257763 -194963 -49934 -17340 253165 -223518 -12277 -33204 258387
18761 358429 -41296 -536272 -118024 69048 -68285 -243503 63219 -83155 -12241 -214094 -109583
18750 -109583 28900 -128278 -154801 121426 -66891 284478 -236053 176374 243451 -4825 -20296
18739 -20296 181139 175144 60689 -86108 -47479 42615 -89526 -160087 -235074 239158 1860 478166
18727 478166 91273 109304 114224 -83932 -248455 119863 45811 -23155 -321902 -236572 -4429
18715 -232737 -354177 100994 -14355 -191676 211802 -548506 79231 27121 -55933 -69897
18705 -69897 -276562 54063 -44992 100067 -105639 -15671 -47192 -79483 -4821 165183 21888
18693 68496 133088 -334729 -53288 -255906 -412833 -367194 114773 -170273 92097 -404092
18682 -394243 -37633 -113032 -22895 -193927 -115074 -163310 -10278 -78403 -59060 -55853 -143275
18671 -143275 -42899 253452 -173517 -455256 -75170 -228 -222609 -220598 -431949 -85782 -285448
18660 -285448 328906 -416629 -57882 18252 226500 118566 53602 181166 -82071 -210960
18650 -210960 -157706 -64219 -10791 -206759 -48431 108322 180224 -109320 149384 463603
18640 463603 -200772 -140886 -213890 -83159 74522 -107553 -253862 -70665 240692 -139486
18629 -217217 -130946 -172229 350685 -419156 118736 -272208 -137229 -180923 -5131 177883
18618 -4288 -143716 -125738 135964 -283292 -140874 164215 311057 174139 186945 97805
18608 97805 -138022 -61525 -150867 -44374 -141743 -65039 -91542 90792 160466 -301141 -56185
18596 -86043 -153134 216532 -430403 151109 86142 112583 -236952 -131919 -172331 71427 -131306
18584 79157 86001 -106701 -208443 -31887 -431694 -11744 -163952 -284435 -10093 -255551 -154234
18573 -154234 -201867 -142383 -150551 -495879 -505492 -66456 -42556 75520 163981 -50299 -15277 115744
18560 -32035 8615 -279899 39469 -246793 -164288 -355973 -114668 64382 -41653 -64622 500509
18548 37164 137053 8675 -285687 -51862 -120094 44003 201899 -19443 -28898 -62922 59728 -131510
18535 275303 50 -340986 261290 -240399 5797 -119703 7970 39991 188633 169145 -9922 -134055
18523 -134055 -58115 -164565 142272 -102263 -48934 -27144 179766 -241335 -213612 -18976
18512 -403572 -2288 -359256 271862 -212322 -192246 171233 -131974 -339596 191486 -88199
18501 262094 -141990 -405775 20402 -67352 -172368 -138419 -262490 -232550 105571 -176946
18490 41549 -64010 486396 115553 -83551 -174177 -180491 -228421 6879 -130121 106547 -200392
18478 19941 -175572 315253 -185735 -4089 67692 -2584 -130752 94211 -202908 -10536 231438
18466 -303534 84438 8067 -192857 -96678 156986 -201457 -159213 -13038 -16219 -291293 408694
18454 -178255 -211676 -110638 60025 137828 -33059 -81683 -98044 -49075 123971 -76542 -93038
18443 -93038 330333 -91128 -95504 16983 194528 170890 -99702 -395724 -283131 123314 -82863
18431 131932 -289722 -247325 104469 -56142 43922 66308 -40248 -296995 39327 30537 -59979
18419 225799 -152625 -16195 309968 -54079 33416 15320 302232 -183886 104566 -196955
18408 111503 457196 -502322 81615 -340068 86443 -74313 270437 -83034 115137 -25121
18397 -51511 282376 236117 -75773 -64885 79972 80853 186744 -277371 36632 -249723 -134910
18386 -134910 -312107 -81427 -266541 11074 -163720 -256512 250084 -138451 -33607 -15706
18375 190268 -208740 -144633 -164274 200980 6145 12823 -227445 -45278 -227073 -10172 83656
18363 -31129 -125781 -27232 103899 -124681 228003 -314849 -199130 -195279 -52278 125816 136457
18352 136457 107993 -410270 156271 -192835 101198 8702 -69635 -150844 -92956 193843 -147465
18340 -180437 -279512 -72768 -54532 -208611 -3957 384437 -70500 -27326 -250420 12881 81580
18329 81580 -28270 -215485 106499 92010 -83725 -376241 -98449 94340 -310900 46257 -279205
18317 222125 76436 -164411 -16354 26023 -26569 -43671 13271 98650 145491 -354915 -54940
18305 -13409 235704 353588 -130245 29618 -82483 -47680 -150358 259499 26041 84546 -178069
18293 101224 27347 3682 33759 71321 86256 73505 57472 -39067 -290761 35 14818 -303581
18280 -183126 -80669 -52588 192271 -46957 -257991 -122920 -76002 -301629 3083 13117 -121816
18268 71488 266660 -221815 352412 -126741 -132659 60646 6310 34121 -215905 168061 1695
18256 -179857 65066 8800 72184 19752 100682 184258 64829 29649 -409236 11621 13893 67536
18244 67536 80276 -138958 -168376 -51521 -237159 80828 9627 -83423 -183522 147401 24444
18232 -120697 164252 118584 -34836 -100308 44652 241652 71204 -119783 8697 250285 132468
18221 132468 -3931 -108212 174788 -34350 -3830 -244263 -143736 -61227 -81116 -126459 93633
18209 -145768 -61030 170472 23569 -41980 189359 -8785 5322 70672 -111180 209841 31258
18197 -102173 202821 -329500 -1808 -258 -208923 -226589 -84700 -300935 -55855 -16938 -123766
18186 -123766 122183 -453115 -176654 -177211 369333 -20043 21730 -73375 -152164 -310418 -182954
18175 -182954 -65218 -223809 156843 180575 -76893 -67505 2584 244516 151347 -232351 -51130
18163 -46477 32104 124698 94748 89427 -91175 -283109 92260 -36674 -107441 -218582 126464
18151 -9095 107315 6333 70977 34453 -115338 63136 52612 -12096 85807 116395 130744 -50871
18138 -589000 -69387 -153043 169558 -216019 -263732 139312 -420731 -226171 57200 96153
18128 96153 -36606 320688 141412 -173321 54526 171526 47408 -377029 -36950 66395 573
18116 235841 -127874 67751 -125608 -138977 -259357 103245 -44975 91191 -35544 137234
18105 -185780 -190774 368027 -118705 79489 86133 -93027 -85634 71022 -50906 -60303 -217227 -99365
18092 -108449 -4015 50455 -104871 -100491 -190129 102398 -245418 183913 -95114 -266982 -128805
18080 353789 160854 135762 120059 302028 45110 -128262 58292 95816 100547 383546 -188241
18068 10910 -149359 -196255 -310644 258181 167675 72784 203077 172169 -278488 186240
18057 -332429 -117120 101779 22924 -27614 -126784 -101500 -161158 -227042 33118 40276 -300054
18045 -28193 -29913 -98137 -93536 -43858 101881 -339536 111046 165184 74157 3182 76918 -161003
18032 118688 -150117 -45475 57362 -74936 88034 66964 -113291 -262813 373475 -61428 347720
18020 -55830 12225 -335941 40536 62660 205962 68977 -198739 25096 -18099 332538 -100997
18008 -201774 -133781 -208982 1321 -95065 -384019 73792 -42372 211713 -316311 -46201 144260
17996 -161898 -310741 93929 -86777 193630 6385 -72846 411889 -77910 -29657 -120903 -146758
17985 -146758 16365 -32023 80718 99985 -47403 -138061 20659 -127763 -10728 258970 158223
17974 158223 -79868 -217497 172620 174460 -78834 -247001 -215631 152261 -94799 134584 -115196
17962 -138423 210729 -83558 -291420 -48805 304571 49595 -147333 41196 191470 324971
17952 324971 -82047 -55811 -138967 87497 -250352 -11926 100629 207819 65677 -210624 16310
17940 -156285 300218 -16183 26944 -271719 -389435 17604 123628 -139861 -221324 182545
17929 235743 -170882 -121729 -20476 117923 -235826 91842 -84321 211137 126240 -146033
17918 -149766 -310384 185034 -158075 25686 258154 81479 189282 6194 -286969 -56467
17907 -48652 -132683 -69287 250037 238081 414769 -23238 124036 -207870 83201 -91822 71803
17895 -157646 -89658 107342 -35202 187924 -37960 -234969 -360377 -85615 171304 -128609
17884 7916 -38047 -142361 -26248 95468 90997 -249136 143474 90317 42766 -33431 -274165
17873 -274165 60740 9064 -21216 -56766 96286 110341 -121483 414339 -40915 -211263 -271867
17862 -271867 -176182 214488 -66266 -15646 -85289 -41690 385340 269232 63857 -237606 -300049
17851 -300049 118008 -305709 72129 123605 59121 -170393 -124160 -103963 -72626 12667 194740
17840 194740 143381 123704 -99722 -156992 -119414 227942 15799 -43167 -83326 -428738 126198
17828 -119741 200114 -38728 114822 23719 -90254 -146002 -106864 52347 57731 12759 -179764
17816 438038 154595 94610 15194 -73874 -91300 -178425 160960 170313 78882 319144 -146516
17804 -111694 98302 -190872 -12122 104584 63865 229894 66983 -321341 77984 238477
17794 238477 -115519 74938 253441 205544 109634 49055 -28546 114435 169613 161568 14416
17782 -307659 96839 142489 200562 -38413 -47821 -349137 14537 6405 279808 138282 -115721
17770 128545 8392 -275811 -110030 51721 -110862 191404 315442 56128 121204 -50899 -55376
17759 -55376 8437 173256 -102436 -95978 -272151 -80597 149660 284028 15465 68538 109478
17748 109478 -274308 235302 -179032 7509 -83033 -84648 55685 148735 -157471 71329 -305956
17736 -17901 -194272 -405650 -70102 344416 -393725 21125 -211148 171733 322413 127499
17725 -228647 335310 184655 180374 296046 8309 257615 -472922 13426 101615 -378929 149180
17713 -24971 158345 -271548 -181692 -81595 -70206 337278 -215876 -82716 -22514 288507 -156700
17701 247505 -134405 -68468 92350 34528 120628 68621 -19402 -55105 -108798 707 161513
17690 161513 -8602 187328 64957 -13617 317031 116665 -18478 -84873 51464 145006 20561
17678 -68095 -90982 283507 -23875 91083 -227990 -92355 44651 -139641 -164065 -173881 -16670
17666 54312 -62828 -124614 291082 -102939 111772 19890 -236677 75442 306952 49372 -9779
17654 34927 273053 106576 -108588 254460 -8813 242822 -111127 -131058 -239409 -129444
17644 -129444 172007 -230652 -6567 225045 148450 144364 528628 244715 216368 81390 111557
17633 111557 164179 155664 113417 -149720 13465 51856 -382425 153659 -176043 -390193 -76066
17621 -32118 29453 48676 209299 -107348 339502 259247 -28340 -124838 -54126 469897 16651
17609 -6563 96255 -57265 -78816 202738 -240171 194665 74656 207607 -123510 125374 210001
17598 210001 79943 -419 87888 -207440 -175394 173629 -238338 89843 71113 -90344 274942
17586 117039 -220785 -41718 -361753 -73661 -239887 92709 65229 210089 -142018 195210
17575 -130895 215200 191742 -9011 3643 -220584 342400 371657 -50522 -128738 112493 -99943
17563 -104394 -152896 -109214 110935 -187873 108431 -94679 233854 175214 377258 94484
17552 321892 316624 -68144 164480 19719 61842 437486 35042 174161 -174029 -129588 88843
17540 -226135 231691 -16304 -15274 85904 175120 163950 -143902 203435 -150276 310218 151374
17528 -63068 -131306 -260875 248665 81163 61162 -305601 -110249 340499 99849 168198 71504
17516 -274430 -250429 176129 471159 409293 169503 164563 198596 54028 184314 -209685 175270
17504 70341 273517 -63489 287422 57424 276964 444596 191597 40295 93324 49664 -47475
17492 195646 -25466 -60267 81242 169205 56027 -83505 22807 188831 257965 -44176 116022
17480 122055 295080 104263 259049 54175 -34389 131874 -197929 162352 -18044 50248
17469 42466 35305 239235 118318 -137737 118844 13182 99523 124160 -107972 56622 246190
17458 246190 50317 201811 22813 67564 103628 192844 -77384 319105 228721 419352 404683
17447 404683 297155 231864 300770 221508 295543 300927 245563 166702 124580 257899 -62134
17435 259475 501859 177848 -22171 300924 395399 414697 179441 674771 461523 432787
17425 432787 95777 427600 133073 287088 103437 152173 274353 271506 241278 214144 262639
17414 262639 101589 345034 395304 74767 144963 365999 642597 63962 -9611 -20451 394928
17402 323002 -59687 -143563 155690 29268 -136993 38638 347368 241323 -64051 24718 54787
17391 54787 58583 -72755 -121255 280134 190266 254053 -17186 53351 -79630 355213 180890
17380 180890 169373 253719 47957 83674 490648 475904 125715 -146865 117153 375072
17370 375072 16879 273252 329812 71718 89259 180313 482049 168983 -50108 104373 46541
17358 178853 114480 288362 -77141 263398 -88427 485041 97578 164246 64099 210334 273097
17347 273097 107828 118756 257399 231135 43091 31920 275361 128833 55417 207364
17337 207364 190434 379256 16954 -31498 494628 313581 279197 249094 161776 288861 368531
17326 368531 468356 69679 -232064 39105 -8028 -92344 130699 323839 583581 354916 189805
17315 189805 285545 434147 93569 -48809 197168 59218 192322 229890 92655 145872 450736
17304 450736 124967 366489 408061 122862 164886 260421 117538 63574 328282 100092
17293 354779 336712 309897 518644 294684 76301 91365 128043 132671 295652 260597 257551
17282 257551 557595 332873 -32357 80899 198078 406 526536 10143 247195 494957 344438
17271 344438 359059 82480 10549 164890 -24360 -14771 173218 136026 289146 366734 206083
17260 206083 117227 -1645 124852 543001 20884 429282 -94214 198097 243499 321438 176263
17249 176263 237424 92213 209355 326989 430865 212545 361711 68194 484450 37056
17238 167263 494242 194438 65502 191463 115498 423883 -99352 232753 457515 281247
17228 281247 434545 386303 699727 381654 516502 339001 102366 152847 56398 50988
17218 50988 177769 292167 432664 163701 280932 119055 396371 416851 230387 20489
17207 325817 126113 445853 877316 530964 -147196 339653 718010 72 427540 229965
17197 229965 137846 355593 133075 10984 7036 307036 545028 412731 -137993 496640
17186 115561 138447 354983 132558 355472 351676 169707 447741 180944 -85029 61414
17175 735023 483957 236311 303055 280038 387412 453707 221585 181374 -44252 329172
17164 452100 589318 485167 401431 52134 397784 486333 416504 301657 298334 134610 370734
17153 370734 305875 348088 43624 462652 84674 243714 461915 391697 588525 232427
17142 189602 353361 354738 264491 311897 534106 464520 508414 218394 388122 431952 633594
17131 633594 314595 541894 170482 162985 366708 30222 363917 628597 345342 756485
17121 756485 271710 6937 261413 501344 631190 341086 333579 547561 170686 303756
17111 303756 365405 337720 744833 286795 559597 575236 679152 40182 350753 484444
17101 484444 381974 561086 493960 481627 147030 438627 317596 424108 163361 569959
17091 569959 561968 159273 504589 119320 496728 612321 564669 342625 556087 373040
17081 373040 114707 449567 419960 305106 181394 595902 629541 351050 580775 599303
17071 599303 661048 165052 656069 353133 390939 554110 524900 434857 548185 616164
17061 616164 584652 449210 318534 343776 115122 956166 526257 409617 257322 508015
17051 508015 315476 490169 374075 523641 949405 917676 900148 638381 964378 584217
17041 584217 528812 828229 490334 564526 611376 645952 797315 763380 553193 640770 641653
17030 641653 483083 750517 562485 707376 943260 437306 926716 786083 532930 668320
17020 668320 474814 614347 847529 804029 864564 456060 802504 760530 588981 778944
17010 778944 719803 730780 729075 782151 803153 704564 922535 598504 1200470 599526 873276
16999 873276 785203 941270 913245 836747 890963 806101 1079110 646794 984397 1125087
16989 1125087 703008 952788 650207 659216 747091 969075 982574 1117938 965969 950289
16979 950289 932642 1189758 859393 979450 866545 1129205 1125781 1029903 1099354 774834
16969 774834 1107730 1191804 1245399 733318 1015134 1136640 1282852 1037857 1075083 1295309
16959 1295309 1138426 1136788 1090016 922501 1096249 899146 1117923 1289755 1086245 1302248
16949 1302248 1285913 1340945 1251753 1380097 1211652 1537576 1435949 1282931 1393766 1201813
16939 1201813 1375172 1195428 1284575 1662179 1541034 1402965 1264742 1434423 1750214 1438621
16929 1438621 1585486 1524330 1471552 1487059 1714310 1470301 1384724 1437104 1423312 1554378
16919 1554378 1427765 1724610 1645446 1608215 1748874 1849591 1674387 1790015 1853470 1760732
16909 1760732 1899158 2060119 1788578 1932411 1839657 2051089 1758117 1897183 1972513 2259690
16899 2259690 2072626 2065366 1815334 2234183 1943309 2219060 2222973 2166706 2252872 2247194 2335775
16888 2335775 2224124 2546222 2516017 2297887 2582606 2280968 2381070 2516287 2292824 2768105
16878 2768105 2616274 2962710 2562850 2625267 2870712 3114281 2765112 3074511 2803578 2795821
16868 2795821 3111704 3207466 3265123 2945929 2861968 3140309 2977919 3090729 3732430 3395928
16858 3395928 3540372 3657938 3592826 3541164 3894823 3585128 3809728 3748689 3744598 3654037
16848 3654037 3813210 3584728 4010706 3953184 4058718 3800850 4262006 4390831 4610252 4526160
16838 4526160 4636660 5181691 4850870 4997891 4975332 4837918 5160306 5419616 5276688 5551705
16828 5551705 5938285 6008488 5677747 5921403 5740007 5875508 5916903 6144800 6098795 6256425
16818 6256425 6793200 6861801 7233911 7438608 7383387 7335581 7609158 7662188 7756747 7928452
16808 7928452 8212011 8086765 8347154 8569992 8893901 8851357 9429824 9565603 9745946 9824121
16798 9824121 10073813 10602233 10902937 11010653 11379724 11590197 11766691 12087206 12646412
16789 12646412 13023128 13261520 13505409 14131779 14758786 14862713 14846437 16107121 16623853
16780 16623853 16930986 17399425 17900543 18552972 19068023 19852729 20377239 20963308 21843873
16771 21843873 22560782 23599766 24191260 25277265 25946965 27139185 27941820 29292891 30460836
16762 30460836 31795027 33345017 34445696 36076848 37373909 38969022 40819178 42825139
16754 42825139 44702717 46795925 49023258 51388439 53886405 56236381 59349043 62398854
16746 62398854 65898716 69264199 73386918 76973919 80939475 85485896 89983149 94932571
16738 94932571 100013757 105589232 111488127 117624371 123041012 129312530 135642470 141901106
16730 141901106 148409860 154424913 160346006 166098686 170686070 175037412 178587995 181353373
16722 181353373 183101436 184366637 183760759 182646557 180454360 177193465 173285108 168631322
16714 168631322 163268078 157688052 151631519 145650533 139076322 132701760 126452659 119894115
16706 119894115 114022543 108242825 102464250 97067534 92070207 87253702 82834817 78314227
16698 78314227 74349956 70229694 66901879 63689980 60634887 57469027 54489119 51972461
16690 51972461 49650072 47303464 45197036 43263696 41375699 39148567 37678250 35953560
16682 35953560 34578497 33242508 31542094 30615894 29138500 28199962 26994296 26272400
16674 26272400 25049367 24305365 23126804 22589282 21820325 20882164 19785431 19615532 18944236
16665 18944236 18362092 17660612 17345285 16786001 15973852 15691363 15088915 14339830 14168812
16656 14168812 13961976 13351921 13027136 12485864 12377000 12105696 11792907 11250652 11124170
16647 11124170 10432512 10529498 10497639 10259578 9834947 9657573 9031297 9229548 8585272 9209051
16637 9209051 8585509 8333106 8181915 7775980 7746020 7747087 7572981 7115735 7256638 6821917
16627 6821917 6768029 6720074 6456282 6532209 6718442 6473168 6124584 5757272 5858991 5795968
16617 5795968 5546422 5378057 5162447 5147833 5042025 5158021 4683710 4673795 4689326 4728609
16607 4728609 4550175 4165211 4261230 4181367 4322645 4309237 4158537 4020485 4082976 3998485
16597 3998485 3850874 3841717 3917303 3678601 3663521 3399370 3804589 3468994 3502398 3374731
16587 3374731 3000058 3051457 3328335 3446561 3593309 3136908 2966710 3009089 3233008 2800912
16577 2800912 3048829 3060958 2423742 2663671 2787903 2803750 2535276 2590015 2598507 2131075
16567 2131075 2757138 2275815 2308046 2741491 2668137 2117970 2301398 2084165 2167674 2244435
16557 2244435 2184635 2182080 2168630 1925907 2045054 2125128 1986700 2012254 1909471 1827713 1726482
16546 1726482 2022335 2377177 1825180 1621212 1849338 1631867 1807472 1882522 1865484 1618191
16536 1618191 1773570 1789324 1723711 1420578 1792959 1727296 1240938 1656024 1338024 1871361
16526 1871361 1421642 1553603 1450716 1697038 1553856 1432276 1574378 1578022 1406762 1715396
16516 1715396 1729054 1112144 1335059 1353041 1204962 1563214 1275236 1414486 1220713 1175131
16506 1175131 1361332 1290222 1487441 1190994 1284895 1172404 1538109 1373125 1222985 1293713
16496 1293713 1068920 1115164 1377319 1062956 1292979 1143452 994546 1268683 1134769 857468
16486 857468 1140868 998534 721437 850338 1014833 1129514 1354475 925756 1080870 892712
16476 892712 773887 996680 1342540 1035268 1230337 945342 1010120 761324 905957 858051
16466 858051 996833 827999 1055114 861441 828651 699394 992372 974178 684703 980552
16456 980552 1053367 814956 658990 814616 634777 887356 888252 1009925 765237 1110389
16446 1110389 743444 818638 930939 524939 813026 477514 587238 497790 579471 549403
16436 549403 693788 622234 1068235 546750 610368 857219 743399 900218 685563 737988
16426 737988 569250 714827 635954 743663 785726 641141 679076 578914 113180 541649
16416 541649 446475 625581 676822 554248 971740 644356 743675 650652 312113 374907
16406 374907 753135 933942 705612 744866 416395 400214 500148 361728 612303 784857
16396 784857 506151 441626 442495 726345 429143 554254 805402 428206 368662 397852 275690
16385 275690 762941 590454 156342 773563 483866 674304 522843 288716 385905 464870
16375 464870 388298 606677 347247 273273 459527 411279 339068 676416 637239 234268
16364 519059 647619 173966 443220 827189 344560 110274 299514 525478 547000 273338
16353 641488 464389 347850 609269 772771 353349 623555 49146 589519 433462 486106
16343 486106 34346 387228 467209 186886 474803 457820 473216 478503 588828 328504 563380
16332 563380 107408 326782 292160 443512 82802 253220 442991 35731 41457 236676
16322 236676 93951 496403 304410 257696 568856 412421 125878 135587 181494 177323 492772
16311 492772 48871 354018 258692 233896 179535 195731 251344 -5698 557603 61067 137560
16300 137560 269258 530256 206405 384985 322878 287524 469810 124728 543388 379632
16290 379632 395715 222323 324749 372273 466982 -1246 278690 239432 567055 447136 371113
16279 371113 144566 214048 316395 360879 559825 389941 284514 211567 137338 180798
16269 180798 259184 331 288285 253068 506064 619302 373136 321745 362748 293726 113698
16257 71895 277508 275027 512 8249 -97626 222842 132589 215844 295320 137725 466213 184227
16244 218773 321511 234281 232241 -140013 547126 328939 128109 -204986 398980 105467
16233 213401 316076 337617 87665 378056 153977 317659 98734 376810 220073 -51538
16222 177705 25448 355171 257494 383123 241663 328336 73220 312511 242288 34515 -16558
16210 -46396 56902 161617 13044 182641 -24412 469628 199452 182584 -82797 34933 -92230
16198 139683 274722 390195 -131349 342013 9734 166494 157733 228642 -22747 351864 354048
16187 354048 17670 -194809 -55804 42803 103747 -54301 90987 -22485 619752 240486 183080
16176 183080 -33212 371568 165559 -139720 -53210 -32537 -123853 -49883 -66976 274909 294341
16165 294341 21707 -139356 129486 143220 472464 -33505 25879 139296 -11567 53908 382476
16154 382476 151685 115847 51273 110345 23839 225192 106837 36867 -264892 266018
16143 -42070 -10469 436823 -122163 -325623 116203 127923 392467 43301 43906 169147 -88531
16131 415398 146005 87677 54254 -143209 58116 20682 -68036 283467 -80590 -17867 154210
16119 502058 191598 -24265 198312 -45258 221859 137977 110650 163495 240334 143833 -254236
16107 43900 168325 -286704 117565 147786 -5270 202348 352421 -37644 -33426 396724 379109
16096 379109 -93104 418031 -38229 -57491 -200089 108776 12177 294618 -45486 -188930
16086 -188930 -31237 15626 -123858 -123922 -6726 211317 -71010 208810 116654 44837 -142083
16074 227123 43086 164855 68377 17845 262280 -208991 163283 -64905 -152067 128732
16063 201810 -92502 -50931 -7308 308681 257288 -25915 -102060 -68430 131172 196530 26138
16051 -70586 268990 53650 -116469 -269049 -257612 535133 316792 -7819 182444 -147587
16040 170842 -211016 -8272 339850 -213182 -455286 182459 -26129 -9138 2008 -17783 201431
16028 -112939 535894 36647 9229 65981 303298 -47544 134357 147735 125724 29367 -157148
16016 23167 288976 132065 87020 91046 -50742 230014 -100385 -65897 472008 189705 239681
16005 239681 143174 159516 133116 -278423 125125 -61966 -202001 -134825 -292349 341688
15994 276312 198932 6246 194266 74953 -152040 -202201 247152 15306 15862 192661 -119381
15982 485702 -141565 76438 436816 195216 291003 -180145 83557 137322 234326 -178365
15971 -174000 -33196 304022 -19128 -254908 126971 18395 -67264 -196576 -41257 345365
15960 -323193 -42244 338865 74457 -196902 -48622 -375237 -145009 -128607 159838 -33026
15949 195567 260065 -116479 -353290 171276 282704 109400 -204654 88458 -104940 63480
15938 10920 -49550 12071 -79105 -155277 39710 -11372 -280380 162452 189 -75227 162904
15926 -200948 128486 -139098 -149580 178455 -225274 169557 -150419 -68942 238609 -152382
15915 -95016 -69116 147572 -123061 -1598 -186131 -142332 6541 -54870 -13384 214725 100938
15903 -139922 259893 538368 82550 134084 72021 31165 23124 -101446 -275688 -47434 -102462
15892 -102462 69560 12791 -85657 145376 -139084 -115856 -75329 -116005 -150482 -109721 -161999
15881 -161999 -42762 -105034 -127140 134911 425861 -118675 -44377 -108716 -124876 193434 120607
15870 120607 -412254 152465 -226077 122801 -2391 230763 148711 -131940 -15176 -92161
15860 -92161 -126352 272803 -39451 217802 32821 35037 -458429 -60813 161981 142010 178894
15849 178894 50695 -10701 261367 177460 206390 216185 -201316 55822 -42798 -151046 -52586
15837 -231451 -274917 -67414 87127 86019 63315 -272670 -194273 -121275 -198637 -121266 -75922
15826 -75922 -144384 180918 -57774 -176053 -92265 -164313 82962 -157985 -70340 -312828 -164871
15815 -164871 -97183 91835 16927 -335839 53249 -58688 -117703 -186335 16534 -309268 -49608
15803 -321222 -118224 -96905 -56811 -428501 -23191 43695 -171534 48875 204665 234086 -136051
15791 -54035 -10166 29014 -342611 206653 -3398 251647 352130 83910 112701 -229977 -194840
15780 -194840 -354678 -53356 220041 510741 -9386 -143670 -172124 -425988 -177267 24920
15769 101906 -88907 -189715 133659 370795 36739 49906 70505 -317544 130386 170629
15759 170629 -279089 60140 -58465 194992 55519 -174060 -192107 161965 -256792 106252
15748 -156514 94398 263308 104634 -9933 -165227 -91366 20092 -170467 31155 208837 -118618
15736 -30146 -27576 24792 -373056 241056 -71620 -354125 151108 -285275 -81262 54177 374800
15725 374800 -44255 -229252 113285 29118 276522 -138201 52097 -52344 340716 -54257
15714 -155889 197132 -238082 -279208 -63695 150076 -255946 213650 -103188 -199420 -89423
15703 -9494 316764 172688 371216 -159660 121031 302389 143412 -183696 -158435 -146297
15693 -146297 197165 169451 -157104 -205647 71770 -290961 -38950 100301 -19764 14052 -249308
15681 -187075 284043 -377906 -314490 326653 171138 -175284 -7902 151887 74640 282969
15671 282969 268144 205300 246885 126853 131947 33539 52127 102130 -9867 -114709 364966
15659 71904 54027 -135741 -157250 120510 -108399 83673 70925 168163 -13079 389571 56994
15647 -70784 124912 241183 142613 -10632 7965 181506 -44855 -393292 90362 -512687 -185204
15635 59038 67921 -211110 -192663 -150679 -8256 -9150 -74749 103985 -199764 -155639 -136569 -371064
15623 -371064 132881 -60250 123016 92728 -4987 -196478 189186 -34516 -50874 -85854 -1993
15611 -178822 835 -139630 178579 -15642 -68542 -139579 -173546 -196553 -207803 209362 -102185
15599 -145164 -261490 -154622 -25100 -80591 -75701 -34790 42120 -325610 -54257 -110835 228637
15587 191063 -77350 -37106 45984 -275089 156121 208203 -117870 12251 -139818 104662
15576 -53524 -305949 -79186 258822 -51369 -113269 97357 -8038 -9668 -214148 7224 52418 39465
15564 39465 -46614 -221190 124859 -6188 139889 -154855 147732 -39968 -298773 -177341
15554 -177341 -225027 -257364 152464 -227975 81060 42984 23211 -198012 59573 54141 216378
15543 216378 241070 269893 -37495 -143002 116500 -163778 51012 -54493 -178353 50164 36290
15532 36290 -7366 -35889 98578 189594 -178813 -392821 -351829 -90482 -45244 313251 329225
15521 329225 37572 -118613 -48733 129923 342289 289832 -220827 -31791 184832 91722
15510 -357555 88218 -122255 110088 241953 -72836 96641 225276 -91025 371757 -58094
15499 -117115 -210878 -22621 270237 10199 44279 70578 78898 -206440 99349 79966 -17250
15487 -165800 -81943 101156 24651 -243811 -82533 232448 -20655 -166541 -213566 104425
15476 74694 154951 108972 -185154 45448 -75230 -279950 -112244 117998 -232907 -50103 -173533
15465 -173533 -129149 -15282 1613 16032 -174293 -184316 227111 -198756 -68255 179706 -136266
15453 298016 112850 -44059 281362 -6459 174631 110258 52789 -319805 29603 168530 -187359
15441 72890 -22225 1274 -165053 -249102 374303 33321 30109 72819 132561 223120 46778 53921
15429 53921 43891 90924 -260405 -207508 -39242 -97998 -136394 -227534 237185 -80123 36037
15417 97427 -248551 -157284 -147756 -189481 266983 26698 -103311 222973 -10550 145236 134798
15406 134798 -7750 164577 -215656 -19184 -322295 169616 -97467 -65426 154195 1873 248376
15395 248376 -158535 250835 63146 133961 29309 -42985 -272651 -223409 114576 -435307
15384 128021 -459179 192789 -116035 84526 127797 148156 109380 175655 141666 166850 78118
15372 -36806 -112430 6631 185215 -188197 245710 -156763 121543 -15320 -64466 -51776 298516
15360 271749 14806 411793 -83079 -185417 220915 -193269 -225512 79239 321170 -226944
15349 -108227 -103032 41210 455080 92203 29293 -262695 -500632 -128034 -41858 169456 33986
15337 -29285 909 405393 372061 12010 268075 50352 67839 64405 248668 225578 -50186 -123943
15325 -123943 -109437 57609 60234 -229364 -25726 179187 220870 318602 190614 -133331 271879
15313 7413 182663 5768 3183 87008 195555 232123 -359574 -21475 -99251 112465 -103669
15301 386174 -138622 112505 -212722 114582 284668 12921 -112596 -85881 -186139 417357
15290 -75262 133729 -116461 -41564 16808 -73698 192575 -148061 66686 79342 123289 -137178
15278 96006 284140 -57539 207206 323210 328631 -50350 237839 193515 18467 -8084 27504
15266 -218131 22236 63911 62517 75816 -282553 108493 -45458 247804 -12326 -397591 102061
15254 -39456 -49 178227 11227 -29600 443147 198663 535849 2096410 1878037 1516306 2480379
15243 2480379 1212708 850547 20500 115923 54533 372609 78871 147751 368783 52261
15232 131229 -121119 12016 -60748 257239 -106029 161795 -205164 172874 407090 -122510
15221 98657 -108681 47360 -374004 -54465 119461 46233 252443 174975 146878 125509 -198526
15209 -76385 15770 62790 184801 376237 141815 487876 -40568 222158 144377 194931 279306
15198 279306 162166 -197938 13111 -151140 415996 -51520 236792 33782 246796 316716
15188 316716 106914 453261 -134084 78268 481131 176048 250712 242720 -122776 53802
15177 238550 -366106 69798 418384 -113562 10307 99441 182731 54564 -50093 -64703 -40934
15166 -40934 366656 74487 110258 52020 23915 98711 317151 117095 -221099 -226310 370716
15154 45765 100229 216283 -95012 179512 102083 145722 140566 -152286 -166466 221389 49004
15142 421324 -15806 -28278 396492 -140710 -180683 -163740 52246 79656 97740 535814 331221
15131 331221 89469 118862 74947 -7846 166332 -348339 292084 163116 14952 567769 146809
15119 457565 -18426 246082 -234087 132778 662007 289315 341109 -136278 141357 57519
15108 91669 -233662 382456 77665 207268 -200074 173904 314812 82294 44114 252994
15098 252994 290256 404375 74658 195271 1902 90573 62083 -4161 255058 -111318 198071
15086 59309 174245 424444 100410 -24134 67215 467348 212596 -47002 340137 155880
15075 392546 95249 352436 142717 49333 338765 351570 -112760 190063 163897 -13810
15064 20073 295503 231773 116856 422074 -28674 201741 305746 302064 113211 -52751 285927
15052 411076 188190 -174808 104982 12719 -27360 28697 277960 -27395 484372 260108
15042 260108 -34462 309237 228487 219984 316629 -137082 44286 263844 29270 187691 157221
15031 157221 390354 38611 -70564 182250 573524 184224 321105 244086 109153 219856
15021 219856 281255 213082 185521 373964 135544 186254 88372 195539 160073 323043 81010
15009 224373 171165 407184 565737 101671 257361 343022 -120981 321203 244265 22890
14998 163916 438688 16166 -145892 699675 197545 60419 28126 80969 301324 -24705
14987 171096 211282 602362 307344 234351 173451 20516 266570 518359 602889 20218 203729
14976 203729 183469 260392 20212 318949 509103 -34195 180558 324521 122693 290497
14966 290497 117814 314076 139060 185898 297541 370816 105576 274250 48099 595136
14956 595136 -62077 217570 466081 334348 413995 -33130 252222 450230 210794 314091
14946 314091 199492 726080 361145 441716 -36193 114167 469132 406818 171806 227975
14936 227975 -15736 28925 38106 493571 80810 216860 96294 193469 190118 501022 448067
14925 448067 539950 499889 438966 243013 359902 435657 384678 583814 518362 452950 160740
14913 259045 375242 422975 180738 490941 230961 102965 472771 233085 225520 77155
14902 361872 425306 179592 458440 114685 492245 365764 577298 673479 153579 340721
14892 340721 782651 283672 600272 547179 524850 141298 604105 649343 460782 567864
14882 567864 624974 411409 688336 189372 632430 493789 611546 169709 377082 333908
14872 333908 301166 -41871 128665 164748 286392 558124 605037 455855 284280 366134
14862 366134 408408 424170 406591 464512 398988 282000 690110 232541 605436 371315
14852 371315 511323 563305 578429 649512 444009 435412 79110 296961 697691 334320 424121
14841 424121 362235 288142 548098 553087 217892 759966 524232 529522 292176 892619 805694
14830 805694 217363 644132 405102 477928 428750 420554 583613 674544 640718 593868 556833
14819 556833 623202 669051 678373 488083 596013 409514 497131 482187 441757 682542 622704
14808 622704 370588 377032 713366 496225 428578 349302 618101 589519 589275 169935 711086
14797 711086 647209 532170 838893 477167 749345 764882 831756 923704 572297 793144
14787 793144 758112 443037 733734 353140 749357 515066 379458 540117 495042 780117
14777 780117 555857 558759 109239 202621 688122 827784 511485 387848 868618 742209
14767 742209 473662 842588 565424 546269 870865 823721 735651 867527 782901 474427
14757 474427 525146 528727 1075564 682534 923219 622111 596089 768760 652650 850847
14747 850847 1006746 894048 952709 909570 704855 820645 206919 777315 927031 948177
14737 948177 638572 832947 643374 934332 567800 656340 719808 818480 629203 923547
14727 923547 866063 932251 608844 946295 993940 845590 786826 620881 963588 1179428
14717 1179428 740480 1210450 983433 995848 1050301 788365 903798 946427 1172152 1238437
14707 1238437 1047789 1176173 1425667 1452390 1146641 1098249 851281 847574 772914 1195754
14697 1195754 827596 1190372 1020056 866415 748901 801470 638416 1116960 1286211 1073785
14687 1073785 1157878 1114785 1525495 1060594 899823 1220817 861583 1224160 1279278 849178
14677 849178 1124165 1112660 1149858 921465 1374881 1006499 1278794 1330373 952805 976613
14667 976613 940798 1022941 1277116 935666 1043743 1192468 1348722 1218445 1196957 1131744
14657 1131744 1094574 1359229 1442525 1393380 1106363 1280005 1478269 1664839 1514246 1042343
14647 1042343 1486171 1066298 1184681 1215519 1302689 1229236 1519454 1405014 1269041 1223617
14637 1223617 1476065 1152335 1549800 1242353 1164053 1202513 1454612 1743362 1499079 1427460
14627 1427460 1328261 1563824 1137354 1476131 1531531 1526839 1580363 1608968 1417667 1526548
14617 1526548 1553865 1299824 1398853 1736967 1652766 1573476 1311085 1374800 1452590 1679212
14607 1679212 1667602 1576095 1857634 1939683 1627750 1567791 1649261 1775486 2290618 1667676
14597 1667676 1523281 1933144 1942412 2119224 2134931 1979514 1885459 2085360 1709523 2036080
14587 2036080 1837969 2021635 1882420 2181248 2098385 1826140 2113952 1911818 1991444 2019544
14577 2019544 2232761 2435166 2368490 2273830 2222422 2311235 1774765 2652147 2555216 2446053
14567 2446053 2252039 2623010 2433769 2368799 2250158 2692798 2619994 2890127 2862317 3009195
14557 3009195 3269769 3584742 3300493 3384336 3961016 4500630 4789050 6005740 8048536
14548 8048536 11700176 20355078 40974367 50046376 22046095 12163447 7151224 3867696
14540 3867696 2290302 2364239 2404510 2120757 2212244 2220665 2151028 2400934 1959007 2360348
14530 2360348 2201464 2162258 2583386 2561231 2678172 2353485 2419415 2214655 2527568 2515117
14520 2515117 2549900 2663865 3017525 3132412 3111963 3203482 2875370 3261069 3282678 3141813
14510 3141813 3453899 3181369 2716394 3112396 3133761 3353515 3346266 3516345 3108358 3384436
14500 3384436 3281721 3502135 3439797 3938548 3682668 3696353 3599720 3605802 4005235 3734635
14490 3734635 3796500 3848520 4037541 3940234 4168619 4272255 4248144 3799260 4317440 4065436
14480 4065436 4251532 4402314 4083647 4469227 4423413 4240724 4576367 4781798 4269677 4787872
14470 4787872 4683881 4530357 4891578 4923594 4980434 4712686 4901892 5186091 5018827 5245381
14460 5245381 4956737 5536626 5317427 5524364 5513589 5518111 5309110 5873122 5878014 5779306
14450 5779306 5961739 5896715 5807976 5975745 6309752 6235678 6261563 6220714 6543411 6571054
14440 6571054 6415604 6949377 7053054 7111862 7050643 7078218 6883808 7355875 7416898 7368314
14430 7368314 7560195 7812360 7825351 7743555 8227629 8432660 8204174 8442511 8811552 8778367
14420 8778367 8778124 8868199 8925317 8877824 8860373 9671084 9548641 9515909 9733785 9561361 9794349
14409 9794349 9880474 9827277 10305470 10600541 10647796 10903084 11097568 11448141 11012477 11757231
14399 11757231 11749557 11899031 12153122 12151448 12398249 12524133 12955885 13127887 13108513 13553675
14389 13553675 13664277 13990078 14071756 13993530 14646790 14798214 15228772 15839774 15556014 16211456
14379 16211456 16135675 16532190 16702176 17051041 17582160 17912396 17968467 18573092 18944321 19054836
14369 19054836 19613124 20002115 20306964 21068768 21084780 21700858 22313516 22756705 22935195
14360 22935195 23778501 24282045 24585517 25320760 25993485 26201152 27017535 27354016 28282046
14351 28282046 29196132 29716898 30465657 31217941 31982884 32576997 33381274 34661249 35396920
14342 35396920 36072771 37099318 38334945 39539797 40343175 41668607 42711551 43949222
14334 43949222 44963170 46670519 47960451 49212790 50637565 51983613 53670227 55332678
14326 55332678 57337624 59240184 61292939 63287909 65207068 67514422 70225184 72627495
14318 72627495 75077194 77656562 80754611 84178005 87017763 90475679 94067583 97743186
14310 97743186 101690749 105819887 110132893 114931055 119673560 124925145 130241911 136239647
14302 136239647 142308440 148808548 156160978 163305213 171213353 179065464 187969294 197087984
14294 197087984 206687788 217124880 227695087 239331307 251104440 263255529 276468654
14287 276468654 289717834 303730377 318165671 332596803 347677063 362340703 377310961
14280 377310961 391891833 406193925 419810881 432394576 443706411 453646846 461218793
14273 461218793 466196803 468668056 469658567 469349158 468110591 465083782 460569451 454488218
14265 454488218 445976752 435559619 423631941 410893556 396903681 382074514 367098587
14258 367098587 351982404 336880857 321904029 307169189 292757780 280493793 267344330
14251 267344330 254529149 242234938 230714524 219614986 209269126 199092352 190102972
14244 190102972 181366754 172877732 165083961 157474953 150162053 143686149 138099738 132547427
14236 132547427 126453269 120746019 115965825 110950090 106743566 103190952 98987417 95227921
14228 95227921 91418884 87820923 84329307 81525017 78341550 75698684 72966115 70682385
14220 70682385 68400641 66097892 63784038 61558268 59701388 57794636 56024160 54607187
14212 54607187 52848740 50982952 49831639 48085423 46931421 46326832 44659558 43382161
14204 43382161 41995865 40720974 39652873 38741282 37963099 36547763 35998907 35254602 33755399
14195 33755399 33138855 32250253 31620743 31050543 30149799 29190455 28730666 27883603 27394519
14186 27394519 26663879 25996486 25371369 24872109 24004214 23942830 23354808 22662357 22173571
14177 22173571 21909160 21338849 21221130 20617779 20316985 19964075 19484694 19037500 18626970
14168 18626970 17995238 18307122 17555475 17594249 17018945 16926573 16339885 16296408 15886190 15635928
14158 15635928 15292165 15119281 14563354 14311626 14286662 14161514 13961409 13665561 13278081
14149 13278081 13074977 13018821 12730192 12412116 12379013 11495724 11692632 11727212 11437268 11237446
14139 11237446 11109694 10913277 10855094 11027806 10510697 10104192 9975773 10164374 9785387
14130 9785387 9467848 9456180 9597411 9390787 8899960 9216951 8937073 8863593 8737704 8445637
14120 8445637 8478332 8543396 8298922 8416792 7922446 7937246 7889801 7780159 7672420 7631035
14110 7631035 7228705 7340309 7219131 7161696 6857119 7141776 7244371 6899575 6841733 6670466
14100 6670466 6392986 6481175 6445034 6324300 6423773 6463957 5857937 6010258 6171154 5758556
14090 5758556 6041472 5884975 5685849 5421269 5595637 5444562 5340054 5382401 5340789 5534232
14080 5534232 5368593 5483351 5062317 5111613 5068906 5067479 4983650 4706241 4689636 4756447 4878416
14069 4878416 4693191 4990948 4460559 4402584 4544768 4546683 4306894 4391338 4243730 4592355
14059 4592355 4349738 4540410 4666800 4413854 4216605 4272545 4050125 4073591 3960506 4091394
14049 4091394 3949565 3581421 4063666 3966431 3624493 3887543 3714748 3692818 3435105 3196291
14039 3196291 3584932 3692356 3502205 3577032 3365682 3434389 3452449 3519758 3371767 3542583
14029 3542583 3405395 3348961 3564910 3355517 3031709 2922698 3257282 3152623 2888548 2751867
14019 2751867 2639351 2931144 2933487 3009378 2795230 3068035 3062028 2811194 2497836 2804064
14009 2804064 2980970 2703842 2277093 2725364 2414909 2456871 2265529 2375233 2496301 2538171
13999 2538171 2245266 2452264 1980560 2015716 2434645 2165867 2387958 2325307 2490115 2817068
13989 2817068 3795025 6096164 12707780 31855311 52570452 29088110 14501358 8740100
13981 8740100 6195421 5553042 4363116 3962597 3461416 3507438 3151185 3465934 3046277
13972 3046277 2874676 2825166 2995886 2777787 2853130 2949337 2627112 2564838 2823183 2678358
13962 2678358 2693904 2645050 2229746 2310863 2113319 2409386 2316316 2253539 2139139 2255017
13952 2255017 2319895 1907626 2095737 2207198 1780298 2347813 2176921 2089145 2111009 2044467
13942 2044467 2109081 2115822 1916718 2388675 1907887 1809107 1813030 1923394 1872495 2147533 2335584
13931 2335584 1939875 2026623 2071123 1776166 1728019 1428044 1667737 1563327 1790300 1713877
13921 1713877 1566848 1681113 1535518 1608415 1685858 1800128 1535442 1584529 1772317 1319605
13911 1319605 1872360 1662498 1536810 1740918 1499880 1659281 1493600 1639608 1759044
13902 1759044 1463127 1272836 1198166 1725542 1344786 1491875 1254650 1742360 1105652 1431117
13892 1431117 993917 1231663 1455152 1351080 1355515 1486250 1467607 1000463 1587744 1698138
13882 1698138 1041971 1547548 1221667 1351376 1380833 1185732 1324025 1480630 1070105 1254073
13872 1254073 1312217 1003749 1153670 993638 1181397 1363772 1225157 1144043 1090028 1196822
13862 1196822 1112508 1266043 1249676 1026546 1037025 1085909 1500082 1175578 1085336 1025160
13852 1025160 887961 1384840 1557850 962729 992442 1165105 935236 1331436 1243691 1392560
13842 1392560 1013359 1468244 1024685 772208 1103632 1087088 1103998 1254441 1216544 880764
13832 880764 1205643 936894 1084171 847101 1038556 1317296 1028382 1072921 1109652 881361
13822 881361 800915 946791 934498 941654 960468 1041511 983508 941780 840010 1162082 1050897
13811 1050897 775850 900647 1029013 722804 847372 974140 406611 838133 867744 831012
13801 831012 849416 1016736 1092785 982202 1132801 891779 973135 1046228 1014467 943284 739239
13790 739239 1114505 947993 867638 960188 613307 877403 855964 638082 906264 793894
13780 793894 494701 1147488 746552 1168102 648998 618457 617902 901807 1090240 630080
13770 630080 991028 893727 657549 789498 429540 749111 499903 776132 875370 476802
13760 476802 1034959 484883 980105 557268 846335 956236 801337 797178 644079 722248
13750 722248 639464 933293 740944 492533 706570 509425 563261 599561 809762 872405
13740 872405 1019328 868562 1002539 625797 651540 617301 636409 459789 566134 673939
13730 673939 694491 939612 648034 174832 770939 429081 592301 847423 860112 772573
13720 772573 538175 415759 1084280 866580 742157 631833 711266 611684 511209 520045
13710 520045 221353 564367 438676 739692 472760 679045 766188 617261 734292 677775
13700 677775 532912 506470 605127 618860 760350 657510 401432 519607 493017 909033
13690 909033 607242 626365 527266 564312 343998 507629 374809 599732 649664 504052
13680 504052 585260 445536 738606 427587 406516 760827 207717 270810 503978 545504
13670 545504 395125 645140 893455 714788 725067 568837 320441 667112 315595 564399
13660 564399 372069 469933 563525 722839 327616 274349 181486 341935 643116 408540
13650 408540 314980 615193 500297 552801 204263 565555 707313 676886 380903 352087
13640 352087 342969 429484 527194 616366 467292 678340 140374 479344 615868 601034 296652
13628 479329 470557 380046 543995 490550 585204 327465 240569 524551 718315 528309 562087
13617 562087 548551 224241 517528 538295 256038 643565 364193 519555 371241 40905
13606 749111 468784 495874 393105 182082 437092 569385 126256 538249 373451 629558
13596 629558 289837 579911 337188 507890 190083 446567 327068 217414 238933 432186
13586 432186 560645 651879 605840 573339 564306 455866 237210 -20841 559068 282075 422561
13575 422561 534686 565841 564562 331769 348140 508749 418849 600324 352745 483844
13565 483844 334072 333371 397468 507725 318742 401340 635875 73268 184316 274808 296163
13554 296163 450360 326515 477996 861874 224497 382863 53340 589651 294770 616501
13544 616501 357054 218367 153168 273073 206423 303745 262887 696575 131315 411887
13534 411887 461887 348891 360458 12717 329674 465 262925 307073 124448 247547 285734
13523 285734 576285 322433 121185 58655 200799 513462 377359 460206 408908 256400
13513 256400 151439 274129 17567 353848 311969 178583 266706 594779 370741 270240
13503 270240 458247 461629 246550 447625 98872 335986 322558 264891 537325 269006
13493 269006 394175 1650 297799 140017 302171 -54090 173925 507904 392217 439687
13483 439687 157215 485419 -183444 464068 283155 196161 373116 657256 230129 370143
13473 370143 256468 256065 104834 312176 146708 132734 269950 292387 366910 59988 525979
13462 525979 152299 160996 121873 300956 -81259 292846 331289 449939 129103 147670 146934
13451 146934 106380 379517 175953 117323 27304 360691 152336 267524 486405 403595
13441 403595 152782 202421 153338 -64029 201722 390223 248579 24918 269298 517538
13431 517538 147573 187551 177548 125841 174009 149003 248916 186917 362080 2841 116966
13420 116966 273153 252706 96580 29452 581124 293123 645389 24831 480292 375571
13410 375571 3095 208907 69355 199106 205130 138975 417374 154967 256404 98633 403280
13399 403280 231738 272597 101489 238546 420577 388086 36345 138207 39757 142232
13389 142232 738604 276233 -99190 -155640 257967 329506 -14381 -48266 251096 25805 182046
13378 182046 318515 168574 354121 252987 128709 557587 390260 344893 310461 413246
13368 413246 379070 337987 78703 165510 271426 292521 203584 338157 29042 200246 -60910
13356 219861 272240 234306 246667 134775 226096 315327 84894 236623 286943 310648 304018
13345 304018 380755 348503 656259 38931 172696 498226 459162 70485 185639 128426 370840
13334 370840 92792 366155 229499 340882 97963 636345 20940 89339 194186 14791
13323 259984 408432 346293 102244 257186 183050 231045 162053 50157 330039 47438 223713
13312 223713 160413 339707 5389 351375 -87917 464088 264029 385790 134948 91486
13302 91486 565034 -76801 151369 430405 583122 216034 202822 92091 282383 318345
13292 318345 -69092 195308 124686 -199791 -232059 198998 288448 22940 95341 198041 3148
13280 334684 349951 15205 -46674 58028 5842 301084 -160707 296774 152770 161093 -45879
13268 115751 -243768 330827 440061 38155 83976 431557 231274 125902 -9343 195442
13257 196968 345465 10610 41661 96671 305426 247069 -136273 -30883 -65905 118440 -321947
13245 -31192 -98603 125758 194733 58391 52434 -157793 109307 55805 46498 120591 33030
13233 54246 67569 176059 51029 245672 195447 191935 -61750 146790 53780 78779 -193088
13221 347764 23893 119819 94658 227134 -67913 55977 173543 174311 36946 43976 7454 121972
13209 121972 363726 86169 225458 -169155 130292 1409 371421 -57961 40295 -80685 59449
13197 61676 630210 335916 40427 480428 166556 -21503 58355 213938 215325 97955 -56387
13185 -24482 -28663 211148 136583 426648 92450 -28928 237036 86043 126239 -360941 306134
13173 729651 -25785 225955 419187 183694 181672 -56014 162429 150549 158321 -29225 345635
13161 331232 74219 287753 142463 239535 240653 20054 -113998 68524 241341 128769 204202
13150 204202 150758 110043 153984 182808 370936 403081 117699 8052 104182 73985 -98274
13138 41460 -31457 111308 -166825 -88612 202222 239027 93654 -243877 -149900 -159182 19966
13126 -67644 206695 298371 -61642 131044 391062 -431151 -184903 133233 215474 213710 66600
13114 368789 -17267 377048 37479 244226 239162 -221878 157272 136043 335203 341232 131669
13102 123188 280906 61484 148 -70646 -70543 171460 161060 -46493 -185010 157127 -16648
13090 132127 -69338 -62237 -3409 80182 173103 395043 -73818 39957 20189 4729 336289 118197
13077 426613 294712 47942 19516 92936 218714 179510 -307524 132026 3059 -182094 15962
13065 49403 -69618 164996 -97303 -6288 81271 239145 141666 92926 -72323 469682 29112
13053 -146039 9314 138836 22000 151236 -20397 84475 186191 225200 -96978 -137071 217734
13041 187196 180173 132151 -210977 516243 -197775 40454 50151 55478 58980 -208017 213938
13029 356666 -128204 189866 156301 37233 111929 300627 77473 293712 -153298 401437
13018 238838 103695 454674 274174 -155659 247736 111330 55421 -252776 -65022 -126415
13008 -126415 -19716 -107623 -95358 326686 -169472 140798 267013 244823 75608 -487848
12997 174379 346912 61674 244393 495251 4953 186280 15236 -13759 55527 263249 -141286
12985 -32863 84552 -149494 45837 -264886 38576 33262 77163 81936 24492 -71589 3028 81182
12973 81182 -118779 92268 -34862 154156 93055 74088 -98636 138527 246848 120957 -247187
12961 -9576 357366 -122218 247129 169279 205253 312008 -196749 10102 48571 -22067 255298
12949 47320 -62320 -217867 -92082 562646 -9156 317166 71157 212484 516924 -377002 16473
12937 -41020 -49333 62271 177053 135513 384685 -38324 -26704 55326 -300945 25612 188192
12926 188192 6674 207638 433512 283254 105413 193164 -35182 163594 -79578 -315343
12916 -315343 286052 458703 -29253 132268 -52895 263993 -68210 -406686 -106479 97942
12905 220836 170098 178060 28895 -73562 211180 178331 108428 178416 -86456 20552 130348
12894 130348 13191 342553 238835 -3500 167430 -39841 74931 90546 31642 140 6600 -7088
12881 -256476 16289 171274 -162527 193053 18520 -10297 -49814 39579 -26153 -94848 -188075
12870 -188075 70469 -90274 17080 305842 98695 175431 105889 -46779 335914 304380 34630
12858 319350 -103997 399136 183420 171778 3299 54633 60143 77790 724193 -32483 -198731
12847 -198731 92268 89115 214894 -290213 -94154 -89784 161259 -56807 -83566 268674 -111952
12835 -187591 316918 16508 -44187 242857 -148548 -87379 -175090 -398184 -41343 284809
12824 168189 -316124 269505 84388 -157523 42909 8636 -207697 -33250 230040 -44438 190439
12812 145950 156787 -23434 38953 -312450 35027 121898 149841 271652 -282651 113127 -74794
12800 144674 -81371 -65157 -345758 101945 -299215 127515 -93152 -224317 38695 16318
12789 -207647 41877 31453 255875 228710 132325 -233244 -6783 -172437 149384 -320506 -31900
12777 -24332 45866 131016 229437 -264692 -157395 169013 144409 5597 58293 88113 -106677
12765 -142683 -118672 -108018 -315097 -109476 30547 -26722 37345 167594 456438 2195 -103352
12753 -53176 393943 -118463 -91535 100391 164758 -126903 -84753 78289 243879 300116 141545
12741 88477 41055 -140195 129266 32659 -66171 247728 49697 -43926 14479 688433 65138
12729 153425 380287 -10808 153625 -352466 24053 9284 -59025 -18273 304207 -58498 35056
12717 -58798 165365 343395 -29149 44215 -330490 168943 -90050 4556 88474 102187 153904
12706 153904 269612 -174895 -27175 145607 230610 226655 389911 -70427 236743 -147997
12695 -13839 240422 79703 155339 137058 -184128 -40329 146256 220877 -244365 -7224 108874
12683 289373 -63542 -288066 -22990 -410480 107541 108826 -39246 -67186 -50673 221900 240597
12672 240597 -34019 5991 378433 -37008 191526 310483 175395 -247588 313613 -134383
12661 243755 -288725 -20714 371100 173106 208681 -31726 166535 267695 -73390 -52862
12651 -52862 430594 170100 43859 317519 20016 471644 -39542 -320713 -149834 -366259
12641 -366259 207796 -240531 126803 -26042 309825 -39072 -92534 -129325 87562 139658 490259
12630 490259 33268 219894 -15288 539875 39297 303221 -92582 329973 -199172 94509
12619 -72935 -115809 369199 -176257 -15144 203652 -183816 -31733 364991 -192171 -20468
12608 52786 134914 -123462 77406 101135 -1627 186633 -188663 188115 77093 137159 46201
12596 283392 90490 13284 15234 83441 -56087 57746 98378 -125020 307528 56892 40696
12585 40696 18552 -275810 79185 -104539 68046 -36025 -7840 227957 -104067 174674 22732
12573 -330678 -158968 -129172 134026 256185 -28678 -335705 -4872 -265237 -149931 -69515
12562 203827 77125 79651 -232646 -36604 -37088 50727 210051 -456353 131593 385845 -31736
12550 -89506 -16354 -131877 13976 -126500 -75087 -182991 77562 -87228 18833 -51234 -331339
12539 -331339 -149672 389133 88519 51881 12559 -153730 162982 -299092 168315 120202
12529 120202 -33722 -24186 -25399 91519 -1558 111033 237511 -46422 33075 -177646 -154574
12518 -154574 129724 269722 -101842 -7341 229882 68329 345614 -65932 154599 40478
12507 62286 179133 -40573 169634 22134 -134970 191630 24546 -15020 125926 -24600 42243
12495 -34150 -146389 -129690 237405 443453 35181 -159797 -227841 258729 -126494 149499
12484 182491 78452 -121920 76327 41719 -91147 90390 -268984 -101993 -157842 -13348 -32586
12473 -32586 57178 99559 696878 35131 306689 13120 -154565 6677 -74056 313814 42234
12461 56906 171455 242513 -19853 287775 341799 205323 -83585 -143838 128997 52861 236025
12450 236025 -200652 14360 162269 -154889 -10349 -37609 128586 24906 108091 -281697
12439 351222 185778 236242 61659 -45073 1344 -13791 11754 -112501 -30806 -4695 214738
12427 -193421 6610 163179 209738 -172519 -17144 -24239 -209671 -46155 -46223 192245 -41465 -104325
12415 -104325 -91367 142229 162717 274170 208169 -158728 -26598 44788 81364 39734 -48655
12403 -132872 174898 122181 -37822 -1493 177445 136844 -14909 -157895 -63511 -222796 -64633
12391 -158144 34553 291749 226681 -83485 -105094 -56563 34989 246588 -55377 -154721 141941
12379 -46772 180744 51638 178737 367932 -208186 -113941 -166767 -62698 139321 -74282 228724
12367 -47859 166281 -255375 -736 -141445 13442 -35184 -81589 -148858 -180550 -160228 -207554
12356 -207554 115603 -67489 135342 -181081 -8458 -56844 250546 -411172 80274 205518
12346 205518 143001 204785 -38227 325357 -21465 -36194 237376 21284 -110950 -25170 48836
12334 -78812 -165761 -734 116414 -173589 -129820 -14302 121391 197113 238031 111290 -132778
12322 -144326 91910 235024 94562 -91448 120511 122401 17075 74924 -299142 -221630 170663
12310 116874 36701 157446 61654 23044 -16543 101406 -111023 49425 -182512 -75755 55574
12298 -72789 -132076 8062 -80301 -208768 -197161 -200666 120144 -366891 -359031 11220 62687 -198865
12285 264257 109221 103912 28542 36186 25411 -150013 104705 -358468 338335 -119279 132918
12273 13114 80697 75518 114877 170173 71267 230552 -180024 -32262 -103794 11252 -191373
12261 -47178 -5828 -8989 181458 -326554 -253925 -324825 -38119 71373 68742 -254627 -325695 162164
12248 -7123 -124968 40066 -17953 200091 219776 18098 46186 -132945 274474 249548 204179
12237 204179 456562 -114793 209426 122524 245844 129123 -105466 104718 36045 45687
12227 45687 160254 80326 420201 -219444 -19046 303020 357711 -96172 58204 368946 112631
12215 47951 318871 269075 217746 -32687 78236 -153227 -60548 172210 84637 80147 116228
12204 116228 -16080 -40547 212022 154078 195371 88632 6845 74796 83162 105403 426818
12193 426818 424146 246584 105390 344175 478150 363274 -137374 -29748 45022 107861
12183 107861 156545 -38187 -69036 48557 -94238 -26912 44881 10053 113605 213497 156894
12172 156894 40600 95960 213967 144562 64021 198293 364657 176819 326338 -122300
12161 -81417 310031 365016 63756 288449 -117779 -39734 216335 -10558 -111508 380521
12150 -152290 182933 -71207 5998 -189128 120986 201572 350778 -28008 188743 -446964
12139 231389 162347 33825 214890 185669 47541 -294255 50095 -32937 36443 152881 128489
12128 128489 38178 135326 301099 37911 152010 -107548 -100582 41615 50293 -189141 359708
12116 -25646 -21758 -149913 144103 -42486 303556 -434720 -7975 214031 20398 -192483 338634
12104 347529 -165646 164735 -1057 404005 -214567 397205 -27094 -165728 201294 80013
12093 -7546 -348268 158963 -388580 -76196 -54446 -362408 -61262 -198970 134012 263215
12083 263215 -176112 101260 292265 -222078 25701 270189 -14016 353209 -106734 -46193
12072 -73790 -201610 41302 -21695 93933 -91995 -155196 117546 908730 1722523 617995 55979
12060 -197694 -53247 -229855 207006 96066 -208582 -195068 66948 -171788 53112 24253 -36483
12048 71045 -125894 170065 -198053 198149 153242 -284524 -77477 -266843 -14213 -58755
12038 -58755 266972 18839 -6230 -19990 -29036 104885 -35836 -2945 98144 210422 -196380
12026 15594 20211 -107559 -163654 -200924 -58760 100008 -310699 -63843 210648 -8703 147959
12014 137543 -97280 10729 -268036 -34374 -49981 -27996 -119560 -129176 302870 -218443 101841
12002 -77570 272138 -540943 -108975 173800 -1120 -208755 86704 75454 31077 300902 -160928
11990 -374678 -245628 -191501 165128 -260620 -1301 125533 29890 -20578 -74440 -204385 -138480
11979 -138480 -230528 -27262 136901 106711 -166361 -221353 266822 -99180 -115094 -134432 -16454
11967 92114 211497 -123268 75093 142128 -169089 -121461 292685 80190 -184870 -216292 -132760
11956 -132760 33228 46629 142926 94808 -14426 10521 -201353 317293 -273310 221562 -67179
11944 297215 -60597 26714 -199955 -29746 -126150 -197410 -88408 33410 -235659 12891 106591
11933 106591 -349290 -153144 293086 -18468 -132929 258794 -176574 -147191 -114368 -45669
11922 320473 -24964 -263168 77182 -85023 375508 -74007 -179676 133031 -27106 182537
11911 -2246 200131 148676 -258020 -112020 -214076 -261455 -153608 -156238 -336395 48947 -47608
11899 59922 42690 154881 -167809 -101306 -64735 241991 -139003 -128957 -54090 -287348 -287040
11888 -287040 81854 81868 8577 -283233 208912 -171579 67365 -154456 271774 102672 -66578
11876 197277 101641 -185471 -49687 -425438 175344 138341 71577 109916 -234 10601 292347
11865 292347 74147 86063 -69093 49198 -130477 185042 3246 128704 -60897 -11226 153843
11853 -88838 191363 133036 -141188 359249 21102 233277 -61586 373411 -58959 94828 59490
11842 59490 169443 -65805 -351 -69559 19281 71288 66995 -226715 -100182 -75773 -325921
11831 -325921 94760 -1902 -95138 -227833 -47652 15963 -80240 102315 -295643 208885 198120
11820 198120 -192501 -73017 -60688 -155033 244650 -207807 -23388 106595 36717 58865 -170842
11808 -48766 -116367 58956 57447 -38924 93820 106218 209439 -193300 65068 -363549 -6120
11796 188621 150787 -183067 54615 -82485 75884 41415 -311140 -19170 -194215 53236 -81266
11784 6452 -52878 196371 23177 -172587 -66162 147008 -117308 58568 -141774 -110328 -311497
11773 -311497 -164303 -169011 -388206 -82176 -27763 -174679 -116120 -45021 -24344 -248155 -46141
11761 -33090 -207540 -230657 -357370 -212783 173672 -313403 -10986 566 60660 -46288 -139608
11750 -139608 -117388 -301515 337518 71970 913 -144590 80269 231045 90071 -227811 254874
11738 -153736 -255865 -122574 -98429 380132 34541 -24110 -178500 223837 179560 -16261
11727 109272 -92862 202819 -73490 -249325 -25378 41664 39812 10154 -212053 80401 178787
11716 178787 -164290 -239628 36168 153811 197183 354606 -26829 -997 22833 -14087 -127144
11705 -127144 18216 91051 -68493 -405922 248764 -208515 104892 104944 -220904 72334 -75380
11693 -191112 -204102 -253492 215782 145961 -363 101541 194079 37032 135329 308149 -97486
11681 98458 107293 -126304 98662 56652 118131 225228 378674 -9937 -88036 -84622 249876
11669 256688 287245 183167 202737 238914 -72504 -51692 -82581 -56991 -14770 112516 -240629
11657 126929 78272 -49213 -256090 -21421 -220915 250064 -34028 -175638 10740 124948
11647 124948 -207706 223063 -226098 -50709 -162345 36485 -97515 279516 68832 230935
11637 230935 48844 446121 -144255 206915 -266272 -48673 -170777 180541 -129386 -255474
11627 -255474 49212 114689 -240186 53613 115431 200873 -4974 51125 5280 157885 -121389
11615 247263 5669 172186 -94378 340403 61747 -72575 -366244 -192467 -273631 -136213 56712
11603 92618 -47870 119440 102456 29554 -35525 107958 -215769 -138763 -205711 94943 315315
11592 315315 213073 104721 -124220 -30370 37249 -126113 -151532 88073 112676 65680 -97890
11580 -2038 -164065 144005 199297 -66754 -65208 252231 -86475 117079 71561 288923 -134744
11568 -140858 -115333 30363 223373 -117464 -72090 269731 429708 -302706 232961 86328
11557 -186831 -80949 202966 196596 -103329 141266 76721 -273830 -60405 -93682 247969 174322
11546 174322 128445 -121073 144696 200937 161766 59960 125926 169435 294299 -287583 -234905
11535 -234905 -153846 94647 123207 241508 137208 -59974 1353 -39270 320652 51515 274414
11524 274414 125976 177988 367276 -123418 177218 -89609 26694 150742 11731 211893
11514 211893 325861 188379 183535 -129491 114178 81047 103154 352759 -270147 -41401
11503 82678 383216 -283399 -55041 29058 38964 123268 47385 -24226 33243 111570 -94037
11491 338252 162424 -3155 88578 163666 105207 286103 83105 339740 57251 277178 193542
11480 193542 98308 263021 66648 -88940 -58189 326155 241924 235513 282516 60749 90879
11469 90879 -42231 150693 -93424 -339613 3378 -172127 41825 185406 34359 -91913 48551
11457 -164123 310691 112215 369959 173218 -91062 300064 36345 162489 -51837 -196340
11447 -196340 -12049 -423599 252497 67910 -340506 -460582 -144340 -33219 -86838 62615
11436 110364 123881 141589 210410 47587 265348 106523 361250 321871 2325 214774 247153
11425 247153 -12471 -171772 -120912 93237 -333420 64384 22609 131545 270420 -166333
11414 -313633 -114482 -228025 109329 226210 -289949 -358848 -498484 83269 -86096 -239786
11404 -239786 60553 240584 18646 -50724 111342 78211 2833 11923 -39818 -202355 -124159
11393 -124159 100519 -2859 -278557 52454 26627 263344 -35672 50174 -13611 292071 -233630
11381 -163660 -194797 -275861 21704 -88502 -67760 -64888 251084 862 -14794 8962 -129682 26998
11368 105083 -143815 69999 -77673 146028 -42178 67464 -30040 22195 4047 -206847 14966
11356 272949 -114192 155137 -458180 -39287 -328786 321703 -321531 11365 49598 -27076
11345 -93356 -293679 -279965 -86926 -22709 -38761 -216775 -40372 -177948 147752 -287430 -71783
11333 261933 91973 267132 111723 18641 126761 -127251 93271 -129938 148790 143256
11323 143256 -107628 58213 -80238 -90630 188441 -137424 185976 -177780 -25115 -127315
11313 -127315 39817 -78899 -111274 -62434 98381 -65366 -7338 -48361 5668 194891 -39798 -12679
11300 -128038 -138566 -43373 -310143 41565 -73768 48261 132904 113909 -144216 -122698 -45325
11288 -198154 -167247 -31635 91065 131712 171394 -145145 -61557 -295202 -103806 -157211 -185718
11277 -185718 -43801 -177700 -121781 85781 -4978 -91040 144537 -20117 -92113 149653 5765
11265 -121933 7550 99611 98978 -181740 182893 640516 -41566 -149396 -181074 -332489 109190
11253 30812 -117850 55947 126383 -180651 -148093 206241 -143818 -121097 -115711 109072 113896
11242 113896 -8707 -126194 -86415 -21615 -25709 -318409 -89250 -460829 18112 -81716 -203680
11231 -203680 203187 47801 32538 -155287 171357 15818 151093 -29147 -149295 -201610
11221 -201610 -368378 91041 222541 -248860 46454 -89610 -107537 -259178 -88932 -9456 -16173
11210 -16173 -160659 70792 -78162 -7691 -73301 61050 35249 -68919 232349 -29295 -229429
11199 -229429 -246609 -349748 11079 275511 -50826 114075 -483415 -134964 -19773 -191603
11189 -191603 261795 58108 186733 -128973 1306 180493 47742 213472 -29647 -28080 -21356
11178 -21356 63770 -163300 106632 -122213 -162633 -53541 -191102 -85702 -88485 53129 42352
11167 42352 -250325 31595 -123346 -142458 106574 -100276 54826 263532 -121155 1849 -139225
11155 27141 76009 -112296 -232671 -86548 -100519 -78926 -248661 -177530 -51993 -16723 19069
11143 172622 222815 -83108 239624 52694 53849 -86087 -136682 232508 9315 -5251 -2621 -168140
11131 -168140 24850 -79132 218363 -64122 229902 283328 111281 140229 238702 -52361 -410880
11120 -410880 -2358 8778 24483 -203757 166238 -62786 -149336 149057 -73890 383781 84766
11108 55336 56481 95069 120191 58504 421218 293053 -35853 286630 24452 568503 159796
11096 173318 566655 120839 -148267 115024 7446 143862 228931 -42971 -395222 355762
11085 16737 329170 233501 184215 414877 25593 288711 -180392 427261 262809 86118
11074 494238 8752 -117055 314564 318241 107711 55112 549259 -70027 250066 358886 102204
11062 144177 405719 262560 567753 413011 506233 420390 395646 384667 484096 915693
11052 915693 663513 420150 546999 729107 498278 397405 532355 553294 641740 539301
11042 539301 884612 716202 851426 764906 821019 551412 257088 751740 764270 842090
11032 842090 762667 382287 451361 636085 497489 538549 564842 765479 656667 564466
11022 564466 536116 714834 745599 852852 619659 581265 654066 217838 461183 760147
11012 760147 471550 617001 740931 255878 446839 412346 535672 629433 500655 524423
11002 524423 547892 876183 718169 733106 788793 672417 581823 479399 554532 571048 573063
10991 573063 878384 479901 675132 817772 847494 543301 872087 663498 1008778 743446
10981 743446 867270 1166422 854263 877152 1645041 1437411 1521337 1924855 2029489 2451282
10971 2451282 2620406 2609283 2619400 2440880 2109734 2120885 1625357 1248218 1459011 1333460
10961 1333460 1399947 1459064 1578236 1467632 1458133 1612659 1545915 1210067 1227241 913344
10951 913344 920871 859203 530457 658023 677059 508650 299519 247905 321476 378278 309842
10940 309842 -52848 164832 355273 28512 322515 -113383 -60121 317744 318766 115724
10929 283724 251115 212463 294398 -146909 3558 22628 -171780 62079 -14764 62638 -179831
10917 66733 401304 134156 471309 62222 238 7791 -48616 -104625 172 -67802 -104993 194988
10904 107707 321185 -48285 -95358 -107668 -28879 -97514 -352379 -104233 -258809 -31957 43431
10892 -200614 -39065 58236 -191223 -4280 -36424 156642 -120815 -28983 112917 -136299 91317
10880 1884 168699 168676 -133309 290111 233869 -218554 -61289 -196377 -51333 20377 -96914
10868 114532 -293166 449507 -31335 -343278 -174367 -40068 -60079 40337 16993 -156612
10857 318129 -94927 -15316 -54050 218664 -21037 -133277 -56429 -155514 -201570 125155 111157
10846 111157 23240 -102799 -146971 111485 194359 -23385 165912 -20856 160316 -161898
10835 100895 52075 76769 -131011 -115404 -62001 -121313 -243937 31065 -107554 16118 -187998
10823 70126 285521 136041 -145145 58855 101435 -45248 313010 229503 -107873 -19484 55603
10811 -272645 -214308 1808 34778 -96185 -59682 -29847 -9560 -37524 95468 -470799 104216
10799 189301 -171136 -55501 -158697 15656 -138934 -13479 -176951 19990 72294 -385053
10788 222291 -282459 -68021 -136462 -26340 -311010 -94688 -110986 -54606 -288150 -152905 16705
10776 -130389 -161064 8553 245719 15444 83655 14659 33367 9945 39652 71224 55155 -143686
10763 -135093 -28190 -570 -110545 -98974 -127669 -254991 -157657 17829 -170549 -440737 47876
10751 -114699 49163 -31793 6576 -187540 86609 -99142 46840 -76677 35693 -145858 -252550
10740 -252550 15660 -150431 -61954 -229788 -139371 -221805 -275114 -135561 27903 -345600 -106960
10728 12321 10589 -62851 -27712 -268203 147278 205756 -132912 -82365 -66286 234187 -35584
10716 213059 259343 -59191 52758 60939 -293086 -277860 -48835 -351358 -74529 163790 -10783
10704 89199 208326 353604 345759 -174534 -109209 -229555 153868 38509 312463 -133046
10693 284689 -240517 -156235 -81289 -1 125305 -50233 86439 -258683 400933 -155058 -149364
10682 -149364 225984 147911 -232764 -169402 -136481 -148390 -60238 -172787 -40175 -116061 81052
10670 36455 -150110 6666 -45710 -407239 14219 -493022 -396972 -194695 -199109 275661 64276
10658 -86810 -14568 -255968 -83263 -59030 -8211 -28760 -73871 -209662 -74070 -14915 -41925
10647 -41925 90626 187484 89856 -193157 -126634 -37238 -210842 -107230 -320848 339298 -523153
10635 -171415 -167126 189652 -406417 -261183 55431 -17248 -216248 28583 -56279 -109481 -60935
10624 -60935 -126230 -149915 73217 -147124 -57847 -251209 15045 -91367 -161536 -109512 -212612
10613 -212612 163884 99220 77866 28372 -11308 -293276 -310645 400605 -47127 -101498 100268
10601 -41418 -193358 -21950 157147 41765 -14638 86892 216214 247188 -172782 -142793 -62350
10589 62819 25537 94772 -18753 -99782 -44427 115913 -84852 220233 -23643 -251082 -100343
10577 126558 -121575 84908 -162255 187555 -117117 88385 -391551 79383 -50932 -69498
10567 -69498 15803 -491997 101367 -143397 14285 -159479 82213 -221370 -110009 -323882
10557 -323882 661 -124695 -4293 -76238 -86500 -93153 53647 145977 4205 378136 113327 -212055
10544 -12312 39379 28682 -179784 94283 2574 -185148 33078 -5082 -5205 267934 -272580 199142
10531 230325 -143218 -21259 -248177 40127 -289617 -332112 87067 68116 142039 363153 -41477
10519 -108663 47941 -75932 183174 -74407 -20528 109581 -112808 138183 -340072 60923
10508 41649 -260655 -58928 65940 23553 -248996 102809 5234 -110246 -308204 -16179 -116942
10497 -116942 -35485 -181172 148508 -223350 -157794 306264 48326 161901 -211953 -125115
10487 -125115 59656 -279306 297966 -168461 -156935 225740 182965 85493 312560 517431
10477 517431 74988 -337492 32920 -9443 -96363 405623 281141 -165066 12369 -88635 -200214
10466 -200214 -30517 -112196 251919 90917 535502 -193294 -101890 -114771 381987 105921
10455 118882 52938 -320170 -231523 -170193 -265023 348281 -55879 -298746 -34806 -306167 -2678
10443 120368 16008 -408980 46327 -36666 -536591 -157173 -172496 -10015 -131727 246245
10432 166418 -25509 -204735 -232149 129446 37442 -104498 -197799 66602 65495 65881 -325880
10420 -221147 -85217 34508 123411 66469 -59965 72298 139526 -106584 -130513 88975 -189935
10408 -546309 -266412 -51123 -27750 -25248 -10159 -193981 -1605 -165549 419492 -289994 -160904
10397 -160904 -293150 129778 108582 -140740 132930 -233198 232490 214585 -142276 163108
10386 183915 100153 369158 213677 -221483 -462234 -224050 104293 174233 378075 125977
10375 413081 201867 258372 -8029 411881 209192 138583 320372 260493 470421 399429 478091
10364 478091 268139 303114 360948 179653 213381 420172 184316 78686 135196 260782
10354 260782 15315 200158 115092 583907 367218 563863 417961 465376 231871 337998
10344 337998 386752 140759 358881 -43065 141637 235832 6107 365048 39336 510746 -32958
10332 60711 82646 276338 -1839 57724 -81437 120670 -92561 -70440 35370 -97404 48726
10320 -238532 42807 238322 -8589 315302 -6800 110047 -69500 362519 -87786 13414 166905
10309 166905 -127420 358100 -48683 -46131 308800 13388 63837 -122917 -44930 7535 132036
10298 132036 145647 -152321 -425247 20692 -535254 138070 -26462 -116643 -29700 -77788 53630
10286 379460 -21414 -288441 -388578 130309 -126702 -181414 -102093 1938 -208225 178720
10275 -84696 -117329 -60894 -225629 -94010 -85249 50562 319 -177036 147024 161930 142342 53611
10262 -143427 185967 57385 143035 62287 168451 293103 222183 194693 -22265 17752 229651
10251 229651 274006 315406 205894 -3759 83235 -3955 35684 -56146 -14273 2885 -345419 -120553
10238 102395 175515 -23863 -135346 -16490 -103827 52295 49788 67711 167039 -85987 -134025
10227 -134025 9291 222302 -216348 198531 47942 10183 -147999 166261 -82616 -22660 -76103
10216 -76103 119779 -124742 -190316 -25926 -104086 207801 -19383 105316 -213793 128353
10205 -149916 -1869 -5198 -123244 85839 -140804 -33045 -116022 64833 -402981 349776 348514
10194 348514 -202307 -311327 -58043 -158755 58392 -57339 54403 -275620 -91194 21194 -217104
10182 -283814 26364 62167 -4317 235649 109012 -58020 -150016 225767 260423 8207 -56189
10170 -411866 87372 55979 80910 -68343 -47765 -125212 -109737 -101445 -17883 -195202 -28403
10158 -170842 167683 -245555 -140150 -61310 15004 -300729 185307 234336 18176 54239
10148 54239 193033 5017 -113368 -221794 -11271 -365619 -131705 -400550 -321653 -213588
10138 -213588 -370845 -341669 -359079 -121672 261019 100882 -61146 -26503 89442 -100654
10127 1436 -70313 -18835 -27728 -247171 292179 -141280 252773 -211142 -652696 71863 -27479
10115 -28024 237440 -48248 104343 -66617 26540 159234 -180026 -259655 32000 -6773 63977
10103 -140469 -170603 -62368 -166569 -9119 -272565 74786 224172 20363 -113391 74606 43209
10092 43209 -190703 -48857 -131296 -90255 -116868 -157702 -210753 -129340 53240 108207 -213217
10080 -113236 -9296 -27825 -99921 81401 -52879 90728 203997 154863 -15900 105597 -20672
10068 -83646 -107722 46341 297604 -238348 -38053 299032 -223634 -271007 108997 247750
10058 247750 -376622 -350239 -415127 -321210 -48947 -191057 -29310 -234599 -183343 113371 142538
10047 142538 40816 -205369 -225682 225283 -83330 9676 -77479 -12526 20165 59631 -52006
10035 62190 210830 9151 -20168 140732 -93756 -160005 129051 -147944 -12683 238656 -183208
10023 -348440 -124226 131760 41230 62717 89353 -27643 -204637 -205144 -51526 -132132 49405
10011 -40918 151893 187743 -129866 -383882 -254813 -30417 94089 -119373 -221239 -349732
10001 -349732 41658 -161672 185855 -107727 -57580 -279460 40285 -31609 -39089 -257523 595
9989 70604 -377428 -272927 106971 64725 -4501 122992 210513 -325480 252834 177595 224893
9978 224893 114305 -286753 -83311 -468950 -80412 -130268 2954 -22402 -112643 67687 -47701
9966 -67146 118820 -124218 -226865 -28158 51770 -242605 -296109 188533 117610 -14582 -142783
9955 -142783 -2356 130586 -41744 19706 -210371 -13575 -95586 -83851 -31999 -422757 38711
9943 247718 -268059 -96905 -61915 -85815 96896 -329447 305557 -135730 84946 34237 -249549
9931 -60707 -68880 -61067 114083 6008 -221702 -230591 -277985 173716 179347 -303103 -567247 -678957
9919 -678957 -253119 -32982 -221724 2504 -518975 -302803 129678 -200262 -174093 138019
9908 -545713 -500083 -347709 -232538 -243874 79305 16002 -104726 137121 -47532 209077 -21108
9896 -157999 -363118 -62790 -163495 -248359 -171901 17375 462215 64415 -175561 44252 -133362
9884 -53883 -120133 -157058 -47758 128462 -48675 286733 -97422 -402378 -185129 280267 -95906
9872 170890 -11312 -74464 86078 -125989 -268156 45389 -412824 -294475 -103591 -196074 28113
9860 75983 -71049 -307608 10799 -52853 -128447 -214912 42733 -551 -58802 -177705 88659 -184591
9847 16291 -132379 -113362 115889 -131257 49056 116111 -119315 -191935 -254302 -68944 -23888
9835 -16158 24045 43767 -76566 20173 -335856 -227460 105683 -204563 -158224 -259802 -321756
9824 -321756 310225 -57652 111779 -4759 -89708 -67017 -229871 139499 252500 -279642 207706
9812 -389910 -144637 138309 -168965 137199 -517979 178028 176317 46327 -258880 -105141
9801 258806 35334 211972 144922 -256584 -65496 156427 -206099 -147792 -72117 -329932 -50831
9789 50729 -313756 -101330 -221518 -167219 79358 -367926 278409 -310395 -281400 108177
9778 -185022 -106641 -372365 -191585 188655 162589 118120 206228 -174933 10335 -101183 67629
9766 -95515 -143778 -63521 -25885 121502 -131776 -120346 -21805 109020 -45146 -49225 -643536
9755 -643536 -130251 151831 -154928 85119 94429 -126631 -321548 66740 222817 -249725
9744 -490308 -267602 -324407 76589 -98083 183407 108795 66275 -225673 -334032 18432 -135422
9732 -81980 367896 -65027 -119400 -65603 -118921 69294 -193051 19842 29516 -566 -11634 107713
9719 -20150 -136819 134470 -11216 -46553 -77670 -64250 7009 235715 -327596 -312245 -16707
9707 -143581 -74861 239860 -80479 -199841 -208345 17095 -3080 -440950 -1819 -358467 -1924 -10270
9695 -10270 -112645 -230049 -193701 62217 9392 -46350 -46946 192612 56096 -99861 -183933 -104368
9683 -104368 93907 -46944 -122032 -157098 -287028 -189971 -297214 -502685 -195850 -59402 179659
9671 188501 -181235 -158358 57240 -135476 -113305 -226202 -73047 235877 236190 42752 39200
9660 39200 -45316 -204392 179083 -141443 -100982 -51859 -95837 -291797 -77668 6530 175886
9649 175886 -227024 147338 -93029 -87355 258634 293245 150490 -46704 -236952 -319356 -11361
9637 -148831 -214947 -134355 38469 -232816 -94912 137311 147119 211324 23891 81739 139375
9626 139375 181682 -98159 -240792 -102291 -243 110978 -510243 157653 97852 80794 -169544
9614 -89811 -203221 -456472 -504690 231057 -77884 -215277 -319463 -15715 124624 -155351
9603 -46299 132970 -2622 73186 136979 32166 44986 205565 -19747 -265237 109819 7782
9591 -126136 -40085 -330095 -125536 -251234 133507 54485 -210712 -477109 3924 111726
9581 111726 -83041 70935 -174051 -477045 -279750 -179919 -163268 47779 -139753 445612 -53343
9569 68386 25141 -43833 24818 79654 -94933 123715 -343095 -49357 19404 -90438 -153074
9558 -153074 -277513 -172741 56266 -262120 170118 -169313 122125 -290949 164089 -216688
9547 -119331 118637 246239 -311251 100029 -381437 45080 96653 -45244 -313402 -208681
9537 -208681 -380060 280737 -15440 -24413 46614 141107 -47563 11992 -297556 219776 42347
9525 104431 -134639 -50460 -82297 -104564 -245485 -53789 -220919 198790 22596 57570 68553
9514 68553 -391633 -75017 -118566 385153 174829 102734 -33201 -88902 -147985 -120516 86695
9502 -13997 -135045 -201597 -30637 91364 -274826 147532 -62223 -184686 153134 89178 188144
9491 188144 -115006 -259790 -43542 36453 -159523 -147294 -91982 -99128 -165386 -270891 157063
9479 16584 -56132 -496937 265963 -99681 -12462 -220322 182658 -138908 -87331 210001 44373
9467 146474 -230098 -52209 -397938 -43795 222527 -206383 -81375 214348 -582494 -162511
9456 77662 -136876 291575 -352197 207230 -7458 -361381 -118125 -32287 143985 -348387
9445 -136600 172106 9340 219400 79986 -111858 32135 -64288 -153839 -199128 -270921 -413267
9434 -413267 16661 72413 181478 43065 4696 21082 -72482 11386 -6005 -108050 -79455 33433
9421 263409 -282902 252167 -40036 -298595 47250 98068 170337 143760 -181893 -166027 -383412
9410 -383412 -217925 -207956 -49826 85567 19326 72271 -47350 -176058 -14735 -186422 6640
9398 -184319 166389 -70531 -125170 -144214 -310574 -89292 182400 -196957 -99725 81715 -309406
9386 82577 84166 65335 -64381 -124494 316546 -255379 -298455 -130080 -395798 -231079 131926
9374 -420748 154357 -394194 350860 -162329 -24389 -366480 -146126 459596 253390 -80958
9363 -152721 -323955 55050 -231121 -96092 -457578 -172945 -413725 -70848 -107126 87764 217265
9352 217265 2254 -209237 -249804 100535 -56742 -181891 -167563 -112223 -196062 100502 179169
9341 179169 20279 950 57216 -146654 234588 -284861 -188746 -371661 -32911 96709 -192055
9329 130689 290505 -69635 -125101 217056 -126650 -206339 59897 38345 -51992 -83249 -61113
9318 -61113 -184730 -314759 -37905 79864 -135168 32085 -98811 -48086 -235632 -63095 -132525
9307 -132525 90073 -39585 17135 -64769 43914 38190 101534 -179902 357053 -140443 -317287
9296 -317287 -137852 158382 -61641 -171197 -262470 -74272 -124733 -112193 -135305 163109 45751
9284 -343588 -96982 59521 177266 -272911 -341301 -59332 187384 -48885 -276737 -78548 -317879
9273 -317879 28174 -134451 -128328 -22647 18888 -106771 -27341 -48770 97169 21593 -245715
9261 -24039 139151 230613 -182952 154242 14090 -96600 232112 47839 -158476 -297480 -168919
9250 -168919 234637 112988 -322150 -143376 294451 75113 -260963 376682 44818 -57861
9239 -104887 229758 -553158 77920 -30636 -116082 -289104 -114436 76102 11842 -169026 143756
9227 63444 -63346 -66759 179281 159099 -24668 -206769 9161 -232164 -43898 -73088 39071 -75489
9214 45769 -100244 276702 115746 -307512 -149610 -297015 -356441 -138614 -86724 150465
9203 128356 -456169 68079 149268 58506 149436 -330386 -268500 -353992 -98996 -103156 -219650
9192 -219650 -84069 64648 -144257 -12367 431351 -74004 -98174 132776 -307256 55847 70162
9181 70162 13352 -241984 -406139 -27604 -118890 -15054 -236352 -134911 265456 -126133 -365862
9170 -365862 -166997 -327811 -287148 -49895 76771 71068 -124012 -204929 181444 50643 -27979
9158 -109134 5144 19640 -62754 87478 54895 -53409 -82804 -19612 -280506 -100898 112929
9146 31770 87025 262878 78640 -351767 146920 -85349 -11691 -83772 -27283 228126 -226491
9134 -123919 332298 -262071 -15850 -117082 414753 -6964 -73980 -214817 -328880 132588
9123 -363626 -342441 -222667 -54902 -43584 -260812 -149577 19814 -528897 108097 68214 -127364
9111 163678 49707 222843 -299545 -51803 -208848 -143890 122328 339775 -119490 166050
9100 -296130 -248513 -38065 -195495 17782 -219315 -115045 81709 -133328 -143683 66050 26239
9088 -156985 225853 -239092 -160597 -173461 -207642 -17729 -237838 -40574 -70437 99774 255237
9077 255237 66747 29199 -215673 -30725 -54304 -452217 -145084 -88416 -41412 403995 -36683
9065 -238260 -125902 -283082 11933 -77581 106204 -179880 -176068 -121291 286 266427 48652
9053 -140717 -70808 127209 118024 -250386 -34537 -18844 -63062 -253513 -305697 -86214 63908
9041 -8836 -99321 46012 82699 45773 -46543 -391920 -60578 -72568 -333539 -175763 -444241
9030 -444241 -28847 36045 164585 116362 89172 -87666 218905 -96285 30969 -439217 285290
9018 110253 -96271 59341 -104140 -364095 65280 232335 -91133 34653 -227937 -34350 -264538
9007 -264538 -158795 188909 -120346 -236216 -115601 -387887 -2227 39731 25904 -341226
8996 131836 -137635 -80855 1481 -158525 -251688 -245778 -306267 -92199 11567 145441 -92851
8984 -224304 122794 69597 -202709 53336 -340968 94847 -145393 146130 -25565 239467
8973 157519 34642 37386 -237944 -391098 -52822 -51276 -86015 284514 -8701 -114013 -287364
8962 -287364 -379719 -397899 -295046 -192926 -66 120152 -99850 -64676 70342 22115 -63845 185614
8949 12432 -316060 -47487 20432 33000 -89963 -122720 -174702 105979 197816 -244762 83449
8937 51766 155305 -7357 103889 398157 72254 108864 -140932 2632 -245737 -34695 178151
8925 317732 426270 645240 1360471 5183439 21912965 6790125 1692677 627133 254520
8915 223831 389229 124996 21994 -269009 -171124 -24354 -242368 265722 284293 120368
8904 129192 59328 126866 115670 -431630 -107702 -326018 -36288 -156399 -125751 100489 -231022
8892 -40213 -193849 -60941 20844 -11126 173563 -62174 22258 -155955 -228481 -106638 -29594
8880 44956 150107 7952 -16207 -213246 -119445 -41183 -169036 -432495 -410648 -58047 -219270
8869 -219270 55281 -15819 -190242 82389 -27697 64803 -327362 -213008 -64100 80738 -22303
8857 -139814 -61472 -51369 65148 -299765 156894 64526 37687 -219367 -7501 -8175 154137
8845 100597 -242855 -88681 -257228 -109235 75517 -104813 -313465 87089 -147103 350062
8834 72609 -52524 -193075 -256239 -20911 15039 18659 -48271 -248011 -25734 -64743 -23327 121757
8821 -74678 -160661 158500 -10026 -124766 -267650 -36236 -14688 -53160 -269104 -83485 -172229
8810 -172229 -227889 -268619 -139043 47787 78557 -140780 -355660 -144886 93413 -276012 -227269
8799 -227269 119997 -132639 -347321 1547 218042 179818 86204 36661 -196137 62828 381712
8788 381712 80210 71099 -6254 15886 -81750 -314129 87704 371501 113937 -103826 -177273
8777 -177273 123660 114549 -186505 -301475 -31158 -306204 -56210 -303066 -165153 -135374 -14479
8765 206748 429616 -362017 34383 -455602 6257 -287382 33888 -23470 -323337 -90395 92573
8753 -254604 -352914 48034 21123 40007 75192 -138135 -123281 -274785 179078 154317 -295351
8741 52076 -339762 67508 86361 -275640 86766 -198905 -19191 -506069 -185669 112520 199870
8730 199870 -164669 303069 8113 107710 -8580 -177735 6393 -59032 -193193 34625 -189706
8718 -297585 -10870 325741 -233648 -94924 -157779 -103792 64529 -438052 -103546 187121 -43772
8706 -163376 68815 101332 252991 -386916 -226210 -38920 82362 -346070 -238042 -242468 144333
8694 51978 1203 -265202 -205666 -69066 -178413 -204099 -215630 -225895 264449 -199523 -103192
8683 -103192 61768 332906 -21043 -31648 127839 -34959 73247 -53322 278433 -203000 299203
8671 -310188 -88207 -290283 -38164 -184893 -19206 321706 -374809 -30621 -707276 -77853 432508
8659 364149 -15957 577166 353838 -336423 -94641 -132518 46607 -10199 257034 -49698 13901
8647 109628 143698 -445630 23899 -177334 294371 -17009 -197567 -342959 -95613 5829 180090
8636 180090 -299939 148695 -283939 -473789 -77425 26833 -116789 -195429 -455979 -165760
8625 103673 -271046 88624 -200267 -88735 73247 201732 30013 175732 -181480 71963 105467
8614 105467 -294007 -54677 -110167 183215 -233248 12045 -150607 -195177 -119121 -223265 48959
8602 38389 -141560 283245 348079 8580 243310 -42041 -98888 9439 -67832 -183694 104966
8590 -104316 -296447 -212919 26283 -178684 -85746 -251651 -39477 -197198 205242 -139571
8579 20718 -25627 62703 315740 -286591 -30786 26656 -62363 339187 -37694 144916 -60831
8567 130856 108508 253428 -91748 -121889 199978 -103293 422528 -169394 87004 -43623 90466
8555 60854 -248481 3741 -151274 81783 -6453 15961 -208541 351225 -86713 29097 -218265
8543 -189189 4287 14761 -221345 46634 -1616 36352 189167 189063 -205750 -46511 -229339 -143166
8531 -143166 155950 -86174 -213108 -82738 10207 2344 -120694 -154300 -173361 -98007 181782
8519 -42553 130840 508243 -47640 296771 27931 4339 265999 -84185 54409 -356931 35368
8507 275167 -185712 -42528 -258554 129691 -85653 -77567 -32488 27242 -199761 39312 -298652
8495 48911 218430 -11045 306864 179127 -255629 -441035 -102215 -218775 -172425 76813
8484 -340443 28496 -94808 63097 16361 -32251 22071 73062 123516 38008 -297822 332529
8472 -337092 84077 -292735 -211725 -227414 -86740 -291376 7626 -165297 -51986 144810 10888
8460 6593 -298586 170169 -332445 -8989 123244 -70105 -226316 -257056 73732 -139403 74208
8448 113085 106069 -70737 -92284 13052 198979 -54583 27069 89112 -155798 -244417 189817
8436 138038 14078 -114298 -68258 -421825 16260 -48675 -475513 -79316 -168438 -114189 -61683
8425 -61683 -26370 -65900 -201907 136173 -120332 104368 -457918 -5988 -108766 113721 -103601
8413 19129 148122 -431395 101848 -27030 157422 -168649 75735 -350046 -116049 5646 114369
8402 114369 -89592 -145464 87217 -337139 91523 -33800 135046 250645 6144 -294844 3980
8390 -87884 -144700 -132257 232859 -222631 -61641 125728 -187989 195150 -63910 144484 -90217
8378 -87567 -263791 7054 -76100 -20201 -54279 165027 28689 224751 116283 -445537 102860
8366 -101364 51329 -315796 15146 -2444 158093 54718 28250 57272 -108296 -115615 -201545
8355 -201545 -294817 -310963 -348145 -76539 235834 -46241 -135150 246116 -12678 -11509 17175
8343 -183382 102231 240116 -31997 -68012 143036 454 -71286 -185973 -60917 90785 -239267
8331 98079 1602 26307 143296 -45252 72889 -45868 300303 -148958 101736 -149949 136309
8319 157347 -78010 24091 -149880 -272432 41396 -11793 -112927 -10646 -28962 88368 9971
8307 -303059 -267630 -266348 212122 41497 -110295 7287 116296 -80014 93973 -308882 -37433
8295 -228684 54237 -257871 -287942 36144 70478 -269817 145032 47844 42635 -181230 -80946
8283 -55194 165893 -172036 4378 -318802 167173 -170775 115633 126156 -103233 58420 -50282
8271 -192026 -199420 320215 -115774 -29989 -84222 117390 -51897 -296493 56360 154036 -104771
8259 92533 98806 -250465 71133 75473 -134130 -207668 -156245 -32265 -74294 -61403 -176580 -182376
8247 -182376 -38272 104046 -143874 -107253 97048 -210197 -73996 -114956 -115130 -112319 96409 -271527
8234 -109711 9078 313125 -66536 29338 121557 33814 -40704 30279 312202 -124028 -224326
8223 -224326 -129649 -117658 -48540 -176962 26555 78448 49649 -116280 157987 -327296 -34425
8211 52936 92499 -1501 298958 -307199 -114314 -150999 93411 -30412 47365 -130206 12487
8199 -302354 133512 -169135 -19344 -22100 231012 -148231 111976 86263 230277 -124348
8188 -127752 23326 -429027 -243132 194846 54127 -49074 163648 165396 -31975 -279639 280389
8176 137765 -106366 182824 47443 -9344 -201463 -194355 -9868 -138739 88936 -418511 -271836
8165 -271836 -273320 -124831 10213 -318038 -83424 110948 123657 -333043 124723 -23079 -152240
8154 -152240 -18536 -35227 168520 -155371 -29360 66964 -155570 -112784 -27286 49741 -107275
8142 136408 11754 66581 -293467 -228730 -75434 112862 -224145 -171089 463292 -123319 108734
8130 -133332 -114317 10813 -256948 101473 62256 151892 16090 -390523 -306664 -259068 117039
8118 201142 104226 -34837 220 -338105 -73554 148504 151852 -20338 60763 -75615 72392 -43553
8105 -282269 -120388 115814 -147535 87297 -294282 43502 178108 28028 186783 135454
8095 135454 -194379 81088 -22192 -224116 -3704 25501 -67732 160568 -47299 -429750 -191822
8083 106729 228401 -380463 -106809 74458 123998 223573 -35676 -82759 -80267 222738 -113054
8071 219542 -334424 -72345 3508 15865 -126500 -417061 -259930 -317407 -96263 95127 -254321
8059 -68314 -66534 133939 28646 -129863 129739 -39459 67102 -267157 -134021 69780 -164069
8047 33813 -114821 -55068 -528580 -27324 127020 -172884 -47801 -48894 86321 297334 3131
8035 148767 -2987 181189 9368 -7917 58520 156058 89858 75740 -6801 58512 -42382 181161
8022 -364869 -82363 -276803 18391 -147721 198681 -173436 -148140 -70556 100376 -161226
8011 75257 -175458 -25537 269745 -92664 -38798 204822 -98690 -18262 -4824 -288471 71814
7999 -153938 -204826 -33246 230851 -148289 7229 -204567 -100504 -178577 217415 38036 -15640
7987 -112960 143648 203980 -547165 187467 47720 114779 387875 -124304 24722 -49377 -25953
7976 -25953 -227144 110964 245524 -140670 -296582 57602 -150163 61329 -457088 -137518
7965 63801 -51796 -94987 174807 185279 -202929 50147 250117 68022 327277 -3984 -415173
7954 -415173 187915 84787 37429 371068 -209297 -228784 -95562 -139245 -490374 47793 78906
7943 78906 256946 -195550 165650 -126225 -264191 -200229 104742 11005 454599 233529
7933 233529 -242698 56835 430752 -20157 39852 122521 167237 -430443 -106780 158694 169881
7922 169881 -104276 -236163 -39775 -221235 11173 -150502 -185245 -242381 -40298 -288293 -165078
7911 -165078 -240005 -274276 126881 109650 -309690 -60529 -230276 -174019 -129689 -148550 -316477
7900 -316477 87916 -60949 2042 -6605 -38237 -364127 -180940 243619 -94522 -180340 36329
7888 -124464 -168133 -7405 -229453 -16080 -170889 344143 -262489 -67094 -309209 255351 145118
7877 145118 154567 200037 69728 -9493 -156078 -68218 -352153 -226643 39801 -24700 93097
7865 -82195 -220161 176446 -160257 -83379 -297114 -64870 -25148 126733 -112946 56030 52983
7854 52983 209039 200689 -67411 333069 -194830 297547 329973 2699 -273220 135799 -72003
7842 -445385 -349199 -204928 -296375 -42483 -159710 -330118 -150062 -115114 -105385 -5976 -193330
7831 -193330 -14745 -37500 25723 -273842 -334073 169122 -81347 -103141 -136253 -90700 -86152
7820 -86152 172294 -39350 -449588 -62591 319571 278115 238231 129648 -42035 18142 29796
7809 29796 -164253 -201713 107124 -192348 32890 -441448 -91193 146533 340265 90011 -336597
7797 136989 -26010 -234850 -199749 272451 -123903 130161 190333 41856 -52915 -184277 -32579
7785 270082 2641 -40105 -114935 -25609 122215 179230 -179272 123185 13599 -340585 -157942
7773 388767 54430 305794 -252801 36459 -257508 57662 -373728 -57186 102676 -124579
7762 21033 61037 -7909 443865 -43733 224312 43551 -237597 15320 -220059 226999 -89758
7750 223685 -138632 -96867 152687 163361 130256 -70923 79861 -129447 -45394 -160456 26638
7738 -46979 80248 -87660 334160 -213315 8747 -88764 92692 7655 242471 -80591 58373 271891
7726 271891 -75179 -226657 94693 79331 -297777 44175 -90687 185057 111644 -8728 -21684
7715 -21684 -114039 -218754 -122105 -20401 9472 31983 -256281 6916 183228 -184223 -131147
7704 -131147 28275 89052 137111 369945 92145 -36336 -57551 -180067 163564 -8078 -101255
7693 -101255 315211 -28154 -256789 -144796 24732 -105835 140417 -224448 45579 30943
7683 30943 -149069 -140632 187373 -184960 -176173 -23798 706532 -196344 -146337 164501 -19666
7671 255589 228813 -45311 80256 -19057 -73984 -147985 -253634 -164863 1965 139720 -115737
7659 47910 -156117 -80136 -176312 -301147 8695 -94162 112606 -419231 -11593 -1515 -299521
7648 -299521 -77186 39898 -88659 21577 5839 119267 -7905 -29813 -201173 -144342 -246832
7637 -246832 -44717 94435 -146559 -204719 103134 -236433 -134556 104579 -152582 -16333
7626 216006 -262956 116316 -158706 -106344 -38939 125599 -237720 7461 -156030 163894
7615 294971 -18109 138231 -176284 -43912 -183798 -130446 197173 -14953 -7283 127147 -12131
7603 -40681 -51881 182553 34823 -90646 137911 -64962 93232 -10720 -100080 -12748 201270
7591 93478 40493 4188 -300862 -38725 -166648 -406361 66368 -195251 192442 -380639 -112057
7579 -30616 60084 259478 151848 209711 -101 100554 46840 -501443 -13627 -105083 -210109
7568 -210109 -188454 147474 33989 -66229 226560 -193592 285707 150366 -376616 73962
7557 -110024 34035 262568 -169857 117788 89767 197746 161163 140636 -239977 -193093 -17966
7545 -157796 -33702 -175452 -191030 -197054 -200866 90245 220992 -226162 -79331 -152558 284262
7533 -109824 17635 -8144 140893 -17179 15258 -36635 41425 -58618 59973 53052 -189078 -132944
7521 -132944 252799 -326527 267551 -142485 -157374 -92170 212158 84411 253340 -188759
7510 -79150 198929 177877 73137 -48643 379263 115689 148256 -172201 -169963 -256370 -313751
7499 -313751 146752 -72897 -47937 -131560 -127877 97145 -46707 -80599 50613 -110287 -84291
7488 -84291 -301337 -281543 60351 61258 200580 164567 -101758 103756 -103113 -87044 156350
7476 11947 235571 -199251 -143062 16866 224114 -218708 -166894 58301 -213488 9122 -199465
7464 -7550 -83265 44103 371520 132158 -148306 -92734 15973 100923 3275 -41168 -412894
7453 -412894 42932 146501 -190325 121707 -230065 81528 -11305 32108 69403 -82524 -142029
7442 -142029 -13770 59995 -389724 -322466 66083 27376 -55111 223553 47349 -26716 -25560
7431 -25560 224555 158740 160310 142698 153079 -309655 77992 137878 9882 198999 40877 -4246
7418 29704 -201658 254793 195506 -409694 36371 2535 331810 -218718 -40222 -91263 236228
7406 248419 -93388 -146527 -3737 -283774 14355 45442 -143457 142350 96071 -126172 8304
7394 -74361 -112527 -33939 -52422 242734 5220 -137926 -21575 91329 -73168 -16346 -262541
7383 -262541 169747 -183030 92407 -260877 -324324 -151563 -52645 156187 114064 -89844 45491
7371 -49387 99144 -102515 -61011 -71600 -174256 -250144 133131 74398 -49382 -268601 -364084
7360 -364084 -373800 63921 91517 -94914 -30144 100703 -112542 -79845 -162684 328136 25228
7348 -10842 213733 256981 124070 -322149 49059 270950 -43439 195806 -249376 208263
7337 -113952 207818 149960 95416 -167016 -174746 -15579 -35199 -215237 240495 -262250 -211295
7326 -211295 15312 80055 -303181 -68493 79683 -72110 -175786 246780 -81314 -313054 -67198
7314 8479 -197436 49944 54779 131331 -102631 -17802 -191062 183268 -16881 -170214 122928
7302 -473015 64489 296691 -111442 -107917 -143261 -125805 -116072 -144164 -101906 51846 251000
7291 251000 420680 -155443 80633 -218050 -30056 -8064 -117103 -79338 -208256 79210 72859
7280 72859 -4659 -186919 -57346 -123558 -28075 -130234 167236 -204075 -148048 -35571 165532
7268 -65231 -146141 -118558 297379 50045 111000 -152786 277498 -30879 -21706 -338473 134696
7256 -89214 -214864 -230616 -350675 -104171 -13300 -88100 46122 -241550 129204 -36320 -68102
7245 -68102 92266 26952 42805 206390 -176928 -2852 91042 -203366 -82139 66439 220345
7234 220345 -69732 -96533 232735 70777 200835 -20541 -243828 47875 -184392 -67794 -191775
7223 -191775 -109759 216298 50239 45734 -226868 -150525 -395759 123583 -321169 -38378 136744
7211 -198890 -168977 16121 -180614 136763 261825 -102889 -321775 346660 -37359 -4716 -188079
7200 -188079 158304 -38358 315402 -320594 -30996 72523 -107966 9950 -117732 192691 -15346
7188 -92758 -56128 2668 -329234 76609 -213152 -151792 285986 272274 -3232 -204451 138698
7176 57313 -199611 -3809 -22605 -64641 -257562 -120484 127077 154408 -189902 -102492 -350794
7165 -350794 78142 170655 -48331 176847 42660 -22317 31998 13534 143833 -195423 5626
7153 128813 11059 85387 322013 201904 -152472 -141168 99487 316101 201238 266533 -6025
7141 450391 8053 -13514 209037 208539 301005 101440 -64025 -112958 68450 108345 -90621 20722
7128 -186967 -55195 -83028 -72936 254522 184948 95186 -224969 -441 131383 -191404 -89756
7116 268758 50423 -96885 -77797 22541 -146120 -258243 -98210 67680 -12764 198390 -171962
7104 139188 160553 193420 -130458 -31207 192995 -388523 39339 -52416 53702 58132 217984
7093 217984 -173883 55838 101270 -38978 19319 47787 -103485 115309 322307 -177745 -63974
7081 132480 250406 -29986 122540 -119589 -316133 175481 281690 146708 135096 88188
7071 88188 179571 -124904 -166604 43435 36181 -26887 124583 207967 125117 10425 -395869
7059 171407 -81968 96261 -281113 93187 6709 50879 354081 -13945 -106055 -246321 -126570
7048 -126570 27656 216890 -273058 -121747 -119539 79270 -71609 -109447 71541 31799 -235592
7036 78971 -499037 204187 -65803 -134146 -126850 -119443 -14384 -240176 192747 239611 -143291
7024 -232950 -246468 32612 -78899 242399 -186753 34737 25592 -230563 71991 -14395 -436177
7013 -436177 7972 25226 74917 38737 38685 117458 15496 62290 -173970 243442 -198046 -163538
7001 -163538 -120767 -196828 -293177 2378 169576 10517 -83333 -315721 40557 245122 -312895
6989 -82122 -286484 159516 -287501 -74989 -323159 21078 -68545 -244824 25164 -4913 21481
6977 -5565 133468 -21499 22542 297927 -12140 -245204 36584 2406 82760 -128689 -237327
6966 -237327 -41054 157336 -338070 355302 42051 -6034 -329799 210199 208833 -90266 14897
6954 -56882 2051 17473 -33203 257654 -136965 82200 287526 71592 143761 -23377 82901
6942 301802 -121494 -255784 -193759 15776 205256 -164681 -45147 313741 192325 15270
6931 -184648 -115774 41321 -149195 233428 246595 174112 69406 -21232 329144 71792 -91758
6919 -138450 192310 -89166 -46642 52732 -67750 -354890 -375606 14173 -252605 -41902 -180918
6908 -180918 -219340 -106891 -242392 -52464 -27148 -130245 -230796 -81367 497375 -180538
6897 -134840 61328 65139 54490 -16401 -95584 52130 -148926 -129881 -172659 74472 -35765 125698
6884 -174044 32058 130763 -12411 -160435 -411588 69223 -5516 -351928 -135604 77990 -52576
6872 -195307 -368835 95052 -231571 -141431 -249867 78908 -83387 -180667 152801 -283137 -36999
6860 51157 86566 61495 -15839 -49088 59611 75809 -19883 83990 119879 -47434 25398 125011
6848 125011 304029 -411677 -70837 -247636 238765 -38644 56063 -360436 -36991 27192 -287636
6836 107640 240433 -7715 -39570 25378 3871 -237468 -104330 692 59098 73753 86285 65870
6824 65870 161557 -40203 48232 144086 -287946 52098 -324798 -41572 -106425 86997 7247 48176
6812 48176 142140 36190 -40491 239842 -138691 193903 -218180 -25782 20508 127454 -200694
6800 -273510 -149564 320803 96353 -140225 16155 -58640 17792 50464 58762 -207218 -178934
6789 -178934 -17576 16735 -202720 -6430 413074 237589 223008 -277756 -269640 153976 90246
6778 90246 246410 379853 44170 -182902 335197 227851 -86343 -23855 40703 -190433 -54527
6766 -188271 -229416 160727 89797 -137648 86237 258947 -94863 164701 -7241 128595 743
6754 83162 -147527 -97103 116100 -286045 -108089 163826 105618 -173124 -158166 -95074 131985
6742 -92819 3474 -232097 -168540 7601 68451 41615 106028 -27093 -29508 55720 -273823 -152176
6730 -152176 -178188 62092 -78842 764347 -128196 183636 41135 261588 152975 29192 228094
6719 228094 -130170 47017 48522 39537 -141379 57195 214735 -128752 -240798 -118179 -157380
6708 -157380 -217205 125428 -42312 160646 203549 -76997 -53692 231613 -113963 -340268 46858
6696 -58003 92445 -51196 52444 -143584 182641 66575 -109833 59105 -74143 116018 27266
6684 -88844 -102473 197826 -43760 -41912 -126600 35571 -299259 -29350 58147 59718 -109437 79792
6671 -379165 206000 276981 -263396 -221088 -290156 53532 -169366 135298 -214244 33523 69066
6660 69066 -377219 175992 32091 20563 -141234 -174719 -94627 85152 -14740 89036 -231041
6648 -2000 -153406 -290385 -72435 -311535 7074 -230505 -163319 -87051 222432 -166320 226882
6636 103459 58166 143276 -140953 -200183 46690 200895 -114873 21528 131566 -195594 86783
6624 -86814 339783 -260125 -136997 304235 -162675 386623 -17777 -179596 13085 -268765
6613 48801 30024 -327022 556830 120382 -28754 103054 -206504 64862 225846 -107621
6602 246065 158291 -107195 -22706 -215336 -4466 127370 -268711 -135795 -107123 -149696 91802
6590 -455523 -182395 93376 456039 -42505 176678 141067 -73291 35232 240995 -267685 -92212
6578 187048 -102136 132868 49016 -285784 18774 -319994 81872 12732 26964 132492 -75892
6566 129815 -1 -4269 13271 311085 69074 -53578 -152282 381901 -372038 -469585 147070 79760
6554 79760 -178433 94287 -118433 -37788 -59641 -10526 -190264 13483 18957 43074 -332376
6542 -55902 -130021 -73095 9529 261388 32362 100305 -106096 -212680 238825 -41582 -142830
6531 -142830 -205918 -39476 -14043 -23420 -54608 95738 38617 -283484 -199831 287832 59254
6519 -49045 -55856 -11080 -88188 -2829 6034 -41357 44544 191648 -257234 99087 19157 360352
6507 360352 -45854 70306 -102112 -108760 211422 110069 -304410 -335401 171673 20812 52042
6496 52042 -226066 -110965 273379 71164 -21244 92993 -219422 31915 -126250 -53456 -181036
6485 -181036 -186189 -183379 -153844 53621 -262909 -239948 -175982 -128930 -254456 57746 17037 186493
6473 186493 -129320 -160392 237766 100865 50258 90645 -89539 -182961 -141087 -2980 -262906
6462 -262906 -39747 -113653 -111653 163838 37739 -172024 -236203 -25302 -145353 44776 -260140
6450 58062 -65386 -130880 -52083 41814 -5447 -156881 77350 40157 50378 261380 -264611
6438 305649 203050 -349279 -70193 -120637 95716 506859 5536 140510 142394 -43111 344984
6426 217655 46971 329504 280940 -153278 59639 -66673 -18104 25336 -266970 216466 185623
6415 185623 -40534 38974 -60189 -105668 -481535 272015 16418 -212759 27563 132674 -102657
6403 144245 20060 185815 136957 54675 300034 -147623 -30623 -99249 -111613 227672 -210982
6391 -119732 -132560 -120273 50576 -233950 56686 -157736 360915 252525 -66231 158149 -1572
6379 -49008 -1370 94398 46728 176044 -356023 -45120 -142988 85578 -5958 186558 86210 -136477
6366 195704 77513 -118606 -110820 -244215 -178489 214131 55844 -366536 37957 363386 39705
6354 290608 4271 25923 -121191 365864 -57132 -329367 -7064 23201 -103334 -257188 -10466
6342 -245710 44114 22750 -213163 2891 -125740 -186673 -126880 -34596 -259977 -92151 -97054
6331 -97054 -383017 -143278 104882 108639 -14704 -79368 -275700 166138 -48843 -113859 44501
6319 -10818 137543 75552 -208142 -323410 32879 182750 -66433 140802 -55178 16632 85298
6308 85298 101009 243201 -356572 -189431 104287 -164493 -238153 -1498 58049 -150021 -339694
6297 -339694 -106259 -33625 112582 -42543 249877 147772 -148477 245911 -219922 -11568
6286 184992 -1332 122126 -187288 170481 25912 349776 441248 30348 -61753 76195 166395
6275 166395 -302170 75509 -27704 -63168 122454 52304 157648 -123403 137102 -144995
6264 13536 -33281 176316 181188 -130260 -141516 101121 14432 125708 82384 -200190 -89088
6252 -233724 232194 107741 18814 -187716 94995 -127318 61932 152870 -136712 52559 85765
6241 85765 174484 -178999 153498 214780 98471 149073 157879 66161 -453304 194765 -69598
6229 -213416 -125692 91036 100603 -388896 -121290 80173 -163024 -125807 -159768 143856 -257541
6217 -104177 52954 197113 231376 -69701 118728 -207899 -60006 -183090 37267 270852 -51239
6205 -205875 -136144 -90343 -13686 -336606 -333392 -84250 86429 -17089 -49745 -162598 -21664
6193 -268568 -136751 284485 392527 312248 -219187 254057 -270483 28797 125135 -67121
6182 -63310 -116731 -106026 -157023 193272 -143758 80518 46503 -5928 -198704 13750 -7955 -53606
6170 -53606 -184085 -242907 -150028 -89191 -63967 67494 -195397 197831 261941 38043 -146663
6158 -250467 28801 9408 154652 140174 146141 -75564 74864 191790 -357347 202850 -203839
6146 -510937 -228122 -342374 31961 37999 -104082 255474 -132469 -215824 -17749 73705 84456
6135 84456 194812 164240 -100737 -293868 60400 -201648 -66727 -224578 200686 215984 -151495
6123 115926 -221508 36328 -157603 234857 106712 250784 184516 113084 147946 83744 378156
6112 378156 25254 -93032 -3507 -99745 8188 70118 -97069 -270052 153970 117950 184553 111220
6100 111220 -240851 264775 -168228 32126 70816 -71194 -36938 -51983 409112 95869 -26258
6088 -76298 -97270 126000 -87566 -362470 284087 120397 28629 197104 48599 246776 -71900
6076 161913 30575 132568 -51083 -119313 -319253 243710 -13624 188082 154859 -184437 -36278
6064 -51787 -346268 -128520 76436 158072 -82940 53830 98682 -257592 194116 117426 105010
6053 105010 -88438 -146230 10916 186327 -21381 109660 62846 -159958 -157327 101548 -357037
6041 49849 -17937 -79137 283989 -470467 -300251 319635 30645 3868 290251 -336795 -564122
6030 -564122 -377847 284018 -343449 -299347 -176110 123806 -58526 115073 123666 158042 48227
6018 249212 15917 141326 294073 126678 2207 -124357 -87673 -35455 -173374 191295 -76288
6006 32165 -7656 129257 -5474 219871 -217344 238814 -142121 -341001 121435 -60078 -38514
5995 -38514 142280 65012 -484012 44592 -109980 108501 -30674 182783 -51420 110503 91237
5984 91237 -18813 22151 281938 28843 56511 -202827 -21357 -103 -19383 268304 -185804
5972 -401936 -101082 -94754 140359 204862 -159564 77726 19175 82402 247711 98890 258064
5961 258064 -210367 16099 -63962 -86335 119260 -13712 -173936 -158261 -122644 -204109 -19032
5949 -62257 400519 -71633 25854 82293 -142527 260400 -170713 -132209 138328 199934 -254907
5937 -156065 -117804 153623 -255226 -20425 37336 -97095 97948 27096 -22096 36822 26497
5926 26497 -143085 138179 199008 -131126 -227234 111145 44832 -68888 -155785 -29808 -67521
5915 -67521 -55099 -368080 -71445 3441 11329 8047 -167494 -332877 127100 19640 -122264
5903 -173684 93809 97535 -307072 -48967 -60996 -133705 -56969 -25194 -60257 -33102 -123491 -111294
5891 -111294 103333 -96864 -107129 -14820 -58090 -231041 55168 -352304 110401 -84112 131552
5879 19573 -61403 -184574 60863 389833 82338 60966 405069 -61312 -137733 33265 -56642
5867 195076 -2040 191767 111904 237736 351702 115958 -185992 206749 241160 72268 171479
5856 171479 87874 -149487 -329962 312382 48513 359123 188110 5510 104950 98155 -14762
5844 112426 -89714 218433 -161965 -316331 -166856 -213647 206774 -223739 -82294 106681
5833 -38063 120478 162393 248745 227281 -108813 -290714 -194208 216560 28177 8347 -39537
5821 -64977 78457 -50870 -158386 61470 -49484 -14358 -282948 -26336 -25273 -96344 -120181 -66075
5809 -66075 -12037 2561 -24140 172632 -232000 37551 101637 -18180 1163 -444352 95266 126576
5797 126576 -239047 187958 259092 115498 65327 170971 126879 217282 225705 -131420 52399
5785 164985 -168584 115664 -189030 -135768 149914 61619 228042 -170631 -51429 -119785
5775 -119785 20032 -42569 73596 212833 24928 -64845 7749 -64928 -99535 303924 -33842
5763 85894 -49942 -168771 147480 110622 244564 -59080 7365 27746 -191470 27807 -181543
5751 -17976 -108148 -106519 -168773 -33790 58536 207077 -53729 -45097 409481 -315638 11131 35491
5739 35491 314380 141365 -289437 -165350 62660 23911 -110390 -93075 -53979 86494 -305466
5727 -199356 -15388 42247 -79482 -115783 19754 -437067 99219 11960 -201553 -196915 199369
5715 -28049 -61908 329606 -17244 -320420 91981 103624 -11681 16509 110769 -436 127766 -20876
5702 344624 211997 -101283 418225 -109484 100805 33451 -172231 21687 140803 216280
5692 216280 78878 -61439 94055 -259989 -90385 -251738 -133341 -247954 55565 146666 -209555
5680 -271295 359431 -220524 109737 -214113 62102 135606 106667 -62045 74919 -127391 117088
5668 16378 -68556 93801 96216 -94931 41175 24040 -47181 169321 55585 -324863 -43705 295932
5655 -338860 56993 222703 50866 -130083 195750 -67442 -136466 49957 -133660 -149037 24409
5643 70781 -359187 214365 385199 -236901 81458 -177861 32071 -4067 -7573 76444 36884
5631 241204 -333308 19046 -100250 18639 -213644 40965 -223318 -115716 -192362 152434
5620 21167 -232124 -24370 -17619 -100942 163796 565573 -44279 2827 -60872 -17715 -95654 -171327
5608 -171327 174949 70822 119572 359816 121659 -377550 33412 182566 -190021 296461
5597 -161618 -173767 158920 274231 111100 134060 -273098 11896 44107 -26916 142618 -224772
5585 -91991 -15027 51466 -96767 -78702 28500 -252375 -38995 -60010 44875 -23566 362446
5573 100133 -27238 -168890 274504 -176688 9849 134016 -267065 143255 275231 -334152
5562 212725 -33869 -111773 292484 -31014 152469 -130808 620 137367 -233480 360292 100637
5550 -187866 -32518 -84307 -368967 -220351 -316833 -7418 344164 55698 -21105 -55254 140078
5538 -196574 36210 172332 18680 280997 -194563 128698 -335722 -100480 163803 239980
5528 239980 124107 -40184 -24548 131473 22032 -12831 -72989 -239910 224364 7875 -23064
5516 -106423 -304820 14384 148785 260540 -10545 133523 -8126 -79833 -235873 -92226 78334
5504 -304542 -70804 512852 -232698 14220 -6369 -177567 195503 68729 -74150 68257 278321
5493 278321 -17437 118252 -49295 -172483 69784 -202722 287697 -36562 -35786 362700 -47574
5481 330886 -160674 169905 29455 163861 -57621 -169254 350694 145027 208783 168512
5471 168512 -110566 -25376 8630 -244173 -234525 -36959 68223 -109312 172797 -74263 -58400
5460 -58400 -233769 1652 63462 -146195 -82362 -364119 65751 -15002 166556 125469 7674
5448 84031 356364 -32005 -950 206418 -18668 52174 176254 115660 41602 206804 -52259
5436 52296 58691 -105253 -112741 -40603 24964 181041 -57933 7469 22853 12909 -199480 236901
5423 -175855 48170 16834 -78947 -132991 139248 -19277 -46974 -165448 37602 479116 66737
5411 189522 136204 269206 65705 -19829 47666 -67631 61872 91375 -79149 -130759 -60867
5399 -190336 29971 -37143 -16507 -148468 202801 42682 -169471 -256570 119692 -66976 136431
5387 -137685 -107083 60428 -134486 384449 -114896 113495 -47075 333357 -159237 38585
5376 129370 112467 -290988 -238534 -186489 -189119 -136447 -28230 -151956 -67606 27646 191571
5365 191571 71968 54779 -128664 96138 -254712 123574 6970 201674 -365956 167945 389223
5354 389223 199447 22965 -235690 -19824 84618 -393409 26014 74625 -10442 -1309 53429
5342 -101088 -194674 32494 -262967 -120199 404788 6855 36833 -96684 -110482 123489 -433446
5330 41970 -83748 -79316 -312448 -215946 35726 123051 34388 59497 -53805 65974 48654 -35147
5317 139256 -34430 -95825 125894 -20352 187825 88799 -39231 13748 -205941 340665 -476611
5305 125946 88695 -163516 -18759 -188297 67481 219176 -11141 27497 -144986 66578 123730
5294 123730 223792 -88417 122017 29406 -80108 87295 254242 225149 -31150 123182 340874
5283 340874 186140 -231731 172924 -110556 -51702 52505 82688 -112203 -142736 -131901 69361
5271 -128577 47615 37128 206846 9388 176675 75428 -44552 -173724 72698 -94392 339354
5259 329158 -129965 108134 -62136 289558 -52343 -140454 -227171 63379 51496 82215 -127337
5247 104352 -191997 -416798 22973 27916 282509 -197721 -56166 70458 33119 -22308 70524
5235 -170129 -141979 -73520 -101888 -357261 33527 -75040 -197845 72871 41734 63462 43329
5224 43329 72558 -164647 67358 18429 -158582 61863 223779 53617 -300381 393065 -255284
5212 -12961 50334 48918 -215537 -194044 -125870 -313086 208045 -303958 66762 -159881 -130358
5201 -130358 -64194 -106627 -309935 -174950 -1926 -38615 126737 -150672 337478 -234047 -28234
5189 91832 54507 351261 142148 131083 525456 -77571 -35242 -293514 -75371 -115842 -156505
5178 -156505 329027 -73058 85665 -57708 -351437 -365590 116570 -80741 138120 186091 111222
5167 111222 -213417 264989 183832 67135 91904 242808 -64796 17282 294079 152324 -79117
5155 -887 -103645 -24859 -108370 -162922 295216 -117968 166232 54166 224085 449132 107711
5143 444 143083 147748 -235859 -175970 247838 -230145 276932 274069 59722 -17152 6452 -164373
5130 -160418 11922 -54578 -187960 32781 -230245 31034 47086 -195268 -168959 60047 -161741
5118 106234 174301 238455 -55050 -161538 -21599 139643 80430 -336035 418352 28929 321133
5107 321133 79478 -83327 106078 67095 4607 -404058 169121 -62434 -279530 271479 128042
5095 -192171 -95078 164115 178038 93332 -123316 76990 -15814 -34839 216804 29112 236298
5084 236298 169141 -98171 -119182 279257 -11854 294438 30930 80089 55472 -145664 130344
5072 -107813 34245 429027 -367637 11532 83302 293601 -186279 -124420 295464 -189727
5061 -187082 202896 -24184 -251805 -198313 204432 -31048 -24053 214584 426931 -16816 71214
5049 -66175 -48787 -199214 83098 94363 -312276 309198 -332745 67009 143286 -75284 123595
5037 -236539 -231063 98754 128766 5003 -120889 -84966 3808 -26118 -307712 -379851 -206277 -237088
5025 -237088 197517 -233517 291910 94912 -114023 7969 -178476 176575 146985 89924 -65927
5013 428616 -200456 -214721 72960 173929 99042 4513 196190 -19163 151408 -8097 200936
5001 -12277 -6835 -101845 232767 148748 123309 -553 -41392 -42650 273351 213886 -53519 82541
4988 308782 37937 64 190060 -304008 -49125 -194070 117861 111322 24530 23998 -117076 -166441
4976 -166441 -161689 -139441 -37377 -117903 -392445 380251 192558 242012 180203 -87801 -200242
4965 -200242 -3373 -86509 -182083 195012 33713 154722 -129345 247333 303857 182619 -293293
4953 -305542 104141 215936 -117849 191859 -341724 493297 -175180 -60962 109525 -36373
4942 -99564 197613 146399 151208 -276660 82266 226100 -147307 -36091 52044 174912 -158833
4930 7452 164447 -354938 -136028 -257668 -274594 330034 -214094 13527 -174300 -27784 13873
4918 -306652 39407 272602 -206124 -244976 62639 -193835 -69932 -410362 165786 157513 -13810
4906 21283 -46112 253609 35280 -53729 -179929 -166298 238910 -257691 -206438 -95931 12937
4894 107962 315963 -10159 238276 79707 -57323 130520 -49272 -41578 -143872 114179 -25228
4882 -190259 141593 95290 -106101 280313 -263998 -144481 -97778 -111608 315086 260135
4872 260135 103992 -68904 26881 107724 -157307 192483 -291629 134906 197961 73329 -202108
4860 -34256 172550 17597 -77617 49375 -138428 -130137 -1715 1348 -161074 67183 -52580 295303
4847 -129405 -125232 270625 -4044 25266 -143067 137410 -62344 -107624 559 102055 237700
4836 237700 112932 1175 -328202 9898 229955 236496 -51941 -34297 11653 -10222 -163056
4825 -163056 273474 -111491 -70175 -57242 -301149 55272 -68949 160247 131592 -99619 -19458
4813 99852 67816 -232020 -86328 110498 60054 68464 -48779 -203234 344978 40498 -163004
4801 129088 -37206 -48909 98577 181352 264456 -230467 48813 71017 209546 -33241 -58677
4790 -58677 431066 -153017 -64777 -217255 -17260 -84143 103841 -225785 36508 -184973 56217
4778 463473 -175404 56522 178994 343094 84080 -43508 -237200 -102582 -18473 4852 204891
4767 204891 135484 311671 -62119 38803 3542 110733 122064 -65138 155217 16843 -242436
4755 -73702 52045 -55073 -47430 106550 -51139 182925 70291 -5061 -80529 284018 24213 6463
4742 78908 90058 -131427 -18937 66181 -30086 -199636 76267 -100491 223844 6104 -80740
4730 260979 -6362 94392 311191 21988 54602 49350 407977 -177080 -167548 -66722 146832
4718 -181784 212313 45172 -189526 -152290 68335 133021 50122 -23794 -92898 -179917 -44426
4706 48495 73285 -66957 100003 23409 361521 -47506 288645 -204906 195060 162222 71874
4694 -27024 -39087 172932 -38033 -194160 -97221 -300310 197031 153418 -38520 198556 258411
4683 258411 -132572 -125878 202192 261672 -163113 233363 -38339 -12837 -315772 63147 -123935
4671 288599 -17740 130669 -39076 -77915 233946 210503 132679 4107 -58102 212071 176379
4660 176379 187151 108797 -111536 41844 314164 121804 132940 -214801 5463 171253 55441
4648 -335529 -24796 -4087 -197577 237896 345048 -32546 -393372 -248539 -206754 -145669 51254
4636 56480 -25811 -86048 8805 -93978 167881 -129505 -246862 -108306 -71632 72649 -226776
4624 -208440 -5967 95783 455118 118517 241755 -229744 -57192 34570 126857 -326404 -276994
4613 -276994 111085 108104 -201863 -198819 -242857 -90463 -78953 45254 182946 70565 -81464
4601 207670 105138 -81289 -89316 -18662 -92508 -389333 421155 105241 -157133 -112772 248760
4589 -159121 210572 -79921 180652 147877 -202323 291771 -123336 -62176 -362997 123193
4578 289 -85398 62278 10628 42524 -161505 -122480 -204342 -75722 171423 32682 -123507 167074
4565 130276 259870 11058 -244389 -132771 -373075 -74566 -64346 107653 255812 -210315
4554 11152 52644 77892 213908 -372 -205297 220580 127517 -320789 -123091 45772 -311443
4542 -210789 -60543 51896 -17496 120345 -17184 -52225 -138958 24441 122439 28648 -30349
4530 1677 44067 -411940 -352324 327919 -43653 187601 -39893 9313 -25964 -180632 -60095
4518 241558 260912 -241436 -45724 -33252 -134493 94065 -30341 -34914 92256 74852 -84049
4506 -17872 154548 -11392 -283008 -125167 365755 53061 -130656 -4919 -33771 25514 -86421
4494 -253675 -58294 184960 368225 -181143 197166 90159 -59099 -284905 -16972 223659
$$ [...]
##END NTUPLES=NMR SPECTRUM
##END=
