
##TITLE=UV1268_M12_1292-1216_70_7414245_V4fIW9ki2v
##JCAMPDX= 6.0         $$ Bruker NMR JCAMP-DX V2.0
##DATA TYPE= NMR SPECTRUM
##DATA CLASS= NTUPLES
##ORIGIN= BRUKER
##OWNER= Administrator
$$ 1.72 TOPSPIN		Version 2.1
$$ 2013-01-25 21:32:11.597 -0500  Administrator@X
$$ Compression mode = diff/dup
##.OBSERVE FREQUENCY= 400.02188249412
##.OBSERVE NUCLEUS= ^1H
##.ACQUISITION MODE= SIMULTANEOUS (DQD)
##.ACQUISITION SCHEME= undefined
##.AVERAGES= 64
##.DIGITISER RES= 22
##SPECTROMETER/DATA SYSTEM= spect
##.PULSE SEQUENCE= noesygpps1d.comp
##.SOLVENT NAME= COFFEE_meoh
##.SHIFT REFERENCE= INTERNAL, COFFEE_meoh, 1, 14.96127
##AUDIT TRAIL= $$ (NUMBER, WHEN, WHO, WHERE, PROCESS, VERSION, WHAT)
$$ ##TITLE= Audit trail, TOPSPIN		Version 2.1
$$ ##JCAMPDX= 5.01
$$ ##ORIGIN= Bruker BioSpin GmbH
$$ ##OWNER= Administrator
$$ $$ E:\/data/COFFEE/nmr/UV1268_M12_1292-1216_70_7414245_V4fIW9ki2v/12/pdata/1/auditp.txt
$$ ##AUDIT TRAIL=  $$ (NUMBER, WHEN, WHO, WHERE, PROCESS, VERSION, WHAT)
(   1,<2013-01-25 21:32:05.894 -0500>,<Administrator>,<X>,<go>,<TOPSPIN 2.1>,
      <created by zg
	started at 2013-01-25 21:20:35.706 -0500,
	POWCHK enabled, PULCHK disabled,
       configuration hash MD5:
       86 BA 57 50 F2 9D 5C 9B 26 00 A9 28 5F 66 2E 89
       data hash MD5: 64K
       07 96 2B 79 FD 03 2C EB 26 23 9E B3 7D 3F 23 5A>)
(   2,<2013-01-25 21:32:08.878 -0500>,<Administrator>,<X>,<proc1d>,<TOPSPIN 2.1>,
      <Start of raw data processing
       efp LB = 0.3 FT_mod = 6 PKNL = 1 PHC0 = 0 PHC1 = 0 SI = 128K 
       data hash MD5: 128K
       9F 13 AA 3D C1 DF 1C BF 43 E5 8F 53 3B 28 B0 0B>)
(   3,<2013-01-25 21:32:09.910 -0500>,<Administrator>,<X>,<proc1d>,<TOPSPIN 2.1>,
      <pk PHC0 = -79.45313 PHC1 = 0 
       data hash MD5: 128K
       98 46 64 40 49 96 1C 11 E3 EE E1 D5 B0 97 C6 86>)
(   4,<2013-01-25 21:32:10.535 -0500>,<Administrator>,<X>,<proc1d>,<TOPSPIN 2.1>,
      <abs ABSG = 1 
       data hash MD5: 128K
       56 2C 2B 97 ED 6F 43 59 96 09 DD 31 5A 57 F5 C7>)
(   5,<2013-01-25 21:32:10.706 -0500>,<Administrator>,<X>,<proc1d>,<TOPSPIN 2.1>,
      <abs ABSG = 2 
       data hash MD5: 128K
       22 CE C1 61 93 27 8D EB F2 0B 68 36 7B 91 45 FB>)
(   6,<2013-01-25 21:32:10.878 -0500>,<Administrator>,<X>,<proc1d>,<TOPSPIN 2.1>,
      <abs ABSG = 3 
       data hash MD5: 128K
       BF 00 BB 1A 7F DB 68 58 CB 11 7B AB 80 CD A7 78>)
(   7,<2013-01-25 21:32:11.066 -0500>,<Administrator>,<X>,<proc1d>,<TOPSPIN 2.1>,
      <abs ABSG = 4 
       data hash MD5: 128K
       71 DF 4A D4 DC 57 83 D6 2E 9B 72 38 69 1B 56 DA>)
(   8,<2013-01-25 21:32:11.269 -0500>,<Administrator>,<X>,<proc1d>,<TOPSPIN 2.1>,
      <abs ABSG = 5 
       data hash MD5: 128K
       54 D4 42 53 30 F5 A4 73 94 A2 28 B1 32 42 1E 33>)
$$ ##END=
$$ 
$$ $$ hash MD5
$$ $$ 35 F7 B6 56 0A F5 47 5A 37 7B B8 F7 FA 0A B9 9F
##$RELAX= 
##$RELAX= 
##$RELAX= 
##$RELAX= 
##$RELAX= 
##$RELAX= 
##$RELAX= 
##$RELAX= 
$$ Bruker specific parameters
$$ --------------------------
##$DU= <E:\>
##$EXPNO= 12
$$ [...]
##$TP07= 0
##$TPNAME0= <>
##$TPNAME1= <>
##$TPNAME2= <>
##$TPNAME3= <>
##$TPNAME4= <>
##$TPNAME5= <>
##$TPNAME6= <>
##$TPNAME7= <>
##$TPOAL= (0..7)
0.5 0.5 0.5 0.5 0.5 0.5 0.5 0.5
##$TPOFFS= (0..7)
0 0 0 0 0 0 0 0
##$TUNHIN= 0
##$TUNHOUT= 0
##$TUNXOUT= 0
##$USERA1= <user>
##$USERA2= <user>
##$USERA3= <user>
##$USERA4= <user>
##$USERA5= <user>
##$V9= 5
##$VALIST= <valist>
##$VCLIST= <CCCCCCCCCCCCCCC>
##$VD= 0
##$VDLIST= <DDDDDDDDDDDDDDD>
##$VPLIST= <PPPPPPPPPPPPPPP>
##$VTLIST= <TTTTTTTTTTTTTTT>
##$WBST= 2048
##$WBSW= 25
##$XGAIN= (0..3)
0 0 0 0
##$XL= 0
##$YL= 0
##$YMAX_a= 6345158
##$YMIN_a= -12230083
##$ZGOPTNS= <>
##$ZL1= 120
##$ZL2= 120
##$ZL3= 120
##$ZL4= 120
##$ABSF1= 14.96127
##$ABSF2= -5.596911
##$ABSG= 5
##$ABSL= 3
##$ALPHA= 0
##$AQORDER= 0
##$ASSFAC= 0
##$ASSFACI= 0
##$ASSFACX= 0
##$ASSWID= 0
##$AUNMP= <proc_prof1d_extract.lims>
##$AXLEFT= 0
##$AXNAME= <>
##$AXNUC= <1H>
##$AXRIGHT= 0
##$AXTYPE= 0
##$AXUNIT= <>
##$AZFE= 0.1
##$AZFW= 0.1
##$BCFW= 0
##$BC_mod= 0
##$BYTORDP= 0
##$COROFFS= 0
##$CY= 15
##$DATMOD= 1
##$DC= 0
##$DFILT= <>
##$DTYPP= 0
##$F1P= 0
##$F2P= 0
##$FCOR= 0.5
##$FTSIZE= 131072
##$FT_mod= 6
##$GAMMA= 0
##$GB= 0
##$INTBC= 1
##$INTSCL= 1
##$ISEN= 128
##$LB= 0.3
##$LEV0= 0
##$LPBIN= 0
##$MAXI= 10000
##$MC2= 0
##$MEAN= 0
##$ME_mod= 0
##$MI= 0
##$NCOEF= 0
##$NC_proc= -2
##$NLEV= 6
##$NOISF1= 0
##$NOISF2= 0
##$NSP= 0
##$NTH_PI= 0
##$NZP= 0
##$OFFSET= 14.96127
##$PC= 1
##$PHC0= -79.45313
##$PHC1= 0
##$PH_mod= 1
##$PKNL= yes
##$PPARMOD= 0
##$PPDIAG= 0
##$PPIPTYP= 0
##$PPMPNUM= 2147483647
##$PPRESOL= 1
##$PSCAL= 4
##$PSIGN= 0
##$PYNMP= <proc.py>
##$REVERSE= no
##$SF= 400.020009527426
##$SI= 131072
##$SIGF1= 0
##$SIGF2= 0
##$SINO= 400
##$SIOLD= 131072
##$SPECTYP= <>
##$SREGLST= <1H.CDCl3>
##$SSB= 0
##$STSI= 131072
##$STSR= 0
##$SW_p= 8223.68421052631
##$SYMM= 0
##$S_DEV= 0
##$TDeff= 65536
##$TDoff= 0
##$TI= <>
##$TILT= no
##$TM1= 0
##$TM2= 0
##$TOPLEV= 0
##$USERP1= <user>
##$USERP2= <user>
##$USERP3= <user>
##$USERP4= <user>
##$USERP5= <user>
##$WDW= 1
##$XDIM= 131072
##$YMAX_p= 469401708
##$YMIN_p= -13622
##$CURPLOT= <Network HP LaserJet P1505>
##$CURPRIN= <$Network HP LaserJet P1505>
##$DFORMAT= <normdp>
##$LAYOUT= <+/1D_H.xwp>
##$LFORMAT= <normlp>
##$PFORMAT= <normpl>
##$SURQMSG= 1
$$ End of Bruker specific parameters
$$ ---------------------------------
##NTUPLES= NMR SPECTRUM
##VAR_NAME=  FREQUENCY,     SPECTRUM/REAL,   SPECTRUM/IMAG
##SYMBOL=    X,             R,               I
##VAR_TYPE=  INDEPENDENT,   DEPENDENT,       DEPENDENT
##VAR_FORM=  AFFN,          ASDF,            ASDF
##VAR_DIM=   131072,        131072,          131072
##UNITS=     HZ,            ARBITRARY UNITS, ARBITRARY UNITS
##FACTOR=    0.0627417313425164, 1,          1
##FIRST=     8223.62146879497, -994,         -56906
##LAST=      0,             670,             -57399
##MIN=       0,             -13622,          0
##MAX=       8223.62146879497, 469401708,    0
$$ Real data points
##PAGE= N=1
##DATA TABLE= (X++(R..R)), XYDATA
$$ [...]
67864 78020 79177 81382 83651 84804 84629 83753 82835 82227 82073 82277 82443 82190 81532 80828 80375 80153 79915 79440
67846 79440 78720 77934 77193 76401 75424 74298 73073 71619 69928 68469 67743 67417 66469 64533 62615 62042 62947
67829 62947 64259 65046 65379 65882 66899 68305 69822 71278 72591 73652 74308 74553 74765 75532 77049 78772
67813 78772 79882 80085 79750 79340 78898 78165 76977 75481 74061 73057 72467 71898 70956 69692 68552 67852 67410
67796 67410 66735 65484 63701 61745 60077 59054 58808 59229 60026 60810 61254 61262 60997 60699 60491 60399 60365 60197 59702
67777 59702 59081 58974 59753 60883 61423 61207 61017 61452 62179 62682 63213 64357 65992 67447 68657 70353 72901
67760 72901 75686 78048 80203 82679 85320 87489 89017 90209 91071 91176 90364 88991 87453 86007 85108
67745 85108 85203 85926 86206 85591 84959 85431 87015 88835 90274 91230 91451 90418 88022 84847 81636 78744 76199
67728 76199 74006 72292 71279 71038 71145 70810 69613 67975 66630 65880 65681 66086 66986 67636 67146 65484 63471
67711 63471 61766 60433 59540 59452 60305 61740 63338 64844 65812 65700 64628 63440 62614 61679 60088 58165
67695 58165 56661 55843 55593 55932 56792 57599 57827 57814 58302 59217 59629 59079 58291 58243 58924 59404 58957 57832 56914
67676 56914 56776 57177 57522 57691 58109 58981 59821 59996 59490 58879 58768 59507 61135 63181 64746 65217 64912 64682
67658 64682 64990 65649 66293 66667 66583 66034 65379 65035 64945 64648 63821 62499 60914 59510 58928 59461 60547 61291
67640 61291 61490 61648 62024 62285 62220 62163 62413 62822 63266 63991 65060 65945 66176 66088 66365 67064 67695 68135 68874 70202
67620 70202 71633 72391 72200 71384 70464 69907 70126 71330 73249 75185 76499 77021 76938 76499 76043 76114 77030 78259
67602 78259 78672 77730 76030 74405 72880 71046 69065 67565 66647 65784 64805 64156 63927 63381 61974 60291
67586 60291 59347 59293 59408 59120 58507 57902 57553 57630 58141 58772 59145 59193 59055 58758 58400 58469 59434 60930 61902 61786
67566 61786 61193 61160 62013 63225 64129 64443 64232 63689 63011 62264 61386 60459 59891 60096 60935 61710 61858 61538 61408
67547 61408 61906 62899 63959 64725 64987 64668 63919 63084 62359 61617 60772 60203 60418 61213 61570 60708 59040 57780
67529 57780 57623 58092 58224 57632 56739 56151 56056 56249 56504 56752 56950 56950 56608 55909 54954 53934 53205 53205 54060 55246
67509 55246 55853 55319 53846 52191 51161 51273 52570 54591 56640 58254 59387 60120 60373 59996 59042 57824
67493 57824 56757 56180 56184 56484 56551 56082 55337 54912 55176 55958 56720 56936 56355 55087 53557 52324 51845 52322 53633
67474 53633 55371 56955 57809 57581 56346 54659 53276 52614 52421 52113 51465 50890 50971 51849 53121 54299 55267
67457 55267 56283 57625 59295 61054 62654 63892 64509 64287 63371 62282 61451 60876 60386 60047 59986 60006 59786
67440 59786 59439 59509 60321 61659 63110 64349 65040 64895 64062 63131 62459 61807 60924 60181 60214 61089 62219 63093
67422 63093 63787 64640 65699 66556 66721 66126 65253 64632 64155 63122 61138 58790 57191 56888 57446 58058 58355
67405 58355 58525 58790 58952 58593 57743 57133 57533 58903 60442 61448 61801 61671 61237 60834 60872 61281 61449 61044
67387 61044 60513 60331 60158 59291 57732 56242 55416 55204 55288 55420 55417 55298 55443 56124 56924 57140 56837 56947 58089
67368 58089 59792 61105 61612 61634 61802 62611 64032 65350 65789 65474 65342 65838 66284 65955 65233 65003 65262 65162
67350 65162 64363 63580 63582 64305 65202 65983 66645 67157 67534 68009 68703 69232 69011 67945 66539 65320 64431 63857 63726
67331 63726 64166 65080 66332 68045 70404 73095 75273 76251 76098 75339 74254 72820 71292 70373 70503 71230
67315 71230 71665 71541 71467 72018 72911 73319 72820 71744 70657 69837 69330 69177 69370 69758 70227 70858 71716 72640 73487
67296 73487 74418 75617 76764 77281 77187 77224 77882 78664 78716 77954 77085 76641 76444 76081 75455 74656 73593 72068 70169
67277 70169 68412 67444 67580 68571 69809 70803 71473 72017 72629 73489 74808 76553 78140 78787 78313 77386 76778
67260 76778 76570 76311 75852 75638 76073 76838 77171 76821 76412 76666 77426 77815 77334 76462 76023 76300 76954 77499 77555
67241 77555 76881 75614 74415 73919 73978 73868 73297 72920 73602 75412 77530 79039 79687 79931 80330 80939 81366 81456
67223 81456 81648 82388 83397 83978 84032 84275 85342 87058 88763 90020 90785 91192 91420 91601 91666 91514 91371 91621
67205 91621 92108 92050 91007 89582 88692 88445 88263 87940 87928 88537 89399 89935 89999 89817 89566 89268 88945 88661 88463
67186 88463 88402 88544 88842 89063 88955 88512 88058 88010 88547 89484 90466 91217 91538 91248 90382 89434 89079 89534 90468 91620
67166 91620 93060 94651 95710 95704 95025 94605 94910 95784 97001 98370 99393 99555 99073 98660 98477 97971 97023 96443
67148 96443 96852 97772 98491 99275 100892 103255 105417 106817 107704 108281 108274 107651 107059 107118 107704 108316 108797 109352 110142
67129 110142 111183 112436 113713 114739 115502 116218 116719 116347 114968 113730 114073 116109 118591 120493 121926
67114 121926 123337 124549 125108 125115 125128 125424 125850 126335 127095 128254 129621 130979 132385 134001 135743 137258 138264
67097 138264 138869 139475 140262 140846 140651 139711 138862 138919 139838 140989 142126 143698 146102 149018 151687 153663 155019
67080 155019 155945 156484 156685 156772 156969 157266 157497 157645 157896 158403 159166 160282 162118 165009 168748 172578 175747
67063 175747 177933 179175 179682 179885 180399 181610 183341 185146 186885 188812 191139 193743 196288 198447 200052
67048 200052 201309 202854 205312 208671 212304 215653 218623 221242 223330 224835 226144 227664 229188 230184
67034 230184 230675 231400 232901 234921 236945 238982 241356 243957 246330 248504 251143 254612 258350 261585 264291
67019 264291 267003 269926 272788 275436 277997 280492 282910 285745 289774 295006 300471 305356 309784 314092
67005 314092 318064 321579 325351 330105 335395 340250 344772 349939 355808 361137 365191 368813 373081 377862
66991 377862 382521 387264 392684 398426 403485 407791 412508 418523 425423 432271 438785 445331 452170 459196
66977 459196 466273 473498 481049 488939 497002 505177 513716 522886 532451 541740 550467 559120 568236 577620
66963 577620 586736 595598 604672 614077 623612 633571 644731 657215 670013 682013 693098 703944 715286
66950 715286 727728 741711 757003 772555 787489 802034 816951 832356 847828 863525 880235
66939 880235 898093 916026 932942 949000 965329 982869 1001889 1022192 1043262 1064460 1085590
66928 1085590 1107180 1129802 1153281 1177024 1200977 1225622 1251081 1276874 1302777 1329321 1357046
66917 1357046 1385677 1414484 1443165 1471997 1501260 1530933 1560826 1590636 1619958 1648563 1676704
66906 1676704 1704946 1733740 1763338 1793877 1825140 1856362 1886739 1916196 1945337 1974658 2004132
66895 2004132 2033525 2062618 2091008 2118122 2143677 2167852 2190839 2212568 2232990 2252288 2270634
66884 2270634 2288088 2304865 2321164 2336433 2349368 2359186 2366502 2372380 2376890 2379300 2379456 2378061 2375542
66871 2375542 2371449 2365259 2357145 2347570 2336641 2324277 2310596 2295713 2279423 2261456 2241847 2220704
66859 2220704 2197905 2173487 2148157 2122880 2097930 2072655 2046188 2018073 1988315 1957355 1926109
66848 1926109 1895570 1866044 1837009 1807840 1778381 1748603 1718139 1686702 1654821 1623656 1593959
66837 1593959 1565511 1537583 1509661 1481636 1453647 1425963 1398825 1372235 1345994 1320019 1294423
66826 1294423 1269217 1244215 1219381 1195007 1171327 1148254 1125755 1104208 1083960 1064752 1046002
66815 1046002 1027474 1009160 990650 971326 951304 931588 913002 895433 878375 861646 845220
66804 845220 828883 812647 797212 783324 770716 758241 745138 731801 719158 707573 696504
66793 696504 685067 672844 660182 647745 635871 624551 613934 604335 595567 586764 577350 567831
66781 567831 559061 551016 542950 534634 526672 519479 512674 505760 498811 492068 485299 478048 470283 462380
66767 462380 454542 446597 438354 430017 422188 415464 409841 404574 398918 393052 387841 383551 379252 373904
66753 373904 367703 361866 357232 353575 350218 346803 343276 339550 335519 331336 327456 324347 322115 320348
66739 320348 318319 315456 311657 307232 302663 298434 294875 291905 288980 285514 281352 276773 272138 267735
66725 267735 263854 260644 257849 255035 252245 250136 249144 248705 247686 245599 243037 240797 238876 236664 233942
66710 233942 231306 229440 228241 226918 224896 222350 219816 217559 215502 213638 212181 211184 210282 209041 207491
66695 207491 206003 204580 202597 199490 195513 191526 188111 185239 182777 180871 179633 178832 178205 177793 177588
66680 177588 177082 175659 173408 171120 169402 168189 167188 166341 165614 164712 163396 161898 160701 160024 159769 159879
66664 159879 160373 161018 161284 160764 159517 157910 156267 154715 153267 152006 151227 151327 152374 153742 154426 153890
66648 153890 152519 151079 149874 148603 146963 145122 143531 142468 141840 141268 140313 138757 136846 135110 133834
66633 133834 132805 131690 130490 129447 128713 128337 128323 128351 127662 125832 123613 122320 122192 122029 120777 118887
66617 118887 117516 116931 116495 115983 116010 117015 118488 119519 119705 119273 118608 117872 116953 115722 114453 113776 113883
66600 113883 113988 113131 111492 110259 110055 110215 109855 109004 108138 107227 105971 104694 104214 104830 105990 106973 107388
66583 107388 106991 105633 103691 102140 101801 102608 103803 104751 105363 105785 105877 105131 103102 99978 96673 94277
66567 94277 93297 93375 93690 93646 93296 93195 93794 94958 96057 96511 96149 95141 93826 92663 92060 91998 92003 91666 91083
66548 91083 90574 90173 89711 89264 89113 89215 89107 88490 87620 86953 86608 86370 85994 85313 84254 83099 82579 83282
66530 83282 84868 86181 86340 85523 84553 83943 83623 83405 83313 83384 83461 83329 82949 82482 82188 82273 82676 83061 83257 83601
66510 83601 84462 85414 85466 84344 82989 82342 82100 81310 79849 78496 77668 76984 76273 76203 77363 79233 80650
66493 80650 81027 80702 80217 79735 79171 78574 78161 78071 78166 78204 78214 78527 79238 79834 79666 78696 77393 76046 74690
66474 74690 73656 73517 74225 74902 74871 74498 74638 75592 76905 77839 77786 76632 75105 74428 75147 76562 77579 77815
66456 77815 77533 76998 76397 76041 76030 75999 75677 75396 75486 75530 74917 73854 73090 72787 72477 72043 71870 71959 71768 71131
66436 71131 70589 70505 70537 70357 70224 70444 70797 70946 70984 71138 71304 71272 71113 71004 70945 70919 71047 71279 71254 70746 69947
66415 69947 69118 68341 67836 68044 68979 69952 70391 70570 71034 71700 72142 72490 73306 74614 75676 75783 74832 73153
66397 73153 71265 69793 69175 69315 69856 70709 71887 72948 73254 72886 72670 73016 73289 72714 71457 70337 69775
66380 69775 69520 69310 69281 69649 70282 70771 70868 70806 71125 72108 73450 74612 75381 75804 75649 74515 72633 71064
66362 71064 70683 71282 72088 72834 73785 74922 75748 75899 75424 74460 73163 71994 71512 71673 71862 71801 71886 72351 72710
66343 72710 72493 72008 71772 71631 71142 70496 70304 70626 71018 71500 72561 74044 74927 74672 74072 74198 75052 75860
66325 75860 76207 76175 75693 74534 72921 71443 70273 69087 67925 67549 68529 70317 71631 71732 71056 70628 71043
66308 71043 72145 73503 74936 76413 77666 78226 77846 76658 74917 72917 71216 70419 70494 70701 70520 70260
66292 70260 70370 70595 70384 69870 69789 70507 71695 72824 73450 73132 71811 70267 69505 69593 69760 69712 70019 71001 72167
66273 72167 73190 74550 76507 78218 78784 78623 78810 79434 79723 79643 80125 81414 82286 81577 79759 78312 77945
66256 77945 78138 78160 77878 77606 77684 78326 79500 80794 81673 81971 82003 82112 82350 82650 83074 83678 84252 84478 84352
66237 84352 84302 84737 85539 86076 85792 84749 83590 82966 83029 83460 83868 84016 83808 83346 83111 83717 85200 86732
66219 86732 87420 87332 87335 87909 88607 88798 88483 88057 87657 87194 86734 86373 85935 85328 85070 85860 87515 88870 88953 87901
66199 87901 86585 85734 85633 86250 87248 88099 88535 88789 89153 89463 89276 88475 87427 86591 86169 86067 85994 85593 84698
66180 84698 83565 82804 82994 84259 86118 87795 88828 89374 89832 90270 90490 90558 90825 91311 91510 91062 90265 89613
66162 89613 89130 88555 87926 87497 87231 86870 86506 86591 87308 88340 89390 90532 91809 92896 93448 93582 93687 93913
66144 93913 94182 94567 95248 96088 96643 96739 96750 97023 97340 97261 96910 96923 97533 98141 98072 97436 96923 96896 97095 97179 97186 97368
66122 97368 97883 98745 99832 100854 101496 101809 102283 103397 105174 107215 109004 110149 110534 110400 110159 109999 109747
66105 109747 109118 107960 106254 104160 102207 101187 101590 103221 105444 107658 109435 110480 110779 110723 110835 111331
66089 111331 112008 112508 112633 112531 112654 113349 114377 115027 114911 114448 114344 114725 115085 115015 114657 114369 114191 113838 113098
66070 113098 112061 110971 109965 109054 108337 108062 108335 108863 109225 109373 109679 110479 111740 113158 114331 114852 114616
66053 114616 114126 114128 114761 115365 115351 114935 114755 115078 115736 116582 117590 118606 119354 119712 119749 119539 119138 118682 118371
66034 118371 118448 119254 120989 123292 125421 127132 129011 131571 134378 136617 138201 139707 141404 143031 144487
66019 144487 146033 147667 148933 149601 150017 150507 150875 150809 150444 150235 150589 151784 153858 156265 158078 159020 160037
66002 160037 162391 166286 170799 175052 178971 182884 186887 190876 194845 198779 202389 205327 207693 210025
65988 210025 212639 215161 216842 217224 216288 214129 210876 206910 202808 198862 194890 190676 186373 182299 178522
65973 178522 174845 171049 167041 163005 159575 157545 157044 157263 157330 157247 157497 157990 158009 157251 156316 155910 155980 155934
65955 155934 155529 155224 155663 157016 158899 160934 163256 166207 169611 172795 175469 178107 181109 184137 186839
65940 186839 189757 193672 198258 202283 205101 207066 208427 208862 208485 208331 209158 210427 211170 211426 212080 213662
65924 213662 215993 218848 222205 225860 229396 232609 235584 238317 240692 242927 245635 249282 253810 258855
65910 258855 264033 268804 272308 273773 273289 271989 271206 271318 271629 271408 270752 270155 269578 268505 266783 264763
65894 264763 262543 259715 256085 252052 247874 243116 237322 230836 224440 218399 212364 206073 199728 193765
65880 193765 188575 184338 180833 177550 174178 170827 167605 164457 161685 160091 159965 160324 159888 158614 157587
65865 157587 157500 157980 158394 158503 158169 157128 155423 153584 152192 151605 152144 153861 155961 157191 157278 157410 158791
65848 158791 161214 163610 165538 167349 169193 170725 171889 173143 174560 175319 174655 173047 171897 172009 172776
65833 172776 173031 172414 171655 171642 172544 174002 175897 178606 182495 187407 192779 198169 203558 209175 215128 221190
65817 221190 226913 231908 235969 238938 240575 240603 238854 235349 230438 224888 219594 214923 210516 206003 201664
65802 201664 197997 194853 191674 188566 186376 185374 184539 182770 180371 178557 177651 176614 174478 171581 168975
65787 168975 167123 165733 164712 164703 166492 170136 174912 180037 185279 190853 196898 203237 209605 215885 222033
65772 222033 227860 233023 237137 239815 240706 239652 236754 232194 226142 219039 211771 205176 199377 193925
65758 193925 188704 184411 182021 182024 184313 188446 193824 199950 206909 215408 226005 238429 251991 266484
65744 266484 282164 298832 315403 330573 343595 354316 362790 368985 372556 372715 368678 360541 349434
65731 349434 336554 322253 306375 289255 271974 255681 241000 228029 216538 206122 196434 187421
65719 187421 179202 171781 165044 159017 153868 149668 146333 143810 142108 141117 140558 140113 139451 138232 136339
65704 136339 134163 132364 131317 130937 130997 131355 131890 132522 133369 134614 136117 137388 138067 138266 138426 139009 140302
65687 140302 142196 144123 145527 146491 147622 149353 151703 154749 158721 163426 168194 172805 178038 184790
65673 184790 193033 202228 212449 224373 238208 253312 269034 285383 302685 320960 339768 358222
65661 358222 375017 388912 399599 407803 414180 418356 419530 417967 415377 413589 413079 413057 412783 412485 412936
65646 412936 414477 416683 418794 420148 420244 418750 415558 410560 403243 392835 379134 363018 345808 328209
65632 328209 310108 291287 272044 253121 235391 219657 206381 195344 185727 176803 168620 161900
65620 161900 157255 154497 152717 150962 148833 146509 144376 142687 141428 140256 138665 136476 134193 132570
65606 132570 131766 131266 130750 130580 131102 131880 132190 132057 132222 133050 134037 134512 134382 133963 133470 132977 132646 132685 133186
65587 133186 134200 135869 138331 141579 145527 150094 155078 160094 164907 169905 176109 184613 195874 209443
65573 209443 224322 239749 255715 272693 290773 309137 326423 341543 354075 363981 371130 375160
65561 375160 375725 372779 366592 357553 345999 332238 316701 300015 282881 265864 249271 233220
65549 233220 217895 203708 191161 180512 171593 164029 157561 152161 147899 144762 142560 140968 139675
65536 139675 138520 137485 136610 135980 135743 136003 136670 137549 138543 139568 140269 140092 138798 136726 134360 131831
65520 131831 129070 126311 124061 122549 121430 120187 118772 117700 117471 117948 118437 118464 118359 118870 120217 121798
65504 121798 122897 123493 124171 125362 126768 127544 127087 125728 124518 124143 124266 124269 124385 125443 127549 129840 131772
65487 131772 133886 136809 140201 143296 145942 148391 150527 152070 153183 154034 154001 152287 149291 146457 144658
65472 144658 143475 142226 140926 139889 139070 138148 136848 134960 132517 130102 128401 127297 125985 124126 122249
65457 122249 120788 119520 118357 117904 118546 119619 120216 120406 120919 121966 123133 124238 125518 127038 128598
65442 128598 130233 132147 134090 135451 136149 136951 138601 141010 143490 145465 146784 147618 148297 149082 149908 150414
65426 150414 150273 149485 148366 147420 147051 147162 147114 146402 145303 144472 143939 143006 141296 139382 138093 137624 137644 137887
65408 137887 138147 138024 137323 136587 136559 137073 137160 136494 136039 136842 138733 140820 142839 145238 148154 151148 153971
65391 153971 156766 159329 160965 161476 161594 161896 161955 161171 159883 158837 157921 156410 154298 152486 151570 151272
65375 151272 151271 151806 153052 154569 155804 156733 157695 158922 160530 162591 164934 167204 169372 171849 174910 178409
65359 178409 182275 186812 192174 198031 204188 211057 218954 227279 235005 241768 247872 253322 257495 259790
65345 259790 260152 258845 256131 252322 247841 243088 238353 233829 229472 224909 219739 213943 207885 201961
65331 201961 196390 191242 186455 181924 177686 173902 170599 167706 165504 164575 164948 165663 165691 165012 164220 163325
65315 163325 161679 159007 155752 152307 148687 145177 142553 141141 140209 138851 137060 135455 134313 133562 133440
65300 133440 134387 136150 137629 137832 136656 134649 132555 131308 131886 134504 138169 141525 144092 146215 147910
65285 147910 148492 147550 145740 144215 143651 144167 145687 147746 149238 149182 147799 146258 145272 144552 143742 143131 143096
65268 143096 143375 143417 143088 142605 142114 141796 142035 142924 143831 144029 143703 143775 144710 146057 147251 148320 149488 150423
65250 150423 150386 149118 147255 145692 144656 143599 142026 140172 138637 137544 136423 134848 132808 130481 128191
65235 128191 126661 126649 127994 129558 130584 131557 133157 134868 135441 134533 133041 131816 130841 129818 128918 128590
65219 128590 129017 130032 131271 132295 132822 132966 133014 133010 132842 132682 132885 133385 133646 133365 132852 132549 132494 132458 132324
65200 132324 132107 131785 131259 130353 128883 127012 125555 125567 127396 130296 133063 134862 135561 135679 136173 137828
65184 137828 140488 143014 144225 143875 142683 141615 141160 141049 140573 139334 137763 136716 136538 136695 136405 135369
65168 135369 133866 132404 131367 130860 130788 131207 132435 134600 137238 139725 141964 144158 145972 146629 146053 145309
65152 145309 145489 146592 147852 148846 149850 151395 153900 157555 162202 167390 172810 178590 184990 192008 199448
65137 199448 207125 214693 221532 227209 231972 236489 241171 246023 251013 256177 261241 265457 268052 268854
65123 268854 268439 267645 266928 266138 264916 263182 261126 258821 256081 252695 248538 243439 237265 230252 222977
65108 222977 215827 208695 201334 193832 186615 180134 174622 169928 165578 161266 157354 154555 153007 152043
65094 152043 151030 149998 149193 148439 147370 146052 144930 144243 143774 143094 141903 140388 139364 139668 141083 142202
65078 142202 141828 140282 138869 138311 138240 138151 138166 138699 139788 141053 142122 142939 143768 144954 146556 148269 149739
65061 149739 150890 151840 152689 153512 154398 155337 156278 157403 158976 160654 161421 160680 159070 157620 156372 154543
65045 154543 151964 149544 148182 147868 148052 148250 148020 146961 145243 143704 142918 142407 141218 139073 136514 134037
65029 134037 131565 128847 126014 123633 122357 122539 123929 125682 126844 127015 126473 125664 124817 124191 124425 126185
65013 126185 129307 132669 135233 137047 138890 141077 143165 144850 146517 148550 150622 152210 153495 155035
64999 155035 156721 157830 158259 158993 160874 163342 164939 164922 163966 163287 163458 164171 164907 165567 166449 167822 169706
64982 169706 172039 174810 177851 180663 182712 183832 184158 183714 182365 180204 177680 175189 172716 169992 166930
64967 166930 163791 161045 159145 158310 158388 158889 159173 158706 157370 155667 154448 154119 154186 153848 152994 152265 152098
64950 152098 152094 151470 149918 147817 145798 144266 143182 142187 141035 139937 139278 139015 138657 137955 137263 137052 137431
64933 137431 138383 140077 142426 144553 145345 144621 143353 142585 142486 142621 142735 142843 142691 141623 139252 136113 133402
64916 133402 132035 132069 133045 134655 136839 139374 141762 143695 145362 147083 148826 150330 151604 153019 154867
64901 154867 157042 159238 161391 163919 167571 172877 179592 186702 193240 199093 204878 211104 217704 224389
64887 224389 231057 237715 244190 250163 255299 259196 261381 261590 259947 256671 251802 245496 238492 231877
64873 231877 226317 221721 217676 213960 210630 207973 206437 206249 206846 207066 206262 204974 204172 204002 203722 202703
64857 202703 200902 198340 194704 189886 184497 179440 175061 171076 167248 163764 160924 158745 157044 155707
64843 155707 154732 154017 153330 152578 152006 151995 152595 153357 153753 153706 153563 153596 153711 153706 153606 153623 153872 154274 154726 155261 156009
64822 156009 157002 158085 159069 160049 161420 163476 166052 168772 171597 174887 178862 183255 187638 191902 196209
64807 196209 200587 204804 208699 212454 216318 219945 222178 221881 219204 215721 212962 210956 208566 205084
64793 205084 200982 197154 194097 192008 191104 191380 192390 193656 195014 196287 197004 196897 196383 196043 195759 194856
64777 194856 193070 190978 189483 189144 189960 191474 193151 194932 197400 201049 205493 209743 213323 216785 221014
64762 221014 226192 231529 235954 239171 242090 246006 251204 256630 261222 265258 269987 276101 283040 289627
64748 289627 294890 298272 299594 299013 296803 293116 288105 281966 274608 265647 255322 245143 236829 230677
64734 230677 225739 221541 218678 217505 217286 217205 217409 218349 219705 220745 221351 221939 222597 223055 223359 223909 224916
64717 224916 226437 228978 233358 239751 247344 255125 262575 269316 274515 277132 276685 273524 268367 261815
64703 261815 254305 246289 238241 230449 222900 215462 208182 201347 195298 190239 186205 183098 180741 179024
64689 179024 178042 177969 178710 179745 180408 180331 179660 178899 178511 178659 179385 181006 184037 188513 193697 198818 203926
64672 203926 209596 215856 221950 227179 231508 235189 238256 240600 242072 242244 240443 236436 230915 225084
64658 225084 219941 216005 213298 211317 209318 207005 204766 203068 201954 201389 201679 203075 205231 207511 209678
64643 209678 211929 214399 217051 219925 223130 226713 230872 236114 242766 250389 258081 265300 271977 277958
64629 277958 282856 286535 289314 291489 292968 293434 292604 290216 286017 279955 272326 263705 254831 246447 239066
64614 239066 232906 228070 224531 221767 218768 214926 210761 207377 205274 204124 203544 203479 203808 204142 204237 204187
64598 204187 204049 203739 203399 203400 203709 203739 203196 202695 203102 204534 206481 208792 211990 216572 222416 229077 236478
64581 236478 245032 255055 266177 277448 288030 297678 306461 314203 320496 325220 328725 331360 333042
64568 333042 333400 332135 329106 324260 317712 309808 300954 291474 281702 272082 262993 254561 246776 239750
64554 239750 233712 228725 224582 221052 218173 216200 215195 214716 214080 212979 211763 211034 211068 211728 212754 214022
64538 214022 215580 217557 219919 222141 223329 222893 220989 218125 214639 210853 207417 204891 203120 201584
64524 201584 200304 199753 199899 200057 199888 199796 200025 200109 199729 199475 200036 201094 201790 201980 202226 202727 203062 203083 203339
64505 203339 204384 206246 208776 212067 216180 220836 225676 230646 235854 241183 246128 249964 252113 252642
64491 252642 252347 251998 251480 250074 247631 244992 243046 241910 241387 241757 243498 246420 249659 252545 255008
64476 255008 257083 258483 258803 257874 255755 252611 248719 244393 239793 235069 230803 227994 227314 228556 231018
64461 231018 234255 238143 242354 246232 249260 251327 252431 252394 251126 248945 246412 243940 241757 240093 239125
64446 239125 238737 238604 238614 239028 240114 241725 243405 244868 246367 248597 252229 257443 263855 270938 278485
64431 278485 286632 295628 305820 317834 332411 349798 369518 391038 414612 441324 472464 509161
64419 509161 552544 603787 663715 732418 809231 892658 980052 1067741 1152155 1231098 1303824
64408 1303824 1369877 1428187 1477316 1516065 1543414 1558107 1558981 1546053 1521093 1486755 1444833 1395183
64396 1395183 1336291 1267104 1188653 1104010 1016779 929791 845289 765752 693671 630341 575389
64385 575389 527774 486820 452018 422446 397081 375483 357587 342899 330497 319834 310924 303614
64373 303614 297298 291631 286984 283706 281277 278653 275220 271006 266099 260428 254108 247589 241310 235453
64359 235453 230126 225510 221708 218667 216348 214835 214143 214032 214148 214310 214678 215731 218020 221706 226206
64344 226206 230425 233462 235071 235470 234863 233303 230887 227878 224514 220801 216617 212148 208208 205856 205454
64329 205454 206161 206696 206678 206895 208130 210107 211991 213670 215916 219229 223048 226408 228952 230954 232679
64314 232679 234203 235752 237594 239502 240751 240899 240211 239052 237185 234046 229519 224068 218227 212366 206864
64299 206864 202035 197708 193346 188822 184755 181790 179829 178355 177327 177255 178354 179983 181131 181219 180374
64284 180374 179177 178402 178751 180518 183443 186997 190764 194496 198040 201491 205357 210165 215848 221759 227347
64269 227347 232469 236895 239984 241330 241476 241432 241502 241110 239877 238312 237191 236688 236557 236776 237463 238303 238600
64252 238600 237912 236238 233589 229882 225406 220895 216784 212701 208018 202812 197960 194316 191955 190246
64238 190246 188531 186821 185844 186310 188071 190210 192048 193796 196013 198733 201507 204102 206650 209123 211214
64223 211214 212971 215127 218423 222760 227288 231243 234477 237269 239883 242313 244274 245440 245869 246121 246755
64208 246755 247726 248561 249135 249906 251201 252548 253031 252176 250203 247542 244517 241496 238913 236886 235043 232995
64192 232995 230853 229112 228166 228194 229448 232326 237082 243541 251197 259479 267913 276048 283267 288713 291553
64177 291553 291394 288342 282665 274644 265013 255236 246857 240367 234888 229101 222426 215352 208864 203642
64163 203642 199667 196495 193853 191825 190366 188924 186935 184607 182762 181865 181683 182003 183166 185544 188924
64148 188924 192806 197033 201615 206153 210021 213163 216199 219581 222948 225547 226965 227242 226422 224358 221067
64133 221067 217162 213707 211469 210315 209492 208491 207451 206654 206010 205326 204862 205189 206549 208694 211345 214449
64117 214449 217915 221439 224744 227765 230594 233509 237148 242222 248813 256092 262902 268486 272609 275390
64103 275390 277255 278743 280036 280878 281346 282442 285404 290394 296263 301724 306435 310829 315232 319362 322501
64088 322501 323943 323384 321074 317604 313449 308695 303170 296810 289944 283320 277662 272943 268168 262297
64074 262297 255491 249160 244632 242061 240754 240115 239891 239876 239960 240385 241399 242606 243133 242610 241544 240580 239829
64057 239829 239180 238821 239043 239767 240674 241670 242848 244140 245410 246862 248978 252026 255928 260557 265811 271411
64041 271411 277080 283014 289686 297006 304099 310239 315606 320730 325453 328926 330494 330167 328304 325330
64027 325330 321769 318163 314781 311696 309201 307794 307617 308225 309035 309765 310249 310161 309182 307223 304201 299835
64011 299835 294047 287506 281409 276642 273355 271254 269926 268831 267371 265336 263190 261680 261076 260899 260434
63996 260434 259534 258853 259189 260597 262339 263789 265135 266897 269044 271071 272950 275344 278712 282690 286778
63981 286778 291166 296316 301972 307267 311874 316491 322021 328597 335575 342135 347710 352213 356162 360516
63967 360516 366133 373375 382243 392609 404184 416428 428803 441189 454026 468040 483771 501183
63955 501183 519810 539519 561102 585845 614544 647357 684708 727790 777837 835391 900859
63944 900859 975679 1062392 1163528 1280665 1414329 1564310 1729899 1910109 2103762 2309281
63934 2309281 2524563 2747295 2975145 3205081 3432405 3650769 3853282 4033602 4186451
63925 4186451 4308041 4396485 4451509 4473394 4462064 4416974 4337584 4224128 4078618 3905398
63915 3905398 3710438 3499878 3279317 3054065 2829055 2608002 2393217 2186766 1991418
63906 1991418 1810010 1644274 1494853 1362072 1245950 1145562 1059190 985271 922656 869843
63896 869843 824638 785009 750018 719542 693321 670594 650554 632768 616977 602567 588384
63885 588384 573219 556671 539543 523261 508905 496832 487043 479411 473400 468073 462960 458911 457594
63872 457594 459871 464920 471200 478049 486002 495704 507085 519829 534186 550837 570082 591575 614905
63859 614905 640114 667548 697460 729785 763963 798800 832714 864373 893070 918498 940375
63848 940375 958418 972495 982617 988832 991173 989582 983870 973899 959831 942033 920745 896174
63836 896174 868902 839805 809357 777354 743630 708789 673984 640184 607887 577265 548296
63825 548296 520916 495347 472105 451476 433152 416647 401778 388432 376119 364227 352591
63814 352591 341462 331042 321476 313165 306568 301635 297724 294127 290395 286348 282121 278183 274886 271996
63800 271996 268974 265650 262270 258991 255740 252491 249283 246038 242837 240219 238621 237530 235853 233229
63786 233229 230415 228225 226720 225587 224641 223655 222389 221170 220845 221638 222566 222471 221208 219323 217083 214533
63770 214533 212131 210549 209889 209706 209717 209966 210361 210588 210501 210160 209518 208511 207405 206557 205859 204901 203720 202907
63752 202907 202891 203601 204869 206623 208471 209644 209717 209098 208513 208274 208300 208599 209394 210859 212924 215299 217584
63735 217584 219538 221364 223531 226170 228801 230800 232010 232768 233550 234754 236643 239261 242445 246039 250004
63720 250004 254280 258766 263553 268854 274462 279563 283463 286305 288612 290313 290815 290086 288918 287733 285711
63705 285711 281762 276144 270433 265898 262565 260024 258484 258446 259725 261478 263149 264869 266919 269382 272496
63690 272496 276729 282048 287442 291742 294736 297040 299011 300357 300859 300883 300920 301047 301106 301148 301366 301777 302199
63673 302199 302454 302400 301963 301365 301154 301782 303287 305484 308175 310899 312846 313588 313730 314240 315118 315251 313711
63656 313711 310603 306453 301393 295479 289396 284196 280357 277489 274920 272262 269512 267017 265314 264642
63642 264642 264522 264145 263248 262349 262094 262670 263913 265622 267616 269835 272636 276720 282406 289048 295485 301084
63626 301084 306229 311872 318795 327204 336710 346664 356683 366981 378093 390271 403329 417116 431947
63613 431947 448368 466649 486762 508851 533355 560441 589599 620183 652245 686257 721721
63602 721721 756359 787040 811394 828410 837987 840658 837802 831468 823525 815087 806736 798916 791891
63589 791891 785515 779170 771691 761359 746489 726495 702342 675844 648629 621743 595806 571238
63577 571238 548581 528766 512716 500456 491048 483712 478573 475878 475043 475237 476612 480020 485493 491840
63563 491840 498018 504229 511252 519197 527411 535296 542836 550440 558676 568132 579283 592318 607112
63550 607112 623422 641360 661902 686839 717918 755860 800072 848710 898356 943839 979471
63539 979471 1001418 1009205 1005126 992558 974806 954832 935294 918476 905954 897989 893176 889105
63527 889105 883698 875918 865306 851269 833041 810062 782285 750410 716042 681247 647579 615589
63515 615589 585321 556954 530795 507015 485741 467189 451359 437756 425693 414772 404849 395754
63503 395754 387365 379796 373187 367343 361889 356738 352160 348403 345424 342960 340718 338542 336515 334810
63489 334810 333349 331833 330221 328974 328539 328737 328979 329036 329327 330442 332582 335461 338647 342001 345855 350610
63473 350610 356092 361429 365699 368584 370343 371315 371571 370779 368258 363511 356984 350062 343969 338881 334358
63458 334358 330312 327051 324553 322398 320486 319307 319233 319895 320595 321181 322241 324401 327618 331346 335407
63443 335407 340442 347198 355483 364303 373251 383288 395837 411492 430193 452476 479866 513616
63431 513616 552943 594308 632394 662463 682624 694140 699559 700891 699751 698459 699794 705504 715805
63418 715805 730556 750262 775639 806751 842940 883085 925378 967036 1004769 1035658 1057682
63407 1057682 1069925 1072817 1068222 1058895 1047534 1036070 1025531 1016303 1008350 1001028 992708 981025 964121
63394 964121 941781 915071 884898 851388 814832 776686 739231 704357 672902 644836 619677
63383 619677 596795 575786 556750 540148 526348 515352 506916 500804 496909 495182 495517 497783 501958
63370 501958 508111 516167 525767 536500 548211 561038 575296 591381 609597 629844 651712 675054
63358 675054 700231 727544 756817 788033 821950 859281 899213 939393 977372 1011365 1039624
63347 1039624 1060184 1071960 1075639 1072974 1065573 1054832 1042455 1030191 1018971 1008660 998506 987445
63335 987445 974167 957446 936513 910967 880575 845670 807756 769232 732261 697976 666746
63324 666746 638934 615244 596388 582545 573361 568522 567984 570971 574623 574362 566402 550141 528133
63311 528133 504079 480967 460435 442928 428184 415856 405823 397869 391304 385252 379253 373407
63299 373407 368104 363807 360817 358819 356818 353934 350173 346084 341892 337448 332862 328562 324735 321299
63285 321299 318438 316459 314927 312686 309236 305588 303223 302508 302642 302857 303051 303316 303496 303409 303035 302252 300747
63268 300747 298589 296652 295956 296548 297421 297700 297583 297790 298440 299018 299339 299872 300878 301818 302131 302202 302973 304785
63250 304785 307206 309879 312896 316157 319064 321225 323102 325515 328724 332313 335797 339038 342191 345601
63236 345601 349734 354917 361029 367650 374593 382181 390884 400770 411432 422433 433682 445216 456668
63223 456668 467220 476243 483932 491141 498678 506886 515775 525226 534993 544744 554287 563697 573177 582771
63209 582771 592135 600482 606904 610995 613078 613542 612098 608066 601414 593057 584023 574799 565698 557307
63195 557307 550121 544050 538813 534616 532004 531234 532364 535894 542623 552644 564987 578562 593179
63182 593179 609413 627779 648265 670396 693419 716603 739723 763196 787496 812470 837372
63171 837372 861461 884313 905776 926037 945684 965267 984577 1002602 1018266 1030902 1039814 1043758
63159 1043758 1041322 1031901 1016051 994884 969214 939335 905518 868701 830646 793202 757282 722754
63147 722754 689517 658407 630659 606631 585608 566897 550591 536916 525266 514448 503839
63136 503839 493939 485716 479599 475124 471316 467406 463363 459863 457713 457277 458405 460745 463958 467794
63122 467794 472187 477257 482996 488960 494502 499360 503813 508222 512645 517019 521483 526288 531439 536581
63108 536581 541207 544940 547707 549846 551955 554522 557548 560546 562865 564146 564626 565078 566215 567988 569589
63093 569589 570345 570558 571324 573504 577015 580987 584348 586320 586700 585940 584746 583417 581695 579377 576836
63078 576836 574641 572821 570850 568384 565570 562555 559113 555142 551304 548724 547986 548657 549896 551311 553134
63063 553134 555710 559050 562919 567297 572609 579411 587881 597788 609013 621872 636725 653409 671381
63050 671381 690403 710793 732953 756894 782333 808955 836331 863811 890845 917450 944117
63039 944117 971137 998141 1024368 1049257 1072775 1095316 1117478 1139867 1162763 1185775 1207897
63028 1207897 1228191 1246338 1262271 1275281 1283958 1287226 1285119 1278124 1266060 1248235 1224658 1196618
63016 1196618 1165999 1134540 1103840 1075302 1049529 1026156 1004883 986532 972582 963805 959832 960111
63004 960111 964795 974511 989583 1009774 1034645 1063884 1097310 1134566 1174886 1217171 1260407 1303996
62992 1303996 1347749 1391709 1436061 1480933 1526047 1570649 1614058 1656229 1697460 1737543 1775418
62981 1775418 1809662 1839012 1862265 1877914 1884209 1879718 1863895 1837162 1800487 1754846 1701122 1640500
62969 1640500 1574775 1506127 1436642 1368049 1301690 1238423 1178646 1122584 1070499 1022514 978504
62958 978504 938430 902494 870500 841253 813242 785979 760093 736016 713252 691260 670376
62947 670376 651237 633698 616959 600590 584783 569661 554999 540763 527397 515320 504467
62936 504467 494562 485546 477523 470467 464210 458642 453796 449797 446753 444488 442367 439717 436587 433799
62922 433799 431933 430525 428668 426217 423960 422587 422003 421749 421598 421453 421058 420264 419359 418693 418134 417240 415884
62905 415884 414315 412735 411320 410589 411123 412671 414091 414551 414408 414567 415406 416793 418711 421185 423736 425649
62889 425649 426833 427889 429263 430920 432904 435529 438635 441252 442465 442308 441392 440057 438328 436337 434134
62874 434134 431309 427466 423096 419302 416531 414139 411375 408231 405018 401669 398003 394313 391067 388194
62860 388194 385215 382082 379278 377020 374928 372758 370955 370032 369676 369017 367707 366312 365648 366093 367521
62845 367521 369431 370979 371369 370578 369406 368491 367507 365821 363713 362309 362142 362367 361766 360198 358616 357826
62829 357826 357682 357499 356836 355740 354558 353718 353526 353899 354418 354821 355346 356365 357809 359263 360689 362672
62813 362672 365747 369643 373456 376489 378695 380320 381443 382052 382437 383269 385185 388366 392504 397138 401905
62798 401905 406478 410502 413832 416805 419965 423404 426651 429408 432227 436151 441776 448953 457328 466823
62784 466823 477576 489807 503929 520533 539947 561897 585758 611119 638080 667076 698457
62773 698457 732114 767413 803550 839905 875945 910846 943488 972882 998374 1019410 1035357
62762 1035357 1045634 1049753 1047178 1037485 1020941 998724 972361 943055 911578 878491 844303 809607
62750 809607 775220 741873 709660 678224 647744 619298 593793 570910 549627 529507 510929
62739 510929 494291 479668 467206 457136 449247 442867 437564 433421 430419 428016 425709 423667 422429
62726 422429 422090 422133 422116 422304 423428 425801 428880 431960 435259 439869 446417 454246 462339 470651 479909 490465
62710 490465 502199 515501 531318 549917 570340 591687 614432 640005 669439 702905 740277
62699 740277 781472 826363 874865 927315 984502 1047245 1115996 1190698 1270703 1354658 1440523
62688 1440523 1525858 1608250 1685648 1756259 1817989 1868169 1904172 1924390 1928413 1916412 1888845
62677 1888845 1846813 1792207 1727182 1653796 1574297 1491301 1407285 1324123 1243269 1166035 1093276
62666 1093276 1025137 961541 902784 849280 800910 757072 717290 681393 649136 620063 593857
62655 593857 570526 550142 532543 517324 503908 491559 479562 467562 455790 444882 435403 427362
62643 427362 420167 413149 406234 399984 394980 391285 388502 386139 383861 381692 380056 379394 379524 379604 378901
62628 378901 377385 375429 373220 370726 368000 365165 362213 359158 356345 354370 353643 354042 354867 355138 354334
62613 354334 353091 352842 354365 356853 358808 359746 360593 362407 365142 367849 369840 371440 373658 377235 382038
62598 382038 387357 392703 398253 404625 412496 422347 434182 447373 461147 475461 491119 508796 528163
62585 528163 548095 567353 584861 599779 611767 620934 627177 629860 628497 623451 615513 605125 592526
62572 592526 578371 563556 548487 533105 517539 502234 487504 473523 460704 449492 439669 430367
62560 430367 420923 411407 402376 394518 388493 384570 382301 380923 380058 379580 379018 377780 376024 374608 373975
62545 373975 373736 373491 373341 373315 373068 372631 372785 374095 376072 377880 379463 381264 383230 384885 386322 388312
62529 388312 391330 394992 398718 402545 407072 412836 419968 428402 438261 449938 463709 479289 496068
62516 496068 513940 533662 556258 582215 611464 643897 679592 718668 761153 806877 855158
62505 855158 904597 953439 1000165 1043667 1082898 1116562 1143144 1161313 1170494 1171164 1164357 1150756
62493 1150756 1130645 1104989 1076175 1047113 1019654 994211 970773 949766 931933 917858 907816
62482 907816 901822 899744 901513 907140 916034 926316 935285 940971 943019 942057 938536 932326 922830 908986
62468 908986 889504 863866 833214 799865 765854 732097 698773 665945 633679 602186 572255
62457 572255 545183 521783 501607 483618 467493 453859 443208 435132 428830 423967 420658 418829
62445 418829 417955 417422 416900 416383 416118 416552 418205 421430 426221 432170 438562 444656 449969 454303 457529 459476
62429 459476 460040 459191 456844 452915 447603 441384 434622 427483 420348 413908 408500 403618 398553 393307 388459
62414 388459 384254 380384 376669 373432 371001 369224 367741 366521 365948 366351 367416 368060 367244 365194 363488
62399 363488 363448 364716 365984 366865 368179 370432 373062 375524 378205 381652 385602 389506 393504 398131 403438
62384 403438 409139 415376 422521 430337 438080 445553 453409 462226 471832 481700 491549 501250 510570 519422
62370 519422 528193 537581 548086 559735 572231 585353 599351 614930 632718 652778 674895 699382
62358 699382 727407 760418 799349 844353 895040 950736 1010507 1072987 1136267 1198037 1255999
62347 1255999 1308175 1352845 1388503 1414247 1430326 1438085 1439041 1433915 1422493 1404355 1379617 1348916
62335 1348916 1312836 1271762 1226554 1179091 1131662 1085808 1042144 1001226 963883 930375 899881
62324 899881 871436 845037 821234 799777 779343 758574 736902 714379 691322 668293 645904
62313 645904 624433 603940 584834 567879 553354 540577 528560 516967 506252 497114 490003 484942
62301 484942 481492 478945 476727 474647 472846 471736 471936 473842 477012 480259 482647 484303 486084 488641
62287 488641 491964 495653 499331 502893 506536 510453 514387 517670 519937 521620 523485 525788 528213 530515
62273 530515 532905 535802 539522 544287 550233 557302 565291 574177 584307 596199 610290 626920 646462
62260 646462 669365 696090 727058 762607 803021 848568 899406 955339 1015738 1079748 1146362
62249 1146362 1213982 1280003 1341151 1394360 1437319 1468611 1488010 1496784 1497103 1490590 1477483 1457220
62237 1457220 1429304 1393300 1348675 1295631 1236095 1173133 1109221 1045663 983778 925683 873202
62226 873202 826522 784740 747475 715094 687360 662830 640142 619363 601459 586671 574032
62215 574032 562485 551896 542687 534890 527962 521427 515269 509598 504274 499105 494263 490202 487185 485092
62201 485092 483679 482874 482844 483965 486633 490749 495413 499625 503565 508694 516186 525593 535538 545403 555663
62186 555663 566660 577925 589033 600479 613189 627397 642438 657408 671694 684968 697086
62175 697086 708056 717979 727096 736057 746069 758591 774843 795569 820962 850605 883755 920118
62163 920118 960350 1005468 1055570 1109210 1163957 1217336 1267161 1311318 1347727 1374884 1392504
62152 1392504 1401492 1403140 1398277 1387156 1369883 1346613 1317397 1282260 1241699 1196933 1149518 1100911
62140 1100911 1052512 1005872 962559 923791 890282 862240 839366 821010 806435 794785 784845
62129 784845 775322 765749 756804 749340 743285 737830 732405 727022 721935 717653 715155 715276 717676 721098
62115 721098 725002 730432 738862 750628 764803 779974 794415 805872 812232 812886 809117 803105 796865
62102 796865 792121 790375 792241 796521 800305 800409 795112 784943 772038 758761 746790 737166 730638
62089 730638 727437 726848 727620 729128 731858 736539 743224 751550 761547 773604 787754 803661 821332 841234
62075 841234 863539 887819 913707 941268 970301 999848 1028972 1057566 1085793 1113164 1139070
62064 1139070 1164059 1189646 1216762 1245188 1274589 1305067 1336191 1366258 1393225 1415898 1433680
62053 1433680 1445804 1451682 1451839 1447690 1440390 1430223 1416809 1399219 1376072 1346477 1311100 1271775
62041 1271775 1229902 1185818 1139833 1093082 1046880 1001782 957853 915508 875464 838079 803387
62030 803387 771781 744070 720617 700828 683702 668621 655349 643540 632665 622372 612599 603239
62018 603239 593964 584499 574851 565130 555353 545619 536355 528124 521233 515720 511611 508916 507447 506957
62004 506957 507486 509269 512234 515887 519838 524158 529044 534383 539804 544985 549761 554055 557716 560298
61990 560298 561048 559462 555905 551258 545895 539392 531359 522060 512011 501518 490999 481206 472595 464817
61976 464817 457347 450283 444036 438598 433708 429468 426100 423342 420756 418435 416606 414639 411378 406711
61962 406711 402012 398693 396869 395805 395077 394856 395354 396463 397816 399004 399924 401010 402859 405537 408595
61947 408595 411898 416019 421580 428578 436688 445946 456738 469263 483340 498770 515677 534382 554892
61934 554892 576510 598139 619147 639817 660687 681598 701732 720411 737363 752277 764743
61923 764743 774801 782956 789331 793131 793324 789621 782670 773625 763813 754487 746543 740494 736759 735814
61909 735814 738031 743625 752740 765244 780413 797263 815186 833781 852032 868296 881324 890633
61897 890633 895666 895398 889408 878747 865055 849188 831388 812337 793127 774263 755511 736832
61885 736832 718877 702406 687698 674609 662804 651784 641056 630390 619691 608685 597158
61874 597158 585520 574722 565510 558093 552542 549050 547519 547271 547508 547900 548558 549678 551551 554800 560186
61859 560186 568023 577968 589525 602596 617358 633687 651101 669446 689433 712183 738288 767473
61847 767473 799029 832213 866307 900751 935352 969967 1003722 1034780 1061152 1081591 1095649
61836 1095649 1103205 1104265 1099098 1088314 1072979 1054750 1035654 1017480 1001465 988656 980209 976998
61824 976998 979115 986052 997232 1012086 1029672 1048371 1065898 1079666 1087600 1088924 1083969 1072991
61812 1072991 1055568 1031484 1001803 968484 933108 896485 859409 823107 788748 756901 727691
61801 727691 701174 677367 656093 637043 619973 604802 591500 579912 569736 560825 553423 547839
61789 547839 543822 540552 537383 534342 531760 529827 528711 528742 530027 532109 534321 536336 538172 539991 542115
61774 542115 544816 547727 549875 550792 551230 552259 554016 555924 557759 559733 561867 564097 566839 570537 574637
61759 574637 577864 579645 580509 581050 581393 581811 582836 584325 585240 584919 583863 582741 581325 579140 576563 574384
61743 574384 572541 570106 566501 562078 557500 553102 548938 545037 541476 538421 536094 534457 533102 531766
61729 531766 530928 531404 533279 535573 537141 537763 538200 539338 541401 543902 546189 547992 549544 551318 553629
61714 553629 556387 559077 561104 562292 562983 563430 563213 561540 558116 553405 548040 542396 536820 531761 527313
61699 527313 522938 518120 513096 508575 504786 501271 497704 494547 492627 492182 492512 492501 491390 489138 486279
61684 486279 483544 481436 479921 478528 476933 475462 474759 474857 474852 473754 471487 468854 466695 465322 464582 464035
61668 464035 463126 461554 459534 457483 455547 453715 452223 451378 451020 450607 449906 449162 448578 448061 447575 447313 447335
61651 447335 447477 447688 448090 448601 449032 449729 451579 454989 459290 463482 467236 470885 474802 479078 483461 487330
61635 487330 490066 491713 492870 493633 493215 490955 487176 482581 477434 472008 467165 463573 460693 457536 454180
61620 454180 451524 449681 447795 445578 443899 443400 443556 443662 443812 444115 443649 441211 436778 431440 426044 420661
61604 420661 415164 409525 403535 397002 390428 384848 380663 377108 373188 368762 364402 360561 357294 354530
61590 354530 352138 349818 347385 345141 343554 342471 341024 338543 335343 332323 330009 328238 326719 325518
61576 325518 324856 324594 324121 322840 320756 318573 317156 316818 317172 317663 318045 318241 317962 316827 314915 312905
61560 312905 311539 311055 311193 311569 311883 311956 311769 311535 311618 312352 313873 316047 318479 320653 322175 322940 323130
61543 323130 323118 323318 324000 325177 326763 328759 331173 333730 335934 337579 339043 340897 343258 345694 347710
61528 347710 349080 349680 349289 347843 345785 343849 342368 341043 339500 337849 336406 335091 333529 331709 330106
61513 330106 329061 328472 328215 328372 328755 328718 327902 326823 326201 326061 326032 326263 327244 328742 329679 329320 328057 326826
61495 326826 326183 326091 326197 326084 325590 325038 324844 324913 324814 324544 324530 324775 324648 323810 322750 322069 321760 321648 321976 323039
61475 323039 324600 326199 327739 329291 330607 331392 331855 332486 333354 334053 334241 333905 333179 332239 331306 330530 329960
61458 329960 329729 329968 330390 330434 330113 330237 331330 332805 333747 334104 334504 335298 336435 337900 339500 340564 340749
61441 340749 340971 342578 345656 349017 351874 354529 357345 360157 363079 366848 371687 376541 380127 382285
61427 382285 383775 385247 386948 388961 391090 392803 393860 394776 396234 398299 400621 403064 405623 407967
61413 407967 409699 410910 411949 412711 412715 411874 410636 409235 407247 404158 400102 395870 392302 389719 387814
61398 387814 386042 384214 382654 381699 381215 380797 380273 379735 379216 378693 378395 378715 379709 380943 381940 382587 383074
61381 383074 383686 384722 386355 388426 390588 392761 395269 398378 401954 405731 409683 413814 417721 420752
61367 420752 422626 423675 424445 425300 426426 427914 429752 431923 434611 438004 441781 445197 447979 450838 454612
61352 454612 459188 463842 468601 474479 482176 491167 500537 510189 520593 531566 541928 550364 556262
61339 556262 559780 561567 562479 563190 563908 564528 564939 564969 564263 562668 560600 558488 555920 552001 546721 541280
61323 541280 536713 532800 528947 525615 524026 524524 526062 527508 528855 530713 533034 534954 535865 536230 537223
61308 537223 539859 544570 551356 559986 570114 581496 594171 608203 623199 638257 652469 665254
61296 665254 676054 684062 688648 689987 688885 685929 681125 674444 666472 658275 650684 643806 637190 630384
61282 630384 623386 616657 610810 606288 603228 601412 600362 599755 599874 601373 604525 608960 614294 620619 628019
61267 628019 636013 643968 651711 659126 665524 670289 674168 678953 685603 693458 701723 710934 722271 735845
61253 735845 750307 763761 774440 780918 782664 780580 776348 770948 764195 755761 746123 736194 726432
61240 726432 716720 706972 697482 688708 680948 674286 668715 664232 660845 658447 656667 654901 652678 650064
61226 650064 647758 646768 647941 651540 657031 663258 669124 674301 679196 684140 688820 692794 696313 700143
61212 700143 704596 709245 713800 718693 724320 730048 734589 737340 738960 740648 743170 746567 750456 754562
61198 754562 759172 765105 773109 783399 796003 811273 829587 850544 872895 895312 916934 937151
61186 937151 955270 970563 982450 990639 995402 997672 998575 998768 998417 997612 996392 994438 991251 986707
61172 986707 981040 974330 966400 957201 946753 934696 920533 904469 887436 870081 852254 833777
61160 833777 815148 797137 780117 764129 749253 735569 723077 711966 702695 695552 690417 687086
61148 687086 685438 685091 685341 685769 686534 687750 688849 688802 686654 681763 674030 664242 653799 643784 634550
61133 634550 626322 619656 615094 612871 613196 616216 621383 627536 634085 641614 650880 661859 674263 688331
61119 688331 704423 722374 741939 763383 786891 811820 837260 862973 889045 915030 940262
61108 940262 964697 988601 1011631 1033007 1052401 1069891 1085293 1098461 1109986 1120534 1129369 1134466
61096 1134466 1134298 1128823 1118596 1103834 1084725 1062076 1037116 1010964 984442 958102 932188 906748
61084 906748 881846 857601 834141 811779 791045 772315 755537 740464 726836 714261 702462
61073 702462 691899 683465 677172 671905 666984 663102 660921 659652 658125 656555 656007 656663 657987 660185
61059 660185 664006 669209 674603 679697 685124 691450 698719 707200 717368 729020 741491 754763 769319
61046 769319 784983 801084 817732 835750 855416 876529 899504 924934 952116 979666 1007597
61035 1007597 1037090 1068043 1098768 1128465 1158117 1188431 1218813 1249156 1280827 1314966 1351490
61024 1351490 1390657 1433895 1481948 1533517 1586548 1639569 1691437 1741848 1792992 1848844 1912023
61013 1912023 1983458 2065661 2163244 2278519 2409227 2552502 2708748 2880473 3071317 3289325
61003 3289325 3547948 3860567 4237168 4689685 5236711 5899423 6700156 7674692 8883736
60994 8883736 10405023 12319543 14711039 17646094 21078981 24718132 28009986 30350287
60986 30350287 31410363 31313421 30521605 29570685 28890335 28771076 29340517 30458863 31652771
60977 31652771 32261845 31765912 30045701 27377936 24216537 20969924 17908915 15178817
60969 15178817 12834462 10867991 9238204 7897351 6801253 5907507 5177203 4580255
60961 4580255 4094161 3697752 3370142 3094845 2860477 2657399 2477185 2315126 2169702
60952 2169702 2039114 1920895 1814488 1721047 1640287 1570072 1509191 1457708 1413941 1373514 1332318
60941 1332318 1288700 1242426 1193624 1143557 1094528 1048050 1004214 963243 926111 893092 863157
60930 863157 835421 809932 786582 764672 744211 726361 711789 699594 688489 678068 668338 659075
60918 659075 650346 642800 636701 631392 626219 621259 616689 612212 607752 603984 601505 599933 598327 596136
60904 596136 593357 590226 587002 583703 579959 575544 570972 566877 562924 558251 552987 548221 544238 539922
60890 539922 534463 528582 523390 518929 514629 510538 507265 505172 504283 504565 505669 506785 507346 507642 508263
60875 508263 509272 510321 511269 512216 513216 514367 515946 518192 521139 524781 529042 533510 537746 542009 547088
60860 547088 553142 559297 564786 569905 575421 581580 588160 594955 601652 607590 612221 615650 618349 620657
60846 620657 622860 625422 628669 632396 636045 638995 640555 640130 637734 634004 629490 624319 618735 613459
60832 613459 609239 606504 605650 607022 610225 614146 618232 623249 630230 639161 649313 660393 672699 686396
60818 686396 701257 716887 732750 748186 762952 777516 792480 807932 823652 839437 854704
60807 854704 868200 878718 885911 890025 891217 889665 885879 880355 873235 864839 856012 847190 837563 826064
60793 826064 812951 799583 786741 774044 761027 747951 735376 723591 712611 702256 692071
60782 692071 681643 671059 660656 650354 639727 628686 617684 607234 597641 589066 581364 573924
60770 573924 566204 558350 550846 543726 536681 529776 523297 516940 509953 502215 494495 487419 480836 474484
60756 474484 468672 463840 459830 455965 451680 446908 442043 437612 433796 430290 426982 424623 424370 426574
60742 426574 430377 434488 437858 439657 439296 436874 433287 429638 426716 424961 424451 424761 425251 425611 425910 426174
60726 426174 426406 426897 427889 428834 428739 427450 425893 424686 423197 420540 416966 413545 410729 407799 403733 398230
60710 398230 391939 385926 380805 376277 371671 367009 363136 360652 359178 357991 356923 356150 355475 354442 353007
60695 353007 351563 350391 349561 349282 349778 350713 351263 351009 350418 350240 350673 351434 352386 353781 355830 358339 360954
60678 360954 363657 366839 370832 375485 380326 385080 389892 395032 400458 405692 410078 413267 415562 417676
60664 417676 420022 422245 423615 423841 423298 422532 421823 421305 421273 422202 424491 428189 432937 438226 443809 449691
60648 449691 455590 460713 464516 467553 470925 474754 477672 478113 475703 471062 464740 457072 448912 441677
60634 441677 436204 431894 427489 422587 417967 414412 411707 409111 406450 404206 402670 401626 400927 400728 400878
60619 400878 400672 399695 398500 397921 397988 398101 398012 398060 398489 399140 399776 400290 400586 400727 401128 402159 403609 405010
60601 405010 406352 407959 409752 411354 412913 415067 417877 420492 422204 423283 424413 425807 427213 428390
60587 428390 429198 429604 429942 430869 432751 435269 437760 439692 440777 441125 441541 443184 446545 451007 455732 460693
60571 460693 466637 474296 483856 494925 506885 519573 533727 550465 570296 593072 618777 647527
60559 647527 678354 708677 735508 756831 771563 778905 778421 770422 755875 736313 714176 692548
60547 692548 673782 658609 647038 639527 636551 637579 641550 648342 658917 674002 693445 717060
60535 717060 745430 779568 820093 866675 917659 969938 1019510 1062495 1095764 1117082 1125423 1121436
60523 1121436 1107357 1086236 1061157 1034712 1008576 983352 959065 935853 914045 893811 875188
60512 875188 858535 844627 834191 827519 824470 824624 827422 832344 839023 847261 857241 869880 886691
60499 886691 909026 937616 972986 1015974 1067516 1128224 1198502 1278670 1368416 1466146 1569095
60488 1569095 1673648 1775206 1868447 1948938 2014842 2066743 2105896 2133096 2148762 2152976 2144971
60477 2144971 2123185 2086205 2033486 1965238 1882293 1786521 1681144 1570344 1458543 1349815
60467 1349815 1247388 1153373 1068979 994821 930728 875433 827086 784283 746425 713212 684281
60456 684281 659408 638494 621111 606333 593214 581161 569885 559322 549744 541561 534816 529100
60444 529100 523986 519329 515053 510957 506834 502618 498499 495041 493000 492631 493276 494064 494867 496050 497421
60429 497421 498114 497649 496477 495248 494048 492585 490598 487824 484086 479781 475898 473194 471622 470753 470330
60414 470330 470069 469375 467776 465468 463105 461202 460040 459859 460717 462252 463909 465306 466263 466717 466886 467261
60398 467261 468015 468600 468343 467406 466684 466774 467405 468051 468687 469720 471343 473260 474973 476171 476899 477527 478559
60381 478559 480184 481954 483095 483379 483524 484442 486191 487981 489157 489766 490092 490184 490122 490241 490573 490417 489081
60364 489081 486981 485462 485477 486791 488463 489710 490296 490474 490753 491502 492738 494322 496157 498030 499592 500921
60348 500921 502827 506032 510186 514280 517937 521693 525941 530287 534141 537350 539924 541551 541766 540383
60334 540383 537595 533851 529723 525660 521775 518097 514978 512919 512045 512073 512720 513726 514605 514896 514656 514216
60318 514216 513510 512255 510755 509794 509632 509868 510405 511787 514333 517785 522163 528130 535931 544737 553775
60303 553775 563569 575525 590998 611526 639080 674442 715090 755711 791347 819673 840153 851811
60291 851811 852617 841135 818442 788170 754565 720554 687653 657180 630706 609132 591999 578202
60279 578202 567025 558124 550922 544607 538649 532970 527728 523118 519184 515639 512183 509078 506930 505654
60265 505654 504248 502030 499547 497736 496711 495995 495440 495134 494772 494058 493516 493921 494986 495498 494935 494119 494023
60248 494023 494692 495667 496819 498277 499963 501632 503129 504291 504854 504692 503962 502863 501517 500210 499447 499524
60232 499524 500286 501490 503148 505317 507785 510258 512717 515392 518437 521847 525559 529408 532991 535803
60218 535803 537669 538997 540542 542894 546132 549907 553759 557319 560402 563212 566476 571026 576946 583254
60204 583254 588704 592837 596068 598846 601109 602625 603498 604087 604521 604562 603973 602856 601567 600342 599103 597586
60188 597586 595591 593126 590443 587938 585806 583735 581153 577965 574783 572268 570465 569100 568133 567537 566835
60173 566835 565555 564080 563332 563537 564025 564402 565098 566410 567747 568397 568467 568415 568152 567260 565820 564352 563107
60156 563107 562034 561299 561280 562021 563143 564301 565470 566855 568857 571988 576570 582580 589972 598845 609076
60141 609076 620156 631750 643944 656469 668118 677662 685131 691555 697564 702877 706967 709554 710458
60128 710458 709648 707530 704595 700738 695459 688808 681605 674686 668493 663425 659933 658023 657194 657108 657810
60113 657810 659126 660375 661022 661220 661408 661744 662265 663232 664924 667291 670097 673227 676645 680186 683614 686692
60097 686692 689067 690273 690053 688548 686078 682912 679432 676309 674223 673400 673469 673815 674085 674531 675845 678535
60081 678535 682425 686867 691339 695664 699693 703068 705345 706106 704897 701322 695405 687778 679381 670919
60067 670919 662523 653884 644782 635521 626734 618713 611175 603806 596695 589953 583179 575795 567769 559625
60053 559625 551868 544806 538834 534355 531294 529087 527326 526151 525964 526960 528962 531459 533812 535715 537439
60038 537439 539405 541588 543620 545350 546896 548160 548735 548310 546859 544469 541384 538150 535192 532146 528080
60023 528080 522580 516267 510086 504391 498840 492828 485938 478364 471081 465296 461454 458995 457103 455468
60009 455468 454227 453495 453134 452779 452061 451045 450403 450761 451874 452843 453227 453487 454247 455547 457037 458482 459808
59992 459808 461027 462354 464106 466310 468748 471509 475000 479153 483185 486626 490163 494820 500497 505942
59978 505942 510145 513218 515847 518400 520868 523338 526081 529217 532523 535633 538336 540657 542819 545180
59964 545180 548047 551363 554628 557389 559796 562435 565618 569143 572763 576353 579365 580704 579744 577155
59950 577155 574133 571010 567268 562777 558231 554237 550619 546917 543057 539234 535487 531690 527705 523406
59936 523406 518838 514504 511184 509242 508326 507929 507989 508792 510456 512708 515126 517603 520563 524514 529170
59921 529170 533314 535976 537646 539874 543699 548884 554501 559681 563864 567035 569936 573453 577547 581217
59907 581217 583694 585243 586652 588477 590955 594082 597399 600102 601678 602099 601299 598964 595137 590494 585666
59892 585666 580772 576022 572333 570696 571116 572653 574464 576459 579021 582442 586678 591490 596751 602531
59878 602531 608784 615137 621288 627473 634099 640962 647318 652637 656751 659263 659594 657849 654932 651499
59864 651499 647480 642957 638724 635313 632085 628053 623292 618797 615151 612044 609088 606419 604323 602657
59850 602657 600931 598975 597441 597526 599984 604518 610455 617968 628098 641420 657064 673051 687017
59837 687017 696663 700622 699661 696602 694387 694412 696833 701618 708342 715301 719831 719829 714783 705594 693856
59822 693856 681108 668260 655599 643431 632380 622866 614639 607230 600548 594675 589381 584301 579350
59809 579350 574639 570211 566160 562669 559585 556394 552998 550053 548038 546482 544676 542697 540932 538943
59795 538943 535750 531186 526161 521461 516970 512217 507167 502240 497883 494229 490948 487450 483512 479542
59781 479542 476015 472922 470168 468161 467343 467302 467082 466412 465948 466152 466529 466251 465145 463812 463048 463313 464528
59764 464528 466168 467694 468970 470244 471810 473841 476403 479422 482725 486362 490665 495671 500623 504518
59750 504518 507251 509848 513418 518042 522791 526737 529818 532681 535722 538485 540234 540965 541430 542170 543027
59735 543027 543704 544309 545027 545698 546010 545791 544924 543465 542041 541521 541856 541861 540657 538862 537758 537738 538230 538723
59717 538723 539079 539059 538347 537068 535677 534396 533227 532397 532287 532963 534204 535893 537963 540149 542209 544280
59701 544280 546621 549198 551791 554258 556392 557939 559108 560622 562802 565117 567104 569097 571393 573443
59687 573443 574759 575974 577866 579810 580460 579759 578971 578815 578824 578596 578338 577870 576346 573508 570188 567009 563474
59670 563474 558972 553960 549504 546151 543736 541807 539817 537346 534604 532377 531203 530948 531345 532387 533920
59655 533920 535440 536729 538302 540829 544389 548585 553056 557503 561474 564427 566006 566161 565125 563209
59641 563209 560421 556411 551092 545070 539029 532946 526575 520554 516208 514142 513759 514269 515447 517120 518589
59626 518589 519071 518320 516581 514336 512252 510909 510304 509941 509482 508932 508211 507082 505545 503753 501541 498699
59610 498699 495743 493680 492840 492689 492952 494030 495963 497868 498961 499487 500047 500607 500752 500414 499766 498835 497779
59593 497779 497174 497444 498314 499272 500211 501149 501678 501340 500298 499125 498105 497246 496710 496584 496308 494960 492326
59576 492326 489221 486558 484348 481857 478587 474874 471521 469050 467450 466512 466060 465815 465421 464875 464581 464709
59560 464709 464850 464692 464694 465518 467045 468576 469772 470779 471623 472280 473241 475224 478212 481482 484605 487774
59544 487774 491140 494618 498403 502976 508531 515125 523427 534591 549495 568898 593769 623552 653608
59531 653608 676192 685548 681736 669235 653002 636660 622947 613796 609608 609258 610972 613032 614265
59518 614265 614562 614599 614572 613667 611190 607519 603196 597749 590417 581646 572865 564910 557449 549857 541982 534071
59502 534071 526537 519781 513832 508304 503041 498460 494845 491768 488804 486433 485441 485699 486293 486801 487630
59487 487630 489049 490607 491685 492155 492301 492475 493012 494264 496525 499912 504145 508467 512138 515290 518963
59472 518963 523958 529826 535200 538901 540546 540526 539866 539808 541006 543082 545151 546700 547914 549452 552088
59457 552088 556271 561809 568214 575366 583515 592615 602232 612158 622503 632961 642654 651004 658161 664273
59443 664273 668926 671545 671655 668552 661615 651478 640102 629114 618798 609125 600779 594333 589248
59430 589248 584670 580652 577758 575938 574656 573665 572987 572644 573119 575547 580739 588547 598698 611391 626408
59415 626408 642649 659514 677775 698209 720684 745823 775538 809090 839383 856322 854750 837685
59403 837685 812134 784186 758230 737667 724267 718239 720159 731137 749279 767240 775587 769029
59391 769029 748948 720797 690333 661600 636449 614953 596662 581680 570362 562294 556275 551391
59379 551391 547705 545844 546115 548019 550510 552819 555135 558279 562646 567789 573078 578401 583958 589795
59365 589795 595868 602345 609478 617211 625054 632330 638679 644548 651082 659078 668052 676776 684870 693439
59351 693439 703940 716827 731540 747412 764178 781726 799743 817651 834873 851152 866620
59340 866620 881434 895333 907568 917132 923092 925040 923447 919184 912416 902400 888829 872933 856572
59327 856572 840535 824529 808593 793493 779599 766368 753363 741078 730304 721176 713276 706220
59315 706220 699757 693688 688119 683563 680414 678401 676751 674765 672221 669568 667859 668146 670593 674312
59301 674312 678244 682082 686329 691771 699115 708937 721735 737959 758012 782061 809406 837533 861589
59288 861589 875526 875217 861241 838402 812174 785943 761476 740441 724008 711578 701494 693232
59276 693232 687803 685927 687004 690216 695519 702892 711460 720215 729109 738684 748825 758486 766580 772742
59262 772742 777197 780072 780899 778853 773620 765911 756798 746604 734896 721616 707730 694564 682795
59249 682795 672225 662323 652862 644267 637378 632727 630076 628795 628520 629238 631036 634064 638426 643662
59235 643662 648713 652957 656939 661441 666188 670230 673275 675628 677016 676631 674402 671140 667170 661836
59221 661836 654781 646757 638754 631126 624068 618130 613651 610276 607607 605762 604828 604339 603897 603770 604333
59206 604333 605353 606411 607596 609232 611276 613546 616232 619618 623535 627583 631662 635824 639888 643699
59192 643699 647535 651720 656005 659832 663131 666321 669567 672563 675134 677579 680177 682694 684672 686074
59178 686074 687288 688535 689538 689998 690169 690643 691614 692763 693980 695802 698914 703524 709466 716506 724203
59163 724203 731891 739239 746529 753906 760745 766303 770604 773952 775894 775519 772710 768278 762884 756618
59149 756618 749611 742267 734768 727082 719564 712852 707022 701500 695917 690367 684766 678702 672167 665794
59135 665794 660172 655461 651685 648733 646079 643273 640758 639368 638928 638333 637185 636373 636726 638070 640057
59120 640057 642988 647262 652820 659707 668405 679026 690836 703130 715935 729320 742733 755630
59108 755630 768076 780028 790589 798765 804600 808868 811898 813301 812630 809931 805769 800929 795778 789857
59094 789857 782606 774606 767372 761643 756649 751412 746037 741202 737158 733817 731138 728723 725527 720668
59080 720668 714180 706538 698029 689052 680348 672191 663886 654820 645613 637492 630837 625020 619429 614014
59066 614014 608940 604282 600035 596169 592830 590494 589470 589125 588242 586374 584150 581977 579353 575996 572770
59051 572770 570695 569722 569250 569165 569471 569453 568243 566008 563844 562670 562842 564414 567025 569727 571673 572891
59035 572891 573944 575127 576441 577968 579716 581457 583261 585810 589673 594682 600507 607369 615584 624940
59021 624940 635185 646608 659375 672708 685421 696850 706549 713623 717310 717968 716606 713707 709264
59008 709264 703702 697893 692424 687622 684110 682537 682843 684482 687238 691187 696045 701286 706810 712879
58994 712879 719466 726106 732176 736880 739431 739914 739510 739117 738149 735487 731149 726032 720433 714020 707124
58979 707124 700821 695654 691389 688258 687333 689162 692916 697413 702433 708558 716234 725497 736311 748637
58965 748637 762171 776279 790353 804346 818861 834368 850200 864679 876418 885030 890400 891961
58953 891961 889296 882915 873680 861827 847251 830495 812708 794802 777283 760696 745514 731642
58941 731642 718631 706393 695316 685845 678335 673051 669773 667668 665964 664494 663220 661698 659606
58928 659606 657289 655111 652695 649515 645850 642385 639267 636390 634177 633129 632826 632285 631176 629850 628446
58913 628446 626883 625554 625002 624967 624765 624583 625512 628150 632079 636877 642827 650390 659710 670839 683846
58898 683846 698440 713935 729745 745519 760822 775248 788951 802725 817477 833856 852222
58887 852222 872645 895011 919229 944935 970763 994594 1015031 1032024 1045628 1054975 1059303 1059222
58875 1059222 1055877 1049404 1039245 1025493 1008855 989730 968602 947050 927118 909739 894754 882117
58863 882117 871824 862860 853659 843799 834097 824941 815609 805384 794295 782641 770747 759320 749021
58850 749021 739575 730145 720580 711363 702470 693428 684438 676245 668788 661244 653547 646588 640612 634663
58836 634663 628003 620949 613900 606724 599575 593191 587781 582607 577304 572711 569709 568050 566992 566396
58822 566396 566496 567210 568368 570224 573181 577226 581941 586801 591286 595086 598331 601293 603924 606101 608135
58807 608135 610439 612803 614727 616287 617858 619054 618835 616732 613203 608890 604391 600559 597897 595589
58793 595589 592267 587896 583831 580893 578511 576036 573752 572198 571570 572180 574467 578134 582201 586325 591121
58778 591121 596810 602585 607797 612828 618224 623780 628907 632993 634964 633509 628528 621697 614991 609186
58764 609186 604067 599267 594337 588768 582612 576631 571424 566932 563050 560021 557959 556684 556352 557465
58750 557465 559812 562149 563411 563726 563950 564869 567160 571404 577639 585359 594145 603813 613883 623644 632943
58735 632943 642261 651894 661742 671878 682474 693133 703180 712647 722045 731114 738863 744932 749860
58722 749860 753879 756583 757977 758767 759418 760136 761871 765972 772486 780068 787866 796123 804578 811872 817122
58707 817122 820590 822112 820386 814764 806368 796360 784319 769394 751992 733153 713153 691869
58695 691869 669844 648140 627722 609574 594478 581910 570097 558052 546731 537399 529829 523009
58683 523009 516720 511297 506555 502051 497958 494782 492508 490678 488961 487247 485715 485089 486118 488549
58669 488549 491477 494938 500067 507351 516005 525597 536863 550128 564167 577494 589506 599437 605550
58656 605550 606698 603807 598666 592143 584597 576981 570196 564006 557776 551735 546548 542251 538568 535622
58642 535622 533437 531324 528663 525743 523141 520944 519187 518252 518116 518088 517978 518590 520290 522122 523138 523588
58626 523588 523940 523862 523201 522930 523939 525831 527959 530786 535161 541137 548476 557270 566975 575900 582874
58611 582874 588549 593892 598402 600974 601506 600405 597502 592859 587692 583076 578603 573682 569217 566429
58597 566429 564872 563264 561577 560699 560602 560538 560586 561486 563264 565507 568700 573946 581636 591516 603586 617629
58581 617629 632347 646249 659073 671204 682249 691446 698959 705422 710652 714130 716398 718694 721559
58568 721559 724982 729544 736248 745537 757561 772952 792139 814278 837859 862019 886280 909586
58556 909586 930641 948686 963069 972752 977346 977986 976169 972378 966695 959771 952055 942980 932079
58543 932079 920003 907343 893560 878340 862701 847329 831111 812979 794031 776015 758928
58532 758928 742160 726831 714624 705053 696285 688160 682151 678614 676294 674433 673383 673251 673808 675573
58518 675573 679203 683943 688364 692410 696962 701721 705368 707618 709304 710549 710604 709387 707500 704890 701127
58503 701127 696813 693073 689847 686276 682442 679066 675861 671926 667531 663762 660657 657438 654302 652273
58489 652273 651542 651637 652840 655645 659229 662337 665401 669961 676449 684373 694106 706324 720059 733534
58475 733534 746657 760429 774097 785213 792462 796255 796640 792961 785800 777059 767871 758272 748877
58462 748877 740835 734181 728294 723870 722243 722914 724096 725645 729060 734526 740511 746496 753454 761145
58448 761145 767432 771023 772711 773272 772222 769299 765185 760246 754436 748834 745273 743986 743537 743412 744727
58433 744727 748055 752567 757649 763324 768810 772856 775981 780306 786685 793966 801405 809705 819164 828851
58419 828851 838150 847253 855698 862255 866508 868839 868817 865685 860349 854745 849134 842284 834252 826503 819228
58404 819228 811162 802336 794472 788326 783203 779343 778101 779262 780844 782095 784242 787868 792158 797016
58390 797016 803108 809307 813016 813783 813928 814902 815710 815560 815248 815177 814719 814290 815401 818007 820513 822944 827185
58373 827185 833512 839998 846058 853446 862905 873017 883284 895019 908084 920062 930098 940467
58361 940467 952928 966417 979624 992976 1006756 1020039 1032551 1044821 1055662 1062727 1066513 1070495
58349 1070495 1076265 1081939 1086366 1091105 1096874 1101867 1105283 1108943 1113817 1118633 1123553 1131301 1142619 1154425
58335 1154425 1164672 1175402 1188806 1203890 1219355 1236102 1254325 1271533 1286002 1298975 1311187
58324 1311187 1320636 1326311 1330661 1335832 1340751 1344464 1348921 1355628 1362789 1368533 1374015 1380799 1388271 1396053
58310 1396053 1405781 1418111 1431217 1444474 1460105 1478869 1497923 1515439 1533414 1553258 1572753
58299 1572753 1590353 1608334 1628379 1648054 1665115 1681558 1699961 1719515 1739071 1760312 1784400
58288 1784400 1809138 1832938 1857872 1885517 1913739 1941053 1969996 2002455 2035837 2067767 2100481
58277 2100481 2136608 2174769 2213306 2254073 2298256 2342692 2384687 2426409 2470318 2514681 2558042
58266 2558042 2603640 2654683 2709613 2766606 2828112 2896067 2967224 3038139 3110124 3184377 3257376
58255 3257376 3326433 3394807 3465842 3537171 3606320 3676710 3752252 3831405 3912593 3999824 4096578
58244 4096578 4199824 4306562 4420420 4545025 4677125 4813437 4957856 5114390 5279586
58235 5279586 5449923 5629929 5824607 6030885 6245381 6473393 6720819 6984667 7261504
58226 7261504 7557603 7880211 8226734 8593804 8988785 9420326 9886065 10382615 10919207
58217 10919207 11507949 12149605 12843729 13603584 14445343 15372065 16385428 17503905 18751905
58208 18751905 20141906 21687534 23424284 25397328 27641736 30199084 33142483 36561975
58200 36561975 40541886 45183448 50635821 57074946 64675482 73651793 84321330 97104373
58192 97104373 112514245 131230708 154162676 182338391 216672064 257695625 304999304
58185 304999304 356125371 405573135 445387898 467946739 469401708 451231670 418898153
58178 418898153 379049292 337409873 298088133 263564554 234648419 210556122 189541180
58171 189541180 169930342 150903339 132559337 115437437 100008464 86474903 74828932
58164 74828932 64950661 56647761 49684353 43833073 38907249 34747807 31207996 28167811
58156 28167811 25546141 23282448 21317070 19598746 18094863 16777888 15611094 14560076
58148 14560076 13607992 12746148 11958045 11225475 10542681 9911647 9329009 8788657 8291274
58139 8291274 7839745 7429356 7052303 6707569 6397307 6117851 5862696 5629351 5414562
58130 5414562 5207719 4998493 4787719 4582844 4386660 4198289 4020683 3857950 3708074
58121 3708074 3566310 3433057 3311035 3197735 3088276 2983122 2885703 2794863 2706672 2621359
58111 2621359 2541626 2466306 2392383 2321153 2255908 2195497 2136347 2078768 2025116 1973746 1921056
58100 1921056 1867730 1816935 1768082 1718292 1668473 1622119 1579548 1538902 1501295 1469289 1441576
58089 1441576 1414631 1388417 1365207 1344219 1322847 1301921 1284217 1268723 1251678 1232482 1213394
58078 1213394 1194220 1172516 1148479 1124715 1101561 1077352 1052766 1030277 1009643 988451 966754
58067 966754 946961 929557 913074 897748 885071 874274 863332 852840 844847 838589 831447 823379
58055 823379 816148 808882 798903 786529 774678 763971 752593 740798 731071 723650 716140 707932 700989
58042 700989 695817 690464 684021 677552 671170 663579 654916 646769 639141 630507 620962 612066 603578 593646
58028 593646 582355 571786 562406 552623 542021 531800 521945 511300 500615 492199 486239 480650 474766
58015 474766 469910 466042 461256 455184 449650 445325 440805 435631 431228 428118 425056 421656 419189 418100
58001 418100 417366 416805 417389 418768 419172 418251 417349 416561 414346 410658 407583 406184 405468 405270 407239 411824
57985 411824 416769 419838 420924 420579 418716 415776 413149 411361 409448 406757 403703 400390 396372 392087
57971 392087 388628 385826 382585 379209 377207 376619 375875 374568 374001 374610 375313 375869 377403 380095 382772 385344
57955 385344 389076 393768 397237 398530 399275 400874 402673 403915 405268 407241 409113 410474 411998 413802
57941 413802 414940 415359 416437 418774 421360 423671 426549 430263 433877 437446 442660 450215 458484 465849
57927 465849 472345 478062 482006 483760 484306 483925 481152 475067 466865 457961 448309 437852 427749 418689
57913 418689 409582 399412 389018 379745 371705 364657 359215 355882 354013 352914 352755 353383 353547 352409
57899 352409 350707 349393 348299 347013 345733 344329 341976 338705 336017 334883 334420 333526 332460 331784 331129
57884 331129 330190 329676 330044 330465 330185 329823 330221 330976 331129 330270 328087 323930 317828 310938 304155 297303 290309
57867 290309 283878 278251 272784 267569 263940 262333 261179 259111 256820 255530 255149 255280 256605 259694 263642
57852 263642 267459 271701 277242 283510 289497 295569 302648 310401 317728 324297 330162 334660 337186 338461
57838 338461 339592 340487 340501 339996 339795 339599 338400 336145 333767 331884 330562 329964 330110 330377 330294 330479 331804
57821 331804 334058 336406 338684 341239 343914 346214 348086 349675 350728 351105 351411 352224 353100 353143 352005 349519
57805 349519 344981 337802 328436 317858 306620 295185 284529 275457 267802 261085 255358 250622 246243
57792 246243 241932 238572 236964 236423 235781 235155 235510 236987 238974 241443 244919 249282 253810 258353 263500
57777 263500 269571 276226 282967 289382 295256 301091 308078 316715 325847 333854 340273 345380 348819 349851
57763 349851 348602 345862 341763 335728 327656 318150 307568 295744 282791 269430 256452 244424 233899
57750 233899 225377 219031 214839 212773 212531 213445 215044 217328 220085 222485 223968 224971 226178 227491 228404
57735 228404 228856 228986 228462 226799 224057 220699 217152 214014 212086 211628 212022 212744 214034 216093 218413 220567
57719 220567 222881 225491 227542 228250 228084 227942 227838 227361 226677 225990 224660 222097 219042 216736 215211 213590
57703 213590 211615 209641 207445 204404 200779 197598 195284 193422 191868 191044 191078 191543 192147 193008 194270 196039
57687 196039 198449 201240 203661 205427 207223 209506 211523 212555 213581 216516 222212 230374 240992 254548
57673 254548 271127 290760 314743 345508 385222 435533 498613 577253 673503 786748 910992
57662 910992 1031733 1126877 1175201 1167531 1110718 1021449 916982 810271 709682 619954 543085
57651 543085 479375 427994 386973 353735 326382 304150 286536 272537 260938 250792 241516 233061
57639 233061 226016 220907 217403 214735 212726 211634 211172 210646 210050 210099 211053 212305 213166 213299 212459 210781
57623 210781 209281 209062 209865 210232 209146 206633 202917 198214 193415 189667 186877 183758 179689 175444 171645
57608 171645 167696 162910 157754 153313 150272 148959 149539 151483 153615 155335 157203 159685 162006 162946 162375
57593 162375 161291 160624 160472 160268 159313 157384 155058 153173 151876 150589 148968 147272 145721 144120 142345
57578 142345 140560 138677 136223 133097 129873 127078 124668 122520 120829 119623 118435 116846 115018 113360
57564 113360 112027 110901 109645 107674 104691 101399 99070 98152 97877 97479 97099 97184 97650 98177 98787 99597 100370
57547 100370 100832 101183 101927 103341 105282 107279 108688 109072 108586 107815 107315 107605 109245 112202 115204 116605
57531 116605 116135 115152 115026 115911 117228 118502 119408 119702 119576 119568 119827 120014 120183 121084 123219 126112 128899 131174
57513 131174 132962 134398 135768 137396 139181 140689 141837 142928 143845 143922 142936 141616 140690 139930 138496 135825
57497 135825 131954 127428 123138 119738 116981 114118 111060 108498 106708 105018 102800 100294 98062 96269
57483 96269 94907 94078 93652 93204 92632 92238 91970 91323 90359 89965 90593 91454 91571 90989 90375 90033 89902 89933 89895
57464 89895 89314 88156 87071 86495 86097 85558 85192 85234 85176 84506 83494 82570 81510 80030 78626 78029 78165 78383
57446 78383 78362 78203 78019 78005 78438 79081 79175 78642 78563 79662 81006 81247 80523 79990 79866 79319 78190 77511 78027
57427 78027 79169 79920 79993 79802 79794 80135 80761 81518 82374 83345 84110 84007 82763 80932 79222 77758 76380 75216
57409 75216 74436 73877 73470 73593 74342 74868 74234 72589 70781 69223 67935 67326 67791 68740 69070 68686 68528 69025
57391 69025 69474 69244 68720 68632 69113 69840 70676 71791 73413 75629 78194 80559 82368 83793 85047 85841 85840
57374 85840 85444 85422 85868 86221 86264 86331 86446 86099 85145 84260 84093 84398 84377 83551 82061 80436 79248 78795 78962
57355 78962 79487 80291 81315 82250 82787 83015 83172 83202 83054 83173 84106 85687 87194 88226 88803 88719 87623 85902
57337 85902 84752 85032 86498 88315 89799 90541 90356 89458 88283 86951 85277 83371 81762 80782 80250 79897
57321 79897 79578 78996 77807 76286 75308 75308 75697 75740 75581 75955 77104 78407 79043 78710 77737 76670 75790 75037
57303 75037 74399 74173 74602 75409 76068 76472 76950 77647 78297 78683 78914 79172 79559 80249 81396 82759 83831 84495
57285 84495 85242 86490 87881 88445 87413 84937 82185 80566 80548 81198 81073 79455 76563 72916 69001 65353
57269 65353 62376 60075 58361 57453 57438 57652 57228 56248 55647 55866 56320 56381 56167 56044 55938 55542 54817 53981 53346
57250 53346 53326 54188 55591 56811 57614 58516 60021 61992 63951 65570 66716 67382 67784 68201 68623 68893 69160
57233 69160 69670 70201 70353 70396 71056 72313 73260 73444 73506 74091 74921 75431 75559 75322 74368 72730 71405 71391 72522
57214 72522 73968 75446 77151 78864 80107 81040 82343 84190 86132 88108 90850 94965 100108 105348 110091
57199 110091 114413 118765 123605 129264 136056 144444 154926 167635 182066 197143 211475 223744 233362
57186 233362 240934 247740 254627 261699 269086 277364 286843 296958 306882 316483 326309 336848 348180
57173 348180 360156 372613 385632 399724 415497 432911 451228 469890 488990 508678 528726
57162 528726 549066 570126 592095 614407 636589 659008 682020 704893 726571 747204 767950
57151 767950 789280 810394 830420 849381 867874 886392 905087 923660 941439 958113 974333
57140 974333 991030 1008294 1025683 1043598 1063392 1085854 1110378 1135940 1162211 1189356 1217478
57129 1217478 1246840 1278113 1311800 1347714 1385460 1425169 1467409 1512666 1561329 1613942 1671101
57118 1671101 1733226 1800730 1874339 1955008 2043638 2140958 2247415 2363016 2487579 2621514
57108 2621514 2766450 2925175 3101319 3299145 3523271 3778507 4070471 4406726 4797035
57099 4797035 5252335 5783970 6404290 7127459 7968943 8944160 10067589 11352192 12808165
57090 12808165 14441247 16251349 18231024 20363117 22618639 24956207 27322394 29652630
57082 29652630 31876066 33927156 35757766 37336822 38633431 39597830 40160395 40252662 39833971
57073 39833971 38905136 37505574 35702792 33582036 31237097 28761394 26240734 23749243
57065 23749243 21347665 19082500 16985745 15075780 13359222 11833239 10488136 9309980
57057 9309980 8282701 7389507 6613924 5940548 5355262 4845211 4399219 4008472 3666388
57048 3666388 3367451 3106253 2877528 2676491 2498606 2339364 2194927 2063101 1943254
57039 1943254 1835139 1737924 1650336 1571293 1500045 1435906 1378213 1326612 1281089 1241629 1208180
57028 1208180 1181157 1161663 1150880 1149713 1159622 1183506 1225127 1288158 1376494 1493366 1635109
57017 1635109 1782829 1903123 1963050 1948352 1868510 1746120 1603445 1456940 1317894 1193018
57007 1193018 1084497 991843 914083 849697 795829 749552 709730 676434 648995 625939 606384
56996 606384 590006 575762 562116 548667 536269 525395 515536 506451 498840 493341 489858 488368 489562
56983 489562 494017 501119 509096 515657 518486 515863 507370 493849 476676 457360 437683 419319 403002
56970 403002 388455 375322 363770 354202 346938 342253 340191 340283 342038 345776 352434 362532 376008
56957 376008 392992 413638 436605 458331 474400 481446 477957 464420 443485 419352 395863 374755
56945 374755 355819 338441 322743 309509 299422 292452 288022 285861 286548 290883 298966 310455 325631
56932 325631 345454 370329 399255 430098 459810 484111 498050 498091 484069 459160 428197 395734
56920 395734 364697 336066 309894 286632 267179 251704 239229 228677 219740 212381 206102 200192
56908 200192 194288 188265 181985 175576 169548 164243 159455 154916 150772 147271 144333 141793 139733 138320
56894 138320 137691 138272 140792 145666 152729 161864 173459 187997 205711 226793 251066 276748 300150
56881 300150 317486 327015 329205 325522 317787 308190 298839 291014 285157 281463 280095 281120 284694 291112
56867 291112 300271 311532 324757 341249 363052 391491 426960 469787 520112 576253 633375 684049
56855 684049 720495 737203 732800 710205 675056 633592 591255 552038 518131 490109 467914 451749
56843 451749 441979 438572 441237 450120 466031 490061 523201 566323 620281 686048 764300 853606
56831 853606 947689 1034461 1099007 1129300 1120967 1078355 1011892 933613 853283 776952 707776 647292
56819 647292 595984 553635 520023 495191 478914 470407 469087 475217 489431 512128 543939 586321
56807 586321 640500 705176 775009 840946 892126 919033 916948 887639 837872 776139 710144 645772
56795 645772 586750 534810 490516 454056 425197 403083 386766 375804 369939 368602 371435 379064
56783 379064 392631 412637 438686 469931 504651 539077 567385 583597 583990 568418 540091 504026
56771 504026 464968 426168 389534 356106 325996 298662 274032 253038 236418 223453 212680
56760 212680 203408 195662 189046 182764 176661 171171 166263 161453 156897 153408 151154 149271 147099 144964
56746 144964 143365 142169 140993 139780 138692 137910 137762 138443 139432 139812 139349 138618 137933 136939 135557 134484
56730 134484 134208 134228 133859 133321 133394 134317 135597 136685 137383 137749 137980 138309 138771 139231 139797 140963 143036 145588
56712 145588 147682 148578 148185 147045 145994 145657 146093 146969 147996 149061 150026 150707 151035 151011 150581 149783 148948
56695 148948 148467 148377 148415 148268 147593 146067 143817 141565 139963 138961 138155 137424 136779 135978 134880 133869 133307
56678 133307 132964 132728 133432 135955 139637 142705 144304 145168 146186 147339 148368 149525 151114 152883 154307
56663 154307 155131 155483 155854 156939 158862 160576 160714 159179 157226 155939 155354 155149 155286 155678 155912 155707 155130
56646 155130 154235 153034 151845 151038 150403 149501 148675 148877 150452 152835 155459 158022 159961 160866 161626 163825
56630 163825 167548 171001 172839 173684 174633 175536 175782 175766 176356 177403 177911 177397 176282 175144 174222 173399 172197
56613 172197 170121 167384 164902 163213 161935 160654 159626 159136 158818 158232 157482 156699 155511 153735 152019
56598 152019 151064 150644 150115 149487 149309 149788 150657 151641 152472 152743 152345 151850 151980 152852 154101 155477 156969 158652
56580 158652 160669 163046 165280 166580 166763 166508 166485 166744 167151 167808 168731 169728 170922 172759 175205 177620
56564 177620 179795 182428 186143 190792 196116 202323 209509 217256 225267 233598 241772 248558 253267 256552
56550 256552 259302 261635 263650 266201 269924 274135 277590 279819 281034 281398 281199 281016 280897 280015 277960
56535 277960 275704 274367 273689 272675 271103 269354 267308 264555 261410 258685 256669 255092 253724 252248
56521 252248 250044 246926 243642 240771 237630 233183 227581 221907 216816 212386 208838 206346 204353 201962
56507 201962 198906 195538 192274 189627 188219 187891 187464 186217 184956 184650 184722 183858 181944 179979 178524 177472
56491 177472 176999 177434 178395 179181 179873 180959 182099 182392 181761 181078 181033 181704 182971 184465 185527 186130 187335
56474 187335 189783 192267 193097 192423 191855 192136 192714 193396 194784 196901 198807 199917 200585 201150 201452 201514 201745
56457 201745 202281 202891 203593 204612 205833 207052 208499 210247 211476 211362 210378 209581 208991 207926 206672 206389
56441 206389 207413 208942 210418 211953 213436 214526 215557 217188 219119 220410 221066 221954 223137 223691 223339
56426 223339 222858 222604 222026 221037 220499 220857 221423 221522 221296 220968 220342 219458 218852 218718 218594 218116 217381 216493 215567
56407 215567 215188 215908 217245 218145 218431 218810 219505 219972 219913 219467 218460 216652 214722 213773 213845 214126 214549 215801
56389 215801 217813 219752 221596 224148 227312 230002 232083 234756 238528 242355 245383 248097 251121 254296
56375 254296 257484 260849 263579 263762 260479 255023 249328 244281 240087 237035 235002 233216 231352 230066
56361 230066 229903 230555 231613 233058 234561 235382 235539 235989 237120 238135 238460 238651 239250 239893 240252 240861 242206
56344 242206 243895 245375 246689 247901 248646 248849 249208 250397 252380 254775 257194 259109 260212 261021 262197
56329 262197 263363 263776 264025 265564 268468 271340 273757 276984 281607 286273 289716 292455 295338 297785 298746
56314 298746 298381 297668 297127 296887 297259 298386 299922 301646 303730 306009 307874 309340 311297 314281 317887
56299 317887 321693 325715 329654 332829 335229 337501 339662 341112 342145 343935 346587 348770 349922 351343
56285 351343 354330 358595 363261 368140 373253 378250 382981 387630 391996 395871 400311 406859 415147 423026
56271 423026 429610 436331 444370 453012 461447 470241 479935 489927 500018 511434 525114 540486 557019
56258 557019 575460 596411 619291 643968 671922 704521 741545 782619 828672 880707 938555
56247 938555 1002118 1072576 1151029 1237084 1329822 1428880 1533525 1641993 1752818 1865329 1977693
56236 1977693 2085838 2185474 2273929 2349095 2408163 2448726 2469826 2471055 2452157 2414540 2361523
56225 2361523 2295911 2218818 2131726 2037800 1940017 1839890 1739200 1640913 1546925 1456868 1370575
56214 1370575 1289722 1215466 1146668 1082271 1023462 971477 925095 882412 843429 808854 777944
56203 777944 749634 724354 702726 683761 666209 650353 636774 624806 613869 604705 597556 590852
56191 590852 583510 576756 571757 567260 561660 555651 550714 546645 542709 539560 537856 536562 534738 533363
56177 533363 533406 533863 533796 534275 536052 537442 537062 536578 538019 540380 541776 543051 546061 550097 553251 555941
56161 555941 559881 564822 569432 574228 580604 588032 595171 602565 611366 620605 628805 637110 647775 660634
56147 660634 674038 688142 704196 721745 739741 759545 783736 812855 846305 885390 932376
56136 932376 987653 1050968 1124546 1211576 1312155 1423311 1541572 1662132 1776742 1876614
56126 1876614 1957851 2021949 2072363 2113579 2151775 2191801 2232976 2270186 2298432 2314114 2314261 2298949
56114 2298949 2274019 2247690 2224199 2202624 2179884 2151278 2109702 2049030 1968728 1873003 1766895
56103 1766895 1656164 1548721 1451466 1366151 1291608 1228591 1178637 1139797 1107980 1081693 1061510
56092 1061510 1046068 1032851 1021930 1014742 1010168 1005992 1003046 1003524 1006361 1008759 1011110 1015695 1021664
56079 1021664 1026228 1029802 1035014 1041516 1046899 1051948 1059789 1070403 1081069 1091604 1104022 1117780 1130697
56066 1130697 1144027 1161109 1181458 1201589 1221179 1242822 1266111 1287739 1307291 1327262 1347498
56055 1347498 1365284 1380783 1396802 1413366 1428118 1441724 1457067 1473578 1488344 1502369 1519521
56044 1519521 1539780 1559889 1580156 1603893 1630572 1656540 1682289 1711910 1745460 1779066 1812489
56033 1812489 1849059 1888091 1925067 1959597 1995538 2033015 2068327 2102126 2139511 2181417 2224102
56022 2224102 2267618 2316251 2369786 2423067 2475229 2530707 2590210 2649575 2708548 2771656 2839367
56011 2839367 2907612 2976985 3052843 3135320 3219167 3304463 3397172 3497998 3601476 3707333 3821577
56000 3821577 3944836 4071215 4200439 4339236 4488818 4643309 4802585 4973924 5158784
55991 5158784 5351209 5551675 5768753 6004494 6252498 6513173 6795948 7103498 7429512
55982 7429512 7775262 8151895 8562868 9001621 9470603 9984463 10550279 11163862 11830074
55973 11830074 12566351 13381285 14271798 15247320 16334070 17550052 18901319 20410098 22120585
55964 22120585 24070966 26290165 28831538 31779713 35218093 39227555 43928710 49488241
55956 49488241 56078184 63882888 73169625 84316111 97779507 114129831 134146674
55949 134146674 158792263 189006018 225454777 268129455 315430888 363021297 403774573
55942 403774573 429901077 436342787 422969556 394009662 355571710 313322984 271447701
55935 271447701 232576879 198039706 168210370 142911427 121722691 104111500 89498520
55928 89498520 77350979 67237498 58798258 51712819 45721691 40639271 36315853 32608861
55920 32608861 29402648 26622734 24208645 22094087 20226178 18578349 17127788 15839602
55912 15839602 14684655 13651863 12730095 11896392 11133152 10438982 9811605 9236638 8703080
55903 8703080 8213513 7768884 7358362 6973623 6618533 6295353 5995168 5710927 5446806
55894 5446806 5205939 4981297 4767089 4567314 4384982 4214298 4051286 3901095 3767120
55885 3767120 3643496 3525701 3418396 3325645 3243544 3169748 3110544 3071107 3047647 3035649 3036120
55874 3036120 3046101 3051702 3038447 3001822 2942182 2858083 2751870 2634057 2514588 2395492 2277441
55863 2277441 2166150 2066028 1974253 1887380 1807652 1737158 1672238 1609578 1551896 1502059 1457386
55852 1457386 1415092 1377464 1346281 1317758 1288232 1259344 1232688 1205129 1174521 1144412 1117955
55841 1117955 1092627 1066067 1041450 1021640 1003350 982687 961551 943084 925542 906253 887199
55830 887199 871242 856840 841711 827770 817483 809092 800206 792237 786559 780173 770024 758040
55818 758040 747271 736656 724164 711486 700891 690793 679056 667487 658611 651143 643028 635898
55806 635898 632124 630411 628524 627488 629042 631894 634597 639186 647739 658021 666437 672575 677014 677653
55792 677653 672447 663224 652778 640661 625666 609899 596433 585306 575624 569114 567467 568139 566591
55779 566591 561033 551957 539336 523686 507797 494094 482211 471770 464900 463138 464645 467585 473190
55766 473190 482048 490409 494038 493174 490119 484806 476605 467715 460465 453435 444291 434240 425724 417944
55752 417944 408857 399497 392047 385368 376737 366569 357386 349434 341158 332741 325478 318872 311937 306089
55738 306089 303226 302220 300669 298746 297850 297007 294263 290463 288027 286987 285585 283686 282225 280413 276769
55723 276769 271905 267225 262148 255808 250010 247015 245699 243460 240715 239851 240793 241432 241663 243283 246417
55708 246417 249562 252746 257268 262608 266777 269369 271270 271840 269445 264416 258601 252424 245183 237658
55694 237658 231472 226373 221000 215825 212447 210475 208059 205120 203235 202653 202190 201748 202295 203721 205279
55679 205279 207616 211757 216566 219890 221733 223634 225485 225694 224102 221968 219452 215857 212052 209909
55665 209909 209452 209077 208345 208112 208246 207773 207100 207618 209348 211258 213573 217366 222215 226617 230363 234287
55649 234287 238150 241084 243523 246253 248155 247407 244400 240971 237320 232332 226362 220886 215761 209618
55635 209618 202739 196784 191919 186915 181901 178308 176063 173548 170394 167877 166532 165738 165532 166443 167620
55620 167620 167531 166356 165433 164649 162877 160567 159223 158527 156698 153583 150703 148345 145393 142080 140079
55605 140079 139627 139151 138011 137116 136686 135899 134918 134790 135194 134734 133490 132794 132515 131260 129344 128724 129695
55588 129695 130391 129930 129353 129098 128316 127169 127056 127901 127881 126517 125447 125416 125106 123827 122821 122933 123298 123303
55570 123303 123701 124832 125792 126200 126847 127909 128488 128560 129310 130881 131881 131701 131245 130786 129325 126852 125076
55553 125076 124949 125424 125401 125012 124320 122809 120947 120287 121184 122254 122735 123436 124662 125264 124602 123602 123056
55536 123056 122658 122362 122807 123791 124236 124263 125230 127071 127805 126558 124936 124392 124253 123457 122278 121158 119539
55519 119539 117008 114109 111112 107448 103045 98656 94341 89437 84593 81847 81934 83487 85553 88732 92989
55504 92989 96663 98859 100732 103174 105297 106490 107926 110383 112392 112252 110414 108337 106321 103936 101363
55489 101363 98897 96174 93110 90610 89371 89015 89114 89893 91212 92258 92932 94040 95467 95854 94919 94324
55473 94324 95193 96493 96993 97144 97756 98355 98166 97406 96469 95085 93311 91962 91114 89678 87400 85660 85242
55456 85242 85028 84091 83372 83882 84928 85650 86814 89416 92774 95565 97631 99365 100492 100839 101126 101683
55440 101683 101553 100240 99084 99420 100518 100881 100485 100248 100253 100116 100190 100836 101268 100593 99420 99072 99766 100733
55422 100733 101507 102035 102156 101990 102149 102702 102740 101774 100528 99484 97919 95507 93706 94073 96092 97997 98972
55405 98972 99296 99140 98512 97765 97047 95897 94311 93394 93885 94866 94974 94110 93003 92074 91758 92934 95731
55388 95731 98722 100474 101176 101661 101730 100693 98785 96777 94824 92870 91545 91450 92056 92337 92031 91407 90408
55371 90408 88926 87260 85435 82777 79019 75123 72242 70552 69786 69963 70855 71738 72530 74167 77009 79941
55355 79941 81948 83473 85260 87002 88183 89118 90059 90416 89990 89846 90741 91854 92268 92467 93006 93005 91585
55338 91585 89743 89055 89395 89600 89599 90166 91229 92104 92937 94335 95996 97117 97752 98414 98793 98291 97415 97256
55320 97256 97906 98555 98832 98896 98615 97797 96863 96318 95999 95760 96167 97470 98625 98563 97751 97306 97190 96556 95315
55301 95315 94126 93281 92705 92548 92791 92794 92225 91767 92046 92672 93278 94456 96507 98375 99134 99518 100534 101642
55283 101642 101924 102056 103240 104865 105132 103553 101180 98773 96403 94506 93728 93926 94598 95854 97689 98994
55267 98994 98805 97973 98028 98971 99781 100448 101683 103101 103601 103310 103348 103863 104006 103754 103976 104719 105077 104819 104636
55248 104636 104696 104385 103543 102641 101767 100659 99663 99342 99310 98712 97642 96842 96343 95753 95519 96353 97714 98419
55230 98419 98480 98810 99365 99251 98477 97834 97145 95436 92939 91189 90893 91298 91842 92836 94238 95347 96065 97118
55212 97118 98651 99889 100407 100520 100258 99257 97827 96848 96470 96141 95969 96670 98046 98923 98852 98571 98560 98405
55194 98405 97867 97368 97160 97075 97186 97633 97835 97136 96211 96471 98010 99487 100084 100265 100482 100589 100699 101211 101763
55175 101763 101472 100443 99724 99615 99386 98811 98546 98715 98544 97769 97092 96944 97061 97530 98882 100837 102299
55158 102299 102974 103670 104758 105696 106366 107373 108537 108573 106932 104720 103191 102468 102202 102314 102462 101920 100593
55141 100593 99240 98315 97545 96894 96801 97123 97020 96273 95592 95374 95327 95649 97215 100093 103066 105124 106348
55124 106348 106997 106948 106499 106487 107063 107437 107256 107102 107225 107032 106296 105663 105430 105034 104274 103852 104082 104195 103598
55105 103598 102758 102281 102083 101987 102176 102608 102976 103566 105052 107105 108462 108749 108973 109814 110736 111261 111725 112244
55087 112244 112337 112192 112864 114508 115810 115975 115843 116219 116567 116326 116105 116386 116376 115405 114306 114117 114393 114144
55069 114144 113586 113631 114318 114991 115531 116213 116815 116887 116592 116401 116339 116177 115900 115332 113946 111767 109863 109161 109273
55050 109273 109157 108462 107602 107005 106935 107562 108670 109668 110274 110688 110906 110621 110011 109720 109699 109064 107569 106170
55032 106170 105574 105192 104216 102864 101889 101688 102416 104122 106177 107489 107874 108329 109429 110456 110670 110384 110144
55015 110144 109989 110133 111179 112796 113404 112175 110248 109040 108467 107926 107829 108788 110193 110970 111129 111342 111612
54998 111612 111533 111256 111103 110733 109789 108813 108483 108566 108681 109508 112024 115906 119708 122309 123309 122602 120594
54981 120594 118455 117130 116370 115509 114650 114196 113859 113216 112805 113488 115061 116521 117443 118096 118501 118463 118354 118880
54963 118880 120071 121323 122362 123418 124554 125523 126213 126651 126718 126366 125907 125603 125309 124897 124638 124598 124164 122788
54945 122788 120866 119289 118472 118295 118579 119171 120005 121447 123971 127086 129334 129953 129807 130076 130816 131556 132514
54928 132514 134239 136612 139150 141896 145241 149263 153964 159737 166995 175691 185617 196542 207646 217616
54914 217616 225800 232384 236856 237503 233394 225879 217155 208167 198937 189875 181497 173612 166039 159486
54900 159486 154576 150718 147133 144213 142512 141220 139182 136851 135564 135293 134814 133914 133719 134789 136406
54885 136406 138017 140025 142757 145781 148680 151719 155501 160510 167038 174957 183647 192701 202390 212743
54871 212743 222549 230124 234696 236284 234667 229568 221610 212066 201787 191178 180891 171586 163298
54858 163298 155952 150199 146690 144809 143129 140977 138607 136190 133628 131121 128911 126688 124188 122003
54844 122003 120755 119903 118590 117246 116984 117634 117844 117133 116436 116495 117004 117572 118286 119037 119335 119153 119026 119173
54826 119173 119383 119814 120854 122059 122350 121558 120751 120694 120898 120603 119885 119317 119182 119435 119983 120630 121051 121075 120853
54807 120853 120793 121408 122811 124195 124457 123775 123742 125245 127125 127914 127980 128588 129574 129633 128556 127468 126881 126184
54789 126184 125283 125161 126294 127784 128598 128710 128582 128418 128312 128423 128725 129214 130317 132388 134916 137117 139180
54772 139180 141940 145506 149290 153311 158215 164061 170335 177273 185795 195888 206231 215755 224322 231524
54758 231524 236099 237159 234993 230216 223147 214550 205928 198365 191737 185521 179643 174099 168541 162775
54744 162775 157164 152216 148268 145662 144521 144238 143931 143522 143590 144147 144557 144761 145518 147114 148892 150453
54728 150453 152392 155375 159307 163893 169188 175177 181563 188380 196132 204910 213977 222471 229830 235310
54714 235310 237890 237076 233233 226979 218912 210007 201376 193366 185583 177957 171030 165181 160426 157005
54700 157005 155092 153812 151709 148556 145618 143743 142266 140274 137899 135798 134243 133348 133350 134048 134628 134539
54684 134539 133972 133251 132504 132142 132679 133707 134027 133245 132350 132257 132673 132878 132702 132190 131166 129738 128480 127644
54666 127644 126905 126212 125968 126027 125555 124413 123617 123839 124427 124529 124193 123682 122749 121405 120473 120449 120713 120682 120910
54647 120910 122009 123312 123729 123368 123245 123814 124762 125874 127129 128176 128556 128321 127835 127202 126436 125854 125746
54630 125746 125979 126342 126895 127544 127767 127239 126287 125298 124264 123303 122926 123221 123441 123063 122662 123062 124224 125636
54612 125636 127194 128916 130336 131054 131440 132022 132563 132537 132155 132129 132656 133356 133965 134448 134661 134547 134459 134716 135047
54593 135047 135010 134658 134314 133999 133671 133693 134398 135389 135806 135259 134041 132630 131384 130562 130298 130599 131492 132878
54575 132878 134162 134576 134119 133622 133586 133527 132853 131751 130777 130146 129907 130218 130880 131129 130493 129453 128767 128614
54557 128614 128825 129393 130196 130734 130781 130824 131311 131949 132329 132692 133417 134275 134916 135642 136930 138518 139792 140808
54539 140808 142163 143995 145823 147308 148601 149923 151203 152130 152350 151849 151267 151402 152157 152500 151820 150662
54523 150662 149698 148647 146961 145047 143975 144158 145013 145755 145958 145478 144351 142822 141245 140014 139527 139774
54507 139774 139983 139341 138212 137894 138852 140022 140313 139980 139978 140742 142249 144446 146841 148354 148446 147887 147680 147805
54489 147805 147776 147765 148227 148896 149130 148942 148839 148970 149216 149785 150858 151933 152342 152266 152549 153636 155264 156883
54471 156883 157853 157622 156427 155492 155812 157015 157978 158209 157959 157448 156764 156265 156305 156731 157202 157659 158042 158008 157579
54452 157579 157497 158206 159002 159013 158558 158578 159102 159241 158504 157217 155827 154565 153704 153397 153374 153315 153299 153375 153200 152684
54432 152684 152468 152958 153417 152878 151513 150182 149118 148104 147532 148122 149733 151455 152756 153577 153534 152161
54416 152161 149956 148251 147889 148709 150144 151624 152570 152875 153206 154090 154984 155104 154821 155149 156058 156507 156099
54399 156099 155618 155783 156497 157476 158685 159906 160746 161282 162030 163127 164136 164727 164929 164779 164358 164065 164216
54382 164216 164499 164469 164337 164522 164770 164601 164318 164514 164834 164378 163269 162626 162905 163366 163379 163223 163310 163534 163667
54363 163667 163674 163436 162889 162456 162626 163122 163314 163378 164075 165345 166140 165808 164752 163628 162742 162262 162073 161462 159980
54344 159980 158501 158228 158709 158308 156833 156103 157313 159370 160725 161493 162678 164425 166315 168670 172226
54329 172226 176762 181101 184395 186695 188391 189723 190678 190911 189842 187279 183771 180052 176293 172186 167634
54314 167634 163090 159324 156869 155570 154672 153591 152526 152021 152135 152477 152860 153350 153786 153889 153809 153928 154163
54297 154163 154129 153926 154039 154404 154343 153515 152253 150946 149836 149453 150314 151959 153062 152807 151542 150021 148811
54280 148811 148523 149564 151242 152027 151299 150166 150036 150981 152006 152385 152150 151651 151200 151004 151186 151935 153551
54263 153551 155945 158210 159306 159218 158860 158838 158974 159068 159341 159940 160667 161382 162010 162072 161029 159275 157997 157779
54245 157779 158006 157962 157776 157995 158781 159772 160237 159311 156775 153707 151622 150850 150477 149859 149259 148939 148702 148630
54227 148630 149215 150334 151023 150690 149768 148880 148285 148388 149637 151441 152350 151903 151264 151367 151586 151052 150170 149789
54209 149789 149736 149324 148695 148566 149033 149545 149728 149516 148912 148323 148643 150181 151919 152584 152130 151487 151218 151168 151189
54190 151189 151489 152345 153846 155724 157173 157314 156175 154735 153744 153147 152899 153344 154268 154572 153741 152717 152445
54173 152445 152372 151540 150352 149938 150268 150333 149947 149988 150796 151566 151575 151037 150456 149976 149663 149692 149940 149929 149396 148540 147652
54152 147652 146912 146484 146301 145811 144514 142784 141571 141241 141291 141293 141466 142055 142704 142933 142941 143464 144886 146791 148448
54133 148448 149539 150198 150492 150205 149376 148696 148889 149785 150505 150599 150489 150704 151240 151886 152628 153395 153883 154018 154182
54114 154182 154662 155214 155579 156019 156916 158085 158929 159131 158900 158665 158744 159157 159595 159675 159284 158522 157480 156401
54096 156401 155838 156096 156581 156390 155516 154752 154437 154177 153885 154053 154687 154998 154677 154502 155121 156069 156682 157162 157940
54077 157940 158748 159125 159286 159695 160315 160989 161983 163355 164343 164278 163692 163689 164551 165759 166992 168280 169469 170326
54059 170326 171042 171963 173065 174255 175800 177758 179360 179789 179377 179267 180061 181479 183194 185233 187595 190117
54043 190117 192755 195554 198428 201332 204532 208324 212773 218019 224479 232306 241088 250552 261129 273241
54029 273241 286451 299983 313763 328307 343720 359179 373066 383325 388302 387906 383647 377230
54017 377230 369629 361653 354317 347878 341454 334482 327737 321931 316257 309610 302473 296125 290485 284260
54003 284260 277000 269596 262846 256850 251735 247633 243912 239715 235361 232013 229926 228223 226470 225135
53989 225135 224248 222941 220724 218066 215341 212336 209246 207047 206213 206039 205729 205287 204849 204136 203206 202772
53973 202772 203038 203025 201912 200333 199480 199487 199601 199517 199584 199898 200069 199924 199759 199777 199741 199364 198703 198136 198131 198972 200470
53952 200470 201916 202595 202464 202259 202876 204583 206835 208860 210415 211858 213555 215511 217684 220291 223507
53937 223507 227130 230850 234605 238330 241647 244259 246484 248951 251913 255249 258941 263085 267575 272234
53923 272234 277138 282370 287665 292779 298029 303861 310021 315781 321010 326466 332900 340339 348280 356211
53909 356211 363972 371917 380630 390077 399251 407109 413629 419436 424527 428076 429441 428832 426980 424714
53895 424714 422883 422084 422242 422743 422990 422610 421316 418952 415473 410564 403658 394826 385258 376211 367790
53880 367790 359496 351626 345220 340740 337723 335768 335102 336096 338983 344118 351863 362074 374035 386533
53866 386533 397250 402608 399650 388475 372042 353509 334626 316546 300611 287529 276716 267277
53854 267277 259084 252322 246609 241346 236595 232979 230815 229721 228973 227984 226596 225076 223764 222724 221845
53839 221845 221120 220495 219651 218376 217021 216104 215586 215010 214219 213360 212354 211043 209736 208909 208396 207640 206666
53822 206666 206075 206079 206296 206475 206592 206261 205080 203711 203592 205217 207571 209665 211727 214361 217341 219933
53806 219933 221878 223506 225255 227598 231059 235840 241569 247646 253640 259366 264988 271059 277914 284980
53792 284980 291194 296168 300330 303919 306642 308501 310204 312340 314727 316849 318429 319316 319312 318380 316593
53777 316593 313866 310245 306411 303167 300292 296698 291862 286388 281009 275916 271303 267610 264749 261860
53763 261860 258347 254528 250874 247293 243593 239966 236510 232901 229103 225877 224104 223939 224857 226024 226377
53748 226377 225056 222231 219006 216232 213947 212099 211008 210685 210480 209939 209415 209402 209852 210537 211396 212112 212110
53731 212110 211543 211562 212993 215269 217204 218227 218320 217473 215986 214814 214856 216076 217770 219354 220539 221195
53715 221195 221520 221942 222545 223076 223721 225165 227481 229780 231531 233486 236579 240558 244372 247368 249461
53700 249461 250708 251446 252402 253954 255693 257221 258851 260933 263191 265403 268007 271134 273696 274514 273935
53685 273935 273274 272954 272279 270896 269337 268034 266773 265401 264361 264169 264799 265749 266397 266297 265529 264778 264723
53668 264723 265333 265904 265716 264539 262730 261049 260109 259820 259608 259252 259060 259152 259209 259133 259268 259616 259575 258877 258047
53649 258047 257428 256563 255243 254323 254592 255441 255667 255124 254582 254361 254087 253622 253286 253270 253613 254608 256457 258727
53631 258727 260904 263263 266263 269273 270941 270979 270667 271333 273016 274904 276523 278114 280183 282891 285756
53616 285756 287977 289281 290364 292256 295360 299305 303471 307353 310739 313892 317316 321047 324500 327271
53602 327271 329616 331808 333636 335060 336727 339097 341532 343067 343774 344536 345743 346990 347887 348437 348719
53587 348719 348837 349065 349467 349621 349220 348618 348139 347223 345095 342000 338975 336591 334768 333607 333430 333991 334463
53570 334463 334345 333742 332778 331473 330232 329727 330139 331003 331854 332547 333019 333261 333435 333516 333045 331780 330350 329584
53552 329584 329436 329281 328983 328826 328600 327748 326398 325332 324893 324824 325212 326599 328950 331466 333749 336340 339735
53535 339735 343653 347681 351986 356903 362351 368148 374503 381734 389803 398449 407597 417394 427990 439430
53521 439430 451620 464368 477529 491032 504657 518137 531700 546058 561465 577288 593193
53510 593193 610208 629734 651742 674960 698594 722811 747552 772144 796410 821010 846093
53499 846093 870541 893280 914691 935931 957342 978231 998028 1016932 1035411 1053546 1071131
53488 1071131 1088247 1105538 1123731 1142831 1162021 1180494 1198198 1215560 1232792 1249826 1266665
53477 1266665 1283310 1299540 1315213 1330559 1345640 1359712 1371671 1381030 1387971 1392672 1395159 1395655
53465 1395655 1394319 1390620 1383591 1372801 1358716 1342302 1324693 1306919 1289250 1271018 1251738 1232152
53453 1232152 1213342 1195087 1176033 1155422 1133689 1111421 1088808 1066326 1044854 1024679 1005117
53442 1005117 985476 965755 946201 926958 908483 891642 877095 864990 855325 847887 841879 836463
53430 836463 831850 828988 827990 827802 827759 828482 830850 834995 840869 848835 858937 870306 882131 894706
53416 894706 908823 924655 941909 960646 981157 1003293 1026596 1050956 1076616 1103685 1132147
53405 1132147 1162175 1193965 1227346 1261935 1297655 1334859 1374038 1415614 1459843 1506680 1555773
53394 1555773 1606685 1659011 1712333 1766329 1820948 1876244 1932013 1987850 2043538 2099107 2154549
53383 2154549 2209683 2264062 2316627 2365878 2411086 2453091 2493120 2530974 2565319 2595618 2622539
53372 2622539 2646241 2665571 2679612 2688944 2694520 2696060 2692417 2682970 2667697 2646239 2617853 2582332
53360 2582332 2540326 2492766 2440454 2384349 2325939 2267082 2209241 2152654 2096373 2039563 1982740
53349 1982740 1927242 1873639 1821474 1770672 1722203 1676772 1633551 1590878 1547694 1503773 1459131
53338 1459131 1414045 1369438 1326545 1286164 1248546 1213723 1181488 1151260 1122565 1095721 1071719
53327 1071719 1051377 1034653 1020579 1007666 994721 981544 968783 956975 945987 935522 925833
53316 925833 917609 911254 906508 902697 899314 896480 894843 894880 896450 899256 903455 909295 916358 923943 932163
53301 932163 941896 953439 966009 979010 993192 1009988 1030015 1052544 1076193 1099910 1123638 1148306
53289 1148306 1174957 1203736 1233913 1264704 1295595 1325906 1354714 1381388 1405790 1427964 1448118
53278 1448118 1466775 1484229 1499846 1512628 1522423 1529679 1534088 1534572 1530891 1524157 1515379 1504509 1491370
53265 1491370 1476357 1459568 1440293 1418197 1394178 1369276 1343559 1316865 1289770 1262732 1234987
53254 1234987 1205414 1174079 1141905 1109317 1076321 1043679 1012822 984419 957798 931842 905915
53243 905915 879967 854312 829294 804804 780262 755381 730617 706487 682885 659613 637148
53232 637148 616265 597214 579824 564073 549931 537015 525045 514388 505493 498062 491427 485390
53220 485390 479982 474627 468358 460796 452310 443311 433978 424555 415299 406195 397216 388729 381119 374161
53206 374161 367307 360440 353846 347653 341866 336742 332456 328532 324290 319840 315945 312832 309753 305909
53192 305909 301348 296726 292485 288467 284218 279635 275275 271833 269247 266738 263911 261333 259672 258732
53178 258732 257835 256714 255479 254047 252275 250467 249179 248582 248405 248334 248084 247349 246112 244825 243886 243178
53162 243178 242456 241737 240948 239641 237647 235611 234263 233488 232779 232196 232168 232575 232806 232627 232299 231959 231439 230665
53144 230665 229692 228544 227459 226981 227252 227488 226855 225611 224739 224693 225180 225900 226675 226993 226298 224804 223353
53127 223353 222479 222185 222520 223602 225076 226277 227018 227635 228256 228643 228788 229011 229393 229661 229771 230097 230947 232151
53109 232151 233091 232825 230576 226666 222683 220099 218928 218371 218293 219043 220055 219892 218004 215505 213816 213205
53093 213205 213012 212665 212130 211738 211861 212489 213125 213397 213577 213992 214165 213318 211618 210091 209304 208944 208740 208869
53075 208869 209263 209451 209429 209869 211044 212243 212778 212910 213292 214025 214788 215417 215838 215779 215040 213876 212711 211653
53057 211653 210577 209490 208633 208303 208638 209365 209768 209248 207956 206602 205728 205537 206235 207826 209519 210141 209377
53040 209377 208040 206888 205837 204717 204038 204362 205286 205721 204970 203183 200989 199176 198483 199071 200126 200410
53024 200410 199452 198000 197200 197436 198099 198427 198341 198320 198588 198782 198521 198000 197781 198214 199289 200718 201897 202084
53006 202084 201091 199609 198447 197646 196842 196220 196409 197432 198454 198760 198489 198179 197975 197579 196787 195904 195636
52989 195636 196463 197972 199093 199225 198877 198866 199223 199400 199221 198962 198731 198523 198759 199896 201449 202274 202112 202111
52971 202111 203402 205713 207846 209130 209924 210921 212353 213896 215135 216056 216988 218059 218918 219209 219069 218838
52955 218838 218519 217865 216762 215159 212922 210229 207803 206171 204953 203514 202070 201383 201478 201473 200705 199323
52939 199323 197745 196310 195528 195859 196971 197809 197689 196877 195952 195117 194240 193137 191711 190242 189493 190024 191450
52922 191450 192914 194192 195640 197128 197857 197371 196055 194541 193209 192351 192065 191907 191311 190509 190320 190988
52906 190988 191979 193002 194329 195915 197120 197673 198064 198634 199006 198827 198357 197905 197405 196932 196948 197604 198450 199201
52888 199201 200066 200947 201160 200528 199946 200170 200700 200613 199941 199414 199277 199172 198932 198698 198383 197731 196891 196415 196618
52869 196618 197258 197864 198161 198259 198580 199469 200821 202312 204008 206369 209542 213065 216394 219321 221709 223266
52853 223266 223825 223456 222206 220101 217553 215240 213375 211497 209151 206374 203389 200365 197590 195418 193858
52838 193858 192620 191624 190936 190277 189306 188415 188451 189451 190505 191058 191571 192617 194177 196126 198435 200476
52822 200476 201033 199634 197113 194367 191470 188544 186488 185904 186133 186328 186857 188604 191412 194322 197098
52807 197098 200459 204753 209172 212324 213165 211543 208284 204598 201018 197217 193153 189787 188085 187792 187863
52792 187863 187728 187463 187085 186498 185886 185447 184845 183611 181962 180595 179685 178698 177211 175471 174069 173495 174046
52775 174046 175850 178773 182337 185728 188046 188910 188852 188719 188681 188324 187708 187556 188160 188858 189059 189072 189403 189866
52757 189866 190017 189961 190062 190252 190235 189947 189328 188061 186161 184473 183947 184644 185895 187147 188260 189353 190767
52740 190767 192800 195131 196922 197829 198343 198879 199288 199695 200909 203247 205736 207312 208139 208857 209302 209110
52724 209110 208974 209948 211682 212543 211551 209260 206741 204621 203139 202310 201769 201008 199921 198789 197868 197347
52708 197347 197455 198097 198697 198863 198858 198907 198556 197400 195971 195103 194770 194424 194083 194155 194447 194361 193961 193892 194238 194392
52688 194392 194122 193988 194550 195811 197463 199092 200155 200381 200158 200022 199892 199377 198598 198024 197671 197181 196569
52671 196569 196195 196182 196520 197515 199316 201133 201846 201315 200357 199501 198634 197812 197555 198215 199741 202019 204728
52654 204728 206981 208044 208471 209683 212308 215723 219135 222108 223956 223756 221477 218268 215191 212369 209785
52639 209785 208087 207927 208977 210228 210990 211195 210971 210338 209338 208291 207849 208633 210666 213366 216333 219802
52623 219802 223808 227245 228456 226745 222814 217871 212909 208782 206220 205466 206166 207584 208786 208989 208297
52608 208297 207763 208151 208954 209252 209141 209416 210134 210494 210142 209606 209374 209396 209668 210476 211827 213257 214383 215130
52590 215130 215389 215128 214828 215191 216300 217658 219012 220428 221616 221987 221537 221016 221052 221609 222302 222680 222305
52573 222305 221182 220064 219720 220036 220408 220735 221244 221725 221906 222334 223716 225553 226578 226541 226332 226331 225940 224923
52555 224923 223872 222978 221642 219782 218328 217801 217496 216721 215858 215529 215629 215875 216477 217523 218469 218934 219366
52538 219366 220234 221075 220997 219677 217471 215086 213506 213552 214981 216555 217393 217695 217873 217807 217363 216830 216301 215386
52520 215386 214114 213395 213941 215353 216822 218060 218992 219315 219168 219597 221448 224193 226600 228302 230054 232704
52504 232704 236358 240291 243228 244096 242931 240759 238354 235651 232580 229700 227516 225838 224403 223484 223278
52489 223278 223320 223222 223410 224350 225513 225960 225664 225498 226085 227266 228538 229507 230097 230747 232171 234504 236965
52472 236965 238668 239418 239445 238909 238131 237763 238143 238881 239587 240540 242126 244063 245839 247497 249342 251186 252512
52455 252512 253114 253042 252215 250648 248747 246818 244563 241620 238342 235496 233419 231977 231099 230793 230837 230928 231004
52438 231004 231051 230836 230251 229631 229356 229410 229668 230171 230713 230592 229371 227561 226066 225268 225092 225495 226289 226888
52420 226888 226933 226917 227644 229304 231646 234618 238121 241382 243449 244309 244912 246093 248029 250692 254215 258685
52404 258685 263989 270037 276886 284623 293191 302103 310095 315339 316449 313348 307125 299290 291208 283707
52390 283707 276871 270450 264628 259983 256649 254144 252298 251567 252012 252707 252835 252723 253114 253991 254912 256026
52374 256026 257840 260240 262628 264907 267586 270923 274550 277852 280326 281771 282621 283743 285360 286514
52360 286514 286202 284769 283452 282865 282704 282748 283258 284331 285611 286784 287832 288691 289168 289339 289636 290396 291505
52343 291505 292547 293120 293148 293018 293244 293920 294763 295777 297394 299803 302702 305951 309835 314327 318800 323007
52327 323007 327696 333688 340988 349323 358754 369027 379118 388442 397857 408364 419360 429326 437874
52314 437874 445906 454049 462152 470326 479221 489121 499709 510834 522531 534201 544713 553614 561544
52301 561544 569382 577619 586578 596374 606572 616604 626513 636513 645857 653146 657878 660850 662845
52288 662845 663861 663867 663358 662687 661610 659972 658152 656392 654330 651702 649006 646956 645715 645108 645230 646325
52272 646325 648244 650434 652426 654212 656280 659380 664016 670047 676871 683974 691112 698076 704653 710783
52258 710783 716511 721861 727095 732989 740407 749511 759691 770244 780884 791626 802459 813076 822798
52245 822798 830936 837383 842572 846705 849491 850944 851848 852952 854207 855424 857072 859690 862917 865925
52231 865925 868436 870557 872048 872743 873406 875071 877665 880209 882270 884167 885863 886867 887453 888890 892056
52216 892056 896556 901413 905890 909525 912297 915065 919070 924655 931056 937595 944375 951641 959213 966787
52202 966787 974078 980521 985606 989776 994282 999876 1006292 1013109 1020277 1027522 1034141 1039852 1045174 1050529
52188 1050529 1055634 1060143 1064226 1067966 1070724 1071631 1070398 1067324 1062854 1057378 1051105 1044010 1036247 1028593
52174 1028593 1021935 1016296 1010922 1005322 999596 993851 988156 983063 979229 976368 973565 970868 969537 970331
52160 970331 972486 974862 977146 979340 980994 981736 981909 981974 981745 980817 979319 977816 976940 977343 979339 982264
52144 982264 984933 987094 989557 992484 994589 994789 993580 991887 989418 985372 980145 975053 970635 966414
52130 966414 962292 959174 958063 959231 962395 967131 973127 980455 989575 1000676 1013252 1026691 1041008
52117 1041008 1056372 1072138 1086976 1099999 1111349 1121752 1131863 1141926 1151625 1160279 1167400 1173051
52105 1173051 1177616 1181621 1185856 1191170 1197803 1205315 1213483 1222682 1232982 1243475 1253070 1261434 1268498
52092 1268498 1273578 1275856 1275366 1272680 1267809 1260298 1250359 1239161 1227958 1217523 1208386 1200960 1195293
52079 1195293 1191190 1188558 1187137 1186041 1184306 1182023 1180338 1180115 1181124 1182684 1184602 1187166 1190575 1194688
52065 1194688 1199152 1203602 1207953 1212616 1218203 1224848 1231957 1238760 1244957 1250771 1256489 1262136 1267553 1272647
52051 1272647 1277393 1281521 1284294 1284860 1282871 1278637 1272657 1265322 1257108 1248658 1240335 1231907 1223039 1214017
52037 1214017 1205678 1198613 1192579 1186750 1180456 1173724 1167151 1161275 1156156 1151568 1147361 1143318 1138872 1133481
52023 1133481 1127283 1120979 1114978 1109073 1103024 1097005 1091321 1086143 1081675 1078149 1075405 1072851 1070024 1066838
52009 1066838 1063211 1058907 1053902 1048337 1041826 1033376 1022291 1008641 992552 973711 952201 929343
51997 929343 907050 886472 867600 849754 832038 813800 795356 778020 762848 749468 736572
51986 736572 723234 709248 694568 679231 663783 649099 635623 623122 611123 599149 586668
51975 586668 573400 559770 546738 535130 525436 518090 513372 510957 510063 510293 512044 515865 521629 528500
51961 528500 535633 542706 549805 556843 563223 568123 571033 571811 570291 566255 560041 552913 546439 541379
51947 541379 537271 533183 528964 525808 525436 528641 534861 543320 554039 567167 581808 596463 610551
51934 610551 624537 638476 651460 662728 672207 679357 682533 680473 673790 664164 652530 638886 623396
51921 623396 606708 589310 571383 553264 535487 518475 502701 488892 477468 467968 459627 452369
51909 452369 446675 442672 440058 438831 439426 442020 446155 451141 456500 462096 468155 474938 481922 487436
51895 487436 489637 487883 482917 476018 468421 461248 455270 450717 447828 447624 451601 460626 474465 492457
51881 492457 514228 539715 568572 599246 628344 651471 665515 670256 667497 659138 646800 632700
51869 632700 619273 607283 595145 580859 564224 546742 529824 513814 498613 484577 472477
51858 472477 462829 455560 450279 446652 444324 442647 440861 438665 436350 434216 432037 429238 425367 420275
51844 420275 414194 407888 402383 398188 394883 391711 388350 384902 381432 377957 374751 372381 371464 372459 375367
51829 375367 379465 383612 387064 389734 391556 392160 391465 390013 388225 385870 382881 380247 379265 380059 381556
51814 381556 382868 384117 385839 388194 390864 393361 395276 396478 397079 397094 396272 394450 391825 388662 384982
51799 384982 380866 376817 373563 371632 371268 372332 373974 374857 374170 372258 370040 368177 367020 366762 367130
51784 367130 367327 366766 365512 363752 361403 358665 356265 354582 353116 351453 350079 349565 349634 349952 351144 353996
51768 353996 358154 362752 367965 374706 382984 391675 399817 407022 412667 415791 415960 413436 408500 401518
51754 401518 393633 386347 380239 374866 369889 365460 361514 357674 353998 350972 348702 346914 345750 345688 346662
51739 346662 348266 350797 354997 360652 366589 372346 378676 386056 393736 400725 406628 411073 413380 413519
51725 413519 412568 411694 411483 412712 416600 423227 430461 435495 437153 436040 433026 428573 423346 418470 414915
51710 414915 412864 411644 410094 407309 403353 399141 395574 393169 392514 394284 398275 402778 405500 405129 402009
51695 402009 397636 393614 390708 388736 387595 388090 391106 395993 400609 403148 403152 400660 395545 388279 380448
51680 380448 373645 368323 364329 361917 361455 362580 364455 366616 368855 370538 370791 369445 367320 365539 364908
51665 364908 365914 368949 374361 382207 391822 401699 410146 416081 418954 418216 413715 406740 399734 394565
51651 394565 391649 391015 393320 399080 407555 417116 426242 433459 436934 435208 428410 418052 405744 392625
51637 392625 379782 368283 358524 350122 342699 336403 331577 328338 326714 326804 328426 330806 332976 334604
51623 334604 336197 338325 340740 342535 343188 343125 343140 343559 344256 345092 345935 346455 346404 345924 345103 343463 340530 336814
51605 336814 333520 331182 329229 327031 324831 323461 323570 325260 328084 331414 335223 340442 348075 358202
51591 358202 370273 383839 397907 409877 416692 417533 414431 409927 405174 400638 397311 396224 397529
51578 397529 400882 406227 413628 422932 434125 447371 462164 477101 491137 504626 518628 533792
51566 533792 550167 567204 583329 596498 606242 614819 625696 641342 662869 690815 725200 765236
51554 765236 809668 856691 902826 942843 972236 989609 995906 992019 978297 955774 926188 890722
51542 890722 849986 805399 759440 714212 670616 629182 590872 556736 527431 503314 484352
51531 484352 469615 457412 446336 436054 427045 419852 414512 410381 406533 402569 398872 395835 393193
51518 393193 390507 387892 385628 383455 380946 378372 376395 375022 373640 372079 370848 370173 369485 368077 365746
51503 365746 362583 358629 354048 349355 345313 342621 341512 341381 340978 339391 336782 333985 331707 330485 331003
51488 331003 333653 337835 342227 345853 348563 350734 352915 355582 358701 361706 364299 366950 370018 372766
51474 372766 374016 373623 372470 371142 369446 367190 364506 361218 356741 350955 344555 338286 332432 327260
51460 327260 323229 320314 317707 314717 311581 309012 307234 305918 304836 304194 304404 305738 308130 311187 314528
51445 314528 318249 322962 329394 338100 349486 363639 379781 395993 409837 419652 425564 429275 432719
51432 432719 436761 441126 445227 448374 449218 445946 437843 426336 413852 401861 390574 380202 371581
51419 371581 365413 361549 359242 357655 356067 354099 352011 350484 349816 349526 348856 347551 346126 345403 345742
51404 345742 346669 347435 347915 348596 349657 350676 351615 353439 357024 361884 366688 370798 374572 378429 382535
51389 382535 387448 394125 402982 413471 424913 437336 451406 467950 487780 511682 540384 574597
51377 574597 614893 661255 712964 769197 829377 892195 954431 1011443 1059066 1094813 1117566
51366 1117566 1126956 1123249 1107273 1080110 1043062 997899 946697 891419 833939 776365 720805 668756
51354 668756 621058 578299 540809 508362 480479 456964 437678 421885 408494 396989 387496 379811
51342 379811 372995 366189 359401 353278 348417 344972 342598 340722 339089 337917 337199 336205 334289 331876 329912
51327 329912 328488 326920 325110 323820 323374 323096 322458 321897 321994 322524 322904 322960 322667 321664 319735 317468 315796
51310 315796 315079 315049 315452 316215 317144 317963 318651 319377 320075 320411 320220 319723 319170 318448 317258 315701 314472 314201
51292 314201 314620 314758 314098 313142 312569 312264 311693 310974 311019 312672 316216 321556 328350 335938 343590 350806 357074
51275 357074 361554 363612 363515 362014 359371 355488 350932 346954 344258 342480 341096 340231 340238 341070 342380 343782
51259 343782 344743 344717 343733 342449 341344 340212 338693 336915 335240 333703 332046 330183 328379 327012 326243
51244 326243 325847 325479 325218 325629 326991 328721 330041 330944 332000 333335 334493 335203 335596 335663 335162 334150 332992
51227 332992 331780 330339 328859 327890 327679 328116 329316 331409 333771 335400 336328 337710 340145 342747 344362
51212 344362 344932 345083 345080 344817 344377 344006 343921 344514 346320 349370 352963 356408 359536 362263 364242 365385 366133
51195 366133 366796 367142 367047 366958 367125 366966 365874 364243 363061 362766 363099 363841 365094 366892 368987 371000 372582
51178 372582 373588 374217 374665 374578 373333 371012 368534 366443 364168 360881 356584 351925 347489 343762 341237
51163 341237 339946 339297 338884 339080 340274 341999 343410 344247 344706 344798 344530 344344 344621 345018 345037 345016 345693 346965
51145 346965 347955 348330 348670 349354 349871 349561 348487 347155 345852 344649 343681 343007 342320 341210 339746 338614
51129 338614 338584 339841 341846 343854 345589 347377 349678 352574 355731 358730 361389 363833 366207 368279 369489
51114 369489 369617 369243 369259 370057 371506 373495 375905 378156 379522 380056 380565 381492 382414 382943 383451 384479 385980
51097 385980 387645 389535 391778 393935 395159 394926 393400 391272 389486 388764 389107 389998 391255 393227 395842
51082 395842 398020 398586 397570 396063 394944 394120 392960 391129 388976 387223 386284 385889 385600 385562 386359 388171
51066 388171 390515 392866 395021 396831 398244 399783 402373 406482 411982 418899 427380 436598 444604 450018
51052 450018 453280 455751 458233 461038 464834 470507 478348 487941 498656 509883 521199 532721 544766
51039 544766 556704 566656 572965 575634 575950 575236 574425 574052 573704 571787 566605 557547 544968 529627 512999
51024 512999 497405 484738 475209 468018 462865 459984 459176 459851 461840 465232 469489 473640 477359 481082
51010 481082 485136 489497 494359 500049 506316 512396 517863 522914 527876 533061 538987 545975 553486 560525
50996 560525 566785 572927 579774 587735 596844 606685 616368 625307 633993 643347 653319 662852 671235 678792
50982 678792 686192 693780 701742 710250 719151 727888 735732 741699 744386 742764 737342 730109 723183 717952
50968 717952 715394 716450 721733 731259 744616 761145 780113 801222 824924 851670 880935 911581
50956 911581 943106 975756 1009350 1042830 1075276 1106661 1137219 1166684 1194732 1221799 1248935
50945 1248935 1276905 1305837 1335720 1367092 1401123 1438935 1480713 1525397 1570995 1614813 1653543
50934 1653543 1684230 1706100 1721114 1731919 1739331 1742312 1739989 1732647 1720721 1703772 1680823 1651107
50922 1651107 1614342 1570911 1522097 1469669 1414961 1358655 1301524 1244904 1190209 1138407 1090123
50911 1090123 1045875 1005954 970278 938511 910236 885051 862660 842738 824534 806957 789458
50900 789458 772614 757366 743905 731777 720782 711099 702618 694845 687471 680495 673843 667388 661367
50887 661367 656252 652281 649531 648260 648539 649711 650897 651963 653423 655474 657832 660447 663632 667462
50873 667462 671678 676206 681149 686384 691836 698025 705495 713818 722077 730385 739944 751464 764498 778578
50859 778578 793990 810954 828964 847560 867235 889015 913601 941213 971812 1005217 1041498
50848 1041498 1081507 1126454 1176641 1231140 1288897 1349686 1413745 1481098 1551480 1624304 1698348
50837 1698348 1771986 1843990 1913722 1980386 2042802 2100182 2152629 2200628 2244657 2285595 2324946
50826 2324946 2364322 2405088 2448599 2496167 2548586 2606314 2670257 2741544 2819969 2903026 2986570
50815 2986570 3065835 3135837 3191916 3230664 3250036 3248511 3224955 3179597 3114197 3030782 2930963
50804 2930963 2816909 2692069 2560263 2424893 2289633 2158827 2036048 1922696 1818885
50795 1818885 1725146 1642343 1570423 1508414 1455558 1411543 1375737 1347072 1324726 1308268 1297132
50784 1297132 1290503 1287693 1288000 1290192 1292698 1294402 1294871 1293843 1290922 1285787 1278370 1268838 1257670 1245612
50770 1245612 1233163 1220152 1206005 1190237 1172414 1151963 1128556 1102665 1075337 1047442 1019434
50759 1019434 991809 965404 941105 919381 900067 882605 866607 852350 840545 831626 825470 821795
50747 821795 820449 821210 823765 828179 834929 844171 855314 867716 881556 897612 916445 938187 962959
50734 962959 991074 1022733 1057736 1095448 1135032 1175885 1217949 1261337 1305593 1349610 1392404
50723 1392404 1433641 1473249 1510895 1546118 1578719 1608609 1635331 1657861 1674979 1686030 1691597
50712 1691597 1693364 1693034 1691645 1690292 1691122 1696735 1708586 1726726 1751047 1781720 1818235 1859097 1903042
50699 1903042 1949598 1997649 2044162 2085194 2117700 2139665 2149015 2143531 2122028 2085212 2035525 1976542
50687 1976542 1912256 1846237 1781258 1719560 1662965 1612352 1567369 1527193 1491440 1460260 1434013
50676 1434013 1413239 1398633 1390618 1389170 1394255 1406108 1424855 1450197 1481498 1517589 1556288 1594862
50664 1594862 1631383 1665123 1695411 1721057 1741586 1758249 1772992 1786841 1799912 1812358 1824425
50653 1824425 1835981 1846748 1856668 1865420 1872221 1877040 1881666 1888517 1898545 1911184 1926200 1944577
50641 1944577 1967530 1995498 2028369 2066056 2108488 2155307 2205591 2257672 2309390 2358835 2404713
50630 2404713 2445877 2481167 2510288 2534361 2555054 2573669 2591558 2610173 2628743 2641722 2640185
50619 2640185 2616982 2570939 2506923 2433211 2358739 2290924 2234170 2189882 2157906 2137701 2128271
50608 2128271 2127861 2134413 2146204 2161685 2178754 2194332 2204695 2206409 2197340 2176845 2144909 2101373
50596 2101373 2046396 1981547 1909915 1834948 1759331 1684793 1612540 1543645 1479172 1419951 1366189
50585 1366189 1317511 1273551 1234346 1200049 1170629 1146148 1126919 1112909 1103243 1096755 1092849 1091398
50573 1091398 1092106 1094480 1098314 1103653 1110309 1117821 1125850 1134320 1143216 1152481 1161930 1171132 1179788 1188541
50559 1188541 1198963 1212313 1228652 1247588 1269328 1294430 1323067 1355320 1391742 1432677 1477154
50548 1477154 1523230 1569234 1613852 1655322 1691742 1722540 1748983 1773127 1796871 1821990 1850198
50537 1850198 1882777 1920494 1963897 2013279 2068466 2129248 2195917 2268867 2347982 2433295 2526046
50526 2526046 2628048 2739851 2860430 2988682 3124046 3265214 3409280 3552880 3693431
50517 3693431 3828578 3955087 4069088 4167119 4246363 4304317 4338910 4348913 4333856 4293810 4229712
50506 4229712 4143744 4039005 3918908 3787181 3648247 3507076 3368605 3237438 3117956 3014239
50496 3014239 2929643 2866425 2825722 2807614 2811148 2834412 2874832 2929435 2994612 3065272 3134218
50485 3134218 3192739 3232416 3246933 3232866 3189600 3118974 3024772 2912044 2786483 2653825 2519041
50474 2519041 2385616 2255684 2130858 2012535 1901454 1797662 1701277 1612840 1532649 1460298
50464 1460298 1395260 1337379 1286331 1241243 1201415 1166913 1137859 1113676 1093720 1078098 1067020
50453 1067020 1059706 1054799 1051633 1050361 1051136 1053906 1058630 1064858 1071382 1077230 1082788 1089180 1096859 1105731
50439 1105731 1116166 1128653 1142523 1156234 1168945 1180816 1191914 1202114 1212131 1223266 1235727
50428 1235727 1248278 1259925 1270872 1281511 1291653 1301295 1311145 1321831 1333556 1347118 1364274 1386318
50416 1386318 1413059 1443922 1479359 1520491 1568024 1622264 1683612 1752171 1827078 1906770 1989591
50405 1989591 2073729 2157061 2237675 2314287 2385773 2450807 2508427 2558420 2600442 2632969 2653689
50394 2653689 2660752 2653237 2630705 2592912 2540037 2473052 2394053 2306383 2214093 2120969 2030178 1944579
50382 1944579 1866684 1798031 1739211 1690880 1654192 1629878 1617443 1615768 1624020 1641385 1666181 1695696
50370 1695696 1726629 1755322 1777989 1791391 1793353 1782564 1758329 1721074 1672894 1617123 1557240
50359 1557240 1496106 1435685 1376992 1320454 1266617 1216366 1170281 1128051 1088783 1051679 1016276
50348 1016276 982421 950394 920871 894384 870966 850495 833144 819143 808214 799517 792128 785506
50336 785506 779612 774627 770487 766743 763106 759973 758133 757959 759235 761640 764927 768640 772310 776055
50322 776055 780562 786323 793336 801630 811515 823038 835648 848741 862288 876763 892644 910053
50310 910053 928607 947612 966530 984915 1001499 1013839 1019834 1019591 1015119 1008301 1000015 991068 982705
50297 982705 975820 970560 967028 965468 965448 965798 965844 965830 965721 964717 962611 960669 960269 961564 964585 970974
50281 970974 983065 1000846 1020401 1035557 1041314 1036585 1024517 1010085 996833 985742 976763 970346
50269 970346 967011 966429 967886 971119 975860 980945 984844 987044 988328 989766 991892 994659 997693 1000648
50255 1000648 1003565 1006594 1009206 1010211 1008948 1005933 1001918 996915 990801 984301 978512 973619 968835 963561
50241 963561 958084 953195 949514 947139 945766 945302 946419 950036 956096 963446 971211 979621 989159 999696
50227 999696 1011027 1023499 1037403 1052433 1068558 1086794 1108104 1131916 1156560 1180753 1203728
50216 1203728 1224339 1241260 1254140 1263778 1271200 1277363 1283599 1291280 1300694 1310776 1320031 1327124 1330506
50203 1330506 1328209 1318455 1300320 1273937 1240470 1202010 1161089 1120049 1080755 1044647 1012720 985568
50191 985568 963561 946755 934584 926000 919941 915069 908968 898699 882886 862752 840592 817951
50179 817951 795853 775757 758849 744748 732119 720484 710474 702477 696136 691189 687735 685369
50167 685369 682951 679654 675755 672106 669273 667279 665757 664183 662243 660053 657926 656154 655262 656023 658788
50152 658788 663075 668281 674362 681269 688121 693746 697790 700620 702367 702786 701879 699918 696992 693220 689315
50137 689315 686254 684443 683738 684081 685510 687794 690778 694819 700111 705820 710721 714577 718083 721676 725311
50122 725311 729305 734385 740686 747602 754768 762584 771701 782681 796120 812336 830863 850908 872342
50109 872342 895627 921065 949078 981108 1019066 1063594 1113591 1167369 1223289 1279216 1332693
50098 1332693 1382251 1427897 1470153 1509648 1547793 1586565 1626775 1667326 1706687 1744055 1778177
50087 1778177 1805831 1822685 1825692 1814258 1789593 1753699 1708815 1657198 1601198 1543418 1486256
50076 1486256 1431062 1378252 1328548 1283530 1244565 1211723 1184281 1161769 1143880 1129749 1118109
50065 1118109 1108040 1098999 1090176 1080477 1069322 1057082 1044585 1032388 1020627 1009283 998303 987495
50053 987495 976510 965134 953618 942520 932172 922492 913429 905278 898279 892254 887055 883118 881040
50040 881040 880757 881686 883605 886787 891276 896678 902890 910469 919929 930995 942767 954431 965658 976525
50026 976525 987125 997094 1005500 1011362 1014271 1014437 1012414 1008990 1004967 1000505 994855 987257 977870 967333
50012 967333 955653 942313 927489 912459 898622 886534 875914 866047 856245 846581 838320 833063
50000 833063 831324 832404 835706 841627 850915 863582 878549 893994 908100 920080 930770 941924
49988 941924 954861 969941 987025 1005795 1025667 1045999 1066472 1086877 1106608 1124914 1141528
49977 1141528 1156512 1169635 1180690 1190419 1200429 1212032 1225672 1241264 1258138 1274387 1287018
49966 1287018 1293124 1290676 1278464 1256142 1224572 1185610 1141542 1095128 1049728 1008184 971406 938891
49954 938891 910684 887907 871310 860378 854129 851697 851832 852851 853627 853768 852535 848712 842197 834697
49940 834697 827929 821742 814664 805594 794233 780578 764944 748200 731175 713986 696460 678982
49928 678982 662405 647370 634110 622695 613029 604765 597453 590763 584625 579520 576460 576092 577762
49915 577762 580059 582270 584651 587344 589970 592420 595127 598333 601946 606343 612310 619957 628710 638653
49901 638653 650657 664733 679523 694040 708571 723032 735804 745410 752307 757753 761765 763436
49889 763436 762408 758685 751713 741152 728063 713905 698765 682077 664760 648985 635684 623734
49877 623734 611843 599934 588409 577322 566912 557976 551089 546039 542420 540133 539028 538684 538918
49864 538918 539948 541690 543520 545212 547687 552373 559976 570108 581906 594745 608519 623378 639091
49851 639091 654651 668758 680688 690428 698026 703278 706283 707897 709092 709818 708770 704497 696691 686317
49837 686317 674588 662130 649188 636249 624102 613510 605139 599502 596416 594722 593224 591892 591567
49824 591567 592589 594458 596816 599913 603970 608993 615460 624216 635303 647736 660776 674401 688047
49811 688047 700063 709349 716635 723141 728777 732749 735214 736948 737717 736274 731958 725264 716961 707696
49797 707696 698474 690384 683489 676692 669020 660511 651753 643176 635052 627694 621382 616248 612283 609262
49783 609262 606765 604491 602454 600709 599177 597896 596998 596261 595269 594391 594913 597600 601835 606860 613146
49768 613146 621475 631159 640363 647959 654023 658680 661709 663414 664748 666169 667145 667144 666385 665214 663240
49753 663240 659424 652730 642679 629774 615517 601599 588905 577519 567524 559237 552743 547694 543654
49740 543654 540249 537125 534308 532489 532295 533237 533948 533609 532683 532226 532971 535108 538396 542272 546220 550180
49724 550180 554389 558991 564190 570591 578783 588548 599007 609634 620618 632165 643849 654780 664076
49711 664076 671112 675648 677779 677540 674649 668887 660626 650699 639882 628784 618024 608179 599699 593120
49697 593120 589008 587263 586783 586265 585141 583446 581348 579381 578646 579940 582967 586990 591859 597659 603842
49682 603842 609741 615721 622809 631291 640721 651177 663369 677435 692836 709685 728869 750106
49670 750106 770710 787078 796990 800173 797479 790417 781189 772224 765260 760826 758544 757891 758715 760857
49656 760857 763046 762546 756599 744418 727498 708148 688218 669041 651714 636948 624906 615331
49644 615331 607742 601618 596746 593293 591299 590397 590412 591796 594803 598506 601390 602744 602819 601842 599739 596677
49628 596677 592971 588442 582763 576467 570758 566196 562368 558930 556061 553711 551335 548746 546475 544962
49614 544962 544091 543816 544488 546179 548296 550286 552193 554264 556585 559353 562880 566985 570832 573685 575400
49599 575400 576100 575988 575623 575692 576223 576591 576524 576552 577254 578672 580678 583218 585904 588026 589282 590020 590568 590928
49581 590928 591312 592214 593692 595274 596839 598841 601376 603915 606357 609488 613846 618928 624212 630255 638018
49566 638018 647600 658335 669674 681319 692892 704130 715092 725610 734825 741791 746257 748472
49554 748472 748574 746678 743154 738409 732727 726746 721604 718080 715985 714887 714943 716334 718309 719628 719831
49539 719831 719398 718759 717832 716561 715286 714383 713953 714086 715202 717963 722847 729710 737715 745947 754349 763945
49523 763945 776044 791359 809900 831154 853941 876276 895891 911108 921269 926649 928260 927708
49511 927708 926896 927491 930317 935145 941233 948193 955959 963645 968969 969454 964031 953009 937094 917507
49497 917507 896775 877871 862008 848111 834859 822375 811462 802207 794170 787264 781531 776433
49485 776433 771236 766039 761902 759872 760115 761771 763476 764301 764396 764470 764609 764084 762447 760246 758369 757203
49469 757203 756669 756638 757029 757915 759709 762738 766509 769985 772728 775112 777294 778856 779733 780480 781148 780772
49453 780772 778614 775109 770955 766068 760207 753882 747818 742104 736656 731872 727950 724184 719886 715505
49439 715505 711863 708724 705202 701234 697615 694855 693133 693171 695853 700848 706699 712599 719139 726968 735662
49424 735662 744445 753370 763245 774934 789192 806499 825941 844231 856705 860221 855399 845978 836028
49411 836028 827752 821666 818054 817587 820685 826949 835492 845563 856891 869768 884707 901528 918844
49398 918844 935117 950243 965404 981269 997179 1012283 1026593 1040423 1053635 1066046 1077904
49387 1077904 1089237 1099196 1106608 1110817 1111574 1108718 1102488 1093683 1083001 1070735 1057516 1044649 1033093
49374 1033093 1022763 1013448 1005707 1000142 996583 994812 995387 998682 1003696 1008942 1014041 1019341 1024409 1028200
49360 1028200 1030593 1032451 1034104 1034816 1033896 1031355 1027324 1021837 1015421 1009096 1003450 998344 993718 989994
49346 989994 987517 986263 986306 987956 991102 994924 998547 1001591 1003900 1005104 1004700 1002366 998094 992196 985158
49331 985158 977331 968978 960767 953843 948933 945636 943039 940766 938910 937318 935706 934386 934114 935118
49317 935118 936771 938268 939209 939550 939479 939327 939336 939530 940035 941181 942915 944565 945722 946969 949117 952025 954864
49300 954864 957285 959584 961957 964418 967354 971354 976413 981966 987685 993612 999587 1005281 1010856 1016968
49286 1016968 1023970 1031583 1039322 1046749 1053314 1058587 1062717 1066375 1070403 1075864 1084006 1095444 1109520
49273 1109520 1125030 1141177 1156917 1169785 1176699 1176333 1169975 1159988 1148258 1136173 1124886 1114744
49261 1114744 1104989 1094693 1083881 1073446 1064269 1056837 1051747 1050255 1053859 1062964 1076177 1091579 1108623
49248 1108623 1127666 1147239 1163057 1170857 1169552 1160647 1145586 1125261 1101553 1077347 1054581 1033461
49236 1033461 1013743 995539 978779 963212 949457 939070 933108 931356 933051 937450 943552 950437
49224 950437 958247 967882 979391 991517 1002940 1012953 1020697 1025133 1026331 1025757 1024590 1022702 1019828
49211 1019828 1016700 1014210 1012291 1010430 1008665 1007436 1007149 1008574 1012917 1020689 1030940 1042256 1054077
49198 1054077 1066526 1079576 1093043 1106905 1121002 1134831 1148143 1161218 1174090 1186104 1196805
49187 1196805 1206634 1216056 1224579 1231479 1237104 1242671 1249056 1256485 1265178 1275475 1287360 1300396 1314250
49174 1314250 1329110 1345829 1365985 1391457 1423467 1462064 1506237 1553583 1599307 1636667 1659913
49163 1659913 1667376 1661661 1647391 1629296 1611629 1597658 1588637 1583446 1579694 1575496 1570452 1565245 1560361
49150 1560361 1555346 1549420 1542604 1535759 1529573 1524165 1519809 1517356 1517530 1520310 1525359 1532554 1541708 1552287
49136 1552287 1563880 1576561 1590424 1605204 1620681 1636936 1653761 1670368 1686258 1701892 1717897
49125 1717897 1734075 1749897 1765561 1781784 1798799 1816275 1834139 1852739 1872233 1892384 1912954
49114 1912954 1933855 1955011 1976670 1999865 2026084 2056581 2092588 2136286 2190847 2258620 2338491
49103 2338491 2424340 2506512 2577011 2635894 2692830 2759570 2837481 2911313 2956950 2958256 2918773
49092 2918773 2858041 2796289 2741303 2687729 2626390 2553325 2471770 2388722 2311025 2243278 2187180
49081 2187180 2141992 2105968 2077640 2055939 2039741 2027901 2019537 2013699 2008802 2003001 1995373 1986532
49069 1986532 1977888 1970405 1964055 1958280 1952754 1947573 1942757 1937941 1932830 1927792 1923639 1920833 1919264 1918729
49055 1918729 1919174 1920430 1922123 1923980 1925891 1927741 1929580 1931906 1935240 1939409 1943819 1948445 1953832 1960042
49041 1960042 1966457 1972966 1980592 1990453 2002705 2017004 2033347 2051820 2071881 2092361 2111886 2128923
49029 2128923 2142025 2150675 2155696 2158440 2159830 2160383 2160462 2159926 2158093 2154768 2150956 2147892 2145718 2143841 2142307
49014 2142307 2142036 2143785 2147643 2153533 2161525 2171438 2182638 2194470 2206659 2219234 2232347 2246177 2260770
49001 2260770 2275785 2290474 2303988 2315858 2326436 2336759 2347548 2358283 2367640 2374865 2380252 2384275
48989 2384275 2387084 2389092 2391161 2393543 2395381 2396075 2396520 2398060 2400602 2402766 2403693 2403691 2403077 2401457 2398512 2394725
48973 2394725 2390788 2386707 2381932 2376121 2369443 2362272 2354873 2347372 2339909 2332762 2326296 2320782 2316311 2312939
48959 2312939 2310874 2310490 2312220 2316299 2322477 2330132 2338933 2349295 2361780 2376178 2391659 2407731 2424440
48946 2424440 2441624 2458788 2475941 2493788 2512691 2532128 2551679 2571910 2593713 2617299 2642455
48935 2642455 2669282 2698049 2728696 2761138 2795817 2833299 2873549 2916112 2960801 3007698 3056674
48924 3056674 3107423 3159753 3213441 3268069 3323505 3380261 3438765 3498413 3557801 3615824 3672174
48913 3672174 3726973 3780378 3832477 3883202 3932384 3979986 4026015 4070108 4111684 4150771 4188138
48902 4188138 4224282 4258859 4291524 4322676 4352769 4381454 4408063 4432418 4454507 4473983 4490805
48891 4490805 4505878 4520110 4533220 4544405 4553813 4562219 4569450 4574212 4575458 4572859 4565855 4553421 4535246
48878 4535246 4512458 4486739 4459211 4430241 4399612 4366565 4330115 4289684 4245238 4196995 4145544
48867 4145544 4092154 4038180 3983954 3928785 3872234 3814902 3757908 3702189 3648461 3597194 3548201
48856 3548201 3500712 3454330 3409699 3367938 3329519 3293889 3260084 3227636 3196944 3168801 3143618
48845 3143618 3121280 3101801 3085662 3073161 3063752 3056541 3051253 3048227 3047647 3049344 3053323 3059932 3069394
48832 3069394 3081543 3096093 3112779 3131157 3150620 3170775 3191643 3213434 3236223 3259804 3283817
48821 3283817 3308101 3332907 3358468 3384366 3409756 3434329 3458454 3482151 3504658 3525583 3545937
48810 3545937 3567320 3590400 3614668 3639254 3663414 3686664 3709196 3731929 3755563 3779940 3804876
48799 3804876 3831111 3859620 3890348 3922381 3954942 3987317 4018281 4046813 4073268 4098795 4123649
48788 4123649 4147223 4169682 4192247 4215372 4237639 4256944 4272015 4282386 4287749 4288005 4283504 4274715
48776 4274715 4262024 4246104 4227978 4208224 4186387 4161503 4133052 4101213 4066438 4029001 3988878
48765 3988878 3945996 3900684 3853752 3805983 3757724 3709113 3660384 3611688 3563053 3514996 3468731
48754 3468731 3425211 3384260 3345274 3308284 3273561 3240575 3208335 3176594 3145723 3115574 3085590
48743 3085590 3056214 3029072 3005433 2985377 2968733 2955923 2947347 2942663 2941144 2942072 2944292 2945970 2945518
48730 2945518 2942631 2938124 2933027 2928074 2923729 2920315 2918145 2917592 2918875 2921822 2926063 2931424 2937821 2944900
48716 2944900 2952121 2959101 2965614 2971472 2976859 2982469 2988728 2995061 3000482 3004761 3008410 3011724 3014581 3017101
48702 3017101 3019764 3022845 3026385 3030644 3035980 3042291 3049209 3056750 3065129 3074056 3083021 3092137 3101844 3111705
48688 3111705 3120288 3126367 3129607 3130177 3128662 3126431 3125102 3125280 3126471 3128350 3131263 3135168 3138954 3141288
48674 3141288 3141619 3140054 3136711 3131454 3123848 3113351 3100020 3084987 3069544 3053742 3036562 3017469
48662 3017469 2996987 2975666 2953269 2929261 2903420 2875809 2846683 2816528 2785522 2752959 2717964
$$ [...]
##END NTUPLES=NMR SPECTRUM
##END=
