
##TITLE=UV1269_M12_1292-1216_90_7414817_RMNKnYd3Fd
##JCAMPDX= 6.0         $$ Bruker NMR JCAMP-DX V2.0
##DATA TYPE= NMR SPECTRUM
##DATA CLASS= NTUPLES
##ORIGIN= BRUKER
##OWNER= Administrator
$$ 1.72 TOPSPIN		Version 2.1
$$ 2013-01-25 17:42:45.636 -0500  Administrator@X
$$ Compression mode = diff/dup
##.OBSERVE FREQUENCY= 400.02188249412
##.OBSERVE NUCLEUS= ^1H
##.ACQUISITION MODE= SIMULTANEOUS (DQD)
##.ACQUISITION SCHEME= undefined
##.AVERAGES= 8
##.DIGITISER RES= 22
##SPECTROMETER/DATA SYSTEM= spect
##.PULSE SEQUENCE= zg30
##.SOLVENT NAME= COFFEE_meoh
##.SHIFT REFERENCE= INTERNAL, COFFEE_meoh, 1, 14.98509
##AUDIT TRAIL= $$ (NUMBER, WHEN, WHO, WHERE, PROCESS, VERSION, WHAT)
$$ ##TITLE= Audit trail, TOPSPIN		Version 2.1
$$ ##JCAMPDX= 5.01
$$ ##ORIGIN= Bruker BioSpin GmbH
$$ ##OWNER= Administrator
$$ $$ E:\/data/COFFEE/nmr/UV1269_M12_1292-1216_90_7414817_RMNKnYd3Fd/10/pdata/1/auditp.txt
$$ ##AUDIT TRAIL=  $$ (NUMBER, WHEN, WHO, WHERE, PROCESS, VERSION, WHAT)
(   1,<2013-01-25 17:42:37.370 -0500>,<Administrator>,<X>,<go>,<TOPSPIN 2.1>,
      <created by zg
	started at 2013-01-25 17:41:30.824 -0500,
	POWCHK enabled, PULCHK disabled,
       configuration hash MD5:
       86 BA 57 50 F2 9D 5C 9B 26 00 A9 28 5F 66 2E 89
       data hash MD5: 64K
       CC B2 64 81 6D 36 4B DB 5D D1 C6 D0 C2 F3 8C 26>)
(   2,<2013-01-25 17:42:40.417 -0500>,<Administrator>,<X>,<proc1d>,<TOPSPIN 2.1>,
      <Start of raw data processing
       efp LB = 0 FT_mod = 6 PKNL = 1 PHC0 = 0 PHC1 = 0 SI = 32K 
       data hash MD5: 32K
       EA 07 BB 87 A4 AE C8 77 EF F8 F7 EA C6 0E 77 01>)
(   3,<2013-01-25 17:42:40.933 -0500>,<Administrator>,<X>,<proc1d>,<TOPSPIN 2.1>,
      <pk PHC0 = 97.86072 PHC1 = 0 
       data hash MD5: 32K
       F6 35 6F A0 18 86 1D D1 44 2A 17 07 EB E4 6B E4>)
(   4,<2013-01-25 17:42:41.230 -0500>,<Administrator>,<X>,<proc1d>,<TOPSPIN 2.1>,
      <abs ABSG = 1 
       data hash MD5: 32K
       B9 F6 F6 C2 19 A8 79 77 3C A7 6B 90 CA 28 75 81>)
(   5,<2013-01-25 17:42:41.386 -0500>,<Administrator>,<X>,<proc1d>,<TOPSPIN 2.1>,
      <abs ABSG = 2 
       data hash MD5: 32K
       48 55 26 5D 69 80 48 5F 77 50 2C 2E 33 F3 55 B6>)
(   6,<2013-01-25 17:42:41.527 -0500>,<Administrator>,<X>,<proc1d>,<TOPSPIN 2.1>,
      <abs ABSG = 3 
       data hash MD5: 32K
       0F EA 32 1B 48 44 2D E1 7A D5 D3 7C 5B 0B 6B 1A>)
(   7,<2013-01-25 17:42:41.683 -0500>,<Administrator>,<X>,<proc1d>,<TOPSPIN 2.1>,
      <abs ABSG = 4 
       data hash MD5: 32K
       4A BF F0 22 42 17 D6 DB 74 A3 36 D3 12 3B A0 65>)
(   8,<2013-01-25 17:42:41.839 -0500>,<Administrator>,<X>,<proc1d>,<TOPSPIN 2.1>,
      <abs ABSG = 5 
       data hash MD5: 32K
       99 F9 50 E0 6D A6 91 16 F4 3E 44 A8 21 9F 05 BE>)
$$ ##END=
$$ 
$$ $$ hash MD5
$$ $$ 29 44 90 18 1A DE 7D 6B 46 DF 2A 6B AA 53 63 B6
##$RELAX= 
##$RELAX= 
##$RELAX= 
##$RELAX= 
##$RELAX= 
##$RELAX= 
##$RELAX= 
$$ Bruker specific parameters
$$ --------------------------
##$DU= <E:\>
##$EXPNO= 10
$$ [...]
150 150 150 150 150 150 150 150
##$TP07= 0
##$TPNAME0= <>
##$TPNAME1= <>
##$TPNAME2= <>
##$TPNAME3= <>
##$TPNAME4= <>
##$TPNAME5= <>
##$TPNAME6= <>
##$TPNAME7= <>
##$TPOAL= (0..7)
0.5 0.5 0.5 0.5 0.5 0.5 0.5 0.5
##$TPOFFS= (0..7)
0 0 0 0 0 0 0 0
##$TUNHIN= 0
##$TUNHOUT= 0
##$TUNXOUT= 0
##$USERA1= <user>
##$USERA2= <user>
##$USERA3= <user>
##$USERA4= <user>
##$USERA5= <user>
##$V9= 5
##$VALIST= <valist>
##$VCLIST= <CCCCCCCCCCCCCCC>
##$VD= 0
##$VDLIST= <DDDDDDDDDDDDDDD>
##$VPLIST= <PPPPPPPPPPPPPPP>
##$VTLIST= <TTTTTTTTTTTTTTT>
##$WBST= 2048
##$WBSW= 25
##$XGAIN= (0..3)
0 0 0 0
##$XL= 0
##$YL= 0
##$YMAX_a= 647685
##$YMIN_a= -552034
##$ZGOPTNS= <>
##$ZL1= 120
##$ZL2= 120
##$ZL3= 120
##$ZL4= 120
##$ABSF1= 14.98509
##$ABSF2= -5.573092
##$ABSG= 5
##$ABSL= 3
##$ALPHA= 0
##$AQORDER= 0
##$ASSFAC= 0
##$ASSFACI= 0
##$ASSFACX= 0
##$ASSWID= 0
##$AUNMP= <proc_prof1d_extract_pilot.lims>
##$AXLEFT= 0
##$AXNAME= <>
##$AXNUC= <1H>
##$AXRIGHT= 0
##$AXTYPE= 0
##$AXUNIT= <>
##$AZFE= 0.1
##$AZFW= 0.1
##$BCFW= 0
##$BC_mod= 0
##$BYTORDP= 0
##$COROFFS= 0
##$CY= 15
##$DATMOD= 1
##$DC= 0
##$DFILT= <>
##$DTYPP= 0
##$F1P= 0
##$F2P= 0
##$FCOR= 0.5
##$FTSIZE= 32768
##$FT_mod= 6
##$GAMMA= 0
##$GB= 0
##$INTBC= 1
##$INTSCL= 1
##$ISEN= 128
##$LB= 0
##$LEV0= 0
##$LPBIN= 0
##$MAXI= 10000
##$MC2= 0
##$MEAN= 0
##$ME_mod= 0
##$MI= 0
##$NCOEF= 0
##$NC_proc= -8
##$NLEV= 6
##$NOISF1= 0
##$NOISF2= 0
##$NSP= 0
##$NTH_PI= 0
##$NZP= 0
##$OFFSET= 14.98509
##$PC= 1
##$PHC0= 97.86072
##$PHC1= 0
##$PH_mod= 1
##$PKNL= yes
##$PPARMOD= 0
##$PPDIAG= 0
##$PPIPTYP= 0
##$PPMPNUM= 2147483647
##$PPRESOL= 1
##$PSCAL= 4
##$PSIGN= 0
##$PYNMP= <proc.py>
##$REVERSE= no
##$SF= 400.02
##$SI= 32768
##$SIGF1= 0
##$SIGF2= 0
##$SINO= 400
##$SIOLD= 32768
##$SPECTYP= <>
##$SREGLST= <1H.CDCl3>
##$SSB= 0
##$STSI= 32768
##$STSR= 0
##$SW_p= 8223.68421052631
##$SYMM= 0
##$S_DEV= 0
##$TDeff= 65536
##$TDoff= 0
##$TI= <>
##$TILT= no
##$TM1= 0
##$TM2= 0
##$TOPLEV= 0
##$USERP1= <user>
##$USERP2= <user>
##$USERP3= <user>
##$USERP4= <user>
##$USERP5= <user>
##$WDW= 1
##$XDIM= 32768
##$YMAX_p= 475326068
##$YMIN_p= -742320
##$CURPLOT= <Network HP LaserJet P1505>
##$CURPRIN= <$Network HP LaserJet P1505>
##$DFORMAT= <normdp>
##$LAYOUT= <+/1D_H.xwp>
##$LFORMAT= <normlp>
##$PFORMAT= <normpl>
##$SURQMSG= 1
$$ End of Bruker specific parameters
$$ ---------------------------------
##NTUPLES= NMR SPECTRUM
##VAR_NAME=  FREQUENCY,     SPECTRUM/REAL,   SPECTRUM/IMAG
##SYMBOL=    X,             R,               I
##VAR_TYPE=  INDEPENDENT,   DEPENDENT,       DEPENDENT
##VAR_FORM=  AFFN,          ASDF,            ASDF
##VAR_DIM=   32768,         32768,           32768
##UNITS=     HZ,            ARBITRARY UNITS, ARBITRARY UNITS
##FACTOR=    0.250966925370066, 1,           1
##FIRST=     8223.43324360094, -3100,        -54680
##LAST=      0,             31069,           -103213
##MIN=       0,             -742320,         0
##MAX=       8223.43324360094, 475326068,    0
$$ Real data points
##PAGE= N=1
##DATA TABLE= (X++(R..R)), XYDATA
$$ [...]
23847 72345 66870 207893 -102453 -33107 -120140 26391 -221035 -247764 160947 -16814 23961
23835 8375 152492 -230426 -263325 -116517 -290131 78115 -25939 -6025 42500 -295078 -157880
23824 -157880 -143037 183641 115226 -261770 -172142 142380 133120 212085 -112496 -4143 6310
23812 61132 -297193 -229 104468 -159962 212671 123520 -38594 164049 -327783 -183900 -1939
23800 211619 4883 -58706 -45257 -295890 150397 119341 311669 498803 120455 -113739
23789 55069 32367 -224092 124009 224604 -163433 39242 350558 40467 131942 136679 126571
23778 126571 -43874 -260782 -397922 -437465 -232683 -149057 361170 103070 -96634 152536
23767 -72591 -32279 247048 160370 60105 -247432 -48892 8333 425389 -193784 197641 72166
23755 -251302 30692 46617 -220769 -102156 101443 -170745 91073 285754 -156411 111673
23744 462665 -57839 -78787 -159562 -91037 -197560 -380037 56472 -188687 423670 46351 56633
23733 56633 -279101 -53859 -40148 248984 60284 -112420 290322 338239 -323572 183053
23722 268909 -104453 82935 10218 220722 206107 -13316 -139823 -177436 -22682 -157930 -197253
23711 -197253 50528 -246767 32113 119193 -120006 -280475 -274096 -65519 90245 -221507 178150
23699 -333011 -77733 -26304 31689 597 -32681 -283059 -213353 -2245 -226088 -241796 -198360 195313
23686 254666 -20008 -111094 -287350 158422 -83028 -107697 -117922 -270111 -295593 59533 216222
23675 216222 55498 50336 135644 171193 -123264 388033 123276 -6068 -71267 -146842 166395
23663 132806 -282480 79621 41568 14791 248720 -132117 15721 -94831 111747 113717 -254631
23651 40853 27632 -336991 106598 192816 140870 7003 -77061 -70574 96119 111367 63876 144855
23639 144855 -280802 -85019 -39755 -131843 -55681 244120 73463 259012 23846 19411 33352
23628 33352 145985 85611 -233784 -268264 214491 -245085 -195129 315132 -51325 120180
23617 142122 143823 -99880 -341668 148213 97687 -391036 93637 203644 45773 -80598 226920
23605 -254659 282500 9621 -410574 -99305 -122076 -244788 195975 -209864 53598 192187
23595 192187 -1853 -157646 -227085 -25424 129371 50784 76055 222425 160297 -6770 -154991
23584 -154991 137777 -21284 -201482 -88327 -135728 56501 55877 56904 -66852 -77236 -6846 -66628
23572 -66628 217312 49997 -199431 -223915 -61465 -153869 151047 418996 -141532 -11781 -118376
23561 -118376 -7428 110228 -86064 114054 148069 28785 -281626 145288 -10381 -244669 -453739
23550 -453739 334804 195096 20184 84773 208568 -154953 -78626 -11428 249932 -2225 262613
23538 -189257 2239 126054 41419 -27630 30795 18506 -12962 -135414 -369123 170519 -101795
23526 189229 -290666 -429352 23826 255907 -169455 -512082 242937 443066 156076 -2654
23515 -253019 -212245 210324 -235144 -63547 -214338 49072 -288178 30778 227389 87867
23504 63032 53387 166139 -18483 16313 -57552 67587 103338 -150172 -363700 -5898 85264
23492 125246 -135649 -26209 -203482 -325072 287871 217585 -132713 -10242 22381 36648
23482 36648 226203 -111914 191026 -153815 106341 6586 68964 74699 270207 -259634 16630
23470 98831 -7032 496586 -123497 -217333 196660 -84758 -110670 -93993 -128190 82203 -14581
23458 -189518 -154975 -96404 -163789 152399 195544 -22892 -53 268334 -106965 70317 116524
23447 116524 -216830 100228 -98896 -16608 -303211 -298008 -44212 12367 -69644 134934 -273197
23435 -37101 -226254 -109036 94091 -40394 -145454 153218 -117073 127888 17108 -29831
23424 370455 55698 43652 -233213 -289494 -137384 -367345 224253 -82655 -238441 41606
23413 64183 -52151 316936 113193 -100335 -39108 125912 -85898 249377 93526 -17091 104199
23401 264693 -15761 198409 277197 111877 -18336 195949 16273 -192725 -318968 190498
23390 -73352 45824 268200 85424 155970 -345768 139533 -3151 -418869 -111798 -83432 21609
23378 102038 -44095 121910 -408485 -26094 -180028 -354900 -79501 30775 -300288 117698
23367 -181195 93939 57131 -23111 99274 -114352 243413 -98620 64943 -43813 -163065 56194
23355 -438079 -195634 -82061 -90774 -62486 54528 -60688 -116992 278857 248386 200290 133192
23344 133192 -160952 -288609 59420 -128690 99515 -347341 78058 61061 117621 -180368
23333 35593 345578 -21701 -174588 -97731 -160323 -158388 -257837 -302190 -38472 -158639 132405
23321 168364 19336 -165929 -155119 -95949 -9502 -594798 -5833 78830 324913 376494 -172370
23309 -331199 -274424 -177532 -112350 -26751 95149 -143016 4284 294266 -207700 130607 -38353
23297 -160544 -258860 -109580 225667 -52926 23665 -222089 -208804 -58241 -318085 -257241 60222
23285 -407208 -28933 346314 -544 -130170 -86432 116582 -81536 -127885 99625 167994 67085
23273 -349582 -199619 -212239 56986 -9660 -200921 -171893 -236881 -153402 -115085 -126452 132418
23261 106094 16255 -173604 -215521 -117931 35513 -77545 -32974 -76899 -61067 -303113 -257868
23250 -257868 -112356 -2501 220135 -149564 211933 -65676 384182 -55732 -215935 67667
23239 -179030 -323770 37166 -34174 123101 301037 -152123 -161545 -418050 -23398 -50656 -278074
23228 -278074 149284 305974 -216515 227248 43468 -18112 110361 30995 270888 -82332
23217 203202 -202947 -185173 82660 10892 -129582 -1461 23759 -114809 -77987 -172415 -7951
23205 265302 184297 -188455 -239684 -228508 -138529 -92647 -61181 -88900 5269 -258968 -398917
23194 -398917 -57264 -296425 136639 111690 -59818 266027 -354672 -62630 27291 -339396
23183 15541 207163 171566 130048 89982 -65383 220756 -28226 -23468 -24130 160917 -46331 489098
23170 132067 68692 171410 -146803 -11002 108889 -27453 -149049 -157902 235021 66695 23873
23158 -215612 -135959 -155452 13433 49727 -84893 43160 -277239 -76958 -13003 62623 142346
23147 142346 223023 232783 -186442 -260374 113827 51709 -142603 -21004 -207611 176649 -305914
23135 227650 48740 236711 -145484 -360257 103428 219742 205066 -267623 293857 -4868
23124 49909 -340536 -132984 397459 142256 18464 -44623 174389 104597 -11758 -37896 -105885
23113 -105885 261282 136296 180410 -286196 -272117 -112106 -157321 -54858 -65118 -39576 -101882
23102 -101882 -138682 -55785 -107818 -120687 102537 174798 -167473 -104233 492651 -272421 15562
23090 169643 241975 33477 4449 -41411 -397686 -217065 5764 172901 67338 -127736 366993
23078 371219 -12285 -139978 -238954 -240514 -37475 -348274 233577 -285622 60134 -245759 343546
23066 305297 179535 -179481 -109023 336515 -177414 54880 -29211 -19186 41058 -6419 217580
23054 187367 45613 -248912 -411228 -29729 -27965 -71758 98652 138331 155645 141335 -60482
23042 -64493 -314066 -22224 -51450 43673 -149905 -127942 -156169 48832 203860 65681 158931
23031 158931 146030 -139940 101490 16283 172402 72994 -268755 -150720 129675 292807
23021 292807 -83192 1867 -59961 233676 -116507 -215606 -155831 -340978 45280 -124733 -23178
23009 41029 63998 170390 -215994 130366 80707 -194054 -38797 249058 -186248 -225636
22999 -225636 -49784 -42273 -274026 -232445 83695 11823 42283 14017 -242941 79184 218652
22988 218652 -268544 -27849 -22019 -180958 -76252 -275384 -303967 19827 223218 50246 -123849
22976 -37885 261790 183435 -66399 135574 25200 54520 -159265 -145246 -211988 -67347 220683
22964 -73806 62301 43971 26622 349244 42205 114695 -193218 -24492 -345176 -232893 -110243
22952 -1418 -106108 -105457 89519 -121254 268975 -32167 -392517 -389763 -299150 -44666 -135871 270687
22939 -360278 -19389 109087 -436333 -7112 86883 -196743 -132498 108733 -83655 -80284 -91784
22928 -91784 193582 -7382 -122690 -10830 -163469 153609 -393340 -168751 -69748 -345009
22918 -345009 -194839 204359 101302 90637 119810 -161238 3657 41080 194389 117222 1574
22906 233666 -13801 -253646 -71240 -68075 -161725 247030 -33026 30052 330197 188628 -132661
22894 343353 -200731 -105260 82289 -178913 34071 -380407 -158227 -96091 -293619 -171512
22884 -171512 -38693 33433 -243266 -147552 35902 -59519 58921 -367362 63584 -117875 -199986
22873 -199986 134098 39407 44169 -143110 78412 -207761 -114399 455742 -67100 -123059 266945
22861 99893 129393 39187 44232 -41925 162225 -128645 -261719 151644 -51084 -95425 -9147
22849 39622 74632 -100933 -435751 2739 384593 112130 104617 2906 13332 1140 161952
22838 161952 153499 -84916 120502 -43261 75686 127139 -36191 -315304 140112 -17679 227849
22826 42392 97171 192543 -223860 103103 -28397 -190194 -155213 7708 167611 -211051 -152194
22815 -152194 -53625 -151694 -44791 16327 -294617 -62022 -369044 -167462 -95407 172643 177845
22804 177845 100444 -122159 -258863 -40874 271106 83523 54016 72663 244010 206806 49605
22792 -214322 63799 -55345 -46954 -158985 -309630 -336077 -264267 108654 31984 97005 275294
22781 275294 -149735 8094 -207403 -144094 -50531 26297 123301 -230286 -187349 403182 -236139
22769 7292 -150426 254330 -148334 27684 106650 59564 28740 203728 -115616 -57709 -497
22757 -58423 3912 -215895 26354 231652 -160086 175291 -182534 -270127 1637 91040 -207839
22745 538163 152957 -445934 -81314 -249061 -172885 -52605 -523890 290024 33227 -362482
22734 109024 99923 110280 190115 -447217 33106 -109547 -303704 157955 171624 168650 -18651
22722 -60581 -575 -155600 -40856 45705 183236 -157918 8773 -21735 19968 7560 -176621 -18296
22709 -71609 16754 253329 101735 157850 -78555 68726 -236038 -406774 -233457 -122813
22699 -122813 17027 56488 104703 -319277 -17469 -228566 -46842 -242262 270148 26548 274127
22688 274127 75788 23114 50428 -105740 248192 95343 -32518 76312 80309 207549 158472
22677 158472 53023 -83521 51192 24744 296058 193966 -11396 -91565 -289894 -66217 260646
22665 -90265 -241357 -82172 -71406 -4265 131837 233521 -242240 -169304 158064 92900 74213
22654 74213 239331 37452 -254832 54382 -352401 -336192 56178 256621 -123623 136189
22643 15932 222637 -8981 50804 31459 60 68021 -349841 331962 132107 -120249 -188863
22632 -188863 -231908 219766 64677 -257448 208995 -113113 24484 -89509 -276379 -37937
22621 -96134 -79146 189641 -47944 -358460 -156864 -20799 -223555 -420389 -154950 -316730
22611 -316730 -136135 -85809 151773 -227655 -30805 -10820 -93407 122503 -224814 -245691
22601 -245691 51056 -137185 -66634 141517 46875 37296 94980 9006 -99451 228823 -147295
22589 -142045 -187702 -54873 -298428 179063 -162767 -26895 -12635 -290253 -29747 -67556 -149167
22578 -149167 -214879 -320306 45958 -7220 -152916 -356383 14137 -172634 -192305 -43402 -237500
22567 -237500 -160138 -143878 -107635 52936 -134729 -140820 193062 32849 -34014 69908 117593
22556 117593 -90451 109490 -28086 -126456 97969 203807 -3657 27532 -113543 -125161 -31024
22544 24170 -50680 98088 -202724 -260466 -16386 22130 -144311 -127507 85916 -71505 35041
22532 417154 24627 60307 38840 -223491 -66034 -271378 88282 7331 123619 2550 273481
22521 273481 138268 -222419 -93879 73086 -133401 204045 -184195 -85314 174319 -47257
22510 -384076 -200388 -53324 222201 146430 -31546 -233032 23684 154008 100528 132375 -11898
22498 16805 51698 -249480 -2985 -57963 -227897 16769 19827 -207837 63307 308273 168864
22487 168864 268333 6129 -13658 27754 48973 117016 369619 77121 -151158 53750 -358482
22475 -317473 -143403 110343 98237 -3595 -178086 -45121 -91533 -294575 60409 47347 -227072
22463 112621 23789 -75685 -22921 230558 150626 108796 189164 111100 -175979 -100956 -111860
22452 -111860 -8418 285627 258250 144882 -44371 26888 187170 -97413 44380 49811 -43514
22440 -307291 -8150 16287 112333 50719 187367 -249769 1169 85910 41621 -270953 -325237
22429 -325237 209416 192291 -133254 -491855 -196638 -215221 -76186 287142 28643 -326487
22418 61676 84748 -151783 174295 -205242 46848 66131 -153618 26114 96609 -2185 244390
22406 109221 144348 63555 -344761 55178 88688 8253 14581 37105 -106273 -479040 -73335
22394 49682 -101536 296126 -42385 107318 -193909 -221009 -47022 -221219 -294214 -97796 -184254
22383 -184254 -162053 -88820 -292782 -370950 33215 -306235 -38189 123932 -156690 -185854 22566
22371 64869 219555 264375 -225883 -67609 72705 66509 -19562 -201461 99119 221601 -34458
22359 -2888 -52504 -46691 -136996 427614 -85005 -185049 -82192 224532 353811 -45253 -246467
22348 -246467 -108796 -132185 694 113701 -414574 -109105 112571 187342 -172170 -67693 329352
22336 -119575 176801 -46453 223770 -470845 -192805 -298970 -63659 8759 -2023 -29550 27572
22324 13196 126124 -47696 52323 -193535 145849 -184458 -66902 -29231 276036 -95668 -22134
22312 -13969 28374 53005 -244343 -48864 8017 103552 -250657 -71166 -257142 16083 126861
22301 126861 -65238 294840 40609 50617 -188599 103245 -65877 -134703 57872 166795 153599
22290 153599 216163 209619 -400052 -48517 -68126 269875 -242405 91672 16606 7106 100892
22279 100892 -119196 124902 50304 34679 44630 -100782 -192496 -52174 -432229 -159616 -342824
22268 -342824 202036 -156777 184882 -90048 20359 43089 -231149 107136 -202636 151081
22257 366039 101151 137531 -252276 -277519 256287 135317 -190841 69618 -76764 -97698
22247 -97698 -41435 -99061 -256992 23806 60867 24250 -115887 -169349 -96333 42149 -203069
22235 -109955 -54756 50881 488955 23222 -240423 -113234 81449 -38320 -3276 42887 -169731
22223 -378204 -168127 -39919 451361 68 -20624 -176657 -198465 4629 210159 -232424 -79291
22211 -149872 -103525 180638 -301863 249728 12630 -38384 -188426 74157 -385293 92438
22200 -180636 67891 -92557 -19617 -58995 27261 -199651 -9566 -173014 224832 119058 32696
22188 53124 117485 48455 262982 -407363 227450 -146989 -55944 240244 82448 -309813
22177 56398 142124 -118594 -6449 -36011 6089 184531 -54371 66760 217937 -50250 -211811
22166 -211811 -179857 178187 222267 -252961 -323278 21942 -825 19084 -396841 -106909 -39079
22154 110274 -76927 -7070 97372 100913 7073 -193456 -115970 99814 -83253 -219975 -40560 -375272
22142 -375272 228935 -521224 159685 254238 -138048 57678 -121230 -58516 30744 -93320
22131 420460 14555 78291 -155415 -139024 -207886 102766 -132153 15775 16985 -80425 -112969
22120 -112969 11705 -93287 61832 -110164 66274 10676 -163553 -76849 -74318 -13183 15882
22108 -34924 159526 275951 -35918 -247601 -332870 343160 -78830 243132 -29214 -43882 -224130
22097 -224130 198747 235501 -228538 -253784 1908 46687 144986 86459 134302 -49990 82314
22085 25691 38166 21895 -110289 238991 186966 -421943 -49006 215020 -334020 -127575
22074 -409962 114108 -586012 27721 -106412 42039 -7960 -188176 48546 -590773 -95874 -4645
22062 370328 -309648 139926 -168996 350734 203401 -29340 82615 247311 -51080 -136751
22052 -136751 273351 -264613 182983 -281951 198935 -251844 172448 76721 -311004 -143007
22041 -129618 85700 -245526 139233 -290390 14512 -378994 316502 -194729 221363 -8777
22030 -109581 -55914 79630 164443 -186437 153643 -99634 -321231 83785 308941 74269 -394556
22018 -105220 33510 -120701 67032 -100858 23081 -92079 -255235 206479 -67305 -178217
22008 -178217 -186 -445704 -38124 -32694 -70423 225550 -113916 128517 -134716 -162964 80990
21996 47671 69501 54688 292265 -128182 -397727 -91108 132173 181884 28084 -121767 16097
21984 111318 -121733 101881 -198365 114704 60875 115048 126644 4236 -339337 -353842 71334
21972 71020 -40541 -59453 -16606 -56174 -237877 -34611 -369084 19046 145612 64648 204344
21961 204344 -160943 10092 -226966 -154318 -14994 -15185 89110 -327797 6946 -54858 -405732
21950 -405732 -206453 102304 150356 -438741 -369664 -324481 -43831 -119077 70725 -25581 -288130
21939 -288130 -157714 143048 56024 52428 -334283 302548 -244581 78174 104906 -91921 -13411
21927 -471981 -26306 105109 -14485 -209694 -475168 195985 1507 -27800 -228491 93349 86734
21916 86734 272438 55268 253514 -247519 265983 66918 -270031 162217 129984 81334
21906 81334 14400 116665 66679 -184820 -27842 11608 130327 -247705 60224 -44317 -178021
21895 -178021 74850 74680 -121636 -192050 -167144 -125475 -94068 -417576 -396493 -259643 -37551
21883 -96128 -385982 -57563 26734 -252043 85875 169612 -58381 -81673 215272 -193166 -82322
21871 -50212 78300 27297 -6386 5197 -16798 2482 292715 79551 -30422 151386 -20406 -222784
21859 -222784 -80967 -123944 173334 107087 -133061 268007 -208018 46862 -83710 -76021 -10942
21847 -65921 -197622 -27199 84298 -9957 81939 107932 -38585 -13887 -418792 103742 -130708
21835 262187 -42773 153273 31138 -147119 1281 -367150 196219 164508 -191944 -127899 -145031
21824 -145031 -260725 -155173 28329 -303445 -15502 -372280 -85258 -300392 -348668 -67903
21813 26230 -209168 -229674 350300 210108 -271610 269984 25385 31489 -198901 -326840
21803 -326840 -297933 52063 -273107 65958 302986 -91309 -50003 -242991 -250 329120 141879
21791 -36751 371776 -267119 76787 -45144 -113397 14427 19172 -123964 169341 -28208 -285480
21780 -285480 185205 -59164 24557 -22284 138796 13263 40341 -94170 -76264 306578 323405
21769 323405 262752 275977 2683 -31913 -126526 194347 82351 179199 268609 158676 90606
21758 90606 -167235 -233646 -221582 -332344 -47234 -5719 -40862 -174223 40117 171978 204358
21747 204358 -122524 -12802 155731 252188 -158369 -108300 -203880 -248439 -301344 -156484 -188037
21736 -188037 -158996 218026 8989 -275724 -10245 89053 217698 -272689 110326 108982 276401
21725 276401 -205800 386418 -41000 -285853 -233664 -207226 166732 265748 -190546 143067
21714 -49575 55534 129991 38547 223322 161830 -93950 199471 -239229 134928 120799 100070
21703 100070 115356 206460 -172809 55468 -152660 79204 -24684 -13782 -138447 50969 183281
21692 183281 -227387 18275 -299712 62873 -158660 153159 -75865 -140065 174257 -370606
21681 -379336 -72684 114510 -9205 -203183 -55900 26285 223267 26333 -262279 -54898 -114469
21670 -114469 -85180 -3855 -90 -30185 -229703 -294104 28839 -3990 91829 419341 138768 -212891
21657 17145 34530 12046 42397 -84978 -103756 424980 -351274 -12421 -162205 64833 -293921
21645 121521 -214179 231782 -14309 -10678 -171908 -106304 -108918 50407 -90635 -257649 7115
21633 -47300 -7122 -219672 -50576 -367228 -11336 5194 115656 97511 -99444 102576 182644
21622 182644 -87509 -102002 173736 129195 -40572 -185336 -293967 -52468 64673 -245883 -63741
21610 -3644 111763 -493219 297688 35513 77208 -264420 208081 29921 -23550 -119182 -503608
21599 -503608 -119499 369493 -204807 -257507 -39258 -59469 115944 -132642 -185171 125164
21588 -231716 -161019 110917 -285149 160988 -184636 -7451 -37037 150324 -459308 294158
21577 150708 63990 12187 -189541 -107611 -134009 -450043 -26913 -134249 -151954 -162315 313172
21565 -188599 -1180 -228274 134062 291557 -54658 -69531 88467 -226582 82778 -25627 104
21553 -17864 -14151 24552 -34009 -236525 -300166 -17191 142519 -62927 -170606 -201462 -175896
21542 -175896 74443 86430 133192 -85632 -79750 56143 -359040 -118849 -223979 11625 -63376
21530 -196849 113855 -93384 -94609 24091 -279431 -224481 -94232 168383 -9887 -299208 -73562
21518 18295 44596 244308 306035 -212472 -179667 -215007 -12469 -45775 -77632 13902 45931
21507 45931 -21106 -157397 103947 -57076 44748 -289894 26387 -73368 144518 -190968 342125
21495 -44148 -270627 105958 66796 43168 312905 102789 123227 19259 -150924 178909
21484 -227625 -126318 -245040 -34839 -221406 300500 -39181 50015 -230065 22747 -6033 -181489
21473 -181489 58494 -38267 -264090 -93531 -67685 -166512 51769 -8471 -50619 292345 -44743
21461 -72586 -285237 -335574 -19604 80212 -149755 97550 -21851 -2863 -92441 26768 -259694
21449 16178 -84820 287596 -221216 117912 196795 -243298 -17193 277060 -49633 13024 241193
21438 241193 -50685 185572 529792 485427 295218 299151 274561 -134373 428000 33688 -293036
21426 49755 62862 15281 -153504 -84943 -7864 -43599 -167451 112574 45284 -233192 130849
21414 39577 31805 83727 -104925 -333896 -401285 137465 40645 -131878 -85480 -121931 154197
21402 106589 -174055 -375259 -131079 147590 -244882 -99167 -434859 338472 -107829 -77284
21392 -77284 5315 -113634 194354 -186452 -357361 -35243 -234368 104000 127555 -207572
21381 174531 134513 -300749 -404090 -321212 -106579 259533 80263 -352114 73060 -138076
21370 -189366 -54912 113792 -341621 147261 -58940 -287870 23462 -60704 -260665 66642
21359 92774 121653 -20295 -152828 -75604 -158058 -111010 -140668 84229 -300999 359429 -117148
21347 216272 -322635 -210179 238263 -186658 38323 -119970 -217134 -302886 -133599 11703
21336 -42338 202023 17973 89599 -124247 -138981 -116034 124154 -83854 77260 -277 -66964
21325 -66964 150755 -94617 -233281 -146121 278419 197640 -200158 -571 132402 208963 -60857
21313 115910 85159 -187439 -30602 292638 155775 112930 203097 -163577 -270464 9465 -210947
21301 -75195 -294071 -117555 -141953 349075 -192383 198697 57423 -219501 -554517 -257518
21290 -69648 -112902 -207679 -45115 -62016 -65788 317609 -328444 154227 87200 -36050 -178888
21279 -178888 54872 -128002 -30636 -37556 -58507 -306137 -212256 -154043 141 49374 75109 -142026
21266 -53080 181873 17794 -160571 220944 224793 -2057 -43931 -276647 -439025 -433631 39491
21254 -29937 -175149 -350269 -54491 59527 20030 -117845 -78498 -174858 -71972 -104350 -147487
21243 -147487 225288 268607 -207739 -112776 -242066 -193340 109747 303437 -172623 49817
21232 292088 22159 -159369 -107287 -242597 432489 -147480 -269988 155420 15622 57887
21222 57887 -89670 57342 46522 65196 -306923 72221 -124498 -30276 5716 -140278 22200
21210 -81928 -66422 136882 61885 322331 -89226 80683 185043 -175539 -173683 -227243 -334060
21199 -334060 -60403 189202 -92326 -110739 -111138 17722 -173684 136335 -50829 -208823 2538
21187 -106121 195282 -81289 -102440 -96247 51751 -80966 -54702 -61637 -167276 -151588 -226396
21176 -226396 -569964 -126434 54522 -94137 -89197 -231110 216458 87583 -82284 -46818 48948
21164 5936 -430702 -82359 -161157 -165323 130781 374656 73444 29751 6234 -61432 -78836 -94259
21152 -94259 52427 339103 -182633 -57524 -185054 -42322 106936 -93982 -143792 10607 -96420
21140 -508767 52375 -45756 -132808 44984 -56004 30651 -267756 370653 19924 -140090 367838
21128 205233 -154140 144350 -31782 10323 -31861 -37758 -141032 -39187 -105682 195226 -111453
21116 -111909 -327156 -207482 -26031 13442 -72388 147151 -75156 -43285 109568 162911 -122507
21104 219833 68910 49437 -133040 -652506 -132792 -94063 -110929 41274 -17643 -65660 -121767
21093 -121767 81241 -154244 -465967 -218739 24319 -93493 -45843 -220346 -384541 22463
21082 125749 -108518 -157869 70579 -186798 28166 -52297 -122387 71675 -100149 -220279 -6455
21070 -90775 -283424 -341985 163394 -164367 -34394 -12968 -84739 -238221 -187328 92859 82427
21059 82427 -6565 -87006 -49782 123852 314039 74531 -110614 105252 -26665 133026 40380
21047 -185803 -268111 64382 -119066 173502 35022 93514 92433 -361364 -50610 -249834 41376
21035 -165716 -209358 94044 -277511 84829 229081 148438 -3049 91239 -139236 -47649 -26647
21024 -26647 -4074 -26556 -70562 -3331 2905 -273812 -164995 140420 58550 -309874 -53201
21012 -191756 179089 -414667 -170671 -441327 258297 195999 -267828 30992 -168913 161627
21001 263649 -130743 -225601 32066 79483 85202 -34725 -365329 222296 -155148 242926 -41564
20989 -351455 -120128 -52673 92276 -121333 -299888 -153821 32678 -461107 -218409 198448
20978 -25351 95930 300000 -120356 39019 -26020 176238 147601 188203 324902 118354 188839
20967 188839 -311944 -231211 -73415 -100383 11966 -34842 30806 -200031 168824 120472 -205278
20955 -89929 -22458 -116533 -74213 -8688 -363665 -19212 81137 94730 -347875 7416 24624 -241718
20942 -3025 41945 -76558 203459 39669 -264279 24084 2488 -86469 -30811 129238 203551
20931 203551 -16379 -115448 -93028 148358 -76285 195613 182356 554186 46954 30637 77549
20920 77549 4869 336876 174641 89777 -109624 -242399 -57287 -110960 19079 317837 114605
20908 -178519 -148082 -68146 155388 159585 34382 42667 -6085 -130851 97166 205555 -227470
20896 66388 -124701 -253638 58634 125154 45804 -8570 -259976 26347 -187079 147272 -217719
20884 -75469 -270039 -72012 112140 130286 306834 -462872 282166 -135748 -15075 -10533 -9913
20873 -9913 -136775 -96332 171086 -47742 61807 -76384 -87829 345319 -177273 -129678 -195275
20862 -195275 -232350 119583 56146 107669 171433 122013 -75564 -443724 -100172 14059 -31591
20850 103144 -136402 -205625 -277419 91395 19057 15261 31666 61701 179145 -235910 -94659
20838 87908 208946 -153330 -144529 58066 -6879 -21882 -174340 -245884 43767 -155291 -73063
20826 -136718 -107991 -269583 -210203 130844 76689 -198069 79526 -113933 113452 -189878
20815 -24560 126171 -61892 56120 -126190 -140685 235072 -230112 269719 181231 -11141 112051
20803 121142 51861 467570 -521291 -132447 -90152 -119049 -252479 -126565 -49100 -424713
20793 -424713 20123 -156178 126120 -132990 160235 81569 -101610 -21971 -36047 115884
20782 -69408 -209602 15463 -36726 -324419 20912 77381 -115237 41750 -153007 -160237 -27177
20770 153963 -124700 133333 131228 -188573 -70043 -409218 -259689 106362 8684 -441185
20759 -99596 -201268 -130826 -68829 -290480 -42240 123046 -33675 -119365 129794 183916 -231743
20747 -137794 -104289 -918 85726 -208070 -69492 -49716 -23190 115883 -183451 -121936 13210
20735 -79728 115826 -154190 -108036 58302 126582 -88869 -218587 19721 205031 -153631 -103841
20724 -103841 -102931 157302 13710 -202167 -277315 40147 136396 -210866 -230678 -85414 180851
20712 -38295 187713 -242413 -243814 154287 34153 168186 -284122 -280242 -49216 60758 213455
20701 213455 -40971 -48320 -285015 3758 -188626 -314742 67833 -218853 297362 177203 -219687
20689 51853 -26062 200770 -178000 13410 240020 -165879 30329 -191851 -270361 119008
20678 -256614 -205790 116465 215114 -201870 16012 88361 225109 -92194 -35386 -281023 -157671
20667 -157671 187144 -66370 -126651 -150023 -98425 -155989 -145209 -370941 -136657 -25629 -238395
20656 -238395 -169798 102527 104827 -121006 -373723 -59520 53652 149016 -104208 -24897 -55225
20645 -55225 -140072 -304885 29842 3093 -231617 155057 -63728 45312 175710 -213154 -150043
20634 -150043 105905 -124568 -89273 193374 363039 -366053 -97416 -86363 -95961 -15134 -211970
20623 -211970 20141 148451 -390841 167549 -136601 224092 192766 92462 28972 139783
20613 139783 -97034 17863 94537 -18460 194115 105736 -415915 75685 -210322 201022 21986
20601 -327067 121956 -29856 97518 254292 -231105 -162676 165897 -25801 40234 -182600
20590 -262922 -169569 139976 157180 138544 -131178 18321 22884 -11 -223508 103083 -78415
20578 70800 34062 -115578 160799 -321663 3888 -100577 -77626 -83861 265697 260693 67778
20566 -128888 269929 31998 -65866 182130 96259 43470 -196934 31458 30239 -163906 -19734
20554 -58660 233148 -72587 119064 -97373 -263045 11687 241499 -103263 -50852 -146328 -213257
20543 -213257 105899 -344273 -192537 144517 -134377 -156521 234149 310894 -109798 -87634
20533 -87634 -1115 -24588 212383 -80641 -327591 30288 -66218 53007 87274 -131092 -335508
20522 -335508 -21771 -234413 -104255 129813 29503 -247956 -5648 79437 -123166 320178
20511 -263313 94565 284131 23292 41598 249577 -125036 -99247 -222977 -94041 -153561 -137537
20500 -137537 -380983 -354571 106947 -22588 -99855 -127146 -83357 -10756 -436711 -261607 -97703
20488 -226999 69598 -348272 213550 -399858 -127917 -146702 41474 -393109 -61489 221483
20477 -278096 275347 99709 -91512 -41761 -160606 -271427 -251481 306638 97648 -62603 -99899
20466 -99899 -9295 57268 -383261 -228697 48319 508049 -104522 78166 -257535 74946 22158
20454 138246 402118 -26833 27059 62268 -153728 -161164 -329063 -15119 -34130 -189953 -225070
20443 -225070 -187413 184672 -11366 -103018 14550 -104039 788 -100101 -83852 -79462 148956
20431 -113796 -187425 26769 -224632 -304342 466358 -254694 252305 46144 -355564 121707
20420 -193293 -54893 -6986 -288087 -347855 -295130 -154753 104849 -183561 -105497 -116249 -190472
20409 -190472 -109071 217395 47748 -147747 -620470 12767 -179747 -160536 3686 -282973 -60381
20397 248555 -29750 -37822 -2202 -116658 -29377 -239164 70063 -406979 15338 38465 -208457
20385 -229772 73089 125752 -81363 -91779 -56595 52282 39067 -198574 -93895 -130360 -108260
20374 -108260 -82534 152752 -126028 135508 286439 79706 74091 -264266 -146201 138433
20363 -80639 117326 107995 -107441 -7250 57565 -27997 76687 -381319 48541 -138348 -168007
20352 -168007 -57041 -240487 57683 -143200 225003 -4355 367504 -136011 19690 -75519 2354
20340 45020 35243 -67990 201518 -283358 -100697 -161249 64471 104556 -135755 -233305 -79179
20328 177958 258541 -275754 -70865 22725 -19921 18456 -94992 -101294 -185834 -71266 -160757
20317 -160757 -123566 173410 -337084 -306574 -235141 856 94494 40678 -175878 -116425 99001
20305 -197941 -28994 -113799 45660 -115802 -326113 -73756 -37132 -39733 -155471 -35572 -16000
20293 -160200 -47726 -191650 -238768 167814 -339531 -165400 -238819 390158 -15275 -68931
20283 -68931 233418 150022 -414730 -28399 23227 -26720 -274227 -281145 208530 48377 -18717
20271 -23872 -73902 72569 174141 -50213 87248 86693 39456 -29291 10542 50846 -123216 86477
20258 -152535 -123157 66845 330132 -386855 -199593 -186178 -8999 189297 99230 -296305 -139080
20246 -55405 -118534 38715 -101466 127128 24966 -64876 -137197 -62342 -29770 -388948 89721
20234 -37426 46365 -252749 -16639 85334 180289 38425 26403 181689 159068 -90077 -75446
20223 -75446 319326 124404 -186419 -289593 333874 140948 112322 -148157 98713 -69766
20212 25193 270478 -92801 -35424 -63083 11013 -19449 49648 -244023 54491 277155 4131
20200 -334050 497242 -50444 57910 174230 -25610 -30016 -18234 7227 92063 130029 142473
20189 142473 -67929 103145 -210666 -69063 62355 -76091 -32242 -372540 -204875 77262 -87690
20177 -366 149764 -79673 -73001 -43624 99098 -326354 -43340 13859 -12454 -208516 -166389 -14583
20164 -261733 -126810 -106983 88988 -47011 317626 101060 -38988 33721 -163336 -116563 -163742
20153 -163742 424487 58335 -135113 100927 246304 65007 410434 -377830 -49077 -208904
20143 -208904 -30855 60795 269550 -149824 -69373 -175364 -229723 -61081 177990 20221 -33838
20131 -129212 25620 256812 300233 -244798 -151973 -173962 -169857 166547 -334822 33804 -109364
20119 -25413 49056 -263767 -41959 -42332 -208707 766 -141982 200681 -211045 30928 -61992
20107 170967 -200967 32483 -149719 -105282 -182704 -286970 50254 -112389 -316393 195705
20096 -269750 -326830 2846 -11466 -283205 -116593 166711 -42024 275029 -157106 -104889 -11639
20084 -360408 -77915 -141144 -37816 -43587 -77332 -187319 -45021 140337 -207636 95686 55730
20073 55730 170542 -88101 64831 68328 -156495 -152434 -69469 -183945 43517 -100676 19920
20061 310238 -203736 -266310 67437 -32114 -61398 -149330 -51761 -192836 557154 -198942 -111170
20050 -111170 -169343 168552 -170583 -74450 -376571 -146436 -74661 28542 -52162 -214591
20040 -214591 -199918 -97976 332688 -296533 -85357 14587 -428586 -43548 -51661 -135572 8794
20028 -72801 -176143 97954 -221084 -61967 10994 -224334 103744 -149808 -184282 -104168 356989
20016 102390 -203554 189353 239897 -184098 -276031 42322 -57615 -236980 -33436 148065
20005 248921 40537 -427759 -220865 63422 -110376 69116 47959 -111975 -197883 -332135
19995 -332135 78535 -209372 -67170 163025 -247525 -245966 -209278 -156068 76332 267611 15229
19983 -80178 -368708 222508 99298 146968 -71500 84289 -115491 -178487 405737 -104222 350804
19971 276507 -275543 -87609 -414365 -190478 69782 -295035 177681 -169367 5090 -114252
19960 8908 -124897 118723 -173148 50992 109541 -298875 -119149 -296925 -31304 -212717
19950 -212717 -44245 60957 217757 33931 -46518 -33428 -381147 170803 -145658 -283139
19940 -283139 -120829 -211257 120200 -340062 -100839 8353 -180086 79355 -196052 342775
19929 -39737 -71787 -59240 -293553 22562 9708 22802 78075 195854 48138 166580 -93504
19917 -182435 1708 158898 -201762 -270710 138316 -4539 -102159 20225 36863 -102857 -10454
19905 -193899 -53919 29146 -107243 -494593 -129563 138217 138865 -41424 -208288 -172489 74564
19893 -337599 -131213 -186081 -125392 55722 -84780 -132293 360220 -176730 -119026 -363241 -232124
19882 -232124 107070 -90269 411850 40184 245923 -33959 -209634 50666 16224 123231
19872 123231 -190008 -197659 89750 -170016 -239589 -371248 232076 -92807 -19263 -66367 -118377
19861 -118377 -23368 -271125 -50467 41910 -162331 298676 145040 -27865 -210008 -72017
19850 -48176 -60397 -368171 -316160 66089 242389 -56806 -208744 142928 -169402 -5900 358955
19838 -81472 274235 -187821 -22220 -60280 -90547 -130725 -1120 -285941 7300 -145473 -50450
19826 -125611 -164259 153984 67084 25768 -135737 -82722 -189341 -21968 57353 204179 -243460
19814 -9843 -25015 26688 -345232 104834 38964 295912 -152158 -283841 -100591 36245 7965
19802 -113269 263089 -13725 -340642 -230731 -107242 -175905 -274474 169228 99421 -154288
19791 223922 -228067 61540 -129517 -145418 -293737 -90891 -463785 -102681 -15097 6448 -98503
19779 205768 -237491 -341945 12466 324433 223243 153752 -165293 -28993 -84798 -296275
19769 -296275 60271 222872 23509 -60240 172192 -108561 -50050 -135227 398129 204262
19759 204262 -113520 22879 263469 5351 30404 -309375 93277 13551 232891 -24434 -213429
19748 -213429 -178037 226851 -334321 -28561 -228111 292008 -40710 389888 14546 -20628
19737 109294 56439 -899 23019 -189546 47643 -263627 83026 -104261 -227961 -154930 -189974
19726 -189974 83931 -277296 270354 74511 -56312 -110994 68069 -38655 166391 50012 184853
19715 184853 -277672 -290198 -78695 -253700 25764 -269314 -81741 -34543 3171 -119877 -540085
19704 -540085 68695 -59600 253217 -146538 105791 -21927 -174307 411838 94667 354456
19694 354456 -195613 -244470 70711 -132423 -180466 -84432 -149369 126414 277265 21314 -131424
19682 -81913 -14689 -75933 -182606 187516 -279362 -109693 -127387 -46410 38485 -88383 201752
19670 -176204 -397588 110364 -113680 -53923 -188012 -67003 -190946 52069 354353 -114880
19659 137048 43617 110248 358993 -31001 -320013 -358324 -103287 140626 88438 315499
19649 315499 -127820 -111638 -117610 12914 -183668 -37101 -12716 -481891 -305047 164673 -7365
19637 34867 -332081 5583 -283266 -75704 -242783 -323909 -59349 -237079 -307628 -304112 -143846
19625 162388 52064 9454 -119067 -27257 77072 -158458 34928 -66768 21756 -202755 22993
19613 -255739 49884 -375483 -184108 139752 -311033 -254059 4314 22975 -97556 -1978 -103158
19602 -103158 86757 -42845 -21551 -196109 -133715 -393242 -346790 -73215 -71982 -172509 139164
19590 13491 -119901 -191764 -52647 183667 -495775 19198 57005 259579 -126751 -127215 -231207
19579 -231207 -85449 -127336 125226 -206808 251756 -120169 -33716 109864 101259 -2505 -212068
19568 -212068 151628 11052 148267 -47195 -312272 -45267 111748 282904 11904 145260
19558 145260 -50782 56103 116314 -137389 15284 -145124 196160 347600 -22840 -153354
19548 -153354 -309257 16924 -4687 -60507 140209 65401 -42357 -221491 -78627 -258121 105769
19536 -345064 -100551 -161738 231875 -149870 119126 101144 -546775 -292550 147774 -252879
19525 -309677 -46650 146447 -341986 -4240 276034 -55261 37706 -62219 -134704 281389 -40772
19513 262126 376129 303310 -46200 -349928 -111837 53734 -399434 -69134 -66892 -27306 -284405
19502 -284405 45542 -37712 73080 61512 -92649 64015 322209 95778 130909 23845 -50569
19490 -46479 -30223 -3498 -267113 -126480 -130477 122290 -9583 163070 189407 39980 194906
19479 194906 81202 -154704 54385 81618 -346030 -174825 -94548 -131244 229748 70734 185974
19468 185974 -135101 147661 -140793 75740 -262249 205975 -149224 108139 -185771 -169877
19458 -169877 157891 53589 55810 292852 -226841 -156185 174831 -210759 157937 -351461
19447 29052 -172520 -93870 -153243 -132299 38722 -24433 -14377 -273710 -3257 -33721 -254655
19436 -254655 -175953 199761 -24380 -64829 94641 142695 5377 -383740 -94428 -114917 -179614
19425 -179614 17016 -125250 -240724 186957 -72835 196224 -458568 134971 68677 -717 70064
19413 -256941 -229122 -272861 -215339 -11673 -111624 63259 -112608 250221 -63385 -89392 -78395
19402 -78395 -187371 -36824 -247038 -193078 1077 -275715 -284248 -248577 -178526 -179131 -121761 -284427
19390 -284427 59552 -281332 84206 -33631 -24291 -158916 24584 -292481 -15809 -300173 145373
19378 202598 149550 66903 -226248 -117002 246991 -186462 158709 -341585 -273387 51324
19367 -129032 91695 -218065 20138 -57431 256731 -41039 -11263 27622 -270017 67053 -305888
19355 115900 119767 -76127 -177332 105047 -270000 -59668 54319 191671 -138172 144908
19344 1383 -233417 -233841 -9685 -201937 73066 -58940 302499 -447849 -157090 83631 -198936
19332 138847 -304472 181264 -110850 -158512 59297 16075 202533 -113752 63253 -156849
19321 -159039 -452426 283737 -168455 -17175 -79114 -164007 -247941 181591 60224 -337693
19310 116434 144559 -92092 -65925 179411 -42436 -552556 -87269 98477 45252 -418053 -442775
19299 -442775 28045 -313321 -320225 60226 -111604 -193437 -119699 -5779 -192731 7326 -288038
19287 51529 -66942 35862 -153198 -457020 -983 148373 -49986 63973 -351813 -99361 35029
19275 -281499 -5209 144290 -53801 20752 -29716 -219328 -55465 -203932 217477 51517 -19305
19263 -90174 166799 -230175 87572 405183 -142565 -161918 -228600 24802 95712 96771 -292238
19251 -206334 385942 -213058 63632 -114839 -70071 170671 -237989 -161706 50116 -12643
19240 -177350 -90620 -63374 -170973 35627 -60403 -254112 -40384 430745 206294 -86414 -51340
19229 -51340 -288675 -154588 127012 -136244 226529 67709 -224036 -223555 -210689 138699 -206263
19217 -124601 -317401 -27717 66525 -77399 -194456 -164518 87175 -235723 324005 -73127 1297
19205 -166364 -100613 2610 -356845 -24232 24408 -38706 -40087 -135899 341431 -412819 -126315
19193 -212425 -75907 23763 -12689 -93271 177740 134546 -130475 -254069 67594 6285 47382
19182 47382 -303947 -317665 125864 93841 282465 -327094 -438614 -27798 221365 -65496
19171 -193079 -155582 -86728 -25993 -226466 108270 208210 -79160 8525 -182560 230033 -251814
19159 -150359 173640 -47589 172895 -335380 -165563 -104402 568 -95808 301196 -8993 -171998
19148 -171998 -135945 -33163 270155 107366 -15871 -13336 34767 55816 -162458 298561 -291308
19136 -29477 -207723 313375 33345 -77195 190084 -3089 -28369 55518 -258225 49990 20721
19124 -37705 2729 -6585 -130544 23172 -19268 -62686 177042 503050 -242296 173134 118216
19113 118216 -119683 -48919 -268147 -75284 -66021 49980 149300 7164 343236 -261144 -364772
19102 -364772 -177498 132207 -99515 -175102 -129414 -35431 134674 69624 -20553 -104718 -50675
19090 -214646 -128460 -195828 -234497 -38201 -54797 31202 11712 -94982 -234868 86900 172132
19079 172132 -121863 -57033 -160494 -172070 182671 -251365 -65871 34048 -266446 -53480
19068 -540075 250618 186153 -13499 -238895 98359 77884 -113597 164345 -285208 -74345
19057 99000 -182637 95169 138770 -165856 -8693 82752 42601 -85386 -8098 80515 -358179
19045 149128 -334516 312208 -160604 -267825 -86022 -385660 188083 -111604 -184939 66961
19034 -20272 209974 285033 -168298 184439 100300 -52172 -158578 -96115 369725 90011 -114244
19022 210464 -26531 -94503 -178106 43699 25461 -174922 -98223 -409493 64982 -49491 885
19010 -81516 190940 -128770 -480059 -75677 -379865 142199 -51288 6405 -212397 -63113 148045
18998 -103883 107284 -88344 102177 179888 54207 -220076 -47683 -458048 -9761 62405 144564
18987 144564 -26422 -197920 25649 -114431 306897 -217506 -137327 126239 -96147 81732
18976 -74195 -125429 -109479 -15748 -257886 -134533 -323860 -521690 78961 49620 151945 95916
18965 95916 95982 -150777 -109644 -121114 -86530 93660 115162 -321169 -4435 -433840 166031 24953
18952 74567 -441907 -52811 -137920 -93274 -117731 -465935 -103603 -36978 -84852 -217633 -89043
18940 -116919 -35951 143942 -46942 -13397 -34310 70307 -49814 -22985 435280 -243526 -181416
18929 -181416 70235 -20362 112473 285827 144002 73840 -73244 62654 436987 -70397 152617
18917 85989 65838 -397440 -112630 -89810 -117257 4446 -208062 232908 22245 -67778 -53873
18906 -53873 -129921 6463 -244409 -180759 -171845 -205608 -32638 -171374 80290 6013 11326 -310832
18893 -166049 -588754 -391125 1986 -277077 -193978 127233 -268061 -90982 -109934 61519 9735
18881 24047 -62737 -87186 -184296 -38565 146608 -381824 131262 223916 311337 -48354 -81253
18870 -81253 -53762 -78139 147074 71116 -119691 -209717 -88700 46324 87396 319052 202072
18859 202072 18375 205401 -99548 39501 -15168 -186884 -32182 -290676 -222075 -134507 234265
18847 -43793 73567 -18702 85834 24907 -180021 -18427 203075 24746 -118266 12808 36251
18836 36251 167909 -206837 19588 -28268 -35040 -59449 -539631 -265520 315145 -80987 99480
18824 -180553 271816 269205 -4082 87286 -36709 -268507 -174570 81016 -111025 155497 278064
18813 278064 -58833 107968 -265261 95090 -201487 -189964 -353787 77550 -128926 168232
18802 -87545 100800 78198 1157 -186365 114244 -127317 23403 -287321 368553 32424 -8194
18790 -328333 107260 -19512 -162938 143685 -105312 90474 40965 -94426 111375 -103935
18779 -273414 -86176 24884 -51852 -66169 -269103 -53909 116173 -103300 -47945 -164968 -56358
18767 -371676 92962 150184 -54099 49816 113714 167117 -203220 79733 160495 -282380 -263605
18756 -263605 -62205 94220 -75802 17007 -275561 -298191 114575 -130097 -24773 294930 33562
18744 -271437 -259667 72049 -249616 -107936 38810 107110 85400 -70165 -310084 101727 89713
18733 89713 -16697 -37383 84348 -87734 150381 164668 -3166 -70083 -53214 250150 -136200
18721 -111738 -130243 -267552 142920 30695 118488 140208 -137505 -89796 -96859 -70009 -11121
18709 16391 -3084 116565 162468 36039 -368569 86232 -24624 -175473 -218082 -18328 78770
18697 -73463 318810 49577 -2669 104288 242764 -259812 35979 102089 -83629 29176 -172556
18685 -180079 -160758 -405594 -358450 123345 -30707 -343778 -195354 575031 177927 115919
18675 115919 -48106 -263583 13756 25488 160665 -70008 -378405 -330886 132640 234238
18665 234238 108305 -76183 99077 50044 241473 -68854 -62266 82749 240865 -52306 -96850
18654 -96850 -170581 -428235 -93324 -178746 -469839 36042 130037 140533 -407227 -144993 -203851
18643 -203851 -238192 -34007 7440 -2054 -144995 -16699 -305960 163866 107453 -304577 -79244
18631 -38023 -148098 -24643 -22840 181481 -46733 -208172 -56160 -91201 -18142 -58968 -171383
18620 -171383 -321611 172763 -322766 402858 -293917 -132950 -174895 -87916 46573 -237799
18609 -81293 -152852 -170468 -168670 196782 -12358 49198 -16526 157705 -100088 83164 201968
18598 201968 -111316 -180317 -62779 -60390 312648 -338790 -335756 -96618 -311434 79435 -225558
18586 -87323 -62892 -416776 -136412 -3593 -185065 16294 -128638 -119743 127671 72683 -8421
18574 -406137 4923 -177452 -261421 230140 -184001 -125981 199539 318964 51146 -227517
18563 286557 -25657 -222348 209116 -273877 7151 209771 125009 20573 -53099 -133743 -189783
18552 -189783 -164043 185035 -144830 136529 -369725 -145616 -7733 -450888 231608 -399316
18541 -441404 -136628 223920 -56906 115978 -65733 -212774 -36375 -368638 -145212 188330
18530 -119555 190266 39454 -14612 2041 -127360 -91773 -94712 37418 132512 -68307 67265
18518 -24375 -295411 -217474 33682 93976 21830 238859 -7297 -226832 104498 -120000 -56768
18506 91144 -311029 241986 371328 -86415 239434 -162888 207143 -200729 192004 93317
18495 -46545 55745 32639 25358 -196733 16407 -230534 -135617 -185366 -86619 -162485 -39219
18483 -385716 -146491 149882 161730 -93174 -22924 1384 95569 -135182 15137 53047 -90544
18471 -64814 -420572 64159 307081 101922 -178122 -199368 -88151 -74671 -27082 -170492 -14074
18459 -320289 50296 -196217 -323257 -170882 79023 -81647 297380 264510 87292 -34352 -179092
18448 -179092 -17800 72868 -206611 -7734 -51058 -259337 141245 -53859 -30738 257174 -90555
18436 -65448 340233 -280012 69334 -132256 38998 -299540 -339668 -108766 -120766 -158444 -1986
18424 -35539 -181798 -72353 99873 -63612 13600 233802 -70909 254135 297615 -165988 -66188
18412 -98861 -135439 -89633 90321 26249 184816 193542 -65630 68490 -222791 65405 124828
18401 124828 111473 186825 40814 -335208 -839 -273596 -77917 34048 28895 -308875 -63227
18389 -124997 57362 -30392 -9058 -324601 -4122 -43088 12945 114628 -125241 166514 179774
18378 179774 -124099 92596 -151371 120331 -88621 130605 -238324 266432 -380720 234546
18367 -93697 75504 187460 -144084 364176 -123628 152781 -95564 141770 -168551 152326
18356 -102407 -55081 4608 -146843 136902 -211199 98085 -204300 -225758 143545 -18647 -174071
18345 -174071 13439 152592 -115787 -126173 -67104 -535720 332222 -202742 219812 -70764
18334 -147198 256084 -316752 -38297 -125500 -41150 400183 91708 53329 176147 -125481
18323 69274 -217267 -46328 134591 211263 279072 -260933 179068 226998 44265 -292447 -210323
18312 -210323 47464 -146211 -274115 -236666 61488 -214561 83621 -338322 -166958 26297
18301 211583 7994 -183921 244571 35354 371526 -288060 174148 -252637 -248522 47979 -263583
18289 8698 -174870 92050 115189 -242959 -199616 214484 39679 228810 251702 247257 74849
18277 159865 65005 292008 -42688 -126783 -226999 -19880 177802 174214 16602 71504 50969
18266 50969 -125043 -278140 -458563 -399527 -195736 -83673 -114201 -171766 -214816 12553 -18209
18254 -299675 -310077 -282523 391114 -376193 46255 -264431 168838 -226506 -188186 -186352 -377172
18243 -377172 -97179 -351253 -226288 31354 -75610 -304375 17703 209550 -190004 -26089
18232 -21357 -123516 -288358 -355917 -139541 -330363 -34563 30315 -30955 -308440 -185828
18222 -185828 124825 -69893 156031 72915 -59253 69393 -92804 121066 -126326 -135460 -140140
18211 -140140 387682 -408274 -182885 -81812 -208952 93853 -402369 78813 -227346 51394
18200 -34092 -116619 -146476 -253375 37781 229179 -14105 70254 216934 -126688 140428 -188009
18188 -46465 103476 45702 7279 56693 -128687 -44646 435465 -133384 65426 -50072 -71638
18177 -71638 43313 12768 158320 -145284 228670 -157963 -96092 -166692 -26488 -43251 -303020
18166 -303020 -195690 -198618 -18103 -3903 -103638 186634 -108677 -38735 113380 69115 31914
18154 20741 -172902 -185657 172673 67713 -68928 181460 347854 181229 -238301 -55205
18143 82499 97768 -17547 75653 257409 -153033 -301117 45526 223748 73792 -167445 94585
18131 -77321 -343041 -254230 -267182 -73042 228675 20052 -15411 107110 -508 -29265 -92998
18120 -92998 171024 215149 -35268 -223339 -434526 -39789 -427726 169813 -89040 -170914 54839
18108 -198002 -63536 -99678 104494 271022 -299704 263200 233649 -41451 76075 24820 53136
18097 53136 -133928 -125189 1360 -26897 20826 237476 -51180 -193254 -104078 -76297 -122322
18086 -122322 186103 -78565 -137128 -173421 -70852 -31811 -286441 41159 -39684 -99017 -129176
18075 -129176 -213470 46135 31997 4202 -189090 -187763 -164003 -328002 22736 -105712 3892
18063 -297090 -280821 -69261 230179 -222840 149688 -135940 16461 -268885 206097 113568
18053 113568 -45149 192038 3742 -160437 -257268 -231133 109297 -54870 -178655 130950 55465
18041 -456863 -25771 -62949 -5947 260637 -236067 -138948 -190219 -152816 -136368 -19881 263928
18029 -58090 76610 -181628 100109 -85120 -212480 50564 -250110 -104866 259097 184569
18019 184569 -73125 55548 -202810 -272797 -126175 -180183 75799 -157654 -101515 132259 -189903
18007 323937 -11219 -130594 -170570 -11066 -231787 41792 63804 43060 -185759 -61536 -188983
17996 -188983 -165378 148545 229699 -174808 0 -120590 82024 40819 223063 -169414 38434
17984 136426 10733 -165057 -113723 -247330 208072 91507 -582734 -61066 -162394 -94278
17974 -94278 72292 16989 -101827 -291675 -108601 -276976 -10328 -573027 -337962 44710
17963 118528 -222499 -219053 111523 311517 138294 123578 -32784 -192926 355991 -67671
17952 -62319 24676 166484 -28335 -295535 189292 -189670 -54146 270736 -83672 153937
17941 152727 11115 306477 143011 30124 228350 -337731 -27011 -130250 135031 192224
17931 192224 48618 273931 -249294 125194 128315 -40548 -332809 -150115 88974 -152314
17920 -256735 -35773 235135 -397826 -106250 14520 29952 -40776 3127 -27544 195784 36535
17908 -530566 128767 203058 -141530 363121 20011 -20697 174141 7124 -123944 36188 -40515
17896 -61787 -415647 302874 48744 194224 165693 55293 -31724 180648 -237331 114956
17885 86027 -12384 58384 187697 -91245 -2685 -96659 77095 125615 -160663 91346 124696
17874 124696 -4 33432 22076 -102358 -152995 39188 -54943 67357 -338197 -30229 2860 -113626
17861 -54314 74832 345705 8605 199957 -45106 -375508 253698 -40231 55131 -29821 97268
17849 -51209 -335534 -156420 -5678 49432 36130 12601 22774 -133664 -143664 -171091 -110803
17838 -110803 211126 -50951 59266 -192253 -107409 36722 -15816 155827 31689 25409 -221906
17826 86392 340330 -499651 -320630 469028 -324190 -130744 -13253 -228323 258419 20712
17815 -152940 -55239 -59004 -60399 209778 55289 -188077 302942 263510 10147 49074 -61488
17803 157717 -164 12490 132442 -193290 258445 364175 129347 132892 305632 -139162 35103
17791 97275 -58819 69552 -154940 -37406 38635 -134347 -144238 -281348 62537 8257 -204402
17779 -84238 -80443 -33386 -127322 33261 162786 -51710 34637 307986 -38431 -255505 -21912
17767 -100954 -201201 220198 -173713 -239965 -176513 134085 -99746 101258 -64891 116965
17756 69097 -64590 138204 287543 -248111 222857 354427 -105685 -56903 -184303 245646
17745 -237985 92428 68303 164291 246806 352371 -118974 21325 -109594 -226395 67532 54772
17734 54772 27545 72869 11248 68331 -94236 -587996 -56106 -161182 -269799 248727 -220416
17722 -72565 384589 -26163 162670 -50731 -92609 -19099 -240554 -40617 237387 -82908 39845
17710 -24507 -78472 290289 74850 121674 -16099 98293 233718 26312 -445534 239002 45068
17698 25086 48142 48059 59842 -154509 -218258 41680 -293438 40003 79981 -270234 125048
17686 -15803 -52949 -27714 -78327 -218675 72888 266617 101166 -21686 -250069 54208 98812
17675 98812 238471 -149536 -115865 134704 -230085 96226 -261995 -201476 -29725 -116807 201678
17663 24756 206943 -24772 -10149 517221 -171276 50187 137830 -70785 -285898 163355 43827
17651 248380 -2435 134787 -199892 -46960 203089 74780 70614 -76168 -107490 103265 106735
17640 106735 163097 -127019 -98254 -120906 -121431 66074 77847 -3969 -969 207643 130768 193304
17628 193304 -412469 -186042 -284217 328729 69512 50495 145622 242509 -108708 60812 -5995
17616 19011 19822 19958 19317 190113 240261 162878 92579 274748 16575 66149 -77305 -246836
17604 -246836 -445153 230934 119830 51633 -29334 68149 -95790 -144533 721745 55933 -57563
17592 3365 -150620 301672 -68778 21412 167601 86568 142534 -168415 7434 423188 114704
17580 49400 -79765 83914 -251149 -98024 64898 173870 131071 -47982 26032 27200 193419
17569 193419 -93953 61311 130200 13758 202836 -161705 59482 -284971 -38259 -29325 -182001
17558 -182001 -254931 -32379 -89795 376251 -4364 -150476 360310 -215216 104306 69753 65528
17547 65528 -68835 523370 308746 104695 52557 -71006 -86742 -30064 -10417 157079 -211838
17535 -33154 37913 264213 45739 -160401 25471 59042 -136087 303135 -191458 232687
17524 76103 96119 -111200 243758 -112646 -61434 -88309 105060 -151350 72767 124978 90391
17513 90391 425070 -43438 156551 259978 -26558 -153016 298642 359706 237241 86441
17502 -151738 172468 -11938 31628 140358 25418 73210 80406 154346 -67625 67459 109453
17491 109453 148043 248320 223508 16247 -282397 77531 -157756 -54035 67550 165218 -104929
17479 -168892 88864 -214130 -100698 223514 116960 -62093 128999 167841 19936 133974
17469 133974 359989 524200 20469 -268513 139270 184376 75150 141457 196450 179215 356569
17458 356569 -173245 -64338 113232 144705 17611 266773 429424 159904 30999 111088
17448 111088 376568 244369 368226 236656 326839 162035 463063 358059 -169984 516639
17437 86146 85058 382852 308484 297475 272636 411915 35717 327491 221632 337525 62655
17425 153530 208582 -86406 419652 96531 -156338 313808 25382 412170 171235 255943
17415 255943 458508 298346 505884 -53323 85060 127437 8327 318001 -44093 229326 -187195
17403 201698 257001 -100426 381806 -129311 114449 -13853 -52408 364535 105878 229645
17393 229645 255103 5286 60755 -34938 161951 50403 1071 172355 10765 34030 82677
17382 82677 290984 236632 9780 307035 -324777 -26173 225682 260734 30615 87784 -73811
17370 89051 281643 339708 311958 279657 -273050 495916 -199012 72120 184099 -54655 -255600
17359 -255600 216679 39806 235169 -130925 75375 -157412 -6476 418118 -16570 263466
17348 142885 -159875 283834 -122613 -92845 253694 139475 378222 178481 272844 42745
17337 -59782 -97834 -208093 -72930 200708 139561 213257 44063 84845 139745 -19864 -44628
17326 -44628 -80739 165140 -299480 -52219 114311 138673 156706 98444 260477 43193 337741
17315 337741 -58926 -14291 254978 -332992 -71924 59907 299433 227715 182783 145203 181181
17304 181181 251419 -183662 -8418 35643 -37400 -328186 263806 232992 149208 102338 129040
17293 129040 230605 336079 131890 359668 -100756 283699 61133 59009 -195432 171387
17282 -130407 -106385 67319 170783 176799 189329 320432 -84008 401625 376724 -60487 86463
17270 117839 223267 145240 183096 58338 333115 410082 -74283 -109865 80816 312781 108746
17258 71620 22032 378030 462408 77091 234323 361193 94037 126697 128437 345403 104700
17246 137569 102508 307012 284152 -290159 -149871 70885 177293 -353544 161346 253005
17236 253005 30004 122303 144922 170139 248470 114329 14206 188152 117832 372226 236183
17225 236183 56778 326323 255997 -91919 4031 87881 248324 19167 392848 -3283 69836
17213 16597 100637 405875 191988 56512 313003 188535 3135 502580 163711 33141 -54514
17201 177641 65283 -74304 338556 20610 13172 328548 35301 255619 385086 419443 400895
17190 400895 192383 234957 325251 455059 -178032 81510 100776 42396 -8238 -87578 262194
17178 1453 304114 329414 432237 -32160 -34648 336974 104826 -46631 43350 226484 309282
17167 309282 192982 -29875 59680 410390 199537 301286 273975 291260 436169 282077
17157 282077 422949 439577 -37334 494043 248155 259835 555804 398077 176727 234626
17147 234626 294445 282349 48523 350441 427218 445042 161905 204613 376779 307170 42904
17135 413574 280101 323932 105885 77012 628124 353114 361959 238367 481309 538369
17125 538369 627821 578434 226609 179182 739656 146511 390072 543761 501012 647974
17115 647974 380415 330776 34812 339042 635032 372853 222010 549806 424031 -29440
17104 387057 316461 150185 510863 687402 744213 421459 387789 458076 494108 627691
17094 627691 636443 167405 9786 446796 253575 490637 638606 269359 94764 392052
17084 392052 524970 327075 921493 506422 488481 584866 388280 329496 428816 425366 447795
17073 447795 320685 436887 456241 445459 161599 317164 756870 432857 319350 491783
17063 491783 658060 680284 228775 175525 457690 226235 37348 604943 333094 629968
17053 629968 506473 128913 429719 453572 659658 514158 198087 299646 570437 199323
17042 280998 512938 495501 623511 629849 794870 495721 637959 695816 407560 429312
17032 429312 511609 600582 538568 472234 413260 852404 651393 681834 491139 669694 416401
17021 416401 280426 723886 585659 610242 687865 812486 828457 425765 636829 524597
17011 524597 299598 496299 637586 459540 611648 999483 644690 664872 872968 717480
17001 717480 547820 104278 627850 617328 507715 793578 587784 620805 428055 887636
16991 887636 805429 669538 386627 1052649 692776 711821 795701 673418 903278 836833
16981 836833 393930 823412 749076 933293 904778 646636 889886 899921 780559 1197440
16971 1197440 623839 939284 758294 1193968 885917 800581 950943 644802 847301 740579
16961 740579 683117 1215599 1261592 1033650 977879 1089978 661883 1168660 857641 762785
16951 762785 969870 1052668 950679 1153572 900667 715218 760191 936390 1201067 1016659
16941 1016659 1042229 1011391 1152342 1100116 1234629 1067595 1121684 1126402 1229684 1298733 1121617
16930 1121617 1135114 996271 989901 1215394 1199206 1423535 1510918 1167180 1292718 1030268
16920 1030268 1153358 905766 1533571 1342471 1450717 1486411 1191367 1210613 1469174 1132078
16910 1132078 1618445 1647810 1865801 1576157 1343709 1518704 1492850 1373684 1637887 1960122
16900 1960122 1703804 1491556 1609643 1401377 1421079 1491842 1908036 1730119 1760485 1964494
16890 1964494 2002675 1998272 1707414 1734677 1815429 1772718 2197420 1962426 2093138 2358743
16880 2358743 2200866 2382064 1927898 2250771 2159862 2173914 2195468 2544778 2301317 2426334
16870 2426334 2048384 2449252 2318515 2355236 2617153 2360097 2632705 2599786 2571991 3020503
16860 3020503 2841782 2779162 2812948 3047646 2794170 3160192 3243237 3147182 2955449 3176182
16850 3176182 3008693 3177306 3388945 3429380 3468081 3578996 3364543 3718613 3654033 3697282
16840 3697282 3425720 3827148 3884752 3868973 4005206 3985393 4216699 4232379 4577547 4571124
16830 4571124 4428886 4464069 4697758 4608727 5020950 5059384 4805358 5149794 5600842 4967444
16820 4967444 5147783 5481060 5754641 5702026 6016934 5605621 6187970 6243768 5949254 6319089
16810 6319089 6284388 6677643 6747245 7073499 7306619 7548711 7624709 7395916 7829281 8248256
16800 8248256 8220752 8178810 8851389 8516822 9131054 9227304 9687467 9714712 10078346 10322308
16790 10322308 10267706 11030799 11334738 11642540 11602031 11891022 12467422 13073872 13266568 13900178
16780 13900178 14102917 14530680 15207708 15339248 16153971 16800729 16865133 17641086 17827366
16771 17827366 18581565 19568137 19999856 20978223 22193938 22730839 23542203 24524315 25311208
16762 25311208 26276046 27515946 28784052 29896945 31197132 32481587 34079924 35337917
16754 35337917 37172664 38472120 40288315 42606538 44662831 47178265 49414177 51930657
16746 51930657 54645380 57698385 60666973 64437599 67362447 71440701 75433432 79760012
16738 79760012 84714309 88992403 94467069 99936505 105681722 111614352 118047467 124922046
16730 124922046 131249047 138111400 144420680 151352087 157927435 163392699 169208533 174281308
16722 174281308 178536733 181671741 183773640 184798302 184769372 183663223 180982515 177428923
16714 177428923 173128990 168636684 162706687 156351052 149860578 142889513 136212410 129719108
16706 129719108 122920649 116569511 110217673 104284972 98523803 93130775 88069308 82881174
16698 82881174 78690821 74477487 70226146 66828190 62966733 59800564 56798252 53777048
16690 53777048 51197300 48763832 46369985 44063499 41833354 39765913 38100646 36513824
16682 36513824 34793067 32982123 31871345 30463014 29379268 28200711 27015284 25888470
16674 25888470 25265482 23933125 23336166 22597801 21521581 21031940 19968309 19100805 18452084
16665 18452084 17672671 16986916 16760059 16416418 15693626 15563504 14862831 14399662 13783412
16656 13783412 13498165 13289482 12464440 12230571 12256339 11622890 11251166 11258627 11027541 10363624
16646 10363624 10020898 10025409 9814115 9440262 8971569 8979461 8704830 8396486 8193927 8518909
16636 8518909 7959572 7916425 7450877 7501304 7168972 6967014 6868914 6864449 6906848 6421755
16626 6421755 6109359 6236062 5990651 6269735 5922291 5636012 5731265 5565376 5535007 5121002
16616 5121002 5242496 5341612 4927237 4737946 4636846 4586495 4765449 4500235 4670504 4461370
16606 4461370 4464492 4373022 4245500 4173404 3687324 3796743 3869735 3911730 3848460 3576293 3634972
16595 3634972 3738018 3619420 3169947 3662465 3365986 3134659 3279270 3414096 3464060 2923063
16585 2923063 2843851 3067453 2856721 2904042 2822603 2875230 2497432 2498374 2777343 2747083 2385743
16574 2385743 2695675 2737222 2319261 2603822 2221279 2115239 2367580 2591908 2107099 2030796
16564 2030796 1961259 1880288 2190071 2007624 2274027 2109182 2773158 1869389 2114400 1732573
16554 1732573 2164749 1801688 1827560 2129410 1677292 1863258 1768421 1826225 1827436 1874526
16544 1874526 1657136 1567617 1863041 1734316 1884893 1719854 1633772 1492524 1776724 1868693
16534 1868693 2053615 1951852 1382279 1601495 1635034 1505397 1352633 1330618 1394882 1397934
16524 1397934 1414416 1545626 1134212 1769909 1547032 1695714 1714566 1512390 1294625 1356983
16514 1356983 1586398 1319227 1270231 1353389 1284860 1297530 1102101 1387721 1779200 965432
16504 965432 1597941 1155111 1399171 991931 1164279 1102448 1216114 1343591 903664 1299809
16494 1299809 1240436 933214 854710 1342687 1061783 875040 1018085 1086497 1182623 1030551
16484 1030551 1224270 885805 1218128 859940 863232 815023 604760 819972 1037441 936367
16474 936367 915709 552212 1015191 912317 797489 892878 931180 656143 1014821 670909
16464 670909 1034460 766834 1104940 848044 973233 707101 677303 907421 604040 724773
16454 724773 658139 982662 799570 589172 627315 964504 994573 689218 823720 1094402
16444 1094402 670181 972673 447402 703449 533563 532546 734974 913069 608247 1181738
16434 1181738 625666 676581 761699 752498 969838 1008594 861308 613029 391704 808463
16424 808463 719582 769111 715553 807870 746685 323747 816745 664833 649581 512146 772832
16413 772832 401370 709833 442930 608894 658285 793890 371859 408318 647363 186237
16402 858091 613421 503616 649457 724093 463896 497665 683986 541030 284771 235974
16392 235974 830471 603598 550292 476974 506166 706514 360363 325301 667274 622423
16382 622423 267395 256773 422031 348986 387122 650493 667545 371506 908802 537131
16372 537131 418367 633363 374989 371617 181616 565744 756891 454796 631465 245462
16361 322694 749574 369297 611072 163616 203765 496887 412184 431600 237399 532385
16351 532385 412336 422370 158003 477188 434504 806261 545771 301944 315106 180805
16341 180805 455871 136637 413781 522316 224565 569588 99794 171115 708456 506491
16331 506491 576538 354795 591423 341167 496559 212410 674231 560585 620545 138114
16320 455758 323659 254937 -34699 537824 274481 308095 333026 213162 296696 400097
16310 400097 449632 530742 186707 498240 453183 398187 464225 195118 279849 366383 485024
16299 485024 397353 291020 110264 353788 48017 381132 628637 342771 510529 336111
16289 336111 264071 -160274 675807 -36760 406728 226816 298186 65789 -63517 531257
16278 125757 450314 539492 382290 388764 -284728 47317 -47715 239027 260831 165407 259710
16267 259710 517174 560721 136568 179223 474758 218499 306125 490820 57305 424524
16257 424524 564719 73629 147230 -271753 429589 31105 294663 35935 102271 432200
16247 432200 369187 32085 291908 306194 78785 561877 388644 112302 454303 34238
16236 61349 361922 404959 142351 472151 202222 448413 188564 384352 365432 454336
16226 454336 97432 108534 383752 541906 -1307 412165 361905 224933 356711 188975
16216 188975 135741 542086 -28135 329323 707819 -94580 178803 116783 270058 95451
16205 119795 102349 282822 201811 436927 -61601 299705 367413 -22404 -216122 223855
16194 308631 590233 389514 378291 271102 -150754 197540 512614 291785 348752 149851
16183 114222 230792 131041 223132 186953 381682 39057 -40781 302727 465750 514679 276009
16172 276009 223889 113427 -115250 84822 39155 104639 476167 230152 -17791 -27488 178700
16160 125362 128401 103284 45992 250927 473182 -154171 284010 226744 99690 -23574 -99908
16149 -99908 140286 -37895 239633 179769 -93182 -247279 61009 -3313 -157223 188625 -83450
16137 251038 -35366 13290 11162 121853 -402543 264136 52655 6438 325959 147589 -109047
16125 134011 191839 107368 261899 -1566 291596 339276 334052 77268 218150 91321 15193
16113 -137052 -150097 61190 -174463 1604 -169085 -140857 226835 194951 129870 -125364 320635
16101 -82981 66027 274862 92571 201717 200707 46311 171411 341029 469594 208916 312058
16090 312058 146043 -43591 285805 -419758 -406997 76041 140631 238018 -332394 -127554
16079 -144363 -102740 279236 116921 -209461 9092 326425 -154871 56429 194425 61278
16068 -71064 437804 181924 -1197 140409 169548 81460 71376 -63454 -14872 -68612 -114091
16057 -114091 -210249 -39051 215056 -77783 -156651 64007 -55013 -217590 -100741 -163667 151358
16045 47001 -29655 -34216 298149 -205254 104203 -474440 158317 124255 412277 -6381 278058
16033 102688 88147 37976 -197969 32302 242695 137115 364581 71050 141897 4000 137540
16022 137540 -150837 -30618 116966 -362753 -22834 -113757 -162709 -269268 -85458 -148153 267666
16010 -321089 -225788 63301 28302 -273364 -133773 20217 157365 175724 -39376 46408 416713
15999 416713 -179770 202137 -87001 -204017 302843 -171680 -255716 151446 -21007 116706
15988 -340178 127341 36398 224440 -278186 -120220 64044 236800 34400 370989 401779
15978 401779 448315 183003 28575 -316460 -157712 -76789 133981 285425 19468 102419
15968 102419 232942 -251211 -241214 -134648 -237909 -70460 76073 -103708 131434 180657
15958 180657 368731 -101104 -402444 43401 -99651 79052 -101035 83044 39561 2171 -16536
15946 -24601 21273 -252782 -74447 101977 91509 -252409 76599 -40638 -340205 -154768 -233665
15935 -233665 -164111 142291 -74717 138823 -163069 -101352 -130007 1501 -98093 -125162 16166
15923 35391 -141138 57817 31003 -48214 -203351 225394 82876 -125657 -25345 305745 239771
15912 239771 -229094 225015 -106290 22983 -37876 -78060 77292 120025 240012 87565 -73390
15900 -338561 -26035 -186095 -81047 25540 45683 -43521 173063 220700 184885 -262422 337164
15888 247302 29620 136313 272978 52730 49922 -20464 39071 -32132 -40360 119207 -90257
15876 -219296 62987 -2849 -182585 1777 -20845 -168930 -145014 -201663 219370 42827 171565
15865 171565 45142 -129256 -30539 -336700 -116560 131083 -138541 -32561 310342 -261736
15854 72659 -135505 -214664 253965 153583 -6272 -232388 156261 78171 -133724 164881
15843 -70169 -126734 -193250 -142212 -71775 68656 -250774 39704 -145019 58824 56324 12149
15831 -175440 -321111 -306225 -155990 -31432 39426 -62174 -91093 -231714 -4254 -115504 -130980
15820 -130980 -141671 106172 80905 -415833 110719 -247556 149190 256955 228647 -59785
15809 -66409 -19859 -237930 -242879 -218253 -246076 -53376 -46413 38054 69206 -294743 24078 14440
15797 14440 -156296 -492618 -84544 306113 -177659 -73695 45162 -44038 -220298 -239264 -53860
15785 -339844 71632 2872 50894 -212491 -82481 106250 201546 89714 -140436 63011 133255
15774 133255 -39449 60929 116817 -95544 91959 79147 -76659 6712 64433 39040 -56843 -8520
15761 -158410 96476 204866 40826 -157001 27660 -190416 4499 25514 216057 -245996 -62342
15749 305526 161673 -29923 106743 77988 205879 -109406 -92664 -27276 -16256 121505
15738 32104 -105682 -8660 -59259 -314764 -94376 3647 -93604 -188597 14980 -86005 -267389
15727 -267389 -26733 -75295 -83773 -4815 -55191 -229406 -20874 -240583 -223883 -143411 -190821
15716 -190821 -26388 -222068 -8323 163488 49586 309245 -232615 -413805 63389 1362 221693
15705 221693 137206 -46679 -83838 -184184 -33801 162630 -196297 -13277 -177178 53055 243383
15694 243383 -281639 -6110 234613 67167 50453 -48449 171938 -154310 -29025 -24234 53714
15682 -140021 21987 -376514 194901 112343 79786 -144609 -372165 -76193 -542062 -91916
15671 99440 98699 -287922 78901 -91030 -172483 -13748 -42123 288615 -13266 142188 -134962
15659 255520 -114772 108550 -223215 59747 -138449 -198394 282967 200144 17418 112755
15649 112755 247590 -121370 83891 -129949 -468183 252999 63733 41117 -268805 -341970
15639 -341970 -178647 17433 -151826 -290314 74776 -92380 19113 -184341 -58490 13589 -153993
15627 -14416 135294 -109471 568732 -52918 -376312 155541 163292 15207 -156134 105107
15616 -126375 9046 -97118 -28459 -294614 153049 -237772 652 59189 133950 123339 176287
15605 176287 -183171 -332604 -282732 -24988 -174903 -204535 375504 309974 24638 -77963 165740
15593 208047 -34679 -142679 -136523 122713 -21554 -277314 -98828 170401 118440 98872 -309141
15581 86925 40877 74860 303605 310800 9096 100390 -49755 480137 -522193 -404486 -158572
15569 49111 136821 -65780 281581 -176545 148089 -256458 -129728 214302 151651 102903
15559 102903 9790 -14086 -147253 -164896 7478 178853 -79838 -281738 79801 -39571 140191
15547 -299986 99681 -155001 184374 -71738 -304136 56730 209798 289203 188812 -19094
15536 -130934 -50705 -247942 315963 382238 -128764 -18233 199874 67932 -462041 -200747
15525 61528 -183597 120743 176857 59454 -159133 -252289 -143577 -64551 -114790 -94347 131683
15513 -80677 33502 104727 -123767 12305 153771 85720 140439 -178530 -22845 91238 -303268
15501 -352566 -352223 -119928 -40897 -208457 150543 81257 72146 -101440 229120 -15325 28739
15489 -451327 13280 21650 151327 8123 -14648 136465 61274 201609 308694 -48106 72278
15477 193416 -34028 104115 177717 26134 -229052 -154640 132588 -104095 -88104 -104433 -33204
15465 -152960 421829 39609 68748 -18646 323703 126455 -149674 101507 260491 51756
15454 17711 -38521 116037 -144088 177525 -119365 -111370 79001 56536 177133 55348 84424
15443 84424 135893 29086 -281107 -181006 -165460 73879 -27375 67174 -76202 -207114 -74137
15431 110652 -9792 -174218 219349 -5427 -29587 -108753 222874 -86709 -305658 67216 -212372
15419 -87466 85132 156585 351769 841 114557 -378559 122774 -146809 77529 -264039 72512
15407 326865 -336774 122915 -16450 -358739 -167420 -233711 45059 -136314 270077 224592
15397 224592 32617 206268 52353 -18261 -23098 -54133 3244 -237956 -33598 -372659 -69508
15385 382418 -44405 128658 185538 -207431 -271233 330974 184725 148920 32918 82171 -75892
15373 317327 -4470 40497 -24401 29114 -75254 -106804 -163935 -160798 34153 102837 50010 88777
15361 88777 -19937 104263 272288 96130 -143471 37939 75959 -50824 93841 141960 -88105
15349 -195505 -41726 25049 -97263 73246 -127738 -213310 -284114 201713 44147 -166458 308073
15337 -73698 40868 8423 14527 33113 41543 20916 -282372 -82983 271559 50325 387665 -48104
15324 -65719 6276 -227770 -372331 -143987 21724 -183393 146820 51918 326758 454210
15314 454210 35896 -22969 359626 -63831 -152896 81459 162291 30551 -95445 32033 -147087
15302 -284425 183456 -122189 3321 224622 -280806 -4037 -93706 -40771 60988 -85401 357556
15290 273649 -300407 126795 -111962 139089 14759 -42329 -117427 27831 -52453 -166125
15280 -166125 116356 185658 -7448 175325 309106 -228635 137422 51840 58438 -3864 416079
15268 79974 216033 -409329 24799 470006 -126090 517630 -139985 -165295 211128 -90600
15257 153408 -61755 -126402 -227717 254785 -12495 14918 177779 291037 -118359 434842
15246 1251282 2231052 1401269 1969981 1300986 689115 94781 177859 -132389 120587 -143421
15235 -132450 97769 9120 -5 169074 -28774 -24779 12498 185989 246353 -91589 59411 184195
15223 184195 -148903 297482 -129158 -99286 -124171 -244481 -246287 77358 116928 388083 -89224
15211 144437 278288 -131539 -78195 50563 5581 -64887 -1253 56640 287429 -98153 -9450
15199 355362 176208 -82880 99158 -148856 -278022 118330 291916 -121115 91132 68545
15189 68545 -157645 204231 13393 303856 -39721 104539 -240846 103453 -159111 328329
15178 609337 -73857 423654 -20142 -175436 333539 168344 239556 51854 55201 531080 -63554
15166 96223 -31395 210216 142837 -176759 485186 -241306 -112653 214959 64885 -57414
15155 191289 -5135 48349 -17000 400161 -2332 114849 -36676 -39056 70686 19188 250762
15144 250762 134884 -1254 201736 165243 418364 327714 -192929 -95083 128350 37278 155931
15133 155931 -25784 72501 201416 -124625 61131 -101758 143450 163986 -71407 351336
15122 30685 -173028 102338 61154 188324 -20775 59992 97984 -49265 449135 265917 -18822
15110 191111 -7893 157100 50962 149683 313266 438484 -31735 69460 154829 302533 102193
15098 175234 61429 369992 381650 399865 -18185 9565 101090 66270 57336 -92478 -137769 299082
15085 132362 394420 213379 -114265 3523 394841 -244608 -68700 -89153 -88672 -167218 44054
15073 104962 419701 97528 181175 66910 186274 45546 274096 258153 303984 219888 19601
15061 207196 -57132 108193 39836 623945 19479 235840 440780 57770 132956 152066 408913
15050 408913 305002 58529 -53179 433801 612788 75857 184592 -74288 -33778 286697
15039 321076 328648 -13643 133179 155535 276260 173774 40104 103485 105042 249354 124025
15027 165812 60946 392799 167723 -122058 128023 406707 92001 107308 129182 62793
15016 220160 190167 162457 213557 378448 94822 173183 313455 410115 90168 -125822 199728
15004 181959 517052 322453 -108719 48320 11372 197317 248961 419683 172293 -97981
14993 67892 442410 -25291 317358 72142 220291 145350 311388 39626 193058 253680 264835
14982 264835 311033 287930 36910 201759 195366 -18681 418148 401112 177237 165687 394525
14971 394525 209931 281208 373219 440326 367257 58327 139926 289848 531681 249647 335311
14960 335311 24451 441542 298569 383146 524106 113624 457763 359017 208665 323179
14950 323179 246235 201459 137901 -70735 42660 282195 195901 144747 280696 198465 139281
14939 139281 128989 101044 407092 152292 170352 -114432 435746 165601 573554 77135
14928 207859 75263 -30182 81496 -83732 635410 154673 208680 80102 -14109 155600 440839
14917 440839 141913 383056 533827 524157 218991 -76371 282313 387562 -77379 253333
14906 214528 272866 469995 -39489 500706 -71576 572019 217140 633629 420406 438500
14896 438500 547275 552010 -42192 213007 295442 368521 323366 81111 139810 258723 194903
14885 194903 228785 126958 344395 339181 139965 446386 250279 313537 426173 299218
14875 299218 162565 568126 250045 174691 355532 300954 -22337 132110 307464 131905
14864 389189 105231 237227 438952 -20020 278605 389772 607621 436823 285334 271340
14854 271340 279318 470379 124877 591041 674834 559154 585342 332685 707359 522635
14844 522635 402630 688874 379431 246820 211649 413232 352511 474666 252094 675921
14834 675921 552100 222642 386871 544777 644337 416457 404848 352451 289057 426826
14824 426826 397885 481841 106650 684455 418724 636850 291392 313006 878778 94665
14813 203205 786870 242755 329484 423241 485849 689041 523949 177621 583762 421439
14803 421439 320078 174766 447342 762833 124706 335159 415873 402551 551659 73894
14792 491826 244272 438071 574381 355507 417101 767501 296885 521275 581327 387778
14782 387778 152023 580786 460148 597002 404604 566054 848285 743725 558269 422720
14772 422720 583135 350356 441434 445739 640263 727952 507020 573589 761366 530110
14762 530110 535821 454960 516248 470673 311648 508959 630915 671421 418474 886708 695198
14751 695198 326806 1036365 758988 488897 816132 637901 577999 855915 666406 709938
14741 709938 607205 689943 688443 452208 733110 553709 987396 573918 801389 661725
14731 661725 864537 900006 630751 725720 1018432 792813 662883 436345 886992 584071
14721 584071 777552 553395 515769 474315 1209821 751886 651727 902978 634446 782181
14711 782181 1119230 843784 553264 651192 717859 237947 590367 469366 912068 674736
14701 674736 607806 857533 862787 988232 546455 638720 573908 735147 567777 1013885
14691 1013885 968809 962340 834876 972611 588315 861422 1201251 1234489 834218 819507
14681 819507 1027457 754728 795584 1085648 992108 963732 963626 712759 1150312 753424 1040818
14670 1040818 917767 1129997 867391 839873 1126128 995844 1335128 502834 1253405 733939
14660 733939 1001716 606971 1122467 1161278 1078854 1057451 1216384 1067691 1066024 1046043 1223048
14649 1223048 1167767 1295326 1249003 1065056 1253861 968262 1223405 1443964 1224692 1046870
14639 1046870 823944 1377902 1584970 1184219 1128865 1373703 1512113 966836 1192240 1540851
14629 1540851 1567505 1458642 1586112 1555485 1235647 1285054 1187065 1198642 1300757 1107452
14619 1107452 1491312 1560044 1500856 1295133 1519007 1225075 1598363 1560471 1646349 1484712
14609 1484712 1373498 1315980 1328014 1973603 1650552 1697677 1662296 1664407 1333818 1680797
14599 1680797 1522511 1721959 1423328 1704963 1483644 1558282 1890916 1655420 1487593 1722327
14589 1722327 2034207 1756101 1462933 1610587 1511909 1716885 2081162 1821690 1791095 2260957
14579 2260957 2063278 1806925 1873318 1802708 1867785 1826410 2052841 1756646 2301345 2232410
14569 2232410 2087281 1982080 2289795 2132262 2509202 2133268 2370724 2301038 2438314 2544568
14559 2544568 2520936 2641721 2661518 2903291 3181575 3141287 3403092 4064996 4349592 5446048
14549 5446048 6833729 10613012 18563452 34853950 45143003 24632578 12920903 8087283
14541 8087283 4107811 2852791 2067308 1860118 2394330 1896618 1913403 1741558 2154240
14532 2154240 1997356 2103833 2404743 2115561 2427879 2001601 2240958 1980781 2133054
14523 2133054 2284967 2075059 2222517 2064950 2659014 2176265 2552481 2580034 2380656 2518005
14513 2518005 2596524 2519562 2734392 2763067 2729005 2608706 2811893 2206678 2886860 2948022
14503 2948022 3011164 3070646 2795943 3198941 3092895 3041835 2899704 3061666 3188725 3096962
14493 3096962 3459504 3377771 3080100 3526150 3474694 3388936 3407178 3526308 3316140 3639162
14483 3639162 3558991 3860998 3740049 3584124 3814700 3804907 3860671 3620396 4260042 3864232
14473 3864232 4096265 4109811 3955841 4035351 4185089 3764116 4244808 4162582 4323907 4726539
14463 4726539 4446737 4675879 5005372 4600331 4397078 4764771 4728439 4830593 4983628 4685029
14453 4685029 4990467 4980229 5315329 5327849 4988629 5078001 5099440 5054602 5768926 5206472
14443 5206472 5488674 5555341 5886072 5532103 6202751 5837450 6279073 6185226 6366108 6158406
14433 6158406 6329481 6471983 6525287 6423051 6466409 6873472 6966277 7259887 7045471 6916449
14423 6916449 7139659 7425007 7596856 7641748 7679845 7698940 7853890 7858978 8076240 8332710
14413 8332710 8038153 8269537 8711732 8773206 8871282 9119738 9152503 9268760 9296230 9122361
14403 9122361 9514382 9915493 10010878 10215197 10123824 10504250 10530466 10849017 10491372 11223361
14393 11223361 11531189 11696947 11667834 12039321 11987058 12299039 12919636 12777937 13078134 13272517
14383 13272517 13296955 13719692 13969917 13952392 14717768 14449034 14897050 15321431 15697336 15647186
14373 15647186 16136846 16271107 16938519 17093996 17591850 17950421 18301552 18519910 18909678
14364 18909678 19389339 19684046 20197401 20678053 20970894 21478842 22177691 22540938 23021284
14355 23021284 23726135 24412418 25003368 25262331 25977196 26324451 26951604 27666319 28502575
14346 28502575 29350210 29958896 30786502 31745617 32508463 33443013 33978277 35258966 36284047
14337 36284047 36958877 38509307 39601595 40675474 41437066 43026407 44188678 45601893
14329 45601893 47631648 48616839 50440639 51904687 53492801 55154381 57286721 59493645
14321 59493645 61258935 63233018 65933814 68119292 70788714 73311598 76000873 79408407
14313 79408407 82005986 85660901 89132155 92874070 96644718 101231146 105577886 110036426
14305 110036426 114918208 120015335 125692041 131531788 138072157 144784417 151739194 158994405
14297 158994405 167196303 175912743 184698764 194508995 204844883 215415203 226406430
14290 226406430 238923328 251430470 264425781 278216896 292716090 307973983 322732089
14283 322732089 338799775 355083452 370771016 387140586 402521483 417432629 431943380
14276 431943380 444539117 456325651 465537514 472581619 475174122 475326068 474571440 472068415
14268 472068415 469155212 465855695 459749818 450529986 438780225 424972495 410189285
14261 410189285 394429904 378588195 362077939 345858336 329816605 313636548 298436566
14254 298436566 283632569 270606091 257076808 243999814 231391855 219764719 208962380
14247 208962380 198570118 188512208 179194897 170909289 162818700 154947267 147791068 140629975
14239 140629975 134230370 128257160 122946128 117231928 112430842 107380579 102723706 98710827
14231 98710827 94963650 91480811 87854123 84156954 80829043 77620670 74877241 71913272
14223 71913272 69247599 66917904 64420689 62814407 60417566 58432226 56306694 54657069
14215 54657069 52733694 51297238 49819926 48480896 46950551 45126596 43965234 42907316
14207 42907316 41955633 41204739 39326266 37998871 37157567 36143699 35228294 35052720 33451721
14198 33451721 32602590 31888763 30813979 30207169 29734570 29254589 28364757 27268488 26728019
14189 26728019 26087501 25352277 24985743 24028418 23795344 23278925 22905228 22280326 21800703
14180 21800703 21266476 20693311 20294353 19958816 19334060 19097400 18869818 18638217 18126392
14171 18126392 17848520 17497332 16746021 16589845 16515583 15876373 15856497 15306110 14857808 15121580
14161 15121580 14526206 14201491 14266873 13962242 13726933 13877801 13100961 12817446 12950760
14152 12950760 12285829 12231153 12023597 12101733 11696727 11394706 11694421 10915362 11088355 10844207
14142 10844207 10633233 10297023 10370873 10319020 10082122 9686855 9781960 9470127 9159464 9206271
14132 9206271 9340502 8756713 9156626 8656011 8615528 8512728 8609127 8412888 8277387 8372996
14122 8372996 8361825 7532527 7584511 7630389 7374435 7588036 7808263 7320485 6975707 6991982
14112 6991982 6837079 6690164 6643437 7185041 6720729 6497932 6738647 6342723 6268324 6263705
14102 6263705 6094985 6038273 6077473 6183705 5924068 5970226 5673634 5595013 5787217 5529076
14092 5529076 5414425 5137026 5687052 5026034 5123849 5176156 5260027 5341727 4893641 4910748
14082 4910748 4756505 4809997 4875918 4995685 4629920 4609942 4388032 4679587 4458777 4557745
14072 4557745 4461668 4036131 4476686 4236291 4218958 3928868 4083674 4051964 4105987 4247318
14062 4247318 4322796 3905007 3799913 3982322 3699101 3558497 3950776 3872598 3799362 3870187
14052 3870187 3699308 3389833 3843672 3558132 3466251 3474814 3491288 3449669 3266689 3539627
14042 3539627 3623965 3448048 3199165 3045148 3091704 3321161 3211698 3034357 3114841 2988366
14032 2988366 2771563 2973822 2869890 2829466 2967463 2947412 3028539 2952055 2751206 2737870
14022 2737870 2823441 2846999 2602304 2734562 2468174 2399211 2567060 2442213 2695865 2301278
14012 2301278 2595292 2520300 2544536 2364416 2247190 2297810 2341035 2023893 2141394 2278001
14002 2278001 2436485 1747721 2049607 2103932 1894352 2461162 1813684 1874275 2259977 2084312
13992 2084312 2248642 2353517 2341981 3490516 5477703 11686218 27444183 45110789
13984 45110789 30191599 15659672 9077571 6531580 5121918 4096007 3840129 3645489
13976 3645489 3242119 3277385 3112776 2889824 2565693 2724510 2607878 2536321 2267633 2367081
13966 2367081 2608333 2492279 2650570 1996066 2163022 2179851 1962008 2138003 2179316 1703742
13956 1703742 1915366 2155999 1867684 1848376 2007363 1839517 1818663 1668555 1806861 1980444
13946 1980444 2072202 1966048 1621836 1912476 1722245 1528099 1523986 1556018 1683472 1635244
13936 1635244 2118094 1727896 1782083 2233506 1255079 1373924 1601972 1456819 1594054 2189136
13926 2189136 1516453 1560798 1448141 1482920 1716567 1826790 1222037 1293978 1542559 1525597
13916 1525597 1405680 1637795 1705642 1722543 1204736 1372058 1451428 1263950 1690641 1402860
13906 1402860 1352542 1668669 1083692 1458478 1335381 1379373 1540826 990454 1228321 996615
13896 996615 1505618 1366704 1331006 1601257 1171350 1308629 1488975 1297471 1009497 1075033
13886 1075033 1531332 1104888 1213979 1269387 1101304 1273525 791576 1279773 1093236 1327071
13876 1327071 1498255 1528082 1111762 882130 1132685 1393920 1437607 1374316 1294143 1096892
13866 1096892 1284734 1055309 869657 1240261 1197199 1151254 1049138 1181317 1353901 797193
13856 797193 915625 950034 872317 999586 1068167 1090307 1077451 892199 1206486 1007339
13846 1007339 1206153 899730 1107888 1205907 1045290 666714 977571 826250 959371 986983
13836 986983 907964 799540 1052357 752295 1288620 1138327 859267 814990 1064915 806889
13826 806889 1181789 766141 891973 857720 1123308 758941 984148 760188 1258179 656441
13816 656441 921403 1085488 644371 715352 1411348 480942 1059490 990525 824118 634803
13806 634803 941361 433711 796650 673668 858722 910526 483873 801106 846448 772542
13796 772542 851871 705437 863113 759166 591140 831307 789130 491181 550669 624354
13786 624354 583899 790187 571409 881960 873460 619742 428565 661677 1008987 539833
13776 539833 570753 856798 468730 690698 719471 883728 540593 783046 710997 408161
13766 408161 530106 583474 733167 321263 715967 681930 926368 771875 702081 782181
13756 782181 516511 690530 543144 316370 778274 976382 524948 500069 661400 812535
13746 812535 849763 982081 546665 345278 630588 712920 523398 483557 556175 372386
13736 372386 717313 290075 522727 595984 415031 794731 650203 712984 306679 565954
13726 565954 667444 601005 731875 505677 645479 325382 531900 761590 452113 714376
13716 714376 534809 367620 478325 857685 609234 569951 631185 747856 566237 608013
13706 608013 472967 680216 525836 564938 670701 744044 847042 227805 532391 671624
13696 671624 733619 446963 613435 551037 258331 276077 635834 414959 827321 461781
13686 461781 243166 372110 356363 175717 242542 339066 485475 512500 598282 386184
13676 386184 439490 263343 444768 508711 556776 608309 467189 362848 539368 412259
13666 412259 145503 299209 600442 482217 195364 349545 318855 87350 316127 793966
13656 793966 408937 638914 342720 398163 341449 601559 391698 670573 448517 425295
13646 425295 411489 335163 406304 6834 473869 620441 650742 396705 657909 175416 396979
13635 396979 614399 436873 367773 525299 430416 212481 437896 431820 200201 493394
13625 493394 180003 314174 292499 95495 487905 272596 520662 -102957 595437 317176
13615 317176 507218 479250 626270 429659 575378 386703 342323 145955 339750 819495
13605 819495 639115 525772 464476 576772 -40959 97611 656761 429126 157341 320577
13595 320577 377335 482232 173170 146398 345898 369578 166039 338404 462014 429295
13585 429295 265281 535281 648555 300457 520193 227058 437747 191147 496750 338429
13575 338429 200669 299533 320194 266465 94372 332809 39388 394092 404504 313997 379888
13564 379888 94220 61386 -36563 271436 380293 325327 64475 481167 117022 591396
13554 591396 435098 7594 264728 248080 81888 324694 93961 309824 430958 457876 409443
13543 409443 298003 45030 149442 264137 -39935 211806 403414 378852 567567 390623
13533 390623 119018 397903 169073 360043 384969 47009 107876 339398 27343 433955
13523 433955 615393 317735 220724 496397 50245 302810 263599 197780 495478 -135726
13512 240520 490266 231753 53592 375567 295640 375416 305650 220703 468105 159569
13501 289159 196160 221584 243482 235674 7757 271270 167656 187369 136070 146491 291616
13490 291616 61680 480237 494723 -19304 509028 264596 366532 35200 321360 495935
13480 495935 232290 40866 180134 310933 57151 347448 378777 263511 111910 137344
13470 137344 242076 166677 431133 309714 33765 381202 439022 193102 588253 289472
13459 362683 199433 88548 271001 242458 494959 184923 124947 399534 287857 236803
13449 236803 285432 671322 194113 329871 103224 334335 542824 475511 477272 198828
13438 243447 -3677 63069 339974 168523 192433 79472 293007 127011 37029 -206502 386296
13426 375038 337100 119136 115099 169893 -131050 145969 407468 145034 60617 321344
13416 321344 70869 359857 -137595 112512 411643 271323 188616 -140414 274260 138580
13406 138580 -112912 337725 336417 43437 219949 189282 240761 187663 -229654 144164 225560
13395 225560 -32000 200656 29501 346128 226722 119450 71292 368729 262578 285467
13385 285467 -14127 107257 319835 236286 -72661 459251 206906 67981 280878 271721 257415
13374 257415 265417 496806 305830 338851 116097 469318 295331 378475 43444 351678
13364 351678 426472 269826 114162 227157 132945 53798 325766 125070 260529 -47207
13353 333629 347374 392951 495186 110094 391061 714577 277708 258840 310281 113202
13342 83124 172922 621057 446191 456617 324602 117736 159238 255630 48042 14071 277413
13331 277413 -93215 100379 182897 -39265 313259 361056 95820 192045 248657 338555 44670
13319 369963 432214 54657 168398 206579 101238 93309 537617 407358 12329 70145 144427
13308 144427 223047 208106 -177002 202789 -122294 -84720 389865 260584 92670 193849
13298 193849 87762 291893 -38655 -25217 82662 -86465 143290 391474 -30435 93847 157493
13287 157493 233473 -97917 491279 62055 137262 202397 233220 124405 -74409 191511 -142007
13275 393848 257637 183454 1119 187503 65176 329182 79580 27080 4856 -182013 250058
13263 159643 113572 -19741 241656 116240 137345 153121 142555 -42547 -17085 -76560 55989
13251 -31220 -68251 95873 -155664 106944 -43384 365588 46694 183597 335071 54356 63568
13240 63568 126350 133648 47482 -69431 230646 227592 21214 41190 374001 239256 261995
13229 261995 34965 -73182 36567 324682 110651 238246 76966 -20454 154935 -78006 162710
13217 -434395 -221156 -192698 28197 209038 283959 -202188 140524 -550895 119154 149301
13207 149301 90959 -218865 6109 -184972 52679 53344 285247 382501 13127 91128 216776
13196 216776 352631 7790 -264414 90674 91976 374065 68806 475122 -161799 -108965 176166
13184 79667 167316 -65169 -173685 205558 88221 435070 51174 -157060 330318 25514 -68055
13172 342945 151008 226 114416 138762 352562 98211 397717 237928 114634 35113 127899
13161 127899 -33666 10050 -147449 284079 -167270 127950 -55314 302417 -1473 157777
13150 35518 -150521 96073 -21211 -94719 -136969 84734 186186 7460 349274 179105 283532
13139 283532 109352 -153114 -68703 94375 54404 200019 131102 -188698 18724 -85216 189415
13127 -108560 -60880 -58424 104350 101077 224195 -213610 -497 -151706 -279425 144735 60194
13115 -196587 18138 287138 49523 -60161 -287639 40815 -115807 51187 -99560 -55822 137644
13103 86107 -85057 4579 58063 -56093 287280 193596 143950 203134 -19440 15117 42857 359311
13091 359311 -12073 107115 170518 3224 -230289 312202 87582 716573 793 168555 -164823
13079 66723 365550 382332 347765 45425 295534 290293 197185 37907 76926 -198193 114623
13067 -296980 15597 -42174 121761 88424 259363 34390 134877 16503 168592 197774 -362086
13055 -32165 190060 72614 100310 -54534 -285277 118197 116375 6793 32292 129298 -37638
13043 -162192 482427 5727 -231827 29430 -111774 159283 283566 -196166 -1761 14281 -55076
13031 -38689 159792 117271 165662 306242 37863 257135 237750 118187 279086 75423 141211
13020 141211 -181037 -130586 -5614 200920 110847 -4667 38773 -118644 195257 103877 213704
13009 213704 250628 141264 400851 174393 105910 133669 248765 146301 42499 52467 -311344
12997 10861 142922 130255 42879 -104292 46250 88582 -1279 -34186 -262498 -99749 -184318
12986 -184318 290639 184821 201556 205882 -368214 59904 213177 264759 240166 -8677 -12443
12975 -12443 -222528 4737 288843 -38283 284445 -52636 -43055 387563 144487 -86471 308674
12963 117273 242328 -150744 -12946 -158690 90838 142852 104670 -90845 28162 274528 76062
12951 153898 -111009 83875 -3280 5469 455953 229401 42865 -56740 -86353 32467 -62071
12939 -94658 42064 -174829 -316491 -289803 -272127 117574 -234599 -75026 61989 136787 133353
12928 133353 122649 231243 -90092 -239010 -115708 -25803 -168813 -122919 -49686 -99019 -43453
12916 90260 -22957 158271 -10359 381178 141832 167182 -4097 21314 68787 -128515 390077
12904 -86550 168026 39737 396890 -2119 -142694 -242126 51156 238375 -31178 37099 74130
12893 74130 325410 333051 124418 -198592 -410471 -49112 20307 164775 51046 -82074 214285
12881 62526 -43396 -56685 168897 -105295 151003 -327502 -129483 75379 196260 -279441
12870 326648 144151 146990 -92929 77784 74795 110105 264481 177171 87104 -45802 169526
12858 -132652 -81866 -94336 136462 212369 5397 -11881 -139341 15495 -156356 84677 27303
12846 283475 51153 125723 110385 -404670 188743 27280 -184113 101958 105687 303143 -56238
12834 29967 57439 -208930 32752 -49557 -69167 147393 -124819 136830 -203133 126295
12823 314108 138315 48081 -9826 210933 111869 30703 103644 13070 209734 -39171 62993
12811 -7532 -268186 -330721 135735 -187091 358389 325455 -176787 180220 -197898 -288378
12801 -288378 -201040 -240124 121272 86241 -2890 132686 -127721 -180302 -9523 91607 94406
12790 94406 -208723 230157 -537 984 32026 -194795 3360 134416 -13559 -25938 16126 271423
12778 271423 27016 207451 -371844 -111247 361643 144101 155414 424851 95751 -7696
12767 -91050 -57278 80492 -46896 144545 42501 5891 193499 -105496 -159449 15139 -317999
12755 59595 -103807 -95120 -48986 89385 -58066 10657 -109468 -23505 -147792 88513 213643
12744 213643 -140509 -152139 -515512 -226408 -156500 -60081 285146 507253 85065 208849
12734 208849 -59735 190784 -27654 76497 -269764 -104999 214212 295526 -98722 189522
12723 17766 -74725 -471900 51743 380329 251223 84029 -318375 117608 70248 -74294 -216171
12712 -216171 -182040 57046 26846 -19665 364326 -80709 -130877 302115 326213 254354 459409
12701 459409 57834 324735 201729 42651 198107 -31295 -266124 -183819 60673 399101
12691 399101 391070 226833 -127420 -56232 48711 301628 -239399 79990 71521 -163238 227373
12679 132349 -46207 -94367 21478 82178 59808 266375 -10386 204251 -7881 -172836 -37832
12667 149303 26546 63102 -54537 139031 106439 84893 34411 -20602 104322 11459 423995
12656 423995 190244 17519 -48213 -124564 126135 42688 -289877 -35418 10284 -376955 -41035
12644 21381 -80188 199681 139828 37041 258933 87533 -21673 3267 83661 -126934 270398
12632 94224 -171953 287086 -55571 114325 200242 115113 206880 -140 344758 134499 428145
12621 428145 191406 623051 157129 92754 29745 210178 -108673 82230 266746 -112149
12610 138127 425702 -4163 116403 214820 320387 131263 -80860 51489 359012 -141687
12599 23472 212232 -70438 106827 346755 -61972 245895 -30331 -140080 278015 215484
12589 215484 133892 133273 -157131 -21218 62654 136677 252949 -219424 304095 -130337 -99265
12578 -99265 113732 -127957 -68064 284126 233571 -162505 123209 -33332 40616 266773
12568 266773 40706 261586 -148905 -122391 238885 -202534 192179 196630 -95337 20175 -2185
12556 251534 65020 173708 51505 184233 -286924 343357 -127228 -153077 182185 -467074
12545 -140141 -392704 248453 -71172 194344 -244504 75144 206146 48065 151276 274502
12535 274502 14440 4398 -169883 257795 -125408 31328 199630 -28026 66584 277843 -24804
12523 133097 -17339 -143752 -89118 -249030 -104932 15057 190 -64594 33246 115185 -149013
12511 -105702 -132066 -424452 -210032 -187190 266498 -34392 -157748 -194213 -179781 269664
12500 20977 -234983 -3173 50624 75033 373795 118425 20038 -91093 118712 -48223 108725
12488 150067 41629 236789 223080 160229 7610 -60319 -199339 -38209 20554 -189873 174302
12476 204385 176541 115705 -136278 -345783 -85587 142761 -164358 -20863 60022 374094
12466 374094 -139014 203705 -315743 111595 -324307 -40723 -23291 -30959 -121762 -83321 -72780
12455 -72780 -208173 5397 58467 -39194 285182 154103 -169898 97465 106012 406 -184193
12443 90196 198291 -379107 -486002 129246 178089 31012 15475 91353 81907 -373709 -117367
12431 -27470 64036 -160176 -157188 -132285 378430 -125118 61813 -75323 -305050 -331867 -73945
12419 -142169 -58886 -159750 130068 -17109 -370197 143659 83517 -134658 167856 124453
12409 124453 508667 155320 108887 29816 312653 322253 -203732 104529 -39320 159543
12398 140477 44977 -334840 54398 1872 -34500 -109476 306193 -61647 62470 -223682 -85 -13680
12386 -13680 -118675 257950 221213 40908 -264048 -196681 -345799 -168672 30037 105153 36169
12374 48379 -46501 163506 41175 12028 125075 80826 -18940 -44453 181389 117077 -329727
12362 117869 147857 219807 199607 473700 17166 121445 -367378 -134598 75616 65408 -341929
12350 -283370 164746 110969 -383472 154845 16601 -230921 98606 95090 -14409 183854 225621
12339 225621 7260 -283747 7911 288036 277837 -356547 -17988 30150 185235 -90216 -98172
12328 -98172 -280550 3789 -87989 -7525 86121 -226127 42742 339159 -33675 -36843 213487
12316 22078 -97877 -118443 -26350 109273 128675 88891 -29917 213091 -118345 -169920 52966
12304 99073 375 364775 61423 101374 -159825 140704 207756 208612 198421 20425 -5623 -178916
12292 -178916 99665 39975 32412 -84958 131164 59184 366656 -62670 -187171 35043 -104362
12280 109523 -145940 11790 -21234 67767 92275 147897 32068 153372 258395 59010 -10287
12268 218971 72085 293479 260328 -133449 92517 32374 140599 121872 87027 189996 50182
12256 175775 -53157 145346 -34587 101713 255865 290622 64836 22440 -140804 170893
12245 65235 8782 -208272 -422862 236713 -300954 -33826 272043 259299 -150025 193807
12234 144776 -216675 18695 300960 109087 -21091 131638 93963 278201 353044 367273
12224 367273 211118 196291 -178407 174055 70450 75275 150578 32290 469687 -226032 235594
12212 -19483 275893 129295 94014 -157248 117711 -50265 337139 133754 118653 361268
12202 361268 -18842 -108218 -1033 103346 168137 223925 495814 3429 57024 -45317 -191169
12191 -191169 176153 -66907 92598 -162464 -4442 101533 -189993 -121459 202448 -46436 257644
12179 228948 49199 -54295 655022 288 159420 97411 -48046 -179570 -39906 -272860 27476
12167 98818 316228 151948 -193947 186516 494455 -242051 -108716 -22537 101754 -130377
12156 83951 360337 -195141 90449 306332 119737 58911 -47341 -227739 81797 5477 86454
12145 86454 -93525 -15916 219004 -30611 -111430 147877 83612 51714 -456558 83848 -43204
12133 192997 -13529 127013 203106 129601 -345087 -136319 -179097 41756 93660 254702 -266795
12121 -106726 1492 18258 -93909 -171649 258197 111024 29866 172766 451370 -42920 44142
12109 168223 44421 -84453 413871 89233 106055 246712 168820 -33903 109843 193289 62835
12097 -310959 -252044 18625 -55632 261294 -591206 -13494 -40125 52932 223877 347798 -6375
12085 78457 -328725 -232029 -130305 -62976 286627 92467 112005 2418 -257567 -225963 -172112
12074 -172112 177047 -186875 -294985 93171 -261481 -559818 -155350 -359560 -54243 121980
12063 329100 25014 645544 431235 908002 1019329 410054 328630 389108 -84269 107995
12052 160706 166681 -87454 -113393 -204 -96699 262304 159793 213962 185998 -44509 -61695 5654
12039 157506 47480 -437217 81619 172684 -126263 92743 35687 -231503 84372 -84086 82689
12027 149381 -155188 235522 -95458 -36593 -384232 77516 -144188 -36447 442112 -30443
12016 -88308 47104 -139742 -139351 -36802 -107511 103750 66318 45567 -11693 47247 188514
12005 188514 29849 -189695 344610 -176085 62879 -90528 -94087 -127030 -24630 129871 76533
11994 76533 -36781 188501 120858 -48216 -387965 -119991 -390527 -360639 -193321 -241140 64319
11982 -30475 -24924 111075 -344391 -12410 -217509 -398829 145181 33436 -44507 5687 44585
11971 44585 -164531 -248659 -243802 -146046 156512 -155644 -290540 133815 214287 -126543 286169
11959 -25067 39107 -94885 -50915 406602 -260214 -111583 15456 49122 -60565 -38932 220343
11947 39831 106102 145164 -30723 17440 92338 180645 34576 -538223 -67142 -147422 -35304
11935 -202456 249415 -172024 -20057 200515 -227800 -54453 -15760 109111 70595 194735
11925 194735 74409 169527 -281302 -377813 37098 55566 -122517 46254 -86885 118722 351302
11914 351302 128297 -368674 -303635 -303590 -283616 99148 -25101 -229774 345388 -194754 -85282
11902 -33439 7898 -14058 -136065 447204 188627 -234139 -64360 -1468 210073 -209065 -116408
11891 -116408 -329694 380133 -68366 43461 -288670 -67098 -45311 2642 230989 -32624 256382
11879 -179478 230916 73732 -154797 -230969 -89463 -106197 50542 -72724 -146190 25007 -69506
11867 -110396 -432367 -82546 -165312 -164161 53762 -264548 -4291 -289935 62079 -152045 157710
11855 100942 157268 174203 11087 -115843 137082 -80942 -94669 118513 180043 65524 196974
11844 196974 -324238 84916 27014 106401 -117947 -77616 22307 8131 308276 52389 -57113
11832 105143 -305822 -20247 -315282 -445115 -79768 -239487 -87406 -77543 -154229 -46766 -88731
11821 -88731 116760 -464565 -135610 212271 37509 -225968 -447116 -136126 -167616 -59680
11810 -357682 46737 132633 -14458 150866 -200914 332174 100716 -169883 -58004 -50489 -146514
11799 -146514 -141233 -60346 94082 -273533 -261209 -6191 -18611 140688 -338072 260788 246117
11788 246117 283079 -389165 -225353 -280492 298595 -24052 -221039 148601 3008 88824 69412
11777 69412 -206253 254385 248744 71433 135634 51824 -183835 -11679 -225301 42471 -18155
11765 77870 -88174 -112032 132769 -221612 189675 -111387 77145 -89108 -156135 105491 -159615
11753 404871 -232576 -216177 -27213 -44753 12757 -13124 -201922 28895 8209 229125 172103
11742 172103 470874 39927 -158308 153754 -5515 8444 -95309 25793 278176 -387375 -193694
11731 -193694 -201637 168940 180973 93222 -207546 -9473 3198 45784 -44520 -283197 85034
11719 106560 -41704 -106455 -13208 41451 275922 -110923 -188262 113206 -291915 287526
11708 -50390 -110334 241666 -31356 -96779 197341 119556 -123937 -151525 -36443 117063 -132714
11696 94635 -63243 85365 -60869 -298107 -123795 -70585 111966 198202 82018 -151136 60411
11684 -223253 295101 -135349 129099 372619 117392 147127 168560 136487 10299 44638
11674 44638 -15769 62537 190606 166066 -97603 4562 212519 -93865 -107613 -256834 52637
11662 -88473 -62833 16805 -181075 78309 -51305 -87403 -296105 137140 -217059 75385 -75251
11650 217756 29168 206357 -9552 -99254 -439631 83337 28358 -98135 186038 -14767 223302
11638 45005 353946 -276079 -79283 57337 -6724 -134678 176921 -44777 145447 -25708 -146510
11627 -146510 -267396 133906 -201998 48489 -11808 87234 -124368 -194804 -420135 120345
11616 -843 -118125 -407218 408667 -177450 -146853 241719 -23641 378091 32022 387932 8750
11604 -175323 22730 -97372 -1571 15836 214252 -96603 -205291 -211071 -369402 96796 25110
11592 80985 -24228 199704 -268179 -147770 -229228 -27857 96743 -122190 -253544 213158
11581 143904 304309 57847 218909 -231018 -39520 -94669 270474 -21086 -29960 245504 109590
11569 -391540 -136957 -202225 -173788 -8041 -18363 20349 -9115 147961 -262272 271423 320576
11558 320576 -313033 -83504 -177830 408113 -59093 -154257 44164 -3894 73267 -99303 1336
11546 9710 358733 -7744 -36905 42191 -69289 190874 79381 11527 -107774 -41716 103450
11534 -172124 111768 431260 139585 -1413 -62288 -181133 281766 42842 7052 112110 -9634
11522 -9128 105243 -31670 345375 -121653 -118160 169594 403881 -2542 193967 -273299 -61512
11510 -176281 10962 -208818 -176035 -60780 210729 30312 -148940 -30857 81686 98965 22540
11498 171446 225970 82449 5819 134836 225246 -38460 -84704 -121452 133605 146029 73990
11487 73990 -62943 -88566 286789 -167870 -205647 3484 98307 54563 99833 98744 197086 -139254
11474 180287 155371 2682 197310 276942 -211930 156882 109264 81062 165212 68870 -170475
11462 348637 137963 252504 -15658 2802 -42115 52234 -48507 6807 234946 -235697 146265
11450 -168658 -135916 -143290 153370 293194 271200 -5226 25339 99153 45060 -221318 287713
11438 87642 240602 161051 22626 87074 103955 -385 229543 8750 111776 -59922 -76498 -493177
11426 -493177 -31681 16751 105386 193187 329102 17185 -74175 85384 118758 -290462 -13653
11414 -169358 424996 104390 -104657 -96071 -5525 187448 -121214 236662 113128 91410
11404 91410 398938 43711 25764 470329 -246440 91792 -363590 141799 -106220 -103812 216078
11392 -220392 -202977 -50121 151568 228983 3840 -269207 154157 -118452 240778 -84845 -220987
11381 -220987 162497 -82372 -187281 -142039 4198 -277197 -264265 -269010 169135 -266369 -56399
11369 -131831 138563 43353 274570 -376437 -234060 -220062 -181967 -66878 277519 -68583
11358 24753 -53833 -69115 178050 -13031 -181471 -44426 -255911 -213294 -242182 25789 155399
11347 155399 -58228 183444 151621 193331 -115921 178839 -251649 -363134 -37553 -68164
11337 -68164 143502 74431 62376 -135619 471968 190710 -65254 -313594 -237301 -181881 44868
11325 -45810 -156995 453879 31404 550289 -20670 -86520 24000 -172165 -358415 168479
11314 46643 -341399 23703 -124150 129767 -117354 104903 84419 -147631 -223980 -60199
11303 54127 292165 -116265 -206452 23265 -166570 33443 -155309 10821 54326 22693 58885
11292 58885 57552 -25614 311201 -98533 101569 155675 -31819 -75296 -188709 80248 191195
11281 191195 -216638 -355273 18749 12340 285789 -223318 80367 67312 -455656 -44739 75291
11269 3395 -13237 270238 164099 188732 259581 132828 -59100 255426 -68796 39190 51210
11258 51210 -259110 84463 -257930 122398 -16807 -130637 38141 -34373 131962 -192561
11247 184603 -150427 121356 -32047 122795 186773 72156 122196 51985 178884 -89734 -201536
11236 -201536 -66139 32831 98903 -217883 112897 -2831 -208384 -157090 -240671 147070 47641
11224 -142294 -293523 -24655 -467801 159524 -130389 -170686 -205746 194691 160531 -75616
11213 -82767 51753 182193 -109659 -193462 -105724 188062 165461 -176110 -52027 -283341 200490
11201 -122825 40362 -177119 -38564 -207385 -138211 -35513 -241721 -118295 -108831 -324832 177514
11189 -300498 -245565 70338 -123129 869 121051 -150987 -89360 -295976 -95336 -167636 -289796
11178 -289796 -58673 105119 -231286 194899 238564 -54309 -309367 30549 199496 -189879
11167 268343 -321732 -274855 -54600 117809 -112577 -68387 19266 -247227 -197661 41742 -68579
11155 159584 -124088 -65380 -66948 107885 -470934 -97808 -203199 118553 191098 -301011
11144 -17082 239273 -22805 97199 -101027 -131267 261999 -245220 10531 -177375 -23830 150236
11132 133564 104923 203343 51500 79589 -89603 384755 -187225 162132 -28879 -11464 98259
11120 198229 189939 -129347 241561 136378 173198 -254860 -27538 157484 168946 -1040 -254710
11109 -254710 64884 -48600 93149 242221 134326 219464 134445 226419 59823 -266780 21410
11097 308079 144591 -8545 168211 100973 102676 87199 402482 101626 -68315 -42074 61708
11085 244596 175239 246143 -152047 444420 72310 187364 100705 368630 -251108 31424
11074 235083 155975 300269 542123 99134 508923 180240 408545 296267 138625 383056
11064 383056 166328 275355 381312 255743 427619 431056 321149 241820 454613 736603
11054 736603 724045 454243 594699 478310 357125 358996 931612 581581 489713 317178
11044 317178 687590 326388 590761 487575 424187 398149 456338 584499 573241 633764
11034 633764 432177 395221 744543 266155 320702 705817 635960 666042 368867 906798
11024 906798 566449 552240 317283 794282 585221 788385 712524 513482 654865 362489
11014 362489 621174 533225 748286 616758 341524 354572 341882 411140 511287 746353
11004 746353 474302 559604 457459 784767 894852 717304 566431 807213 460362 577782
10994 577782 517556 258805 842703 530548 370923 771125 883485 830915 760413 705862
10984 705862 884256 860321 649612 632868 1070083 813679 1095783 1079160 1219537 1431663
10974 1431663 1555392 2331993 1979388 2375218 2075112 2184664 2160286 1948155 1900379 1462008
10964 1462008 1322812 879456 1340673 1194694 1299491 1131729 1300282 1447079 1070584
10955 1070584 1185509 1322831 911111 407087 557500 537291 294111 327608 32569 206957
10945 206957 411805 4088 483912 87439 -100022 -19833 460067 -62118 523402 250206
10934 348318 -134198 58064 81833 -68747 530283 -54742 341439 306157 201692 6478 64741
10923 64741 75078 211373 318842 389149 -61673 410603 215304 -452328 -139288 240844
10912 184955 258222 64670 354034 -59629 9378 -322176 -20533 45077 7710 -91860 -220804
10901 -220804 -251089 31699 -126648 -197232 63451 64137 57280 44982 276581 -15074 -221304
10890 -221304 -465707 -43369 -157765 -29603 -133632 -14530 -316022 -116110 -41098 195650
10879 41405 81275 -129346 28858 7137 82341 77386 375040 -188952 -179368 11646 114026
10868 114026 -34985 -46659 157893 -103556 70892 -8517 109485 -345921 -308922 98650 -4862
10856 217410 -54333 -261851 193910 29874 160785 -64344 272850 17340 -191340 -282300
10846 -282300 -267929 -48210 -7256 91887 -148863 -141710 101266 -183040 36321 -89550 -37798
10834 -37440 -71745 142065 160360 -689 -99941 -33928 -416931 218555 335611 242652 44410
10822 -126452 536833 21096 -99310 -67473 -93226 -57773 9983 -120523 187406 226763 76259
10810 24705 -162363 -130980 -270571 142793 147341 -306788 13727 196756 -40103 -287223 -131839
10798 -220401 -168852 -107151 -53744 204361 -196587 40841 147057 -23910 82543 240295 -86596
10786 62883 179817 -41528 -134900 96444 287396 -122537 -182762 202825 -124920 -236988
10776 -236988 -145520 -82851 -295500 144899 119163 -72240 15060 -359344 -126716 21096 -2869
10764 -194388 -7711 76295 100632 -104041 -100807 302435 249345 -92012 -42837 81479 -18632
10752 256365 31804 -260754 -76680 -400164 -209065 -60030 -5700 167484 -2832 -469388 18257
10740 61262 122752 -285448 -69840 213398 -211934 108022 -66146 -313978 -86975 -82708 -99143
10729 -99143 45840 355152 -115075 -206716 -213920 64256 78521 -425683 370928 -129295 -134507
10718 -134507 -79312 -125142 -58549 -81556 -176415 -268460 190082 -1343 96687 -136439 215010
10706 81850 36813 -292407 -21939 320609 -69319 43968 72480 158366 163705 -121543 -168129
10695 -168129 -164498 -86657 -289446 -489350 -396897 -30189 210579 -94635 -373998 -19177 100243
10683 -208642 -167185 342393 -188196 -79278 -15806 -294482 -42564 -248079 -59053 -162618
10673 -162618 -4163 252466 -165015 359431 -124357 -32985 -122491 115346 172269 48676 64822
10662 64822 14280 72169 -143678 -37574 21588 -38013 -376995 65072 -107928 92863 12148
10650 75764 246265 -172816 213200 -86997 38639 -99310 -160804 -133211 5192 243112 -61622
10638 -47696 122347 11105 -38158 -366530 138951 119104 87384 -35505 -29133 -420370 70965
10626 -79010 17927 4202 -51251 42361 218618 -122691 -83352 118853 166390 123689 -160656
10614 -437057 -323930 97031 159164 103005 -155857 34408 -148509 -321160 260435 168654
10604 168654 -220067 232479 -227818 -85676 153805 -109317 245553 253316 -148805 -232320
10594 -232320 152378 -19425 -152948 91313 -327430 -298168 188818 -25185 60919 152171 165388
10583 165388 65414 -171575 -11749 102117 211715 -290966 247626 -258760 -174833 -255276
10573 -255276 1441 -213364 -194289 222168 -34892 -274785 -90543 -131695 35335 -429585 -120142
10561 126727 115829 148162 -160304 -82145 4159 147556 -87173 -162435 -49538 37432 -103546
10549 -270007 -4917 162219 -113343 66563 -207062 129200 -46968 -303383 61292 -158068
10538 -65340 -140783 15154 -117162 22416 -165645 -98660 26488 -392469 -3570 -52781 145046
10526 -129174 12082 -386807 120037 1924 -63413 -294035 14230 -50958 -12031 27889 2257
10514 244845 -63880 -163709 292326 76341 -179546 -102857 -124797 -149508 -216004 25353 218726
10503 218726 65452 -320981 -109346 -203521 -88914 12185 -429946 -50041 -289201 408940
10492 -99016 101061 -42321 -239537 -142640 324973 -235807 -385715 35020 -72186 -170841 331323
10480 144431 -286584 -146036 -97743 76233 344262 181289 -65983 -133264 -123990 -54829 -58580
10469 -58580 -73575 -326977 -21817 10586 46100 -196618 -51556 9902 150326 -131654 97040
10457 -221290 45263 51892 107617 -58451 -443114 193747 -33025 180314 391594 64872 29397
10445 115880 43392 270870 -26679 399289 -240955 125677 158784 -82600 -526046 188732
10434 -155132 -167354 172702 159189 225853 129569 33005 -117033 -164131 -50012 -47016 -42621
10423 -42621 58185 -211676 -205848 94535 -175198 85339 78905 -241224 132676 13150 -306384
10411 161801 251743 -163040 187823 15798 39257 -199484 -111370 -23338 -41147 -26809 -11252
10399 -131364 251206 67578 -250154 -261242 171911 83619 43095 97207 355377 22540 -865
10387 -33528 -116982 -58382 -225213 14333 -202112 -34447 115279 -255739 323842 207988
10377 207988 474453 85684 178423 175168 177446 243564 519742 -165829 26096 186213 154376
10366 154376 285968 721808 249830 288294 126228 74603 92514 213821 26035 -251010
10355 8603 -50657 318709 199321 -90513 492692 201319 580229 363888 370362 288747 -169541
10343 30194 403557 204307 131303 -53617 99715 207430 -44442 528851 149723 49641 288557
10332 288557 237649 150058 -54971 139715 -128679 329673 -205548 -23850 111529 -14124
10321 145504 -135608 303856 238012 213413 158324 33317 -108136 -5324 -56268 -94305 147375
10309 279194 286090 -111849 209798 -26917 7501 52174 7313 -287479 -142339 298573 1278
10297 230609 46644 -241926 -126488 -309678 56091 -406004 39867 -85265 242019 -67215
10286 -127301 -309994 -134148 -243371 -483829 96839 -155850 -81959 -5195 85729 -117071
10275 -92962 -357443 209711 -26707 122423 243861 42132 195373 -75787 303678 -77005
10264 23286 183404 244757 -224451 310445 189548 25135 192041 143655 421488 361949
10254 361949 312466 128150 358327 81991 7669 185994 -151012 -5581 11094 -4588 55249
10242 -9419 -10690 -2134 -448143 -602899 -114683 -140982 37972 -536411 -141902 -35053 78990
10230 301077 133339 -7667 -37616 260765 -452236 -138491 157532 -105618 124820 -75478
10219 -272721 79721 153024 54708 151546 148925 -142792 -90362 82271 -147847 129827 -226753
10207 -32183 -361121 138053 -58715 -61536 -185364 -6340 77611 -465363 -93680 46994 -1565
10195 -160484 128806 -132470 -289864 346067 -368237 74784 -134417 31015 -257034 168145
10184 -11769 86820 -223541 -19344 -80341 -291240 119889 16470 8282 186172 16435 -140258
10172 -332841 126268 -124707 28642 147012 -123120 358850 51100 365494 -155124 274787
10161 911 -143249 183842 -372418 -303502 194256 145705 -78037 -215158 208607 -571740 -224534
10149 -46641 -228571 33195 31445 -202613 -404903 29821 -369952 145529 43256 -193647 -86435
10137 -18202 -13726 -135409 173579 215891 70046 -94983 59213 -399110 24395 -8438 138817
10125 162413 -382995 -215785 -37631 -162790 -193936 -212921 -189042 -335974 5560 -126180 -47721
10113 -60324 -710441 48175 -124570 -11410 139993 56210 -330316 -41179 -146440 -128327 132952
10101 -151868 -143392 -171182 20253 147479 -348578 -71365 245509 -52786 2985 96554 -181381
10089 -391452 -153793 -21788 8944 4475 -229809 -71215 -309010 -48890 -51370 -36931 84374
10077 -66738 222398 -119152 -125557 -125777 -170244 -52511 -47696 -156712 -150091 -161520 43339 -19684
10064 -150450 -117226 -19303 317742 84694 -94078 54112 -65879 -116204 -217525 -78719 -236191
10053 -236191 -72671 -90859 77591 42041 -50801 -69065 161987 -204036 188201 -104186 12795
10041 128210 57510 -71788 106578 -359088 -33131 22124 198708 369480 -216263 -29092
10030 -250405 -16387 -204241 89258 -115792 95810 -296450 39980 -110063 -13081 162952
10019 133167 152742 16020 -470628 211792 -223915 8720 51333 -130430 -144947 -397037 -273907
10008 -273907 -246636 -138327 -277476 167552 -98177 19140 89407 -85946 -235358 -198202 -102521
9997 -102521 95522 -94840 6301 197472 6285 -151709 175587 -293278 -32661 83840 154197
9986 154197 -21782 150178 -126824 -110136 -416313 -150497 -118078 -198866 -320452 -190944
9976 -190944 -176887 -85681 -408091 -234383 122522 80878 -242622 -147453 -347339 -142819
9965 96031 -91510 -59059 -181759 96237 -318003 -115044 32800 284385 -187467 -248845 25199
9953 -106387 5547 -309209 6034 -265676 -193793 111708 -393383 233221 96658 192148 217223
9942 217223 -113527 -63056 34719 -29054 60015 -205245 -34421 135338 1659 106196 -259881
9930 4801 -76958 -35404 -437945 -250160 -176214 -166354 310656 27879 6683 -155874 -31355 -4339
9917 228005 67168 -111165 16270 -113151 -88336 221920 184992 -173339 -3665 -74488 -359805
9906 -359805 -150803 -160223 158363 59588 193438 -186110 -181760 -92758 -335646 -85579 -59223
9895 -59223 -222671 -376899 -119463 238013 -41521 -30649 -108492 -162146 -79812 38842 121915
9884 121915 -288233 355319 -200973 -9490 181530 43953 -7005 -12057 62892 -262792 189572
9872 -312319 -112377 92255 114203 -167696 -433593 -326716 -152272 -217613 -219344 25104 149686
9861 149686 -200899 -363192 -93080 -119431 26869 -675456 -65515 154275 154728 -186689 -414988
9850 -414988 -138242 111709 241347 -138569 -454284 234126 -36818 -22769 35918 221098
9840 221098 -70282 44204 34624 -80590 -267368 -183759 55157 -32648 -192247 -124365 -85037
9829 -85037 -303374 -253318 121313 -193229 -41414 191103 -136852 -167727 114893 -390756
9818 -184054 371536 28600 -196985 -227429 -24801 -95751 314080 19287 -52470 -172001 -150250
9807 -150250 -232925 -265377 -151732 173352 36510 -120888 218074 -102579 -30062 -298859
9797 -298859 -124159 -214717 -84178 3051 13392 -106451 -92765 -115222 -122405 159590 70574
9785 -28320 -88580 -120993 -72909 25498 182528 -118330 -17429 -362286 -189999 212196 -297024
9773 28522 -14852 16671 -19929 -24528 -166435 -209788 164483 28429 -136020 -48461 24975
9761 -324399 -61993 -131256 -346379 87040 -20465 -78627 -245047 -235976 -284251 25385 -131456
9749 13162 -174067 -192872 -53195 246828 -102432 -190296 -86505 129954 -56815 -118641 -43568
9737 -95338 32774 -307206 90215 167379 86806 154234 -123832 164306 -197459 -184668 147558
9725 107472 -83228 -30775 -30394 -279913 172184 -379520 -222420 -13488 -178144 138738 62611
9713 -59608 -76495 27859 102763 -129475 113137 253262 -296248 28077 25162 -150220 158412
9701 -65747 124719 -283776 -106481 91940 -65334 -435194 131947 -138245 -168715 -169233 14641
9689 53861 28466 60905 -430275 -31849 47176 -102576 -63024 -10577 -64636 -186910 -100288
9678 -100288 -101484 248939 -41050 -48833 -386114 -162346 -24687 -131426 -153905 -218699 170555
9666 43867 197795 251817 -62371 93030 -261852 -294100 -141909 80543 -74335 -127971 219806
9654 208763 90229 -77911 -310348 -296951 -368480 -17859 -236907 -204079 446 106464 -72070
9642 -102256 -271958 145 -86496 -149463 -252392 -250265 -152875 138371 -91098 108955 87824
9631 87824 -102681 -10701 75521 33286 -16762 -54011 -152644 -105436 -51696 -153023 -229202
9620 -229202 -154381 175346 -366945 123807 -81296 -133947 94187 208520 -12632 -111679 86891
9608 -213847 -87277 -131728 35356 -31401 -80250 -219550 -186984 241916 233318 58031 -39201
9596 -66754 -356569 148020 66207 82290 -183738 -91517 171373 -51884 163437 108839 -172502
9584 -129047 -175597 -39883 75577 -11650 -196001 26930 197055 -27906 62658 -177931 183526
9572 177198 60616 -100424 -69429 -82485 -7980 -126419 184315 -112388 101721 186366 276782
9561 276782 157108 -187783 -59585 -324249 -302308 128293 -171348 184309 25901 -132420
9550 -358810 -166289 -118952 -145494 -319338 -30839 -102273 -396544 -138133 -28607 -148768 -61587
9538 251854 -476654 -261875 -91805 -91495 -26281 -70020 -239531 -131913 -54484 -33211 -178091
9527 -178091 -244387 -209224 330847 -301449 -6983 101746 29616 -50834 -15622 -86507 126955
9515 -130041 -572026 147976 49895 47433 65902 -154369 -49379 180949 -296405 4521 60079
9504 60079 28348 117922 -135137 296405 148130 -116384 -146739 129381 -252464 -38343 258514
9492 -241371 -1310 72330 -93855 -130326 -156740 158535 227085 75456 -382281 -92470 -103465
9481 -103465 -176323 -124235 -493652 47690 -295379 -342458 -28917 -23612 -170290 30136 -248202
9469 -590141 -243535 -121501 -68902 133345 -9271 -330285 -86736 -165317 -228739 236245 -123527
9457 -95533 -59326 -157200 -333097 -203080 81593 -78799 85385 -111 127384 127131 -112839 -113128
9445 -113128 -24184 -85689 71168 211465 379571 222860 87855 -24576 250379 -84420 -73750
9434 -73750 62668 -109009 -179785 66998 -9963 21125 -289169 -23115 -43532 -41051 -191462 -400368
9422 -400368 -29982 -66368 -67625 262771 147336 53103 -466 -326262 221631 116952 -30223
9410 -159778 228294 -130491 31000 188169 -252881 -391937 -82615 78972 -91776 -73560 16275
9398 1430 23874 -206119 265407 -268173 2997 197489 222107 172319 202 -155306 18711 24014
9386 24014 307053 -282475 -107190 -108347 -98147 -12051 133286 25026 -156735 -339447 65646
9374 69376 -57950 -27236 -213019 301898 28200 60616 -186967 234847 -49768 -236635 88640
9362 5699 -442294 -544486 -309762 313577 -136513 -8635 -81200 -418396 -63822 -318073 -24103
9350 -104842 -134188 -81864 102332 -243505 -162388 -146905 83010 -162066 106219 -223190 -68615
9338 173983 100531 140139 -71726 -471 -126623 -207598 285596 345919 -221224 -239691 -74447
9326 -249573 -313582 247167 35160 138106 -160323 -101025 -27557 -2436 -15250 -101248 221075
9314 23594 243138 116855 196728 1470 -146810 46553 -235218 -10309 -534833 -183603 -576759
9303 -576759 -178403 402488 -311447 176274 -149012 69634 -49132 -152589 -227370 -15702
9292 -50064 -326216 305902 140645 -20724 -15068 -97547 10571 22618 -127685 25058 84856
9281 84856 -358546 -135926 -120484 -87605 222409 -343821 33336 -146601 -28948 -104068 49313
9269 2193 -43015 -297499 176559 80219 -230923 -141266 394852 32594 -113782 -398778 -210916
9258 -210916 -217529 193174 -332349 -143198 -540050 -154138 89313 -1654 -212162 -197763 -24875
9246 45668 -97008 -232889 -142007 -55383 -292978 -453 -371445 -310051 -145094 -129316 60855
9234 5247 77380 -12507 213982 -211807 -109786 19226 -305083 233233 64387 247886 -72933
9222 -293377 -20661 178725 5045 -57358 131447 -21029 -73288 -328693 176872 -159843 318559
9210 145852 -239508 -65823 62448 14694 -15013 -100334 -326028 -117421 65013 -16968 -77702
9199 -77702 337224 -144021 -83053 -47474 -543099 -526321 -126383 232815 43660 61380 -46270
9187 72750 -124408 -291809 -251343 -18509 -99930 -5106 14857 -530928 -118097 -276239 -246953
9176 -246953 -12120 134973 -89540 -371659 -179925 14857 7419 -195978 -74163 -164688 22518
9164 -227509 130232 35659 -251316 -5871 -367079 -121607 -6283 -133939 -35459 -188434 162094
9152 222392 38213 4898 -145883 122471 -101463 69395 -83870 -331551 123283 -72584 121655
9140 -383297 -36462 -305377 162373 72750 73625 -137661 -16720 -53639 -55046 -118585 -12947 238956
9127 50696 -167657 -114792 -148170 -174894 -179913 -41877 -73541 -57242 292514 82567 -252276
9115 -100397 64976 -194098 -219612 283685 9613 58687 -147333 1733 -189543 55810 21161
9103 -109183 -23759 184051 -117124 104613 -353083 -268442 -41988 -79594 213624 21183 -242635
9091 267851 -130721 -74750 59494 -130609 -172701 145983 -411691 -252162 -172154 -281232
9081 -281232 -60464 -10697 -314460 -203475 -162581 236381 -170703 -165724 -261510 -57005 97033
9069 50302 -172044 292559 38787 -234998 127832 396760 -227383 181660 -113737 5085
9058 -24715 32966 72416 36410 -131759 -89719 -16736 -109115 -68086 -227286 -203012 330291
9046 -63675 -251401 192715 -167677 -38186 131761 -169730 71603 -338548 263408 -46269
9035 64838 -188208 34910 -96817 244848 307432 -88152 222270 29367 78927 -71021 112168
9023 201795 -220381 -153642 -127852 31966 -78771 131983 -73884 192578 46141 -437469 123448
9011 -79834 219979 -231166 9574 -266296 41794 146009 -180535 68553 -253574 100363 175302
9000 175302 496710 42016 233384 -108182 -181794 64206 97135 30535 28287 112840 -210384
8988 -190554 -24201 -58799 -24643 -572768 -72465 53418 114452 193896 -360784 -256686 -47922
8976 -309533 194075 108060 119809 -427555 -107985 -296978 52172 -16210 -219380 96895 185640
8965 185640 -78456 -160030 -49811 -43631 -170271 -175275 -252345 5805 55630 96054 -129814 -123804
8953 -123804 29241 -182666 113189 -270725 148290 -321968 52465 -60652 -63259 -64605 58182
8941 -438466 -295364 -84739 -75641 -234638 -18684 276213 201564 192515 -150964 -131111 233536
8929 -147196 -139707 27772 61777 175628 312271 582043 1447057 5193127 18974953 8425024
8918 2194005 584437 444069 198929 -156330 -49141 -47242 71829 74627 -278547 -97558 167189
8906 315181 -57743 139247 59773 -117131 -97423 34816 -52607 -304029 -35755 -211222 -63939
8894 42971 -360484 -98441 -10828 -137485 -19023 269648 -122528 -175760 -350262 41833 -181445
8882 371360 -255411 200232 -22353 76141 81598 25345 60210 -293778 -56016 -136280 -87878
8871 -87878 -195840 -414715 117470 -46782 -410295 -188729 116370 -23683 -385979 -125548
8860 289013 -160885 144613 28917 92891 -90742 94585 -2782 49937 101065 216225 -305859
8848 -635646 83594 -47916 -249085 -239847 -82552 122937 -180329 157359 -184573 -396933 -329468
8837 -329468 35923 39071 72109 70657 20516 -14086 82788 -39424 26005 -73087 -288272 11955
8824 -489960 -51037 -2827 219462 -82009 -340713 59395 55894 -42120 -84319 103575 238802
8813 238802 -260962 -197476 62405 352102 -65488 40759 -65127 148885 33336 -12548 -134725
8802 -134725 -167542 -157417 142517 -186246 -76623 -23747 -116012 77296 11076 -31223 -195926
8791 -195926 -204373 -84783 -246110 92245 67140 128440 -198175 77996 -149979 -17512 -139776
8780 -139776 -154148 29003 53043 226748 -48247 26667 -117021 -21290 -223350 -139222 246958
8768 55906 86372 -166401 6335 -194626 -11952 534629 -453935 -132698 -66281 -9315 -347281
8757 -347281 -675439 -87089 19024 -156906 -250886 -150616 41917 252506 -278681 -189401 40592
8745 61653 -188222 -224900 -276710 -56270 -21363 -489476 -262311 102117 -63622 8199 -50788
8733 270223 37436 42535 -107051 -73353 384754 -91421 -2611 -29451 170174 -75597 306178
8721 -105832 -72305 -140756 -7830 -129498 36638 58130 155696 170636 116635 -89088 265790
8709 -132509 11318 -84952 207327 -88322 276571 265518 -239446 -146779 28531 -120117 237756
8697 395798 611461 87543 163085 141899 -523640 -73524 376853 -9733 -378186 -629078 195614
8685 169482 -79466 -8203 -375564 209972 -487892 180410 -147584 157475 -160700 -15562
8674 211066 273042 158393 136170 -312230 276350 -140601 -16809 230103 288856 284108 -163336
8662 -192926 -70841 -59192 -94681 28474 -135308 -79542 -239501 -146461 6025 -6855 -158419
8651 -158419 -510913 -50259 -29372 -203764 34964 238491 -132415 -174701 334427 -144675
8640 -316964 -33753 -354389 -1349 77567 -318913 -9749 331242 149007 189704 9679 90229
8629 90229 -119897 -206046 -27299 -223093 -549523 -221282 -569763 7437 -61206 -423022 -66172
8617 162570 -63017 26026 91902 -7226 32916 -117923 -196679 35982 -15217 55736 79463 -105934
8604 27807 -165866 -50641 -98975 -60583 149141 -145075 -122230 -21979 -23707 407499 -109793
8592 222080 240309 -99608 -61852 46145 -246864 -18015 -325478 137418 55912 156274 -21251
8580 307860 146533 118010 -125667 4895 310505 -248260 46875 -209141 -156784 87424 3016
8568 -44689 -15636 -37678 36198 -404089 144938 -68585 -68802 -99163 102806 -82178 -329106
8557 -329106 -225784 204512 -71779 201180 -244187 40826 -205016 -205443 142128 -27754 -111909
8546 -111909 -71177 89140 347766 -178603 -40623 -165772 -257547 -228550 45278 -64531 -964
8534 -113011 -101688 -210643 -247965 -483548 26335 -83547 222286 -173747 -62068 56983 46339
8523 46339 -324119 98583 -35289 -151397 -107706 -83258 -93394 -375423 -275604 24025 121364
8512 121364 -191422 150418 -74939 21696 -87602 6669 338788 123137 98262 -218077 93327
8500 -129838 -332532 167245 -56009 -297889 -103686 -256118 192750 27673 -146261 81444
8489 -153056 265671 -232536 -363825 302524 73224 200944 -105273 191229 -202744 -82466
8478 472701 135239 343155 -364535 -264105 52503 247256 47085 96946 262277 -19586
8467 -77795 -104389 -178519 24042 -201492 -143060 -312824 -213895 104428 -273360 147683 -83037
8455 -48638 10422 -174061 -81064 -366894 -174713 -91829 -69245 23922 149957 142725 -126793
8443 -84795 209087 155804 170273 197627 -123382 115716 -107117 179738 -280410 121409
8432 -184440 143802 -39088 -76959 138801 173671 -272229 50231 118735 -59159 79861 -190809
8420 -371525 186332 -264078 58929 -93047 -50530 -34446 127628 -57721 -78979 36664 -157127
8408 9639 39804 130881 -50912 -39910 274182 176823 84781 -69981 188914 32618 -71879 -267057
8396 -267057 -177549 144192 50421 -73390 223446 120656 68148 -31704 -456461 217416 -82702
8384 -269083 -137566 -201911 -189930 189269 -239663 -176631 -44365 -243004 -153185 218818 -194091
8372 -35795 -113945 -487807 38773 222927 -222194 -89400 -19514 -145550 -191192 -128231 -129691
8361 -129691 72372 215999 -60331 64398 -139332 181252 186336 22424 -432745 131142 -35751
8349 151665 -115027 129530 -61242 39567 -204964 -121065 -216302 84835 -41637 301362 85864
8337 173327 -245282 173773 72374 103922 -71128 -318612 202499 -175818 -74464 -297679
8327 -297679 8861 -108140 -87340 -79044 -29122 -109068 89211 290792 -285429 5717 -122538
8315 392342 116935 -139249 -4981 -138950 -275863 -80941 -45917 63637 -195498 -140786 101513
8303 -253238 92847 -61022 260357 42334 73501 142627 16273 49298 -10837 -516008 -181295
8291 -58895 -86141 -198887 -124323 125878 86058 144924 227128 140593 -194631 5558 -86700
8279 249661 85970 -217630 66567 -166708 223518 169000 -376156 -184907 -173589 -24862 -77269
8268 -77269 -25052 -69388 -263518 -196003 -75742 186798 -14128 -16119 34959 -233018 143830
8256 81004 -479814 -358214 55848 268897 -290676 -180367 -464707 -198338 178700 -116315
8245 197126 -137168 -11614 -262565 48745 168391 -140668 19323 -78810 -60452 -105468 130886
8233 -107087 -60241 -175264 -363878 11417 -39355 31510 -83944 -114870 -171274 218721 30880
8221 -55344 26715 -264245 -161464 -72958 246425 -349567 12179 96625 -337143 -190071 7011
8209 -166647 81193 -139036 310347 -245260 -48389 -81407 -43970 -346750 197148 -381300
8198 160207 -157998 -30999 143474 -336865 47037 -76444 248067 -271612 -248248 -82460 182756
8186 -16918 19551 -113658 274122 224722 328529 -16351 -73814 73774 213369 -112299 -196811
8175 -196811 366600 -45860 -404534 -134675 133089 -225620 -4549 -163464 325343 -92659
8164 -14101 -23519 -6743 69824 -250208 166419 -423802 220655 -112924 179162 -20225 103624
8152 -78357 -494314 122153 -89964 96479 64077 -212652 68163 80592 -264836 -164614 -226094
8141 -226094 -120405 -122335 -231421 63102 4598 43783 -203611 66759 62925 -14815 129511
8129 -336887 -46659 -94432 24578 91393 -175733 -60468 26138 -195191 19598 -49585 -164170
8118 -164170 103537 -130642 31456 335896 -223631 -210730 118041 -201077 -226646 -183796
8108 -183796 154891 100851 -303034 123342 -13558 -155964 -20334 251946 -148676 -86974
8098 -86974 -32745 -12756 11402 -62035 -166586 -83912 -122900 -40894 17921 138708 96988
8087 96988 -186007 327058 59468 263410 -91762 79003 -109958 -412940 -194791 96439 178304
8076 178304 -57815 90588 -21448 -109074 -85989 372658 2452 -472193 -328669 -401523 141111
8064 -363281 -148644 156070 72105 -16587 -41843 109894 -9669 -240184 -204030 23368 -116472
8052 46889 -79748 161074 185314 -7951 -29354 -85785 89893 95101 211707 -65308 -57566 90847
8039 -1481 173390 -130627 291038 -161043 -43580 336941 -322246 -347487 -449893 -366986 -81659
8027 220570 -70017 141012 -304067 -138522 -5427 191387 71304 -63024 231889 92558 71770
8016 71770 70127 -246075 -54116 5256 -159513 -424738 -130675 15080 -142391 -210484 -41515
8004 -84323 -78562 -330400 -183489 29357 -418618 127152 -120709 -306525 -367475 -107384 -108473
7993 -108473 68736 -127965 -41071 -140549 -228342 -249234 -261396 -12411 85553 -171389 22992
7981 218851 -71599 -98015 -4202 -92759 -127603 143045 -89349 137217 -295097 -368276 129688
7969 189018 -112385 -30539 -220818 -13917 142316 -328406 158402 171790 -147222 -243150
7959 -243150 130311 2634 -3793 -85676 272947 73737 -75067 146961 -258525 147484 79433
7948 79433 -255902 80708 -392603 102581 42339 -296500 18536 -141317 -148423 339693 -329350
7936 22213 35570 -432358 153845 5571 58969 323298 -183720 87370 -503650 281813 -15333
7924 16076 -108808 -295750 -27307 -182455 38491 -3967 -75475 29577 -29929 -33604 31271 84775
7912 84775 155602 -71223 -271941 -15614 39982 -141907 -230899 -83969 -445894 -4387 154904
7900 -3689 -133946 -151096 -73144 225328 -115216 42608 86386 102932 -64544 151653 -245041
7888 -55635 -136272 267025 -207726 -147685 -240404 52155 -82422 106667 306556 -83890 -450291
7877 -450291 55698 27670 325741 41172 -312446 39734 30414 -313362 -30579 90660 96742
7866 96742 -48611 -89299 -79301 -183034 121571 73129 -17984 351451 46847 44415 18637 38969
7854 38969 -134885 61727 -65735 162494 -93898 113259 218381 114439 -258925 -228181 12604
7842 -224444 16346 132857 -189095 136616 149260 -224507 7814 -26856 100623 -136822 -250591
7831 -250591 -181542 -175397 215743 -52341 164907 -32762 -482636 -31435 -250302 -178128 -67716
7819 262165 790 137179 131594 -59381 -129833 85212 -103631 -273595 -171196 -420587 -189312
7807 -268156 -254936 122104 -221117 -112654 -66848 -118708 -13927 211215 151497 225591 -57545
7795 83131 -216635 -259658 78174 119510 13765 336154 14789 -43118 -98802 -105978 82994 165555
7783 165555 -43007 97752 109944 86561 10325 237800 -6136 -76933 -101178 -98685 -136506 -172979
7771 -172979 2748 90586 -92951 33512 28936 95061 243333 314107 -133718 141942 -154239
7759 76429 -244088 -21241 28954 198598 323911 -237456 104241 22386 -380916 -261606
7749 -261606 136373 -106365 178063 111406 138895 -34041 80677 -282347 81444 326709 -243793
7737 -224035 221241 -69501 -108846 -17379 -176724 104070 140861 -53556 -68765 100468 -246045
7725 -89499 -64472 -332995 -197834 87545 371829 37689 -47324 -45354 -136917 -18530 -269676
7714 -269676 -19810 76655 -53003 211691 67251 167250 56259 56821 -224152 80586 -89317 33168
7701 -134059 399806 -160668 -227354 -10297 -181510 -215899 239084 45583 -75144 -106097 -17697
7689 121368 -85091 -127311 62955 230831 -128464 -100391 229899 -34082 -357885 -192176 -7385
7677 133994 54949 -171406 1590 3598 -41899 128920 -144579 -43024 160802 -73718 -215679
7666 -215679 104185 250405 -107402 -114224 38912 -178629 -80197 -69842 -91120 -37348 9019
7654 -73402 66842 -209094 -151920 -141910 71619 220841 -117078 -36954 -117933 -453581 120305
7642 -298634 -479898 66453 40813 -11131 37583 19559 152848 4413 36372 8203 -137622
7630 -15252 -205560 -149559 98450 -135098 -160555 -22356 -504612 -135228 -83213 -248667 977
7618 -171199 -305418 -315058 -254710 76630 -7912 266547 302797 -149028 -75460 -182799 -4588
7606 -280061 291536 -26691 -56199 -233580 -253289 -87765 -71282 3996 355799 -140130 72389
7594 -104098 47157 123336 -109168 -134542 -144395 272811 -88459 -451913 -42517 -209457 -12176
7582 42791 70093 1930 178509 158427 61017 330325 -209222 -8376 -28328 146298 -152813
7570 -49085 334815 -130326 -76950 -324959 4464 95549 103418 -42524 -177813 122192 246788
7559 246788 -20308 20441 -187728 -153775 -4841 63860 -321413 2681 140322 -277204 64675
7547 -15475 -27156 17400 -103124 190338 -135672 -314555 347034 -7095 134888 -365299 -171610
7535 127428 -127216 16366 -205019 20704 74762 -279533 50731 -38518 -206761 74973 -92335
7523 105805 -341338 -292404 326925 -31017 -188151 -453814 -295865 81636 -177283 -190198
7513 -190198 -61312 31453 -31977 -251264 -192425 27513 -42738 -69391 4305 -41026 9979 82144
7501 82144 -207132 88336 -89986 -318036 -11187 268292 59869 149938 -14270 118076 -140419
7489 242219 32429 -659562 -133775 -203908 -213447 -256397 -95064 128260 262420 11607 -2465
7477 7557 50549 -111336 316834 106374 45073 -116208 91739 -56224 152010 108481 -1432
7465 126859 361186 117281 -74612 -54988 2662 -106035 146115 -204210 -234764 391751 130774
7453 -128682 -237638 -220106 -36753 -15058 -196117 142440 275994 -71347 -19255 274973 -31436
7441 112874 -49662 44754 -292301 -26518 158059 -151271 42546 -100979 156219 -57137 -144811
7430 -144811 213426 91537 -127018 -325150 8612 -41463 186564 296083 213711 137264 -233784
7418 -67780 -112804 -7843 -20174 -182745 26440 29261 48174 -323347 231436 108668 170442
7407 170442 68472 -336604 295780 -90936 -104104 -120878 -304441 -126223 -58401 406510 -43560
7395 -372711 -243210 4979 61984 -117631 32773 -119832 -147713 -33790 -92286 -44988 134100
7383 593825 -170567 -14858 -56065 -398435 47872 -127606 -147184 -92997 -47825 -354783 220923
7371 -151387 184473 194679 91571 157667 7335 -169685 -35663 -144134 59540 108319 192878
7360 192878 -280482 -266363 167400 270084 -205368 32910 -233661 248537 -75087 103039
7349 -224748 -29856 271143 33644 -149042 -142213 179445 -327479 130625 -72308 377162 -86736
7337 -19252 27861 -45883 -63058 -41324 -16065 -196827 106348 -315920 -258187 -83021 98030
7325 -115976 -293238 -146291 -211167 -5782 -169637 87371 -349 328022 -139425 -181756 174997
7313 109131 26531 108675 -336691 -163753 -73028 40682 -41014 -95830 94397 201188 -151639
7301 46556 -166474 -128364 -68434 -181262 -93853 -19996 156986 66370 -265631 300420 103226
7289 63334 -46611 230711 208632 115089 -484585 14486 -128632 183728 -176205 -75755 35248
7277 38592 -32886 23436 -84665 96995 -178624 326902 178652 -117508 -144886 -137662 -41078
7265 -305920 14784 289705 3194 88144 122838 -123423 -46920 37918 -32970 23798 -391534
7253 -237420 -225783 79 -112007 -63283 -311619 -100656 -47087 60257 -413673 -43619 -49792 174433
7240 -87300 -115482 -277445 -116939 218999 -125975 -26653 118397 -147936 134889 237949
7230 237949 -238517 -248595 -149867 125243 217311 -208791 368221 -35628 67364 87918 -11827
7218 -65704 183751 -59292 169650 180183 -142311 -75531 285531 105858 -55200 -179664 47602
7206 -124321 -318907 -174912 -3497 -364799 53474 88447 -324169 -25843 167743 -65792 166900
7194 -57895 12330 -219134 -163401 135067 -125005 180415 28141 -12803 -271399 151982 -81290
7182 -151705 -84438 -65248 -97625 -166318 -33111 -233117 -122430 11035 313099 68593 61267
7171 61267 -217993 -7110 -146825 -137511 -71647 32223 337444 147808 -93432 -85360 -29277 -27517
7159 -27517 -139850 34923 160330 -35445 -441359 256766 72161 -93476 -139876 -428195 105467
7147 -200409 113602 -100859 -135856 3638 150240 -86144 -49852 14376 -90077 -273888 211034
7135 24287 956 187114 -210253 27912 129105 -97001 -24676 -190300 -82646 90978 -81288
7123 193767 340943 -66056 109729 -109234 54630 -1957 -11646 260725 -10327 -64644 -63170
7112 -63170 -308169 131327 -159865 -47283 -466685 -94551 236068 287444 -174887 -137738 -52358
7100 61569 -140860 -329626 -241764 164006 13223 -174285 31925 7463 -106796 -232365 -309847
7089 -309847 71072 -112825 81441 2625 207684 76532 101139 66611 -309969 219791 -46500
7077 73200 -160519 -29389 223225 174950 -99251 64221 -239161 -360418 -112212 -233463 -227639
7066 -227639 -444458 -72834 140390 -90081 21810 104260 -219178 71433 28379 205805 -193852
7054 150082 129431 -183917 -136150 138158 -117620 163798 65534 169452 -40187 -174147
7044 -174147 -160106 -27077 -190493 -27649 -144294 39656 -185273 82891 198352 -259672 71275
7032 48358 -39406 221629 77844 -365353 -521209 51267 -282933 -105185 243486 219991 235870
7021 235870 141613 32479 -15601 215838 52860 129524 -98183 -776 -334679 -111768 70545
7009 353685 74225 183222 334119 78031 139888 -70746 7309 -214352 -131501 42850 498328
6998 498328 17444 -129991 137793 42871 -258073 86469 -99052 208328 -40244 -263123 -226977
6987 -226977 -103567 175523 -185688 -7370 48836 -26045 -288401 256152 -81218 -361007 191280
6975 -118770 -196144 -173394 269376 226767 -82450 -103171 -44439 -76180 -167302 -73012 93824
6963 -13309 1414 142857 82738 144417 57689 -132478 -3027 -123392 -342520 -279548 -59070
6951 -57588 65931 99106 -101767 -148509 12077 88318 40057 94009 -110158 2683 178071
6940 178071 -54015 -34438 -46339 -106929 -148014 -14855 85831 57085 -201558 -384256 321105
6928 -273603 94966 7131 -136061 258953 -166096 -53132 269568 28765 22378 -11715 -180729
6917 -180729 38542 34809 32607 -483899 104411 328277 -40222 -192764 78219 -70734 -124659
6906 -124659 157369 138233 -215591 125393 -260038 67380 138194 -134487 -440742 -213869
6895 17503 92499 -84685 14050 214017 -197175 126360 63436 64906 -138606 92728 -324918
6883 177183 -34366 -155080 265138 -52670 1394 57279 27552 -70700 189737 64247 -122666
6871 -255106 -283538 54394 -200805 -139741 -61268 -253211 105992 -179587 -39409 -42796 248460
6859 -41313 106301 -96069 -5356 -148855 -387592 -596 118903 985 56916 -178453 -155426 -332350
6847 -332350 -381774 30355 126089 171021 -271564 -146058 158526 241938 446267 135616 10966
6835 -134809 302096 107276 -12241 -208446 76847 -52000 20242 170182 -135593 -7680 95117
6823 -156470 -34015 -165251 234121 -354934 -44301 214273 7933 433870 -246315 -293983 -179159
6812 -179159 -235993 -190864 -68102 -42962 -215321 96422 308630 -251781 118736 290970 141886
6800 -126015 82222 64418 -55708 -49358 50069 134197 42467 120995 -106257 51683 34856 -136311
6787 126873 4580 -172424 -172910 197144 184569 165757 -24081 -30827 -29489 77906 -171430 -141927
6775 -141927 -254042 -99305 264317 40283 -182818 77349 3611 45862 -233852 -362455 -17558
6763 -184591 -113748 -149884 -208183 25461 306678 -285420 68313 248007 -298268 -177307 -99472
6752 -99472 -25572 128107 107563 120603 -649 -408498 -144524 -31352 -140270 261152 -214144
6740 195398 -1294 -27752 -98609 -90920 -140838 -229824 295678 -200885 -14617 -279533 -289566
6729 -289566 158554 -221521 62713 109359 -150797 187955 -152479 172707 163854 -240668
6718 -288837 -393818 175258 195457 214821 54971 15054 -10722 261284 -74207 296210 -22570
6706 -103544 15062 237938 249444 -186031 85924 103896 -253589 -41160 51098 214986 -143080
6694 -28328 -66959 -415018 -49932 118598 -69150 -163753 200420 156807 -376558 88323 -8844
6682 196449 60384 -249608 95011 -191210 356394 -228750 -348200 -63479 33437 61276 57548
6671 57548 95926 190925 102432 -15566 -38572 15541 -81234 35811 110626 389682 162232
6659 -187409 -19948 104793 112858 56137 41088 -211125 -186659 -99333 -270345 -506382 124378
6647 -73636 185663 -56893 -398938 29074 130139 -47219 185938 166637 -145007 -20345 20797
6635 -49315 -346967 -10163 -135081 -84700 -29609 -154843 27743 -58098 315771 273837 179434
6624 179434 310318 -138434 20179 263624 -122498 -154239 -43441 43377 90387 -52004 -242181
6613 -242181 -136399 -196793 34191 130253 324667 -174425 -3318 -304828 5423 -336622 -163765
6601 69253 57607 -126918 -290193 -195961 55790 208360 88186 -253767 -263663 -33551 3017
6589 -140134 35441 -36809 312186 123524 -49785 -93002 241592 -84096 356072 237131 281316
6578 281316 -134842 -151730 21571 -223770 64183 -453352 -322162 -292859 -375237 262326 31266
6566 47396 -24861 110623 -376880 110965 15411 -6896 23276 80383 -81891 -85906 -224407
6555 -224407 155617 6727 -233931 92361 -102266 102589 239730 -136568 11042 257124
6545 257124 -22653 -36543 -2398 162453 464657 23613 -9973 -141283 -115109 -45778 -167809
6534 -167809 -239430 -47408 20380 -213073 -170532 -97410 163094 436079 -199179 177062 -307403
6522 -342141 173989 48253 -202030 -147309 -22910 84246 91238 -405636 328007 -234987 -97642
6510 -266382 120565 80858 -173599 123611 66381 70966 -297178 268521 130781 -260931
6499 -63649 -77346 -43582 62410 -163075 -114488 -172744 93860 54780 145160 -32060 95610 -94709
6486 -171067 -30790 111996 -181677 140507 -70328 119196 -12353 39871 -269714 -97903 -105266
6475 -105266 -44633 80431 -10200 174671 2496 -10589 -144831 48403 -64258 162161 42318
6463 72314 -182118 -90754 -104687 -218867 128760 68972 499613 -124105 -25927 -172389 -85531
6451 -49566 37302 -256681 105106 219750 59042 293191 83851 -151225 -186130 -439311 -182076
6439 198387 -298081 115507 -327407 82477 26155 -47142 -324600 105409 -151013 300916
6428 89533 -269975 -133251 -141113 -175898 -52961 -223647 44000 -14476 -263786 -9534 -15731 42361
6415 -138002 154083 92220 -124540 532203 -206345 111017 109180 135432 159724 -181049 216581
6403 -305108 -77939 148152 97657 20617 -298700 158935 149900 206041 -35649 119769 398529
6392 398529 -151207 -149513 -37324 -251587 184936 159696 -48659 272725 -112719 -61980 -155576
6381 -155576 -13293 119368 -283152 -147892 -417668 -202469 -209063 -48673 63544 135250 -105485
6369 -207667 69800 -304583 193877 -369584 -172764 236394 7220 -41084 -184071 -261811 224873
6357 -262650 75896 109458 74422 -116782 103255 163751 -315951 -243192 -343582 25749 -116943
6345 -59630 85938 56040 72245 -195847 -193234 151565 239872 226934 -433930 18815 77080
6334 77080 -166631 -268530 260045 -78674 191818 83200 180006 -82321 217629 -306561 397623
6322 -169198 -144496 -118498 88607 -99816 -118551 -270811 -41571 351628 188649 118437 46955
6310 -65678 -16566 -157871 223307 -118509 -66147 331141 -280451 97409 -122448 136720
6299 -39688 -155445 90183 225867 -402070 -302001 300831 -189456 -177465 -123618 -97719 -192856
6288 -192856 257183 151085 -126954 -105792 203821 128080 -63273 117340 47156 -93653 -4787
6276 181279 265076 -295387 83347 -56399 84225 -41 -160919 7926 -95363 -114577 -51766 -188500
6264 -188500 -122147 133129 -137018 -91523 -191605 -20646 -488749 -332883 10250 -167277
6253 -12064 154015 -143469 172129 -235369 82676 7016 -102480 217379 -369754 177619
6242 131557 140377 70566 -37408 -228931 35215 377914 -22193 173149 271206 -187334 -20235
6230 -227436 -107091 66866 -378663 -227518 11891 45172 56459 -140823 169108 84823 -12225
6218 -118101 2005 -161498 -87751 178002 92156 -81088 -112563 -205209 90248 16352 -11523
6206 55558 285948 -6494 139833 198334 237130 -342874 -115590 21362 139613 359317 110857
6194 222200 -186024 -385872 -236908 128303 109166 -141676 181757 -264135 -389795 285592
6183 -29778 -3945 257619 98208 429148 77847 -106158 -195655 19700 36903 -475649 -208503
6171 222578 150984 25838 -187926 -184798 40033 -16800 19450 -129402 42419 93790 80810
6160 80810 -24876 6893 -140628 234409 86175 -321562 79832 -104267 -20398 -33686 -8745
6148 122316 175977 102220 -219917 -54542 104856 73489 117414 -142876 -8176 218987 -96786
6136 177063 -138185 -227557 91464 -214300 105085 -166917 -97172 165991 -208833 219647
6125 -114634 55628 -212307 69296 54827 293162 76567 160199 94074 126029 -118768 121760
6113 -125229 -123217 -44746 -209749 115433 150214 311567 140045 144893 420546 -6582 21615
6101 272264 -143495 -34240 -18140 42152 -105237 62229 165847 -384615 -243803 -46412 -112043
6090 -112043 267910 -94242 -22697 142024 -142369 421260 -242219 -88479 -68706 51055 212286
6079 212286 -80415 150773 74473 -27371 -361777 219848 -39431 -295922 540 -171394 -247107
6068 -247107 67258 -146583 -50937 190498 185088 -196584 -162749 110054 -74785 66994 171702
6057 171702 144228 64627 78314 103887 -3160 -217859 -17771 -128050 -367028 22306 -226914
6045 -191814 -109827 19178 -7028 -96407 310026 21581 100653 -364090 -49701 55033 -107338
6033 -86250 7325 118824 153358 -85822 105988 361049 93336 -163830 132903 -151386 424929
6021 -118966 -227297 206661 -27788 7971 21519 52272 15390 263367 31366 123318 -134207
6009 -68151 -97773 -82916 79205 -205794 300827 -251620 -198833 132404 75098 -292223 85929
5997 400512 227143 -30311 -79284 225734 97494 -327737 170953 -312626 -52831 -68178 -290030
5986 -290030 47167 173986 144655 -279699 -31263 -95695 -219695 59227 196990 21995 -354060
5974 206974 -5201 -208978 -23073 19752 44252 20578 373504 171778 16929 39361 -74623
5962 66568 15811 112670 -214175 377741 -120553 -130420 43256 -65137 -213621 -20793 -11391
5951 -11391 116436 -66260 -79821 -35121 129637 23396 -230802 -92544 -119107 -31440 83391
5939 -182781 -128467 -5132 83889 -152264 147663 -119101 -231797 -74113 -133579 -207368 -104710
5928 -104710 68921 38576 -193970 -351310 -48320 195125 -142599 -103350 157628 286731
5918 286731 -224967 -233735 188651 27635 108429 44600 27267 -86129 -35103 165235 126805
5907 126805 75951 155843 123294 192576 48266 87660 82982 39956 -331986 21943 -51564 326903
5894 18630 121410 38312 -173360 170562 182814 86556 -226183 -100996 14808 12919 141357
5883 141357 61074 -105085 14310 31875 243678 -542841 136511 39669 -16427 64135 -115699
5871 116367 -19109 -41066 390523 -137541 107541 71228 22288 -296819 -36438 -68539 -40423
5860 -40423 249767 -190262 -353552 -99832 -194790 -91682 -23828 -177476 -156230 50964 -51799
5848 -187968 -26690 -123464 80953 -149094 -117485 -84461 43598 130534 -241915 -206896 -136072
5837 -136072 -6079 40571 251769 -969 -192400 -5114 201252 -175147 -89829 429839 -102821
5825 200160 127732 -55145 -94223 12862 230476 -39194 173011 456307 2005 -118671 -109360
5814 -109360 -55922 223234 -76328 -249203 -79173 469 164664 183451 -183573 211646 -169339
5802 -105593 142758 -67573 -184723 -227632 -229582 -7490 -85609 -79035 -18856 -13907 -65100 -207739
5790 -207739 -148666 37468 119271 -326066 -38418 88620 -129673 -95552 -8281 97775 63083
5779 63083 73051 19353 125535 -15712 -323609 -69748 149804 85504 -284496 -55251 -31725
5768 -31725 -190738 -342699 -156820 10603 73850 14286 492 -218592 -77546 11590 153965
5757 153965 -196557 -188419 -223550 -241916 -88719 -34116 328239 -58338 -160727 -53865 -131268
5746 -131268 -21974 358866 -451811 150053 -334661 201488 -198654 170830 340348 283940
5736 283940 76712 255839 336605 14259 104524 -273999 97516 382760 -282078 49340 -34529
5724 -81058 384699 234974 381176 204401 75263 51670 -313160 38175 -117188 295241
5713 65837 120316 415758 -349100 77679 -148505 -482625 350809 -73791 -100857 -179804 -153553
5702 -153553 159417 294544 105983 -107051 149148 -172971 -5176 -108600 -97146 12911
5691 -42141 -104629 -361238 -149817 302172 -31764 293846 -3060 -191577 113574 200419 246520
5680 246520 -32342 102803 -63524 76170 -13669 -129900 89844 107453 -42146 105796 197534
5669 197534 -152000 -248098 231787 120540 36224 276413 -336503 -114454 -161024 62135
5658 51438 -164120 40924 -102008 11747 -63899 -323926 105059 189190 -306904 178824 -51302
5646 -115596 268127 -199101 171413 -125470 -26689 4619 142324 151965 127353 -442036 6160
5634 216257 389546 -61562 114478 110915 -193100 -15955 275249 11324 223268 -201296 -64142
5622 82893 -225751 -382887 -71879 401334 -276249 -43373 -353819 160742 72971 39147 -314421
5610 -51064 -59422 -115200 -250210 -174298 -192707 114138 -188031 107347 62596 26324 -232862
5598 117008 70144 -39351 -128029 -205443 -405920 100483 -47241 25092 -235654 -117272 -15017
5586 -51705 -225406 89305 -17055 113825 321313 30718 135681 120584 -14964 131489 -308977
5574 70299 -381402 249084 220174 -187389 92963 381511 -178875 15700 -178081 107490
5563 -47326 -284309 -194720 -300144 47177 159415 -44812 -54718 -173349 -134683 -11000 -165268
5552 -165268 -186353 71487 -63362 -220886 62998 142759 167655 -9814 294636 48664 22614
5540 -121681 -128587 -22690 62992 136528 6362 310307 14190 -347196 -316686 -281324 -86139 -133923
5528 -133923 -226553 113749 -63980 100914 182275 26921 102565 30095 -104876 -88050 -64360
5517 -64360 101046 -78912 -215746 147629 133897 -210632 112592 -209939 -35557 -266413
5507 -266413 155039 34630 -13531 560051 -65470 108404 -137250 -227174 55483 -51203 -59180
5496 -59180 254236 142895 -209356 -21645 -166041 56523 90863 -446625 -124154 363305
5485 26021 -36053 -165740 518182 -176096 -17558 -220467 -142407 24318 56281 198280 432160
5474 432160 -250549 -36653 -110824 85449 -210151 -174939 -17671 158981 97275 -122102 -34032
5462 -294943 223568 358696 53690 -52180 -206585 -22257 104427 62894 236250 180052 -109373
5450 197244 -68655 279001 230244 300290 -38392 -203047 57932 -90364 109437 114105 153961
5439 153961 135734 172391 173175 -77434 -19725 112891 46633 -5416 -251815 -165564 69560 -234818
5426 -275481 -209852 -130798 263482 -128341 259534 116131 440449 71483 120304 -421276
5415 -221139 279746 341065 90463 252221 -337853 90014 -61500 -30014 182405 -292940 20641
5403 -132275 -59792 251753 111173 -258084 -86150 -77300 262658 296231 208017 -255166 69196
5391 103041 5110 12214 -36518 132284 -76476 -166713 -127933 -78733 6305 378671 -111868 176328
5378 177302 -146425 -22591 -62142 -18995 -189872 115145 154572 -121118 -221424 -116127
5368 -116127 88836 75041 -180703 88689 106249 137292 -340631 -194721 125965 28277 184379
5357 184379 -33370 212492 -8230 -18643 -10626 -65824 -153772 201252 -251138 243408 207064
5346 207064 -46556 29537 -231120 -469708 271778 155397 298291 274875 121212 -56691
5335 -113365 -33582 84260 213665 209700 -111366 197844 158569 123318 -14265 -21222 -64010
5324 -64010 161042 134056 -125596 266526 -190000 -185497 34565 -191197 -1510 89924 -109989
5312 236841 124632 -224467 139090 -262928 -12010 150093 223090 -241799 -366437 -329932
5302 -329932 -101152 -71420 75534 -125422 327159 -105050 17850 126785 73743 221960
5292 221960 -46536 300054 -241296 73943 92264 -69793 93360 73422 -202399 78805 -93798
5280 -118650 234964 75542 -94823 -163763 41379 172585 175341 -144251 200366 -99845 142693
5268 -116962 94341 -41219 52258 249338 -26381 -21989 291246 -106373 -162750 -203843 75001
5256 21658 -136434 -122364 -8579 -261323 -49121 -53173 -15484 -328396 -90397 -315213 306411
5244 -343796 -59740 109995 420233 -88151 98182 -288644 -88968 -272543 128134 -124936
5233 -126923 108984 -204069 -66658 -174222 426140 125596 171692 101887 327306 128059
5222 -80196 -50981 -335039 77859 -31827 119800 154114 101302 210094 -55562 -337337 179127
5210 74311 222966 159377 -160276 67833 70447 -79881 195886 156280 185904 123404 114639 -41862
5197 -50837 -217760 129857 -94122 258271 73030 -17637 -379045 155906 27471 173799 -151207
5185 -224330 -221920 -113483 -124369 -34985 129724 -100886 -116582 -59742 104257 141544 -109128
5173 7242 14603 -409394 -199473 96955 51896 254706 -80158 53243 -115812 -124175 162601
5161 -159511 68085 141093 -220448 235475 -230091 52156 55426 -238193 212263 -98673 44543
5149 524415 201121 130148 142974 61111 375731 116664 -26334 -25138 -12891 -75611 -61968
5138 -61968 15787 -493838 -210324 -161996 -95005 -219568 -49570 155266 -9955 164957 -106395
5126 -24753 -49228 -211794 148864 -190806 -268482 313569 170314 -74223 78671 55255 -189812
5114 -228749 211541 26612 40655 62079 -3881 82589 -145388 417420 -301096 21191 76330
5103 76330 -73178 -311426 5542 205235 354053 -247288 510698 -149685 29731 -409169 -21753
5091 -333879 -55561 451896 -201200 204501 113604 -37896 -103050 218729 -57313 169817 -77429
5079 122188 132931 -73836 344322 7550 19220 288481 421890 61453 97682 -34747 215263
5067 -44824 40118 -268170 -4324 -101348 -166952 -397238 -119358 -152356 -54582 177287 -98890
5055 218093 3041 501670 180588 -62232 -605177 -53961 52391 -364075 -187804 7546 -98575
5043 99323 50887 85082 343915 41304 -6573 -19240 -187592 57912 -95013 -16851 -71207 -94022
5031 -94022 11397 -7403 -142980 -38502 91158 -140249 -338896 -184672 -105128 -4655 -238116
5020 -238116 -191297 -22159 138058 157899 -142109 148139 313043 216294 -348979 166088
5009 78064 -177323 -199154 -93322 468731 -209657 107500 -62413 -251749 -58440 175880 -82369
4997 67795 -212222 38078 -58155 104512 210625 -119 -116604 170105 -202186 -235361 -128944
4986 -128944 547959 -132790 -127075 160622 -203682 -328644 -219664 120910 -25180 -44199
4976 -44199 -293023 -276313 111075 72656 271076 -77675 215377 -160503 230747 -304996
4965 101634 211574 -131617 72479 -74052 -59762 148184 199019 -86291 17060 -238115 248974
4953 -219557 220023 6089 55801 33016 7541 112085 66856 -95871 59226 -120844 -89877
4942 -89877 55866 180195 -99282 181091 -95699 -481942 263566 48273 91210 47770 5212
4930 -37160 -49991 -51429 5701 -148857 326939 163221 -29564 -98713 385708 98862 213869
4919 213869 92885 -167506 -208409 205614 -75527 -135568 -135247 52241 -691 219526 231939 10275
4906 -150403 -14542 -154252 406709 -131001 31595 -46117 -54228 110839 36839 -49118 -43688
4895 -43688 -26494 114628 -36490 178740 55763 190904 153062 23933 -5328 290076 59670
4883 168975 357892 103756 182420 169232 -67430 59450 -52774 -129465 -54137 -255043 29552
4871 103788 333312 18755 56875 77001 378988 53181 144078 34249 41617 135392 -99843
4859 397318 59771 74350 444874 -3812 44128 290465 60264 -133572 51824 36994 201506
4848 201506 -135846 56822 -293793 -242531 -561237 -229103 22270 -126024 84249 46123 236933
4837 236933 -185002 39322 69065 198479 39443 -340804 76159 316230 158472 -208544
4826 -87194 87493 -148625 -165811 257034 53500 -53404 -81183 -23837 184592 -81283 272452
4814 -28310 129804 70342 71789 -165115 -201195 282110 -179830 253205 372446 168150 9333
4802 -124551 229123 -38704 245732 -4146 -181266 -861 326998 -37295 31327 -197135 -21649
4790 41689 146874 -261288 -126891 83903 -89680 847 -130860 -39904 220615 74750 218253
4779 218253 155457 78079 -36009 163769 3592 -92827 5383 -75259 93340 15963 -321156 -48632
4766 -120503 -67790 -139100 381140 283099 -222221 -537982 -211412 -73134 -111133 278747 195300
4755 195300 -215719 -103624 289808 42474 143879 37598 217572 92727 -424615 -22246
4744 40275 -715 49612 -72895 -54675 206810 -91419 -50448 -227401 26352 -36721 -91645 -247349
4732 -247349 -328819 548687 26104 6144 -4454 -23681 382723 -568 -55987 -178690 -31183 119
4719 -111388 -287028 131280 -42901 -30157 110514 -172363 316053 -36934 -151322 194859
4708 118827 -173340 -270440 -323169 206817 29597 -59686 401601 -37307 107018 -230576 379127
4696 2718 -126009 -18999 -22800 -175640 -241102 -124156 238959 286916 64725 183615 229008
4685 229008 17501 164231 75337 -6465 -73698 223586 -140982 -47759 -238534 -43152 140593
4673 -121857 68002 -25289 347956 -334132 -132749 -104995 116328 -117607 -61762 -25365 -201423
4662 -201423 298533 202102 -129450 55859 60052 -186915 -26579 -274705 -386615 96308 -15781
4650 -3548 398204 27101 6336 158076 46351 248518 -142996 156869 -184006 -75175 12595
4638 343023 -238446 -346498 122848 106092 -135462 298697 -156676 133248 96705 -64538
4627 -60666 72926 301330 14033 -25038 233102 86481 -172019 92376 110946 332453 23439
4615 -72250 196767 2139 128796 -40749 194462 -200359 84253 -194978 -129624 -55274 104402
4603 91593 329610 -181056 -86481 -78218 21840 174768 182596 260256 10920 -91868 128071
4591 178530 86503 261580 -184260 44637 -35492 -173513 -22053 -6073 -55582 -200311 248632
4579 -8375 -51985 -155446 120099 447630 -79893 -158848 27106 -41684 149100 -181477 -128788
4568 -128788 70215 -123738 -197368 130079 -81970 -138536 -159430 -90735 2220 -43765 -202820
4557 -202820 21115 -115756 -59553 83772 375178 -204378 66501 165494 -231179 -56768 -19112
4545 -218134 56621 -201215 -336601 -23326 219528 84028 -149308 420472 269847 301546
4535 301546 -113634 188267 -159591 -324710 -139250 -82353 19292 195880 192943 -191966
4524 -141527 117748 145979 51512 -11297 36188 48261 73850 78183 159802 -63390 -116392 369032
4511 77498 1524 133171 -1433 390277 56744 93816 -136037 52996 180532 -138777 252717
4499 205334 168829 127298 -105385 144496 64393 13467 242 25024 28730 168435 -139233
4487 111024 47724 38097 67468 94333 -73003 6804 299818 224088 -174419 37930 90611 -286090
$$ [...]
##END NTUPLES=NMR SPECTRUM
##END=
