
##TITLE=UV1272_M13_1250-1169_20_7414597_TuzFxCuXQv
##JCAMPDX= 6.0         $$ Bruker NMR JCAMP-DX V2.0
##DATA TYPE= NMR SPECTRUM
##DATA CLASS= NTUPLES
##ORIGIN= BRUKER
##OWNER= Administrator
$$ 1.72 TOPSPIN		Version 2.1
$$ 2013-01-26 00:19:08.305 -0500  Administrator@X
$$ Compression mode = diff/dup
##.OBSERVE FREQUENCY= 400.02188249412
##.OBSERVE NUCLEUS= ^1H
##.ACQUISITION MODE= SIMULTANEOUS (DQD)
##.ACQUISITION SCHEME= undefined
##.AVERAGES= 8
##.DIGITISER RES= 22
##SPECTROMETER/DATA SYSTEM= spect
##.PULSE SEQUENCE= zg30
##.SOLVENT NAME= COFFEE_meoh
##.SHIFT REFERENCE= INTERNAL, COFFEE_meoh, 1, 14.98509
##AUDIT TRAIL= $$ (NUMBER, WHEN, WHO, WHERE, PROCESS, VERSION, WHAT)
$$ ##TITLE= Audit trail, TOPSPIN		Version 2.1
$$ ##JCAMPDX= 5.01
$$ ##ORIGIN= Bruker BioSpin GmbH
$$ ##OWNER= Administrator
$$ $$ E:\/data/COFFEE/nmr/UV1272_M13_1250-1169_20_7414597_TuzFxCuXQv/10/pdata/1/auditp.txt
$$ ##AUDIT TRAIL=  $$ (NUMBER, WHEN, WHO, WHERE, PROCESS, VERSION, WHAT)
(   1,<2013-01-26 00:19:00.305 -0500>,<Administrator>,<X>,<go>,<TOPSPIN 2.1>,
      <created by zg
	started at 2013-01-26 00:17:54.290 -0500,
	POWCHK enabled, PULCHK disabled,
       configuration hash MD5:
       86 BA 57 50 F2 9D 5C 9B 26 00 A9 28 5F 66 2E 89
       data hash MD5: 64K
       E7 73 50 3C 2E 78 5A 7B 83 46 8E FF 46 B0 E1 3F>)
(   2,<2013-01-26 00:19:03.399 -0500>,<Administrator>,<X>,<proc1d>,<TOPSPIN 2.1>,
      <Start of raw data processing
       efp LB = 0 FT_mod = 6 PKNL = 1 PHC0 = 0 PHC1 = 0 SI = 32K 
       data hash MD5: 32K
       9B 51 79 6A 6F FD 86 FA 5F BB 0C EF 06 6F 25 AC>)
(   3,<2013-01-26 00:19:03.868 -0500>,<Administrator>,<X>,<proc1d>,<TOPSPIN 2.1>,
      <pk PHC0 = 94.28467 PHC1 = 0 
       data hash MD5: 32K
       49 64 05 E0 42 08 5D BB EE F2 1B 46 DC 6D 84 C1>)
(   4,<2013-01-26 00:19:04.087 -0500>,<Administrator>,<X>,<proc1d>,<TOPSPIN 2.1>,
      <abs ABSG = 1 
       data hash MD5: 32K
       30 B2 48 FE 9B 71 B9 3D 84 89 4D 2E 31 27 1B E6>)
(   5,<2013-01-26 00:19:04.227 -0500>,<Administrator>,<X>,<proc1d>,<TOPSPIN 2.1>,
      <abs ABSG = 2 
       data hash MD5: 32K
       B0 EB FA 02 65 5C 52 D9 48 30 3F 5F 35 4D DE A7>)
(   6,<2013-01-26 00:19:04.368 -0500>,<Administrator>,<X>,<proc1d>,<TOPSPIN 2.1>,
      <abs ABSG = 3 
       data hash MD5: 32K
       3A B2 9E 31 2C BD D2 B9 C5 89 88 C4 69 2B 79 F7>)
(   7,<2013-01-26 00:19:04.509 -0500>,<Administrator>,<X>,<proc1d>,<TOPSPIN 2.1>,
      <abs ABSG = 4 
       data hash MD5: 32K
       CB AB 15 9F D9 D5 CC 39 AB C2 8F AE 31 53 FC F3>)
(   8,<2013-01-26 00:19:04.665 -0500>,<Administrator>,<X>,<proc1d>,<TOPSPIN 2.1>,
      <abs ABSG = 5 
       data hash MD5: 32K
       B6 93 CD D2 C5 C2 88 12 92 A5 21 DB 8C 7C FB D9>)
$$ ##END=
$$ 
$$ $$ hash MD5
$$ $$ C1 CD 44 79 E5 C1 11 B6 0C 1D D3 2C 42 9D 9E AC
##$RELAX= 
##$RELAX= 
##$RELAX= 
##$RELAX= 
##$RELAX= 
##$RELAX= 
##$RELAX= 
$$ Bruker specific parameters
$$ --------------------------
##$DU= <E:\>
##$EXPNO= 10
$$ [...]
##$TP= (0..7)
150 150 150 150 150 150 150 150
##$TP07= 0
##$TPNAME0= <>
##$TPNAME1= <>
##$TPNAME2= <>
##$TPNAME3= <>
##$TPNAME4= <>
##$TPNAME5= <>
##$TPNAME6= <>
##$TPNAME7= <>
##$TPOAL= (0..7)
0.5 0.5 0.5 0.5 0.5 0.5 0.5 0.5
##$TPOFFS= (0..7)
0 0 0 0 0 0 0 0
##$TUNHIN= 0
##$TUNHOUT= 0
##$TUNXOUT= 0
##$USERA1= <user>
##$USERA2= <user>
##$USERA3= <user>
##$USERA4= <user>
##$USERA5= <user>
##$V9= 5
##$VALIST= <valist>
##$VCLIST= <CCCCCCCCCCCCCCC>
##$VD= 0
##$VDLIST= <DDDDDDDDDDDDDDD>
##$VPLIST= <PPPPPPPPPPPPPPP>
##$VTLIST= <TTTTTTTTTTTTTTT>
##$WBST= 2048
##$WBSW= 25
##$XGAIN= (0..3)
0 0 0 0
##$XL= 0
##$YL= 0
##$YMAX_a= 658778
##$YMIN_a= -558959
##$ZGOPTNS= <>
##$ZL1= 120
##$ZL2= 120
##$ZL3= 120
##$ZL4= 120
##$ABSF1= 14.98509
##$ABSF2= -5.573092
##$ABSG= 5
##$ABSL= 3
##$ALPHA= 0
##$AQORDER= 0
##$ASSFAC= 0
##$ASSFACI= 0
##$ASSFACX= 0
##$ASSWID= 0
##$AUNMP= <proc_prof1d_extract_pilot.lims>
##$AXLEFT= 0
##$AXNAME= <>
##$AXNUC= <1H>
##$AXRIGHT= 0
##$AXTYPE= 0
##$AXUNIT= <>
##$AZFE= 0.1
##$AZFW= 0.1
##$BCFW= 0
##$BC_mod= 0
##$BYTORDP= 0
##$COROFFS= 0
##$CY= 15
##$DATMOD= 1
##$DC= 0
##$DFILT= <>
##$DTYPP= 0
##$F1P= 0
##$F2P= 0
##$FCOR= 0.5
##$FTSIZE= 32768
##$FT_mod= 6
##$GAMMA= 0
##$GB= 0
##$INTBC= 1
##$INTSCL= 1
##$ISEN= 128
##$LB= 0
##$LEV0= 0
##$LPBIN= 0
##$MAXI= 10000
##$MC2= 0
##$MEAN= 0
##$ME_mod= 0
##$MI= 0
##$NCOEF= 0
##$NC_proc= -8
##$NLEV= 6
##$NOISF1= 0
##$NOISF2= 0
##$NSP= 0
##$NTH_PI= 0
##$NZP= 0
##$OFFSET= 14.98509
##$PC= 1
##$PHC0= 94.28467
##$PHC1= 0
##$PH_mod= 1
##$PKNL= yes
##$PPARMOD= 0
##$PPDIAG= 0
##$PPIPTYP= 0
##$PPMPNUM= 2147483647
##$PPRESOL= 1
##$PSCAL= 4
##$PSIGN= 0
##$PYNMP= <proc.py>
##$REVERSE= no
##$SF= 400.02
##$SI= 32768
##$SIGF1= 0
##$SIGF2= 0
##$SINO= 400
##$SIOLD= 32768
##$SPECTYP= <>
##$SREGLST= <1H.CDCl3>
##$SSB= 0
##$STSI= 32768
##$STSR= 0
##$SW_p= 8223.68421052631
##$SYMM= 0
##$S_DEV= 0
##$TDeff= 65536
##$TDoff= 0
##$TI= <>
##$TILT= no
##$TM1= 0
##$TM2= 0
##$TOPLEV= 0
##$USERP1= <user>
##$USERP2= <user>
##$USERP3= <user>
##$USERP4= <user>
##$USERP5= <user>
##$WDW= 1
##$XDIM= 32768
##$YMAX_p= 474460970
##$YMIN_p= -717212
##$CURPLOT= <Network HP LaserJet P1505>
##$CURPRIN= <$Network HP LaserJet P1505>
##$DFORMAT= <normdp>
##$LAYOUT= <+/1D_H.xwp>
##$LFORMAT= <normlp>
##$PFORMAT= <normpl>
##$SURQMSG= 1
$$ End of Bruker specific parameters
$$ ---------------------------------
##NTUPLES= NMR SPECTRUM
##VAR_NAME=  FREQUENCY,     SPECTRUM/REAL,   SPECTRUM/IMAG
##SYMBOL=    X,             R,               I
##VAR_TYPE=  INDEPENDENT,   DEPENDENT,       DEPENDENT
##VAR_FORM=  AFFN,          ASDF,            ASDF
##VAR_DIM=   32768,         32768,           32768
##UNITS=     HZ,            ARBITRARY UNITS, ARBITRARY UNITS
##FACTOR=    0.250966925370066, 1,           1
##FIRST=     8223.43324360094, 51403,        8105
##LAST=      0,             -45099,          -69273
##MIN=       0,             -717212,         0
##MAX=       8223.43324360094, 474460970,    0
$$ Real data points
##PAGE= N=1
##DATA TABLE= (X++(R..R)), XYDATA
$$ [...]
23833 -47230 13864 -38241 323208 -95980 179506 -204663 155953 -1415 124899 -104097 248603
23821 202878 80704 135162 64777 -58458 53300 22748 309066 -76437 -270398 -378908 27369
23809 -317 -70770 -247749 -150326 -347190 101441 -141553 383462 208607 -105323 -10265 271241
23797 -69663 249569 -305617 21863 -22910 357503 -92771 55414 -31841 29751 84849 -169467
23785 -78076 -198800 -161602 262036 180847 27535 73942 297839 8691 89437 78233 84453
23774 84453 -267821 9653 -95572 -180458 -163105 129767 -60579 -56239 268925 -223799 -327519
23763 -327519 -334312 158242 194853 136750 104343 -7229 -261855 -46039 293224 -25124 88485
23751 52334 -47277 -252259 66601 141781 -10026 -218594 -162773 -127277 71437 -82469 -216661
23740 -216661 -161040 -243850 54242 287452 116978 131576 -209212 167627 95448 55975 -239345
23728 -123308 113992 -171097 30917 103679 103078 -56470 -125352 -68678 -110596 -9890 -125839
23717 -125839 -74790 -278135 -195908 -163940 110080 -237202 80982 -113809 -52434 -48066 239931
23705 -66298 -109420 -297170 -17118 -100700 511676 232885 67384 -40523 53259 -175685 87829
23693 -188586 -55420 -5785 -310724 -36793 157771 -296677 18849 -143727 4022 467267 118368
23681 82056 -93376 -17248 178319 67210 43045 -163970 -104678 -97261 -162550 -33542 73977
23669 -147398 138408 -5091 235168 -66444 -86707 -165226 156911 118594 153826 -28010 104962
23657 13003 96999 232993 -161227 -86023 -144594 239835 230790 169261 14732 -192752 -149223
23646 -149223 -369335 73780 -185384 -37098 -169746 124145 143532 30292 -93702 -92758 249496
23634 -177002 -34318 250538 -376143 -49869 -288412 137953 120586 109358 -137957 -6589 -182522
23623 -182522 76900 -282455 -95375 -65492 -135622 470226 -128137 -94105 201116 -289716
23612 -73685 -125674 -122161 49832 -223951 70134 -38880 121696 68168 64860 29053 -311807
23600 -283897 -262558 -121039 -47934 123327 236348 -77797 283255 -100058 -47519 62525
23589 -219774 185811 122735 -194905 93128 -107809 137170 -263564 -235895 -408763 49071
23578 271993 239843 22086 69317 -78790 -102735 -28749 10673 -485060 179933 -150872 76543
23566 -179648 25956 171207 36775 -205101 -16924 -78608 -270017 266965 151032 315684
23556 315684 -78130 56472 -283958 288016 1922 125081 -125390 96567 89361 222474 -66614
23544 -77014 -30797 197420 87538 -109552 -173901 -190003 142609 -104325 -337056 -133930
23533 255898 45106 -281390 69184 -91447 -131965 -15811 154308 -56277 214751 183592 -294889
23521 -30701 323697 -137348 148646 -278904 79571 -126188 -231631 118724 -164874 72467
23510 -4894 251938 129299 203056 269337 160702 -214191 236551 -130158 101516 -258266
23499 -52973 -190267 -293126 -138754 -264426 60320 -225693 -203376 -347693 -152156 -47681
23488 113714 -135243 -82297 15280 -147082 10687 -83168 -133621 -324389 28210 85992 -196272
23476 34804 -252346 100055 -182015 -233604 -214762 31052 286447 24149 -68032 -450695 53662
23464 -290662 38649 -215678 -152114 34510 -172880 -253774 -147034 2280 -148538 -279200 192643
23452 125348 158238 63815 -173039 168081 249940 -64253 -289732 66377 338219 -114013
23441 217246 58712 31594 -521641 -1825 -45461 85686 165512 -175048 98480 -139601 190284
23429 -266780 121111 215734 11003 118177 -11380 -194654 -333612 88279 156700 -23534 -10312
23417 241064 143623 -243785 -256194 -157414 -160844 145177 -104333 41764 -267059 68040 -277727
23405 146489 -294510 -110072 -42590 -112940 -6850 140681 143860 126754 -994 210043 74267
23393 216029 25838 23613 -140216 96527 -162969 154024 127405 626809 -88673 -45463 -186457
23382 -186457 -160446 -139579 141004 154649 382088 109212 51617 -341773 105737 -91425
23371 -98447 -45301 108945 275361 143160 24603 61615 -12758 104463 -120517 -36188 38400
23359 -159911 98560 -313275 -143278 78077 175 240577 -110016 221324 -69012 -89647 -160600
23348 -160600 74581 13372 -318747 -252650 -121333 205917 -190387 61582 100974 112995 88594
23337 88594 -174059 122102 168251 122917 -267762 -452622 -59568 -68238 -72705 89769 126208
23326 126208 -252246 -100715 52902 -52428 -206237 230683 4321 -200600 -340250 -99553
23315 -18073 -21362 -16972 -87413 -197710 -24002 266051 -230574 146724 -180167 -1260 -85084
23304 -85084 -196413 468846 87092 -173237 -121683 -96775 -224664 -34110 89121 50990 -144154
23292 -257452 57979 -28512 233275 -171298 -40520 172396 22090 -258499 -94595 74384 -54087
23280 -233732 56400 -149640 -27307 -156175 -56512 -38913 -102946 -176481 -101569 133349 63031
23268 -231314 81865 -79682 -65701 44462 16076 176676 -112559 -67939 67025 44070 -55844
23256 -214682 26194 -175654 -261137 -21649 -117678 56253 308647 248551 170321 3044 -272568
23244 -49348 -156609 36228 -84327 91164 -112477 -260799 -128702 -308629 84104 -18672 6108
23232 154554 289088 -19441 -427661 -135489 257880 283325 -321442 8460 -8497 129921 293262
23221 293262 -99246 73889 -202900 -157363 145650 -235951 158928 59683 -158170 36553
23210 187978 21591 49933 -46746 -338873 -95708 193649 94586 -57971 194124 -60748 88512
23198 104927 64282 227075 5528 185475 28196 341930 53356 165073 184672 -288932 -150207
23187 -150207 -183355 -184160 -57523 -2518 206341 118330 -5667 -93884 131606 -128837 69062 235240
23175 235240 -140932 -103424 167100 -68618 -161426 -11157 -248345 -238344 101699 -140077
23164 171025 -125745 -92640 168581 -107679 -38963 -135301 238647 142842 8614 -108004 83881
23152 246251 69920 110998 176680 -59757 68295 103544 53898 227751 124151 74473 -76579
23140 -205753 -168469 -122757 56809 10518 34260 212992 -237483 -435382 -66629 -41997 -82291
23129 -82291 21326 61798 136479 20741 229846 114617 17745 -143854 22103 -208461 -23344
23117 183404 10920 30335 -111308 -280721 -80396 -334467 -123503 -360335 -28064 -353955
23107 -353955 -32777 110549 375376 -70684 -92918 205818 3620 -111552 145216 592774
23097 592774 68546 176111 -86666 80037 357541 -144918 -102176 -257160 75465 -8401 -7660
23086 -7660 8288 -66057 -32803 -197101 224605 -217189 82696 -114185 197079 -209961 180080
23074 53318 140950 -91388 30380 -139310 4031 -100709 -129590 -45247 42802 -32466 78310
23062 -44958 -92600 118535 -311856 -22700 83387 76711 244325 -43352 -174566 360633 -41575
23050 232921 218214 -212243 -122334 148676 -199744 116060 -95707 -283483 -586786 -299225
23040 -299225 287810 88099 -87009 88411 -26292 62628 -37671 -108178 -156160 475319 -53138
23028 -235249 38283 -275034 -178152 124934 -161660 84482 -92108 169486 -155453 -68533
23017 -48915 -206925 -33420 -11790 -36825 150067 -158171 -72162 88976 -29235 -203573 145194
23005 -38868 37702 -16390 -43172 58429 163867 -72731 279102 -157589 -130196 -186685 -150820
22994 -150820 44510 163196 -232497 172641 -105714 -46159 -39722 152107 -74641 136249
22983 481072 -60388 58267 -30294 -125291 190300 -157810 -68065 67397 123273 335202 -80001
22971 -15559 -333467 110292 44450 -65661 -196407 264032 144754 -35712 -179892 -148808
22961 -148808 -345412 89588 94000 31748 -354659 79756 -122228 200771 -202450 -104260 52635
22949 -996 -241947 -311076 55507 209608 -38943 125772 -49687 -39846 203516 386469 -88472
22937 35521 -328897 -192237 -115042 42944 111224 -35580 338397 -52849 27809 137762 48846
22925 -100150 7618 -282115 -77983 85235 48796 188600 -120693 -217788 310928 -64992 -75234
22914 -75234 -30130 -22483 43316 152782 129662 -25363 109051 45841 170106 41530 -412066
22902 -29870 312938 204750 188428 -147073 13034 -8456 39748 -76866 28223 -307860 54352
22890 -89140 -294697 86737 138989 -55088 -38815 62261 -246286 -341201 272115 -118354 -90064
22879 -90064 135906 26196 -130988 -183155 -227622 246864 -203168 147572 -184697 104632
22868 -488968 -46220 -309986 -5701 -19238 -211403 -89617 188886 137560 160465 -52639 288148
22856 -170266 -287735 -141427 -44436 -108180 84278 -194244 91086 -60078 -35437 244005 -256620
22844 -164920 40636 97566 47023 -113393 52592 -244478 -167433 -153975 -154799 42094 -130457
22832 52106 -79331 -230691 -59947 -234351 -183572 52363 -98572 -197624 -107376 -25216 57632
22820 -79106 33064 87825 -174613 -11839 32846 338921 138071 -72271 -18070 51731 -41118
22808 -125458 -445024 -209911 -126116 -51112 -184086 99887 -161783 -130651 -171740 -84302 241326
22796 -70577 43337 36023 97846 39505 40947 -290898 108856 -4650 14981 229389 303376 -220818
22783 213413 -307891 -174590 277592 75835 -71986 -168962 3149 -28526 288589 -298083 -113801
22771 -107030 -163243 -214116 327637 -123607 -116262 10364 -1336 42896 -127699 -208326 -37885
22759 -163113 -151383 111762 -65276 210 -14359 283656 306489 -32803 -28927 9660 2570 -45112
22746 -46938 -295601 -20652 -2671 98309 -29967 13510 -158018 -111094 12056 -233775 -58307
22734 -130594 177805 141300 -212165 127519 -16965 323309 -220729 -113022 223815 -108587
22723 119610 -6048 -255894 11405 158249 -122782 -179363 -173740 -149020 -274664 -184346 -180000
22712 -180000 269825 164263 135365 -170740 -189899 215679 69871 -265756 259286 46352
22701 139716 -208075 -47187 12420 -90569 58561 107364 -280180 52738 -10987 -104964 -52198
22689 77131 -159147 85580 37122 46003 -237737 -231204 123843 81969 216116 14950 30273
22678 30273 137654 111601 -23718 45492 211598 -105135 -263990 -172381 207474 144137 -88554
22666 -187731 -229733 149940 -35593 13391 161894 -304559 4142 -83404 -305425 -258259 281756
22654 -245958 -54369 179307 91327 39607 -183876 -313092 201857 282720 432821 -210784
22643 -307646 332772 -322214 -27484 -113972 136784 186064 74494 -294163 61269 -93577 -104019
22632 -104019 -241046 -22104 132560 -4544 -1737 -101827 -24325 40495 65917 63780 -231567
22620 100000 262335 -29383 -416585 -59595 21773 175847 90484 -78008 -233112 42406 -140021
22608 294745 -235883 -63956 -245034 197082 279479 4786 -319633 -113029 -224615 -19601
22597 154103 112422 40198 58762 -349472 -45066 -58623 -441738 -246046 -169957 -241905 -440214
22586 -440214 -36249 -36101 -389912 7320 -105227 -143610 -130372 -161636 -364572 18590 -156733
22574 -12914 -281647 -160717 -159829 187635 -68948 9608 -83944 234220 -142549 2822 -163358
22562 -24191 -40313 -105694 39975 -415353 41255 -120435 238308 -169241 8462 11302 291475
22551 291475 34779 234027 -36668 102226 190806 204597 179960 -304864 -212640 101288 -28971
22539 373382 -55698 137381 -70523 103850 -59845 104226 -177415 -6984 38244 46201 -168854
22527 115040 -188399 -319269 -142616 -82832 183002 -216760 -166216 79921 -315726 -1726
22516 -46594 213689 -42831 81867 -56065 -69524 -77438 113713 -39413 36481 -42569 -24474
22505 -24474 -43139 -47635 61327 -237591 16118 -178958 -151147 -56846 -72329 -239007 189071
22493 -27218 128831 -252865 30731 -121079 -310692 -395278 159649 -521197 133390 -46711
22482 -40730 -52266 -95967 99184 -109138 -128576 68310 -126571 -407834 18664 778 468672
22471 468672 -21854 205556 -68927 137497 -194352 -235260 33225 150423 -61895 103421
22460 32341 331330 210272 -65360 -1664 -32609 282984 -1254 -63891 -298551 -90627 -256880
22449 -256880 -95899 -206091 -270776 74845 83599 100652 -48035 81898 159302 6906 -226759
22437 62582 90564 -87405 212492 40214 156804 37727 128317 -178734 -32173 -113049 286847
22425 -176508 -81863 35114 -23066 97716 -167634 -274115 -48718 -200370 -315020 -110415
22414 -331495 -129858 -149204 -5404 -72161 143356 148461 134099 -57347 -66454 -4818 241455 -173095
22401 -18006 -239468 -65046 -117788 -143497 -45418 -1739 166427 -134987 144540 -92514 -38558
22389 -89743 -132730 44464 36974 -353933 -75540 45642 297560 -344739 167504 -107794 145029
22377 -65790 -147431 308550 75012 -104963 -176458 88491 145041 118458 178996 157251 5485
22365 220417 272805 -131898 84879 -179851 -100685 -52118 -101154 -135764 23942 -191835 161186
22353 126087 -42169 -263969 12543 66822 -105483 -357204 -233795 54444 -115545 75402
22342 -48750 -193194 -51242 -159878 -335447 116761 95878 -18020 -141926 -1376 -77693 45456
22330 -208374 9750 109334 -72073 -234036 -254506 -2581 123714 -334354 41398 -86989 -121862
22319 -121862 50743 -121822 -122973 121258 -298336 -294742 -3054 10837 139190 63603 246583
22308 246583 -98628 -84851 -287482 35973 -19853 -260156 -3393 -11908 -58262 27490 -14686
22296 -311426 -98606 -48234 144231 98932 -45081 78017 -125170 323537 -11987 39467 376817
22285 376817 38718 -154978 -102329 -108253 -131689 -152663 -254256 -13273 99878 300434 -4654
22273 -329738 -9118 -126054 -261352 119056 -354656 -132441 -340462 116216 174628 -26328
22262 -90397 219126 37846 260906 -153486 -114457 79268 -140719 -207104 -13472 -54491 217297
22250 -52963 33063 198466 110793 -121259 -84611 280809 136279 -104540 -179389 -119532 -26679
22238 -87458 50217 84805 -144966 -345939 -11973 473320 -209205 -186579 309507 164677
22228 164677 -34845 -112971 -24476 -102744 22211 -76494 -82524 -213025 -52837 139342 -195011
22216 220487 -196528 137388 173634 165602 107039 -48043 178727 34313 -367448 -62825 198022
22204 -103135 28105 30404 -24348 -11374 142722 47436 -158679 -140107 -16455 -416231 91880
22192 -122145 -284599 -219469 -90095 -205667 -205625 -84828 -285853 -297443 -28953 -169748 -92859
22181 -92859 -99811 78439 -150347 -209048 291938 11528 21528 -318615 18574 90644 -333110
22169 -17149 144125 -259680 62658 -475390 78693 207201 27918 -45222 -94311 -127984 8555
22157 -270830 -201849 -158341 43958 -106724 118907 16069 -192624 46240 -28842 -220568 -157402
22146 -157402 -41821 25981 241720 23275 -206776 36347 -142790 -397714 189018 -361018
22135 -94207 65060 -123041 40735 7338 -282550 55417 -177724 -151578 -326731 212772 -4527
22123 -145843 -278185 -231623 115472 127319 -113901 191421 -250726 -119769 -73700 -226798
22113 -226798 268786 172743 -143500 -241404 30878 -233549 -99369 -21262 72906 -224518 -31712
22101 -147400 103211 -160175 -27708 -259434 -191710 66546 -82890 -119394 131605 -163079
22090 -101060 5341 5445 90139 38833 -228092 -6788 24265 -131161 -135026 171558 -232956 159123
22077 -154700 -106278 44068 111674 -67393 244586 -109641 -211262 -108691 -71494 -295607
22067 -295607 -130667 -257547 -131166 -83256 20039 -27892 -95166 -95003 -89303 -128350 135033
22055 -189613 -65023 -175024 -227993 -258768 236845 196062 137747 -88009 135784 -88303 289069
22043 97063 67525 -75062 -374914 394822 111453 -161263 -151657 67303 -379678 -102734 -110699
22032 -110699 35051 -96421 132481 56940 125102 61329 -118965 58607 -315907 -46183 -161535
22021 -161535 270804 -178045 121652 -58691 -122192 -22636 317132 -396850 -143476 193511
22010 -383458 174238 9561 87427 179799 -169914 -76767 -42184 41361 55053 52130 -116043
21998 162754 -62560 9053 -171794 -241246 86793 -239719 -210485 190903 -167270 -11272 -10110
21987 -10110 -338527 241882 58074 -347148 -263378 -20295 -158469 429976 -126962 -96525
21977 -96525 -29727 -330475 -93980 -20730 119554 -223936 -48606 -60885 140365 126164 136719
21966 136719 156380 222873 305859 125898 101135 63435 199819 -360568 -339884 -268832 25298
21954 -1811 -109155 -39871 -60018 -322671 -73788 118011 -240738 -75253 -177664 -95324 -60854
21943 -60854 7985 -219649 -100413 -131189 -54149 -206256 -142501 -28327 166882 -21506 -189842
21932 -189842 7101 -68770 -42355 99193 -57744 -212295 -375139 -254797 -319258 -3306 18486
21920 119322 440286 -97330 -203987 145978 -39752 -6296 81265 229832 350484 155439
21909 -362586 40992 36206 263646 -313748 -75462 -65882 -258385 -116134 69080 55673 46902
21898 46902 -25543 -171332 -220123 -341003 -240202 -119233 9657 254349 -212552 112488
21887 44720 -33201 -347235 48460 186004 154117 262487 195765 -337083 -91206 20931 454384
21876 454384 -29016 -67802 -108083 80336 -56565 35394 -232324 165235 -28554 -146528 -219520
21865 -219520 -201723 210996 -378051 -115458 -259511 -227756 -325906 376019 -70834 163679
21854 53423 70351 -430392 -35770 -7063 -271884 -36887 -369289 -9102 -46603 235085 256852
21843 256852 -34661 250171 -109267 -376586 -106803 -33527 -108767 83875 81670 -19073 2401
21831 -252637 -291169 8563 -395454 254876 125814 -50284 -157012 -79060 -108260 148318 -293694
21819 -241423 -46311 128811 126593 -183530 -87137 78076 206965 -160063 -132748 -316342 245113
21807 88706 568773 -140388 -133004 -320101 109412 146016 213123 98533 -151840 -47525 -1190
21795 55026 -37634 -4066 -78503 130853 -245351 215688 -104830 357450 -200839 381521
21784 -230018 -823 141041 -65420 -192136 -206550 -238122 58035 -135002 46761 217663 301116
21773 301116 147155 -73071 -39148 -197089 270295 -182940 -50391 156663 178191 -525 126954
21761 -109595 4237 387298 80661 -133650 -144121 -118303 -33230 -30661 -177011 -55887 29785
21749 -114703 -128343 105159 86437 64677 -89755 354198 263650 -165835 -530898 340951
21738 -112346 94205 -194172 197288 17404 -44902 26165 -112224 -186113 -238880 -276832 128712
21726 -31536 -244030 -36272 9653 -30070 -31089 152839 13491 -54990 360012 -86316 -90961 14836
21713 -16763 -289796 66664 227337 223893 -219461 142829 -119607 63732 -439954 -336271
21703 -336271 -172356 -127297 62338 64946 15224 -67829 237995 -38951 -10171 14043 337939
21692 337939 -241898 -169067 117349 13991 -99634 78426 532658 -32827 -97949 84823 -171078
21680 -391090 -122856 -158204 -88361 114707 193046 110940 -157939 -224822 -295568 -4031 -344367
21669 -344367 -239976 -175453 -78738 98301 30518 -176382 37900 1898 -130706 32364 -103941
21657 -3703 -165345 29008 -83452 -274042 60330 105665 184343 182785 179723 53582 327222 217027
21645 217027 -332259 -186838 70702 -15295 64263 135612 -93993 -399077 43467 137224 4784
21633 -107852 123579 97934 248533 -235776 -285132 -307616 -181254 184344 55146 92433
21623 92433 -121712 -158128 48096 -124337 -157308 -64486 -56401 319359 -86934 -126249 -24891
21611 192822 -266827 83409 -188937 -361096 70845 -31595 126057 -59623 18082 103810 -177406
21599 -16961 192017 22613 -198021 -203321 -20650 -89901 32172 -212477 -55642 36343 -79583
21587 -119075 257813 -62080 -400027 -331884 -30645 248837 104694 -225999 140454 249398
21577 249398 -50767 -83014 29805 -69704 -467128 17921 -151432 -148244 -231835 -343998 133894
21565 -105580 -313492 14490 125402 205687 -131795 290444 37597 231313 -139552 71686
21554 -52880 174186 133896 77758 54125 -513360 -16373 -209554 -250393 -72371 -53415 -104384
21543 -104384 -23031 -40531 -73033 -213177 35715 85775 61283 -72820 195330 267932 -83301
21531 144060 387146 -64556 -64942 -218972 71879 -125657 -39306 -180665 -55618 -128310 65705
21519 -351500 -97016 159144 88723 -208787 109682 -118595 -101711 157673 -148547 56968
21508 -306454 -210940 -53039 -46291 -299382 2528 -204652 33247 25003 -96384 -121229 24179 -5847
21495 311372 -258535 -256115 111714 -134152 -308388 -42997 -223615 90418 25519 208023
21485 208023 60419 -130647 -318679 -333642 55830 62112 51550 -76663 -6102 33451 -357205
21473 138338 350625 39799 -243139 -28891 -381488 -2149 -5233 282994 81974 -119608 -359479
21462 -359479 -35102 -346734 -60300 157704 -94685 -71893 -141313 -233687 242854 -13574 365101
21450 -38620 -29786 -98091 -282117 324799 142373 -22210 97873 -297550 116953 348220 52768
21438 337515 374432 359370 341774 64235 -69044 162294 180361 -37725 -101626 8157 -60298
21426 -5763 -169471 376 170732 -156695 35844 -235111 -368851 -148145 269645 -51844 -129506
21415 -129506 252549 142079 -26765 179468 216940 -89753 -122452 -118478 -173293 23045 -68904
21403 -146693 129473 -56115 -151576 -141607 -174754 201441 65273 19663 339955 -200138 228133
21391 -946 42315 203256 19945 -44572 12666 -139372 -70581 -111751 -193369 11833 -283315
21379 -70919 -149320 -47637 84697 23552 -169582 -33805 -425056 84091 -444627 -83579 -11496
21367 243425 -91250 -174215 95289 184736 -13658 146259 93748 -132098 -308017 194474 360675
21356 360675 60476 -160593 -117718 76235 105940 21389 147848 -275744 -253622 -359751 343960
21344 -47478 209302 -30846 -73453 3387 -275 165731 -91825 124621 -54681 14759 102621 -33784
21331 234976 -50952 -101848 -307513 76597 -112928 -6282 155681 -170601 -256369 34859 -438887
21319 -114788 -168129 -71065 -75047 -142953 -271720 -182690 -95213 -78024 -129307 -5434 -167407
21308 -167407 -132078 -297599 -65735 -36750 2911 -225838 51799 -153381 -284887 -183281 -251340
21297 -251340 -113847 -525338 -223731 394942 132352 75153 15572 -66887 -33601 -75462
21287 -75462 -314483 59204 -9609 170009 -201947 76983 108436 -272286 -45195 -159711 11078
21275 -204374 12859 -50461 -115195 -112577 -109221 -113425 -117929 -371780 134151 44632 225252 -204746
21262 -227123 219596 -151707 -95892 29604 -67049 -435044 -40934 50614 119646 185482 -168482
21250 -62299 -21491 -139977 220637 -191081 -33549 -462206 179949 101060 34161 -132818
21239 44957 195844 -138421 109270 63386 120668 28499 -394164 234887 13238 228582
21229 228582 131426 -309536 -122529 25252 -251274 92219 -318526 16674 -117866 -348323
21219 -348323 236436 3203 -153019 -12728 -285273 -101211 -63415 -100025 -82124 -404123 -44195
21207 -31177 366095 -150276 47249 85577 233307 41802 -107373 -204092 190665 -68130 98930
21195 -191153 56101 149608 -294208 -3205 -95139 32974 144687 84743 16553 -113320 -398270
21184 -398270 357763 -126920 -178477 67430 -33549 309539 21359 303002 -166154 87500
21173 -75630 -28228 141912 -341704 -275828 -155667 203731 11065 -339561 78274 -12609 -296280
21162 -296280 -27072 2297 268492 77601 134830 -30205 15301 213135 101866 -302408 -216285
21151 -216285 -55906 -23071 289515 -63602 128834 114955 -170833 -188234 -207148 -94659 242171
21139 -168647 -305086 -75015 155907 -78361 97582 70702 -333853 125543 -230297 -166009
21129 -166009 49763 -43795 -203045 31532 -189357 -494582 80395 -43506 113304 -254899
21118 114556 -230792 37259 -25656 -280637 -13236 107045 -106880 -257319 -216931 -161254
21108 -161254 -151904 -195885 -116047 35395 149679 321199 112809 -83854 28121 -138537 -148301
21097 -148301 -78210 305135 107743 426376 -88953 -208480 -10698 170937 -2372 37882 -61860
21085 -39199 -122158 -26106 -291291 103399 -121759 -193816 -167476 -39144 130440 -33917 137292
21073 33645 -385769 313993 -119581 110738 10793 109439 -200675 189634 -35032 -60969
21063 -60969 -71324 -64435 -54602 -145622 -161070 -122725 89034 -163839 -105712 143669 146822 132104
21051 132104 75242 -114220 -273649 -32928 -233294 -4209 38225 -147459 -402442 -45903 211853
21039 242366 -243698 -171684 -110118 -319087 50003 -84000 -259353 -118841 -161522 43067 173399
21028 173399 -220666 128283 -175069 -127150 -20579 -244284 -208998 71166 221412 89850
21017 -52328 -16777 -31708 -122964 -112019 -18476 24777 69986 -233009 -65167 -55479 -79429 -85355
21005 -85355 39385 83272 -53487 13265 182949 -481281 -318640 149627 20352 -23709 -166837
20994 -166837 113431 -176808 -246243 -139854 -150382 83266 -157878 -166908 -248472 159668 524402
20983 524402 385802 -203714 -26950 -109980 10478 -118878 -254545 -370578 -66766 264744
20972 -7206 104871 -342548 199010 45295 -53667 -83093 -159070 17461 120553 262963 432066
20961 432066 -284853 1415 116653 -24636 340737 -116517 191390 -261219 -68363 -64777 -147088
20950 -147088 -186307 -351768 -501058 343983 248904 -228738 122226 -120931 -13597 231553
20939 106705 217496 -383950 90907 -123986 440262 -58061 -46606 -238514 68711 -218894
20928 -15351 216976 162752 -62065 -193339 -186645 151597 49619 233043 -32511 78335 -3461
20916 235662 -149646 -142951 -372051 -269936 -184956 -141634 236278 -334428 -35574 -69650 -23748
20904 -170717 -170724 -169039 45912 80559 1275 -64383 -220891 179703 113997 -200236 99383 -187160
20891 -440285 116802 -317845 294250 -237649 -163576 -167458 42551 -273195 -459507 -67903
20880 -90274 -81127 55343 -310545 -213805 126992 -123909 -274517 -47913 -12914 -400401 -72182
20868 -252121 -4904 -7617 90214 -29816 -243760 -71950 10038 -178620 3020 -74273 301399
20856 -183167 36394 -451917 -139800 -213782 165438 -233066 328158 -293129 341802 -127106
20845 -265837 -339339 134474 -185848 -220130 -225693 20112 -350510 -244284 -18119 10857 -18382
20833 97825 -91738 115016 -68387 -87746 -171085 -354849 -215541 -196344 64592 115775 -414165
20821 427794 113561 -329543 217846 243682 176777 -201859 -26489 30803 1480 -231452 276977
20809 -156041 -135298 82022 -219653 -118112 -122855 -260265 32356 -74408 -91294 33727 333630
20798 333630 -39419 -448 137992 243543 -253545 -191786 23611 -51484 5137 67856 -2083 106835
20785 -113763 246620 -1444 -132106 188448 2439 272646 41576 -123047 78551 92833 289004
20774 289004 226417 -52987 -269807 -86838 25804 6514 -37309 -53837 11691 197572 390199
20763 390199 -175621 -16722 -219974 77078 26227 -125732 259563 -108665 -95540 -395381
20753 -395381 -145153 -163633 -341020 -47498 -312583 -446223 -159421 -358487 -103953 -181471
20743 -181471 -164198 -134434 -245902 -260785 217374 -187552 -207760 196057 139659 -211649
20732 129773 143558 -16520 -208847 -45731 -307447 -83876 -281054 135796 -77341 -382783
20722 -382783 -182680 -46243 -178665 58008 66762 -308129 -43396 117059 -11785 -7638 -276328
20711 -276328 252051 42128 -84010 35714 -83873 -450600 -94062 505703 136579 -66704 256245
20699 -153052 -238350 -127247 72019 59260 -155766 -129311 -337160 285840 -232130 -233197 -259220
20688 -259220 71834 -305677 -261897 -177522 -337319 40516 -38753 -325927 -146960 -223548 -123528
20677 -123528 292808 -73450 -140116 188629 -48899 -193982 -249491 -156761 99380 -338729 -76801
20665 -194372 -391427 -193165 -126629 -49712 111838 -64242 27784 -437230 -551221 -21625
20654 -85770 90930 81518 -185565 -273670 186694 29657 -58738 -14186 -107763 -236919 134290
20642 -182394 -201456 15452 -215226 52562 -131537 -185409 27252 384888 102097 -269785
20631 58682 270558 -23792 -269889 383709 -398906 56135 -297801 -253023 284008 -124652
20620 172099 -57761 -389345 232536 -112884 24984 -384810 -72475 144322 -272288 212538
20609 25576 -93368 268356 -278163 272584 1846 -221096 -62782 -2170 267479 25669 -247160
20597 190081 -95468 -125725 -296100 -185332 -240385 -47816 118172 -9055 286545 192352 -288289
20585 72240 136942 94198 26260 -123594 -102278 200504 -83382 74964 28931 4783 126257
20574 126257 54595 274298 -108452 33564 -16322 22277 -180321 -90090 -22654 -81394 -57795
20563 -57795 -191702 20283 -27644 -125755 59074 -161822 71045 -306716 85702 -73581 163190
20551 -40440 155681 -94224 70197 134893 115957 206166 -315509 -166395 -228720 -40642 -297147
20540 -297147 87526 -214751 76031 -100090 142156 -266806 -159028 263836 48255 -122346
20529 -296778 -70558 -27676 -23231 9033 -289438 209390 -237892 -32814 -148858 -241377 -23640
20517 -99530 12462 -138726 179445 -38520 61965 -174831 -7715 50796 -63975 -51328 -143010
20506 -143010 -90132 56430 22464 -51875 -271027 17234 -57106 243986 -80054 17199 -125688
20494 258766 82728 102455 -4798 20935 -159678 -218117 69173 -43717 201009 192397 -174625
20482 37365 11830 373603 28183 118617 58201 -50265 -104923 78017 44740 -237917 -42579
20470 -106274 -90960 -243924 -248605 118543 431943 106765 162551 -121711 -40092 -40886 -308745
20459 -308745 92187 -171071 4613 -77613 -28193 154971 -221773 -139764 -138502 171494 -73687
20447 -4337 158682 140750 -200045 -116143 59371 -124583 -55551 274709 -41611 -163438 32387
20435 315687 -154702 8150 340964 347417 16306 -237541 -106549 -203578 -97315 77140 7297
20423 84448 -106856 36715 -77675 -219059 -460125 20227 -248211 -242212 -51880 7442 -112359
20411 -46865 10981 189150 -39522 175302 -370068 -52482 -204747 52194 -440075 -46567 -103973
20400 -103973 -44088 -73778 -246524 -100337 -68937 -25140 59733 -242855 86168 287109 51963
20388 -258069 -45482 -163469 -138093 -131778 -148529 -195716 -117780 -336901 221681 38318 -112783
20376 167661 23792 233071 -103963 47560 145496 239862 222979 235400 111458 586 -62822
20364 31983 -158265 -53922 82112 -39605 -64224 223477 -180023 -187206 366641 -202948 -131501
20353 -131501 176602 -160640 -548263 -239989 30888 -202792 149599 -112111 -163946 -158655
20343 -158655 88800 -376048 -224697 -118686 -166856 -275644 210784 -76474 31117 -61192
20332 -625293 -230885 13978 -69789 4667 85169 270415 10847 105761 -313484 -36235 129240
20320 -93883 -86362 63198 -102697 -36405 -172461 190908 -117213 -8309 45375 282777 -145193
20308 -351089 -85533 6827 71511 -112308 -54131 159092 204617 118191 106073 44175 -62422
20296 106166 -17756 212065 -158428 -131468 -6855 -245006 -122570 -179502 475388 -927 -309563
20285 -309563 65359 -211319 149821 -70521 -57088 -47065 270585 180013 -104783 -123888 -386337
20274 -386337 -209274 30649 -354240 -234869 -202022 -78318 -26988 -284614 -26610 80890 48808
20263 48808 21512 27879 21156 30999 -198731 285795 -66652 -100904 18892 -319861 259236
20251 242499 271339 208543 -406813 77505 22416 -145134 -454032 -125398 -199388 62560 -41389
20239 11158 57949 -429312 -68292 272818 14920 -164029 -22994 16360 -23855 148759 -97621
20227 -295360 86555 -336349 -305792 -189962 -42212 12711 52732 59857 -123202 -402309 -198119
20215 -163889 -163058 49727 9000 -163395 86309 205546 6140 32415 -327390 -19408 233711
20203 -361258 -436406 -170382 -23267 -259294 -82574 100990 -23421 -39892 -154931 -13273 -340958
20192 -340958 -101509 -253315 -180519 239612 408837 -21403 -188706 125838 -181826 -389750
20182 -389750 -403285 -481 -169551 -126877 -226926 -191842 -71794 -105799 -119093 -168710 24632
20170 -45854 -180415 -213966 140914 64077 -130956 79176 375015 -150843 -397800 -218869
20160 -218869 -307645 -88483 -243520 178003 -87015 218796 118368 146242 -78041 -113585 -153598
20149 -153598 -319010 -15337 15908 120055 -147334 255768 213807 -259213 -326693 82189
20138 -153630 91291 -92466 -139771 327091 14483 -78635 52996 -38065 -68547 -12037 46411
20126 77 -46199 -58174 -186032 -12672 247047 -143155 -81322 -44894 138373 51589 -75432
20114 227513 -369199 -343875 186767 -140634 -149829 -35377 -137235 -31989 129380 18817 227393
20103 227393 70309 -113709 124499 -101470 160911 -54305 -107356 57647 -36331 289455
20092 -345961 -288986 -37146 88027 -113511 174129 249819 76064 -139767 -321293 183968
20081 -231515 -397830 -123479 260751 -125803 -22338 21571 71923 217727 -38953 161916
20070 48709 240900 172093 23057 -76383 237210 6706 209964 8722 120170 -219903 -47660
20058 87780 -200811 -166168 -171806 -206859 65563 -158863 -150268 118535 -78290 181392 189349
20047 189349 88051 61327 -37318 43636 -346144 -411113 -45049 204331 -142149 277035 304118
20036 304118 -168489 -124007 30790 -11021 195275 -18893 103607 -88975 -338568 -22213 -119585
20025 -119585 -262935 168695 38077 -56381 270691 180319 -123403 79107 -204794 -323810
20015 -323810 -33855 -182448 -218552 -205370 -90052 -27140 -101979 -238207 173057 28764 19271
20004 19271 -130483 73444 186008 -338467 -117114 -95294 53964 279996 147542 -170437
19993 -5351 -59231 9253 26640 -4259 -99497 113778 7280 2375 347018 186631 -357925 -153548
19980 -311168 -36865 100275 -98776 107901 -107132 -176556 95229 204744 194277 -192916
19969 70931 110753 -8258 -179425 419707 -191420 45642 73614 119008 -178862 -39630 282514
19957 -8866 172373 -222240 22116 -158353 -43885 -14771 -223503 -77492 31959 68906 -297879
19945 262661 31054 265382 -160943 211437 -382671 2774 -425943 -466 -72460 88605 -185569
19933 -137305 -10515 -113609 55556 -218645 -377174 71380 -57908 -9085 -140325 -342373 105618
19921 72319 -259941 127403 -237355 11118 146383 -69032 -54434 117860 -198695 85223
19910 85011 -109210 36847 -32539 -44554 -164324 138187 -358959 -266764 -166825 15543 84771
19899 84771 -164034 -69765 298905 -163764 455725 48634 79664 -35814 -331281 82830 -91949
19887 -313044 -68453 -98400 24123 46548 -330073 -289020 -161644 -51465 -36991 -89061 349525
19875 -239741 161082 251423 1847 93971 -371237 -78435 -97472 -131017 381616 -250809 -301184
19864 -301184 -322092 -75524 -266051 -160955 -41371 -45367 -215522 46366 114136 23914 -885
19852 -230099 -79854 71006 -359999 -155188 -232713 94863 251407 -102000 24205 -282879
19841 147350 -243463 -193042 -269501 -132563 -462203 -316886 98880 -167434 283274 111783
19830 -248802 -42048 99977 -189277 -262036 -103261 224842 -115509 66394 -62791 156766
19819 92303 -236434 -498588 -61305 -122164 184777 224106 -74117 209335 193228 207565 -337488
19807 -60439 161178 -8014 -145953 -187027 67297 119635 117646 17727 -23024 138827 7671 158179
19795 158179 -91439 -315393 24593 61989 -122354 -196048 -249819 -194373 -41331 123217 -48696
19783 222753 -61504 -49329 184900 -258242 37975 194218 28371 -157410 96184 175298 2723
19771 -93189 -23479 -183373 -116602 96292 -134026 348163 35600 -348356 -65818 -170492 146451
19759 119606 5884 -312151 -291724 -199261 -74922 47292 23480 -371521 -73648 -152977 -29552
19747 -179514 134911 -68473 47514 -226442 170655 106468 -309839 74379 197830 -418693
19736 59968 42316 51586 -1140 -316106 -23986 -192041 188770 -90059 -57147 84395 -425732
19724 12470 83383 -67591 96554 -258280 -461592 -103843 79078 -94138 -303175 127728 -443495
19712 -55911 -169825 223430 -199785 -107680 -99956 -40785 110962 271149 -107605 -386104
19702 -386104 129632 85162 45175 96457 -30255 61866 -9824 84756 47246 34133 317786
19691 317786 38946 -245882 104882 -196146 -16304 -344429 -223613 -124182 69376 -155415
19680 -215058 201394 -34707 88615 -131150 -297568 -42760 -36510 473742 34644 146152 -571581
19668 -156624 -315698 30065 -234215 -10381 110392 219814 -246844 12633 -104017 -323384
19658 -323384 -267975 -192553 -111172 -171437 -92339 -135945 42011 82410 -326148 136511 186986
19647 186986 -210411 44166 226167 86588 43296 100888 109092 230738 -19981 128916 -70091
19635 58128 -108932 71928 -52293 260066 -329491 158835 47887 12294 -118431 131463
19624 -41843 -151680 245325 -156345 -419411 180456 -113416 -261597 122931 -192069 -222425
19614 -222425 53701 204377 161411 -75243 54157 -218815 170106 -52601 26815 38958 231192
19603 231192 -28808 132237 95497 -273375 -258548 -96658 -76586 -20356 -484881 16780 -547349
19591 -102165 -384274 130789 -218637 95661 -16094 154602 126351 -14790 179803 215854
19581 215854 -59060 140115 -89193 -3036 -33142 -125478 -129119 69709 35423 -29223 -16135 -116249
19569 -116249 -284545 -39465 -175464 -335498 -193936 -88882 134176 -42561 198455 -353457
19558 -142453 -150105 164007 -17736 194054 67219 -76914 -98969 227808 172820 -16345 -204693
19547 -204693 8117 -130334 7220 277123 181054 10504 215303 166267 4271 -132117 -175739
19536 -175739 -247154 -122650 -59812 316325 -57767 -76634 -248844 -34553 -237702 7304 -95785
19524 -434934 -131269 -24261 -64187 -45435 -113541 -79127 -63328 225261 -150452 -73814 -3401
19512 -174729 50972 -179067 -12476 -72600 98384 42943 -360372 140150 -129844 -186621 -380294
19501 -380294 -394074 -103007 -228683 34286 171361 -168191 -161828 308698 -107607 198888
19490 282074 45432 117875 190845 356306 -165189 -114880 5928 -269597 40979 79006 -35402
19478 -31348 -69449 -278272 -232280 119456 -420608 55325 -104265 69372 -416575 194211
19467 -48583 56210 52311 -83327 7529 84339 -197667 133576 65672 -60636 183634 -134612
19455 -197015 45966 -32109 87346 -165693 61004 -160219 -381612 -67482 -234899 -105343
19444 -96305 -103985 111840 -195139 241740 -273103 243271 35422 -236855 156126 71973
19433 177207 -119328 -199201 241994 -350805 -106947 -72893 -180296 -277741 172536 -127169
19422 -213342 -97779 -225210 267062 -238997 -150893 223043 -138482 -198896 -223423 -86967
19411 -248769 37840 -13542 103101 -203190 239165 -108892 -9588 -239596 -132264 246823
19400 133757 -418600 -257368 -36894 226039 -252349 -111603 76911 80017 50522 272659
19390 272659 -306319 -366947 -52160 228020 -72256 447543 -277433 -53097 55691 235789
19380 235789 -108839 -331957 14809 75941 54091 -19224 -19037 72718 -232830 -212779 64728
19368 -99195 -89640 -431513 -262442 -3638 110464 -279606 -271605 -275017 -368588 44081 -222934
19356 -26234 50826 41792 -212962 -49096 -214820 -174686 -100152 -124692 -150731 -451080 -128933
19344 -72398 111765 287205 -61424 -153434 224459 -124206 -320888 64291 -100778 -308409
19334 -308409 -206570 -209448 148933 119145 -97500 -85751 -381044 -64976 -71896 -281041 -111691
19322 3449 -8773 112988 -116165 145934 31066 81042 47320 259922 -269648 -152794 -50357
19310 359104 75595 -89429 -30094 -47161 -226903 -4847 -192060 426466 -41735 -94327 391752
19298 -87429 -300185 -3127 13502 -136021 208703 -67361 -227395 -214438 -55894 -135827 -269640
19287 -269640 144474 28489 128893 69855 14037 -153676 -362209 -238667 9238 68953 -151537
19275 -5536 -31223 -15702 -318467 11578 -205587 9171 -276405 259723 124768 63625 218199
19264 218199 81250 -54656 -7467 46047 -137345 -75167 184050 300215 150669 -83539 -367854
19253 -367854 117343 93919 -28722 -373537 -149879 10770 -58081 -22363 -225063 -4608 168834
19241 -76242 -154996 -442691 -81466 126308 -134617 20044 -130782 195691 -69229 -32671 -22028
19230 -22028 220571 58486 -1286 28026 10278 -178425 -85128 100068 -52620 -138740 -67213
19218 -36914 -141705 -56674 -226059 25567 24676 -163215 23098 13642 65853 -222257 131615
19206 76413 145301 85120 -119128 -41098 158237 7278 -134126 203734 -338689 -48463 -153382
19195 -153382 -128506 12924 106068 26407 70523 -33919 110763 -166091 -118402 283861 25170
19183 -107645 280224 347934 -258178 -102121 -27898 227889 -273506 24100 -336418 -342309
19173 -342309 -32234 -287694 -158542 121949 -301779 -15650 270542 160137 -185371 140582
19162 8446 -136837 -168201 20964 16826 95183 -11370 -217189 -222284 -379011 -35116 -186531
19151 -186531 70165 -370994 159407 -134515 34979 301297 -168528 18797 -222475 -50036
19140 251175 146457 -328575 -357189 -102127 311654 -317947 -73454 88162 47919 -17352
19129 -193919 -89571 -164394 235169 345196 132232 -64718 -87796 -161993 -93885 -263098 -117995
19117 168570 -95217 -496571 -187018 183578 -288949 -175258 154431 -125712 -174812 61515
19106 221001 58578 211421 -10766 220520 -95732 -164505 352564 34989 -303358 -182604
19096 -182604 40910 -214533 136641 19431 -282091 -301520 -163226 -171726 -222608 18727 180254
19085 180254 -62811 -114355 -215993 -353403 246945 -176831 -315860 64576 -88669 28072
19074 -229759 -127856 -91936 -68356 38699 92439 110129 -6258 -63656 -285956 100753 -176107
19062 85216 272657 55633 -211535 6911 97085 171714 -3727 77331 -105989 -22054 50014
19050 -83400 -202789 31627 163092 290454 -26977 -173858 -131447 -236308 -165079 122977
19039 -295154 -379687 335087 71479 -311378 -165341 94232 197175 -32105 167148 66183
19028 104794 112734 -18196 158656 -77649 308960 -274789 145882 134822 -27508 -234060 22934
19016 221745 -99269 -414802 -167860 -54498 -76380 231714 -153304 -93615 110997 -88344
19005 -76639 -123138 -77104 32016 -146644 -126603 -20104 -54879 244062 -287231 -296014 -15300
18993 -176987 -181596 -125725 -74668 70070 -71814 -222617 -32538 -99612 -7539 -5355 -99159 -250690
18981 -250690 48741 -163338 -222874 109431 -16644 143134 66093 -140741 52043 -43019 -224890
18970 -224890 -103309 -28283 143100 69297 -64976 152743 -257649 12418 -188340 131622
18959 105556 -108703 255465 -210650 -272822 -206231 -196764 139512 -110831 -77443 -180364
18949 -180364 -239332 -37092 9923 283212 -287298 335022 38522 37949 -170171 -232445 -42517
18937 -35912 -165852 -126079 -191042 202968 -186426 175398 -70347 131875 -10621 -63398 -216271
18926 -216271 159851 36460 -217923 280968 -183942 -204366 -253475 -90588 32402 -289901
18915 27823 84768 5241 55221 -99664 113354 244939 -42932 12986 -83372 -229574 -164340
18904 -164340 -75754 -249410 -44811 -210418 -95950 -90824 -52917 -131411 68469 -55719 -91709
18893 -91709 81396 234386 -188557 -9325 -403370 -225843 -223529 -51234 335033 -49342 -298890
18882 -298890 -207667 -46710 -248367 246734 -536564 -209858 90057 16408 -157021 -252444
18872 -252444 113447 -90393 -113575 -85562 -189607 -97084 185560 -11107 2296 -160292 -475959
18861 -475959 54257 -74269 -233626 -105503 -196304 -266469 -345467 -96145 105131 111365 -180893
18849 -145265 136075 -296497 206830 86158 -10804 118042 -91414 -53960 259683 23162
18838 97619 194983 -178148 -89268 171089 -14630 -57772 160031 229771 -184955 -352741 -127886
18826 -1303 -78029 112275 154907 -96213 -308154 -60644 34869 235677 194915 -14447 -165172
18815 -165172 43158 268920 169190 36308 287408 -179588 192484 -24989 515948 -267415
18804 39371 -167119 -93353 -28564 -62917 265031 -110919 200936 132995 254636 -228643
18793 52864 -193128 29211 -109720 -281651 -86091 -118582 52930 17522 -102135 198889 -230544
18781 62353 -172047 -26264 140546 51310 78817 -313709 222986 77276 4407 104134 -210252
18769 28742 -77803 -279565 68725 -178290 -17716 -588764 282880 99662 -209067 189554
18758 79555 -94531 -65281 29752 -330011 4322 87617 -281223 -201541 60005 -35532 11537
18746 -221000 -108763 -84420 -256421 146629 -33723 -42653 119639 -96156 22704 68701 -315211
18734 -297027 16629 -197825 55391 -232079 -95247 -253248 -195485 39764 54738 158841 -3937
18722 -308177 214502 44656 50447 224955 19195 401093 -108772 -95291 227522 47671 159459
18711 159459 330431 -118964 -267417 190700 -138348 -261585 5766 -442291 -286167 54291
18700 -14523 287066 -7353 14038 -260955 -169247 -284336 152715 -79528 -33431 -130529 -41925
18688 -225768 103989 -300161 -243760 1325 27513 278020 37395 -106849 -170146 51932 -270170
18676 3922 372165 -93540 -138798 -128616 79468 -269827 -218164 -107636 -110929 -63078 -174180
18665 -174180 204820 70274 143721 -226765 -95799 103129 -205016 -239554 -156353 -220972 -46942
18653 -231759 -258296 43623 -235017 119588 18514 -13343 77460 40416 -91134 -260979 128576
18641 -256796 73541 55646 37364 219032 -288606 64663 -331520 -17477 -178258 69121 321558
18630 321558 151145 -12303 -705024 -275689 -206882 -10388 199810 -302971 -331161 84570
18619 3003 -4101 -105988 22113 -32980 108406 19001 78546 -337900 -233812 -23402 -196989
18608 -196989 70944 -85357 67992 39780 -109991 260809 450705 -345580 50244 382486
18598 382486 -427632 -86155 35268 -148948 158710 -31706 -177561 61032 -232052 252910
18587 -6699 -93207 -146537 36288 -1444 -231040 15777 -26845 352521 -59501 7466 23607 77980
18575 77980 -320784 -183924 -149217 -303427 86458 -233266 -4303 96189 105701 -477516 87810
18563 -103214 -140315 19304 99821 71017 -225237 -175972 44126 77551 -99114 50440 -34077
18551 -273696 -32830 -39962 3961 212706 235271 -145004 -272057 19306 -301926 -30832 76606
18539 82190 -138692 414656 -106288 155112 -309893 115136 -193133 -125556 60330 -173077
18528 120745 -69664 -283402 -65855 -123679 -218157 -158218 -46015 143275 -148046 -167056 -266067
18517 -266067 14142 -360725 -101713 -92356 -84521 50470 33096 19736 79174 -272049 -28137
18505 -105339 211773 -83729 -578357 88446 -198288 69619 -175532 6845 126905 45114 108811
18494 108811 276090 65492 222995 -67330 -5076 -66402 -8649 15508 26591 -103867 -411479
18483 -411479 141754 -29771 -159812 -80859 -9469 -16998 -169513 -77783 98291 -66251 -188898
18472 -188898 -40824 -112801 37827 -47771 -45377 -239550 -68729 -203100 -16416 -66262 -313287
18461 -313287 -35087 -63852 158625 208355 165907 -112034 -217353 -73199 299672 201745 -2806
18449 -229291 -3873 -118040 16918 262667 62201 -68326 5545 -33459 -258495 164073 44575
18437 332220 -173093 20970 84252 -114191 -285275 117982 144624 627450 -556205 260228
18426 -48373 -55997 -65607 418174 -310188 -181006 42242 218787 -137142 69366 -82951 -63972
18415 -63972 -110813 212406 47767 -22067 -155882 -29536 -30322 -200326 -35929 -172737 159506
18403 83380 299530 -78917 131808 247641 -203527 -217961 87314 -194966 28906 -7876 296945
18391 -157943 -47909 73085 -212985 38245 274166 -67209 40681 115942 213951 222089 -132960
18379 92021 -45410 -368913 -188242 -80313 261765 -199357 58675 -258831 248746 -252532
18368 -114533 -134359 9212 -121968 28606 -193834 -468260 90322 112152 -43340 -111597 60162
18356 267693 112462 294255 87257 11147 -187439 -201653 -110671 -283667 -143407 124664
18345 -38810 -70209 127010 -74844 -309990 -10232 -63562 -255470 -45116 18242 23156 -284340
18333 83140 233532 92812 -120484 135889 95067 -12674 -164676 -66760 -146831 83430 -357524
18321 -41331 158524 105249 -67631 142985 -233349 -269555 18888 -196416 -229794 26041 -4694
18309 103831 -9079 52148 -135237 -274046 287937 6356 -19025 64321 -152380 2914 -163600
18297 -151384 20101 -83563 41138 16357 -64289 -78829 -153522 -20372 -114218 -154029 -67262
18285 -5664 -200010 -172618 123296 -156486 -176726 139060 198088 81254 -9310 63397 -4843
18273 -72406 -211543 -106578 -214444 -69332 -45419 -194473 210322 -5891 179365 69935 -20241
18261 -168534 -83340 -332656 -33102 166825 133591 -192604 62338 -29218 53930 6085 141158
18250 141158 -20720 -148640 5154 342311 -154265 -75609 150547 142320 49689 -152241 -77997
18239 -77997 -196796 65335 -214306 107085 -174358 101980 103512 -13803 -349143 -126989
18228 69323 -406570 -31884 -110936 150406 382659 64743 -12182 -296050 -2912 -45511 364234
18216 60005 -2200 134184 -131507 121907 -227142 -108198 247236 129872 -81924 214697
18205 -137591 92236 -266968 -101247 -203962 -186881 194799 278360 -312018 314649 -295188
18194 -59430 -120669 183497 -36541 249693 -184699 -102099 55894 60374 -48385 3011 -129052
18182 236895 213719 -155893 103360 -273729 -104210 210751 23898 -187065 46928 41301
18172 41301 -314817 26887 -394845 67666 254166 271825 -191083 148707 16104 -312677
18161 -94221 119711 -24514 -252199 236859 -76788 96728 55903 108457 47870 -82252 -223014
18150 -223014 -16799 194331 108672 -211465 -234941 30945 -373722 367398 -72 -203390 47867
18138 -261350 46160 -50805 -175633 355387 17084 185194 -60679 71034 -210489 147482
18127 -1419 59708 -141864 49599 -13748 137372 53119 -247410 182317 100523 40539 -137311
18115 -125443 166938 -503679 82531 -76927 75430 36725 247194 -145867 55217 51253 127342
18104 127342 229753 -53654 -147491 -196749 146514 -34551 -148886 243257 -131982 -9359 76457
18092 -82443 156905 89515 -75139 -77039 -211218 47135 -405270 188672 -153182 29905 -81102
18080 -24034 98608 177136 -96005 346173 77540 11986 -366800 -310083 68831 6170 -55325
18068 -104601 -3607 127598 120800 -179601 -398853 63921 122239 184846 -214186 -181073 -87103
18056 -156457 -26111 175461 -261662 -7074 -96323 -152692 -280528 -222453 249385 -100395 -61471
18045 -61471 77097 -69002 -65444 139232 34454 307034 59144 175634 285960 -244327 -77726
18033 -116339 -39403 -243237 151933 132513 75525 -154565 -204363 99210 512467 -118516
18022 346434 -258327 -131438 21437 3432 -194183 -206775 52227 58233 242726 -203465 -91777
18010 -338286 308718 -387817 -49600 7516 146615 -355681 154823 -4791 -76420 142271 -108482
17998 166245 -330080 -11035 -180571 77485 175731 -201033 -250206 123198 -125314 -437403
17988 -437403 -28542 75316 -27273 302113 -236421 -95385 51929 -371122 -173159 -23427 193097
17976 166319 -101375 -51320 -222725 -486580 -56968 275273 -131375 67280 -34242 -157999
17966 -157999 -98480 144994 -49331 -450 360049 -20869 -187627 -391327 -83586 14917 294668
17955 294668 127070 -62338 -193821 -170859 -349516 -173181 -2887 21369 -238258 -97193 -115507
17944 -115507 -74386 -278187 -134152 -52903 -131026 -208613 -112429 289633 113683 216776
17934 216776 -46894 31669 61875 -302656 39890 16281 -69420 33838 326084 -97896 -76032
17923 -76032 44428 -182761 215598 -18038 131142 -28522 236259 197181 -179922 1271 -117612
17911 -161741 111232 -197516 189239 -31390 -195366 13343 87102 5848 -152046 -4754 -240793
17900 -240793 -29168 -144841 -291742 146259 48156 252351 172679 -97510 40082 51427 195573
17889 195573 -104034 84399 301641 -398987 -37533 -73258 -168448 32187 175782 -39161 -79520
17878 -79520 -179594 49404 452086 -1449 22743 -267555 -109103 -37078 -215803 -177809 -183127
17867 -183127 199020 -110633 352796 -168690 -197422 -194650 114332 -243562 -274479 111138
17856 1652 -144581 133900 -216215 -135998 111430 161556 10402 -7348 210315 -78136 97895
17844 -134428 -267924 19583 22913 -238011 -43819 -2983 -78279 355099 176990 -86468 -118941
17833 -118941 35735 -84174 -42893 -15893 -57403 -67792 259930 201783 28645 -23818 -31408
17822 -31408 145987 -132902 86661 -172080 127983 -11348 254339 319173 116826 -113254
17811 -104322 179408 190514 44844 -31547 90950 19013 -58229 126538 124353 -330390 -160942
17799 197207 226124 15697 178205 183710 33359 114186 108155 -108133 228311 177257 -128185
17787 160409 -60420 -207226 218982 87847 139484 -102337 -132831 96312 139905 -68925 23629
17775 61169 -293214 -105712 -140910 363542 184779 9464 -72740 57869 61856 23293 -112004
17763 60103 152660 -12778 -384572 111100 27037 -9195 224679 94232 -120049 132862 -195502
17751 169169 28402 262797 -64842 102877 -142433 339074 56451 -101319 -80435 101706
17740 -294833 -228422 137358 259225 172076 -21484 267529 -9564 228165 -190226 154980
17729 57904 83471 -6373 215257 92766 12481 7139 -180041 291747 -84431 457567 -48225
17717 95419 38735 125478 -18418 181716 133926 181770 110150 241093 -164439 -43136 -30749
17706 -30749 -55157 3764 -52184 71910 -11002 193360 -405630 199152 45823 -140033 -157435
17695 -157435 -100932 -105989 -205357 -236124 293790 202826 162114 220665 109794 -90664 26434
17683 -143708 113100 312433 -71697 -106162 -253072 112927 -263709 -338058 142335 -22073
17672 23659 156980 49061 187506 -133388 183905 82340 102935 -372924 138870 -155562
17661 -158684 121935 6194 203404 -113831 85892 137438 -65038 -95316 -139995 230341 -235273
17649 503289 63565 23257 18631 -69400 -246122 -51157 229695 52009 15476 214472 202970
17638 202970 -217921 4698 160940 -234804 36630 152606 135992 -342009 151900 -177421
17627 -2865 64645 -25538 -318235 48750 -41137 265887 123848 51541 296900 46744 26538
17616 26538 -46979 -90213 16593 -113838 -29409 -17932 223354 -50827 -57907 177206 319182
17605 319182 -22990 -162592 408619 155476 370826 119709 303946 -34726 -57063 183920
17594 -31866 124452 99408 70039 56479 220880 -90203 471797 1817 212814 31111 122434
17583 122434 -117255 140166 -15697 -112472 43550 58164 208471 314706 22322 82757 107592
17572 107592 -298429 148069 290998 73279 40085 68036 237749 46758 82714 41784 66576
17561 66576 -29207 9788 93260 64949 -69338 266385 12196 -233197 241277 -134980 -84552
17550 -84552 82630 -76932 -315718 99971 76489 165326 104832 424841 55941 86611 112691
17539 112691 -10803 149345 -251364 389565 -61821 150105 254381 32576 167886 5247
17528 -73155 124829 -62267 -66833 -94411 168483 44984 270920 -72395 201358 201441 178021 4055
17515 120076 -149214 176542 -32093 138987 -163094 6556 252606 349095 -165475 77652
17504 77413 -57137 324296 307347 334264 116593 372279 -41714 132076 -91615 138463 -10911
17492 299286 29553 46747 47534 338134 130105 62966 80234 86451 290940 108245 278531
17481 278531 -89492 47605 -117437 -96668 267093 251624 -28709 -112521 93888 28220 26139
17470 26139 315564 244045 211743 192817 28487 58306 117047 37212 100709 199171 51556
17458 -112502 101184 319406 -145825 18381 254862 294102 327796 155185 301844 122511
17447 413541 -8471 316853 252831 331562 224653 305233 201206 -74761 329408 296746 92797
17435 568143 189709 214499 192863 141596 182592 180798 241205 414707 123014 99368 93540
17424 93540 105235 -44185 524047 392678 46480 555184 336299 743656 440876 335210
17414 335210 275010 21715 311222 42284 120337 276406 99347 212455 115913 351779 164454
17402 151548 248806 -55586 51756 429570 -37099 418741 -110452 108885 -83926 166645
17391 62971 202480 124371 -18106 -40820 330061 142065 -225358 236832 97978 243937
17381 243937 -97768 155880 209206 295672 62583 102470 230679 41452 371090 275544 28734
17369 -44724 -22237 531651 159157 151179 -98451 119729 215145 -25842 256207 277893 164677
17358 164677 214476 296483 -253311 259562 -331261 187720 350328 -14590 527925 21360
17347 -82326 390551 271465 178917 134667 331294 84434 -131769 381712 205841 -131491
17336 263388 -104649 270092 99675 233342 362584 378444 194918 165470 -91676 94825
17325 87821 29066 209773 195957 306975 527231 -65759 21042 625031 20651 338159 235926
17314 235926 59899 14375 243622 -8020 454731 37534 24592 -1303 153558 314532 123511
17302 314803 66308 305386 293374 220197 -29421 450253 -340996 220335 126532 -47789 409369
17290 -141213 -168250 151127 351015 141476 329605 197251 209295 22159 436527 406676
17280 406676 132610 335890 447240 336973 73583 316645 101053 192070 214733 10258
17269 137490 -95116 278396 252955 83501 55529 162971 406064 162940 320910 570686
17259 570686 246555 61880 -77629 214997 11393 428180 -23131 323258 -60173 230385
17248 151664 345010 309972 359734 389230 185980 69362 643936 402250 -97516 533733
17237 -12441 286637 152588 652037 344102 341214 263014 131669 419929 383207 313894 210297
17226 210297 20452 -40701 -611 270396 78470 604546 308601 360191 102964 150502 130434
17215 130434 295733 523558 262571 361823 241998 288547 453683 266 347704 332063 184057
17204 184057 359069 108368 397803 21368 289874 129960 98516 17495 10517 288901
17194 288901 241147 235496 71517 539006 168499 283366 363974 310944 286897 273164 478445
17183 478445 509512 225048 84442 490940 -845 -56445 439095 547760 319312 152803 472948
17172 472948 -48737 203285 308691 226592 -91623 299802 692051 -24960 298719 15639
17161 125268 250945 438283 231786 297073 657956 504064 111142 225176 295636 235991
17151 235991 520311 384825 184717 322067 362760 453347 417049 325231 339054 -8218 371794
17139 753325 264442 559542 258719 500086 185169 373685 165141 402081 386960 390314
17129 390314 402000 286467 506117 197097 389189 552879 314683 543377 596394 188589
17118 610358 360043 491361 254475 509918 497489 346317 192385 647058 145820 30307
17107 593131 415524 306918 577071 642797 485593 188963 241954 512114 450792 637258
17097 637258 478210 237275 243208 430673 126574 720391 263199 407241 431014 616368
17087 616368 726852 596548 208755 270752 610256 797192 752679 450766 355886 602692
17077 602692 385264 407479 313673 206543 683824 604369 394379 554883 641874 755207
17067 755207 743129 505577 699367 370240 279885 966941 142517 314463 617395 746679
17057 746679 374544 586475 436353 424574 320861 862145 487966 734823 716903 637059
17047 637059 600657 459537 724430 771966 664374 535436 440332 729378 519805 317952
17037 317952 733704 840714 145120 883880 741377 764042 539262 723936 668072 544747
17027 544747 780152 875093 904551 911091 610290 679358 866388 440543 757590 738760 359823
17015 703749 464772 591670 875295 688641 923998 744275 573254 863143 546611 533204
17005 533204 1001245 892153 828420 1019227 628985 659114 880634 757035 1255672 876597
16995 876597 897729 764795 839257 912249 1145487 871202 654428 890569 858488 1096699
16985 1096699 772521 1059048 982612 725546 1016999 907598 746146 746350 905527 1101946
16975 1101946 1109670 849982 1172408 904693 1230582 970226 941349 903985 1046904 893434
16965 893434 1205292 1180489 1378793 1171014 921583 1200793 1267952 1320436 1016421 1245564
16955 1245564 1404096 1154067 1277537 1158150 1255306 1217530 1274670 1187456 1282874 1211691
16945 1211691 1244867 1115877 999027 1204041 1325993 1334377 1353177 1491097 1277099 1163468
16935 1163468 1322272 1509095 1427642 1574032 1125896 1363021 1298272 1994155 1417456 1508081
16925 1508081 1411863 1572465 1321431 1577431 1438268 1793425 1763180 1882216 1335501 1586121
16915 1586121 1423708 1519927 1631732 1663355 1759825 2049982 1660122 1859762 2045965 1736341
16905 1736341 1683836 1852283 1732400 1722347 1778173 1856202 2049635 1758214 1652097 1854226
16895 1854226 1846746 2087897 2152608 2307530 1912478 2058166 2265655 2012071 2163476 2269304
16885 2269304 2535792 2216603 2173405 2312393 2237576 2261346 2640962 2424612 2579755 2533580
16875 2533580 2615261 2614770 2564946 2623120 2660555 3070598 2770129 2957333 2787278 2549620 2777802
16864 2777802 2762293 2993010 3375976 3021673 3086836 3151953 3315082 3081458 2991003 3285412
16854 3285412 3518881 3459442 3551046 3467320 3752794 3963032 3778212 3574030 3547162 4055167
16844 4055167 3858882 3745158 4123930 4269665 3941772 3934104 4102431 4401755 4590197 4683610
16834 4683610 4544335 4710941 4867727 4537046 5029030 4899981 5308675 5272467 5128519 5590900
16824 5590900 5457205 5615665 6011079 5816434 6255479 6147137 6337937 6194847 6434642
16815 6434642 6519708 6689893 6711054 6890172 6781441 7156383 7447269 7524733 7401640 7819835
16805 7819835 8043835 8193924 8647393 8612959 8436019 8659680 9034891 9199646 9820023 10033800
16795 10033800 9856385 10065464 10398981 10696116 11168795 11210003 11512992 11601939 12267010 12460867
16785 12460867 12710869 12931282 13596068 14031575 14234278 14965623 14890764 15341808 15681489
16776 15681489 16184884 16842859 17462126 18142795 18563644 19305360 20010400 20778918 21127534
16767 21127534 21847874 22735433 23580864 24437603 25335959 26174177 27347589 28331221 29326763
16758 29326763 30870009 32161867 33088418 34620266 36027827 37600952 38908073 40533721
16750 40533721 42836823 44708853 46771527 49132513 51276877 53828667 56380097 59336055
16742 59336055 62481570 65675927 68800042 72487183 76606554 80942590 85071697 89778611
16734 89778611 94485158 99374244 104913930 110744223 116233610 122001005 128162868 134376790
16726 134376790 140398433 146753124 152433416 157779588 163125479 167672957 172092741 175589024
16718 175589024 177747013 179482254 179937120 179669677 178380280 175953277 173099800 169081980
16710 169081980 164077476 159518743 153625826 147883021 141851398 135282165 129247726 123131700
16702 123131700 117034525 111254785 105755775 100214331 94621006 89784925 84952429 80393757
16694 80393757 76069021 72034126 68761770 65111393 61947602 58884430 55608593 53128575
16686 53128575 50177756 48267191 46073958 43623973 41805355 39922840 38250416 36252198
16678 36252198 34824838 33325920 31987047 30847850 29190752 28362579 27198470 26130910
16670 26130910 25156332 24281888 23374334 22533296 21922776 21016379 20227213 19127758 18636965
16661 18636965 18294223 17397645 16980259 16551598 15895121 15315014 14800089 14620719 13952745
16652 13952745 13856942 13361552 12857757 12733951 12143081 11779670 11492685 11112484 11017834 10462428
16642 10462428 10115639 9986269 9990645 9819546 9311871 9021463 8953914 8549867 8324713 8647250
16632 8647250 7724498 7673215 7750756 7426111 7466210 7240723 6884709 6856368 6576062 6989233
16622 6989233 6164383 6204546 6019718 6056547 5691984 6006176 5829648 5557967 5303250 5522664
16612 5522664 5150357 5248369 5013108 4885981 5008248 4675823 4716275 4414632 4360336 4743792
16602 4743792 4346207 4011818 3967980 3994375 3812435 3937804 4009910 3946660 3864184 3709022
16592 3709022 3739462 3329094 3474020 3328937 3095138 3585227 3565684 3591221 3308768 2779465
16582 2779465 3260329 3196114 3032159 3000504 2986028 2976652 3095621 3067282 3094314 3225249 2677371
16571 2677371 2404822 2662992 2666058 2581030 2575522 2498956 2616952 2628483 2774947 2442465 2357965
16560 2357965 2575595 2354826 1954024 2069777 1866972 2321509 1912326 2382931 2246852
16551 2246852 2288864 2084588 1709340 2039502 2018873 1741375 1798901 1930134 2113327 1788565
16541 1788565 1649339 1971726 1899373 1823369 1680824 1706384 1918631 1974311 1833531 1841610
16531 1841610 1464050 1660199 1519269 1587770 1518718 1686776 1473818 1440507 1490085 1631394
16521 1631394 1424559 1316861 1197052 1092375 1241047 1638817 1165981 1539775 1239376
16512 1239376 1085701 1308938 1445767 1299867 1116141 1450038 850574 953877 966421 1286451
16502 1286451 1355068 1291891 955974 1396632 1003789 927094 892532 1015121 1022169 988305 1086357
16491 1086357 945115 867695 970435 1076146 1105419 951138 1139222 971604 510859 724179
16481 724179 1094668 1162206 956835 685433 650729 892247 1218998 840374 516450 819436
16471 819436 886920 829166 674991 717010 910301 644259 1047450 1045530 1160909 797378
16461 797378 798638 640245 580895 1047893 957003 899347 817508 623800 338600 678599 624703
16450 624703 643936 1163471 681275 709002 753577 757400 525382 532797 570019 855052 565201
16439 565201 224004 594966 725455 554257 668676 521849 571250 445274 663945 1120035
16429 1120035 638361 673519 650349 359813 651205 606600 896818 398395 180958 773829
16419 773829 711312 410090 654508 579737 636545 944828 395592 743651 163337 442063
16409 442063 386061 370672 204095 730563 848210 620211 247001 258175 755199 641579
16399 641579 349111 609940 266593 717717 447939 263944 502817 786265 576671 903212
16389 903212 402209 373481 671313 345462 340378 420388 136729 519199 201366 264987
16379 264987 593526 753735 366487 113416 527604 244059 419982 141757 231499 333921
16369 333921 794452 290575 188180 164360 218159 182243 164289 418328 -17164 97930 465184
16358 465184 376597 413068 262963 315236 622358 232200 419645 472339 226622 531903
16348 531903 180834 20846 438070 204369 301513 15603 480161 647581 243250 317664
16338 317664 615712 472718 321798 55172 237486 -34293 288588 523928 270843 130514
16327 289711 49150 364188 294915 -122396 468439 280151 126235 217690 -121010 142744
16316 309803 220878 191623 60052 149738 602806 525641 202033 175632 334425 76947 -69773
16304 133397 -56177 462928 88222 180047 97375 273774 39585 218078 -23084 -25346 156456
16292 327298 -93958 -25399 199469 288593 153807 196436 154074 169241 135466 720789 -54258
16280 110311 269348 144751 454826 -96725 292051 586868 -43423 145211 171191 344108
16270 344108 216274 -278085 -64396 595521 371215 239173 -40837 34527 182097 372595
16260 372595 210471 -270233 96280 -242020 282336 61869 -118206 -197433 -50142 142131
16249 125633 -156856 300307 2284 330199 233973 144120 204258 228136 373052 -56296 76608
16237 306277 113457 7874 -77781 492910 96192 373229 -406573 183462 177687 -215882 225480
16225 -168333 39062 222473 262502 307347 297503 115687 -19715 18988 63358 129975 61296
16213 -96337 49134 34131 -79828 40867 -226418 107627 -535 389838 112752 -251437 -49324
16201 173958 17726 166162 -177133 5379 16590 270806 400745 -144309 -63322 3033 368273
16190 368273 103529 335974 99591 -34865 158912 166526 -59802 274766 215094 13739 541605
16179 541605 -114436 154765 280769 45864 17369 -151443 170237 38626 -87996 325824
16168 110404 -13805 -182756 78403 -10690 314170 74244 84824 165264 123193 41998 245270
16157 245270 260885 -257985 -98193 -162886 -21398 109253 -53081 299755 126450 134254 -14801
16145 132348 -49394 101787 273146 -106016 -158371 -80059 -42091 153118 -19925 -63664 277160
16133 157163 -100703 -164270 26068 -131075 151703 174878 65396 -53398 94545 105070 -234918
16121 117133 126278 195216 24844 68945 62856 -91165 -157615 -89340 -222835 -328646 22334
16109 -115299 147865 -111149 -150369 -59251 -37252 -165681 206166 -46852 36293 276879
16099 276879 135516 293120 73117 327052 5699 -17970 253180 254215 20937 -117129 -83997
16088 -83997 25977 -68637 397153 149577 -123744 152761 -30418 10901 117648 -264531
16077 204203 -430453 -39161 -7187 410174 -163661 -130438 11991 101853 111265 109748 152979
16066 152979 -93885 89695 -177660 -103931 -92097 271427 -292052 71589 -138867 -322372
16056 -322372 -22765 -113534 137224 562023 46992 -314734 -150493 108197 -236793 -90595
16045 67397 -128729 44584 -4204 146648 298037 291738 41170 182747 -94318 127996 -149599
16033 -123363 -313365 7177 -64998 156810 108852 -42696 71936 252383 -386653 55478 17733
16021 -127745 -291006 -185185 90861 71627 -271034 140932 -225830 -136464 -222467 83189
16010 26893 277480 146980 64805 -115157 62931 149321 183708 215923 -150759 -181176 -25068
15998 -359863 -462332 242015 27188 51302 103069 54654 224919 -140779 -7219 291133 163843
15987 163843 -282896 -51965 -18165 359428 339872 447037 610413 377595 150640 -199140
15976 -43000 305163 -161422 59323 147857 189014 30332 159080 -380977 -164692 -196504 272764
15964 73836 -38606 -68024 73558 231347 28388 30899 -57532 10159 -89620 -136020 -236949
15953 -236949 -285961 -101212 -228428 51867 196117 -346911 330 37066 215326 -31837 -289980
15942 -289980 -52658 -132394 116952 92343 -342834 -228354 60969 -276525 293350 -196961
15931 -142547 -22831 -59407 157224 -46012 257641 -29165 332094 -294699 -49979 17927 -101845
15919 -227101 298365 161837 820 -110216 381036 -333879 -55250 -289852 -55332 40975 -243613
15907 -281422 -257911 -99386 131654 174580 -364210 -30856 72685 9901 -179642 136260 -18976
15895 -244959 -328645 -141537 11022 69557 -73079 -147283 -57000 -121324 165725 284793 -51090
15883 -246803 -89639 -108423 -6540 -48015 100564 177793 -98845 -138341 -138480 -5407 27317 -129162
15870 43761 120200 -205156 221351 -339101 106243 -137847 -299233 241084 9418 -398281
15859 -96961 -56440 -239826 -84666 312505 211733 -172323 -142801 86046 -76976 -264554 -86054
15847 -79814 -359836 -10591 -421230 231570 -510 130003 152278 -65641 -40116 -91192 119946
15835 86165 -199673 278986 184089 34967 110030 -75837 -39606 93142 -174780 -140771 -344050
15824 -344050 -154608 -108259 160203 55413 189830 -75394 -189891 140144 67129 -94108
15813 -62312 -162712 -302640 310372 -417762 79713 -17336 425392 -237071 66266 264828
15803 264828 346574 490846 308005 -2020 157236 -166752 -113560 151618 237184 -144607
15792 -74312 -96329 120479 17939 -27358 -121111 -293453 401321 23690 -38051 -63259 -76000
15781 -76000 -305819 -39183 -174453 54973 182245 -19614 -72624 -426990 2620 151652 -319520
15769 34018 118768 259749 -373377 2045 121482 -199855 -190661 -420396 -64162 -168729 -143526
15758 -143526 -9282 -137293 127146 -536108 171425 178541 -240862 313391 -111855 -203542
15748 -203542 101792 -28246 441888 -45242 -87566 361607 -25620 290758 94340 -74192 -225660
15737 -225660 -120465 319969 -215345 -75581 57319 43733 -438480 -139259 66449 234369
15727 234369 144256 -282207 85494 52141 85613 412897 -293604 -140438 11226 28675 24111
15716 24111 174083 50285 53937 118510 186203 -238002 40749 -103377 34646 -130008 -145367
15705 -145367 -208731 3609 -5473 -41404 4467 6819 167522 -159573 -51539 12239 -140976 45756
15692 -214256 -25249 13430 136717 76135 116242 346987 -324325 22511 -218306 326835
15681 80574 23322 170520 -127918 -69613 -117126 -187718 -215186 -253336 -320262 625 80289 -365906
15668 -77790 53400 70034 -1908 -105114 -326465 -75321 57132 108878 140804 -307528 -31797
15656 139807 -63092 156803 -115535 -211545 135404 95511 46776 17039 391369 -96588 34439
15644 -144598 7981 -193740 75890 -50009 -64599 -193619 24382 168004 -219430 38535 -121484
15632 36067 -98735 -112969 -69631 6619 82258 139844 -25440 -92909 29699 78771 47953 104334
15620 104334 -54771 -129824 121068 -88264 -58228 16399 -52875 81057 -148939 -180022 109551
15608 -183789 -179006 -13593 67017 -246166 200284 -168104 103504 29523 -33801 -51410 -104925
15597 -104925 189209 -221978 -371966 54233 -245767 -36652 25785 25723 -25425 -34911 -154178
15586 -154178 146749 -326337 396076 -19131 -72601 233675 246283 251533 243300 11799 -235288
15574 -205175 -184994 -333277 124910 169645 -73566 49387 75508 -264280 -278535 2017 299686
15563 299686 -8783 29479 9482 470870 -341175 -386714 -43096 51581 186978 -90328 446945
15551 -87014 -116281 -267158 -67693 -68437 52942 209106 -61404 -145642 -146555 -40959 2143 224469
15539 224469 -37684 -7497 -216555 -64442 -236373 -40220 81863 -101708 -343649 -172652 170635
15527 212404 66743 -174685 -102757 101599 22486 13695 132089 -15606 648225 58817 86983
15516 86983 242219 -148865 69913 -74212 -247742 421951 -49363 -23028 -45963 -40970 365648
15504 34554 317593 -314338 266733 -216280 122273 92739 -216731 -36002 -186810 -103943
15494 -103943 -132013 143308 -145699 -49730 167046 159321 151365 -211087 113112 -190285 -97031
15483 -97031 -85677 -162879 6918 24032 204620 251435 127978 -44903 189013 -95423 -149358
15472 -149358 -144638 -55348 342592 24457 -365990 11817 91797 91117 -209354 489406 31116
15460 -38398 229785 18308 69763 -133026 223093 66916 -205031 43368 34796 469788 -161878
15448 10416 -273662 -347697 -149640 200541 -212901 172091 -253238 3903 611721 -116080
15437 95072 196954 -199395 131938 252891 25422 58825 -117551 -395012 249049 16459
15426 -130642 180389 -132875 -52215 -306643 89511 -300101 134777 148551 -101396 168010
15415 98564 62174 48864 -176430 -26048 14463 506477 208646 -87215 61385 66787 -109506
15403 -243194 -209610 150405 -51928 112470 -83503 61812 -33428 34531 -127610 61081 -69704
15391 -285226 -255078 -199988 11904 59535 188611 -100011 124000 126484 84909 12073 -59038
15379 125661 24169 -227152 163102 261152 106174 461288 357320 -126572 -18671 24487
15368 45421 227737 -235314 207058 -428640 51442 271515 153765 -17427 304959 116434
15357 167752 126722 -48283 233623 209019 82073 230037 -266122 -140075 206028 62494
15346 -153119 139030 -272871 20018 -293851 -78114 21873 8253 219597 13839 -1831 39714
15334 175220 122338 301577 47617 -46412 -205129 234420 135211 63556 51845 313744 88360
15322 -77443 13390 54692 46351 -164900 -90045 328695 230399 -42715 -12298 28299 -128099
15310 120347 -8362 209064 20581 322579 32257 199832 122769 101305 549099 -117782 -19590
15298 100227 131795 187092 -261736 73879 -119636 258457 194371 392244 158263 197455
15288 197455 -92048 54732 227058 -59751 -2623 -25305 291892 345850 78072 290068 167583
15277 167583 57251 115346 62448 163622 -12393 148937 68522 -90533 289109 177648 -64900
15265 -87404 283663 81969 -87578 120767 -164029 29198 6488 40399 71315 99073 7489
15253 64286 48407 132993 344310 360112 1029203 1786425 1648567 1627704 1908296 336407
15242 293343 -2733 152102 118070 271217 -168395 173500 -216554 48035 -149913 111845
15231 134 21654 -2963 -43321 196070 317427 72003 262803 -165733 160071 182248 -64921
15219 258293 42203 2922 28207 197547 66070 -219276 297110 -184385 134101 3000 266809
15208 266809 169094 -15782 -56281 221243 4570 67257 38505 99128 -303653 138888 -71664
15196 -135266 -127455 169564 -57184 -244907 435421 23354 95225 20809 -31675 -59271 -50094
15185 -50094 -370426 -81562 233592 -244592 -74487 316112 -152623 -3127 -168159 -105785 123905
15173 317015 -55500 229663 134808 140879 10298 -231229 -18102 4992 -140612 326584 149896
15161 36676 226585 207191 -13341 169631 -469858 197695 70442 -222358 -24388 224506
15150 140801 280006 -39122 191738 327010 105085 88461 101426 54480 -129551 130269
15139 185067 -43033 415306 273349 208066 288271 58669 297660 -99460 21129 -79007 156369
15127 281595 121033 252489 269105 226310 357518 410438 -22730 168765 406160 -26784
15116 430544 -54925 194474 347914 -11878 321218 304431 14647 109959 41912 584902 498851
15105 498851 36847 199078 14694 280151 77003 -88314 -75112 393260 -34672 82779 114270
15094 114270 -17212 139298 243655 113775 -45230 275083 -59885 -53242 -34829 -41094 159384
15082 181201 142645 416609 268091 133885 -54728 301068 415847 115832 201666 202472 171080
15071 171080 419732 -74725 429700 305356 127784 174124 -46543 150406 328713 163623
15060 6450 166245 48629 -150447 -99136 -123338 63324 68629 292452 236497 227178 474478
15049 474478 72363 330684 8809 113804 44279 355301 287320 371054 40404 441068 129630
15037 27077 70378 576186 172727 47161 229148 229892 156475 101217 356057 307414 179992
15026 179992 281062 192302 -131361 -3430 37907 419785 61983 -13977 270665 229733 231067
15015 231067 174799 512966 405527 251654 11635 290282 458657 374761 316503 7346 653715
15004 653715 77558 267065 61559 98507 336661 178509 -18583 407028 53871 214996
14994 214996 208828 132528 279147 281826 78315 332042 433292 33187 178408 415674 226366
14983 226366 23423 115138 159137 269011 358370 393088 218536 327413 561971 216234
14972 54176 232400 407483 783542 216666 290395 280730 460448 19806 498676 409826 141600
14960 282764 -41032 657998 96247 211242 224418 503013 338498 186393 578946 517320
14950 517320 267371 8689 189318 400666 -43552 16058 389518 56471 281469 444586
14940 444586 459173 238238 232877 349987 40835 408978 625696 237115 286528 228392 389489
14929 389489 674172 553701 -234 -132418 356085 338771 426459 216678 147737 408116 364202
14918 364202 908016 452475 263446 352630 359453 142870 440028 224178 305931 519001
14908 519001 170815 52016 574907 156905 450717 -6518 468209 282612 408500 330339
14898 330339 553946 365589 162644 455506 111670 649333 406578 351804 813105 434905
14888 434905 588432 352869 449041 631781 246475 324453 433274 530742 540412 399341
14878 399341 501651 454915 271065 532734 570306 202409 175977 327672 705422 672687
14868 672687 532145 314327 364102 300731 425263 226632 586938 369970 500981 247863
14857 596198 677197 124442 335705 280355 199109 684187 575707 680555 381774 348374
14847 348374 761574 637792 337945 368777 570108 216910 336694 298383 391421 571131
14837 571131 569161 663202 613044 692221 521519 581392 895757 333319 584105 431075 145715
14825 261201 286544 483504 902490 483588 620032 589453 521613 681487 795978 617701
14815 617701 612924 503067 675468 895875 485616 364425 344218 515219 513559 529395 592533
14804 592533 -14915 871185 853893 787027 595260 474599 371701 599553 754186 533159
14794 533159 948672 588589 418399 505688 621372 671935 902547 487247 506550 632636
14784 632636 441989 554296 305279 750990 425226 852660 559324 728534 399872 434652
14774 434652 677187 635526 343870 706145 403386 633523 352677 529311 880874 884850
14764 884850 806578 806993 623540 564082 765540 430842 841315 773403 362989 678132 563033
14753 563033 1066285 679600 874309 854989 841419 879749 786582 828802 804513 495324 637639
14742 637639 313050 948785 491805 524013 544539 908945 881562 605617 455963 730803
14732 730803 966699 624103 852379 722314 763560 595785 1057090 551568 840287 792431
14722 792431 597996 905812 776762 764282 1036116 737185 950853 704709 814511 849622
14712 849622 776136 981809 1120734 985884 798308 863685 808564 758819 761589 919706 1023776
14701 1023776 901526 1044078 776799 545983 803436 1153090 731237 1007851 758740
14692 758740 944598 1042437 981101 1290963 638496 976434 1101257 977625 1058770 795906
14682 795906 888557 1137986 1166046 1207329 963448 1101121 1110163 812343 1152178 1192421 1035593
14671 1035593 1151365 1184249 1013804 1387464 1100870 900922 1086980 1167691 890241 1251917
14661 1251917 1019029 1093010 1155743 1036763 951254 948078 1336791 1003775 1113578 1230330
14651 1230330 1438571 1259746 1648651 1209633 1363096 1366190 1154375 1382752 1575703 1450301
14641 1450301 1472778 1037713 1343268 1082272 1243383 1584636 1386623 1214457 1326019 1599317
14631 1599317 1298432 1660933 1625258 1273003 1279098 1278376 1406520 1453725 1599678 1027363 1560144
14620 1560144 1667912 1682292 1402216 1691705 1554654 1330002 1729794 1761183 1330063 1518030
14610 1518030 1639158 1523491 1477158 1709763 1761653 1908179 1518390 1965872 1485857 1771957
14600 1771957 1845675 1590177 1523320 1910899 1703140 1880461 1696959 1950630 1903989 1735354
14590 1735354 1923407 1626478 1842770 1568164 1818789 1622151 2113272 2101869 1911948 2084929
14580 2084929 1698464 1901655 2031896 2148116 2113740 2002431 2273254 2292281 2286930 2005819
14570 2005819 2224028 2404414 2092248 2673751 2528856 2530102 2848401 2243145 2498600 2495929
14560 2495929 2924062 3040021 2937350 2871811 3160664 3482300 3433040 3788427 4424227 4712701
14550 4712701 5998773 7750371 11326723 19992831 42449599 48466849 24431881 9441424
14541 4785364 3220966 2478705 2026741 2126011 2179207 1997106 1728635 2249821 2181914 2397575
14531 2397575 1911155 2463504 2075168 2194387 2289026 2367925 2253588 2410697 2321540 2373779
14521 2373779 2501477 2763984 2600468 3050916 3107460 2646890 2711724 2672451 2803730 2953889
14511 2953889 2683603 3040206 2898428 3121911 3125615 3084819 3147888 3379528 3192678 3214109
14501 3214109 3225865 3357234 3208082 3303199 3471863 3449337 3302604 3353138 3422325 3584030
14491 3584030 3447293 3794733 3601682 3945483 3593760 3639856 3931132 3740153 4240324 4104732
14481 4104732 3769286 4097328 3765588 4194262 4425377 4132136 4369892 4464593 4635618 4522653
14471 4522653 4208559 4488547 4678251 4706711 4548223 4638779 4694932 4968340 4623196 4860646
14461 4860646 5058382 5306589 4647953 4981358 5278152 5306386 5029012 5584012 5499469 5258954
14451 5258954 5984764 5644549 5390596 5833365 5831080 5888716 5912241 6261051 6355949 6174508
14441 6174508 6379580 6562845 6422822 6616531 6264701 6573482 6604001 6508598 6901242 7137924
14431 7137924 7040452 7416492 7480747 7003336 7250599 7565917 7729219 7753846 7715330 7780398
14421 7780398 7991569 8333102 8614693 8338916 8283159 8610339 8965582 9035140 9163343 9045459
14411 9045459 8743858 9194745 9352494 9737887 10133406 10021365 10158768 10571907 10344394
14402 10344394 10675991 10913776 11123608 11132393 11705917 11556637 12029809 11855047 12123810 11764749
14392 11764749 12618127 12630371 13375897 13427814 13200174 13815028 13841457 14096975 14570565 14478864
14382 14478864 14535967 15238853 15570695 15856223 16231814 16346202 16595517 16913635 17410142
14373 17410142 17627043 17767156 17879560 18956082 19202284 19232593 19892229 20326824 20833767
14364 20833767 20675749 21305928 21779888 22469638 22969818 23626860 24346769 24451216 25013304
14355 25013304 25603059 26634480 26908306 27520590 27845793 28730604 29559788 30177718 31015833
14346 31015833 31778762 32530976 33436863 34575597 35410215 36533606 37351647 38523423 39372138
14337 39372138 40526214 41819071 42781356 44027160 45434150 46994389 48036816 49474290
14329 49474290 51182144 53014976 54489968 56170689 58146868 60118904 62066541 64374595
14321 64374595 66707315 68910772 71176572 74281522 77182635 79646935 83335558 86546776
14313 86546776 89782908 93186644 97072578 101091703 105450040 109573048 114574442 119565827
14305 119565827 124709716 130545491 136548349 142771516 149604376 156803876 164166383 172482559
14297 172482559 180868717 189893253 199783567 209871419 220640150 232150268 244137310
14290 244137310 256267354 269515617 282948496 297302401 311834551 327019781 342358179
14283 342358179 357990148 373526919 389065317 404053966 417986098 431442910 443578212
14276 443578212 454318338 463456453 469937909 473240545 474460970 473814131 470705138 466568685
14268 466568685 462561489 456640656 447842642 437977916 425841380 412844322 398238980
14261 398238980 383196001 367609457 351898667 336539996 320477256 305149970 291109540
14254 291109540 277206497 263779462 250407024 238081115 226236752 214999522 204301797
14247 204301797 194487001 184591854 175847351 167945575 159931371 152156737 145229461 138631160
14239 138631160 132459381 126923708 121557452 116380063 111163111 106324512 101863221 97918345
14231 97918345 94861898 90472131 87190384 83813517 80503154 77611124 74643013 71969428
14223 71969428 69508872 67014054 64700944 62559832 60858559 58476279 56531360 54681377
14215 54681377 52925558 51376421 50214861 48637680 46870575 45637290 44154317 42959697
14207 42959697 42347586 40864468 39613015 38748770 37287504 36631697 35850586 34992750 34142117
14198 34142117 32772125 32061248 31214284 30461802 30006243 28798793 27937855 27575239 26752638
14189 26752638 25940965 25982673 24724473 24558528 23879452 23401371 23077289 22321237 21903277
14180 21903277 21388387 20704527 20455937 20226922 19636558 19141359 18854983 18491500 18224583
14171 18224583 17577964 17377006 17021154 16802235 16499583 15825781 16109910 15554776 15400706
14162 15400706 15216130 14845536 14358514 14368873 13866388 14103343 13511638 13528094 13223422 12868112
14152 12868112 12673040 12646211 12189820 11881067 11809824 11708169 11777228 11488866 11064337 11068594
14142 11068594 11026166 10313266 10739345 10394363 10236917 10026535 10423585 9726361 9848384
14133 9848384 9659143 9390402 9427600 9448076 8858043 8974301 8511418 8544275 8798421 8371963
14123 8371963 8541019 8206580 8093759 7777009 7696073 7495389 8013526 7684413 7738718 7408890
14113 7408890 7379890 7055783 7213704 7027271 6785033 6830022 6902928 6593537 6558949 6610263
14103 6610263 6503659 6489884 5983061 6263771 6345503 6294812 6073277 6021779 5829917 5145392
14093 5145392 5911156 5605985 5302738 5488955 5446900 5042424 5081983 5562732 5194182 5105417
14083 5105417 5335173 5133958 5226251 4931086 5015110 4690124 4893138 4511375 4620928 4852398
14073 4852398 4536134 4409896 4667586 4290016 4316463 4070625 4502756 4017746 3973392 4224186
14063 4224186 4174597 4258910 4177925 3981242 4204876 4191361 3904337 3882201 3912595 3855522 3980235
14052 3980235 3919367 3596039 3546346 3603017 3527657 3314501 3546521 3278999 3426790 3351501
14042 3351501 3506625 3423260 3475125 3603781 3206084 3019151 3234512 3008726 3380364 3152482
14032 3152482 3112912 3309221 2792729 3163219 3321361 2505065 2886816 2594867 3019835 2656833
14022 2656833 2690760 2679519 3051800 2610505 2651888 2548378 2653297 2322652 2688551 2450935
14012 2450935 2714741 2434892 2485046 2488937 2442475 2210976 2538991 2401620 2340156 2270828
14002 2270828 2205397 2112805 2438617 2169703 1723940 2075058 2160370 2046152 1800420 2022764
13992 2022764 2333453 2226679 2354763 3586491 5740882 12030309 32704008 49666410
13984 49666410 28331212 14234923 8420216 6364126 4721621 4204771 4024074 3523812
13976 3523812 3273165 3051806 3057344 2447185 2727258 2571464 2824985 2841763 2539813 2715329
13966 2715329 2235185 2571354 2380296 2269771 2244951 2363436 2094984 2089026 1932658 1964109
13956 1964109 1891491 2298570 2017167 2040464 1749454 2174806 1718778 2157822 2191814 1857375
13946 1857375 1824629 1939528 1862788 1600988 1833985 1893330 2111831 1715212 1668184 1754728
13936 1754728 1964846 1891179 1764216 1839389 1925883 1556022 1542342 1670982 1383133 1400103
13926 1400103 1444724 1543959 1771400 1804711 1393201 1474383 1443320 1788911 1231711 1423606
13916 1423606 1662099 1442672 1622169 1287968 1311063 1636091 1613924 1678372 1364478 1619702
13906 1619702 1141360 1400402 1257666 1377938 1067387 1490702 1126841 1216017 1447024 1239402
13896 1239402 1195375 1354770 1542649 1260715 1459015 1541496 1184655 1178324 930440 1300890
13886 1300890 1260718 1053186 1378489 941671 1287838 1003086 1204461 1346157 1431839 1204573
13876 1204573 1150756 1067396 1661319 1318226 891644 1060489 1168563 1154129 941249 938598
13866 938598 1184261 828845 788975 854028 1331651 1036803 1071674 1122262 988792 1107817
13856 1107817 1084218 1382036 972183 1116671 1342257 1041227 887605 933349 1105888 1209834
13846 1209834 794542 1129670 1148621 871770 655608 1098684 1153316 1360016 1272374 1121005
13836 1121005 908778 1003725 745010 885685 1094821 878648 981104 944134 617317 1145972
13826 1145972 1127572 745769 719042 809073 1069620 700991 1061161 803452 834496 718246
13816 718246 1076562 666456 642382 713833 1004723 539682 829044 797464 1101528 815074
13806 815074 877599 967219 892048 848503 851785 849600 751782 774012 803821 755911 901974 741549
13794 741549 738958 655245 1075234 816807 914402 730973 603607 449426 524047 406262
13784 406262 502045 547338 546796 846150 617080 702425 1153254 478415 723290 919935 698164
13773 698164 861340 640326 652844 594415 690099 545367 803324 659594 839661 382618
13762 986882 551370 536814 598779 626074 931637 601460 913822 640087 702721 735979
13752 735979 727403 568450 474632 338584 814057 579328 319567 593630 372797 962263
13742 962263 579232 448474 848285 713641 247056 524843 411248 470734 620746 697097
13732 697097 469917 480965 658775 641702 625953 570463 1001038 661417 665763 685267 799158
13721 799158 475647 512408 772416 219947 675729 691218 499716 841628 446635 554269
13711 554269 670016 539720 374210 910637 402667 715279 472643 418452 522677 319474
13701 319474 635662 668980 371564 445583 692044 482148 338408 635132 580848 550054
13691 550054 683805 397509 638001 315579 567915 572269 370567 367598 527197 417011
13681 417011 203206 203283 129700 251754 541513 410478 417994 675894 311481 641707 473573
13670 473573 485957 306526 294387 376295 182216 524027 400684 332934 498707 440469
13660 440469 651291 394462 402407 232100 180593 301172 794154 313200 654858 264149
13649 327252 537715 535523 358068 609771 -1645 423941 575018 439669 315353 393645
13639 393645 335046 391043 348072 267513 434250 183923 356802 8236 535830 518976 232165
13627 485185 450009 278237 522753 421239 502659 156876 103706 434184 243371 136846
13617 136846 186315 351769 551828 441072 584799 468456 618795 64205 146204 79193
13607 79193 237721 355874 346081 575736 445389 37150 848731 218386 387267 584697
13597 584697 60035 252516 406972 449655 682814 449281 347855 764285 484102 182305
13586 703722 334466 281331 236087 362067 413137 572995 369961 202160 446435 436681
13576 436681 41207 389013 298035 252665 41173 525060 340588 400662 201797 389969
13566 389969 430916 639446 594399 -80405 144111 454274 215285 590352 347595 381763
13556 381763 513682 242266 -14831 -75320 371004 346104 336640 359476 493533 33825 269595
13545 269595 275807 126709 94133 567403 277957 285272 726974 585430 52603 372531 62227
13533 237390 710396 276013 41617 299070 205030 177274 -141665 222314 222400 332534 308047
13522 308047 91940 197403 432151 490880 64258 317673 440280 347398 363482 189424
13512 189424 644315 417599 472327 342301 -7275 240232 274150 2541 -150779 -18949 253301
13500 344881 71693 168228 374419 191520 295712 178256 129517 -36748 151995 99484
13490 99484 356877 160754 -115913 327056 299130 -38187 400293 97872 787 322396 230108
13479 230108 257939 66589 281745 334952 153919 303562 78602 339789 595335 546381
13469 546381 375977 155069 406281 27977 -11967 167520 395202 113113 31376 554780
13459 554780 545351 436729 178397 267826 243827 523742 251042 290000 145768 156509 64386
13447 457674 132954 460175 495602 480648 376263 -8215 217716 359680 97846 193934 -50954
13435 59500 200508 415515 80307 69449 215098 184738 207188 315939 254555 16620 94646
13424 94646 152656 415581 112863 102169 -96983 245066 6485 218499 151859 305515 323493
13413 323493 -6858 555510 225663 -22727 488764 -146742 615801 348356 151046 -56812
13402 262832 329275 593618 282052 161737 211065 165315 369021 203500 159553 8249 168672
13391 168672 -6070 73264 -67440 69001 174246 -181411 18048 155329 233715 119040 385235
13380 385235 364641 27312 132890 108845 27762 264811 286260 342384 -297274 173128 44514
13368 261457 365287 223401 229074 294791 193651 261659 456828 286659 235604 124741
13358 124741 235647 602138 249466 112505 81650 402759 342438 218897 118844 -35782
13347 587899 -160427 195447 63815 315477 67173 251892 -274 -86247 224463 313948 249902
13336 249902 -71275 325313 137638 386819 184506 256156 263316 373009 -17838 81783 169812
13325 169812 50873 116074 113503 89142 187410 437610 102161 383767 127141 494157 240118
13313 303710 228750 121568 55771 -87874 325481 294116 -166755 156191 -71557 -117573 -111452
13302 -111452 -130082 -365063 278196 19351 176827 -82670 60102 131002 82489 196438 491438
13291 491438 384781 -20173 43503 -26095 374063 377741 211337 599470 374719 367929 175937
13279 70539 266782 -60571 -171096 -46260 -145933 332765 -159932 -141888 61452 -217904 -40328
13267 72054 130901 82511 33340 308175 167029 42761 275970 228194 68238 151851 64019
13255 -61967 47885 -14677 234957 253628 254342 189127 81957 365593 -3036 250589 35683 221243
13243 221243 349038 338669 35318 184402 16011 -231 57734 -64046 68479 -167908 58533
13231 7079 257558 169182 103187 -149556 -168906 325944 261885 180149 106072 154299 156230
13220 156230 318697 180371 54111 -105829 217002 310165 -3728 -250507 -77629 -124928 88231
13208 -277453 230965 153557 136637 177273 81340 161427 104710 391790 -304423 61987 17508
13196 -49365 -12917 79861 213291 -145867 -80870 286878 -107354 -63956 6775 133525 25360
13184 75695 -112557 177616 98703 357559 -67207 159279 -116312 117184 230909 337722
13174 337722 23570 -19069 189659 2431 -97256 170895 103249 -170161 104817 207626 30799
13162 424919 21346 -24867 276562 227182 -314917 57108 129609 36816 88045 322155 124926
13150 -17446 -184140 -97856 61618 -182111 -133311 53295 138544 164588 189154 -198557 60207
13138 277479 89145 -160165 -34197 152527 64995 229626 307845 -3878 288400 44971 69627
13127 69627 158053 194423 -84440 -157542 117247 99883 247585 -193446 -47951 -150785 -252298
13116 -252298 28687 107559 151871 -94744 -142569 260797 -12266 38824 -204873 146054 -279916
13104 -15673 349309 197435 104449 -193964 215927 359756 43401 92833 76441 1388 33754
13093 33754 -68675 303035 -293661 234957 -13699 209915 -177141 18319 5701 4660 92450
13082 92450 -6847 -143707 54990 65057 -121123 318902 -133885 -5994 257788 220820 211306
13071 211306 19871 -162040 317807 -138570 72147 134876 -227631 -308225 -28281 135005
13060 150465 141993 -144725 -154657 105534 101146 63320 222400 21847 84249 68641 -131525
13048 -251862 -158763 145579 79997 -13560 180980 234648 301375 -310528 270631 240360 200103
13037 200103 202139 39319 81022 -263983 -11214 38388 27817 31414 -20225 325361 151947
13025 45746 -260017 209851 47664 -52390 202187 208491 7398 262152 -71968 333559 564012
13014 564012 160394 174577 -11312 129080 32454 94432 15765 -102486 -38132 66103 25957
13002 83834 -172888 43782 -86538 -123289 256975 65715 109069 104994 303447 154610 -26691
12990 -258982 -134108 252336 100406 455742 132104 -40708 -13337 -143129 253838 -20149
12979 151075 79348 -53449 -232007 -45248 157037 -227629 10354 26559 -216482 -130964 232694
12967 257566 56574 136628 -113433 -39604 125328 46784 -344584 -221997 255512 -119378
12956 190597 -285288 449380 108221 160023 -123321 105393 -427610 33947 249010 78917
12945 9642 -113258 70392 58118 -47299 -475300 -99435 82104 -7066 -258689 -73257 -91050
12934 -91050 85341 -69533 -180326 -281098 -120422 17662 17880 -260503 290005 -273327 204696
12922 19618 92326 370046 -107743 336124 166894 123789 -141581 75142 52416 311304
12912 311304 400305 74422 -19663 -186319 71827 -24758 242631 98395 -146885 -94668 159607
12900 242172 85458 68110 -700 158823 167169 153300 533806 -30136 8867 -77023 90164 115244
12888 115244 -203372 -152853 97887 140721 -75178 -54329 255808 287241 335773 -298890 31764
12876 109301 -373599 -39534 287833 -175249 -40692 27049 420045 29498 269045 -270493
12865 -252608 -46169 240177 -89606 15480 305863 15038 -51312 -249748 113110 10858 -139179
12853 266071 -5501 10327 -159200 -200494 -182810 478067 20049 -229883 -201890 -188014 44147
12841 -248528 146816 -205288 -80417 143914 201437 170375 89187 6723 264625 -163953 -40392
12829 -28444 44253 20679 3295 429969 84565 -82966 -87507 -70323 43608 -207870 -71991 -25152
12816 -83009 86957 -245174 127470 226562 93197 82853 65279 -42645 96583 -117197 167189
12804 -121720 3254 -43628 318130 -124941 150443 58736 158286 198528 -179939 165918 -294011
12792 -75410 -122030 102669 76711 -156307 -64166 106053 134006 76538 -27593 257443 231387
12781 231387 -48709 108638 49427 312264 -76759 -150856 196063 37139 389189 244620
12771 244620 27665 -156759 89301 -7865 304578 -12110 191130 -269956 -60726 15082 287753
12760 287753 -217286 -333549 173774 144861 212015 221301 -140554 -188947 100224 186204 -82522
12748 -10734 -55340 -107350 -226256 186597 114667 -218275 -150946 -112342 -110548 155835 -64939
12736 238615 148177 208516 175294 -142328 98359 83648 176532 -42988 282795 20503 -165261
12724 -41864 275841 -60838 400177 137894 -17078 -35167 -54340 195705 82364 36751 31043
12713 31043 -280628 155607 60534 98086 57807 258490 486681 -199492 62490 18320 272136
12702 272136 104994 27737 139083 61167 166896 143223 99203 280189 -135552 -304235
12692 -304235 -161280 -19851 -122522 -58674 -474187 223064 -19876 119812 155098 -236306
12681 40320 158376 190687 144298 10093 14706 66703 -81855 339838 7705 -4709 2014 114369
12669 114369 160707 144219 171782 117609 141298 -205849 -23797 -54291 666343 339297 -189556
12657 262867 -49847 76883 206400 371353 101945 -150159 95576 274346 117382 124804
12647 124804 158816 165299 176621 -76020 348040 -44016 -112037 239381 106145 -62465 27859
12635 32011 -72165 145234 137559 -51 -43773 -58230 183290 45891 226322 204216 211091 -162700
12622 -225923 -4824 18208 26850 -10842 -75355 174202 22287 -240214 123790 283874 -136095
12610 -459828 107595 76269 141997 -194426 91581 -86688 -239878 -109038 -159941 20182 164252
12599 164252 107770 -214505 -181529 554 169383 -20715 87412 -178109 313640 -133696 82615
12587 -53203 199956 53195 155941 -96887 63335 -46281 -87891 228526 283027 171285 -41763
12575 281462 -9975 304292 -119168 103982 -42428 298162 43351 85623 -133586 325174
12564 -86662 384672 -298425 -69594 -203599 114608 185527 176100 -127636 -74328 217247 -53120
12552 74354 -46086 290 -58058 -23928 333722 116978 92043 61423 108752 324406 -10415
12540 -5319 -233687 55982 -121379 -49205 61917 9193 -51126 -254368 -76041 242557 201851
12529 201851 -316439 -381706 53767 18442 159334 55659 -125552 -18242 -71880 106746 -133
12517 -36354 -400492 231388 -384518 63019 31253 -444542 -11711 -125568 -124447 -178092 -31997
12505 46248 -104397 232988 -66305 13277 37108 17559 379320 150686 374821 -185374
12494 -27731 -108728 -154181 141612 -21458 -117273 51161 -36523 -100892 -141656 -138628 101216
12482 -2223 -5693 -82812 148512 -10367 -94540 -120418 -111421 -45130 171825 -68367 239242 96613
12469 4987 -96132 50839 -234120 -138014 -14297 -128631 381145 -157895 59792 -8588 120284
12457 -389910 -74530 123266 -25611 45956 109208 155313 -17555 405253 13201 -14928 -68282
12446 -68282 -59194 -32250 -216533 186273 -301706 126123 -169864 81557 192079 66879 -130627
12434 20401 199429 -329185 -34301 87017 -17469 543 106129 209364 142597 337818 -9427
12422 -7267 29827 -1959 60692 -132671 276605 -102777 274291 77002 172930 -138722 -181759
12411 -181759 -53111 159081 -96226 -273908 -207545 -160306 -100754 -106834 -316626 -65327 -222528
12400 -222528 262728 -499469 163496 239606 148346 59640 328124 -186677 -93718 224352
12389 287393 110409 463688 158582 -31032 -109983 -178008 626043 -63097 36276 -66674 54534
12377 -126139 -48911 242235 280608 -156785 -293150 187892 -347686 -231244 199596 -388238
12366 451947 -26982 147920 70335 60132 447423 86784 -298147 -20150 114941 -20768 -108731
12355 -108731 -273239 -34873 -225821 84165 -278169 157407 -61797 -285376 203053 -18200
12344 -169790 -299084 441691 -279138 -201410 -191569 21006 226489 -467108 -107485 141974
12333 -24554 141058 -194741 -12936 144522 -206158 22641 -154231 -106614 -453815 -75190
12322 -265618 -219826 119046 121590 -103533 41137 181615 -198590 230563 -58683 -228532
12312 -228532 -5992 -204092 -98190 54596 -45004 -179521 -92605 -208612 -115973 212300 -281810
12300 80101 -86752 257968 139108 -410910 -255155 -43659 69764 32231 -227227 -118730
12290 -118730 102309 120543 89995 -45836 -293221 21313 -114762 130799 91064 39757 129303
12279 129303 157957 85411 -51707 127614 74372 257338 13002 231843 -38142 -148 125900
12267 175466 112996 -16574 -185360 -23256 486736 265682 -26238 191094 210344 -61509 386770
12255 216279 41244 102608 400864 280899 463907 305492 372825 208332 277483 254130
12245 254130 144367 -26414 215795 -276938 -5236 395995 73192 -67614 26626 7585 -79267
12233 -14942 -26424 -146125 -38296 180297 354206 206209 124727 -145728 316071 38754
12222 6880 358402 132991 137750 301452 136718 67976 473724 385757 395872 -55522 -87795
12211 -87795 174316 31080 287693 60004 448840 -30395 54427 30783 -76791 136808 24031
12199 9461 -180715 127851 372811 48121 -65467 -5654 73599 111410 25277 120544 180478
12188 180478 186502 -218699 59780 -45511 232891 -32438 -92790 102553 36687 177613 102776
12177 102776 88337 -23682 190083 -16354 25417 472366 -28702 133485 -53004 -85628 227489
12165 34501 192822 -94459 56437 314822 120208 255 140416 138476 137311 -22397 269441
12153 -383642 -281459 -22078 147623 183167 -167266 212286 75986 -75943 -12813 -114206
12143 -114206 -210024 -155634 52766 -478653 -49125 -174785 -641 -345441 357743 454340 29056
12131 80439 152621 23067 12002 -62685 -42826 -132852 113777 -54923 269805 98792 145137
12120 145137 219929 71281 203722 -277292 343741 115015 -179707 258186 -253519 -238356
12110 -238356 306204 -159402 188940 96646 -203446 -38400 100275 62599 -148627 97180
12099 -262357 30180 -7510 60606 21009 -72040 -58933 -262340 -23833 245629 -5370 -251339
12088 -251339 -88775 426170 -133407 100531 -545000 -66180 68216 353565 -225592 -6416
12077 307379 255598 660993 2221019 935208 259469 -109789 -1193 98156 260387 54701
12066 -230139 -73008 -128672 -60013 -193883 -110294 -104474 -88225 9042 -411629 -155495 170165
12054 59199 212706 160245 -36634 708 74323 -55548 190463 -56882 -192035 29348 -180111
12042 -159821 192839 234178 24791 13542 -206770 -134698 -100855 207421 178449 -441939 213929
12030 178650 -250622 -146650 -210805 319882 177599 -134716 -228229 -149156 122509 -204595
12019 -131153 -241624 92912 129131 217653 -57289 -66545 118655 130473 -133900 -22937 -16795
12008 -16795 10023 -14979 -127811 -140076 -244997 -64793 6343 -70213 -225198 -136001 72010
11996 334544 -63681 45335 -154964 -214795 -225967 9142 -266181 -3422 -124278 -102775 148957
11984 216330 214482 -104303 152760 144693 -5314 -366775 65279 101691 -151120 162602 25188
11972 -211011 184553 185903 8642 -320006 -155028 -112089 -252476 7736 99315 -143446 9536
11960 138112 -207010 193664 -36246 -106951 184181 54077 271842 -26039 -329774 310190
11949 -247133 57563 -166261 -54991 56636 80041 120491 404348 -260097 96840 -95774 -5826
11937 -52784 34212 -99899 -237267 -48125 117233 166160 -2025 -454381 45971 84510 -76176
11925 104830 96969 -172857 157293 222648 53894 299330 60322 50700 22628 -306816 346234
11913 167887 232493 230 -115932 -36852 95634 -35609 -115535 -218206 -133315 -66188 -248417
11902 -248417 -15854 48064 -331898 -50911 93580 -57444 -73880 7860 27463 346812 -79426
11890 -100775 465961 162865 260616 127031 314055 167410 -111106 -40844 25828 -238329
11879 299794 -231186 -168330 70603 -62679 183448 -9928 -162080 -367428 -195928 -524495
11869 -524495 -137576 -147056 197679 -23452 -54047 35641 47480 -342119 5278 -122037 -52742
11857 -66892 -243386 26797 287126 110803 173831 -25230 -218248 -37075 -197397 265107
11846 33643 -355146 113332 15309 -45913 -56528 -329466 -27063 27076 -134799 -153486 -263024
11835 -263024 114926 -191113 -278188 -295539 191134 -171014 105801 141383 -266294 35115
11824 161641 89952 53616 149635 -119385 -217979 -251445 -477022 -39306 -208675 69179 23175
11812 -18076 148046 66263 -218185 64454 -25721 -5539 45179 -285241 191393 -74471 -86108
11801 -86108 -134564 -262807 -17353 -143742 118827 225155 -416563 246186 -75643 505693
11790 -13421 -44888 -273653 -65846 -170161 -126736 138217 157866 94756 85173 -8187 -53735
11779 -53735 179700 -112548 -84987 -70938 202281 -330599 -71939 -290475 114788 -86587
11768 -153217 21333 650 -239273 484 146808 170035 115705 -84099 -5177 -257673 441606 -88886
11755 231796 141561 -181698 -53299 52975 -49790 41147 313009 -11802 98754 120075 -164367
11743 154754 58308 58970 110173 -69450 -131933 199421 140209 95120 191216 301922 -213876
11731 327893 46169 98291 -280240 176844 72847 -122175 -84212 403054 250835 -128318
11720 -32677 -324594 -166876 330523 266671 96035 47243 18809 348182 -355226 22931 49657
11709 49657 -397369 359756 28143 -70490 -255080 163932 2006 279671 226408 -2441 133891
11697 -148230 54411 170525 148641 -109297 -176539 35919 59641 80455 142794 217087 73744
11685 299574 -145226 -72827 154834 182650 -118176 -53170 48990 -16427 -84065 -73557 117430
11673 -162431 163862 246266 374915 -20613 28868 -144280 -64160 -110921 91084 66336 191583
11662 191583 -83107 164325 -201558 9274 126932 12328 -7313 193974 120996 153022 -119032
11650 223546 230206 -136072 292614 214395 -34688 11986 -211893 68785 -15687 -8899 -144344
11639 -144344 -256215 42204 -96434 -169746 -38462 210407 172715 190838 100658 -201383 126534
11627 -8693 173010 -112120 240108 398943 -324065 136710 97760 -32864 35493 83221 -87798
11615 305580 -55031 -11244 -276748 -163417 -132930 264159 26897 64121 142151 90612 82058
11604 82058 29380 77623 170160 187647 94635 -21137 316016 -25168 -1330 30549 88920 -236261
11591 66850 -76297 158830 239650 82625 215802 293712 -55925 -78424 -111698 151118 -71790
11579 83065 -91899 -58693 45006 13249 -181839 322119 282490 -162564 -270000 -280571 144773
11567 250073 108250 22866 -321292 283 341238 -157742 186066 341144 122849 -128774
11556 317432 -71273 301465 171150 149851 190385 -161572 260434 224380 108092 -169107
11545 233784 -98321 92596 67334 -65395 34485 143494 -16157 128443 382564 220128 132185
11534 132185 38924 313657 186809 7163 43085 -159543 90364 158859 258869 10797 196383
11523 196383 -131885 75807 104528 77396 115745 206879 414099 -167420 134337 -164559
11512 -372683 -56206 107082 -63294 -23537 105435 245231 -233539 66662 362835 447246
11502 447246 -61415 -2931 32623 321969 -61210 130845 161411 -140203 138318 433771 80668
11490 166666 113287 -91975 205662 192718 179489 156314 -14513 -56949 98152 81173 37125
11478 268615 466708 62375 201609 282614 92155 45588 -93310 182447 88429 128743 342643
11467 342643 281390 -110791 39231 221906 104706 -26149 341970 248574 172673 70174 376489
11456 376489 189607 136374 -445894 -25505 39621 313950 248983 327379 -220051 -116618
11446 -116618 -42752 -50294 9165 81958 187947 242262 147380 -65682 -21505 66970 -205194
11434 89896 90463 -191655 137950 -25193 -139410 83180 100752 -175292 -120055 163668 411977
11423 411977 100186 -375258 -182394 -204133 -5563 -103300 103376 -70738 -88994 -155545 -123218
11412 -123218 -283269 -130446 -180642 -263910 -143559 276636 -120434 112124 -284884 40248
11401 -350177 11755 110163 128546 213221 -37596 33959 -37194 -103806 -68329 -91025 -83148 -170365
11389 -170365 -12254 113396 -37062 55932 186689 265603 -150967 -369976 -84610 26192 4413
11377 257788 -177735 -64883 -124132 270264 28359 252453 138553 88431 -93260 -221712
11367 -221712 -142001 22223 288183 -255373 -70986 -36197 14903 -164353 -164431 111596 -69473
11355 12575 -85269 53053 37499 -238305 144429 60318 125700 309940 89613 -343400 114551
11343 177013 117674 94643 165613 176802 -61309 139040 -131981 -183942 -177427 -60714 -32270
11332 -32270 67238 -303369 78206 -144575 28832 90504 -22617 -16740 -262699 -14806 -154965
11321 -154965 -208035 -33824 11358 52675 168563 120671 -250110 144988 24701 -7122 167133
11309 -92219 -138619 8370 26020 -205826 -67573 33305 -145212 105199 103644 -134321 -6108
11297 742 -66549 56335 -224833 -145992 -27937 29474 96493 -191878 54167 -503555 -4814 -24644
11285 -24644 -62878 -365922 -259981 190416 125681 -13040 -39271 -33793 -91521 -82111 -51474
11274 -51474 124329 -97319 -101893 -109716 -138049 23528 137156 20447 -267232 94071 -200284
11262 -74621 -30471 -65755 -118928 230153 -168284 -8711 126175 62896 119221 -22020 -75430
11251 -75430 53775 183692 -56383 -207906 -119778 265029 -314087 51991 186194 -287572
11240 -38015 279915 -144173 -137952 -188099 -174192 -144258 153896 -76763 -426900 77554 -85389
11228 -343261 -105820 51080 -220575 -91700 181741 -282274 -26804 -477075 -29743 -46696
11218 -46696 366509 -33796 -57897 -462886 118187 -47684 -44770 -101905 -55912 -204911 -177677
11207 -177677 177746 305817 -19590 -153128 70836 -107610 -190923 357658 -55074 -21808
11196 54279 -6236 220003 -323160 -39983 303200 -305376 51110 -196628 51138 -229556 72894
11184 -147924 48364 435948 17117 -115334 171157 79366 13793 -15271 220973 -114488
11173 251323 -28844 -411666 -306103 -24661 -220820 -78532 -165240 -78943 61905 -91574 137749
11161 41377 -104520 -287324 169813 224199 -224733 -37349 -44644 -119984 972 44957 -138912
11149 -5657 49150 -17520 250930 -102234 140531 -87442 20805 130759 -38121 -111773 -330925
11138 -330925 -96828 -229560 -102491 -240632 23901 96029 -18236 -55735 130152 155841 -122282
11126 -30449 27182 1857 -183238 -188547 -143790 -112596 -84314 -366458 63265 109816 136896 223834
11114 223834 4390 -75495 158418 12422 39604 -131431 222300 199702 205529 289784 373659
11103 373659 -3685 269837 147510 463329 4231 78864 252621 58822 -197342 189598 441340
11092 441340 219043 37268 -1493 285445 -70721 117340 322104 114184 47446 300402
11082 300402 501643 -167358 139662 307980 211667 207331 316412 260425 389578 366026
11072 366026 -73308 277285 204995 443291 -492 382473 239283 331261 310002 517440 364542
11061 364542 213421 248598 554524 649932 522159 669510 195025 234036 540564 283778
11051 283778 632372 478996 796634 628221 529142 814255 706531 596357 778860 785147
11041 785147 -2912 682707 781830 611315 853419 747499 507678 481187 513934 644031
11031 644031 370059 468875 501253 700944 559943 597199 529742 880293 792155 407057
11021 407057 641831 736144 428756 460723 778139 579105 654109 366193 827035 410106
11010 611961 673544 454909 414060 545053 713005 599760 664839 330050 754974 471099
11000 471099 513037 467889 771276 821690 780549 805620 778854 636295 584867 1026084 716143
10989 716143 817466 1054502 612271 822352 866077 777792 853099 750294 774912 893641
10979 893641 1113475 1347148 1386820 1737908 1930267 2384430 2314448 2257893 2552801 2659226
10969 2659226 2528339 2224614 1839155 2126091 1396459 1525396 1399023 1685858 1415064
10960 1415064 1416251 1409218 1477903 1498025 1768268 1563776 1429470 1287941 1368710 1167284 839192
10949 839192 509558 406779 413038 587610 324580 150297 207715 142209 102944 302988
10939 302988 468457 38195 -39275 15289 -77424 -7626 20060 170232 -10179 -72426 5530
10927 -240627 284739 -62011 22804 283932 103141 -203441 -151235 -253652 231558 304152
10917 304152 178414 274496 -114466 -238452 -197251 -153614 -171433 -210277 179611 170435 -5866
10905 -58957 -75174 99677 208275 -5839 -279268 14307 12869 366662 -189692 -42534 -68210
10894 -68210 -42246 173872 -266552 -377869 -51145 468679 -429683 -24459 233216 186486
10884 186486 424543 -32718 -121649 -203210 -48782 32237 101239 205920 -317352 -328789 -11783
10872 57429 -123333 204586 151368 28475 -379256 163303 -20997 -149093 -107917 374284
10861 -158460 -279850 -79249 137453 -12832 -429691 80365 239289 -176027 299732 -165419
10850 -100497 -89393 -303953 -9095 -303269 222827 -227803 21741 -231419 137614 -24878
10839 -11971 -259261 -62405 -212104 53228 -202876 -308531 47924 25473 -207956 146557
10828 -149091 -236605 70613 75757 -79915 -344129 -154396 249020 74938 -76464 -105615 133398
10816 -291064 -145065 -359156 137793 83838 -324748 -134908 -133212 -311852 -139151 -260138
10806 -260138 -72260 -89747 211111 -197850 -170808 7062 245000 314123 -217111 250441 -15507
10794 -3208 64760 -409835 321522 202041 -262558 -250303 -153847 -193588 65560 -96449 -41074
10782 107520 68638 -37616 164105 144175 -59675 60138 -171069 -39284 115195 -147210 -220500
10771 -220500 185940 -141375 123579 -236252 75781 -127572 -18047 271929 -294720 -210807
10761 -210807 96715 -407109 127648 -28377 -133730 -153148 91751 -191617 -221642 22225 -85169
10749 325334 111522 168010 165533 -638 118749 -144691 -84530 -3208 -151193 141560 -349031
10737 -117589 -148805 -379031 6501 -37556 189848 -89990 -213610 -66644 185410 132976 -172936
10725 -66888 107674 318924 -63579 -70592 174526 -103533 -177975 -87915 -57930 -180557 -290028
10714 -290028 61774 88554 -444115 -80723 -119864 112419 -234016 -141980 -24819 66118 -43124
10702 96052 -406292 -189371 -387952 45266 -79370 -3945 -185091 57251 8318 -219873 -79379
10690 148796 153283 -194338 62988 334001 -395510 -34831 41478 -137878 11968 -206621 -525341
10679 -525341 64551 81952 61716 -29303 259085 126300 -49850 55016 76461 -303687 -7639
10667 -261682 -145664 -268345 -169537 -80929 -266492 -106593 -83971 -26882 274737 -48185
10656 -197695 -205862 -176687 -237290 426338 -250385 -128537 -233487 -156378 -70892 78816 251822
10645 251822 244960 -952 141777 61072 -130914 -208077 110881 -149832 23892 -85991 -161148
10634 -161148 -53286 -9753 -88391 37130 8692 126982 -379725 -109108 242917 -130225 168917
10622 59197 -187765 12677 -248958 -50261 -251105 -158437 -160523 -79109 -100240 118920 236174
10611 236174 28408 -31999 87425 -118008 -130041 -159466 -14650 -13761 62977 -337943 -19952
10599 124018 302551 143376 -69489 -78016 -270071 -44419 159278 -79891 -244605 57901 81651
10588 81651 -124916 -73531 -366294 -113577 -284011 219975 -208297 -62343 71021 153673
10578 153673 -76148 -32533 -81165 46871 160925 -347284 -362044 -140872 88830 41227 139130
10567 139130 -138203 -102476 14713 23664 -71761 146060 82509 -10936 114639 -245752 -167606
10556 -167606 -88755 -245126 -164570 213263 -282007 -271468 -36418 25754 -102678 -266 3879
10544 -174414 -207624 -40760 36033 115095 -325306 164104 135093 247182 -88224 -69044 -19643
10532 -454735 -37807 112205 40597 -144554 283172 -520771 -78880 6686 -66328 81598 -68619
10520 -19085 -113381 55665 16010 250302 -70274 2864 -27792 -86717 -158936 355011 -54003
10508 -3088 183516 -149199 -219507 71238 -75455 -257594 -79880 -338334 4819 54967 146725
10497 146725 373087 19622 -82889 -8582 152169 19163 3004 -28701 414777 16382 263262
10486 263262 -316324 94734 -296412 -22292 72763 301222 115684 186987 431541 239847
10476 239847 225596 87820 -75595 215756 293522 196322 54349 -84293 63093 67243 -219518
10464 -117215 186287 -132781 -51158 42748 -32874 -82651 169360 134027 -267399 218042
10453 137711 -172868 -84840 78112 -90644 -288902 -12780 -182952 -73768 -217430 -360198
10443 -360198 -240005 -17875 -22014 2915 -407736 -179096 135703 43599 114287 -269702 13676
10431 -57810 -151875 240137 -71732 -33320 -102641 -383677 -155761 230657 -62189 -126967 -52478
10419 25281 127494 -42620 126673 -214278 136419 -260468 -105767 -135506 16116 -85062
10408 -131858 -29731 -114828 92206 135275 146205 187576 146213 -145671 -177613 133042 -42632
10396 82760 13837 143492 -41886 -28560 -97817 -146386 263938 113400 39956 -216909 158684
10384 15408 -150193 134277 190074 -47410 46187 66282 9029 137684 455372 -107161 205676
10372 139044 235989 129228 417720 493417 242303 328041 517909 365505 557823 457051
10362 457051 219054 396563 325455 278977 151504 406177 70375 125620 260747 640238
10352 640238 131982 386005 359040 546263 315708 169110 497289 128913 301567 52337
10341 266799 395757 68516 106317 -115370 94772 295359 11977 213051 -189312 495768
10330 -32259 489444 -189516 -86091 71277 74184 227356 157337 138642 332669 -30377 429497
10318 17463 29111 -100393 370668 104808 65819 -90020 34169 76057 -242632 52329 -96953
10306 -50105 191405 150019 -296869 -27031 -6081 112785 -208257 31753 359849 -160580 26605
10294 15372 -111225 -109491 330088 1387 61818 -73367 -58542 -236911 -78810 -31863 322557
10282 -228486 -127202 -330001 128736 -298445 162916 -140018 -225445 -158451 -345764 89339
10271 -70909 -62502 56512 283785 -264228 -63012 -194927 195168 -26358 189033 -103482 234009
10259 416094 336465 102906 188149 283694 -32780 133323 227238 147700 189289 -123417 45497
10247 89408 34157 97362 -34173 -194068 223881 -90407 -60045 -69124 102714 105997 -166398
10235 268519 -328352 204437 -18440 101730 214768 273429 85071 -17238 -135789 7288 145433
10224 145433 -292199 -137665 182438 19263 216777 222554 176619 -66761 157058 -227103
10213 -93836 -44829 62878 -165016 -105860 -419104 170246 -19517 -204513 173459 -284236
10202 125893 162642 -23422 -309469 32897 117083 -295746 -261185 155444 27220 90329 14028
10190 -211699 -88420 -82707 -299997 -206537 -254463 -262707 -389470 -121923 25721 -45408 -33873
10179 -33873 -13731 -167016 -149866 -18385 -402073 -88101 -36402 -51707 -253545 22423 59563
10168 59563 -174029 -403974 -137731 45958 -161296 -106808 -318823 65344 -59416 69519 46445
10157 46445 -177068 -25447 84746 94190 7587 -281725 67924 350471 -154580 35604 -7623
10145 -210703 -168821 -243213 -197027 29523 198453 137037 -82790 27378 -328331 -149761 -111397
10134 -111397 -233137 274354 -95311 -78249 -224373 -11397 -85764 -203709 64460 -90486 -46729
10123 -46729 -345596 59485 -76910 185080 -92060 33572 124943 218096 -394945 -199842 -42353
10111 -144442 -78749 47700 -182325 -120276 -25846 -9599 23659 -192646 -101290 -320747 -288929
10100 -288929 -77528 -195642 -120989 87661 4099 -221506 79279 45956 225891 135052 176794
10089 176794 102168 121671 -204388 154412 -109291 61253 -126906 -36191 28229 -78955 -109087
10078 -109087 111343 136737 -53088 -107330 137460 -139362 334323 -207804 -145932 -40503
10067 -16975 142717 -103365 -291812 53867 -258847 -273917 29423 -54818 105826 -133497
10056 52840 96435 -113379 20298 -172595 -56563 -215183 -329271 -100297 -246504 -96789
10045 -226635 -93525 47022 -84100 -36229 -217483 102464 -124101 -54021 99767 316586 159040
10034 159040 284089 -172270 219982 -154292 -121783 78418 67162 -140027 49775 -52462
10023 19030 259355 260566 72196 -137689 -267755 -195869 188115 -108603 -11882 50886 -52019
10011 -23206 -54437 -111696 42939 -163355 114011 2960 162255 -132954 -20363 34350 343679
10000 343679 -315493 53407 -195902 -47718 -242936 -252951 -191995 -340020 -48404 -189651
9990 -189651 -243379 82043 -123014 -401530 -212927 257147 -331384 332609 80119 -39438
9979 -118819 -320606 -143374 -334737 -104710 21426 151355 28378 -250354 -29180 -198754
9969 -198754 206836 435234 -510296 -257927 -86034 -239078 -112551 104160 -374353 -88927
9958 -243300 109118 78018 249793 -246549 -80388 -230664 34927 -140989 1891 55050 -86151
9946 -98676 167169 24819 -203598 -158543 69001 36163 -36332 29361 145455 201735 -111795
9934 -193761 -255088 -241815 129976 16686 -487600 206935 -245869 154224 -338951 -56221
9923 -28055 206407 71746 -21903 -265472 -507569 -143282 -208059 -364829 244386 -337776
9912 -87650 -78798 56193 -379913 20450 -1467 -316380 157753 -67004 -5533 -170844 214070
9900 -245237 140386 76682 -121147 -144084 238703 71922 -122358 205503 129227 107539 -136187
9888 -261233 -367702 -169240 -167459 -92472 -251647 -42380 -161436 21747 -160987 -16560 -247339
9877 -247339 -49528 -142661 -74072 -57335 117608 142834 -34741 -126400 -94571 1024 -114426
9865 169793 108738 -132484 -293217 -170251 -15275 -146643 232046 33445 284465 -51328
9854 60219 213469 -249359 200678 -155162 -292493 4772 -1549 -98746 278738 46890 -66619
9842 -125731 -28766 -316097 -102626 31832 106507 197092 97913 67309 -118748 -194452 -113917
9831 -113917 -113277 -47543 -9589 129829 31256 -76650 -381331 -343451 -336529 650 188257 132081
9819 132081 -387569 144032 -195262 98813 -126425 11324 53602 48869 -180955 -55602 7438
9807 219939 25406 131102 -33384 -48608 174753 315050 -85101 -288463 -32136 147412 -78952
9795 -83281 -226584 61211 -125908 -265399 -157127 -223395 32642 -320809 23586 372571 -93022
9783 -57641 -166109 248953 -24726 -26342 -252964 -92800 241314 -83979 -426539 37368 274861
9772 274861 -92169 -73092 186694 -26592 287744 -230870 -31665 -183680 -39278 -335857 -272387
9761 -272387 267586 -323604 -244865 -117237 -335126 33265 48023 -301113 -124885 -82389
9751 -82389 -101215 3539 318941 -18635 -94404 -217401 172279 -391775 -133521 85605 271993
9740 271993 57404 -150114 -181593 75818 50075 72308 -93619 -304990 -481099 136289 -37452
9728 40302 106693 -36056 -63945 106927 -324650 97372 -362279 -335582 -83627 -74799 -353419
9717 -353419 185977 -136760 354512 -47829 -162959 108149 -96152 -17808 -71450 -165977 -210688
9706 -210688 -140731 10425 -55023 -54459 194833 -132346 -9665 -61392 -355276 -8913 18354 -68296
9693 143344 206060 143100 87335 34164 -77934 101726 -196464 -25632 90547 -11037 -177534
9682 -177534 -121313 -125585 61454 -9622 542598 -149894 -210112 -491278 -72150 -190619 -196718
9671 -196718 -43842 -251486 -173551 75929 -53423 215789 -209277 -8829 -138303 -300492 -175840
9660 -175840 -76281 43661 -40529 207056 -341239 -201674 -124220 -397186 -297468 172027 -139869
9648 -133337 73041 -36082 -244149 78877 -532538 -105642 -52166 64048 218718 257933 -90176
9636 -107622 -196548 -54370 -474662 -2162 5692 154545 156648 -191348 -102131 35657 108076 -459890
9623 -235670 105353 205402 78869 -94316 83400 -207724 -76314 -2383 412114 102491 -236111
9611 73128 -191240 -20543 191988 6461 113963 -37029 41936 105896 -6508 27939 -23788 -216805
9599 -216805 -46899 -19126 -161122 -115544 217850 -356161 54943 -49294 -113309 -45522 -213072
9588 -213072 -122287 -295567 -43257 -37963 -34550 -231199 168607 -211621 -83833 17527 249892
9577 249892 84413 54624 -73189 215193 100013 -45682 -90842 -3674 -178654 -114979 75542
9565 -49337 -289334 36904 -409630 -10053 -305531 203752 97186 -322953 24395 254284 -341792
9553 -312220 130653 -249961 -17984 441180 76344 292805 -72965 -2283 -310442 33016 13116
9541 159555 -60979 -124553 423925 130169 -121704 145536 222540 -103397 158676 -16257
9530 35571 131781 20806 -141104 -178222 -219216 -146891 -7292 -119520 70576 -42012 -112806 38738
9517 -94254 -179291 -211818 -360568 89137 228435 -112953 -152024 31021 -85791 -260912 138691
9505 3039 -29662 -205889 -55983 -54581 -118568 -70382 -100113 51624 -275501 91806 165630 41809
9492 -332618 180525 -201291 -186402 64261 220971 -105912 -147528 -190756 93343 -157353 350896
9480 20652 -19984 -108714 -251194 -276747 342251 -104339 -307294 -31293 -172650 -49303 42886
9468 126869 -99651 -125753 -12592 33249 36452 -196362 -75884 -642143 -13509 268725 -167003
9456 -177543 188010 13693 -242761 19919 -67886 149203 -140755 -81786 130789 16619 97614
9445 97614 -244495 42324 -371040 67020 -124985 23245 -297860 145025 -238919 -219558 39239
9433 126143 -280202 -106632 -260416 -127322 -352387 -47017 8218 -44164 -188709 -294707
9423 -294707 -97984 -193750 -42492 47735 26678 -9382 -171851 50894 137127 211228 -22680 -1759
9410 -161211 -393734 243640 251805 -115470 -108905 77001 -154988 -69600 -46074 -343366 58583
9398 134632 -51531 148904 -321340 220119 281989 183140 219274 186204 -132200 57343 -205714
9386 187780 166389 142731 -32050 -178929 -84451 -114980 -227892 -260983 -185267 -156335 -120248
9375 -120248 77110 -117183 -46999 109248 -10928 -63464 -131596 104858 -31438 -100332 -7232
9363 167547 -314309 -263894 -37361 -121919 -125657 -37943 217104 -110789 -268159 70736 -249795
9351 -263497 224317 -65554 -141920 -87917 5105 -537089 -191984 12255 -262522 89839 -8088
9339 41863 133886 144243 337104 -212377 330607 68157 -82070 -78826 199637 -28763 -99487
9328 -99487 33308 -121838 -191729 -134501 -9234 50724 104075 -89056 195317 277121 127918
9316 70123 129111 -212275 -246573 -205932 -11020 -98590 34783 -42932 -191101 202304 98874
9304 -214904 189883 -28990 106118 95628 -123847 114345 -71102 -128890 100110 -373277
9293 -109088 -192402 -149928 -248341 6868 173104 195699 52330 -73559 -64936 -374948 -128704
9281 -324253 124084 135568 -164337 -200720 -78208 -92178 -446521 -58835 -109597 2829 118463
9270 118463 -91299 -6811 39414 -55613 -5807 -264398 286807 -75123 -35760 116584 -185806
9258 -330498 -146034 -314168 -60209 -58646 -181821 115877 -249791 -66511 87648 -138908 -173291
9247 -173291 -9605 -554908 112812 -99931 -114350 5344 -56668 -117353 102559 15555 17229 24764
9235 24764 112244 -19080 -256568 117987 178386 -134508 310249 -80657 312623 -137156 -161183
9224 -161183 -302194 20836 159213 -240072 -108730 42034 -434594 -31455 210047 -149041
9213 247704 -121229 -128545 93221 -33225 -107629 108627 -163156 -242184 154252 -234638 -13857
9201 -17730 -60243 -73575 -75934 -54366 621 -227394 -200367 -432055 -148766 88891 229416 -21254
9188 99650 25351 -32983 -28389 -125271 -5581 -258964 -58494 66621 123236 -216268 -77146 -333807
9176 -333807 57331 94738 -184232 -16847 354327 37451 151502 80954 245290 133754 -135317
9164 -195136 -227484 -195340 -66396 37374 -50259 165405 166401 44111 -87849 120928 115011 207646
9152 207646 41909 165398 -184184 -255327 -246237 298736 -101323 -555913 -90529 268937 -161027
9140 -101382 -36438 -61673 -52343 -22351 -70533 -181368 -95695 -138654 -79256 79486 -105107
9128 -23461 192108 -312941 54299 111741 73849 189707 -343895 -20025 55998 107996 188164
9117 188164 -171406 -55739 33917 155769 121092 -155373 178319 206761 -229189 178947
9106 -7272 52648 -120826 -122820 -140762 84479 122230 -56089 -229899 109894 37735 -549433
9094 -47903 5131 -151436 -347496 134038 -124662 -128919 139637 -83568 -70547 -263818 116502
9082 -99131 22515 162073 6079 -16314 -57120 26421 -301132 103934 278618 -390730 -58266
9070 -129712 -58795 -134691 223187 -103963 24644 -19092 -77573 42473 -119438 -377335 -97371
9058 -455125 -313178 -169742 -470513 -208200 -155432 -419355 -121210 67547 56582 -47855
9047 -182486 -161273 -149451 -102127 -169290 -192438 -112364 -251883 -165145 224896 64034 -298561
9035 -69699 -463903 -12303 -158720 100351 -152254 35622 156501 -93827 92322 18769 98192
9024 98192 -315203 -382466 -114905 -118281 -169506 202403 -72059 -345446 36636 207026 132948
9013 132948 -22691 -313360 -178842 -108980 -448028 -123547 56270 359159 244731 -217941
9002 -251593 152595 -87994 -162753 -168650 -238636 446889 9224 -321008 19835 166756 -501203
8990 -81337 -57230 214437 243140 -366666 -391787 -210382 -63505 70666 -263171 -156584 -45930
8978 6460 346488 176145 -123928 -159538 -54404 -545455 -270588 116567 -302615 123754
8967 107383 -90196 128186 -91105 65460 -123458 -137931 135432 207830 3205 -134188 219332
8955 95593 28023 -156522 -19842 -71244 34113 -182694 41428 -265948 187453 36507 -139182
8943 -353664 151819 64841 -80939 -246640 -152240 -18683 13526 96981 466842 514962 234199
8931 -87670 -33400 73231 -161833 -180958 -438352 218768 385201 1061004 1871383 9051785
8921 9051785 19021746 6127949 1999723 719108 706473 473570 -76053 -10249 -223248 -221461
8911 -221461 119774 114480 56987 198570 -35676 55223 125280 -32833 66245 -88922 30307
8899 96072 48466 214496 -279522 39044 150667 59078 -124129 -141145 -6617 -193852 -467149
8888 -467149 84413 -191763 184912 -92249 -255897 -9548 127778 -178450 12493 3905 -203440
8876 109399 -41840 195041 41022 4039 -131591 -184814 -64175 131834 82931 -651094 -86051
8864 51510 52779 -103607 -133859 -358972 -138033 96638 -145036 -125644 101973 29214 124903
8853 124903 -55708 69002 -72819 -93915 -98189 65263 129762 -354137 -460871 -192094 -331913
8842 -331913 -149014 -435249 191948 -168763 -3162 42051 -153769 48822 -101216 48109 -230009
8830 -208221 147817 222532 -344520 -16542 -155584 116306 -56631 57637 124801 -103563 -87173
8819 -87173 -2369 178406 -4669 -143395 155173 124057 -156303 -301211 -187942 -52296 -362722
8808 -362722 24286 -200161 -31802 -131775 118765 10365 97017 -281645 -57092 115564 -166340
8796 -306496 89590 -322020 256564 263361 -98839 -354733 -433579 -2867 -32687 63037 132904
8785 132904 -129249 -170190 9438 -345389 -151458 -134466 -464717 -112582 76459 174667 80219
8773 76909 24709 129990 220305 26408 -261819 33760 -93045 -265713 -138426 -44772 -105724
8762 -105724 -120178 52444 -125074 -104203 101855 3622 -117243 -238404 -29188 -91878 -83047
8751 -83047 59947 -273971 42149 242127 70400 -182623 -177901 79638 -166160 -35460 227019
8739 73909 269010 -351171 -246411 223690 -56977 202919 54364 -13330 -119926 24149 45430
8728 45430 -406794 74369 -259598 -172517 121486 -66867 9330 -306867 -240663 -323444 -221369
8717 -221369 -95826 -164245 64081 18331 284903 -188921 42262 -111141 -226186 23783 -225391
8705 -79230 -158913 -393575 114006 -63200 -98143 -65038 -228512 204132 207064 167372 9674
8693 -14051 -3456 -76179 55039 237011 35237 59088 111373 -35782 -388240 -40080 -4868 59687
8680 -5601 -239780 -68419 67206 -52047 -197455 -248024 -139940 502 129054 87996 -213303
8668 -36856 142516 270951 -111584 -113439 -514963 134345 62477 226688 87450 -135251 -261484
8657 -261484 -204990 213856 431942 300440 -466158 90960 -129855 -90538 -41258 48926 -97261
8645 295011 76264 -146357 -120674 -37412 46894 122299 70635 -22138 -17743 -65728 158889
8633 -227303 -198257 48654 -48988 -60954 -151026 -17014 84476 -50932 257638 -114111 -139529
8622 -139529 -33427 59968 14662 -109005 -19137 -350179 119377 -75482 -109063 -22 -120958
8611 -120958 -83054 133629 124695 -15379 132757 -212499 88365 -20154 -324516 -282966 -64331
8599 -46623 96702 -116248 147880 212557 -83269 82534 -195 93716 -174132 -99499 -23865 -124480
8587 -124480 16821 104054 -181878 45335 -106763 81976 -33166 -79055 6510 -7861 -64688 -74546
8575 -74546 -123702 407038 -3954 382487 291530 7267 142930 122325 364064 238281 -224848
8563 -34177 3433 -229784 -34263 -78676 65830 -158774 -196319 117943 -10359 -154328 -266099
8552 -266099 -51932 46623 -103016 210495 -326305 -7393 -17156 76003 -380096 357960 -89744
8540 81124 -296017 179851 -237825 12615 -192346 -14034 -219175 -17641 34975 -227971 -177898
8529 -177898 18592 -45598 83741 264086 -102869 28864 16454 -52089 -347254 -8216 -239069
8518 -239069 -94704 -328880 -252091 110658 55984 228225 -255648 41487 -135688 292407
8507 -91897 73593 239054 90562 29876 -9122 5280 -28857 90590 134914 -201668 -109545 229263
8494 91157 -130303 55689 -233160 -87240 737 75732 -50518 -362305 63731 -40848 -179339
8483 -179339 -60236 -236249 131058 -45612 162174 -119063 -72059 -68750 -196536 -165102 -123745
8472 -123745 -274486 -259037 133849 -97099 67254 298479 -378645 -196973 56672 72850 64817
8461 64817 211876 -229643 -398714 -62485 47315 203933 -38709 -236272 -157374 -325417 -151306
8449 -18953 -265879 -79697 -182002 -69268 414336 -202105 36906 234993 37467 -154993 225547
8437 -26578 -197869 -213115 229475 -65662 870 3509 -123210 301398 -260036 -59181 -35946
8426 -35946 -11649 -382859 113877 -135915 -73875 -33630 -90777 -218506 -143384 -74390 48731
8414 175118 52538 81345 12100 -109932 -24451 124133 -37143 -182239 -12001 206746 256262
8403 256262 -51784 12052 -114329 191061 256327 -295407 -69505 71528 72932 -26173 -358659
8392 -358659 90409 -11930 132632 19698 24467 -75477 -133614 36978 -69750 -1659 -140633 -271775
8380 -271775 -82859 383109 -139531 189335 135560 -300021 129270 -78859 -273117 -307341
8370 -307341 -264701 425520 -239214 -234569 -137802 -444700 167453 -317103 208367 54973 -330320
8358 -35727 -211145 -6627 228373 177395 165997 -123580 340621 -78272 173725 148821 -156677
8346 71323 292905 -132446 415649 145479 -306956 -9750 63296 -96790 -25835 103894 -129195
8334 235936 92537 -362746 41640 -337810 256223 -313344 -251473 239038 231771 -133568 -31954
8322 206053 -229750 27896 -175466 26994 -101075 -160470 -50132 149135 327576 89404 81312
8311 81312 216426 60397 -7546 -190242 -122084 -51163 47827 -97934 81405 -292266 -216874
8300 -216874 -113573 -246986 -5126 142295 -3036 -129344 228827 -44774 -129727 -159810 -101433
8289 -101433 -324724 -211105 314228 -45113 271272 153731 -41805 -330456 53943 117942
8279 117942 91546 76598 -132885 -352151 -137617 -275976 -199557 59006 115192 -35689 -125572
8268 -125572 -286073 -163241 -145193 152959 -222352 -51889 -372869 -189665 147460 12563
8257 -165810 147185 108812 2739 18620 -39767 219746 -36396 136752 -209843 -115691 -73521
8246 -73521 43205 -345449 -299001 -223947 -13956 -16293 18022 -163625 -309682 -344765 -129999
8234 -4465 -49218 -307004 -114353 76069 -337581 -314947 40298 -128998 -1708 -218932 -390540
8223 -390540 233139 153778 -14971 157085 -85031 311699 208492 -31020 -108700 58872 50947
8212 50947 -145739 -116565 -184382 -92525 133287 71368 -158827 -404349 -35336 292642 34585
8200 -252348 -40837 121142 32260 -41938 14127 -245733 -26083 -178207 144849 -151469 51298
8188 61399 58651 25213 -262008 -144697 -136437 -82837 -324867 -37256 -151925 -176793 -4934 191752
8175 -196457 -148336 51608 -473138 -68203 182140 293089 -138925 275358 -72348 72432 -252227
8163 103682 -96618 34895 387480 -82388 -80373 18685 46935 -118764 -136888 -297797 -242161
8152 -242161 -251019 9627 78683 -260136 -13296 18632 -114327 18207 -55045 -54509 28537 -89142
8139 305016 -3960 63724 -436441 -172440 -409535 10853 22416 163718 121388 -17825 -430897
8128 -430897 127511 -197277 -187072 56825 -283649 -106938 -55396 -129491 -364937 237343
8117 -205977 -24552 116532 -41835 -141767 -40495 221241 -111246 201247 -160053 72130 -123142
8105 -150412 -8782 -69300 -43982 -243024 3344 -324669 -182276 -97862 -146904 -119278 -43302
8093 -80774 -194919 -15696 173666 245072 208922 210089 155514 -491613 -117970 279253 -223792
8081 142690 -126022 61522 91640 89207 7380 -228085 -62871 166083 15437 240590 -230395
8069 -283571 -103984 -111020 111624 -261756 182791 31590 203899 -296207 -244151 111954
8058 158698 -301551 -36788 -81662 125931 167202 -233831 -99769 -185706 -14251 -57161 46141
8046 104961 -23704 -275267 47134 116686 38847 5562 34812 15993 -103640 -133483 50266
8034 -80640 116219 -107173 6320 -82805 116419 -202932 -48380 135613 -2574 -10484 -54744
8023 -54744 -82309 -60044 -172840 187456 -10162 269354 -92575 -31428 -17830 32268 255531
8012 255531 258542 -248612 75456 -126907 326388 -28939 -18879 -26345 89407 -33109 -197649
8001 -197649 -180370 81237 -227719 235983 -12320 35520 35225 -127610 40292 -85635 -113048
7990 -113048 -362279 42962 337419 110518 -46633 -135339 200781 98448 -99971 -64814 107922
7978 -228247 16386 -219460 -293386 71326 20617 233643 39474 29351 -158289 -157155 -95249
7967 -95249 62786 38705 37332 143294 -97201 91268 156978 44116 -2982 -124910 274834 -173612
7954 14710 36001 -194985 -97354 104306 -280757 -9886 40243 -143731 -16213 -67032 -43297
7943 -43297 -255920 -195899 -327996 -103451 103313 -147181 -38686 13802 -180609 5940 49096
7932 49096 -56601 -205828 46329 -154819 170490 -200261 -101090 93114 -27289 -171315 77108
7920 -248493 -212245 -9643 31030 225335 -410478 -38988 21584 -124794 33636 -286918 102196
7908 -17313 31458 98014 -124397 -3840 157491 112359 52494 -146180 -232755 16788 54352
7897 54352 -10725 -79265 -236537 -281614 20910 -183725 730 -126252 -271794 75872 -239147
7885 9668 64118 87592 -96721 -10384 53893 -152287 -187105 79164 -362574 -37715 216528
7873 240878 116602 -283640 226202 360726 280743 56985 -19794 -52455 12590 -287079 -38871
7861 -150174 -103100 258693 -126682 33108 -68058 -186668 -148739 116647 185435 93453 204393
7850 204393 -378177 -212460 -369795 14335 202598 -151508 -72869 53036 -147186 179385
7839 -36864 -34196 137251 -477862 -20536 -66737 -191256 -193996 -278460 -154615 -251034 105635
7827 -243170 89155 42069 -42273 -181533 149327 -325880 79298 166048 -10888 -156261 -22672
7815 131475 -123932 -84290 -174450 -177015 -81626 -107116 235868 -172132 280856 262786 376555
7804 376555 29379 -212896 -231120 -147287 -90418 104921 114037 117805 201258 -200401 -256485
7793 -256485 125531 167601 -66091 -20546 119345 65738 -42102 -178345 -11555 47002 126035
7782 126035 -60497 270658 70536 -104924 96478 109287 214282 231570 -343855 57990 -361228
7770 160997 -62700 -309010 -96000 -32023 92465 -8566 46175 158031 -48032 2079 -137435
7758 211883 -112133 -356245 -143246 -253818 -23118 -426987 187980 -62908 -303543 756 176113
7747 176113 417280 -348040 19736 -233071 -158383 -533322 -74977 72971 -126471 117846
7736 241905 -291309 -69155 -61191 18897 -97853 127775 115214 -230658 -48593 103074 151562
7725 151562 -171788 150639 191043 123052 229058 4953 167014 -44210 195042 -121568 374779
7713 328478 -11700 -265750 -255652 123905 -71435 36904 -33932 -29024 119697 14283 -146136
7701 169295 -65782 -94337 27235 135364 -311084 -12370 409258 205346 318300 -309357
7690 -158908 -300422 36337 42804 -157870 -153680 -100286 -22277 80083 -91733 -42845 -601114
7679 -601114 -69595 -340175 -184003 -553494 -302518 -194671 -149124 -190236 56929 9806 -114314
7667 -189990 -128049 -166691 -159686 -39360 121176 -71672 -344739 179489 207897 82754 58204
7656 58204 69362 -115906 -125341 156095 -318047 -74352 137741 -7323 260834 11184 91768
7645 91768 13665 19625 -171351 -154884 165545 -224260 174569 2393 -227145 209266 -29700
7633 -153013 -244919 71261 73119 222758 -345113 247173 -176244 -87682 77422 -123621 -180285
7622 -180285 217920 365815 16701 -78307 102028 -169965 -392285 -71329 160063 -196845
7611 -41454 -22763 -217599 -199959 -38512 -25551 -210357 421674 64114 -19374 -161402 103591
7599 -72059 -238962 13005 -44407 37563 -27462 92427 -122559 239987 -182677 -131189 276550
7587 -407194 243951 -89386 -38914 -193366 -27284 -37379 28540 37019 6080 242599 57330
7575 -330134 -56579 210818 -22732 -163926 75198 8901 -2754 -36550 -183453 -386570 -320990
7564 -320990 -128142 -56574 234762 74636 5253 -174685 -110408 -119035 -257160 -85326 132359
7552 -152311 83682 -137657 -70505 -68907 -127765 -36387 -171965 -19636 25609 -209930 58019
7540 55170 -17530 156248 -71166 56147 118245 -67137 -64712 -196593 -76744 -185232 225343
7528 60148 -32051 -133630 196787 -554688 97393 -108832 -86741 42305 64347 -100378 -23568
7516 219386 309250 20911 90769 -44909 -39446 22775 117377 -186540 40692 53849 -61499 404071
7503 -85445 -30804 84114 110708 -12043 77451 -100182 78502 -14353 288419 -58056 15617
7491 65282 -292840 9720 54519 221370 152107 -267009 -275323 270057 288358 35544 64011
7480 64011 178586 -137594 -52647 53949 -297960 90498 115448 -86927 17723 -342600 323982
7468 87877 -58270 -83252 286706 261637 316913 -100976 32356 155371 -105582 -122522 -256620
7457 -256620 62147 -161228 99909 -14127 38980 -135180 -216609 68347 124777 -582354 25412
7445 37402 119203 -108409 -28360 -188582 -253054 147938 209437 -256536 -111044 -168259 -294863
7434 -294863 -292571 -30409 -353326 -97502 -256057 -42737 -98704 45967 202748 17160 -200390
7422 -59740 -39185 -44513 44146 -140470 471791 -8006 196575 -191431 131488 37025 -234675
7410 -176315 250116 99187 61239 -50027 184564 -181733 292527 -99657 151115 -141129
7399 -113780 -235247 -142703 -85823 -184708 -135419 -130335 -127999 349279 -132730 128001 56986
7387 62174 -323376 -49623 170846 -164461 -152553 -167813 -274572 83326 84827 463 -291712
7375 -100195 64907 -141844 16427 -53052 24107 152257 326668 55555 260433 -248399 -147406
7364 -147406 -256 307982 88827 -258443 34690 -210632 -97804 -5106 -179322 68028 -183933
7352 -50629 -288915 26425 80945 -55996 162922 -74061 -36816 31885 159452 225799 -122942
7340 -91613 207893 107255 -103217 -84498 28195 -431354 71381 -94787 128792 1485 19224
7329 19224 -236009 -174980 161680 20397 -282087 -112048 -97194 71209 58377 7633 -135665
7317 170230 -114116 -146296 -4998 189602 -76870 97 -64003 -46180 191741 -205484 -162397 -153273
7305 -153273 -276264 172298 134369 8065 -89272 -216209 177244 300255 154626 22274 -94675
7293 24272 279964 -365053 -324974 -53224 -31263 115584 40137 -100644 78878 -23846 154829
7281 -191314 -377344 -165922 -87940 170318 -216581 -20592 -51499 21594 14930 -35357 -55940
7270 -55940 -152806 102440 -26676 36409 -70779 -77241 -34598 86026 -4106 106203 -15906 -120803
7258 -120803 40541 -29209 -7431 -362616 -325611 205655 76436 -93077 -126478 -177788 10755
7246 -91889 188445 123360 -192344 -65036 -205779 -321214 -104864 37133 -48464 -67432 -203042
7235 -203042 9821 -233366 -193337 -203223 -437445 -31708 -159388 -398845 309190 -358639 370734
7223 41112 213323 -23463 -207794 -883 32946 -94811 -63357 -208212 276543 117732 96193
7212 96193 -5195 36327 -26495 -96250 17462 203056 219399 196823 2324 25947 -7740 18838
7199 164239 264198 -32459 37204 -132216 -86141 165966 73615 -48370 8663 193505 57156
7187 385952 -116508 -81858 124256 1808 -279828 -9957 254144 69669 -129675 39077 -172234
7175 -12480 -285772 -33012 -241556 -268083 45745 342663 -31566 120804 5377 297512 -326448
7163 124035 -68708 239859 -21339 -43324 -164871 -250711 117584 146282 -184163 -245940 -128723
7152 -128723 200534 -145310 -449116 101991 -49884 59016 -134110 -86928 115208 51812
7141 -364500 53128 -181997 -32397 56356 272074 166883 118342 -13487 -69218 -93172 84489
7129 -161494 -192140 -31970 218121 -347442 68379 75147 -25301 -125108 48642 -184902 -13748
7117 -43733 -30636 9665 37608 2685 -182704 -169626 -332747 -54379 263879 -331528 104515
7105 -382916 -265477 31582 -225294 -103777 -111934 -183944 234048 -76423 4980 130217 -94260
7093 190477 198991 98192 220218 77964 56086 158179 112866 -229591 25454 311253 71643
7081 -39622 -86036 -20516 -309001 136522 -7723 -216597 -102885 -256465 -232588 169409 -209400
7069 62949 -53929 94438 -203590 138896 -141395 -190619 -415 87848 -54480 -397115 -160628
7057 53027 -13145 144363 -40841 110785 -100638 257396 -268486 61402 4082 151477 131792
7046 131792 62140 37478 -8859 -386673 -205903 -87371 111421 -6204 -56091 1900 57931 -56274
7033 -71567 26797 102533 11485 153441 51753 260684 -337240 -102663 92361 -107484 8565
7021 -237551 -63985 -133214 50026 -64333 115456 144277 99779 82965 63315 130167 19991
7009 447736 432284 -4095 -279405 103129 -381563 -181776 298664 26643 -120352 87700 -66436
6997 121082 191385 55464 134932 6380 -144935 -80369 -118222 -85057 -68547 121078 -128042
6985 -85574 -160339 -244001 190370 49398 -68581 39303 -313784 -184486 105708 -31665 -152845
6974 -152845 -226690 105269 -41447 -384997 44950 -258342 427492 -18829 78518 107835 70194
6963 70194 225376 190902 -71162 -244071 169716 124367 69665 91088 -25235 92520 282614
6952 282614 -6212 46272 -221671 -129626 192404 24977 -360321 39652 423693 -316762 94701
6940 -74697 19174 363412 197527 424748 271457 269207 213296 -22096 139238 -342853 54731
6928 78274 31582 -253068 -484857 -151328 -84127 -130959 19365 146815 -73603 -221362 -142601
6917 -142601 -22515 265864 -716 -364133 -160312 -46185 130003 -35161 -181725 -16488 -27453
6906 -27453 -87464 -127636 -34670 -50796 -228707 -236871 -90283 217223 120773 145780 -13034 47011
6893 29801 -172860 -3911 -160600 153467 -9294 -25018 -35519 -3321 57965 150026 128420 -395200
6880 -31076 25711 -22261 212990 -826 -39674 77650 269539 12239 135870 10535 53324 22333
6867 151533 -70423 14951 -54366 -347629 133959 45128 219218 158717 -175676 361526 156767
6855 37273 -401338 -22651 173059 -178805 -250951 -63859 -10672 6989 -49355 62416 280012
6844 280012 347561 -421812 26364 -103319 1891 -105365 252292 -256668 -147136 -268783
6834 -268783 145592 36962 25184 26028 -230851 -12172 33609 -134585 147153 63914 -259474
6822 107355 -176593 516768 -168703 178728 -218879 -59933 47402 -351519 -82100 -20675
6811 -131776 -152038 211666 -519291 31916 286374 -34272 487760 -175369 -62659 263015
6800 -116756 -149765 -209342 201765 -21266 7638 -58627 -63493 -332450 44779 -44664 103544
6788 -191814 1835 180833 30952 -7174 -271745 -41808 188925 -66298 218543 -41458 136537
6776 170692 80744 118931 71979 196889 -93678 -12722 -136849 -93525 -45441 -139865 95030
6764 134937 -145030 4440 -163753 -717212 -228745 -121163 -175141 -246700 -125696 -10215 -135088
6753 -135088 59463 353830 30124 166318 -142779 18051 56019 -255672 -468987 24411 244831
6742 244831 -97630 165751 -217317 -120865 206932 -92226 -62966 27830 -147395 -483327 40104
6730 -58576 -101118 -158548 119747 111574 -456551 -59578 -175509 -36723 -291707 -108455 -74912
6719 -74912 -75153 -395146 -204636 110077 -158831 51449 59364 693 59704 -140178 71538 -59031
6706 37473 47001 19539 -397972 216061 -5697 160337 -244546 130479 -57399 -56909 -138480 244834
6693 -100164 171835 -22520 94199 92520 -55240 60717 -135708 -33952 -115646 431902 163023
6681 194788 -166761 -320994 -33755 -56683 80068 543419 -252512 -111250 -139676 -136744 -60540
6669 13430 -191061 99260 -232300 -109661 -45503 -3316 -145888 -25163 93368 116673 89296
6658 89296 -87786 270548 -248532 175542 77571 -32950 -194242 257437 -141416 92602 -225789
6646 163801 66635 -249728 -20834 -23602 72179 -54377 -173076 -12476 -30692 31003 77528
6635 77528 135562 -52356 46580 21121 133267 31030 76890 179125 -95451 -66867 -227397
6624 -227397 -231414 49645 -94135 40018 -61212 -132089 -204402 50577 -41486 218642 21986 110985
6612 110985 -213724 19535 -87375 -169200 106135 -76864 317490 -441685 56979 -58871 34259
6600 143941 -52732 211217 152714 -7618 46539 37973 -356522 -306985 -151402 111687 -246487
6588 323350 123558 152403 12215 -59709 -303961 210157 -200274 -62730 117386 198678 -245315
6576 -18520 -19200 -235088 -29085 208131 11466 43596 54277 133704 -227053 153147 96219
6565 96219 132677 310851 41001 -199516 138804 -192566 75907 -373126 -34716 -207474 58306
6553 44018 25569 142153 -76136 80871 -309618 -75829 -143148 242399 242524 418354 -35781
6541 -10115 5716 -196579 -193075 -3802 -105662 -298272 193143 130051 -106346 -431826 232946
6529 -10257 -94716 -81430 388404 -91997 -132838 -60176 231670 134279 49618 -86728 24728
6517 83410 97432 126541 -302678 2283 280458 104306 334352 -323307 -34212 89918 11896
6505 -57476 186735 -103479 -13753 -362252 -178573 -113070 44705 -185398 -3776 -426140 185197
6493 -79773 -25001 -68055 -52578 -32186 -155199 -472562 -119603 348354 9173 -105776 -65214
6482 -65214 149173 181391 234474 116131 -164045 -12269 55324 2158 25846 -238384 103965
6470 -424636 142128 91044 191498 -128569 -370429 -249086 157137 229246 -145933 -216968
6460 -216968 -230685 -402233 -130134 -169204 199205 -83410 6846 -294229 -161847 74 -289160
6448 -80268 -216679 126914 115896 -143004 -65868 -778 -113859 -114270 -52321 32023 23390 158954
6436 158954 -157239 333816 -113883 185129 -191882 50138 -34563 -3456 -214037 -157673 -164250
6425 -164250 119611 144426 216831 -281814 15528 -67685 -195806 177312 -324936 -87289 -332118
6414 -332118 10324 14191 81375 -36306 -266928 -324516 -133400 171738 69720 7599 -212289
6402 -124291 -7384 -196625 192058 -81228 191644 30231 85846 222365 -355187 61168 -141860
6390 142074 -27136 18686 -199645 41732 -122432 331 -73741 32321 -39325 -62302 288128
6378 34688 -18754 52391 -142873 91600 6597 -86897 15407 -22746 -12072 176234 -40487 47712
6365 123258 226357 128229 -19482 -168532 16817 33018 -118351 -21958 -101964 111783 185418
6354 185418 -44847 70933 -128336 93849 -228029 168741 -12421 -315430 6244 -194047 -1921
6342 37091 148745 73401 96128 242951 24914 -8876 97643 160143 -265429 -72443 43364
6330 -90178 74809 332302 -45787 127850 89732 -59048 -207277 -98427 -70632 -31326 23993
6318 -104498 209555 -107517 -43829 162897 -355411 66750 343100 -311170 -6907 47338 97523
6307 97523 265961 27999 11340 -135779 -51917 -302526 385116 345276 148757 -134082 -160981
6296 -160981 201742 1518 176984 79556 230426 -50598 -282646 178562 -160663 -124719 -134609
6285 -134609 -84000 125866 -158895 8655 -118315 -80966 -128632 -98223 28877 240571 -115139
6273 -80916 -66757 -85751 96004 100488 78825 87897 -322011 -245359 67088 30691 353422 310365
6261 310365 180408 89357 -142888 90249 -120944 298606 -42544 118163 119213 -168175 377368
6249 18890 -335578 -240115 114951 -12910 134510 165562 53644 -73131 203146 -150733 69513
6237 356721 330718 -63210 -67078 -355059 102242 -35630 -157029 -31562 143046 52358 -37529
6225 65899 -202263 65941 -134417 284737 -51320 -181252 -87489 -14625 -367836 -6 -342696
6214 -342696 -287858 88241 -301054 -201640 -168952 -26525 -432078 -61257 -104722 -32919 -48024
6203 -48024 -352109 -27084 221584 -104358 -81274 -60212 -201518 -191878 381051 169459 -4 -176950
6191 -176950 -358573 158612 -75442 -2408 -87272 348774 -120982 149799 -175998 -142929 76236
6179 25398 -236872 -6800 -47590 -136085 -232185 84741 85761 -8516 51171 -262947 70916 23965
6166 110844 5303 27363 205895 238220 141106 -885 -28808 58036 -383476 -19857 54610 11679
6153 6293 131965 156535 48920 -83163 -209134 -143743 -238210 -210021 -54155 -162781 118183
6141 -26600 357930 -74028 -5594 -111015 90531 100526 9384 -112550 47507 -409656 61007 267819
6129 267819 -112188 -162803 1096 149073 63837 -84007 223925 229349 46114 151814 75955
6118 75955 -36810 -191703 217344 153832 -230202 264411 -284189 -185771 -432515 -32463 193300
6106 35631 40952 83661 -207400 350214 -57805 818 142248 77316 70998 -10297 -136875 -209430
6094 -209430 -311825 -290562 129774 143678 -108525 -169081 282903 -93121 -27238 236650 116600
6082 44650 -305340 340997 -205772 110687 -6441 -249477 -188648 413001 69781 -126817 29109
6070 69551 -51958 -178618 127749 169725 111276 -67695 -205631 -363226 -53134 146209 12471
6058 -198091 505139 313172 36937 -412548 -168039 -152074 247792 -188651 128409 -39228
6047 -9786 -94870 -441206 -262492 -88235 72097 -172124 -84698 -239053 -41297 388324 -204677
6035 178303 -196731 232054 143965 16064 234752 -136033 73803 83598 55426 33980 31770
6024 31770 153514 286119 -393345 -143587 133124 -135935 -151715 87782 -109999 19241
6013 -164967 -58670 74439 32171 38621 -25471 -37893 127842 -204132 159457 305950 220460
6002 220460 -113235 -10074 219587 -193884 86526 11413 -195961 112052 -97781 185352
5991 76161 -137696 78011 -78679 -14721 -25424 248930 -86928 -286877 -163632 30128 1361
5979 309224 196028 -117829 142636 1424 -183346 103327 11668 -334724 -275582 275549
5968 11236 -169675 -70627 -9563 -155808 -215589 266495 -242615 -47872 16837 -169352 52378
5956 239537 138994 11569 159531 -16073 -376273 250845 34744 198839 -259986 -1415 -280911
5945 -280911 49148 -104469 -77415 -95109 875 -139250 331205 -160325 -161859 -93892 67345
5933 -203596 258171 98775 -36301 -126204 -57143 48846 323956 154862 218306 -232823 -91960
5921 265949 84016 -221952 -81694 36512 88624 -18087 -154880 -26078 -313011 -58753 288246
5909 105969 39147 -98046 -80941 300821 341184 437791 85270 138182 84719 -48596 -154274
5898 -154274 -1485 779 30901 -26309 252046 135886 175835 -30011 -28464 157502 236507 173747
5886 173747 266481 -30951 -89824 75955 -46979 -65342 -88408 -38061 162796 -139777 -122759
5875 -122759 4448 52344 -44013 -248618 -319211 60512 -214716 111454 71489 39349 -205266
5863 193300 -270322 -177505 127673 -47613 -156411 -58544 149288 -80621 -143339 -165185 169976
5851 46826 -466489 -62596 185685 -16876 82156 196485 170291 -52266 99953 -338826 45290
5839 -56848 157458 -222874 -57286 1139 -122730 -173944 165852 -100717 -194918 217418 64677
5827 -28229 -82469 -116366 66641 -139074 476222 -114625 -239054 155571 -70333 324586 208742
5816 208742 165969 351964 -124099 -147198 81327 260042 45326 32729 98551 103311 -208403
5804 -74148 99013 -186149 -353192 -85275 103579 143702 346077 435486 -296691 67969 147555
5793 147555 28329 190165 -71248 -108274 24295 49473 -117139 47817 -127878 123659 39653
5781 -92203 -35497 84802 80720 -363395 27282 180342 -164589 -7787 -86869 -23196 197986
5769 57114 -138799 -11521 117870 -85212 -117024 276763 26590 46284 -42469 90841 -219594
5757 -54402 261032 -298777 -184873 36891 62179 -31383 -172536 370493 -114430 5964 -161782
5745 -394878 12054 137824 299754 65905 49107 183204 342635 134284 -288738 351450
5734 -114153 22751 39841 105388 -33637 -385955 24353 -66646 -18152 -34615 106277 -81348
5722 -212960 120897 -214854 -126916 139196 43880 -148054 -74888 -538573 196001 -143538
5711 6451 40206 -107967 -96691 62546 98941 318414 -83701 -192728 184068 -62560 46754
5699 189329 222791 317989 372356 -279822 -45362 229780 83692 -55823 116848 28609 -275685
5687 25116 -5518 86437 90058 -31636 -72958 287687 43944 -44006 348728 96470 -148039 43296
5674 -247357 -68659 -109005 239065 200050 98465 -100642 -84316 93040 84084 -135363 -244610
5663 -244610 344013 106744 11156 276994 -151801 121016 -86089 -366436 98583 -156806
5652 -114007 -164781 50014 -107867 293424 -146182 92677 -51519 58346 45747 -50899 -45727
5641 -45727 -240739 138024 -166957 15707 -54886 -162309 -408318 -149386 39730 124939 342400
5630 342400 105693 -46923 121044 -103036 122623 202182 -216786 68696 -189908 14457
5619 -6658 -189702 -108834 190189 -41000 1821 -229172 55415 6477 101195 212659 111954
5608 111954 -187243 -23720 -25730 6370 -97032 -70919 -115449 -27737 54005 -52794 45941 -143193
5595 111417 216866 -28661 45954 -49080 -194287 -131254 86698 -30739 161577 74387 550076
5584 550076 107373 -69184 -62099 -92749 12839 -301625 -115748 69676 152405 -19702 -53415
5573 -53415 -301587 145316 101887 -65198 158721 -29655 -123338 -90332 -164391 -19211 -328923
5562 -328923 -77921 -477836 -173677 -63162 36079 -57843 39873 155864 -8297 13186 169031
5551 169031 -88710 199400 266884 -85165 92451 -235422 145062 44337 -94538 27313 120712
5540 120712 -10844 233226 90065 191728 -315067 -205089 30652 -327227 -4793 -44804 -152516
5529 -152516 -9985 24887 585 -112111 -93545 29687 131714 -294032 -200443 -215123 63586 -131353
5516 -204984 355100 -1488 -170382 -46500 -286457 -36056 162769 293494 -109427 84497 10868
5504 -287673 -280754 -48514 358405 -3671 -196351 -165852 163421 -111465 90506 144733 -32576
5492 -159716 217257 -197081 -28229 -67340 170806 80983 -53211 -248215 42799 -27464 -55239
5481 -55239 -33451 -111567 133060 210120 61810 -278919 -242618 -85518 14579 -95661 78938
5469 -154772 54828 -431858 -39404 -48125 -93936 50946 55938 -133332 -12286 -50803 -37563 202275
5456 -69357 102717 -100988 -219372 114294 -333453 -200211 -69791 483406 190401 476669
5446 476669 -528793 277493 158503 119295 -91356 -71504 196283 99088 29087 8433 79988
5435 79988 -94091 -115068 -115785 69585 147275 149952 71096 -19085 -173804 -13498 -25702 46911
5422 -21381 9822 -98991 -49388 -192976 -33706 -25454 206953 2244 -343677 -50098 -186541 -214457
5410 -214457 -270258 60538 -145441 -306961 35859 -138708 334021 -58477 -157318 -140488 -253076
5399 -253076 -263564 -132829 -160775 98438 64121 26961 -248703 293356 35069 -230053 535810
5387 -222521 53049 372837 40053 -292313 -109912 -212014 53963 -124659 120673 40304
5376 239988 -49729 -74374 -183571 -168964 -192093 -147553 60037 -71680 128523 188885 -48111
5364 199908 -66642 -401783 117511 104128 134939 -105460 85475 -213614 -189399 -63519 -342941
5353 -342941 -81212 283861 -31653 425143 20922 44446 -20680 362368 -90173 -191283 -27668
5341 106157 -103601 392039 -81955 252467 -84785 -28876 104893 -81215 168438 -29454 2462
5329 -14718 31126 -296401 -75412 112957 272137 1693 83498 232017 136321 -219664 -33115
5317 -345700 134525 224172 152146 235648 119576 168251 22477 50628 -40848 107555 -272898
5305 -184547 75834 347019 -25582 103193 220447 78966 103615 -95296 -45425 -102625 90957
5293 -80789 139799 -123202 -154649 -104491 36269 83549 -220086 94237 -127840 73872 -31743
5281 -211785 -74396 263814 125536 -94394 -146259 -45781 321947 -283676 192667 -85312 87265
5269 68778 -3711 -298867 39224 -42366 123810 8784 96901 90649 -127018 -33624 246784 163166
5257 163166 165493 -93180 -111145 214966 253568 6237 39626 236407 -18993 225297 -380515
5245 327182 -192027 3531 -146427 203370 403900 -281512 -92555 -42475 62264 -182891 105924
5233 307886 -139158 -96707 -137290 -111224 -48464 96556 19658 270287 21174 57843 -106267
5221 355033 -2675 -360206 -186272 -118171 267326 39369 124928 382121 17638 -508123 -134054
5209 -18548 144453 -3375 112537 50375 176313 -150012 211230 -119293 148607 -304804
5198 -231045 68223 -60264 -114599 41670 28808 -86251 -94385 197344 -325371 59730 -10629
5186 -32920 48009 20896 -109617 -103706 168374 -137533 89826 -248515 211010 85665 -110116
5174 -276476 155187 79305 -101635 -305530 -233373 -170295 308040 260644 -103996 -16909 24738
5162 56406 -164093 -377116 -62797 205970 67478 3833 -17227 53022 119750 470151 109824
5150 48733 -10401 130416 158590 -10277 -72971 212810 52781 109802 8346 -27326 -117575 194780
5137 -149891 -152657 139999 -320672 36075 75699 125985 117491 403 40790 236944 -92413 12498
5124 -80619 388104 45926 126470 179965 -257085 105585 -225567 -88108 -64848 -216233 49328
5112 24754 -85657 220468 -232369 108442 203137 11627 -90162 93741 -149523 91584 82075
5101 82075 17542 141078 115072 158914 -73219 -61127 139871 74833 1634 151613 -27681
5089 -133783 -298714 20954 187152 264533 -129707 -31914 -125098 -85810 -270624 -334837 177385
5077 -168368 -35259 -13301 97293 253733 -109928 -119743 -112729 -364790 -156797 -89795 -90264 255847
5064 -132122 -262482 -32311 139772 106742 93948 101299 259887 2561 -138657 136453 -194030
5052 40124 177507 229572 161295 99741 -265637 -101117 -224374 -94014 200944 -61856 -64505
5041 -64505 6891 216768 -248998 16762 -98800 19754 266715 -156875 339830 117307 33073
5029 -183962 -79192 227625 -35689 64894 -97868 310275 280722 -19419 -10004 -240964 13931
5017 41545 -35979 54625 162839 -126182 3072 62 -147344 34773 169393 -48603 -169672 -8734
5004 93501 -148882 -192606 -45721 -26596 177387 102999 132731 -47244 -166092 -179083 -80127
4992 -25619 1945 169329 144367 -61597 98240 231320 159589 77714 142461 -23945 -332875
4981 -332875 122536 112852 202767 39224 -67120 132601 60786 37358 -28881 -136504 258333
4969 67639 9964 51450 -121747 15208 -65657 -34419 -24642 -52190 79626 84198 -237834 -126180
4957 -126180 -178737 -82289 -84402 36106 74185 -19666 -139796 -129300 206897 81684 -106681
4945 -242163 135093 165848 408892 -85271 98366 130699 -201905 53101 -29488 -109828 196486
4933 -9622 330024 85623 25290 65579 32061 120771 111761 195689 -67457 17599 -111937 251758
4920 112024 -165896 -22842 -5302 -112636 221547 216725 73765 187749 -148249 240244 47980
4908 -197306 20574 382044 112228 57222 -123497 34196 -46984 172625 244773 -373670 -102234
4896 146402 136722 46019 -55235 176329 -69255 -225488 115760 -41502 32911 -275201 86896
4884 5380 231053 -60675 214726 37482 -74896 165919 151879 262648 -47317 25699 -39879
4872 31659 127917 214569 -122461 -186437 -287831 -185106 212762 -28304 764 -78902 -105238
4861 -105238 14008 202701 -64747 229677 -294611 -46389 -63223 -4716 -35455 57992 118688
4850 118688 82671 56147 7429 82638 -11634 107701 66777 -279096 110589 -128902 54463
4838 63512 106597 -265280 41851 -118543 -156977 99859 161760 70671 -185707 115581 53195
4826 378539 16344 151565 100808 -78308 126376 192472 -110088 -21950 43746 -48827 -55242
4815 -55242 -77639 128202 252137 -362746 118961 19373 -185995 36916 194170 125655 178635
4804 178635 -70185 90331 -15747 45154 149367 -102177 337417 -84504 -118787 3474 -20757
4792 -83452 141617 -149534 -107411 -100375 20431 -537433 -45117 124703 81987 -186581 57125
4780 -141405 410585 -196074 161788 -159943 -71788 -43993 -56894 -43299 -207817 296497
4769 -17163 -10787 285259 -127301 -19338 -112710 -204179 218061 368667 111868 -61046 -19542
4757 -3475 294656 99212 205797 -105048 -124890 -7535 -198463 -157446 -7506 -86935 -153993 -32489
4744 246056 -162989 233312 279998 81581 -81169 14905 -170357 94500 -18417 -232131 172698
4732 -70008 -152986 48294 -79755 87954 -199704 79833 187692 -112185 -16819 -288553 -303862
4721 -303862 -234383 141083 212824 -307993 -522902 -145243 44637 -52570 -44424 -494873 -345666
4710 -345666 56058 210271 -13637 80357 393370 -691 -104106 -157606 -24915 407843 91903
4698 -494321 255941 -83745 93617 -107162 -61632 173558 -48428 95703 190200 359084 126220
4686 188609 63186 55190 137264 49612 -366285 -18753 53703 -126115 -104809 154086 -209575
4674 324689 -96404 95962 245042 -347736 47073 91705 -333613 328215 -9411 44469 40185
4663 40185 158537 -228542 198265 75364 -88697 85954 -312143 -96292 -277382 -130407 -174732
4652 -174732 224477 -202349 -179671 -73476 -27305 95549 -188927 333208 47535 -23905 116617
4640 -74377 156623 92239 4707 -139509 -106340 322495 240015 172432 51208 79021 -66015
4628 141606 -103613 19805 264119 -95466 -174065 -10891 131722 -25422 -145294 -210143 125087
4616 98011 195130 -182858 -238219 -44309 51633 354122 -49400 -230363 158463 -152034 -29726
4604 7485 19441 -156200 551561 -40928 203958 35886 -326641 68364 50876 -45611 -263560
4593 -263560 -102943 127354 65830 -349101 131263 -78746 -346437 167468 -146351 158566
4582 316696 -18805 101053 157388 -41201 335272 -49770 -117815 82293 104006 120581 251964
4571 251964 -272902 111120 -17197 -18221 11374 -71695 1959 376527 -122227 23553 -30976
4559 -166233 329515 -40870 4397 54692 43725 -102104 -263239 -129391 157919 145336 -67983
4547 38016 530758 -74493 -96172 134485 18393 -22838 -33157 169198 -52713 191616 -93965
4535 36687 160111 -151752 -171168 -135617 -281855 8500 -89058 5382 69121 -230713 -82747
4523 -44554 -537 -149765 307346 67211 -133905 -203050 -18004 -152580 52164 188939 172931
4512 172931 -31092 -67317 -184798 32636 -71458 214170 36043 198162 -54453 105219 93798
4501 93798 -199127 -197564 -207889 -92166 -23712 108096 -182218 -176449 -168387 98674 -176837 251007
4488 -66567 18723 -51484 20876 -192766 -12870 271636 -188580 -268862 1996 -176524 38561
4476 215066 125989 -199781 260006 -29143 -192360 -408582 -188100 70240 246026 -228648
4465 281748 -18900 112606 121635 67842 -45296 -75432 -78573 86560 109406 -98174 -769 62673
$$ [...]
##END NTUPLES=NMR SPECTRUM
##END=
