
##TITLE=UV1278_M1_1242-1388_10_7534667_GrO3PQnggz
##JCAMPDX= 6.0         $$ Bruker NMR JCAMP-DX V2.0
##DATA TYPE= NMR SPECTRUM
##DATA CLASS= NTUPLES
##ORIGIN= BRUKER
##OWNER= Administrator
$$ 1.72 TOPSPIN		Version 2.1
$$ 2013-02-21 23:38:11.703 -0500  Administrator@X
$$ Compression mode = diff/dup
##.OBSERVE FREQUENCY= 400.02188249412
##.OBSERVE NUCLEUS= ^1H
##.ACQUISITION MODE= SIMULTANEOUS (DQD)
##.ACQUISITION SCHEME= undefined
##.AVERAGES= 8
##.DIGITISER RES= 22
##SPECTROMETER/DATA SYSTEM= spect
##.PULSE SEQUENCE= zg30
##.SOLVENT NAME= COFFEE_meoh
##.SHIFT REFERENCE= INTERNAL, COFFEE_meoh, 1, 14.98509
##AUDIT TRAIL= $$ (NUMBER, WHEN, WHO, WHERE, PROCESS, VERSION, WHAT)
$$ ##TITLE= Audit trail, TOPSPIN		Version 2.1
$$ ##JCAMPDX= 5.01
$$ ##ORIGIN= Bruker BioSpin GmbH
$$ ##OWNER= Administrator
$$ $$ E:\/data/COFFEE/nmr/UV1278_M1_1242-1388_10_7534667_GrO3PQnggz/10/pdata/1/auditp.txt
$$ ##AUDIT TRAIL=  $$ (NUMBER, WHEN, WHO, WHERE, PROCESS, VERSION, WHAT)
(   1,<2013-02-21 23:38:03.328 -0500>,<Administrator>,<X>,<go>,<TOPSPIN 2.1>,
      <created by zg
	started at 2013-02-21 23:36:56.969 -0500,
	POWCHK enabled, PULCHK disabled,
       configuration hash MD5:
       86 BA 57 50 F2 9D 5C 9B 26 00 A9 28 5F 66 2E 89
       data hash MD5: 64K
       B0 E2 A8 FC CA 90 9E 8F 8E 21 2B 53 2B CC 78 97>)
(   2,<2013-02-21 23:38:06.437 -0500>,<Administrator>,<X>,<proc1d>,<TOPSPIN 2.1>,
      <Start of raw data processing
       efp LB = 0 FT_mod = 6 PKNL = 1 PHC0 = 0 PHC1 = 0 SI = 32K 
       data hash MD5: 32K
       34 95 0E CC 68 6E B6 B7 91 92 D8 36 CF A2 1D AD>)
(   3,<2013-02-21 23:38:06.922 -0500>,<Administrator>,<X>,<proc1d>,<TOPSPIN 2.1>,
      <pk PHC0 = 66.43982 PHC1 = 0 
       data hash MD5: 32K
       E9 2F 88 FC CB 3E 90 50 93 59 2D 3F 06 9E C5 E4>)
(   4,<2013-02-21 23:38:07.187 -0500>,<Administrator>,<X>,<proc1d>,<TOPSPIN 2.1>,
      <abs ABSG = 1 
       data hash MD5: 32K
       2A FD 70 AC 1D 41 3D A6 EF E8 93 CA A7 E6 B0 03>)
(   5,<2013-02-21 23:38:07.344 -0500>,<Administrator>,<X>,<proc1d>,<TOPSPIN 2.1>,
      <abs ABSG = 2 
       data hash MD5: 32K
       1F A6 FA 4C 0E 4D ED 82 7A 2A D5 6D 98 27 61 25>)
(   6,<2013-02-21 23:38:07.500 -0500>,<Administrator>,<X>,<proc1d>,<TOPSPIN 2.1>,
      <abs ABSG = 3 
       data hash MD5: 32K
       04 48 24 AE CA FD 58 C7 6A 2A 62 3F F6 13 5E A7>)
(   7,<2013-02-21 23:38:07.641 -0500>,<Administrator>,<X>,<proc1d>,<TOPSPIN 2.1>,
      <abs ABSG = 4 
       data hash MD5: 32K
       43 12 47 9D EA 94 A2 12 62 AC A7 32 AC 02 5D FF>)
(   8,<2013-02-21 23:38:07.812 -0500>,<Administrator>,<X>,<proc1d>,<TOPSPIN 2.1>,
      <abs ABSG = 5 
       data hash MD5: 32K
       DE 17 87 78 B9 95 6D C7 44 05 A3 77 DA BC D3 BA>)
$$ ##END=
$$ 
$$ $$ hash MD5
$$ $$ C5 4F 0B D8 5A F8 D9 88 AC 4F 87 D5 E4 04 EE 6B
##$RELAX= 
##$RELAX= 
##$RELAX= 
##$RELAX= 
##$RELAX= 
##$RELAX= 
##$RELAX= 
$$ Bruker specific parameters
$$ --------------------------
##$DU= <E:\>
##$EXPNO= 10
$$ [...]
##$TP= (0..7)
150 150 150 150 150 150 150 150
##$TP07= 0
##$TPNAME0= <>
##$TPNAME1= <>
##$TPNAME2= <>
##$TPNAME3= <>
##$TPNAME4= <>
##$TPNAME5= <>
##$TPNAME6= <>
##$TPNAME7= <>
##$TPOAL= (0..7)
0.5 0.5 0.5 0.5 0.5 0.5 0.5 0.5
##$TPOFFS= (0..7)
0 0 0 0 0 0 0 0
##$TUNHIN= 0
##$TUNHOUT= 0
##$TUNXOUT= 0
##$USERA1= <user>
##$USERA2= <user>
##$USERA3= <user>
##$USERA4= <user>
##$USERA5= <user>
##$V9= 5
##$VALIST= <valist>
##$VCLIST= <CCCCCCCCCCCCCCC>
##$VD= 0
##$VDLIST= <DDDDDDDDDDDDDDD>
##$VPLIST= <PPPPPPPPPPPPPPP>
##$VTLIST= <TTTTTTTTTTTTTTT>
##$WBST= 1024
##$WBSW= 4
##$XGAIN= (0..3)
0 0 0 0
##$XL= 0
##$YL= 0
##$YMAX_a= 572533
##$YMIN_a= -567402
##$ZGOPTNS= <>
##$ZL1= 120
##$ZL2= 120
##$ZL3= 120
##$ZL4= 120
##$ABSF1= 14.98509
##$ABSF2= -5.573092
##$ABSG= 5
##$ABSL= 3
##$ALPHA= 0
##$AQORDER= 0
##$ASSFAC= 0
##$ASSFACI= 0
##$ASSFACX= 0
##$ASSWID= 0
##$AUNMP= <proc_prof1d_extract_pilot.lims>
##$AXLEFT= 0
##$AXNAME= <>
##$AXNUC= <1H>
##$AXRIGHT= 0
##$AXTYPE= 0
##$AXUNIT= <>
##$AZFE= 0.1
##$AZFW= 0.1
##$BCFW= 0
##$BC_mod= 0
##$BYTORDP= 0
##$COROFFS= 0
##$CY= 15
##$DATMOD= 1
##$DC= 0
##$DFILT= <>
##$DTYPP= 0
##$F1P= 0
##$F2P= 0
##$FCOR= 0.5
##$FTSIZE= 32768
##$FT_mod= 6
##$GAMMA= 0
##$GB= 0
##$INTBC= 1
##$INTSCL= 1
##$ISEN= 128
##$LB= 0
##$LEV0= 0
##$LPBIN= 0
##$MAXI= 10000
##$MC2= 0
##$MEAN= 0
##$ME_mod= 0
##$MI= 0
##$NCOEF= 0
##$NC_proc= -8
##$NLEV= 6
##$NOISF1= 0
##$NOISF2= 0
##$NSP= 0
##$NTH_PI= 0
##$NZP= 0
##$OFFSET= 14.98509
##$PC= 1
##$PHC0= 66.43982
##$PHC1= 0
##$PH_mod= 1
##$PKNL= yes
##$PPARMOD= 0
##$PPDIAG= 0
##$PPIPTYP= 0
##$PPMPNUM= 2147483647
##$PPRESOL= 1
##$PSCAL= 4
##$PSIGN= 0
##$PYNMP= <proc.py>
##$REVERSE= no
##$SF= 400.02
##$SI= 32768
##$SIGF1= 0
##$SIGF2= 0
##$SINO= 400
##$SIOLD= 32768
##$SPECTYP= <>
##$SREGLST= <1H.CDCl3>
##$SSB= 0
##$STSI= 32768
##$STSR= 0
##$SW_p= 8223.68421052631
##$SYMM= 0
##$S_DEV= 0
##$TDeff= 65536
##$TDoff= 0
##$TI= <>
##$TILT= no
##$TM1= 0
##$TM2= 0
##$TOPLEV= 0
##$USERP1= <user>
##$USERP2= <user>
##$USERP3= <user>
##$USERP4= <user>
##$USERP5= <user>
##$WDW= 1
##$XDIM= 32768
##$YMAX_p= 467985148
##$YMIN_p= -782444
##$CURPLOT= <Network HP LaserJet P1505>
##$CURPRIN= <$Network HP LaserJet P1505>
##$DFORMAT= <normdp>
##$LAYOUT= <+/1D_H.xwp>
##$LFORMAT= <normlp>
##$PFORMAT= <normpl>
##$SURQMSG= 1
$$ End of Bruker specific parameters
$$ ---------------------------------
##NTUPLES= NMR SPECTRUM
##VAR_NAME=  FREQUENCY,     SPECTRUM/REAL,   SPECTRUM/IMAG
##SYMBOL=    X,             R,               I
##VAR_TYPE=  INDEPENDENT,   DEPENDENT,       DEPENDENT
##VAR_FORM=  AFFN,          ASDF,            ASDF
##VAR_DIM=   32768,         32768,           32768
##UNITS=     HZ,            ARBITRARY UNITS, ARBITRARY UNITS
##FACTOR=    0.250966925370066, 1,           1
##FIRST=     8223.43324360094, 128930,       100838
##LAST=      0,             -39820,          -51729
##MIN=       0,             -782444,         0
##MAX=       8223.43324360094, 467985148,    0
$$ Real data points
##PAGE= N=1
##DATA TABLE= (X++(R..R)), XYDATA
$$ [...]
19531b1127j10796j25239j5107G4111R1712R4263A04739a11065F0235a20638b6530
$$ -21127 -131923 -257162 -272269 74111 165823 260086 104739 -111065 60235 -120638 -26530
19519b67169B9919a19173B5826J7889H431c97520r28a92003L3835K4692L1718
$$ -267169 29919 -119173 25826 43715 8431 -397520 -398448 -192003 -158168 -133476 -101758
19508a01758I5170a30001A73553a97206j35034a43512j45453a8896j49636J1717
$$ -101758 95170 -130001 173553 -197206 -332240 -143512 -288965 -18896 -168532 -156815
19498a56815J8273J5437J5202A06420i1625m2698N749p2737B2545a72066n24096
$$ -156815 -138542 -123105 -107903 106420 -91625 -134323 -128574 -201311 22545 -172066 -696162
19487f96162i0107j39089E1860c15600a24094E9270a83861C8260j5570J70598
$$ -696162 -90107 -229196 51860 -315600 -124094 59270 -183861 38260 22690 193288
19477A93288a71939A17494c93400a61973L5867b4210A81645a36752i884A75959
$$ 193288 -171939 117494 -393400 -161973 -126106 -24210 181645 -136752 -9884 175959
19466a47110j06734Q4086j9856A36368h5345k9344N6127p0689C73691D2524b16152
$$ -147110 -253844 -169758 -189614 136368 -85345 -114689 -58562 -129251 373691 42524 -216152
19454A63929B885L6252L3302l4671b10051M9066h0241j22813A85971o3068b34462
$$ 163929 2885 39137 72439 37768 -210051 -160985 -80241 -203054 185971 122903 -234462
19442A11736e8227j43870d3800a3016j76725N7707f5697m0803G2710b4427k29492
$$ 111736 -58227 -202097 -43800 -13016 -189741 -132034 -65697 -106500 72710 -24427 -253919
19431b53919J6101A52147a50459a3974o2113n7284K030N2875K8542k2314b7390
$$ -253919 -237818 152147 -150459 -13974 -76087 -133371 -131341 -78466 -49924 -72238 -27390
19419A71476C2904d5247A05438d48065B2872J18317d9167I031M5586e12339c8711
$$ 171476 32904 -45247 105438 -448065 22872 141189 -49167 9031 54617 -512339 -38711
19407e7021r0108M8147k24879n9976B86951c89701A33605J90372g234n752k5314
$$ -57021 -147129 -98982 -323861 -383837 286951 -389701 133605 323977 -7234 -12986 -38300
19396c8300F0491P1322J29362A5709c54767a05004b1126N083r0574c0527F436
$$ -38300 60491 131813 261175 15709 -354767 -105004 -21126 -16043 -106617 -30527 6436
19384f0669G3697d075A86769l3533b77378C0747f5644B53484d5461A5351J34225
$$ -60669 73697 -4075 186769 153236 -277378 30747 -65644 253484 -45461 15351 149576
19373A49576L6811B7497j945C728K6135b04319P8872D1292N8168b37192B27650
$$ 149576 186387 27497 25552 3728 29863 -204319 -125447 41292 99460 -237192 227650
19361F4464P8857a31770D9421f8195o5465L4623p2404B8557J20201F8305J27727
$$ 64464 143321 -131770 49421 -68195 -133660 -99037 -171441 28557 148758 68305 196032
19350A96032D9031a7045l4277j24266h0186F9489J62771a06689j5101j58178b0443
$$ 196032 49031 -17045 -51322 -175588 -80186 69489 232260 -106689 -121790 -279968 -20443
19338e1570j82991M5558L7408J1048B1038b68546K2181c5651j39395c7426A03946
$$ -51570 -234561 -189003 -151595 -140547 21038 -268546 -246365 -35651 -175046 -37426 103946
19326d1311n3872A54749a27693j76684a04776j85906j50583d3704B7822O9106
$$ -41311 -95183 154749 -127693 -304377 -104776 -290682 -441265 -43704 27822 96928
19316I6928f6986a1980q4477j88650B02813j360b02869B49896a93508D13645C2172
$$ 96928 -66986 -11980 -96457 -285107 202813 201453 -202869 249896 -193508 413645 32172
19304f581p8641B7855L59946G9270A777c890r8955j9692F4307a20352j76290J5498
$$ -6581 -85222 27855 387801 79270 1777 -3890 -102845 -122537 64307 -120352 -296642 -281144
19292b81144c1136p606j3492A18198e6213l18697Q4603p0794b8485j11637O4203
$$ -281144 -31136 -38742 -52234 118198 -56213 -374910 -290307 -361101 -28485 -140122 -75919
19281g5919B11769b03403a2787I0756J78174h514k37035N4355A67374a30543E4676
$$ -75919 211769 -203403 -12787 90756 268930 -8514 -245549 -191194 167374 -130543 54676
19269b7195A65065l8514b40170d663j43594L6586r8671l9068J23518m2810p4267
$$ -27195 165065 126551 -240170 -4663 -148257 -111671 -210342 -249410 -125892 -168702 -242969
19258b42969f2151k90139G456P2720a96275N574m6504H1940O7805a52536k0722
$$ -242969 -62151 -352290 7456 80176 -196275 -190701 -237205 81940 149745 -152536 -173258
19247a73258g1374a8124k35548a1444m9878I4336a34213L4042j71034A61691B895
$$ -173258 -71374 -18124 -253672 -11444 -61322 94336 -134213 -100171 -271205 161691 2895
19235i9542a4033j62261f8055A55135a46935b0840p7425K3221L5434j05589O6899
$$ -99542 -14033 -176294 -68055 155135 -146935 -20840 -98265 -75044 -39610 -145199 -78300
19224g8300j40798i2691k06274E2817c28521P6067l2951A05962b26025C4010c09166
$$ -78300 -219098 -92691 -298965 52817 -328521 -252454 -285405 105962 -226025 34010 -309166
19212a70062h0702c0380l11313b3795m89949c0324D5085a27385B50166a56204
$$ -170062 -80702 -30380 -341693 -23795 -513744 -30324 45085 -127385 250166 -156204
19201e4712k05326A96805d3934M933k13135g571H5259g0884A11753l1552b15873
$$ -54712 -260038 196805 -43934 -39001 -252136 -7571 85259 -70884 111753 80201 -215873
19189c00298C5014L78875a01185m50153a96734E1811b4072A5459J80715J90369
$$ -300298 35014 413889 -101185 -551338 -196734 51811 -24072 15459 196174 386543
19179C86543j51808B8347e62416b05699k3341M770c051k5036B36276i3066A26560
$$ 386543 234735 28347 -562416 -205699 -229040 -224270 -3051 -28087 236276 -93066 126560
19167C90759g9119p8469O3726A6110c59369g9451j47860O6415o6797o4283A88135
$$ 390759 -79119 -157588 -93862 16110 -359369 -79451 -227311 -160896 -227693 -291976 188135
19155b14148q2534a43765G0922c81694d5071j18359E3554Q2324a36552q3155M2967
$$ -214148 -296682 -143765 70922 -381694 -45071 -163430 53554 135878 -136552 -219707 -176740
19144a76740D3922h2329o0538G2467f5481j91815a25361F7190k3205J58808b64446
$$ -176740 43922 -82329 -142867 72467 -65481 -257296 -125361 67190 43985 202793 -264446
19132a63759p1934d3593H9128J70794c08826e5792j60227B3328c18177i4593k40425
$$ -163759 -235693 -43593 89128 259922 -308826 -55792 -216019 23328 -318177 -94593 -335018
19121c35018C30647b11849A33980i3310C73571d11641J23737A11329c95481i2053
$$ -335018 330647 -211849 133980 -93310 373571 -411641 -287904 111329 -395481 -92053
19110c4156j58183A44236a91965I0543K05601e4130o9958k4757k607K3928G6093
$$ -34156 -192339 144236 -191965 90543 296144 -54130 -124088 -148845 -151452 -127524 76093
19098g9271m0861K1172C3618J09386e2303C1360J1265O0847b008j44605B9336
$$ -79271 -120132 -98960 33618 143004 -52303 31360 42625 103472 -2008 -146613 29336
19086c8174j2917m7420A6852N7168a43139C1853c6564l57905f4170A9101b04814
$$ -38174 -51091 -98511 16852 74020 -143139 31853 -36564 -394469 -64170 19101 -204814
19074b65887K4504E5772f7554D6530a66659j13699B37772a45163A9180a51728
$$ -265887 -241383 55772 -67554 46530 -166659 -280358 237772 -145163 19180 -151728
19063b84529M187g2777A39267g8468k13483b828j41345j496C6729b39069A09872
$$ -284529 -280342 -72777 139267 -78468 -291951 -2828 -144173 -145669 36729 -239069 109872
19051b96749g2822A62313m4822a23618j36611A15095l8362a46716d1635A8945
$$ -296749 -72822 162313 117491 -123618 -260229 115095 76733 -146716 -41635 18945
19040F9601O9203c96237J18967B28887g1544J7988C08421c2772n4132k54350a06819
$$ 69601 138804 -396237 -277270 228887 -71544 -53556 308421 -32772 -86904 -341254 -106819
19028G2029L26961e6050D2793M7786d08644H9609B0540J47386O7988c7903I1856
$$ 72029 398990 -56050 42793 90579 -408644 89609 20540 167926 235914 -37903 91856
19016A8316J6086M0525j7432c06006A40459c5533l8738k20205J11038M7363j21720
$$ 18316 34402 74927 57495 -306006 140459 -35533 -74271 -294476 -183438 -136075 -257795
19005b57795O4536B0303K8326a73614j55045J58832e0230n766B09545c3984A8249
$$ -257795 -193259 20303 48629 -173614 -328659 -169827 -50230 -55996 209545 -33984 18249
18993c06201G6326c8092D4621J12177d54336i8891n3400A80232G7067C3365P1203
$$ -306201 76326 -38092 44621 156798 -454336 -98891 -152291 180232 77067 33365 104568
18982A04568a46042H89K33352B1755J98917B6445F324c805G1527a31686q9759
$$ 104568 -146042 889 234241 21755 220672 26445 6324 -3805 71527 -131686 -221445
18971b21445A67206a94862B26939N1395e7448k2766H0717I098L1775c5893G82
$$ -221445 167206 -194862 226939 278334 -57448 -80214 80717 9098 40873 -35893 782
18959E0477J01861m1800e767q3996p4638B66400d0935C4044b79895G6633L3891
$$ 50477 152338 110538 -5767 -89763 -164401 266400 -40935 34044 -279895 76633 110524
18948A10524e4825C6054b57579m8635F3429K896b26766B02861E7906h6528p4284
$$ 110524 -54825 36054 -257579 -306214 63429 66325 -226766 202861 57906 -86528 -160812
18937a60812C11821D4576R790f0064A19676g5888k24948a6443B2501L2274d07021
$$ -160812 311821 44576 54366 -60064 119676 -75888 -300836 -16443 22501 54775 -407021
18925e8324j84952j35377d3703k69240P7989n855h5357n2686p0398b2232j48288
$$ -58324 -243276 -378653 -43703 -312943 -234954 -240809 -85357 -138043 -208441 -22232 -170520
18914a70520k90026C6490f5360j51796d7949o5456q9506c7166A66538F2307d184
$$ -170520 -460546 36490 -65360 -217156 -47949 -113405 -202911 -37166 166538 62307 -4184
18902i1075A15564f4748G5029J69641B5101M3785e0957K130A35123c6330k50058
$$ -91075 115564 -64748 75029 244670 25101 68886 -50957 -48827 135123 -36330 -286388
18891b86388f778F2074h6698p0149k52206J09818f1510B51407a47588A25068J20908
$$ -286388 -6778 62074 -86698 -156847 -409053 -299235 -61510 251407 -147588 125068 245976
18880B45976f2497E9386a65852l1507D8905f1771k83256E1828g6739c8147j31864
$$ 245976 -62497 59386 -165852 -197359 48905 -61771 -345027 51828 -76739 -38147 -170011
18869a70011D0195j4485J1676a32180o9088j65837L615a42213A12454h6111m5393
$$ -170011 40195 25710 37386 -132180 -201268 -367105 -363490 -142213 112454 -86111 -131504
18858a31504C82702g3987A46971a09175A15406d05776M0405f6880B02603a12962
$$ -131504 382702 -73987 146971 -109175 115406 -405776 -365371 -66880 202603 -112962
18847c5774J6006A09360e6860J7044k35202B26839b64797a13840I2060a11170
$$ -35774 -19768 109360 -56860 -39816 -275018 226839 -264797 -113840 92060 -111170
18836b15466A30200d1732B0009J19473c2820R145k54803g3826A27450a04097A51683
$$ -215466 130200 -41732 20009 139482 -32820 -23675 -278478 -73826 127450 -104097 151683
18824a94291d2765B06886o7776F4193a57546B15708i3637j1837B11741a53646
$$ -194291 -42765 206886 139110 64193 -157546 215708 -93637 -105474 211741 -153646
18813A7368L3377M17960A11371d8338A57439M9263F7574Q5105A3258J63332a57280
$$ 17368 50745 468705 111371 -48338 157439 206702 67574 152679 13258 176590 -157280
18801b18094p2905A45167F2040a2092k20820A22369J09175a2666k4908A39317
$$ -218094 -290999 145167 62040 -12092 -232912 122369 231544 -12666 -37574 139317
18790b4026A04847b68920n1535A2497i3030A09570c04212B55653f6376m3511d3447
$$ -24026 104847 -268920 -320455 12497 -93030 109570 -304212 255653 -66376 -109887 -43447
18778b43130a5923H1951b03142l06875a95537d3916j77729D3467b28773j43025
$$ -243130 -15923 81951 -203142 -510017 -195537 -43916 -221645 43467 -228773 -371798
18768c71798B18033f8662o9017j09989g2796j06397H791J50555C3661a80707c7894
$$ -371798 218033 -68662 -137679 -247668 -72796 -179193 8791 159346 33661 -180707 -37894
18756a826m09263j10631A76917e5453k22470N9696c0778l35867a13490l84981
$$ -1826 -411089 -521720 176917 -55453 -277923 -218227 -30778 -366645 -113490 -498471
18746d98471a36063F4411d3172n4834j27964H0348a84807A56221d6494k961k02341
$$ -498471 -136063 64411 -43172 -98006 -225970 80348 -184807 156221 -46494 -49455 -251796
18735b51796H627a4173j97186M3845m7736R3904E6345c7602p8791c9808k03848
$$ -251796 8627 -14173 -211359 -167514 -215250 -121346 56345 -37602 -116393 -39808 -243656
18724b43656c3537n3977a938l87747A28359a34389L2467r040j54188j5072a22577
$$ -243656 -33537 -87514 -1938 -389685 128359 -134389 -101922 -110962 -265150 -280222 -122577
18712A69376g558j3396j09719P582k31226B26409a34643B22783J86419f3350q3011
$$ 169376 -7558 -20954 -130673 -123091 -354317 226409 -134643 222783 409202 -63350 -146361
18701a46361N9978b1684j83I9073b6298k86994h7862B18965C6016a4596k26831
$$ -146361 -86383 -21684 -21867 99073 -26298 -313292 -87862 218965 36016 -14596 -241427
18690b41427A02067f2842J1030n68454a42553A05244O5684J38765b68398B98999
$$ -241427 102067 -62842 -51812 -620266 -142553 105244 170928 309693 -268398 298999
18679b23941b5033l46013A3349c14589d0049j48096A61410b55378A04384B8997
$$ -223941 -25033 -371046 13349 -314589 -40049 -188145 161410 -255378 104384 28997
18668b29767f0640r7955f586C1178j5108f6250j40006g3429k03182i9550m5685
$$ -229767 -60640 -158595 -6586 31178 16070 -66250 -206256 -73429 -276611 -99550 -145235
18657a45235R971r5787A52980b00291B77676i0200j30928F1836a8934A28263K63511
$$ -145235 -135264 -231051 152980 -200291 277676 -90200 -221128 61836 -18934 128263 391774
18646C91774c24622i911A7627R4969k5136c12078Q2357N3352A63100F810L6835
$$ 391774 -324622 -9911 17627 112596 87460 -312078 -229721 -176369 163100 6810 43645
18635D3645J05739E0604J49496o2762J04417a7000A15949A082c0124m0224C72282
$$ 43645 149384 50604 200100 137338 241755 -17000 115949 1082 -30124 -70348 372282
18623B46259g5311A27508P1940M9370c3390j14208A39400a71069O1415j38510
$$ 246259 -75311 127508 199448 248818 -33390 -147598 139400 -171069 -109654 -248164
18613b48164J08737e6773m6660D3927a55055k7917Q9843M6391n7907A07946E3274
$$ -248164 -139427 -56773 -103433 43927 -155055 -182972 -93129 -46738 -104645 107946 53274
18601b92890C9302A2210R4246C0965K3770e7986A700b38633B11701a11849D9679
$$ -292890 39302 12210 106456 30965 54735 -57986 1700 -238633 211701 -111849 49679
18589C0907i972m114C8981b90078P2114h6714n9377B05248c95866c6681a4426
$$ 30907 -9972 -14086 38981 -290078 -217964 -86714 -146091 205248 -395866 -36681 -14426
18577a58534A00803c7546r7695A20190a20528A64757h5418A47356F9603l4444
$$ -158534 100803 -37546 -135241 120190 -120528 164757 -85418 147356 69603 35159
18567C5159d58071K09131F603a49501c9207j66477B10120I520d0614j05417N5789
$$ 35159 -458071 -248940 6603 -149501 -39207 -205684 210120 9520 -40614 -146031 -90242
18556i0242C0171L3590J27584N3604A7590L4763N8577l5749a13800j81608J11921
$$ -90242 30171 63761 191345 244949 17590 52353 110930 75181 -113800 -295408 -183487
18545a83487e2826m8220k3215A48404N2048C1011i7353L6010B96056l0409b11577
$$ -183487 -52826 -101046 -124261 148404 200452 31011 -97353 -61343 296056 265647 -211577
18533a17391c5256l1256r0768k09365c9053o4564A22446b17281k5048k08340a2442
$$ -117391 -35256 -66512 -157280 -366645 -39053 -103617 122446 -217281 -242329 -450669 -12442
18521a88614A8547i7854A16156e11017a20817L6726A44068G1145b07241L442k26194
$$ -188614 18547 -97854 116156 -511017 -120817 -84091 144068 71145 -207241 -203799 -429993
18510d29993b8617A10828a52198D184a70792Q2432D6702g8645o4916f1112j75389
$$ -429993 -28617 110828 -152198 4184 -170792 -88360 46702 -78645 -143561 -61112 -236501
18499b36501A99229B0903a55542A33113c46889b6658D7080J00343j3507j4408
$$ -236501 199229 20903 -155542 133113 -346889 -26658 47080 147423 133916 119508
18489A19508C4960a36776N3529B15953m0730g8086A86210a69431D569a85413L9405
$$ 119508 34960 -136776 -83247 215953 175223 -78086 186210 -169431 4569 -185413 -146008
18478a46008j21138E646b52541R4113F2288N8086a44272n7762B45220a0632r6846
$$ -146008 -267146 5646 -252541 -158428 62288 120374 -144272 -202034 245220 -10632 -107478
18467a07478J6160K1973C24989a93760C24003g8284r1253J9989G3903b93648A67160
$$ -107478 -91318 -69345 324989 -193760 324003 -78284 -169537 -149548 73903 -293648 167160
18455g1423B24830b84899J31209I6147a74386j51428e7012j92959a15447j01297
$$ -71423 224830 -284899 -153690 96147 -174386 -325814 -57012 -249971 -115447 -216744
18445b16744D9235q483b16942e7429j55517c3295A3461P0023j1666a9835j11364
$$ -216744 49235 40752 -216942 -57429 -212946 -33295 13461 83484 71818 -19835 -131199
18434a31199A26141l2950b42905a00120D1047a41825c5403l22680J56815Q5385
$$ -131199 126141 93191 -242905 -100120 41047 -141825 -35403 -358083 -201268 -115883
18424a15883j32734A10124N3822b687A85242B9745P6601c98278J23248A17380
$$ -115883 -248617 110124 163946 -2687 185242 29745 106346 -398278 -275030 117380
18413d3182E6162b57984j2007a1980l05980H6814Q6598a1051D2018i9841j41601
$$ -43182 56162 -257984 -269991 -11980 -317960 86814 173412 -11051 42018 -99841 -241442
18402b41442B98435a86003j58207c9710D8693L9436A9087a33768j45698A102J94774
$$ -241442 298435 -186003 -344210 -39710 48693 88129 19087 -133768 -279466 1102 195876
18391A95876f0540n1925j0066B01563b1772G7779a5212q2002B27125H3739d7665
$$ 195876 -60540 -112465 -122531 201563 -21772 77779 -15212 -97214 227125 83739 -47665
18379a21284m643q7834k3796E9467I07b9610j31956j93608Q1248h459B51676A0242
$$ -121284 -125927 -213761 -237557 59467 907 -29610 -161566 -355174 -273926 -8459 251676 10242
18366b56895A04027f7941a17D3320J05854i46l19146M8732f4900n2633G4737J95984
$$ -256895 104027 -67941 -117 43320 149174 -946 -320092 -271360 -64900 -117533 74737 270721
18354B70721H4285b44977A16186a26579K6962B83409a3316B53301a20078B27405
$$ 270721 84285 -244977 116186 -126579 -99617 283409 -13316 253301 -120078 227405
18343c67629i5233D101P7399j4624a89300h6862C2069J04096J52513a43872O2839
$$ -367629 -95233 4101 81500 66876 -189300 -86862 32069 136165 288678 -143872 -81033
18332h1033B91457K9811b11551c8986l21350a4028l1505j1959C36857E9479h2893
$$ -81033 291457 321268 -211551 -38986 -360336 -14028 -45533 -57492 336857 59479 -82893
18320c43727B11682A36K4404L5029J75594O8369f0736H9212a30078a1239n4161
$$ -343727 211682 136 24540 59569 235163 303532 -60736 89212 -130078 -11239 -65400
18309f5400j38923e6691A47294J4162d4811l91673a83162N1225A85945F748b67769
$$ -65400 -204323 -56691 147294 161456 -44811 -436484 -183162 -131937 185945 6748 -267769
18297A44911a39785q1991Q7i3595H7088c5250l36927C71325p1779i761k7855k4471
$$ 144911 -139785 -221776 -221689 -93595 87088 -35250 -372177 371325 299546 -9761 -37616 -62087
18285f2087a1893d725m68281a11756o6835C10327d01997J33064C50581b33269
$$ -62087 -11893 -4725 -473006 -111756 -178591 310327 -401997 -268933 350581 -233269
18274B11651k9956a48699j4447e374A73411G9456b44777A45779a40422j74009
$$ 211651 181695 -148699 -163146 -5374 173411 79456 -244777 145779 -140422 -314431
18264c14431A10502f7467J4020j002k4910C93872b57503C0572a83095f2900B01693
$$ -314431 110502 -67467 -53447 -54449 -79359 393872 -257503 30572 -183095 -62900 201693
18252i6681k8862C45131a35757F965J96930a10530j00880E8146K59970a91807
$$ -96681 -125543 345131 -135757 6965 203895 -110530 -211410 58146 318116 -191807
18241F3614A0147a01684n6897c8506j81094P5996N1487j9411D6946b98561O5373
$$ 63614 10147 -101684 -158581 -38506 -219600 -143604 -92117 -111528 46946 -298561 -233188
18230b33188a955p5604J9704l7450A28736a89011P5267A42699B2379i8886c0867
$$ -233188 -1955 -77559 -57855 -95305 128736 -189011 -113744 142699 22379 -98886 -30867
18218A32721a93605F3598B8427n112a20058A7836b12527A10674k8682b32070O0779
$$ 132721 -193605 63598 28427 23315 -120058 17836 -212527 110674 81992 -232070 -171291
18207a71291A6987O8815c69173a10677j41285B37086I2342a22137k50894C84980
$$ -171291 16987 85802 -369173 -110677 -251962 237086 92342 -122137 -373031 384980
18196a31000E8690a94695L7625B74516R8253a90890b6743G9685a58000G421d7439
$$ -131000 58690 -194695 -157070 274516 372769 -190890 -26743 79685 -158000 7421 -47439
18184b03187A10436M845f0397A04193b38370d244G0831c19600F1671a0164j29796
$$ -203187 110436 115281 -60397 104193 -238370 -4244 70831 -319600 61671 -10164 -139960
18173a39960J9504o4300B24027b32440e5772q9702j02457A51102b24669J05166
$$ -139960 -120456 -184756 224027 -232440 -55772 -145474 -247931 151102 -224669 -119503
18163a19503N2245k6885A52103b27379A84039G6255Q8927B0601R5115J39778o9399
$$ -119503 -67258 -94143 152103 -227379 184039 76255 165182 20601 115716 255494 186095
18152A86095h3793A67112c5033j27340K5980I6071a412p8416j12899A38159c52385
$$ 186095 -83793 167112 -35033 -162373 -136393 96071 -1412 -79828 -192727 138159 -352385
18140a54330n8731E093b89989D2502i6061I4408a36196j94932J64586J652D3326
$$ -154330 -213061 5093 -289989 42502 -96061 94408 -136196 -331128 -166542 -164890 43326
18128a01337D79354A0316a32979K0102b7140A43717E4349C103b17050L4285n2002
$$ -101337 479354 10316 -132979 -112877 -27140 143717 54349 3103 -217050 -182765 -234767
18117b34767i4160H4817C5459b4460l6973j88544D5024a12417A8571e3648A03290
$$ -234767 -94160 84817 35459 -24460 -61433 -249977 45024 -112417 18571 -53648 103290
18105e0541l5401A26727g5039A29006k0817B5442a20342j41453H1210N7671a92777
$$ -50541 -85942 126727 -75039 129006 108189 25442 -120342 -261795 81210 138881 -192777
18093a94944Q3820B1730N1355j6768b40658a0351o7818j58093o250M6346R3641
$$ -194944 -111124 21730 73085 56317 -240658 -10351 -78169 -236262 -242512 -196166 -102525
18082a02525k03536R6513g5267I5249N7987Q3567C1580R848e1662A20351b039
$$ -102525 -306061 -209548 -75267 95249 153236 236803 31580 41428 -51662 120351 -2039
18070C4897c4074k64009H7993a40441L2935J5967c1991r5947e827F4808j8615
$$ 34897 -34074 -298083 87993 -140441 -107506 -91539 -31991 -127938 -5827 64808 46193
18059D6193f1659j47833f7858D6716R5322c67317Q9911b1925j54659g4356C25239
$$ 46193 -61659 -209492 -67858 46716 142038 -367317 -277406 -21925 -176584 -74356 325239
18047a64368I8334J2682b2318A69392P2566B6322a72314o0020A04866a29146K4875
$$ -164368 98334 111016 -22318 169392 241958 26322 -172314 -232334 104866 -129146 -104271
18036a04271k39357C3275c6441F0054i0388j46401f2095F6920K6048a33213e3256
$$ -104271 -343628 33275 -36441 60054 -90388 -236789 -62095 66920 92968 -133213 -53256
18024g3379B98632c49677B7632L3803c71655I240M0811a72952F2213J18861B9360
$$ -73379 298632 -349677 27632 61435 -371655 9240 50051 -172952 62213 181074 29360
18012a30592n4659j62155a9585j28818B11058H1735k958a2024A38602c10876d3133
$$ -130592 -185251 -347406 -19585 -148403 211058 81735 78777 -12024 138602 -310876 -43133
18000e5449I7839a12967m01263a1439k04528N7518A70186a13602f463C85722E1292
$$ -55449 97839 -112967 -514230 -11439 -215967 -158449 170186 -113602 -6463 385722 51292
17988G3817K2212d3672j2023m5370p0298c3162l9957j30629J9208j22492A07639
$$ 73817 96029 -43672 -55695 -101065 -171363 -33162 -73119 -203748 -184540 -307032 107639
17976a38546k15477A75312l652J1648b00954N3083A89093p8227a99991d7451o25
$$ -138546 -354023 175312 171660 183308 -200954 -147871 189093 110866 -199991 -47451 -48076
17965d8076B17072d05121a2039F1268l0114d5139D89371d94559F0683d49002E2484
$$ -48076 217072 -405121 -12039 61268 31154 -45139 489371 -494559 60683 -449002 52484
17953a798B09846F0069h8316I5265b01128l6113H8201J45207g7366E3981d7308
$$ -1798 209846 60069 -88316 95265 -201128 -237241 88201 233408 -77366 53981 -47308
17941a98160I1698a66753N1507e786A60346p1343P4167F6641K94308A6887f9564
$$ -198160 91698 -166753 -115246 -5786 160346 89003 163170 66641 360949 16887 -69564
17929A75562c3852j28318A31331a89508o5995a02792d7795A52072A0222P9806
$$ 175562 -33852 -162170 131331 -189508 -255503 -102792 -47795 152072 10222 90028
17919I0028G815d73139f0152B91548b84835G5536G095O2849b02501a4576D09029
$$ 90028 7815 -473139 -60152 291548 -284835 75536 7095 69944 -202501 -14576 409029
17907a89734Q3442G5291a62141B92142j14793a98137f0125q4726O7242A7371K17588
$$ -189734 -106292 75291 -162141 292142 177349 -198137 -60125 -144851 -77609 17371 234959
17896B34959b50570A00722L5314f7913l7708G1373c96611D069a52766C08516F4434
$$ 234959 -250570 100722 136036 -67913 -105621 71373 -396611 4069 -152766 308516 64434
17884B49742j00633J20479a54904A02537a81686h5748A87975f9058b2742j87716
$$ 249742 149109 269588 -154904 102537 -181686 -85748 187975 -69058 -22742 -210458
17874b10458J7715H3795P5650J322o7057J84944E5398K00283f3329J0810C44300
$$ -210458 -192743 83795 159445 160767 93710 278654 55398 255681 -63329 -52519 344300
17862A06369k0637g274q8170m1605a7119k54470O7433G3285h5631I1440c03661
$$ 106369 85732 -7274 -95444 -137049 -17119 -271589 -204156 73285 -85631 91440 -303661
17850b9934l7729H1905a61679A1798h4200I0473d5565r3210B40501h4763B12550
$$ -29934 -67663 81905 -161679 11798 -84200 90473 -45565 -138775 240501 -84763 212550
17838h3622k43148c7282A95674b18350i1155D5037k1289i0504j34456B43840A09992
$$ -83622 -326770 -37282 195674 -218350 -91155 45037 23748 -90504 -224960 243840 109992
17826A05566o818D2520K22410h6478D15720E2294i8593D9544a84814j83552f7390
$$ 105566 98748 42520 264930 -86478 415720 52294 -98593 49544 -184814 -368366 -67390
17814A0927b74151C20390k3822i308A38144m2579j0848N4514B4521K68059f2475
$$ 10927 -274151 320390 296568 -9308 138144 95565 84717 139231 24521 292580 -62475
17802A7089b7107A85103a78717Q8829n6699D3398j2159b30111G7757h2941A23325
$$ 17089 -27107 185103 -178717 -89888 -146587 43398 31239 -230111 77757 -82941 123325
17790a29493e4931p4172K1079M5774B02612M8716b6395F9760a10086k14573K0693
$$ -129493 -54931 -129103 -108024 -62250 202612 251328 -26395 69760 -110086 -324659 -303966
17779c03966G9418B7626J94369C6453h9049A02480a61061B39954A6330J85054
$$ -303966 79418 27626 221995 36453 -89049 102480 -161061 239954 16330 201384
17769B01384a66220j9392A36990c09805i1700K8424C08020e15433a72954N3532
$$ 201384 -166220 -185612 136990 -309805 -91700 -63276 308020 -515433 -172954 -119422
17759a19422i650k89603J27773B30507L3971D1483h1205l51366B31057f2821B25766
$$ -119422 -9650 -299253 -171480 230507 264478 41483 -81205 -432571 231057 -62821 225766
17747d4213m8526B26155j0336r3088c7368C32942C6343b26068b1469c33I0686
$$ -44213 -92739 226155 215819 122731 -37368 332942 36343 -226068 -21469 -333 90686
17735b41994M1624A31391E3628a93778A82267p6354a65991l1521q0355B1035h0491
$$ -241994 -200370 131391 53628 -193778 182267 105913 -165991 -197512 -277867 21035 -80491
17723h4656m2451e3932C67761b88490h2746K772A29571a93488J1808B44311a2069
$$ -84656 -127107 -53932 367761 -288490 -82746 -79974 129571 -193488 -181680 244311 -12069
17711A5704c49822A62898G9734Q2732G420M817J09521g7363l41930a20628H0730
$$ 15704 -349822 162898 79734 162466 7420 12237 121758 -77363 -419293 -120628 80730
17699G0959h7144F4975b4105n2371C4564a95363A12990c8978C4794a05745A68468
$$ 70959 -87144 64975 -24105 -76476 34564 -195363 112990 -38978 34794 -105745 168468
17687B33467o3288K03434B0312f2131n4516F2625M2286K19943f476F0829L8584
$$ 233467 170179 373613 20312 -62131 -116647 62625 104911 324854 -6476 60829 99413
17676I9413a10383A59136a38393k3982A90632J84565o3587j4743a17218E1073
$$ 99413 -110383 159136 -138393 -162375 190632 375197 311610 296867 -117218 51073
17665a97697E7730B5093e5858A65285E3947j76h9883A49326R6592f925L313k58633
$$ -197697 57730 25093 -55858 165285 53947 53771 -89883 149326 245918 -6925 -3612 -262245
17653b62245R6167A12996a1581A13846A2214L02918e4690B3287J39223a83614
$$ -262245 -166078 112996 -11581 113846 12214 315132 -54690 23287 162510 -183614
17642B65069j00354A0881K5931b32196C00534j500b66425B32197j11893a48685
$$ 265069 164715 10881 36812 -232196 300534 299034 -266425 232197 120304 -148685
17631a04970D00691b3852B86599P3248B3877J99490a9278m052I1846m4056a9998
$$ -104970 400691 -23852 286599 359847 23877 223367 -19278 -23330 91846 47790 -19998
17619e47867K64342a20666j38082o6254P549c4430D4064c89195A43759J2674C5380
$$ -547867 -283525 -120666 -258748 -325002 -317453 -34430 44064 -389195 143759 156433 35380
17607d9710n9924E6568b50593d6162B06055n1529o6528J35065j8447q2150Q344
$$ -49710 -109634 56568 -250593 -46162 206055 154526 87998 223063 204616 122466 130810
17596A30810C2647K50012j27943O38k9849C376a23993m5774k5022A85093J77090
$$ 130810 32647 282659 154716 155354 125505 3376 -123993 -169767 -194789 185093 362183
17585C62183H2327a06544E690J51604L6211d860j42358d4482k05055A693N8611
$$ 362183 82327 -106544 5690 157294 193505 -4860 -147218 -44482 -249537 1693 60304
17574F0304b59847A13838m5653L7541b35687C02658r3616c15639B3620a12106
$$ 60304 -259847 113838 68185 105726 -235687 302658 209042 -315639 23620 -112106
17563A47823E0251l164a60004k367b5083k05078A67382a70416k3951A24705N5015
$$ 147823 50251 47087 -160004 -162371 -25083 -230161 167382 -170416 -194367 124705 179720
17552A79720a79249C6324J63672b4665C4207a62861A14163j4218d7367A05250
$$ 179720 -179249 36324 199996 -24665 34207 -162861 114163 99945 -47367 105250
17541i1339b4341A36938D9093a37384f979A73087n3686K52437a24999E114L20045
$$ -91339 -24341 136938 49093 -137384 -6979 173087 119401 371838 -124999 5114 325159
17530C25159A01514C2561c603j93686p646A84663B5397b5506A83190K7034q910
$$ 325159 101514 32561 -3603 -197289 -204935 184663 25397 -25506 183190 210224 201314
17519B01314a84628C3447L0709M55768B44144b2735c208B15087D1323K21744A13659
$$ 201314 -184628 33447 64156 519924 244144 -22735 -3208 215087 41323 263067 113659
17507g096A51633b3723k3960B51296j17505a35197A21686e3537F7836O4582K6149
$$ -7096 151633 -23723 -47683 251296 133791 -135197 121686 -53537 67836 132418 158567
17496A58567K61555C4314J14299F4531j3845R8497f4479B22299H6313J57054J33249
$$ 158567 420122 34314 148613 64531 50686 149183 -64479 222299 86313 243367 376616
17485C76616b29537g1759A44290M4604L12014k22513F4859J58593q3034A3436
$$ 376616 -229537 -71759 144290 188894 500908 278395 64859 223452 140418 13436
17474B38188b21865e1642A97149k1660g689H6249a29734A28039J75824F9866h7168
$$ 238188 -221865 -51642 197149 175489 -7689 86249 -129734 128039 303863 69866 -87168
17462B3555J41863J4976P359l8508a26993B52985G2084n297Q753J38811K53763
$$ 23555 165418 180394 187753 149245 -126993 252985 72084 66787 75540 214351 468114
17451D68114b2309B39696r7870J48518q9703K17496Q9513j01460j5489H2101l8699
$$ 468114 -22309 239696 141826 290344 200641 418137 507650 406190 390701 82101 43402
17440D3402J357J21500J17798j6334J65452D1253K30656B4414J91633e7470A63724
$$ 43402 44759 166259 284057 267723 433175 41253 271909 24414 216047 -57470 163724
17428D72998j45631J7259I8655J80152j26285K6800L5419J06691N3091O7990j48717
$$ 472998 327367 344626 98655 278807 152522 179322 214741 321432 374523 442513 293796
17417B93796K28109k54188j3875I7794l7384J39235K51196j68065C2255K44793
$$ 293796 521905 267717 253842 97794 60410 199645 450841 282776 32255 277048
17407B77048L63564A2732L7710M59907e1669G9582M22414E7933L67132A94076
$$ 277048 640612 12732 50442 510349 -51669 79582 501996 57933 425065 194076
17396A26467L46697a64912D80583k14049D8000K65832j39730K29752A68771B9067
$$ 126467 473164 -164912 480583 266534 48000 313832 174102 403854 168771 29067
17385C87378g7571H5975J76030o6219J2804L23083k36310K54218B71056G5738
$$ 387378 -77571 85975 262005 195786 208590 531673 295363 549581 271056 75738
17374A71712e1191E8220L0613P882D8247J25655J39529K19743k17531A35267B3414
$$ 171712 -51191 58220 88833 96715 48247 173902 313431 533174 315643 135267 23414
17362C10785H9521K6592a40309I7626d8408A42174J31939k0485A03182a60403
$$ 310785 89521 116113 -140309 97626 -48408 142174 274113 253628 103182 -160403
17351B08872G2863J17941B5857J45165K38110j88182E6390J63183J27838A18808
$$ 208872 72863 190804 25857 171022 409132 220950 56390 219573 347411 118808
17340A05554L6123J6914b5499A89252R0309G8275K22459j7151D4855J37103J27275
$$ 105554 141677 158591 -25499 189252 279561 78275 300734 283583 44855 181958 309233
17329C09233G5830M6375j0702c93j2439C15261R7207K9860j71119H4809e7654
$$ 309233 75830 122205 111503 -393 -12832 315261 412468 442328 271209 84809 -57654
17317I2242K9318c1688A78921p0007K54733j19757J24243q1373A32992D2579K9285
$$ 92242 121560 -31688 178921 108914 363647 243890 368133 286760 132992 42579 71864
17306G1864a53393m2002c7345p3335j55142d1508A67546O9954a55558A87664j1179
$$ 71864 -153393 -195395 -37345 -110680 -265822 -41508 167546 237500 -155558 187664 176485
17295A76485j1406l0883k2838g2204B92601j42418A301L41959J39954j43114b35135
$$ 176485 165079 134196 111358 -72204 292601 150183 1301 343260 483214 340100 -235135
17283A43691J84999D3945L4598f2435J2620A00352O8640k6266K84005G1416k2436
$$ 143691 328690 43945 78543 -62435 -49815 100352 168992 142726 426731 71416 48980
17272D8980J37686B280J05406E716K99926j28908J49580A29813J99348J06137
$$ 48980 186666 2280 107686 5716 305642 176734 326314 129813 329161 435298
17262D35298A82208J74474o5240a08314A27001e1843C71378j02424A21090j2138
$$ 435298 182208 356682 291442 -108314 127001 -51843 371378 268954 121090 108952
17252A08952O5025J59382G3781L31101r9876q8916N7967E6300a77535B06420R2200
$$ 108952 173977 333359 73781 404882 305006 216090 274057 56300 -177535 206420 298620
17241B98620a30778c0150A99609D0630M1777M03658B37812Q5333F4406N43765
$$ 298620 -130778 -30150 199609 40630 82407 486065 237812 323145 64406 608171
17231F08171j16716I2810j2667K01252l9758a56672B33337J23381j23530m2048
$$ 608171 491455 92810 80143 281395 241637 -156672 233337 356718 233188 191140
17221A91140O7594o0996B9433Q2601K94727j19656G6056a85036c2118G021M62097
$$ 191140 258734 197738 29433 112034 406761 287105 76056 -185036 -32118 7021 469118
17210D69118A39798J16376L02249B51821B5799L14713H8436N9195K0275K52353
$$ 469118 139798 256174 558423 251821 25799 340512 88436 147631 167906 420259
17200D20259f582B65949G3226L11724A7628L14924o0118J90819k02680L7905k4872
$$ 420259 -6582 265949 73226 384950 17628 332552 272434 463253 260573 298478 273606
17189B73606k9140k2611M75095r6450c9219D94162B13130G8952M29283o9933j47690
$$ 273606 244466 221855 696950 600500 -39219 494162 213130 78952 508235 438302 290612
17178B90612A40037K54847o9922Q6280B8797L16753p5440j15084a55548B74822
$$ 290612 140037 394884 324962 411242 28797 345550 270110 155026 -155548 274822
17167B3283N921K69169C5169L4751g2203A65463J36837q5574K911P6987p9581
$$ 23283 29204 298373 35169 69920 -72203 165463 302300 216726 219637 296624 217043
17156B17043K10678l2224j02166J95049h8671F22186a06716A39780N7357r5665
$$ 217043 427721 395497 293331 488380 -88671 622186 -106716 139780 197137 101472
17146A01472K06808L6885D7706M76083J09858k76746R0916A83759K32509j24174
$$ 101472 308280 345165 47706 523789 633647 356901 447817 183759 416268 292094
17136B92094L40281p2089B34790g1411D78619J07432B23034K21287A85869J2887
$$ 292094 632375 560286 234790 -71411 478619 586051 223034 444321 185869 198756
17126A98756N3758J42829J11486O5451B65917L08970k71100L37146k39051q0051
$$ 198756 252514 395343 506829 572280 265917 574887 303787 640933 401882 321831
17116C21831K67279B30526J46420l8688A17501M17722k62446k7142A6972M53173
$$ 321831 589110 230526 376946 338258 117501 535223 272777 245635 16972 470145
17106D70145J73996I4906L51020K89797C30959J50144B04622M10673k21509k8253
$$ 470145 644141 94906 445926 735723 330959 481103 204622 615295 393786 365533
17096C65533o1288K7647L42004j53204j10172q5383j55675M12250j5455M3191
$$ 365533 304245 331892 673896 520692 410520 325137 169462 581712 566257 609448
17086F09448B77198o9849M40214L903A06885L00884K92058k45928q3626K23635
$$ 609448 277198 207349 647563 651466 106885 407769 699827 453899 370273 593908
17076E93908j20042k30404P3718O1767L27968j42620l6997p9569m9981L8790P6175
$$ 593908 473866 243462 317180 378947 706915 564295 527298 447729 397748 436538 512713
17065E12713o5087L18681k66557B43009m0041M46548l7625k09756l1769L09046
$$ 512713 447626 766307 499750 243009 202968 649516 611891 402135 370366 679412
17055F79412k09523j79979R8359J22299j00947K9205l893M74394m22593n3131
$$ 679412 469889 289910 388269 510568 409621 438826 434933 909327 486734 433603
17045D33603l3866M9323N05502l23996j09791K88173l90824K05374j5798Q337
$$ 433603 399737 449060 954562 630566 520775 808948 418124 623498 607700 616037
17035F16037J82649J23207j27224j37915k61556P1105j5862j34098K46642K00041
$$ 616037 798686 921893 794669 656754 395198 466303 450441 316343 562985 763026
17025G63026l45597J91261K05601q6553J47566j17814k6442k76147M58107q6768
$$ 763026 417429 608690 814291 727738 875304 757490 731048 454901 913008 826240
17015H26240j00289J99747k48552N7297l3033l10827R7390M61590P9748m12649
$$ 826240 725951 925698 677146 734443 701410 390583 487973 949563 1029311 616662
17005F16662L27569k44063J04149J0820L67320l75999k07764K25802k50604J94865
$$ 616662 944231 700168 804317 815137 1182457 806458 598694 824496 573892 768757
16995G68757j04627J51725j09304J24627O6998K02495m24676P3132J29052K7486
$$ 768757 664130 815855 706551 831178 898176 1100671 675995 749127 878179 905665
16985I05665P2355j5276k30406J49648O2680J2638J30989n29167M36523J54707
$$ 905665 978020 962744 732338 881986 944666 957304 1088293 559126 995649 1150356
16975A150356n13898O4405L25208k77743M24507j88688m73418L41010q5905K24418
$$ 1150356 636458 700863 1026071 748328 1172835 984147 510729 851739 765834 990252
16965I90252K51192E89866K82497J25670K34566j26747l230q7214j87464J64295
$$ 990252 1241444 589866 872363 998033 1232599 1105852 1102622 1015408 827944 992239
16955I92239J37163O1941O2520j61055K26142j88533j52818L43180J21186l64595
$$ 992239 1129402 1191343 1253863 1092808 1318950 1130417 977599 1320779 1441965 1077370
16945A077370M7408J65279M20747n06593j72450o9404K45351L44001m70814L06488
$$ 1077370 1124778 1290057 1710804 1204211 1031761 962357 1207708 1551709 1080895 1387383
16935A387383J10718l99244K11568j34634K85821j76059J03887j11192R8300O8111
$$ 1387383 1498101 1098857 1310425 1175791 1461612 1285553 1389440 1278248 1376548 1444659
16925A444659O2237k59598L86468n9652K7311J639O3788j348q8039n8064J08472
$$ 1444659 1506896 1247298 1633766 1574114 1601425 1603064 1666852 1665504 1577465 1519401 1627873
16914A627873q9145J66730j79939J71516q5976L08193K9467n58627N28230P2068
$$ 1627873 1538728 1705458 1525519 1697035 1611059 1919252 1948719 1390092 1918322 1990390
16904A990390l19081J4843M08611k06741K73789l84445K6387L71782J29578k94710
$$ 1990390 1671309 1686152 2094763 1888022 2161811 1777366 1803753 2175535 2305113 2010403
16894B010403R6111j28279K41279P6308k20199L45837j24311Q7542l75990K84567
$$ 2010403 2106514 1978235 2219514 2295822 2075623 2421460 2297149 2384691 2008701 2293268
16884B293268L22136n60363N51706r8485O9303m16362L88205j79871K14651P7096
$$ 2293268 2615404 2055041 2606747 2508262 2577565 2161203 2549408 2369537 2584188 2661284
16874B661284K8668P1629N1237j33898N5219o036P9786J29408M2962j24124j34187
$$ 2661284 2689952 2761581 2812818 2678920 2734139 2728103 2807889 2937297 2980259 2856135 2721948
16863B721948K84874j64011L14272l4903m2826J72017k85676L38217j59222k12731
$$ 2721948 3006822 2842811 3157083 3122180 3079354 3251371 2965695 3303912 3144690 2931959
16853B931959K61579K71210J21555k62881K83694K70514l07087L68613J3578M4770
$$ 2931959 3193538 3464748 3586303 3323422 3607116 3877630 3570543 3939156 3952734 3997504
16843C997504k73596M84733Q643o4134M47997k50319J4521L47211l7394K626R3812
$$ 3997504 3723908 4208641 4217284 4153150 4601147 4350828 4365349 4712560 4675166 4677792 4771604
16832D771604p9451L82589m9847k19918L96040p0813L77890j23526k7557L89168
$$ 4771604 4692153 5074742 5024895 4804977 5201017 5130204 5508094 5384568 5357011 5746179
16822E746179K42472J21567j54321L00286q569J36747J53693r547L04644O5419
$$ 5746179 5988651 6110218 5955897 6256183 6247614 6384361 6538054 6528507 6833151 6898570
16812F898570J25705K11140K6202J71167L86579n7267L63937K46865L265K81697
$$ 6898570 7024275 7235415 7261617 7432784 7819363 7762096 8126033 8372898 8376163 8657860
16802H657860n8699M59239n7075N46989J68208j89550M11829M26354J61936K98513
$$ 8657860 8599161 9058400 9001325 9548314 9716522 9526972 9938801 10365155 10527091 10825604
16792A0825604L10448K69384J60996L01552M21343L90598O07646J02636J19634
$$ 10825604 11136052 11405436 11566432 11867984 12289327 12679925 13287571 13390207 13509841
16783A3509841N81326M69964M22965O42331M33198P22184O3435P35785N94579
$$ 13509841 14091167 14561131 14984096 15626427 16059625 16781809 16845244 17581029 18175608
16774A8175608O26761L40354R22156O92330O28618Q05531N58361J068113P15509
$$ 18175608 18802369 19142723 20064879 20757209 21385827 22191358 22749719 23817832 24533341
16765B4533341J028718R14986J026640J100224J317592R67950J382065J572223
$$ 24533341 25562059 26477045 27503685 28603909 29921501 30889451 32271516 33843739
16757C3843739J095375J747570J551189J595025J979363K097183J822662K201054
$$ 33843739 34939114 36686684 38237873 39832898 41812261 43909444 45732106 47933160
16749D7933160K667448K545586K435690L251790K999075L266518L664470L764686
$$ 47933160 50600608 53146194 55581884 58833674 61832749 65099267 68763737 72528423
16741G2528423L961219M341537M753441M908301M923098N426957N998380N934436
$$ 72528423 76489642 80831179 85584620 90492921 95416019 100842976 106841356 112775792
16733A12775792O263150O495726O659097O892961O872801O834389O657386O673301
$$ 112775792 119038942 125534668 132193765 139086726 145959527 152793916 159451302 166124603
16725A66124603N704185N602944M602093M070147K693568K130099N32392j48361
$$ 166124603 171828788 177431732 182033825 186103972 188797540 190927639 191460031 191311670
16717A91311670j428856k735114l596386m821346n006028o065877o438438o733330
$$ 191311670 189882814 187147700 183551314 178729968 173723940 167658063 161219625 154486295
16709A54486295o623528p012351p127903o930565o186272o444220o710499n662654
$$ 154486295 147862767 140850416 133722513 126791948 120605676 114161456 107450957 101788303
16701A01788303n391977n444480m838968m960225m263098m233877l696996l724545
$$ 101788303 96396326 90951846 86112878 81152653 76889555 72655678 68958682 65234137
16693F5234137l468305l054910k972896k880677k384873k604727j910649k535102
$$ 65234137 61765832 58710922 55738026 52857349 50472476 47867749 45957100 43421998
16685D3421998j868346k060942k086366j301622j831707j005643j542370j240630
$$ 43421998 41553652 39492710 37406344 36104722 34273015 33267372 31725002 30484372
16677C0484372j434105j300221r21810j134105q23369q97386q97183q60351p38844
$$ 30484372 29050267 27750046 26828236 25694131 24870762 23973376 23076193 22215842 21476998
16668B1476998q22047q62005o07189r40549l95021p25361n1565o84161p10963
$$ 21476998 20654951 19792946 19185757 18245208 17850187 17124826 17073261 16389100 15678137
16659A5678137l94483o01121o23744j12834m66535p18138j29241n85197j17724
$$ 15678137 15283654 14682533 14058789 13945955 13479420 12761282 12632041 12046844 11929120
16650A1929120k48374m03823m70810m59070L7222k13659n06856j48653j17307
$$ 11929120 11680746 11276923 10806113 10347043 10384265 10170606 9663750 9515097 9397790
16641I397790k34620n87699J11172o2106l58640p8758k45748j14180r6415m50428
$$ 9397790 9163170 8575471 8686643 8624537 8265897 8187139 7941391 7827211 7730796 7280368
16631G280368j00592N9741o60157L39772k17361l02675k73442K47481o6064l97808
$$ 7280368 7179776 7239517 6579360 6919132 6701771 6399096 6125654 6373135 6307071 5909263
16621E909263P8854l01044j22247j68008l09919J36359j81612J19794n05289M79773
$$ 5909263 5988117 5687073 5564826 5396818 5086899 5223258 5041646 5161440 4656151 5135924
16611E135924n54079J31620Q3233k40173k90114K77093k69113N1245l47225J62105
$$ 5135924 4581845 4713465 4796698 4556525 4266411 4543504 4274391 4325636 3978411 4140516
16601D140516j32526j37025m01364M29935j98305L91778m53609k05352Q5266m8193
$$ 4140516 4007990 3870965 3469601 3899536 3701231 4093009 3639400 3434048 3519314 3471121
16591C471121l62627L70168k97372K08190l56945p7621j23197L52917l4589k17952
$$ 3471121 3108494 3478662 3181290 3389480 3032535 2954914 2831717 3184634 3150045 2932093
16581B932093j25149J21531k59523N6174m2722J8838k24769M1263J95192j53976
$$ 2932093 2806944 2928475 2668952 2725126 2682404 2701242 2476473 2517736 2712928 2558952
16571B558952k0772k33195K22231l98401J38777k10636P3949J03997p8251O0457
$$ 2558952 2538180 2304985 2527216 2128815 2267592 2056956 2130905 2234902 2156651 2217108
16561B217108j00318J04379k92346J91260j70124L1104J47753n6705j27204J77268
$$ 2217108 2116790 2221169 1928823 2120083 1949959 1981063 2128816 2072111 1944907 2122175
16551B122175l98276J53215K4026j22869J0845J19357m87135M14897k18341J76395
$$ 2122175 1723899 1877114 1901140 1778271 1789116 1908473 1421338 1836235 1617894 1794289
16541A794289n0521j136J91965k7949k37953J74283m4838m15810K97551j30679
$$ 1794289 1743768 1742632 1934597 1906648 1668695 1842978 1798140 1382330 1679881 1549202
16531A549202j68721L02331l460M4710l76098M37706K4569n17477L39682l65367
$$ 1549202 1380481 1682812 1679352 1724062 1347964 1785670 1810239 1292762 1632444 1267077
16521A267077j82988J30388J06055r3489j5891q7828M93737l52163N1520m7445
$$ 1267077 1084089 1214477 1320532 1227043 1211152 1123324 1617061 1264898 1316418 1268973
16511A268973m8937J76399m07179J61455l85722K22541j82129J84719K56844j47173
$$ 1268973 1220036 1396435 989256 1150711 764989 987530 805401 990120 1246964 1099791
16501A099791j63074k80716O37123m41345L31138r2017L49716m62148K30559j23816
$$ 1099791 936717 656001 1293124 851779 1182917 1090900 1440616 978468 1209027 1085211
16491A085211J90938m46678L05927r6739l98352K64015J11180n4120k33357q5778
$$ 1085211 1276149 829471 1135398 1038659 640307 904322 1015502 961382 728025 642247
16481F42247K23785L2370L38035m52595J567k42331K87724L3977J72840k93926
$$ 642247 866032 898402 1236437 783842 785409 543078 830802 864779 1037619 743693
16471G43693L58005j94467m31116L23806R2991J29086J4808j48075C73015N21335
$$ 743693 1101698 907231 476115 799921 892912 1021998 1036806 888731 373015 894350
16461H94350l35806J04846J21902k63112J54893K53926m549l59532K2266N550
$$ 894350 558544 663390 785292 522180 677073 930999 926450 566918 589184 594734
16451E94734K98777m02714L20810O8405k35683l4627n470J14240l54752K90714
$$ 594734 893511 490797 811607 880012 644329 609702 604232 718472 363720 654434
16441F54434l3798M28153k20338k90345J06393m1980L28637m42513K91706k89453
$$ 654434 620636 1048789 828451 538106 644499 602519 931156 488643 780349 490896
16431D90896J72110r0941j84312L54217Q5124k25935j2278k34500K01728Q4641
$$ 490896 663006 572065 387753 741970 827094 601159 588881 354381 556109 640750
16421F40750J07067l21095j10638M28098k55764j48693K12517j5792r3616A90004
$$ 640750 747817 426722 316084 744182 488418 339725 552242 536450 442834 190004
16410F23701j87508J08999l3986n9691L6K88256k43870A31128L23946j19253J97594
$$ 623701 436193 545192 511206 451515 451551 739807 495937 131128 455074 335821 533415
16399E33415j81047K98744B02548K32648R7765k02797K47422A61597o4734K50955
$$ 533415 352368 651112 202548 435196 532961 330164 577586 161597 96863 347818
16389C47818A25880M73956n8276J02382j81872L1074B14272K38073k21487K08342
$$ 347818 125880 599836 541560 643942 462070 493144 214272 452345 230858 439200
16379D39200j42978J11945J43863j86593k431n4097R3258J65684j58441k3805
$$ 439200 296222 408167 552030 365437 363006 308909 402167 567851 409410 385605
16369C85605J7719j81324M3223O0613L7936j3068J08580J04499G3028h6798D75125
$$ 385605 403324 222000 265223 325836 363772 350704 459284 563783 73028 -86798 475125
16357C14374B7600M27943H8982K54173L0487J24839A56112J83821K04166j52137
$$ 314374 27600 455543 88982 343155 373642 498481 156112 339933 544099 391962
16347C91962j71755o9696M12964k31638j22044H1136J56950N0003P9563Q2907
$$ 391962 220207 150511 563475 331837 209793 81136 238086 288089 367652 450559
16337D50559B08736m0419K86231j02475L9275l3479F0428K75700k1000j09392
$$ 450559 208736 168317 454548 352073 391348 357869 60428 336128 315128 205736
16327B05736J06821n470J01470M692k03667Q7638j29444B2347L10977F6733L26032
$$ 205736 312557 307087 408557 413249 209582 297220 167776 22347 333324 66733 392765
16316C92765J5687J7111j45365m6313K6329m4049I1744J26747A6085M2525c4869
$$ 392765 408452 425563 280198 233885 260214 216165 91744 218491 16085 58610 -34869
16304B65901J01258L14256B39919L2205p0678J75087J83692j41972r3551g8319
$$ 265901 367159 681415 239919 272124 201446 376533 560225 418253 324702 -78319
16293E81971A13884a27171B59646k3536I9324L48037j12538l7436r2378J22758
$$ 581971 113884 -127171 259646 236110 99324 447361 334823 297387 205009 327767
16283C27767b5388A67051J46070G4180J15674J74884A63872J34660p6360n3170
$$ 327767 -25388 167051 313121 74180 189854 364738 163872 298532 222172 169002
16273A69002F3080J16653J61650l6728q2741F8103J77072K55194B4503L12164
$$ 169002 63080 179733 341383 304655 221914 68103 245175 500369 24503 336667
16263C36667F3239q068a72910A63380C6872d1729A02339N3848h1269j1271C15939
$$ 336667 63239 55171 -172910 163380 36872 -41729 102339 156187 -81269 -92540 315939
16251A70048N6590O509b9010B51500k135L23286I5662Q7144P6700M4571q3154
$$ 170048 226638 233147 -29010 251500 249365 572651 95662 182806 259506 304077 220923
16240B20923j04842n6611J32904e7376A26468j8199K69658L9765e6397B17488
$$ 220923 116081 59470 192374 -57376 126468 108269 377927 417692 -56397 217488
16229I1523a22578n7618B92227K131H7770K727h7064D41931j91158h5742H8110
$$ 91523 -122578 -180196 292227 294358 87770 90497 -87064 441931 250773 -85742 88110
16217A30544h1040a6512n1687C64977H7880K51455c2056n312A45452F5608a5567
$$ 130544 -81040 -16512 -68199 364977 87880 339335 -32056 -37368 145452 65608 -15567
16205B10517H6865R9687l1911O0168E7601J88053b4748K209q0720A10761e9426
$$ 210517 86865 186552 154641 214809 57601 245654 -24748 -22539 -103259 110761 -59426
16193A05712b0720A72670D5044G595a91463A84909o4704n6528L0294b80708I0714
$$ 105712 -20720 172670 45044 7595 -191463 184909 120205 63677 93971 -280708 90714
16181d8734B81248j29464f0303B3999g787D2593P4764I537K32294J8728H362g5048
$$ -48734 281248 151784 -60303 23999 -7787 42593 117357 9537 241831 260559 8362 -75048
16168B89942H4908K42152C2708K13650m6603l6944g6A20139K79460j09073c2091
$$ 289942 84908 327060 32708 246358 199755 162811 -76 120139 399599 290526 -32091
16156A84987M0322p266a09028j104A56476o2228g0272e616j71723h2362A35557
$$ 184987 225309 218043 -109028 -110132 156476 94248 -70272 -5616 -177339 -82362 135557
16144B25224b58110J8282N9946f684G0531a11077k28626F030b68398D1897a45014
$$ 225224 -258110 -239828 -179882 -6684 70531 -111077 -339703 6030 -268398 41897 -145014
16132b33857C4961Q1062J59326A07235J59865I1789g2943A10481c25445E0043
$$ -233857 34961 116023 275349 107235 267100 91789 -72943 110481 -325445 50043
16121B18166A03957M4310G44d626A22160a61364A94402q9427j020J42109f0554
$$ 218166 103957 148267 744 -4626 122160 -161364 194402 104975 103955 246064 -60554
16109B2459J97958b01223O6194A29361n4694L28614p3709i5548B79356k1218N9521
$$ 22459 220417 -201223 -135029 129361 74667 403281 329572 -95548 279356 258138 317659
16098C17659a66079A13208N9447a68847B83105j37221B0426J06862C8849a97300
$$ 317659 -166079 113208 172655 -168847 283105 145884 20426 127288 38849 -197300
16087I0017m1984J72732H5236a01379E1790a72583f167F9849a00991A58999c6070
$$ 90017 48033 220765 85236 -101379 51790 -172583 -6167 69849 -100991 158999 -36070
16075G208a41975C58834c7192A5125a39728A96124F0157f1712j72015J01408J026
$$ 7208 -141975 358834 -37192 15125 -139728 196124 60157 -61712 -233727 -132319 -131293
16064a31293j6776A45464C2516b54815d7996k08343A8370a63585A32095a11091
$$ -131293 -148069 145464 32516 -254815 -47996 -256339 18370 -163585 132095 -111091
16053A5351b1761j12225O4220B50531a13347A78313h9817k74534F9654K19163
$$ 15351 -21761 -133986 -69766 250531 -113347 178313 -89817 -364351 69654 288817
16043B88817m8733o8724a50339n6827R5095j13579h1396a8064A04261K87485A27065
$$ 288817 240084 171360 -150339 -207166 -112071 -225650 -81396 -18064 104261 391746 127065
16031A5695J40964o4696d4472p11q4648p3365A9336a87136A62753l3338a0413
$$ 15695 156659 91963 -44472 -45183 -129831 -203196 19336 -187136 162753 129415 -10413
16019b04934a9079A70300B164b01289r5616A19499a31188j13657C22013b26456
$$ -204934 -19079 170300 2164 -201289 -296905 119499 -131188 -244845 322013 -226456
16008d49550e4653A61120a05317I327b24028J2543A41934R0334c9704j44706H4312
$$ -449550 -54653 161120 -105317 9327 -224028 -211485 141934 232268 -39704 -184410 84312
15996B21462a36586A2687a41129q392j72316e0322k69562A11520O6871l9335e4275
$$ 221462 -136586 12687 -141129 -149521 -321837 -50322 -319884 111520 178391 139056 -54275
15984D18435A7345J62324E3045L34621G7350L26808H4967B963J8321J88346b73324
$$ 418435 17345 179669 53045 387666 77350 404158 84967 2963 21284 209630 -273324
15972b506k46192Q7928H7078J48304G7469J21194N9893h1382B72028a66788C3391
$$ -2506 -248698 -160770 87078 235382 77469 198663 258556 -81382 272028 -166788 33391
15960c20789A70808o1738J70659j29578j2946B6227L1177P0576E0675c19528A00441
$$ -320789 170808 109070 279729 150151 137205 26227 57404 127980 50675 -319528 100441
15948G1532J05535l2979C2254b84102M9617h2365q3091d9774C3054f7411j94979
$$ 71532 177067 144088 32254 -284102 -234485 -82365 -165456 -49774 33054 -67411 -262390
15937b62390A47395p3359a39445j90319k133A65110c25072J54597k68009a50396
$$ -262390 147395 74036 -139445 -329764 -331897 165110 -325072 -170475 -438484 -150396
15926b39012a08933M9456o6638B07554a11478G576a34936l7558r0056J29475k74173
$$ -239012 -108933 -59477 -126115 207554 -111478 7576 -134936 -172494 -262550 -133075 -407248
15915d07248b5936a0343A97591g2151o745Q625K4879B58872H3318O7750g493k61928
$$ -407248 -25936 -10343 197591 -72151 -78896 -70271 -45392 258872 83318 151068 -7493 -269421
15903b69421N3049e7057G3613c15069G8220b14985j02858C3515a85541o7994j42495
$$ -269421 -216372 -57057 73613 -315069 78220 -214985 -317843 33515 -185541 -253535 -396030
15892c96030J57774e0709k7869k50197A5911a44791A24076c31567d6652k62974
$$ -396030 -238256 -50709 -78578 -328775 15911 -144791 124076 -331567 -46652 -309626
15882c09626a05263F913b11326n9032I6122a41688d6846j2O077k7606I4121C1741
$$ -309626 -105263 6913 -211326 -270358 96122 -141688 -46846 -46858 -40781 -68387 94121 31741
15869D9197e4746a6572A5152J89230c91196d504A0518R1351i5505p2899G836J52902
$$ 49197 -54746 -16572 15152 204382 -391196 -4504 10518 101869 -95505 -168404 7836 160738
15857A60738q744M9563e6761k9228k77332a09263q9115A04235l8619G474M08047
$$ 160738 151994 201557 -56761 -85989 -363321 -109263 -198378 104235 65616 7474 415521
15846D15521A28469m4000C8616a55775c5301o9927M2887A42147A7945L5828J10418
$$ 415521 128469 84469 38616 -155775 -35301 -105228 -62341 142147 17945 53773 164191
15835A64191G603a4384j11650d299l0544m7590j93542O8327d678A64601K54611
$$ 164191 7603 -14384 -126034 -4299 -34843 -82433 -275975 -207648 -4678 164601 419212
15824D19212a70712C29899a34184N5082E4893a8856H095a91190f5290J2587A00368
$$ 419212 -170712 329899 -134184 -79102 54893 -18856 8095 -191190 -65290 -52703 100368
15812B20267B6024J76746e01292d5301o3456Q788M3453k32016E6171J2160J06774
$$ 220267 26024 202770 -501292 -45301 -108757 -99969 -56516 -288532 56171 68331 175105
15801A75105E2113J8250b55916D17392c45234e5619B59488L4753E9844J91568
$$ 175105 52113 70363 -255916 417392 -345234 -55619 259488 294241 59844 251412
15791B51412a2775B02926a21822G4975A73c06315J21847A35188a76110b8609k10427
$$ 251412 -12775 202926 -121822 74975 173 -306315 -184468 135188 -176110 -28609 -239036
15780b39036B18516o0920c6113j02726N7149K8819A66885n2262b34D2621O3372
$$ -239036 218516 157596 -36113 -138839 -81690 -52871 166885 114623 -234 42621 105993
15769A05993c78868a50700A19290b66101B6438Q489K83133q6671C1651O2691a06060
$$ 105993 -378868 -150700 119290 -266101 26438 34927 318060 231389 31651 94342 -106060
15757D1023J96648p9808m1501c5213k36121d0223C26549f8213A35519p086b30304
$$ 41023 237671 157863 116362 -35213 -271334 -40223 326549 -68213 135519 128433 -230304
15745F1687b0136C49779r8028a61105n9533e5845o9996l501b5208j08706c3011
$$ 61687 -20136 349779 251751 -161105 -220638 -55845 -125841 -129342 -25208 -133914 -33011
15733a76762A448a42025j26129d7563j10598k8152B9086a06946j4202a8828l38061
$$ -176762 1448 -142025 -268154 -47563 -158161 -186313 29086 -106946 -121148 -18828 -356889
15722c56889H011b53487a15260d309C23314a04724j47232g1187k89236A15334
$$ -356889 8011 -253487 -115260 -4309 323314 -104724 -251956 -71187 -360423 115334
15711a61201j93954a64924A75612M0098a22918e8021q7527K1194j03541P9680
$$ -161201 -355155 -164924 175612 215710 -122918 -58021 -145548 -124354 -227895 -148215
15701a48215J9858B97979c958j28632A67032o6570b35300B06966a08111A24484
$$ -148215 -128357 297979 -3958 -132590 167032 100462 -235300 206966 -108111 124484
15690A61679J34832b17399n2717C231K89775h4297O675B12562b1843k37685g0038
$$ 161679 296511 -217399 -270116 3231 293006 -84297 -77622 212562 -21843 -259528 -70038
15678A75110a05258A0416J12208b5662k89087B5192J8283Q0157J3546a06834A10925
$$ 175110 -105258 10416 122624 -25662 -314749 25192 43475 123632 137178 -106834 110925
15666a80786n3624g52k42884d7550k01006a07983e1870A0631c96631A35799A4116
$$ -180786 -234410 -752 -243636 -47550 -248556 -107983 -51870 10631 -396631 135799 14116
15654a89368a12l171l97366a92356l8610G8254d3703a6032f173A38557d3095E51180
$$ -189368 -112 -3283 -400649 -192356 -230966 78254 -43703 -16032 -6173 138557 -43095 551180
15641d8785l26480d9725H9959i5803C21150b84278j00840a66960B06784h453r4156
$$ -48785 -375265 -49725 89959 -95803 321150 -284278 -385118 -166960 206784 -8453 -102609
15630a02609c859D4365b99491A86112a65384I1591a09244k0644C22222j07167
$$ -102609 -3859 44365 -299491 186112 -165384 91591 -109244 -129888 322222 215055
15620B15055J3266c05863A32178b78672B60584G4899A8709a01425b794C94153
$$ 215055 228321 -305863 132178 -278672 260584 74899 18709 -101425 -2794 394153
15609a47452B26722I2477O9237C9565b20436B07074d4910K991r4703O1053E06282
$$ -147452 226722 92477 161714 39565 -220436 207074 -44910 -41919 -136622 -75569 506282
15597a10206a1677k97835A76638b54864A73711a07499F616O105a27622j07228
$$ -110206 -11677 -309512 176638 -254864 173711 -107499 6616 12721 -127622 -234850
15587b34850c9880k24815H534K48234c2854j47395N5151n5189e3240k92148A04042
$$ -234850 -39880 -264695 8534 256768 -32854 -180249 -125098 -180287 -53240 -345388 104042
15575a11384c2488I9276b9956A53995M9028a1026j8874J2875I7579a62261k43769
$$ -111384 -32488 99276 -29956 153995 203023 -11026 -29900 -17025 97579 -162261 -406030
15564d06030J82107A105J92154i7653A69629g8234B09147a60922K4582j16624
$$ -406030 -223923 1105 193259 -97653 169629 -78234 209147 -160922 -136340 -252964
15554b52964B01926e0883n3298E493J60100a2405A64011R7788h4096j70478a08786
$$ -252964 201926 -50883 -104181 5493 165593 -12405 164011 261799 -84096 -254574 -108786
15542A38101c04363R3868A54367J75684C969a3245F0664a20254A28963N7752b52802
$$ 138101 -304363 -210495 154367 330051 3969 -13245 60664 -120254 128963 186715 -252802
15530A24355C6034K37546r6970A3518a0905j82840G0132c74195A47910b784l0987
$$ 124355 36034 273580 176610 13518 -10905 -193745 70132 -374195 147910 -2784 -33771
15519c3771A67349c15595J42230f4435A26530J17798B0094J81291e8180A9878
$$ -33771 167349 -315595 -173365 -64435 126530 244328 20094 201385 -58180 19878
15508C32597A38089b95131Q6616n8585D7723d1464k06599R6932L7269j90770A2316
$$ 332597 138089 -295131 -208515 -267100 47723 -41464 -248063 -151131 -113862 -304632 12316
15496A15647l3561a5651B76678d3365a0501m1484H5318h969C6939A7774a5069
$$ 115647 82086 -15651 276678 -43365 -10501 -51985 85318 -8969 36939 17774 -15069
15484d7179j36560A32137c43808H5368r746e2125A37896c6857j54059h0465L4459
$$ -47179 -183739 132137 -343808 85368 75622 -52125 137896 -36857 -190916 -80465 -46006
15473d6006m938B22738a08048M011j66689A44943R4423b52219B41914H7309l1840
$$ -46006 -50944 222738 -108048 -104037 -270726 144943 239366 -252219 241914 87309 55469
15462E5469a80489C41638A57959C6779a64595A10798k2433f5239B58325e959j45039
$$ 55469 -180489 341638 157959 36779 -164595 110798 88365 -65239 258325 -5959 -150998
15451a50998B2104J27523d2611o5828e0433R535A15815P5787a61843n9772c3687
$$ -150998 22104 149627 -42611 -108439 -50433 -40898 115815 191602 -161843 -221615 -33687
15439B9683R5304n7788N3545k9086c9385C8667d1087B0203a30942k63557f3401
$$ 29683 124987 67199 120744 91658 -39385 38667 -41087 20203 -130942 -394499 -63401
15427I5800i3566C02195g6921A51349b47000A64187N0935l737o4798E847J64851
$$ 95800 -93566 302195 -76921 151349 -247000 164187 215122 211385 146587 5847 170698
15416A70698a21527F0587b79113B07450C2116M8838O0889l4835J01441b14997
$$ 170698 -121527 60587 -279113 207450 32116 80954 141843 107008 208449 -214997
15405B66112i3662A10679b80892H3949k0962a34135A46397c82815D5312a90813
$$ 266112 -93662 110679 -280892 83949 62987 -134135 146397 -382815 45312 -190813
15394C15158d1402A21062B6775a35685c5230A51236a00232a8320A08225J31439
$$ 315158 -41402 121062 26775 -135685 -35230 151236 -100232 -18320 108225 239664
15384B39664D8909M5070a97A02594b30580A52345b06596B4423a75150H7027R662
$$ 239664 48909 93979 -197 102594 -230580 152345 -206596 24423 -175150 87027 96689
15373I6689i994q2019B2222J42424l2882E6155E35a30370j08916h8116M0661A06338
$$ 96689 -9994 -92013 22222 164646 131764 56155 535 -130370 -239286 -88116 -47455 106338
15360C90354B4762c12127n6889I4906e3571a241n1758k65204R8749p8083J42276
$$ 390354 24762 -312127 -369016 94906 -53571 -1241 -52999 -318203 -219454 -297537 -155261
15349a55261c5151j38027N0809A59610a49091j19822B15229l2300a45006G5624
$$ -155261 -35151 -173178 -122369 159610 -149091 -268913 215229 182929 -145006 75624
15338b19801A76128p0179C2230a26623A54225N8191m7285d3886k9793a5883k2482
$$ -219801 176128 105949 32230 -126623 154225 212416 165131 -43886 -73679 -15883 -38365
15327c8365C05889J11417e5303n7023j13884B71596j06106b20675G1322a9415
$$ -38365 305889 417306 -55303 -112326 -226210 271596 165490 -220675 71322 -19415
15316a28227p1380A14643a25426n8017B09319d4228p9334A15200J77515d4345
$$ -128227 -199607 114643 -125426 -183443 209319 -44228 -123562 115200 292715 -44345
15305A34739d31908H9995B2239a79327J9158B70138K76120a70346q5943C63158
$$ 134739 -431908 89995 22239 -179327 -160169 270138 546258 -170346 -256289 363158
15294g6084j60294A90556p2895c7481A01678N1996p1042J76226E4136g4405K3019
$$ -76084 -236378 190556 117661 -37481 101678 153674 82632 258858 54136 -74405 -51386
15283e1386C31821E9847J88030D5870L30677j8549j17748a35991B26372I6924
$$ -51386 331821 59847 247877 45870 376547 357998 240250 -135991 226372 96924
15272A2881J11529J79938H438N8474J9757J23921a50550B3931a11829C069R3137
$$ 12881 124410 304348 8438 66912 86669 210590 -150550 23931 -111829 3069 96206
15261I6206R9605a63976J3527a6757A28853J13289a00705D2J17150J18240a5050
$$ 96206 195811 -163976 -150449 -16757 128853 242142 -100705 42 117192 235432 -15050
15249A44237M72675j07999K32148J301547q29574N73295j9853E31753A34881m1360
$$ 144237 616912 508913 741061 2042608 1213034 1786329 1766476 531753 134881 93521
15239I3521b27882B72087b30283D18080D2641a36554A01180a82536A83008M3255
$$ 93521 -227882 272087 -230283 418080 42641 -136554 101180 -182536 183008 226263
15229B26263D0365f4470r2387H4208b85838C2620M4972d8833C3939K52473a3482
$$ 226263 40365 -64470 -156857 84208 -285838 32620 77592 -48833 33939 286412 -13482
15217e7552b4263B19629P20F8961k6486c50776e3141p3266H0179b24361C67110
$$ -57552 -24263 219629 220349 68961 42475 -350776 -53141 -126407 80179 -224361 367110
15205A68753C4187J44225c7560B09671K26618a02156B62825J8350c24444D9225
$$ 168753 34187 178412 -37560 209671 436289 -102156 262825 281175 -324444 49225
15194a73114O7222B04773Q946g856G1732d10275A69920O613h7401B1192K80439
$$ -173114 -105892 204773 213719 -7856 71732 -410275 169920 176533 -87401 21192 301631
15183C01631o3147b46987E1273Q2978Q1544h3983L6843A52365O944B2311d5260
$$ 301631 238484 -246987 51273 134251 215795 -83983 -47140 152365 159309 22311 -45260
15171E0387J05940J8263g570A27870c4017A23080b36418N5591b927B63121H9062
$$ 50387 156327 174590 -7570 127870 -34017 123080 -236418 -180827 -2927 263121 89062
15159A46552k3359Q5063a4509B43312j18453e5820A62038b6292A45422h3021C72056
$$ 146552 123193 208256 -14509 243312 124859 -55820 162038 -26292 145422 -83021 372056
15147I8654f0412D32783K5792E4681M36417a36784d5331D5013a38477B62229A06753
$$ 98654 -60412 432783 458575 54681 491098 -136784 -45331 45013 -138477 262229 106753
15135B26645C2908J03462J23979A08199K59563B9904L03179a2302n9226I3763
$$ 226645 32908 136370 260349 108199 367762 29904 333083 -12302 -71528 93763
15124A04368Q1893q9487J52650O8262J1170A58731A9121g4427c4488J2892A24211
$$ 104368 186261 96774 249424 317686 328856 158731 19121 -74427 -34488 -21596 124211
15112A91902a02348C33996A11852K43985G9055J02987c7438B33757J68116J27843
$$ 191902 -102348 333996 111852 355837 79055 182042 -37438 233757 401873 529716
15102E29716d3095j60467A38590C1523g9027B73629b82611E2084P7991b9550C1884
$$ 529716 -43095 -203562 138590 31523 -79027 273629 -282611 52084 130075 -29550 31884
15090A56152L9200C4406J35852l5424J22939h651B95845A20628h3160B55309A4330
$$ 156152 195352 34406 170258 134834 257773 -8651 295845 120628 -83160 255309 14330
15078A62654C5882J71832A01805j4302j844L24568c5274B91365I0149K55327h5082
$$ 162654 35882 207714 101805 87503 85659 410227 -35274 291365 90149 345476 -85082
15066A95677l3468n1040D3285a26705C78309e1316C8876a76103c824A72557B6039
$$ 195677 162209 111169 43285 -126705 378309 -51316 38876 -176103 -3824 172557 26039
15054B54280j7808h6714D85675F8909M9184J18054L6987D5937K72459A2300L16720
$$ 254280 236472 -86714 485675 68909 118093 236147 273134 45937 318396 12300 329020
15043C29020A33193J57727H0976C0342J5357P3221J14911A6319a8314g317B82626
$$ 329020 133193 290920 80976 30342 45699 118920 233831 16319 -18314 -7317 282626
15031B1802L76973j81841H0813M74756j51088C2470J80065B9742N8895L13713
$$ 21802 398775 216934 80813 555569 404481 32470 212535 29742 88637 402350
15021D02350j97824c8471A59655E9950K83063A29853K82558A96377i3761A9710
$$ 402350 204526 -38471 159655 59950 343013 129853 412411 196377 -93761 19710
15010A96633m3132E6542j1658a00620D23527k1217I120a5293B48845N8849n460
$$ 196633 153501 56542 44884 -100620 423527 402310 9120 -15293 248845 307694 302234
14999C02234N6102D3847L31832J43140J95406A79228L15811f1987A02699K13877
$$ 302234 358336 43847 375679 518819 714225 179228 495039 -61987 102699 316576
14989C16576K3894N1494Q8345F5521J68007L1428q5143R5701P0841J35858A37444
$$ 316576 340470 391964 480309 65521 233528 264956 179813 275514 346355 482213 137444
14977C25795O7887J31868B48814j04795B78L2301L94702L0583J49115j84403H1636
$$ 325795 393682 525550 248814 144019 278 32579 427281 457864 606979 422576 81636
14965E74872k75285J46243l6864j33213J68623K25597k52505A96186H5315M54059
$$ 574872 299587 445830 408966 275753 444376 669973 417468 196186 85315 539374
14955E39374B41675J86316A962K84472a17611D54353j89290J30933g2204A55539
$$ 539374 241675 427991 1962 286434 -117611 454353 265063 395996 -72204 155539
14944D95077k09943o5655I4122L18238B2865J72735F3749J94985C7557R9395J15730
$$ 495077 285134 219479 94122 412360 22865 195600 63749 258734 37557 136952 252682
14933B52682A6717K35963o2351q6552j9016M3897J99795J30913B19428E9030L32512
$$ 252682 16717 252680 190329 103777 84761 128658 328453 459366 219428 59030 391542
14922C91542j24324e2183E4879J79306D4768K48219j32082Q6470k4347H2021N06773
$$ 391542 267218 -52183 54879 234185 44768 292987 160905 247375 223028 82021 588794
14911E88794B51113j13537J74754L82021C15679K7895j48333J06139r9315K11389
$$ 588794 251113 137576 312330 694351 315679 343574 195241 301380 202065 413454
14901D13454j31992K6360Q3144K13365B51251j00725L31681A85606J18010l5899
$$ 413454 281462 307822 390966 604331 251251 150526 482207 185606 303616 267717
14891B67717L2859K74239B79880j33720K54075K11595B34391J43769n3403n3895
$$ 267717 300576 574815 279880 146160 400235 611830 234391 378160 324757 270862
14881B70862K67871B15405K41349K06515C24913q7036J81990k3657M1471j32256
$$ 270862 538733 215405 456754 663269 324913 237877 419867 396210 437681 305425
14871C05425K34147O1685E7249J13133K17054P2093A70573J84176A30838J20346
$$ 305425 539572 601257 57249 170382 387436 459529 170573 354749 130838 251184
14861B51184K37393k17088K83808j14947J34023j71704N1974L08052j27281d8339
$$ 251184 488577 271489 555297 440350 574373 402669 454643 762695 635414 -48339
14850C22215J255A56816O9295K59704r0663J28800M1410r850j98163L53377A47878
$$ 322215 323470 156816 226111 485815 395152 523952 565362 555512 357349 710726 147878
14838A86324K05145M7851R2883k3851q0652J54941k6004J51857k06386R7127L5107
$$ 186324 391469 439320 532203 508352 427700 582641 556637 708494 502108 599235 634342
14827F34342k8140k51694P2809K1421J88844j06962k9919q5323P0221j41787o3534
$$ 634342 606202 354508 427317 448738 637582 530620 500701 415378 485599 343812 280278
14816B80278J87177J19299k0700l4254A52345L15392o2116L21232B20862K84896
$$ 280278 467455 586754 566054 531800 152345 467737 405621 726853 220862 505758
14806E05758J50076n4493l2280K8933J17996B87487J48105A91554J60697K09872
$$ 505758 655834 601341 569061 597994 715990 287487 435592 191554 352251 562123
14796E62123j61968J9978K95821A55350M61308j60999M83494j83731j44340o9836
$$ 562123 400155 420133 715954 155350 616658 455659 939153 755422 611082 541246
14786E41246B34603J76076N5208M1222J8483B14047L85443Q2854J67872k68117
$$ 541246 234603 410679 465887 507109 525592 214047 599490 682344 850216 582099
14776E82099L11603l11316B88902L78557J34118C80589L08243k23844O9907K89195
$$ 582099 893702 582386 288902 667459 801577 380589 688832 464988 534895 824090
14766H24090l70480L38713l11905K47900m5625J22015p8409o9966j16281o5107
$$ 824090 453610 792323 480418 728318 682693 804708 726299 656333 540052 474945
14756D74945J15336L60429D46844J20420N703J0225K49474n2516L3463l97061
$$ 474945 590281 950710 446844 567264 572967 583192 832666 780150 813613 416552
14746D16552L88982K3128j29840R8680k72921M49593q6906l96975M8447L78053
$$ 416552 805534 828662 698822 797502 524581 974174 887268 490293 538740 916793
14736I16793l93492M64657o0505j74821J85244l3914J00984l43284K50834k32890
$$ 916793 523301 987958 927453 752632 937876 903962 1004946 661662 912496 679606
14726F79606m290n1616j14270M15968j30520J54707j2360l89171M83205j25264
$$ 679606 675316 623700 509430 925398 794878 949585 937225 548054 1031259 905995
14716I05995j56516N3333J73082k72997K27348q7981j20114K68265J057Q3740
$$ 905995 749479 802812 975894 702897 930245 842264 722150 990415 991472 1075212
14706A075212m63000K61629J73482r5669J28321j66091J60892J6772j21201l3875
$$ 1075212 612212 873841 1047323 951654 1079975 913884 1074776 1091548 970347 936472
14696I36472j97043L52052k16488K35355j46290j4815M71878m33044j11096K88733
$$ 936472 739429 1091481 874993 1110348 964058 949243 1421121 988077 876981 1165714
14686A165714j22197j70129k68340M94210n1098k474k32963J34887K44724j57129
$$ 1165714 1043517 873388 605048 1099258 1048160 1045686 812723 947610 1192334 1035205
14676A035205J45878k99654J53430N9693j74847K20794L6333n27261M39328N0274
$$ 1035205 1181083 881429 1034859 1094552 919705 1140499 1176832 649571 1088899 1139173
14666A139173j98439K43885k55539M43908q900k81778J43794j54212J09417k43328
$$ 1139173 940734 1184619 929080 1372988 1364088 1082310 1226104 1071892 1181309 937981
14656I37981K59446k43112J56557P2794K49178l46664K30951k9128k32457K12276
$$ 937981 1197427 954315 1110872 1183666 1432844 1086180 1317131 1288003 1055546 1267822
14646A267822p7687k75952N68381m00932K95955j05751j34170R36382H29955P15169
$$ 1267822 1190135 914183 1482564 1081632 1377587 1271836 1137666 2074048 829955 1545124
14636A545124K1771j65673M6146l17873O05391l16572k7683q8610L03469k33410
$$ 1545124 1566895 1401222 1447368 1129495 1734886 1418314 1390631 1302021 1605490 1372080
14626A372080O5097J71277l68774K36007K92936l65523J40497L324k5446k314
$$ 1372080 1437177 1608454 1239680 1475687 1768623 1403100 1543597 1546921 1521475 1519161
14616A519161o3043J91258j11461j42869K82285j31706k4104J82238P9884m9967
$$ 1519161 1456118 1647376 1535915 1393046 1675331 1543625 1519521 1701759 1781643 1731676
14606A731676o5343r2497K05498l5710K16744k33603J54350K5979n2388J16310
$$ 1731676 1666333 1573836 1779334 1743624 1960368 1726765 1881115 1907094 1854706 1971016
14596A971016k11933l5225R2054j69703L54405j25230j11027l09001L13613Q0033
$$ 1971016 1759083 1723858 1815912 1646209 2000614 1875384 1764357 1455356 1768969 1849002
14586A849002K76760o3139k53758K28366k18760M8800N44903j72048j94701K49226
$$ 1849002 2125762 2062623 1808865 2037231 1818471 1867271 2412174 2240126 2045425 2294651
14576B294651k3063j98929J04905l4246L74728k21966L11265n14627M01925j79782
$$ 2294651 2271588 2072659 2177564 2143318 2518046 2296080 2607345 2092718 2494643 2314861
14566B314861J66933k17158N40020l39928J51587L53661l7476M0811K7602J42440
$$ 2314861 2481794 2264636 2804656 2464728 2616315 2969976 2932500 2973311 3000913 3143353
14556C143353P5497O23147l02107L54182K53315N13844J399192J798921M348850
$$ 3143353 3218850 3841997 3539890 3894072 4147387 4661231 6060423 7859344 12208194
14547A2208194Q359668J8457089J4306364B3428173A0545687l636941l422048
$$ 12208194 20567862 39024951 53331315 23428173 10545687 6908746 3486698
14540C486698r97888l81450j30811n108R6397J5288m9961o6675K91494J34839
$$ 3486698 2488810 2107360 1976549 1971441 2067838 2083126 2033165 1966490 2257984 2392823
14530B392823j36657M910L12574j27232p7007O1100k8306J0940J38813Q2262O5120
$$ 2392823 2256166 2261076 2573650 2446418 2369411 2430511 2402205 2413145 2551958 2634220 2699340
14519B699340j95523K10733Q2066J48270j6281P1831j30338r3646J98608m8816
$$ 2699340 2503817 2714550 2796616 2944886 2928605 3000436 2870098 2776452 2975060 2926244
14509B926244n9330p1786K45181m21575O28861N04267o28042J65360Q88j08974
$$ 2926244 2866914 2795128 3040309 2618734 3247595 3751862 3123820 3289180 3290068 3181094
14499C181094L35967m2796m7663J64219M03878n30082k49813q7629N64055l452
$$ 3181094 3517061 3474265 3426602 3590821 3994699 3464617 3214804 3127175 3691230 3687778
14489C687778K10054j58226K00621l2863Q2335p1278J39062k14054L14776K63543
$$ 3687778 3897832 3739606 3940227 3907364 3989699 3918421 4057483 3843429 4158205 4421748
14479D421748l72341J34377J74142q1373l6749K76953k64203J04608K02560l7268
$$ 4421748 4049407 4183784 4357926 4276553 4239804 4516757 4252554 4357162 4559722 4522454
14469D522454J28820J15963O4433k0722k01551L00170M50020l06186J10074j94086
$$ 4522454 4651274 4767237 4831670 4810948 4609397 4909567 5359587 5053401 5163475 4969389
14459D969389O63942k74718Q6177J8682P1491M0612m5559K96745j370J65997j56956
$$ 4969389 5633331 5358613 5444790 5463472 5534963 5575575 5530016 5826761 5825391 5991388 5834432
14448E834432K71050j82777J65431K16504L2714K38503k05524l8818M49445q909
$$ 5834432 6105482 5922705 6088136 6304640 6337354 6575857 6370333 6331515 6780960 6772051
14438F772051j50059K69028K97860M4594J65738j12806n6508j06560N51416j73894
$$ 6772051 6621992 6891020 7188880 7233474 7399212 7286406 7229898 7123338 7674754 7500860
14428G500860Q2552J92535K59976m3656J71877K0571O6922P1420K31815L25138
$$ 7500860 7583412 7775947 8035923 7992267 8164144 8184715 8251637 8323057 8554872 8880010
14418H880010j28762L06822J00572J46363k26671N32475J02367j36908J09891
$$ 8880010 8751248 9058070 9158642 9305005 9078334 9610809 9713176 9576268 9686159
14409I686159L57525N4047J71882P4609L57200r8827K92057L38897j0226J92074
$$ 9686159 10043684 10097731 10269613 10344222 10701422 10602595 10894652 11233549 11223323 11415397
14399A1415397N2280K83770L16671K19984L43860j24346L62883L57705K38922
$$ 11415397 11467677 11751447 12068118 12288102 12631962 12507616 12870499 13228204 13467126
14390A3467126J5440M84358J83290P0707P7154P06360n1462P9657M24219N04029
$$ 13467126 13482566 13966924 14150214 14220921 14298075 15004435 14952973 15032630 15456849 15960878
14380A5960878m9716L50647P34342R4024K97480R7766P85758K98625K63099K40644
$$ 15960878 15911162 16261809 16996151 17090175 17387655 17485421 18271179 18569804 18832903 19073547
14370A9073547J92309N68950L04275L73765O47695M35486N6334P96345O48444
$$ 19073547 19265856 19834806 20139081 20512846 21160541 21596027 21652361 22448706 23097150
14361B3097150L90609M79999N86968K97576P26032M62825P05006O61728M84856
$$ 23097150 23487759 23967758 24554726 24852302 25578334 26041159 26746165 27407893 27892749
14352B7892749O89317J272716J93741Q68256N70441P36896J009081J043481N30777
$$ 27892749 28582066 29854782 30048523 30916779 31487220 32224116 33233197 34276678 34807455
14343C4807455P48332J085944J110436J045215J342168P00987R61771J391563
$$ 34807455 35555787 36641731 37752167 38797382 40139550 40840537 41802308 43193871
14335D3193871J177384J512416J236235J999210J156123J293117J729558J501146
$$ 43193871 44371255 45883671 47119906 49119116 50275239 51568356 53297914 54799060
14327E4799060J732525J865404K258121J802828K369959J898888K200739K801987
$$ 54799060 56531585 58396989 60655110 62457938 64827897 66726785 68927524 71729511
14319G1729511K255258K617946K970980K887854L174354L103489L511341M124226
$$ 71729511 73984769 76602715 79573695 82461549 85635903 88739392 92250733 96374959
14311I6374959L681060M312590M134681M133242N091746N105507N564372N463314
$$ 96374959 100056019 104368609 108503290 112636532 117728278 122833785 128398157 133861471
14303A33861471N990770O945354O819006O754459Q053858Q032992Q475026R168123
$$ 133861471 139852241 146797595 153616601 160371060 168424918 176457910 184932936 194101059
14295A94101059R638809R861892J0878783J1098017J1782600J2139994J3059165
$$ 194101059 203739868 213601760 224480543 235578560 247361160 259501154 272560319
14288B72560319J3259860J3857958J4044199J4616223J5131756J4526832J5044433
$$ 272560319 285820179 299678137 313722336 328338559 343470315 357997147 373041580
14281C73041580J5041506J4536809J3769510J3138068J1669168J0412687Q374016
$$ 373041580 388083086 402619895 416389405 429527473 441196641 451609328 459983344
14274D59983344N836667K165137m79639j064708n25211k905588l447767m384399
$$ 459983344 465820011 467985148 467505509 466440801 465915590 463010002 459562235 455177836
14266D55177836o668404j0033342j1365622j2901389j3798313j4718719j5002693
$$ 455177836 448509432 438476090 427110468 414209079 400410766 385692047 370689354
14259C70689354j5413645j4789830j5091873j4603269j4417832j3774896j2323333
$$ 370689354 355275709 340485879 325394006 310790737 296372905 282598009 270274676
14252B70274676j2796008j2306405j1272027j1198568j0781115r834155r689838
$$ 270274676 257478668 245172263 233900236 222701668 211920553 202086398 192396560
14245A92396560q970158q002155q039687p491294p396493o496648o694329n719347
$$ 192396560 183426402 175424247 167384560 159893266 152496773 146000125 139305796 133586449
14237A33586449n491571n329272n402737m669488m331801m495112l771913l998644
$$ 133586449 128094878 122765606 117362869 112693381 108361580 103866468 100094555 96095911
14229I6095911l625463l479191l115465l434181k628180l307238k586986k458725
$$ 96095911 92470448 88991257 85875792 82441611 79813431 76506193 73919207 71460482
14221G1460482k784793j873981k549088j986662k412989j496407j878677j824546
$$ 71460482 68675689 66801708 64252620 62265958 59852969 58356562 56477885 54653339
14213E4653339j338548j440033j802957j503914j853022j011575o52246j089843
$$ 54653339 53314791 51874758 50071801 48567887 46714865 45703290 45051044 43961201
14205D3961201j621975j264376j404853o70935j097005p17880j013192j054131
$$ 43961201 42339226 41074850 39669997 38999062 37902057 37184177 36170985 35116854
14197C5116854j229492p65478m61533j045414n09466j029067r45235j41487p59806
$$ 35116854 33887362 33121884 32660351 31614937 31105471 30076404 29131169 28989682 28229876
14188B8229876m48885r75497q66794l74499o12439o2519q63859o16458m55713
$$ 28229876 27780991 26805494 25938700 25564201 24951762 24889243 24025384 23408926 22953213
14179B2953213l57967k35665m85897p69740n20615m50266K32433p48148n59013
$$ 22953213 22595246 22359581 21873684 21103944 20583329 20133063 20365496 19617348 19058335
14170A9058335r5351n45125l80485l6998m40819l98403j0978q21087k21727l44829
$$ 19058335 18962984 18417859 18037374 18000376 17559557 17161154 17150176 16329089 16107362 15762533
14160A5762533p4757l86531J25756l84407m23568J06490n44035k21887q8554l32048
$$ 15762533 15687776 15301245 15427001 15042594 14619026 14725516 14181481 13959594 13871040 13538992
14150A3538992j38580o13414j2644r344l98740P605n96375N5444k72943O8621
$$ 13538992 13400412 12786998 12774354 12765010 12366270 12373875 11777500 11832944 11560001 11628622
14140A1628622p19079N53539m04213j82574r8979r9274k55639m5813L518n57256
$$ 11628622 10909543 11463082 11058869 10876295 10777316 10678042 10422403 10376590 10380108 9822852
14130I822852j47614q9079J81324m08230k06459P2514n8845j93679j67602M8649
$$ 9822852 9675238 9586159 9767483 9359253 9152794 9225308 9166463 8972784 8805182 8853831
14120H853831r2480n42086K81922m89283J40865j82790k35006J74123Q314n47261
$$ 8853831 8761351 8219265 8501187 8011904 8152769 7969979 7734973 7909096 7917410 7370149
14110G370149M02409k96966l03769M06232j90756m23206R8588j09585j49660j5874
$$ 7370149 7772558 7475592 7171823 7578055 7387299 6964093 7062681 6953096 6803436 6787562
14100F787562q1905k67661n315k26741R6553J55327m17636J89015k34970L8463
$$ 6787562 6705657 6437996 6432681 6205940 6302493 6457820 6040184 6229199 5994229 6032692
14090F032692j53710L46176n91241N07299m33712M7303j00029l38586K03203m9667
$$ 6032692 5878982 6225158 5633917 6141216 5707504 5754807 5654778 5316192 5519395 5469728
14080E469728m0409o2585j20964j10855N1829J05451j40195j74240j78589K33524
$$ 5469728 5429319 5366734 5245770 5134915 5186744 5292195 5152000 4977760 4799171 5032695
14070E032695j26416k22687l838J61845j40661j70401K47349l55947K37724J75487
$$ 5032695 4906279 4683592 4679754 4841599 4700938 4530537 4777886 4421939 4659663 4835150
14060D835150j41023k43740q4891j05503l50077N52473n97287J56921K04192j71509
$$ 4835150 4694127 4450387 4365496 4259993 3909916 4462389 3865102 4022023 4226215 4054706
14050D054706J68834n25421J81450k67689M51978j22306j36802l6168n8261l08004
$$ 4054706 4223540 3698119 3879569 3611880 4063858 3941552 3804750 3768582 3710321 3402317
14040C402317K68960J85849k19391l22317O1408J45869l6310n6660J3464M3338
$$ 3402317 3671277 3857126 3637735 3315418 3376826 3522695 3486385 3429725 3443189 3486527
14030C486527J95557l57769o9984J8896n68l36527L14199K08785l37034J66458
$$ 3486527 3682084 3324315 3254331 3273227 3272659 2936132 3250331 3459116 3122082 3288540
14020C288540m18667J23759l44590L18244j97872K37261j09091j10546Q1552l41110
$$ 3288540 2869873 2993632 2649042 2967286 2769414 3006675 2897584 2787038 2868590 2527480
14010B527480N17644l12727k97832l3156q1908J08111J61689l54454L2588J21383
$$ 2527480 3045124 2732397 2434565 2401409 2319501 2427612 2589301 2234847 2267435 2388818
14000B388818l90238J07894J01826Q8401j4862j02588q9462k24711M25719k39724
$$ 2388818 1998580 2106474 2208300 2296701 2281839 2179251 2089789 1865078 2290797 2051073
13990B051073M83203J352223K528796O646995J6761622K4350921k3576129A4535159
$$ 2051073 2534276 3886499 6415295 13062290 29823912 54174833 30598704 14535159
13981H663062k556768o85999j474310j33922l50505K85455p29634J43003n26710
$$ 8663062 6106294 5420295 3945985 3812063 3461558 3747013 3017379 3160382 2633672
13972B633672J82172J42521n17115K89828P1479j57595k75255K82543n9986l14622
$$ 2633672 2815844 2958365 2441250 2731078 2802557 2644962 2369707 2652250 2592264 2277642
13962B277642L68023l92363J6297K18475o9657j22985j1165j16208o8384L63251
$$ 2277642 2645665 2253302 2269599 2488074 2418417 2295432 2284267 2168059 2099675 2462926
13952B462926l1196l47620J34034P5609l43439J92021J01448n7693k18604k71200
$$ 2462926 2431730 2084110 2218144 2293753 1950314 2142335 2243783 2186090 1967486 1696286
13942A696286L73023j08040j74151J99694J55289o90989K80969R1520l2318k27360
$$ 1696286 2069309 1961269 1787118 1986812 2142101 1451112 1732081 1823601 1791283 1563923
13932A563923K88867J7686K00326m33017Q5790j31044K77977l78918J71424j08110
$$ 1563923 1852790 1870476 2070802 1637785 1723575 1592531 1870508 1491590 1663014 1554904
13922A554904K84626m30080N63835j12153j30820l3430K6847j73365J98633K6571
$$ 1554904 1839530 1409450 1973285 1861132 1730312 1696882 1723729 1550364 1748997 1775568
13912A775568j47223J72878P3427k50299R2196N6652j36658l8555J26859j85867
$$ 1775568 1628345 1801223 1874650 1624351 1716547 1773199 1636541 1597986 1724845 1538978
13902A538978n3788K72736l13116Q8953j19114L93061n88991K77268j10686J06732
$$ 1538978 1485190 1757926 1444810 1533763 1414649 1807710 1218719 1495987 1385301 1492033
13892A492033j02049j29958O4303N26223p20430L42608j61443K39611R9932l54198
$$ 1492033 1389984 1260026 1324329 1850552 1130122 1472730 1311287 1550898 1650830 1296632
13882A296632J20078O1615n5641J16349m78535M64323k21193j1393O4817k5907
$$ 1296632 1416710 1478325 1422684 1539033 1060498 1524821 1303628 1292235 1357052 1331145
13872A331145J84831n30240M49114j74705J0236j86711M82898k85761j1128k05978
$$ 1331145 1515976 985736 1434850 1260145 1270381 1083670 1566568 1280807 1269679 1063701
13862A063701J86768k04792K53917m0044K08292k48160k0342M4913K8468m73518
$$ 1063701 1250469 1045677 1299594 1259550 1467842 1219682 1199340 1244253 1272721 799203
13852G99203N34746j82905K08901l06044n3201N6168p579J11192k0175N4723L15617
$$ 799203 1333949 1151044 1359945 1053901 1000700 1056868 1049289 1160481 1140306 1195029 1510646
13841A510646n53893O6997K25555j33517E34710L17562K87794l56993J68699P7627
$$ 1510646 956753 1023750 1249305 1115788 534710 852272 1140066 783073 951772 1029399
13831A029399j62309j00736J09678K21688l5745J89621K12138G26752M21315K1734
$$ 1029399 867090 766354 876032 1097720 1061975 1251596 1463734 726752 1148067 1169801
13821A169801k12096R6813P1228l16766J40232q6459K15737l55821J58279K07591
$$ 1169801 957705 1054518 1125746 808980 949212 862753 1078490 722669 880948 1088539
13811A088539j32460j51892j69683N00549r8108l9037K9019j94147R7691R8626
$$ 1088539 956079 804187 634504 1135053 1036945 997908 1026927 832780 930471 1029097
13801A029097l79569O58614j14041m06616L05321q0790l50354j88983L10638M8646
$$ 1029097 649528 1308142 1194101 787485 1092806 1012016 661662 472679 783317 831963
13791H31963K10609m07902K83142K16254j59663K13940n46884K70498o3334K48652
$$ 831963 1042572 634670 917812 1134066 974403 1188343 641459 911957 848623 1097275
13781A097275k2327j35252k98575M06528m46265j41015P13345m24502j1477K29671
$$ 1097275 1074948 939696 641121 1047649 601384 460369 1173714 749212 737735 967406
13771I67406q5444k85462L08153k42507K40732k95719K49192J73j49409B68626
$$ 967406 881962 596500 904653 662146 902878 607159 856351 856524 707115 268626
13760A012025k95200J21927j52413L7450N0321j74518J47608p1816J18620l29723
$$ 1012025 716825 838752 686339 723789 774110 599592 747200 675384 794004 464281
13750D64281L98234l3531o7935j82049r8024K80658m145N497l7677q6625M74750
$$ 464281 862515 828984 761049 579000 480976 761634 757489 762986 725309 638684 1113434
13739A113434m57406J73603j92337r8782J34564M14080n7648l73264k02080J28241
$$ 1113434 656028 829631 637294 538512 673076 1087156 1029508 656244 454164 582405
13729E82405O9692K61195r5813j11084j16657j70502J52478L4706O4291C29067
$$ 582405 652097 913292 817479 706395 589738 419236 571714 606420 670711 329067
13718B00994L74474l7965K57080l60822L72193l79646N9195L34695l5594k57006
$$ 200994 575468 537503 794583 433761 805954 426308 485503 820198 784604 527598
13708E27598K12195N7982k62738J83681j2259n5757A15671N01233L2495l11393
$$ 527598 739793 797775 535037 718718 706459 650702 115671 616904 649399 338006
13698C38006K08181K77504k59706o0342L3136J85370j75635k34880L55162L6579
$$ 338006 546187 823691 563985 503643 536779 722149 546514 311634 666796 703375
13688G03375J10977l61790J02361B48943Q4751K95536n3421J28222q4579A46227
$$ 703375 814352 452562 554923 248943 333694 629230 575809 704031 619452 146227
13677G93097A91705J97803M53330l08501J21740J5679q4974O7384q2819N1972
$$ 793097 191705 389508 842838 534337 656077 671756 586782 654166 571347 623319
13667F23319R2762C11621J82970J7181K82918B76999K59463m5023j10090J43469
$$ 623319 716081 311621 494591 511772 794690 276999 536462 491439 381349 524818
13657E24818j93549J34354L50379m07850k8918A33049K59087A34870K16787M30844
$$ 524818 331269 465623 816002 408152 379234 133049 392136 134870 351657 782501
13647G82501C66529B2805O00701B77199J97423J06480j4693B78081O9049J45047
$$ 782501 366529 22805 623506 277199 474622 581102 566409 278081 347130 492177
13637D92177p271P2620J04694j21491r877M3968B16408K11351J17852k5071o5847
$$ 492177 484906 557526 662220 540729 530852 574820 216408 427759 545611 520540 454693
13626D54693j55736k5331K19063o2066K28198j54400o106B03701K41206N4578
$$ 454693 298957 273626 492689 430623 658821 504421 498315 203701 444907 499485
13616D99485J28476j57184N853j69628J53177J36311r5568j39363J88837B21528
$$ 499485 627961 470777 476630 307002 460179 596490 500922 361559 550396 221528
13605E73501B51364L5424J89185j54193J06052j13147N4172K87563j46140i6977
$$ 573501 251364 286788 475973 321780 427832 314685 368857 656420 510280 -96977
13594C23809J01559m3498j54898M215L05814A94380K76712l8581A24598J95790
$$ 323809 425368 381870 226972 231187 537001 194380 471092 432511 124598 320388
13584C20388L30370k50495N7903j44844K6716J38559B29769q534K69210j55855
$$ 320388 650758 400263 458166 313322 340038 478597 229769 221235 490445 334590
13574C34590m6739J51087k02611q6327N64246k01153k1742J05911B87338K4516
$$ 334590 287851 438938 236327 150000 714246 513093 491351 597262 287338 311854
13564C11854F3629L43850J89394B29710j7581L80789k8447k11752M1131j68906
$$ 311854 63629 407479 596873 229710 212129 592918 564471 352719 393850 224944
13554B24944C5873j6506N838L67005A68960K42066k1439K15625j03031m367B22653
$$ 224944 35873 19367 25205 392210 168960 411026 389587 605212 502181 497814 222653
13542C03773P7351A87205K76356q1616q0399L33830k58238Q7501A74302Q5388
$$ 303773 381124 187205 463561 381945 301546 635376 377138 464639 174302 259690
13532B59690J53213A01696L7928L18696O7151k28377J51553p9843j50491k1343
$$ 259690 412903 101696 139624 458320 525471 297094 448647 368804 218313 196970
13522A96970N7624r1177J59652Q4581l8172j689P0559j2634D0988O17883l18442
$$ 196970 254594 163417 323069 407650 369478 367789 438348 425714 40988 658871 340429
13511C40429o7241A06425L96086q9428J41401p9222k04239K83008m7206j02388
$$ 340429 273188 106425 502511 413083 554484 475262 271023 554031 506825 404437
13501D04437A80798O1816N2189K03504h0634C95825j69488J91113j33121j4093
$$ 404437 180798 242614 294803 498307 -80634 395825 226337 417450 284329 270236
13491B70236m9482K8788J83725J36238B20230J64426a57814C63359a03476B55362
$$ 270236 220754 249542 433267 569505 220230 384656 -157814 363359 -103476 255362
13480A71051J23663q5837R5015D4374M61356k19428J08789A24862J19803J79377
$$ 171051 294714 208877 303892 44374 505730 286302 395091 124862 244665 424042
13470D24042f9233K3916B64155j9190m6649I4360G300M27822F8424L82345j91574
$$ 424042 -69233 -45317 264155 244965 198316 94360 7300 435122 68424 450769 259195
13459B59195d4724B27654c5578A08105L32994J883H6449L63496A87329b4089E22458
$$ 259195 -44724 227654 -35578 108105 441099 442982 86449 449945 187329 -24089 522458
13447C73807q941q5902j36449P7236r2527J35480L09695k42472J17136k22333
$$ 373807 364866 278964 142515 219751 127224 262704 572399 329927 447063 224730
13437B24730J13019P7326p3848A32808J86296F3068L27644c4032j25021C1232
$$ 224730 337749 415075 341227 132808 319104 63068 390712 -34032 -159053 31232
13426B49851j942k7436J24984A06587K30766l4730j32298H3948i3466F46575B50318
$$ 249851 247909 220473 345457 106587 337353 302623 170325 83948 -93466 646575 250318
13414B11667Q8997j37260M6650J33889j06563K40859k03434j10374J86847j68608
$$ 211667 300664 163404 210054 343943 237380 478239 274805 164431 351278 182670
13404A82670L364J26204H5984K96555b31676C75839j34596j02238M3200m6754
$$ 182670 186034 312238 85984 382539 -231676 375839 241243 139005 182205 135451
13394A35451a75593C25254K44641A58545l0896m254J21746o5072A1349K85030
$$ 135451 -175593 325254 569895 158545 127649 123395 245141 180069 11349 296379
13384B96379K1262M44701B56994l3257b0394F2583K84610F3857J12478B2321a19717
$$ 296379 317641 762342 256994 223737 -20394 62583 347193 63857 176335 22321 -119717
13372D40033H9941L31957d5969B76656J51805l182j66415r4874J27607Q695a9787
$$ 440033 89941 421898 -45969 276656 428461 425279 258864 163990 291597 300292 -19787
13360A33296J16380L07186F5358L09078j9900J4195j59481k7392L09712A01769
$$ 133296 249676 556862 65358 374436 354536 368731 209250 181858 491570 101769
13349A52669O9687J6614M3650K013J45365m1971O7096j13041J65829J7068a07995
$$ 152669 222356 238970 282620 284633 429998 388027 455123 342082 507911 524979 -107995
13337D35560j35560K2214j55080L16734A42118L29012A61153K8589C9060L40459
$$ 435560 300000 322214 167134 483868 142118 471130 161153 189742 39060 379519
13327C79519A22181J42893K13360A03731M73505k55563O139j36464m3282K9264
$$ 379519 122181 265074 478434 103731 577236 321673 327812 191348 148066 177330
13317A77330K7555A00093A9624a83343a8010A71469J2492N1751E1071L43596N539
$$ 177330 204885 100093 19624 -183343 -18010 171469 183961 235712 51071 394667 400206
13306D00206A31490A3893L38085f1002k3625A91036r059G7320J51030J96930j16014
$$ 400206 131490 13893 351978 -61002 -84627 191036 181977 77320 228350 425280 309266
13295C09266j34039K6890I4883J21017J57807A48014a50530G6673p06K28937b9870
$$ 309266 175227 202117 94883 215900 373707 148014 -150530 76673 75967 304904 -29870
13283B95757I1188K21647L61843l28814n8419j33488F5868J59437H1805N8780
$$ 295757 91188 312835 674678 345864 287445 153957 65868 225305 81805 140585
13273A40585L21439k08740J57208J0767j65900G0221J08273o3387O8156i340A99114
$$ 140585 462024 253284 410492 421259 255359 70221 178494 115107 183263 -9340 199114
13261C868J66985m5903L4684J60730k0938c7179D57374a18755B20256Q0286A10539
$$ 3868 170853 124950 159634 320364 299426 -37179 457374 -118755 220256 300542 110539
13249a05701c3567j94595B07078d7856A81758a76159B51371N225D6607L8522a01392
$$ -105701 -33567 -228162 207078 -47856 181758 -176159 251371 256596 46607 85129 -101392
13237A37694J6917K84767A79243D7439K37626a94689H0551L9124Q2262J82507
$$ 137694 154611 439378 179243 47439 285065 -194689 80551 119675 201937 384444
13227C84444D7661c4158B77552L27254A68728P468K28181j28464J05115j0380
$$ 384444 47661 -34158 277552 604806 168728 176196 404377 275913 381028 370648
13217C70648o6182G049J65519c57206B1041L6351P0695l2711J7296h5529C04980
$$ 370648 304466 7049 172568 -357206 21041 57392 128087 95376 112672 -85529 304980
13205b30635B56830E6060K17835d6850B79777M1214A23398R860C2870K08723K6480
$$ -230635 256830 56060 273895 -46850 279777 320991 123398 133258 32870 241593 268073
13194B68073J35749j68403R2542Q0719B01154o4780j4038L4349e9661D5039a52867
$$ 268073 403822 235419 327961 408680 201154 136374 122336 156685 -59661 45039 -152867
13182B39605g7038a8288B21102q1056m4161R0625K16896A64680J42653j10541
$$ 239605 -77038 -18288 221102 140046 95885 186510 403406 164680 307333 196792
13172A96792f3902B47219q1384k625E2189J27544l9793F7876M5060F935b8981
$$ 196792 -63902 247219 165835 163210 52189 179733 139940 67876 112936 6935 -28981
13160a22579c9141H3072R7242o2092J56446J58511a0041C35837F2255J73313a0703
$$ -122579 -39141 83072 180314 118222 274668 433179 -10041 335837 62255 235568 -10703
13148a50872B46116A4181a11748B8524J68477H2965A1090a07741h071j23285A12062
$$ -150872 246116 14181 -111748 28524 197001 82965 11090 -107741 -8071 -131356 112062
13136d8870R589H0372a84852g361A68151k3431J30739j223J21884B3909J86846
$$ -48870 -39281 80372 -184852 -7361 168151 144720 275459 274236 396120 23909 210755
13125B10755a2083C03064C6774b36798C01846A15683b7680B6951M7969d0806C24714
$$ 210755 -12083 303064 36774 -236798 301846 115683 -27680 26951 74920 -40806 324714
13113c6805m8476B67149C6854K05768H6297L02274c57272J39881e2737A89842
$$ -36805 -85281 267149 36854 242622 86297 388571 -357272 -217391 -52737 189842
13102B68969c2074A3303a48130E8097b90115B58065a08420B41899R0452i9476
$$ 268969 -32074 13303 -148130 58097 -290115 258065 -108420 241899 332351 -99476
13091A52556d20580F8609J61191G1866a8456j80934D81204f3135j97027B13051
$$ 152556 -420580 68609 229800 71866 -18456 -199390 481204 -63135 -260162 213051
13080g5986B99603d8799L910D3519i1889D1699M3538a21423A03325l4180J32213
$$ -75986 299603 -48799 -44889 43519 -91889 41699 85237 -121423 103325 69145 201358
13069B01358J2243M7692J46034j76943k8282m2179J32961K54171d5663D41983
$$ 201358 213601 261293 407327 230384 202102 159923 292884 547055 -45663 441983
13058A32178J07450N5081h0853C25596Q6207A3116J21668a4959E84032k59923
$$ 132178 239628 294709 -80853 325596 411803 13116 134784 -14959 584032 324109
13048C24109j51554D2809J97037h960j02644C8850R4643b0299D31121C0872L4416
$$ 324109 172555 42809 239846 -8960 -111604 38850 133493 -20299 431121 30872 65288
13037F5288L71844g623B09120K90336b5121C63790A46946R1985D8787P870H919
$$ 65288 437132 -7623 209120 499456 -25121 363790 146946 238931 48787 56657 8919
13025A77370l2899a59196E5280J1032J02203O5754l3258C191J40403J74095k5571
$$ 177370 144471 -159196 55280 66312 168515 234269 201011 3191 143594 317689 292118
13014B92118j09984J61345J74768a6966A90116N5672g286I4617J12071p4310P7650
$$ 292118 182134 343479 518247 -16966 190116 245788 -7286 94617 206688 132378 210028
13003B10028e0445F2218K82007j1678q2226D9170A2952L18652j35940A4949a6715
$$ 210028 -50445 62218 344225 332547 250321 49170 12952 331604 195664 14949 -16715
12991H9306K7188m2684a28330B73908A11656d8533B59931o9449L3860B0940K60914
$$ 89306 116494 73810 -128330 273908 111656 -48533 259931 190482 224342 20940 281854
12980B81854C2442a29730B66283A23610k6520i5762A45186g8502B35248C9249
$$ 281854 32442 -129730 266283 123610 97090 -95762 145186 -78502 235248 39249
12969A65314a04627q3199A6452J32543L54061d2236C27462j7126c7734H561L01499
$$ 165314 -104627 -187826 16452 148995 503056 -42236 327462 310336 -37734 8561 310060
12958C10060I0508b3126B54267A26087K00251d2037G9366f0154A75199J46850
$$ 310060 90508 -23126 254267 126087 326338 -42037 79366 -60154 175199 322049
12948C22049K64973B37591b85790a37296k00845B31313a53354P1220H6504K0038
$$ 322049 587022 237591 -285790 -137296 -338141 231313 -153354 -82134 86504 106542
12938A06542E457J72032j4978C8149O2592c73169e7342k41799a6997k38681C48880
$$ 106542 5457 177489 162511 38149 100741 -373169 -57342 -299141 -16997 -255678 348880
12926B23806i1148l0848c8433C10994A02200a28090A61971a69694B56237a23387
$$ 223806 -91148 -121996 -38433 310994 102200 -128090 161971 -169694 256237 -123387
12915i2894D97538E2685b42705h775k66070A0704J00030r357A9705K22168a85431
$$ -92894 497538 52685 -242705 -8775 -274845 10704 110734 101377 19705 241873 -185431
12903B91901a94511B6857O7264e3064A20322n0138Q0477a49392B62962d8402B17020
$$ 291901 -194511 26857 94121 -53064 120322 70184 150661 -149392 262962 -48402 217020
12891c0242I5527i8911A83930J25287e1155H9888R963a12657N2487k82086A31200
$$ -30242 95527 -98911 183930 309217 -51155 89888 99851 -112657 -60170 -342256 131200
12879H6492a93729g3743H5081A2007d5295F1126a97609B31772J2322I2855b02946
$$ 86492 -193729 -73743 85081 12007 -45295 61126 -197609 231772 244094 92855 -202946
12867C6549e5031B57192a08450C20363f8540n9936J9797A07575J6338K86322i9146
$$ 36549 -55031 257192 -108450 320363 -68540 -128476 -108679 107575 123913 410235 -99146
12855b18569K8263B22588C0070Q4210J43818a06784J8322A68930G3255J16273
$$ -218569 -190306 222588 30070 114280 258098 -106784 -88462 168930 73255 189528
12845A89528b27972A87676A9154K21651H7097A9508M12176E4671J49718a63535
$$ 189528 -227972 187676 19154 240805 87097 19508 431684 54671 204389 -163535
12834a37642A19037j3178m9296c02678C36032A32747O2717q119F7686c8023B16668
$$ -137642 119037 105859 56563 -302678 336032 132747 195464 187345 67686 -38023 216668
12822A61629a61968m5710A67358K16170f1610A22673J73646j45181D3271J46770
$$ 161629 -161968 -207678 167358 383528 -61610 122673 296319 151138 43271 190041
12812A90041a31703h037A43053M1894E6157a76193g3163a5741C3776R8378J87465
$$ 190041 -131703 -8037 143053 184947 56157 -176193 -73163 -15741 33776 132154 319619
12801C19619b02905e8270C98765A75219a8429C8368a12747L1104B99012F5852
$$ 319619 -202905 -58270 398765 175219 -18429 38368 -112747 -81643 299012 65852
12790D26106c99248a29840C30716L3829D1072J60259a42707b6967j28608j52469
$$ 426106 -399248 -129840 330716 364545 41072 201331 -142707 -26967 -155575 -308044
12780c08044B28811j9338c5068j88100A16475J3707a467k01408B13480D1311A653
$$ -308044 228811 209473 -35068 -223168 116475 130182 -1467 -202875 213480 41311 1653
12768H8238a04864A19906J89797h0528P059p2692n0021A51882J4357k3113c96732
$$ 88238 -104864 119906 309703 -80528 -73469 -146161 -196182 151882 166239 143126 -396732
12756D9802Q6804J90185f77D8178a31010L492A20689j1560c12364a3541F394b13493
$$ 49802 136606 326791 -677 48178 -131010 -127518 120689 109129 -312364 -13541 6394 -213493
12743D3081J25972d5386N817N49j1368M710B50972D6830L9544J34517J7070H2251
$$ 43081 169053 -45386 -39569 -39020 -50388 -45678 250972 46830 86374 220891 237961 82251
12730D30643A76949a34664D32215C2369K33715F4905Q3664b41257A36416a13472
$$ 430643 176949 -134664 432215 32369 266084 64905 148569 -241257 136416 -113472
12719G6966K1272m1185h9200B6820N0389c3039d357j03290A63477L68907B04086
$$ 76966 98238 57053 -89200 26820 77209 -33039 -4357 -107647 163477 532384 204086
12707B2168J31574k7061i3745B68558J70980A80745J5438F4713K33117o2558H9510
$$ 22168 153742 126681 -93745 268558 439538 180745 196183 64713 297830 235272 89510
12695a32626A04803l5669K6804a35357C35205j59549a153j34610P422F5856K58545
$$ -132626 104803 69134 95938 -135357 335205 175656 -1153 -135763 -128341 65856 324401
12684C24401D9189J54722b05946F3463a89242C29186A05074K89753A95274O691
$$ 324401 49189 203911 -205946 63463 -189242 329186 105074 394827 195274 201965
12674B01965O3076b88747B40498a69442O068I6437b18985E01435o6180e7751a2346
$$ 201965 265041 -288747 240498 -169442 -163374 96437 -218985 501435 435255 -57751 -12346
12662D60749b5922B09392a69771D8773A1989K4032a95293A4562M37217H9499a03141
$$ 460749 -25922 209392 -169771 48773 11989 36021 -195293 14562 451779 89499 -103141
12650b3812A37999o1641J28209p9454l9686L59J3121b42344A38995M5493p7550
$$ -23812 137999 76358 204567 125113 85427 85786 98907 -242344 138995 184488 106938
12639A06938b32997p9825B90745K3080a17975C53242A68957P5024P1778l2977
$$ 106938 -232997 -312822 290745 313825 -117975 353242 168957 243981 315759 282782
12629B82782J83941B15253m8409Q8925J98173A70933a52482A63235K81714n7501
$$ 282782 466723 215253 166844 255769 453942 170933 -152482 163235 444949 387448
12619C87448o2825C2675J70789n9344r020P810A1823J68570p8462A1822M1964
$$ 387448 324623 32675 203464 144120 135100 142910 11823 180393 101931 11822 53786
12608E3786J26549E058Q7371A8728N9813b12837C16929g3233K3590B63270A06874
$$ 53786 180335 5058 92429 18728 78541 -212837 316929 -73233 -49643 263270 106874
12596i0263L2427D33861A50428b15189J01910A70640J29894c7046o2270F9003
$$ -90263 -57836 433861 150428 -215189 -113279 170640 300534 -37046 -99316 69003
12585C3656f2632E4381A3700J12895c5221A32589K24399b6774B47094j00564c4318
$$ 33656 -62632 54381 13700 126595 -35221 132589 356988 -26774 247094 146530 -34318
12573A35732M9497o8695c5996A71248l4076b37221A88773b55860b2386A4453J23296
$$ 135732 185229 116534 -35996 171248 137172 -237221 188773 -255860 -22386 14453 137749
12562A37749K02609f1950D0817e2748j15657A29326L4937c0453A24608a57651
$$ 137749 340358 -61950 40817 -52748 -168405 129326 164263 -30453 124608 -157651
12551i4942B03674a96692A20579a44316A75006b70242A88948b1820k34016D00219
$$ -94942 203674 -196692 120579 -144316 175006 -270242 188948 -21820 -255836 400219
12540H3271i2750j64102I6336l0520J48863a02244d0141A73203J41G5627J04022
$$ 83271 -92750 -256852 96336 65816 214679 -102244 -40141 173203 173344 75627 179649
12529A79649P7289a53738a8949A53270g5922C29469A48709a5282k02095i5333
$$ 179649 256938 -153738 -18949 153270 -75922 329469 148709 -15282 -217377 -95333
12518a57687A16114J27886e0138A50621m7232k0734l345b27167B6174c9913G68
$$ -157687 116114 244000 -50138 150621 103389 82655 79310 -227167 26174 -39913 768
12506b80958D5965e2373E2639K8958P108d119B64272a48j90265O8069C94028e3415
$$ -280958 45965 -52373 52639 81597 88705 -4119 264272 -148 -190413 -122344 394028 -53415
12493b4361A30253J7856K13050b2845j13130B29068K3574A06545M5240a99935
$$ -24361 130253 148109 361159 -22845 -135975 229068 252642 106545 151785 -199935
12482B54027l3059Q1613E5496P9501K93647H5272b69237k292L1563D8326b9806
$$ 254027 220968 302581 55496 134997 428644 85272 -269237 -271529 -239966 48326 -29806
12470g7151B58003a92311F0756h7502j63074a18098k05873J00826A4516L785G800
$$ -77151 258003 -192311 60756 -87502 -250576 -118098 -323971 -223145 14516 18301 7800
12458A70709b89591i942D960J59770G4174e854F5594N2914a07974I8062a0658
$$ 170709 -289591 -9942 4960 164730 74174 -5854 65594 118508 -107974 98062 -10658
12446e5032j35512E2772a17048A30588e0455A08870d2250B5374a03089A50669
$$ -55032 -190544 52772 -117048 130588 -50455 108870 -42250 25374 -103089 150669
12435A24337e1467I4237c6778m9664K7981C8464a0425B35848G3110I297b82730
$$ 124337 -51467 94237 -36778 -86442 -58461 38464 -10425 235848 73110 9297 -282730
12423A85271a44292B12503J63796G4984a64378l5793i3210n2178B31991f0140
$$ 185271 -144292 212503 376299 74984 -164378 -200171 -93210 -145388 231991 -60140
12412A85446e5083l7232A26416a02857j66346c694j57161F22411A11727c95053
$$ 185446 -55083 -92315 126416 -102857 -269203 -3694 -160855 622411 111727 -395053
12401c00489B62327f5642I9495f6811o440I0952e2616h92B48154A19618E1541
$$ -300489 262327 -65642 99495 -66811 -73251 90952 -52616 -892 248154 119618 51541
12389A21847l5970i3929I8204C8034J91325B3298J68804a54137A37075J24570
$$ 121847 85877 -93929 98204 38034 229359 23298 192102 -154137 137075 261645
12379B61645f9730A13358a5573A34986K75669a46841P0424G7894k3559J39199
$$ 261645 -69730 113358 -15573 134986 410655 -146841 -76417 77894 54335 193534
12369A93534I4217r505O675c9326k08873O7577O9909d4626D20361a77891A958
$$ 193534 94217 84712 91387 -39326 -248199 -180622 -110713 -44626 420361 -177891 1958
12357F9493M9758c3586j62645a1425A75358b45457B28603A0183M34377d0594r7431
$$ 69493 119251 -33586 -196231 -11425 175358 -245457 228603 10183 444560 -40594 -138025
12346a38025r3371e7851B56024A03337B8432d633A90985L0842A8486K02389J5237
$$ -138025 -231396 -57851 256024 103337 28432 -4633 190985 221827 18486 220875 236112
12335B36112a96280k05215a41947M9646c3120r659B94482j08442D1837f6541q2657
$$ 236112 -196280 -401495 -141947 -92301 -33120 -42779 294482 186040 41837 -66541 -149198
12324a49198N1205G0604b1366p590A73215b96547i2143j03560l8318D1235b789
$$ -149198 -97993 70604 -21366 -28956 173215 -296547 -92143 -195703 -234021 41235 -2789
12312b02790r7286B17756b74175A92448K2463A03455E0681d8004B88171j25353
$$ -202790 -300076 217756 -274175 192448 214911 103455 50681 -48004 288171 162818
12302A62818a92477B74106B0724N2254b31597e9618B16878K22433A46808B4489
$$ 162818 -192477 274106 20724 72978 -231597 -59618 216878 439311 146808 24489
12291C56292A9545K06040g0239B09787E1704J37380b57180A40879d9343H6442
$$ 356292 19545 225585 -70239 209787 51704 189084 -257180 140879 -49343 86442
12280B4177i938n2460k40594A47749a0401k79193f5172b9208B3374R0556J21389
$$ 24177 -9938 -62398 -302992 147749 -10401 -289594 -65172 -29208 23374 113930 235319
12269B35319H5240J47004b07393R6687M7233k044B51544b8548C28737B3898e2156
$$ 235319 85240 232244 -207393 -110706 -63473 -65517 251544 -28548 328737 23898 -52156
12257a25539A47258a43312A37074R0679I0742N580a57428J3229D44554I0930e0562
$$ -125539 147258 -143312 137074 227753 90742 96322 -157428 -144199 444554 90930 -50562
12245C33129c17520B8796J73107h4554I2863e0944B87733H1286a45642B04568
$$ 333129 -317520 28796 201903 -84554 92863 -50944 287733 81286 -145642 204568
12234C29517K20657B1884M22146p5919m2450q5888o5586M1328L98621A33883O0974
$$ 329517 550174 21884 444030 368111 325661 239773 174187 215515 614136 133883 194857
12223A94857j0152j8201J40704a19741C97392q0987Q0042A76912g5674H7252M24286
$$ 194857 184705 166504 307208 -119741 397392 316405 396447 176912 -75674 87252 511538
12212E11538A02826f0518B01669a60078F9254L8268N47914D6156K14001H0192
$$ 511538 102826 -60518 201669 -160078 69254 107522 655436 46156 260157 80192
12201b32428C72683K0067B9627J46765o9222K21520A37194K41195l0021A99J37545
$$ -232428 372683 392750 29627 176392 107170 328690 137194 378389 348368 199 137744
12190A37744O1739i1883A93036O0102A4457J15103K24701H1666R5785E6064J58231
$$ 137744 199483 -91883 193036 253138 14457 129560 354261 81666 177451 56064 214295
12179B14295K13988j70669A8150K58292J60814e6083k1216A08397J87340A0611
$$ 214295 428283 257614 18150 276442 437256 -56083 -77299 108397 295737 10611
12168D09978A82346G7083C4612a52901B21601p3991j7061f8631A21072m9639K36736
$$ 409978 182346 77083 34612 -152901 221601 147610 130549 -68631 121072 71433 308169
12157C08169K01166B5174m088J06469J15442b27670g6414A21015N266C5230K24705
$$ 308169 509335 25174 21086 127555 242997 -227670 -76414 121015 126281 35230 259935
12146B59935n7770J5537K61746H2819a87164B08782n3534c8753E5063f2073A52346
$$ 259935 202165 217702 479448 82819 -187164 208782 155248 -38753 55063 -62073 152346
12134A97878J27993c19776e9156K1141C56776a12620c9274j75695R5081A26689
$$ 197878 325871 -319776 -59156 -38015 356776 -112620 -39274 -214969 -119888 126689
12123B02635c2363H428K19001F2559L07016j40917B1579c1217A74137a33476K311
$$ 202635 -32363 8428 227429 62559 369575 228658 21579 -31217 174137 -133476 -131165
12112a31165C80332j36374a63992A16884F705M4237O200R9863L1952c10757d6202
$$ -131165 380332 243958 -163992 116884 6705 50942 57142 157005 188957 -310757 -46202
12100A15699a59805F9665a24197j89165A42516J3437b03095J6272c8469D8900
$$ 115699 -159805 69665 -124197 -313362 142516 155953 -203095 -186823 -38469 48900
12089G5898J31348d74312h0034B20933G8830J28787j02364c7809k7529j19581
$$ 75898 207246 -474312 -80034 220933 78830 207617 105253 -37809 -65338 -184919
12079a84919F5209K76963B5062b17292K4712C19955l5398a27000N8956b7435k4469
$$ -184919 65209 342172 25062 -217292 -192580 319955 284557 -127000 -68044 -27435 -51904
12068e1904j25223A02272J86768a19618E3490g8249Q621C87Q8302k1995P2299
$$ -51904 -177127 102272 289040 -119618 53490 -78249 -69628 387 88689 66694 138993
12057A38993J323036N39396o85515C84130A00078J62916p4697c8945q98C33227
$$ 138993 1462029 2001425 1315910 384130 100078 262994 188297 -38945 -39843 333227
12046f0244A93855C9853d3784n5216k8870d1884B51840a39060A7216p126e5430
$$ -60244 193855 39853 -43784 -99000 -127870 -41884 251840 -139060 17216 10090 -55430
12034C11538f9043B44232p0608q1020K1149a97371A30246h6340A45012A6036K4179
$$ 311538 -69043 244232 173624 92604 113753 -197371 130246 -86340 145012 16036 40215
12023D0215a69589A05959b25220B10099a75921E0361P5937D4448h0981j3757n5370
$$ 40215 -169589 105959 -225220 210099 -175921 50361 126298 44448 -80981 -94738 -150108
12012a50108j17797D3080a83274B80817F5895J6286O240b40416E9828b15495A03647
$$ -150108 -267905 43080 -183274 280817 65895 82181 88421 -240416 59828 -215495 103647
12000E1823a74819A80215b60535A18439P0852a56158L0129j59520A27538m3288
$$ 51823 -174819 180215 -260535 118439 189291 -156158 -126029 -285549 127538 84250
11990H4250i5995E98M84251b14131e7628j4843I2091i0808B55882a65344E4750
$$ 84250 -95995 598 484849 -214131 -57628 -72471 92091 -90808 255882 -165344 54750
11978C2835c482j00536I8526a11045N2455B2270a9843E8766c0723k9119q7356
$$ 32835 -3482 -104018 98526 -111045 -58590 22270 -19843 58766 -30723 -59842 -147198
11967a47198K1913A06252C4641J42261b90034C23394h6864j4919F1165M1121b72916
$$ -147198 -125285 106252 34641 176902 -290034 323394 -86864 -101783 61165 102286 -272916
11955i0967N270A13657i3807D9968L49289a66217B9638b79543G6540K37092q1773
$$ -90967 -85697 113657 -93807 49968 399257 -166217 29638 -279543 76540 313632 231859
11944B31859h5859j70695A0892N0673M289b01662H8936P7913h1128A54026E0103
$$ 231859 -85859 -256554 10892 61565 65854 -201662 88936 166849 -81128 154026 50103
11932I9468K33539d1036o1522A9293J8745J16748c855q6934G3964J21423q1527
$$ 99468 333007 -41036 -102558 19293 38038 154786 -3855 -90789 73964 195387 113860
11921A13860K5445d4759a5758I9533J66974j21966M4261a22201N4700j993b8884
$$ 113860 139305 -44759 -15758 99533 266507 144541 188802 -122201 -67501 -69494 -28884
11909F949a97306b749o2397A76573A8168f160I8489D7634I956a409B95435I5996
$$ 6949 -197306 -2749 -65146 176573 18168 -6160 98489 47634 9956 -1409 295435 95996
11896A12327b72994d8923j95172i124I9600b09822l3434J00115k13170F0341d6845
$$ 112327 -272994 -48923 -244095 -9124 99600 -209822 -243256 -143141 -356311 60341 -46845
11884B69998r8231a4837j73705F2187b55566E9557a96454G8940g7048L2237l70517
$$ 269998 171767 -14837 -188542 62187 -255566 59557 -196454 78940 -77048 -44811 -415328
11873d15328D8925K62188C8685J55672K1315b17067f6936j16100I2662k9656b00119
$$ -415328 48925 311113 38685 194357 215672 -217067 -66936 -183036 92662 63006 -200119
11861A11393N9576M7542b2960A65449a19748h956C50980F3683J6676C555b70021
$$ 111393 170969 218511 -22960 165449 -119748 -8956 350980 63683 80359 3555 -270021
11849A69759k4912J9472b16646A971a43697C2115d186k12258i1503A6489J25375
$$ 169759 144847 164319 -216646 1971 -143697 32115 -4186 -216444 -91503 16489 141864
11838A41864A6126a57162P7342k73186J51154N901R1920F9977c41961J63545e3263
$$ 141864 16126 -157162 -79820 -353006 -201852 -195951 -104031 69977 -341961 -178416 -53263
11826b37883B03895i3722B87918P618o6038b13881I3397e5247l4476n4224m5694
$$ -237883 203895 -93722 287918 295536 229498 -213881 93397 -55247 -89723 -143947 -189641
11815a89641N5410c5751A97538a18240N7120K8948E3699a44553J9005e541q3566
$$ -189641 -134231 -35751 197538 -118240 -61120 -32172 53699 -144553 -125548 -5541 -89107
11804h9107E6872a05730C8259a04004B19356J23089E180h4315k78823E5323d19642
$$ -89107 56872 -105730 38259 -104004 219356 342445 5180 -84315 -363138 55323 -419642
11792D5720J7747i2245k6261K7618D1971a34125B67513A11820a55762A37664B8936
$$ 45720 63467 -92245 -118506 -90888 41971 -134125 267513 111820 -155762 137664 28936
11780g3498g780C9653P3752B8041K28945b98347a16089J2590H3279k7897a43869
$$ -73498 -7780 39653 113405 28041 256986 -298347 -116089 -103499 83279 55382 -143869
11768b9895H9310J95744j39497m6206a01335A9883K63609D7195b72982R8240B09305
$$ -29895 89310 285054 145557 99351 -101335 19883 283492 47195 -272982 -174742 209305
11756b31675E776B507L79603d4708p0363I3358b28192c7262k7090j9412l379A24152
$$ -231675 5776 2507 382110 -44708 -115071 93358 -228192 -37262 -64352 -83764 -87143 124152
11743A371a75721B14321D4556p922c2497A42971c62639f1333A73521a03178o5012
$$ 1371 -175721 214321 44556 36634 -32497 142971 -362639 -61333 173521 -103178 -168190
11732a68190O0015j4810j3256A39445O1061e5083D3233b41962a1645p3132A85871
$$ -168190 -108175 -122985 -136241 139445 200506 -55083 43233 -241962 -11645 -84777 185871
11720I6561J62645F683J28478a87342I4566L38872D0097I518J991b25511C36424
$$ 96561 259206 6683 135161 -187342 94566 433438 40097 9518 11509 -225511 336424
11708G0458a83937B51677j0240g8860I9274K87I292J2482J96126j1268D5821N0718
$$ 70458 -183937 251677 241437 -78860 99274 99561 9292 21774 217900 206632 45821 96539
11696I6539L2949a15819C81026A65931b9235n7871A40805C5162J23265l6020a39462
$$ 96539 129488 -115819 381026 165931 -29235 -87106 140805 35162 158427 122407 -139462
11684E48437A11763a91574B9302g3376H8343D1026e3583H0949a50922B17865O3011
$$ 548437 111763 -191574 29302 -73376 88343 41026 -53583 80949 -150922 217865 280876
11673B80876H8601L02004C1738A2160P1398Q2274F0376a73551P5299A97585d1376
$$ 280876 88601 390605 31738 12160 83558 165832 60376 -173551 -98252 197585 -41376
11661H0391j267b52473B86857a73018A26524e8449B14566q5521i0485D02820j66015
$$ 80391 79124 -252473 286857 -173018 126524 -58449 214566 129045 -90485 402820 236805
11650B36805i4974B57489q6955f9629E18033C8099g2931A12169J3801O5390b17143
$$ 236805 -94974 257489 170534 -69629 518033 38099 -72931 112169 125970 191360 -217143
11638B31823D4233J87132b8743C4229L97417F8613a55151e0730C43565A52387
$$ 231823 44233 231365 -28743 34229 431646 68613 -155151 -50730 343565 152387
11627B82045a11572C4167J59113k9392d0023J0930B1888O645d4046I8381J2996
$$ 282045 -111572 34167 193280 163888 -40023 -29093 21888 28533 -44046 98381 111377
11616A11377L9795A2900b64737D25673d119A30736k676K2800b20034B84808b4011
$$ 111377 151172 12900 -264737 425673 -4119 130736 128060 150860 -220034 284808 -24011
11604B37814G9515b32137B21782b80554B367b50525E1900A3674N1672f0378A08616
$$ 237814 79515 -232137 221782 -280554 2367 -250525 51900 13674 65346 -60378 108616
11592B61552R5327f3442A81924o7386d956B30111i7191C04690n5199L8569E4157
$$ 261552 356879 -63442 181924 114538 -4956 230111 -97191 304690 249491 288060 54157
11580B20100q2272J53597c3888A60129c92347D51178b31748G5685j6712K06629
$$ 220100 137828 291425 -33888 160129 -392347 451178 -231748 75685 58973 265602
11570B65602e1699C9916e8382k03742B42509o2004c5156J1400i190F8043J13796
$$ 265602 -51699 39916 -58382 -262124 242509 180505 -35156 -23756 -9190 68043 181839
11559A81839E1292a38575C5814J15376J6242G9461a03977B4959P8752K0054C3056
$$ 181839 51292 -138575 35814 151190 167432 79461 -103977 24959 103711 123765 33056
11547I112Q1280R6443D3421K14675c6745m332A72533J21553h5909C51797A36698
$$ 9112 90392 186835 43421 258096 -36745 -41077 172533 294086 -85909 351797 136698
11535A1402J45116J12479H8099h9743D4564K44531j08259E494J71927n7691L475
$$ 11402 156518 268997 88099 -89743 44564 289095 180836 5494 177421 119730 123205
11524A23205P2327d2050D623J64890E7738K1072K35272a29004D1323J13641C2157
$$ 123205 195532 -42050 4623 169513 57738 78810 314082 -129004 41323 154964 32157
11512B52438K17967o2137K6737A05472a27061G9746J9403J59392k8617O7047r0148
$$ 252438 470405 408268 435005 105472 -127061 79746 99149 258541 229924 296971 206823
11501B06823J08887n3488E8398d9676C60630a02388C87610C0176L02297A26318
$$ 206823 315710 262222 58398 -49676 360630 -102388 387610 30176 332473 126318
11490A68767Q4128O6634j00488J38589A69458J44907q7574m3074K58329B4358
$$ 168767 252895 319529 219041 357630 169458 314365 226791 183717 442046 24358
11479E3743a9690B8656J43431d017A57621D7672Q9044J57262M2106I9975C1783
$$ 53743 -19690 28656 172087 -4017 157621 47672 136716 293978 336084 99975 31783
11467E0641J46006R1043E8507K12623b0060B712J75572d7482d895C76371d1096
$$ 50641 196647 287690 58507 271130 -20060 2712 178284 -47482 -4895 376371 -41096
11455A2666L59349Q3613E7104l948a7149j92479B956L20210A36056f2222D0140
$$ 12666 372015 455628 57104 53156 -17149 -209628 2956 323166 136056 -62222 40140
11443a14509H4904J56107C5819K64833j36142R1447c2226I5377j9295a63124a6739
$$ -114509 84904 241011 35819 300652 164510 255957 -32226 95377 76082 -163124 -16739
11431c8790n0668B84768a7920A36214b39158A15378e7987A49938a68626A5576
$$ -38790 -89458 284768 -17920 136214 -239158 115378 -57987 149938 -168626 15576
11420F4467O7789c57569C24390j57958J76563b64900a5059A96121a8311I607b00828
$$ 64467 132256 -357569 324390 166432 342995 -264900 -15059 196121 -18311 9607 -200828
11408A38549d7414B95948A37720C5535g4995D1876Q5840M8802a85309A7393a49067
$$ 138549 -47414 295948 137720 35535 -74995 41876 127716 176518 -185309 17393 -149067
11396f5960K5750a3275B33071C9548J04077A6091a37460j14578Q5676O0518a3945
$$ -65960 -40210 -13275 233071 39548 143625 16091 -137460 -252038 -166362 -105844 -13945
11384I6957D4546a54210E4750J13785f2007D95598b10164e5888j66357I5951K11585
$$ 96957 44546 -154210 54750 168535 -62007 495598 -210164 -55888 -222245 95951 307536
11373C07536d13871e7400E5743K31557b17130A04130M8294b67761k11529h365
$$ 307536 -413871 -57400 55743 287300 -217130 104130 152424 -267761 -479290 -8365
11362c4600l06639D9293b58319C97937a60719A5479R8767l0868b87004D8029h8720
$$ -34600 -341239 49293 -258319 397937 -160719 15479 114246 83378 -287004 48029 -88720
11350a53484G7929B1773P6184C3268L6517e9681J1104j99458I7227D0095N5033
$$ -153484 77929 21773 97957 33268 69785 -59681 -48577 -248035 97227 40095 95128
11339I5128K90278I1983J8925b9570H4589k731B332b93454a07792j8261a3520
$$ 95128 385406 91983 110908 -29570 84589 81858 2332 -293454 -107792 -126053 -13520
11327b40449A34551c6831j89678j2017h5648k1288A17568b21130A55468K5041
$$ -240449 134551 -36831 -226509 -238526 -85648 -106936 117568 -221130 155468 180509
11317A80509C9289i6860A40273g1407C05727E5052R3955D2617a373k65024C12639
$$ 180509 39289 -96860 140273 -71407 305727 55052 149007 42617 -1373 -266397 312639
11305B94121a03310k1910j48546A75175a11354R783B3109L12521a82494B47452
$$ 294121 -103310 -125220 -273766 175175 -111354 -101571 23109 335630 -182494 247452
11294d46876a43476d9430p7703r7218j51938f7686A77408c3003g123A55525h9696
$$ -446876 -143476 -49430 -127133 -224351 -376289 -67686 177408 -33003 -7123 155525 -89696
11282e6709n8725B16666k3837G2712a00441j59494A38361m2557c19440H4790b64590
$$ -56709 -115434 216666 192829 72712 -100441 -259935 138361 95804 -319440 84790 -264590
11270a43278C8072a9327q5738A46669b07533a7240j18785c2153B62390b8406n371
$$ -143278 38072 -19327 -105065 146669 -207533 -17240 -136025 -32153 262390 -28406 -33777
11259c3777A2467M40500C9095Q4687b5746j93476A17063e18686a64992k58494
$$ -33777 12467 452967 39095 123782 -25746 -219222 117063 -518686 -164992 -423486
11249d23486C86797A66058p9867b50170n895A54068H242d8339l64958J29580C18040
$$ -423486 386797 166058 86191 -250170 -256065 154068 8242 -48339 -413297 -283717 318040
11237a54489c5140C11660B6880K58231E7932h4965o1964f6855C4037A48b35478
$$ -154489 -35140 311660 26880 285111 57932 -84965 -146929 -66855 34037 148 -235478
11225a42399k0440P4085A13829n1142b34940B1335J51111a50616j79816A24023
$$ -142399 -162839 -88754 113829 62687 -234940 21335 172446 -150616 -330432 124023
11214F1009J24158C0324J00647a33493A22317C1728b15180A70567a5824A81812
$$ 61009 185167 30324 130971 -133493 122317 31728 -215180 170567 -15824 181812
11203C9782c3834j0406j67747d6223k56799b0778F4671a65147k03727A18177J65526
$$ 39782 -33834 -44240 -211987 -46223 -303022 -20778 64671 -165147 -368874 118177 283703
11192B83703a25277A913J81071b1409m24680a52028k72726a08814l2990N5866
$$ 283703 -125277 1913 182984 -21409 -446089 -152028 -424754 -108814 -141804 -85938
11182h5938b9009r0680M3259A1754i4381A13373c08272B48934a02689l32112f8245
$$ -85938 -29009 -119689 -76430 11754 -94381 113373 -308272 248934 -102689 -434801 -68245
11170c38787f5427A03692c60601h8910A40495J35407g8785c8010B7437a68864
$$ -338787 -65427 103692 -360601 -88910 140495 275902 -78785 -38010 27437 -168864
11159c77461a07943B1538J59130a40388e2534C9563b97351e8638p2670A48190
$$ -377461 -107943 21538 180668 -140388 -52534 39563 -297351 -58638 -131308 148190
11148a670j4988j90200B79383p7671n2488B9083i2127o9811G6298a46914A39376
$$ -1670 -16658 -206858 279383 201712 149224 29083 -92127 -161938 76298 -146914 139376
11136A49418P6361n2295o8718c6939A8413O5832d5277A74459k0970C9170j738
$$ 149418 225779 173484 104766 -36939 18413 84245 -45277 174459 153489 39170 37432
11125C7432d7407E4907O6770d6386A0556P0841L24676J4670b19772H1732J10026
$$ 37432 -47407 54907 121677 -46386 10556 81397 406073 420743 -219772 81732 191758
11114A91758b46593G2656Q729J14135a65628D3980J99980F5109J09752j6852l3714
$$ 191758 -246593 72656 81385 195520 -165628 43980 243960 65109 174861 158009 124295
11103A24295h044D44436B17092k4811p2196q862J61557b08622C34112j50243B8369
$$ 124295 -8044 444436 217092 192281 120085 111223 272780 -208622 334112 183869 28369
11091B90134J55645o9089j08473M22645B20407A08645J32799J217q6410K17710
$$ 290134 445779 376690 268217 690862 220407 108645 241444 242661 156251 373961
11081C73961A45410J93448N6177A02091k0831C5867K18806J88117b93A80395K61732
$$ 373961 145410 338858 395035 102091 81260 35867 254673 442790 -293 180395 442127
11070D42127A44318K12662H2189J83448J26958M50194C00608K64668L35421k22624
$$ 442127 144318 356980 82189 265637 392595 842789 300608 565276 900697 678073
11060F78073l161J0386j85183j21146Q8595K86968n5652M083O8134P5245m9381
$$ 678073 674912 685298 500115 378969 467564 754532 698880 702963 771097 846342 796961
11049G96961Q5283Q7605J41214k17429O53j075j82063K04159N0218k61277J83876
$$ 796961 882244 969849 1111063 893634 894287 893212 711149 915308 965526 704249 888125
11038H88125O5616M1037J6101l5347j39318j90274K65311j17823p1992J66573
$$ 888125 953741 994778 1010879 975532 836214 645940 911251 793428 721436 888009
11028H88009j85202K8769K14083j35776J26886j43561j978k69549L61172J2552
$$ 888009 702807 731576 945659 809883 936769 793208 791230 521681 882853 895405
11018H95405D45862M27619q7908M4619k05025K38991j0731q8391j86930K77070
$$ 895405 445862 873481 785573 830192 625167 864158 853427 765036 578106 855176
11008H55176q4960q9001m7470L27208k91824K53841J44256k53307k83242K89360
$$ 855176 770216 681215 633745 960953 669129 922970 1067226 813919 530677 820037
10998H20037j22446M83899l49262K7496j03177J11704l2121j61909N1212J47331
$$ 820037 697591 1181490 832228 859724 756547 868251 836130 674221 725433 872764
10988H72764J12967K6732j04746N514K42509k02675K64678J76262k43111L58532
$$ 872764 985731 1012463 907717 913231 1155740 953065 1217743 1394005 1150894 1509426
10978A509426k38289M86981n6196J08721Q90697o9306M88173J15921M19017j83083
$$ 1509426 1271137 1758118 1701922 1810643 2701340 2632034 3120207 3236128 3655145 3472062
10968C472062K32758K3099m22904l44787k23303l71331l26055P5513q8136K05215
$$ 3472062 3704820 3727919 3305015 2960228 2736925 2365594 2039539 2115052 2026916 2232131
10958B232131J36553L0079M9379j18023J22135o36935l16541l44247L19957F40120
$$ 2232131 2368684 2398763 2448142 2330119 2452254 1815319 1498778 1154531 1474488 640120
10947E80962K75379l61794k28096J58368N7124J1593k39962M062K04604j93807
$$ 580962 856341 494547 266451 424819 481943 493536 253574 257636 462240 268433
10937B68433p7786g5635A39472M0549d2973A96592o3602i3740B73434L0870A17592
$$ 268433 190647 -75635 139472 180021 -42973 196592 132990 -93740 273434 304304 117592
10925b8300A76816B721J81455f260B02584R3505j37773p325o9217K8910a1167
$$ -28300 176816 2721 184176 -6260 202584 296089 158316 150991 81774 110684 -11167
10913B14527m082p086f7769q6164B03084q7474k3858J58604A16137f342q2363
$$ 214527 210445 203359 -67769 -153933 203084 115610 91752 250356 116137 -6342 -88705
10902h8705f693k97851a32939M9433l0379G9454J87654A18163g7166q7615B0770
$$ -88705 -6693 -304544 -132939 -83506 -113885 79454 267108 118163 -77166 -164781 20770
10890a2007r0741A79189e1785A01472c85301B5134c26574a48555b2513A13467
$$ -12007 -102748 179189 -51785 101472 -385301 25134 -326574 -148555 -22513 113467
10879A04952C4015R6984a07510l22050b00220r3679J37793C07831j48136a67701
$$ 104952 34015 130999 -107510 -429560 -200220 -293899 -156106 307831 159695 -167701
10868A28596O332B7133f5607k07620d5604B04940a36005M8574j6121A8067N2503
$$ 128596 134928 27133 -65607 -273227 -45604 204940 -136005 -87431 -103552 18067 70570
10857G0570b24899C6443b5236L428o7199A13816C5280M14199a4376j05196I1532
$$ 70570 -224899 36443 -25236 -21808 -89007 113816 35280 449479 -14376 -119572 91532
10845D1247R0405m0171K6458K27769A51647k1437b6910I0164i4843j48863f1019
$$ 41247 131652 91481 117939 345708 151647 130210 -26910 90164 -94843 -243706 -61019
10833i7697B54975j12170d44766E4732b80607F0078c3371a1905F7496K25848c55454
$$ -97697 254975 142805 -444766 54732 -280607 60078 -33371 -11905 67496 293344 -355454
10821c7145A42902b04631b3571j79065i0432P043N902K3449n0649n8289k29164
$$ -37145 142902 -204631 -23571 -202636 -90432 -83389 -77487 -54038 -104687 -162976 -392140
10810c92140A31617c50287J27633H7531h7708B80652A14251a31702j52798A76506
$$ -392140 131617 -350287 -222654 87531 -87708 280652 114251 -131702 -284500 176506
10799a87328B05201a39097k11111A49R9253J4233Q2420d52256A53013l4781R9978
$$ -187328 205201 -139097 -350208 149 99402 113635 196055 -452256 153013 118232 218210
10788B18210c56438d6491H7388L3122d5518k52292A90903m1609B0356K71796K0081
$$ 218210 -356438 -46491 87388 120510 -45518 -297810 190903 149294 20356 292152 312233
10777C12233i5055l09275A17750j4425C6218c8558j7181C348a42149E424K6551
$$ 312233 -95055 -404330 117750 103325 36218 -38558 -55739 3348 -142149 5424 31975
10766C1975L3474b38270J01511c363A41143n3767L2845c87613I3008c6288N185
$$ 31975 65449 -238270 -136759 -3363 141143 87376 120221 -387613 93008 -36288 -31103
10755c1103j21064A35225a08339A12306b1560E2238a7349A31284R1692b71678
$$ -31103 -152167 135225 -108339 112306 -21560 52238 -17349 131284 222976 -271678
10744G1094L38917a57012C27393b14779J0239H6897A8730f2703k0821r3535H9565
$$ 71094 410011 -157012 327393 -214779 -204540 86897 18730 -62703 -83524 -177059 89565
10732b20030A33258d99188a49787A96318f6960j55823J7149p3273a38563o3990
$$ -220030 133258 -499188 -149787 196318 -66960 -222783 -205634 -278907 -138563 -202553
10722b02553A23579b45858a20762d5343j72394B68569E9867b683j10275k32194
$$ -202553 123579 -245858 -120762 -45343 -217737 268569 59867 -2683 -112958 -345152
10712c45152A47224D1002a28201G3763g4761D33863A88511l297J20077i6948n518
$$ -345152 147224 41002 -128201 73763 -74761 433863 188511 185214 305291 -96948 -102466
10701a02466j99004H2020a8126l23o5016K3934F2260c42050A48381A557K97374
$$ -102466 -301470 82020 -18126 -18449 -83465 -59531 62260 -342050 148381 1557 298931
10690B98931c22008a30186k5025L2442A46656a92061j7585F1527a52779K2556
$$ 298931 -322008 -130186 -155211 -122769 146656 -192061 -209646 61527 -152779 -130223
10680a30223N2842k95614a06666o1449L7805j72146a31273j70885d9589j62672
$$ -130223 -77381 -372995 -106666 -168115 -130310 -302456 -131273 -302158 -49589 -212261
10670b12261i1099l0665l13991F9283c0441H1999K84125E7294K97511b87341I2143
$$ -212261 -91099 -121764 -435755 69283 -30441 81999 366124 57294 354805 -287341 92143
10658B41809o3374c09691C27090e1331j27355q6570i1449A43289a51647F5819
$$ 241809 178435 -309691 327090 -51331 -178686 -265256 -91449 143289 -151647 65819
10647A18344a02616c2548k21553P2185N2296M0947I8910a09527B15471a68039
$$ 118344 -102616 -32548 -254101 -181916 -129620 -88673 98910 -109527 215471 -168039
10636a59302g6550j6728j78306B2387N5754J59938a75716K6208a0603n8038a466
$$ -159302 -76550 -93278 -271584 22387 78141 238079 -175716 -149508 -10603 -68641 -1466
10624a32123B3521a07071A74655G84K10304H9582b9257j57089J0831H9785d049
$$ -132123 23521 -107071 174655 784 211088 89582 -29257 -186346 -175515 89785 -4049
10612h9641a7401B42565a48426I1968c38215a48342A32426O1602a13595A06038
$$ -89641 -17401 242565 -148426 91968 -338215 -148342 132426 194028 -113595 106038
10601d8605k00495H7398b2687O620r3061a668D7470a52848B36962M9606b8828
$$ -48605 -249100 87398 -22687 -16067 -109128 -1668 47470 -152848 236962 286568 -28828
10589e1616j63501F8530n093b13710P8004I4289K3195L939a67474A14086b53070
$$ -51616 -215117 68530 63437 -213710 -135706 94289 117484 121423 -167474 114086 -253070
10577e2149G7447b62254B13435E8179L2858a89654d8324k28602E0063g1669B30105
$$ -52149 77447 -262254 213435 58179 91037 -189654 -48324 -276926 50063 -71669 230105
10565d1942P117j19384A99206b1703A76300a03268a0221A65995F7049b8989j92373
$$ -41942 -34825 -154209 199206 -21703 176300 -103268 -10221 165995 67049 -28989 -221362
10554b21362n5481Q2149A46660e4310j36265G9690Q8039b41931g0591B92710a05741
$$ -221362 -276843 -194694 146660 -54310 -190575 79690 167729 -241931 -70591 292710 -105741
10542e1849B24056d7416k28287H0920a20998A3039f6617D04619a56627G5338b02393
$$ -51849 224056 -47416 -275703 80920 -120998 13039 -66617 404619 -156627 75338 -202393
10530a32061e2973A20004b02492A7439d26814C29880a73457j21772c4107k76059
$$ -132061 -52973 120004 -202492 17439 -426814 329880 -173457 -295229 -34107 -310166
10520c10166P3046n2095b4951k49229A32043a60203c3849p044j28267F7700e0199
$$ -310166 -237120 -289215 -24951 -274180 132043 -160203 -33849 -40893 -169160 67700 -50199
10508A29935b00375n2107A72559c832j60927A61725c91734a39644d7737m23049
$$ 129935 -200375 -252482 172559 -3832 -164759 161725 -391734 -139644 -47737 -470786
10498d70786C023a30703B4524K90077h6500j98802I072a75619B38859H1258M6275
$$ -470786 3023 -130703 24524 314601 -86500 -285302 9072 -175619 238859 81258 127533
10487A27533L48684b21867q0490A97865J12810j19496K03274A57903M16455Q1438
$$ 127533 476217 -221867 -302357 197865 310675 191179 394453 157903 574358 655796
10477F55796r2734k14212j1099k4385F631a02273C14308H865K23819q5690J6022
$$ 655796 563062 348850 337751 313366 6631 -102273 314308 8865 232684 146994 163016
10466A63016c7066A61076J51557A15300b77881A65948g742B4099R9896a1554B41406
$$ 163016 -37066 161076 312633 115300 -277881 165948 -7742 24099 123995 -11554 241406
10454b87609c8462j2075n5514j07845A24113e208o68514A11597e7442j04687C7906
$$ -287609 -38462 -50537 -106051 -213896 124113 -5208 -673722 111597 -57442 -162129 37906
10442B56271C6199K13497i1435k2081A21465b14883B03386J91209G0389a69368
$$ 256271 36199 249696 -91435 -113516 121465 -214883 203386 394595 70389 -169368
10431A20787j5467j0742m4694a07853O488A57238a70006N8987j73309B14437J03440
$$ 120787 105320 94578 49884 -107853 -101365 157238 -170006 -111019 -284328 214437 317877
10420C17877b26066B31527e1443A38774P7535a41556f1732F3640i9009J2463j27637
$$ 317877 -226066 231527 -51443 138774 216309 -141556 -61732 63640 -99009 -86546 -214183
10409b14183A27561J40193i1605q3033h4384k5026k2528B67582H005a31175M8241
$$ -214183 127561 267754 -91605 -174638 -84384 -109410 -131938 267582 8005 -131175 -82934
10398h2934o5278a4424F329K139M11687a03269A31391K3243p2493K10190K07138
$$ -82934 -148212 -14424 6329 8468 420155 -103269 131391 154634 82141 292331 499469
10387D99469l1956F929M37576E8594g6040B45327E955K26352o049K16612g7431
$$ 499469 467513 6929 444505 58594 -76040 245327 5955 232307 226258 442870 -77431
10375G19618l06597A67419K48631A98359K74094I1603K27683K54660B69569N07376
$$ 719618 413021 167419 416050 198359 472453 91603 319286 573946 269569 776945
10365G76945C72019M73828l22456J99404k50804r2230j7044P1472j45614d985
$$ 776945 372019 845847 523391 722795 471991 379761 362717 434189 288575 -4985
10354A47098k6782K92782j44697J99266K48534j25718l8277j27775A39705N37496
$$ 147098 120316 413098 268401 467667 716201 590483 552206 424431 139705 677201
10344F77201H6723K15041J21130j90224L73724k34938A84948p7884C710K90057
$$ 677201 86723 301764 422894 232670 606394 371456 184948 107064 3710 293767
10334B93767r0929J15635C0075J58964J17090a00331a9492P012j27508e0637J1944
$$ 293767 202838 318473 30075 189039 306129 -100331 -19492 -12480 -139988 -50637 -38693
10323c8693B25693L06501o9715a2026D78153b36847G9189O9541b32353A36922
$$ -38693 225693 532194 462479 -12026 478153 -236847 79189 148730 -232353 136922
10312A66125b6257A0446M3557J49523E9487N0915c4416A27279K9350F8320d206
$$ 166125 -26257 10446 54003 203526 59487 110402 -34416 127279 156629 68320 -4206
10300b29671h8283D0435A6100K67778A08449E3342f9646A03511D4452a8422g625
$$ -229671 -88283 40435 16100 283878 108449 53342 -69646 103511 44452 -18422 -7625
10288C7319e3638p4107j14472D0393J38462j8918E4714f0044j21280A44027a27811
$$ 37319 -53638 -127745 -242217 40393 178855 159937 54714 -60044 -181324 144027 -127811
10276D98445A15480f6193i388A71692A0369O1086g7280B08778l0439m1195c292
$$ 498445 115480 -66193 -9388 171692 10369 71455 -77280 208778 178339 137144 -3292
10264B32661j0310r6084P8923C7728K71756A12141J10609L00779k06818J39830
$$ 232661 222351 126267 205190 37728 309484 112141 222750 523529 316711 456541
10254D56541j58927r327m5723M0528H3496K52027d02792A04981i8724A07766b22877
$$ 456541 297614 288287 242564 283092 83496 335523 -402792 104981 -98724 107766 -222877
10242e712j23596n4369F4505d0859q2520C4387b8160l4521k6100F6690d7647F9589
$$ -5712 -129308 -183677 64505 -40859 -123379 34387 -28160 -62681 -88781 66690 -47647 69589
10229A82768a05435r5342A63912c23890E1692k1652a68491d0836m7789j12467
$$ 182768 -105435 -200777 163912 -323890 51692 30040 -168491 -40836 -88625 -201092
10219b01092C4251c47022J61145G7639a11621B1006M284c9209B56051N666o3376
$$ -201092 34251 -347022 -185877 77639 -111621 21006 25290 -39209 256051 261717 198341
10208A98341c296l32737A11213a28855A658b03805j14612H3458a82394F7964b24915
$$ 198341 -3296 -336033 111213 -128855 1658 -203805 -318417 83458 -182394 67964 -224915
10196A3262b23106K3609a1446j70706B10236c0531A10046a8419l82729A4160b82667
$$ 13262 -223106 -199497 -11446 -182152 210236 -30531 110046 -18419 -401148 14160 -282667
10184a9221j09640M3897j94982B42870d5620m255G5346b61481E3937a12353A25139
$$ -19221 -128861 -84964 -279946 242870 -45620 -49875 75346 -261481 53937 -112353 125139
10172b40640J11186G6990b96021h8703c8490j9637k11812N3642j08856A47678
$$ -240640 -129454 76990 -296021 -88703 -38490 -58127 -269939 -216297 -325153 147678
10161d22874f9239E6218J28721h5440o4493O9220C5553j5506b55795R1647D0429
$$ -422874 -69239 56218 184939 -85440 -149933 -80713 35553 20047 -255795 -164148 40429
10149b9418m09190B4851L3587O0012b44669k7289J05444n5135J3904J5783m2399
$$ -29418 -438608 24851 58438 118450 -244669 -271958 -166514 -221649 -207745 -191962 -234361
10138b34361e8655j3138C15707b15012A47538a69044O0822J3829k91222a66695
$$ -234361 -58655 -71793 315707 -215012 147538 -169044 -108222 -94393 -385615 -166695
10127c06605H496b26664j39600J12374N5257L4211r9909C59523I8108i9280j48287
$$ -306605 8496 -226664 -366264 -253890 -198633 -164422 -264331 359523 98108 -99280 -247567
10116b47567M4658K6586E48581a7760k05319l014d2004j6354K0469m40499C9671
$$ -247567 -202909 -176323 548581 -17760 -223079 -226093 -42004 -58358 -37889 -478388 39671
10104a55513B52093g9110a6252A11276b66587d3525q4710b0985l05528C05015
$$ -155513 252093 -79110 -16252 111276 -266587 -43525 -128235 -20985 -326513 305015
10093b28208B53165p7445l578R3537D6142a53444n9040d4483A18326E4315G997
$$ -228208 253165 175720 172142 265679 46142 -153444 -212484 -44483 118326 54315 7997
10081b84257J23460k9635A91585i8838A04884d24771e8703m6402A40782L08157
$$ -284257 -160797 -190432 191585 -98838 104884 -424771 -58703 -105105 140782 448939
10071D48939a1644q5798K5932k84393M0612J34288r971A06750h9381k5687F6784
$$ 448939 -11644 -97442 -71510 -355903 -315291 -181003 -190974 106750 -89381 -115068 66784
10059A79338g9548A8575c50980J23106A46786I814a08696d496j61425A4110J40885
$$ 179338 -79548 18575 -350980 -227874 146786 9814 -108696 -4496 -165921 14110 154995
10048A54995a61504O1077A48939a53973M7189k06581J6078a03768A37502b82083
$$ 154995 -161504 -100427 148939 -153973 -106784 -313365 -297287 -103768 137502 -282083
10037b03715N7611k9925B14771g963n4640P121j04322A93249h3882F0164J03016
$$ -203715 -146104 -176029 214771 -7963 -62603 -55482 -159804 193249 -83882 60164 163180
10026A63180K2409c85776i4299D6321a57138j19476J07217j410h1182j03279R0449
$$ 163180 185589 -385776 -94299 46321 -157138 -276614 -169397 -170807 -81182 -184461 -94012
10015i4012c3989J49j90237A05303a3871o4288j29458A18387J46823a35021l0211
$$ -94012 -33989 -33840 -224077 105303 -13871 -78159 -207617 118387 265210 -135021 -165232
10004a65232J8871F6758a59118F6368a68135d3126A20709b05984q1267A76011
$$ -165232 -146361 66758 -159118 66368 -168135 -43126 120709 -205984 -287251 176011
9993h8821a0800j86689A24925b82763j11575d0148j21444e377r9686A7928K3397
$$ -88821 -10800 -197489 124925 -282763 -394338 -40148 -161592 -5377 -105063 17928 41325
9982D1325a30275j22962D8563a78261d8796r2128A95061J59015d9391B71661b74871
$$ 41325 -130275 -253237 48563 -178261 -48796 -140924 195061 354076 -49391 271661 -274871
9970a05006G0220k3460a03980F9219Q5206b3492G1249a94963l8143C9448R3028
$$ -105006 70220 46760 -103980 69219 154425 -23492 71249 -194963 -233106 39448 132476
9959A32476b14596I8466a35999F9117b92999H5466a75100M157A05980b82620f6092
$$ 132476 -214596 98466 -135999 69117 -292999 85466 -175100 -170943 105980 -282620 -66092
9947B12655b80022d0281B0355a26208h433C3826h2969k24653D7514b91237f7434
$$ 212655 -280022 -40281 20355 -126208 -8433 33826 -82969 -307622 47514 -291237 -67434
9935b97506l5652h2955j1232k56123A62092b68260L5579J05401a3800a276m1448
$$ -297506 -333158 -82955 -94187 -350310 162092 -268260 -232681 -127280 -13800 -1276 -42724
9924d2724j62287j23161N0750Q9676P3007l4529k24119A2077O3090a54321A35671
$$ -42724 -205011 -328172 -277422 -187746 -114739 -149268 -373387 12077 75167 -154321 135671
9912a62363q4821A69895b43264M0213C63369b95758a07328B2146b2839K133m54648
$$ -162363 -247184 169895 -243264 -203051 363369 -295758 -107328 22146 -22839 -20706 -475354
9901d75354D3418M53639d1089D2874c3493j05367j84002A1033a53912p4505a0619
$$ -475354 43418 497057 -41089 42874 -33493 -138860 -322862 11033 -153912 -228417 -10619
9889A39931J23568b9818o5425A8586O4310d79276A5071i0306b0411j09295m0203
$$ 139931 263499 -29818 -95243 18586 82896 -479276 15071 -90306 -20411 -129706 -169909
9878a69909c0256A31397d9446a8975A32679J2444c083j60877D015b23328k2130
$$ -169909 -30256 131397 -49446 -18975 132679 145123 -3083 -163960 4015 -223328 -245458
9867b45458h5466j11658B1519a14195L2695j20045k18314a74270A35959a28237
$$ -245458 -85466 -197124 21519 -114195 -81500 -201545 -419859 -174270 135959 -128237
9856a8366k61123A56643D5789J03280a71867A44298a65381n3266j9064I2690c7516
$$ -18366 -279489 156643 45789 149069 -171867 144298 -165381 -218647 -237711 92690 -37516
9844g6678E7431b28779b1004k86415R2847e3573A21240a95594J5254n4136A29336
$$ -76678 57431 -228779 -21004 -307419 -214572 -53573 121240 -195594 -180340 -234476 129336
9832a95963J3987C33301i0452q8215C7004Q7792b08221b8885B01232b84007A06784
$$ -195963 -181976 333301 -90452 -178667 37004 124796 -208221 -28885 201232 -284007 106784
9820i6777A35246c68853H0303a2650q2543A4676J65936p3384n2944e9600j38727
$$ -96777 135246 -368853 80303 -12650 -95193 14676 180612 107228 54284 -59600 -198327
9809a98327m4328g2508F0522a33765e1105l4477o8785j39892N6300d5645j63681
$$ -198327 -242655 -72508 60522 -133765 -51105 -85582 -154367 -294259 -237959 -45645 -209326
9798b09326e7763l25891d0631n5972A15569H090b99095l2806A41180f56A87103
$$ -209326 -57763 -383654 -40631 -96603 115569 8090 -299095 -331901 141180 -656 187103
9786B07020G5002R8034E7174b96757A33339F4222J2516h1092B81398a33594j17529
$$ 207020 75002 173036 57174 -296757 133339 64222 76738 -81092 281398 -133594 -251123
9775b51123e0209J3200j35226N0073B6586a35061A1513b27260A06437J17504q4083
$$ -251123 -50209 -37009 -172235 -122162 26586 -135061 11513 -227260 106437 223941 139858
9764A39858o2251a81492Q3151M4104q6117B88742c87270a446j73525M5199C3621
$$ 139858 77607 -181492 -98341 -54237 -140354 288742 -387270 -1446 -174971 -129772 33621
9752a16155A8015J57825k5265F3129b80113k61219d0856j23051K8642M9750j87591
$$ -116155 18015 175840 150575 63129 -280113 -541332 -40856 -163907 -135265 -85515 -273106
9741b73106m3345L2653o0935a02779d6385l63164J12317h1492j13839M7870B69539
$$ -273106 -316451 -283798 -344733 -102779 -46385 -409549 -297232 -81492 -195331 -147461 269539
9729e5751m8932a7449q2932H1897d685j38075o8968a9139j26644L734N5452k88098
$$ -55751 -104683 -17449 -100381 81897 -4685 -142760 -211728 -19139 -145783 -142049 -86597 -374695
9717c74695I6355j5363d8644E8310a04861l37236b09751f2762j53352d4592A9478
$$ -374695 96355 80992 -48644 58310 -104861 -442097 -209751 -62762 -216114 -44592 19478
9705f3649k78598j34496A79406q8612a60985a3378m3683A90452H9922e7626J9654
$$ -63649 -342247 -476743 179406 90794 -160985 -13378 -57061 190452 89922 -57626 -37972
9694c7972k56644L4300A07517b93065I8980a13563B97073A28703a90591A97532
$$ -37972 -294616 -260316 107517 -293065 98980 -113563 297073 128703 -190591 197532
9683C25267A07686b50344O7762j954E4637R9905L9054a71143a4883K096B04728
$$ 325267 107686 -250344 -182582 -184536 54637 154542 193596 -171143 -14883 -12787 204728
9671C991J41787c8107J4341H4591a925I5501b10324L7071I2746J7287a04370J0904
$$ 3991 145778 -38107 -23766 84591 -1925 95501 -210324 -173253 92746 110033 -104370 -93466
9659i3466L531B71582a66360g055B8902K9499n915b11458b3566R571a891m53530
$$ -93466 -89935 271582 -166360 -7055 28902 58401 52486 -211458 -23566 -13995 -1891 -455421
9647d55421b01246A0062a69514A32285m907J3971k0184m2113A284b42545k8278
$$ -455421 -201246 10062 -169514 132285 127378 141349 121165 79052 1284 -242545 -270823
9636b70823a28247L2630c5746m1448q9862C7887M2961Q320J9314d59518a36380
$$ -270823 -128247 -95617 -35746 -77194 -167056 37887 80848 89168 108482 -459518 -136380
9624a03952C3363a3130k57620F3976e5483A23091f3828J7510k09460e6975A22238
$$ -103952 33363 -13130 -270750 63976 -55483 123091 -63828 -46318 -255778 -56975 122238
9612F9435A7450a28686O2388l13484a78224E0953j0503d17933A00718O4804a80112
$$ 69435 17450 -128686 -66298 -379782 -178224 50953 40450 -417933 100718 165522 -180112
9600f2336C7780J30671a72083c1278j79923B57547r2365a19036n1439j21708D7461
$$ -62336 37780 168451 -172083 -31278 -211201 257547 165182 -119036 -170475 -292183 47461
9588A01473a34037H3657a69374g0293G1199c26476A90238r4651a895l67265B9681
$$ 101473 -134037 83657 -169374 -70293 71199 -326476 190238 95587 -1895 -369160 29681
9576b43199c6941A23735e0887k75108g840k15329c788m24325f0062L610k1148
$$ -243199 -36941 123735 -50887 -325995 -7840 -223169 -3788 -428113 -60062 -56452 -77600
9565g7600A71747a62912d9697Q078k80976D14598d8473A35055c8841k95671g8598
$$ -77600 171747 -162912 -49697 -41619 -322595 414598 -48473 135055 -38841 -334512 -78598
9553F9785a53361A77116a33089m55J0618A96356c01034J18823M1452j05786C8411
$$ 69785 -153361 177116 -133089 -133544 -122926 196356 -301034 -182211 -140759 -246545 38411
9541c83268k1955J56752b0750m3080F2803h1443q7224m1852l00211c8753B95480
$$ -383268 -405223 -248471 -20750 -63830 62803 -81443 -168667 -210519 -510730 -38753 295480
9529d30575h5241J5668j58782a12143H6499a00365M1292B1687J75776n0718E1788
$$ -430575 -85241 -69573 -228355 -112143 86499 -100365 -59073 21687 197463 146745 51788
9517g1561H544J79210f6042b9597r3709F8183K7134K83769b03819r2330A28643
$$ -71561 8544 187754 -66042 -29597 -123306 68183 95317 379086 -203819 -296149 128643
9505G2569J68370h0985j23021N9199I5558O8089D3941J03377a75565P7606c9198
$$ 72569 240939 -80985 -204006 -144807 95558 163647 43941 147318 -175565 -97959 -39198
9493A04550b47255J08932f6943A32080C0834c21884J10919N7281n7385p5759L9618
$$ 104550 -247255 -138323 -66943 132080 30834 -321884 -210965 -153684 -211069 -286828 -247210
9482b47210A51396c99147a75122o4723b9974k10085A14448m3349l0599a20905
$$ -247210 151396 -399147 -175122 -239845 -29974 -240059 114448 71099 40500 -120905
9471a36411A36150a25544M7687n5432K0331E8832K4847I76a40102B83066a45541
$$ -136411 136150 -125544 -77857 -133289 -112958 58832 83679 976 -140102 283066 -145541
9459b43968I2057B5791f7840C405a85304b9614j75825H0119D509P8138K30776
$$ -243968 92057 25791 -67840 3405 -185304 -29614 -205439 80119 4509 82647 313423
9448C13423j35576p7476b30692c0870j47868j12811e3176K2026C31627B2470L3108
$$ 313423 177847 100371 -230692 -30870 -178738 -291549 -53176 -31150 331627 22470 55578
9437E5578a88328m262j54469h4590j3753c8538k5609k74709P0079A95134b9109
$$ 55578 -188328 -192590 -347059 -84590 -98343 -38538 -64147 -338856 -268777 195134 -29109
9425F8486J43039B6170J7538K2164d89620b12467A06524J38877b11938M041h1236
$$ 68486 211525 26170 43708 65872 -489620 -212467 106524 245401 -211938 -207897 -81236
9413a33360q6117n5511f7077B6264J46334M9699i8618M6325k41931B4202d25806
$$ -133360 -219477 -274988 -67077 26264 172598 222297 -98618 -52293 -294224 24202 -425806
9401a93271i5733A55433F67a62857D6034a84688A05223N8176R022l5720c13218
$$ -193271 -95733 155433 667 -162857 46034 -184688 105223 163399 172421 136701 -313218
9389e01976a90746m3893A49976G4271J25126F4064N5733b36841B7108p468b04894
$$ -501976 -190746 -234639 149976 74271 199397 64064 119797 -236841 27108 19640 -204894
9377B9161b37101i8576k32047A27964K6648J00007b44209b7834k30284m5743j9834
$$ 29161 -237101 -98576 -330623 127964 154612 254619 -244209 -27834 -258118 -303861 -323695
9366c23695g416h00l29935e750j63885b6681A45417a38856o0689f6986P258j96931
$$ -323695 -7416 -800 -330735 -5750 -169635 -26681 145417 -138856 -199545 -66986 -59728 -256659
9354b56659A78693a27736l0682b603j81295C053O1010h490l8650a3008A4681a0991
$$ -256659 178693 -127736 -158418 -2603 -183898 3053 64063 -8490 -47140 -13008 14681 -10991
9341i7183M5440C4019i0216H2329b8819j66486M2009K8015A8717L9038b75530
$$ -97183 -51743 34019 -90216 82329 -28819 -195305 -153296 -125281 18717 57755 -275530
9329B56933p0375a5259j5734k21753F4978a89495Q4574c8471q4429k32296B0363
$$ 256933 186558 -15259 -30993 -252746 64978 -189495 -104921 -38471 -122900 -355196 20363
9317a56631j81905B88977g6435o6781A2196M9505g3700r4459O2002M5064k30954
$$ -156631 -338536 288977 -76435 -143216 12196 61701 -73700 -168159 -106157 -61093 -292047
9306b92047a12408D3685d35970a29207p6207A39994F503J29381b6540G1226Q4599
$$ -292047 -112408 43685 -435970 -129207 -205414 139994 6503 135884 -26540 71226 155825
9295A55825b41944p5526a35436m07636d4594k1245A87875A6485M7612a66015P4697
$$ 155825 -241944 -317470 -135436 -543072 -44594 -65839 187875 16485 64097 -166015 -91318
9284i1318q5275B2347c21296a07090B1761e6504j48558f214E3547c31743c9521
$$ -91318 -176593 22347 -321296 -107090 21761 -56504 -205062 -6214 53547 -331743 -39521
9272c2280G1161b98645j08289L7072c4383m8586A34381c3887j46863j28101b226
$$ -32280 71161 -298645 -406934 -369862 -34383 -82969 134381 -33887 -180750 -308851 -2226
9260D9280J29221J04437i6368A09159j6601J05713C7058b79660p3609a0217o6437
$$ 49280 178501 282938 -96368 109159 92558 198271 37058 -279660 -353269 -10217 -76654
9249g6654H9229O7011p6029J55923h4376A12458K99932a05126C58799b21232i670
$$ -76654 89229 156240 80211 236134 -84376 112458 412390 -105126 358799 -221232 -9670
9237F8182d22807c7035j77428f3908B50298J01807d05738C27492c45458A19033
$$ 68182 -422807 -37035 -214463 -63908 250298 352105 -405738 327492 -345458 119033
9226b53053C7521a37392D6303b83967c1194h497q8141q2708A59761r912c17251
$$ -253053 37521 -137392 46303 -283967 -31194 -8497 -96638 -179346 159761 149849 -317251
9214f9952A80294j8421c28216a29640e6005j52777j66660F4423b40652j1751J810
$$ -69952 180294 161873 -328216 -129640 -56005 -208782 -375442 64423 -240652 -252403 -250593
9203b50593f0363q4533J1809C3839a07144B33872G9093a3650q2716P54I5530J3079
$$ -250593 -60363 -144896 -133087 33839 -107144 233872 79093 -13650 -96366 -95612 95530 108609
9191A08609b73207D0155J91935i8877k78028B59632c12845g9082m35309J35706
$$ 108609 -273207 40155 232090 -98877 -376905 259632 -312845 -79082 -514391 -378685
9181c78685B28556f32m7770k0978a7521j01999K1863L5204r619C7043c81076B48368
$$ -378685 228556 -632 -48402 -69380 -17521 -119520 -97657 -62453 -72072 37043 -381076 248368
9168a88958I169b28745i3755b8373j69333N8599H2520a79211L2048c3378B51527
$$ -188958 9169 -228745 -93755 -28373 -197706 -139107 82520 -179211 -147163 -33378 251527
9156H1342J43858b01487H5219a65943A20982e1132A93401a43073n3172L6809E2593
$$ 81342 225200 -201487 85219 -165943 120982 -51132 193401 -143073 -196245 -159436 52593
9144a21493k49840a01410I7313d60227f6056m01776E9679O6490D736L42747c702
$$ -121493 -371333 -101410 97313 -460227 -66056 -467832 59679 126169 4736 347483 -3702
9132a70206A25509d04539J20456B24289a14064l9695j13481f8267B36795f61A00048
$$ -170206 125509 -404539 -284083 224289 -114064 -153759 -267240 -68267 236795 -661 100048
9120d8627E5765b27387A09466b77025O9398M1223f3610j0451j51002H4970a6784
$$ -48627 55765 -227387 109466 -277025 -207627 -166404 -63610 -74061 -225063 84970 -16784
9108B16004a05105F0061o55k1199a14520o5959B18477c1387A457d8115j98826
$$ 216004 -105105 60061 59406 38207 -114520 -180479 218477 -31387 1457 -48115 -246941
9097b46941g8714j64385F1107b94704A15363b22241C79743a98713k40486A25990
$$ -246941 -78714 -243099 61107 -294704 115363 -222241 379743 -198713 -439199 125990
9086c71617A2978L4638b42963j33134E2377R1253b11565j40677E1349J84274a63366
$$ -371617 12978 47616 -242963 -376097 52377 143630 -211565 -352242 51349 235623 -163366
9074a89881j9999D2901j5581j298J63647F0360E802J74830c91704C10141a39533
$$ -189881 -209880 42901 27320 26022 189669 60360 5802 180632 -391704 310141 -139533
9062b8413j1510B4039g2176K059j93465e3387A12912a00704A23926a00091j08575
$$ -28413 -39923 24039 -72176 -70117 -263582 -53387 112912 -100704 123926 -100091 -208666
9051b08666I0836K86598a27772F4188f2883A18885K9340c59052a5651j75594A25872
$$ -208666 90836 377434 -127772 64188 -62883 118885 148225 -359052 -15651 -191245 125872
9039i6991A1235b52182a22155C2584j1366a99794e5509r0085I4212c79153A3713
$$ -96991 11235 -252182 -122155 32584 21218 -199794 -55509 -145594 94212 -379153 13713
9027g4763j72284b8338A20905c696D3466L5625a58600m6009a1325j62930J368
$$ -74763 -247047 -28338 120905 -3696 43466 79091 -158600 -204609 -11325 -174255 -172887
9016a72887d8403J7313A48420h7331j60993j8234a27068r0732A47218J088c26701
$$ -172887 -48403 -31090 148420 -87331 -248324 -266558 -127068 -217800 147218 148306 -326701
9004A28012a49770B616R9916A8308e9881k18781C07034a16420n4186D34206a09616
$$ 128012 -149770 2616 102532 18308 -59881 -278662 307034 -116420 -170606 434206 -109616
8992b01512E7383a0100A83297J5468i7706q8105p3903j06183P9278f3405j7943
$$ -201512 57383 -10100 183297 198765 -97706 -185811 -259714 -365897 -286619 -63405 -81348
8981h1348E9893a2770C6888g1590l67583J59363F8043a71094J0219H845f31142
$$ -81348 59893 -12770 36888 -71590 -439173 -279810 68043 -171094 -160875 8845 -631142
8969E5878a7658k41499k26682A27279F782b59372A45785E4153J29376D4504a12234
$$ 55878 -17658 -259157 -485839 127279 6782 -259372 145785 54153 183529 44504 -112234
8957I1605j2447L7095B5267b10337d0943k22574A54583c14190G8593J83373h197
$$ 91605 79158 116253 25267 -210337 -40943 -263517 154583 -314190 78593 261966 -8197
8945d16317K4253B55415E2229a79860j63374a63809j58573K9778B02760r7866
$$ -416317 -392064 255415 52229 -179860 -343234 -163809 -322382 -292604 202760 104894
8935A04894D6799M75880d6704C5833j5224J44663a97824B44098f9975A4559O07533
$$ 104894 46799 522679 -46704 35833 20609 165272 -197824 244098 -69975 14559 622092
8924F22092L65459P57915K705679J0443432E562979A494700E19298B34324b20125
$$ 622092 987551 1745466 4451145 14894577 5562979 1494700 519298 234324 -220125
8914D9162a70761p9431A7438K6690b49601B95917A29642N1320b68772J31896B00121
$$ 49162 -170761 -250192 17438 44128 -249601 295917 129642 180962 -268772 -136876 200121
8902f0359G9742R0540a44192A4414a33663o8861L1389L9126B31950e0393A73614
$$ -60359 79742 170282 -144192 14414 -133663 -202524 -171135 -132009 231950 -50393 173614
8890c76995i2772C4180L0312a70122j97482a72282D9058b44066q5958i1358j58479
$$ -376995 -92772 34180 64492 -170122 -367604 -172282 49058 -244066 -330024 -91358 -249837
$$ [...]
##END NTUPLES=NMR SPECTRUM
##END=
