
##TITLE=UV1278_M1_1242-1388_10_7534667_GrO3PQnggz
##JCAMPDX= 6.0         $$ Bruker NMR JCAMP-DX V2.0
##DATA TYPE= NMR SPECTRUM
##DATA CLASS= NTUPLES
##ORIGIN= BRUKER
##OWNER= Administrator
$$ 1.72 TOPSPIN		Version 2.1
$$ 2013-02-21 23:51:14.894 -0500  Administrator@X
$$ Compression mode = diff/dup
##.OBSERVE FREQUENCY= 400.02188249412
##.OBSERVE NUCLEUS= ^1H
##.ACQUISITION MODE= SIMULTANEOUS (DQD)
##.ACQUISITION SCHEME= undefined
##.AVERAGES= 64
##.DIGITISER RES= 22
##SPECTROMETER/DATA SYSTEM= spect
##.PULSE SEQUENCE= noesygpps1d.comp
##.SOLVENT NAME= COFFEE_meoh
##.SHIFT REFERENCE= INTERNAL, COFFEE_meoh, 1, 14.96128
##AUDIT TRAIL= $$ (NUMBER, WHEN, WHO, WHERE, PROCESS, VERSION, WHAT)
$$ ##TITLE= Audit trail, TOPSPIN		Version 2.1
$$ ##JCAMPDX= 5.01
$$ ##ORIGIN= Bruker BioSpin GmbH
$$ ##OWNER= Administrator
$$ $$ E:\/data/COFFEE/nmr/UV1278_M1_1242-1388_10_7534667_GrO3PQnggz/12/pdata/1/auditp.txt
$$ ##AUDIT TRAIL=  $$ (NUMBER, WHEN, WHO, WHERE, PROCESS, VERSION, WHAT)
(   1,<2013-02-21 23:51:08.847 -0500>,<Administrator>,<X>,<go>,<TOPSPIN 2.1>,
      <created by zg
	started at 2013-02-21 23:39:38.719 -0500,
	POWCHK enabled, PULCHK disabled,
       configuration hash MD5:
       86 BA 57 50 F2 9D 5C 9B 26 00 A9 28 5F 66 2E 89
       data hash MD5: 64K
       74 2A 94 07 BF A3 78 F6 13 64 30 ED 81 B1 F9 6E>)
(   2,<2013-02-21 23:51:12.019 -0500>,<Administrator>,<X>,<proc1d>,<TOPSPIN 2.1>,
      <Start of raw data processing
       efp LB = 0.3 FT_mod = 6 PKNL = 1 PHC0 = 0 PHC1 = 0 SI = 128K 
       data hash MD5: 128K
       32 7B CB 00 5A DB A5 AA C7 8F 36 8F 5E 89 BB BF>)
(   3,<2013-02-21 23:51:13.160 -0500>,<Administrator>,<X>,<proc1d>,<TOPSPIN 2.1>,
      <pk PHC0 = 248.4668 PHC1 = 0 
       data hash MD5: 128K
       90 74 3A B6 C8 98 7D 82 DB BF 1F 3D 7C F4 39 B3>)
(   4,<2013-02-21 23:51:13.847 -0500>,<Administrator>,<X>,<proc1d>,<TOPSPIN 2.1>,
      <abs ABSG = 1 
       data hash MD5: 128K
       DF BF 95 B1 82 A4 49 3A F4 1B 50 AF 68 E5 E2 86>)
(   5,<2013-02-21 23:51:14.035 -0500>,<Administrator>,<X>,<proc1d>,<TOPSPIN 2.1>,
      <abs ABSG = 2 
       data hash MD5: 128K
       F2 20 F4 2A 37 28 AA 1D 02 15 7E 18 C2 54 F9 C8>)
(   6,<2013-02-21 23:51:14.222 -0500>,<Administrator>,<X>,<proc1d>,<TOPSPIN 2.1>,
      <abs ABSG = 3 
       data hash MD5: 128K
       8B 98 10 B5 3B FA DA 86 3F 16 0E 17 BF 95 7A 1A>)
(   7,<2013-02-21 23:51:14.378 -0500>,<Administrator>,<X>,<proc1d>,<TOPSPIN 2.1>,
      <abs ABSG = 4 
       data hash MD5: 128K
       00 AB DA B7 E4 8E AB 53 12 50 6F 69 60 7D B9 27>)
(   8,<2013-02-21 23:51:14.550 -0500>,<Administrator>,<X>,<proc1d>,<TOPSPIN 2.1>,
      <abs ABSG = 5 
       data hash MD5: 128K
       66 6D E3 1C B2 23 8F C0 65 BE DE B5 DB 66 52 5B>)
$$ ##END=
$$ 
$$ $$ hash MD5
$$ $$ CF AB E7 E2 64 05 58 F3 B8 4D D3 AF FC 8A 2B C3
##$RELAX= 
##$RELAX= 
##$RELAX= 
##$RELAX= 
##$RELAX= 
##$RELAX= 
##$RELAX= 
##$RELAX= 
$$ Bruker specific parameters
$$ --------------------------
##$DU= <E:\>
##$EXPNO= 12
$$ [...]
150 150 150 150 150 150 150 150
##$TP07= 0
##$TPNAME0= <>
##$TPNAME1= <>
##$TPNAME2= <>
##$TPNAME3= <>
##$TPNAME4= <>
##$TPNAME5= <>
##$TPNAME6= <>
##$TPNAME7= <>
##$TPOAL= (0..7)
0.5 0.5 0.5 0.5 0.5 0.5 0.5 0.5
##$TPOFFS= (0..7)
0 0 0 0 0 0 0 0
##$TUNHIN= 0
##$TUNHOUT= 0
##$TUNXOUT= 0
##$USERA1= <user>
##$USERA2= <user>
##$USERA3= <user>
##$USERA4= <user>
##$USERA5= <user>
##$V9= 5
##$VALIST= <valist>
##$VCLIST= <CCCCCCCCCCCCCCC>
##$VD= 0
##$VDLIST= <DDDDDDDDDDDDDDD>
##$VPLIST= <PPPPPPPPPPPPPPP>
##$VTLIST= <TTTTTTTTTTTTTTT>
##$WBST= 1024
##$WBSW= 4
##$XGAIN= (0..3)
0 0 0 0
##$XL= 0
##$YL= 0
##$YMAX_a= 6605070
##$YMIN_a= -12763437
##$ZGOPTNS= <>
##$ZL1= 120
##$ZL2= 120
##$ZL3= 120
##$ZL4= 120
##$ABSF1= 14.96128
##$ABSF2= -5.596902
##$ABSG= 5
##$ABSL= 3
##$ALPHA= 0
##$AQORDER= 0
##$ASSFAC= 0
##$ASSFACI= 0
##$ASSFACX= 0
##$ASSWID= 0
##$AUNMP= <proc_prof1d_extract.lims>
##$AXLEFT= 0
##$AXNAME= <>
##$AXNUC= <1H>
##$AXRIGHT= 0
##$AXTYPE= 0
##$AXUNIT= <>
##$AZFE= 0.1
##$AZFW= 0.1
##$BCFW= 0
##$BC_mod= 0
##$BYTORDP= 0
##$COROFFS= 0
##$CY= 15
##$DATMOD= 1
##$DC= 0
##$DFILT= <>
##$DTYPP= 0
##$F1P= 0
##$F2P= 0
##$FCOR= 0.5
##$FTSIZE= 131072
##$FT_mod= 6
##$GAMMA= 0
##$GB= 0
##$INTBC= 1
##$INTSCL= 1
##$ISEN= 128
##$LB= 0.3
##$LEV0= 0
##$LPBIN= 0
##$MAXI= 10000
##$MC2= 0
##$MEAN= 0
##$ME_mod= 0
##$MI= 0
##$NCOEF= 0
##$NC_proc= -2
##$NLEV= 6
##$NOISF1= 0
##$NOISF2= 0
##$NSP= 0
##$NTH_PI= 0
##$NZP= 0
##$OFFSET= 14.96128
##$PC= 1
##$PHC0= 248.4668
##$PHC1= 0
##$PH_mod= 1
##$PKNL= yes
##$PPARMOD= 0
##$PPDIAG= 0
##$PPIPTYP= 0
##$PPMPNUM= 2147483647
##$PPRESOL= 1
##$PSCAL= 4
##$PSIGN= 0
##$PYNMP= <proc.py>
##$REVERSE= no
##$SF= 400.020009526936
##$SI= 131072
##$SIGF1= 0
##$SIGF2= 0
##$SINO= 400
##$SIOLD= 131072
##$SPECTYP= <>
##$SREGLST= <1H.CDCl3>
##$SSB= 0
##$STSI= 131072
##$STSR= 0
##$SW_p= 8223.68421052631
##$SYMM= 0
##$S_DEV= 0
##$TDeff= 65536
##$TDoff= 0
##$TI= <>
##$TILT= no
##$TM1= 0
##$TM2= 0
##$TOPLEV= 0
##$USERP1= <user>
##$USERP2= <user>
##$USERP3= <user>
##$USERP4= <user>
##$USERP5= <user>
##$WDW= 1
##$XDIM= 131072
##$YMAX_p= 445001397
##$YMIN_p= -12122
##$CURPLOT= <Network HP LaserJet P1505>
##$CURPRIN= <$Network HP LaserJet P1505>
##$DFORMAT= <normdp>
##$LAYOUT= <+/1D_H.xwp>
##$LFORMAT= <normlp>
##$PFORMAT= <normpl>
##$SURQMSG= 1
$$ End of Bruker specific parameters
$$ ---------------------------------
##NTUPLES= NMR SPECTRUM
##VAR_NAME=  FREQUENCY,     SPECTRUM/REAL,   SPECTRUM/IMAG
##SYMBOL=    X,             R,               I
##VAR_TYPE=  INDEPENDENT,   DEPENDENT,       DEPENDENT
##VAR_FORM=  AFFN,          ASDF,            ASDF
##VAR_DIM=   131072,        131072,          131072
##UNITS=     HZ,            ARBITRARY UNITS, ARBITRARY UNITS
##FACTOR=    0.0627417313425164, 1,          1
##FIRST=     8223.62146879497, -1058,        -71260
##LAST=      0,             875,             -71959
##MIN=       0,             -12122,          0
##MAX=       8223.62146879497, 445001397,    0
$$ Real data points
##PAGE= N=1
##DATA TABLE= (X++(R..R)), XYDATA
$$ [...]
63795C53493o491n858m778m031m104m760n469n724n192m093l221k983k817k112
$$ 353493 347002 341144 336366 332335 328231 323471 318002 312278 307086 302993 299772 296789 293972 291860
63781B91860j326j345j954j959q96K93N95Q2n84j170j797k297k242j566p23k47
$$ 291860 290534 289189 287235 285276 284380 284673 285268 285350 284766 283596 281799 279502 277260 275694 274971 274724
63765B74724l10o79j017j197j315j398j219o19R3L59P7j98J52J065J831J834J187
$$ 274724 274414 273735 272718 271521 270206 268808 267589 266970 267063 267422 267499 267301 267453 268518 270349 272183 273370
63748B73370N87M91O00L46j94l54J19N93M63J34N55J906L303L824L437K718K081
$$ 273370 273957 274448 275048 275394 275200 274846 274965 275558 276021 276155 276710 278616 281919 285743 289180 291898 293979
63731B93979J556J199J294J955K758L070K904L035M048N467O349O549O760P272
$$ 293979 295535 296734 298028 299983 302741 305811 308715 311750 315798 321265 327614 334163 340923 348195
63717C48195P533P146O541O119N404L790J667kj012k020l394m691n334n159m294
$$ 348195 355728 362874 369415 375534 380938 384728 386395 386393 385381 383361 379967 375276 369942 364783 360489
63702C60489l088k238k260k675k360j048J52J77n38o71K63J489K183K417K722
$$ 360489 357401 355163 352903 350228 347868 346820 346972 347149 346611 345940 346203 347692 349875 352292 355014
63687C55014L223L594L566L113K275J174J22n63q91j001p64N2J120J691J630J711
$$ 355014 358237 361831 365397 368510 370785 371959 372081 371518 370627 369626 368862 368914 370034 371725 373355 375066
63671C75066K366K818K274J461J830L354M344L779K631K304K752K918K333J276
$$ 375066 377432 380250 382524 383985 385815 389169 393513 397292 399923 402227 404979 407897 410230 411506
63657D11506j52k088m201n772o546o894p149p257p037o307m908l064j595j164
$$ 411506 411354 409266 405065 399293 392747 385853 378704 371447 364410 358103 353195 350131 348536 347372
63643C47372j371j127N2J571K630L012L002K946L166L866M848N524N436M761M206
$$ 347372 346001 344874 344926 346497 349127 352139 355141 358087 361253 365119 369967 375491 380927 385688 389894
63628C89894M348M997N349M954M439M789N931O771O829P043Q330J0135J1261J1700
$$ 389894 394242 399239 404588 409542 413981 418770 424701 431472 438301 445344 453674 463809 475070 486770
63614D86770J2497J4012J5490J6506J7799K0136K3083K5491K6821K7530K8354
$$ 486770 499267 513279 528769 545275 563074 583210 606293 631784 658605 686135 714489
63603G14489K9579L0870L1529L0867K8457K4159J8092J0850L518k753p244r712
$$ 714489 744068 774938 806467 837334 865791 889950 908042 918892 922410 919657 912413 902701
63591I02701j0230r337p971o921o423o576p746j0142j3350j6819k0392k3787k5981
$$ 902701 892471 883134 875163 868242 861819 855243 847497 837355 824005 807186 786794 763007 737026
63578G37026k6102k4735k3344k2369k0850j8075j4587j1281q425n998m123k619
$$ 737026 710924 686189 662845 640476 619626 601551 586964 575683 567258 561260 557137 554518
63566E54518q52J371L313M332M766N234N597N436N125N473O493P334P626Q141
$$ 554518 553666 555037 558350 562682 567448 572682 578279 583715 588840 594313 600806 608140 615766 623907
63552F23907R872J2859J6207J9003K1058K3021K5900L0255L5764M1630M7389N2787
$$ 623907 633779 646638 662845 681848 702906 725927 751827 782082 817846 859476 906865 959652
63540I59652N6686N6486M9550L5652J7883Q07j2295k0532k4354k4384k1433j6960
$$ 959652 1016338 1072824 1122374 1158026 1175909 1176716 1164421 1143889 1119535 1095151 1073718 1056758
63528A056758j2636r363p108n644n273o734j0560j6446k3139k9165l3742l6843
$$ 1056758 1044122 1034759 1027651 1022007 1016734 1010000 999440 982994 959855 930690 896948 860105
63516H60105l8388l7958l5645l2597l0025k7949k5556k2621j9859j7905j6693
$$ 860105 821717 783759 748114 715517 685492 657543 631987 609366 589507 571602 554909
63505E54909j5838j5036j3970j2440j0785r628r061q530p668o664n712m687l681
$$ 554909 539071 524035 510065 497625 486840 477212 468151 459621 451953 445289 439577 434890 431209
63492D31209l218l493l793l245j889o29j65l35m61o8P75J767K798L930M951N360
$$ 431209 427991 424498 420705 417460 415571 414942 414777 414442 413981 413913 414688 416455 419253 423183 428134 433494
63476D33494N080M837N307O110O297N685M980M540L819K330M67j081k216l276
$$ 433494 438574 443411 448718 454828 461125 466810 471790 476330 480149 482479 482946 481865 479649 476373
63462D76373m313n015n155m787m142l463k893k347j703j095p63o61n25k96n1M17
$$ 476373 472060 467045 461890 457103 452961 449498 446605 444258 442555 441460 440697 440036 439511 439215 439164 439581
63446D39581J512L153M786O147P498Q958J0200J1031J1758J2711J4013J5964J9109
$$ 439581 441093 444246 449032 455179 462677 471635 481835 492866 504624 517335 531348 547312 566421
63433E66421K3493K8504L3882M0143M7145N2629N3084M6365L3314J7243K240q538
$$ 566421 589914 618418 652300 692443 739588 792217 845301 891666 924980 942223 944463 935925
63421I35925j3956j4868j2885r119m057J923Q449J5363K2411K8710L3035L4736
$$ 935925 921969 907101 894216 885097 881040 882963 891412 906775 929186 957896 990931 1025667
63409A025667L4031L1314K6558J9699J1380L000m060r141j2221j3386j2738j0888
$$ 1025667 1059698 1091012 1117570 1137269 1148649 1151649 1147589 1138448 1126227 1112841 1100103 1089215
63397A089215r114q659r911j2475j5866j9849k4249k8820l3193l6680l8380l7950
$$ 1089215 1080101 1071442 1061531 1049056 1033190 1013341 989092 960272 927079 890399 852019 814069
63385H14069l6125l3982l1816k9246k6226k3130k0059j6824j3737j1460r842p845
$$ 814069 777944 743962 712146 682900 656674 633544 613485 596661 582924 571464 561622 553777
63373E53777m993k018K91K082L743N107O098P426R680J2255J4055J5047J6254
$$ 553777 548784 546766 547057 549139 552882 557989 564087 571513 581193 593448 607503 622550 638804
63360F38804J8334K0930K3373K5495K7664L0383L3742L7021L9134L9757L9672
$$ 638804 657138 678068 701441 726936 754600 784983 818725 855746 894880 934637 974309
63349I74309L9508L8540L5380K9596K2057J3894N793j615p448j0966j2081j1419
$$ 974309 1013817 1052357 1087737 1117333 1139390 1153284 1159077 1157462 1150014 1139048 1126967 1115548
63337A115548j0048q955q570q823r842j2289j6657k2321k7761l1658l3651l4202
$$ 1115548 1105500 1096545 1087975 1079152 1069310 1057021 1040364 1018043 990282 958624 924973 890771
63325H90771l3945l3082l1193k7764k3025j7950j3247q594l178L076Q760J1252
$$ 890771 856826 823744 792551 764787 741762 723812 710565 701971 698793 701869 710629 721881
63313G21881Q041j326j4118k5843l3268l5931l5014l1745k7276k2931j9456j6466
$$ 721881 729922 728596 714478 688635 655367 619436 584422 552677 525401 502470 483014 466548
63301D66548j3307j0156p665o024n069m748m819m610l879l405l847m548m424l619
$$ 466548 453241 443085 435420 429396 424327 419579 414760 410150 406271 402866 399019 394471 390047 386428
63287C86428l120l124k951k430k096k039j805j493j762k455k460j392k99j03l07
$$ 386428 383308 380184 377233 374803 372707 370668 368863 367370 365608 363153 360693 359301 359002 358899 358592
63272C58592MP17J030P71N10O88J241J900K351K280J699J114J054J496K039K451
$$ 358592 358596 359313 360343 361114 361624 362312 363553 365453 367804 370084 371783 372897 373951 375447 377486 379937
63256C79937K785L102L337L483L666M033M535M887M891M799N156O073O974P353
$$ 379937 382722 385824 389161 392644 396310 400343 404878 409765 414656 419455 424611 430684 437658 445011
63242D45011P466P859Q524R088R606J0442J1476J2178J2632J3714J5939J8718
$$ 445011 452477 460336 468860 477948 487554 497996 509472 521650 534282 547996 563935 582653
63230E82653K1066K2595K3460K3802K3716K3482K3426K3568K3683K3642K3556
$$ 582653 603719 626314 649774 673576 697292 720774 744200 767768 791451 815093 838649
63219H38649K3623K3937K4360K4692K4932K5243K5563K5501K4870K3964K2939
$$ 838649 862272 886209 910569 935261 960193 985436 1010999 1036500 1061370 1085334 1108273
63208A108273K1200J7979J3313P857J892m801j2065j9087k5121k9958l3466l5288
$$ 1108273 1129473 1147452 1160765 1168622 1170514 1165713 1153648 1134561 1109440 1079482 1046016 1010728
63196A010728l5308l4000l2035k9757k7184k4149k0393j5851j0963o400k413J262
$$ 1010728 975420 941420 909385 879628 852444 828295 807902 792051 781088 774688 772275 773537
63184G73537M906Q590J2353J6109J9400K1771K3480K5261K7360K9231L0289L0454
$$ 773537 778443 787033 799386 815495 834895 856666 880146 905407 932767 961998 992287 1022741
63172A022741K9923K8959K8019K7459K6991K5930K4137K2205K0515J8650J5932
$$ 1022741 1052664 1081623 1109642 1137101 1164092 1190022 1214159 1236364 1256879 1275529 1291461
63161A291461J2077P107J200n271j1977j9009k6435l3497l9042m2886m5863m8297
$$ 1291461 1303538 1310645 1311845 1306574 1294597 1275588 1249153 1215656 1176614 1133728 1087865 1039568
63149A039568m9307m8210m5658m2789l9861l6529l2807k9073k5481k2148j9447
$$ 1039568 990261 942051 896393 853604 813743 777214 744407 715334 689853 667705 648258
63138F48258j7462j5562j3219j0878r288q309p204n842m705l838k744j422o15
$$ 648258 630796 615234 602015 591137 581849 573540 566336 560494 555789 551951 549207 547785 547170
63125E47170p10j062p78K74J526K410K762K826L053L670M322M385L769L140L110
$$ 547170 546460 545398 544620 544894 546420 548830 551592 554418 557471 561141 565463 569848 573617 576757 579867
63110E79867L465L418K570J371O42P57J438K161K566K406J495P1j011j011k85
$$ 579867 583332 586750 589320 590691 591333 592090 593528 595689 598255 600661 602156 602227 601216 600205 599920
63095E99920N0m10p59o1J319K261K435K532L041L549L475K931K389J903J111K
$$ 599920 599970 599560 598801 598740 600059 602320 604755 607287 610328 613877 617352 620283 622672 624575 625686 625688
63079F25688q02o98J54J019J458J758K363L204L907M464N286O532P803Q713R408
$$ 625688 624886 624188 624342 625361 626819 628577 630940 634144 638051 642515 647801 654333 662136 670849 680257
63064F80257J0248J1248J2103J2728J3452J4663J6439J8561K0846K3363K6270
$$ 680257 690505 701753 713856 726584 740036 754699 771138 789699 810545 833908 860178
63053H60178K9436L2471L5244L8146M1548M5158M8335N0957N3493N6170N8526
$$ 860178 889614 922085 957329 995475 1037023 1082181 1130516 1181473 1234966 1291136 1349662
63042A349662N9970O0445O0322N9998N9751N9681N9537N8900N7733N6531N5771
$$ 1349662 1409632 1470077 1530399 1590397 1650148 1709829 1769366 1828266 1885999 1942530 1998301
63031A998301N5394N4975N4124N2589N0163M6651M1686L4624K4947J2915n31j4551
$$ 1998301 2053695 2108670 2162794 2215383 2265546 2312197 2353883 2388507 2413454 2426369 2425838 2411287
63019B411287k8735m2610n5264o5767p3617p8658q0904q0624p8221p3911o7870
$$ 2411287 2382552 2339942 2284678 2218911 2145294 2066636 1985732 1905108 1826887 1752976 1685106
63008A685106o0738n3288m5528l6769k6906j6913p685R23R353J7358K4440L0680
$$ 1685106 1624368 1571080 1525552 1488783 1461877 1444964 1437279 1438202 1447555 1464913 1489353 1520033
62996A520033L6313M0950M4078M6046M7731M9347N0403N0696N0642N0592N0496
$$ 1520033 1556346 1597296 1641374 1687420 1735151 1784498 1834901 1885597 1936239 1986831 2037327
62985B037327N0206M9514M7943M5138M1395L7124L1818K4362J4455L025r008k1592
$$ 2037327 2087533 2137047 2184990 2230128 2271523 2308647 2340465 2364827 2379282 2382307 2373299 2351707
62973B351707l4820m7972n9870o9802p7727q3806q8089r0505r0904q9234q5782
$$ 2351707 2316887 2268915 2209045 2139243 2061516 1977710 1889621 1799116 1708212 1618978 1533196
62962A533196q1033p5326o8953o2514n6716n1702m7092m2843l9514l7321l5531
$$ 1533196 1452163 1376837 1307884 1245370 1188654 1136952 1089860 1047017 1007503 970182 934651
62951I34651l3312l0837k8893k7607k6257k4290k1965j9828j8053j6597j5557
$$ 934651 901339 870502 841609 814002 787745 763455 741490 721662 703609 687012 671455
62940F71455j4989j4567j3819j2723j1720j1073j0427r271p666o312n799n962
$$ 671455 656466 641899 628080 615357 603637 592564 582137 572866 565200 558888 553089 547127
62928E47127o064n556m549l628l300l548l903l866l348k595j822j075n82q40k007
$$ 547127 541063 535507 530958 527330 524030 520482 516579 512713 509365 506770 504948 503873 503291 502451 500444
62913E00444l346l766l018j917j172n07O20J854K247J662J001Q31N27o44k167
$$ 500444 497098 493332 490314 488397 487225 486718 487338 489192 491439 493101 494102 494933 495460 494816 492649
62898D92649k804k177j070k54J74K96kn78q89o76k45J05L80M10j32q47o57O92
$$ 492649 489845 487668 486598 486344 486518 486814 486812 486234 485345 484669 484424 484529 484909 485319 485187 484340 483683 484375
62880D84375J968K087J615J700K217K230J709J361J013k81k386l870m019l735
$$ 484375 486343 488430 490045 491745 493962 496192 497901 499262 500275 499994 497608 493738 489719 485984
62866D85984l925m180l737k772j980j631j680k096k498k253j422q53q10m47O59
$$ 485984 482059 477879 474142 471370 469390 467759 466079 463983 461485 459232 457810 456957 456147 455700 456359
62851D56359J501J103J39q1M56P53N25M17O87R08R25J078J357J273O94N3l27m79
$$ 456359 457860 458963 459102 459021 459477 460230 460755 461172 461859 462767 463692 464770 466127 467400 468094 468147 467820 467341
62833D67341l90l6J79j81p96q80k97L69Q60J538K508L296L673M003M431M371L416
$$ 467341 466951 466915 467094 466913 466117 465237 464940 465309 466169 467707 470215 473511 477184 481187 485618 489989 493405
62816D93405K178J644J960K402K441K391K931M220N588O139N657M847M613N188
$$ 493405 495583 497227 499187 501589 504030 506421 509352 513572 519160 525299 530956 535803 540416 545604
62802E45604O103O794P094P233P638Q606R951J1087J1620J1731J1885J2415J3558
$$ 545604 551707 558501 565595 572828 580466 589072 599023 610110 621730 633461 645346 657761 671319
62789F71319J5465J7900K0325K2603K5208K8405L1757L4984L8747M3800M9797
$$ 671319 686784 704684 725009 747612 772820 801225 832982 867966 906713 950513 1000310
62778A000310N5732O1303O6942P2736P8221Q3184Q7794R1838R4685R6095R6231
$$ 1000310 1056042 1117345 1184287 1257023 1335244 1418428 1506222 1598060 1692745 1788840 1885071
62767A885071R4755R0751Q3823P4442O2942M9021L2710J5100k444j9375l5806
$$ 1885071 1979826 2070577 2154400 2228842 2291784 2340805 2373515 2388615 2386171 2366796 2330990
62756B330990n1620o6182p8584q7953r3856r6736r7601r7049r4952r1251q6579
$$ 2330990 2279370 2213188 2134604 2046651 1952795 1856059 1758458 1661409 1566457 1475206 1388627
62745A388627q1747p6989p2040o6614o0547n3905m7305m1754l7627l4129l0251
$$ 1388627 1306880 1229891 1157851 1091237 1030690 976785 929480 887726 850099 815970 785719
62734G85719k6044k2468k0054j8267j6298j3963j1665r688p928o285m940m047
$$ 785719 759675 737207 717153 698886 682588 668625 656960 647272 639344 633059 628119 624072
62722F24072l295k162o38P04J594K549M104N924P242Q040R167J1183J3665J5858
$$ 624072 620777 618615 617977 618681 620275 622824 626928 632852 640094 648134 657301 668484 682149 698007
62708F98007J7655J9696K2654K6523L0490L3694L6267L9374M3904M9405N4757
$$ 698007 715662 735358 758012 784535 815025 848719 884986 924360 968264 1017669 1072426
62697A072426N9613O4494O9682P4824P9718Q4649Q9715R4432R8252J00892J01789
$$ 1072426 1132039 1196533 1266215 1341039 1420757 1505406 1595121 1689553 1787805 1888697 1990486
62686A990486R9874R4346Q5370P3645N9597M3257K4758M702j5827l5552n3564
$$ 1990486 2090360 2184706 2270076 2343721 2403318 2446575 2471333 2476035 2460208 2424656 2371092
62675B371092o9655q3740r5093j02644j06160j06589j05084j02151r7951r2815
$$ 2371092 2301437 2217697 2122604 2019960 1913800 1807211 1702127 1599976 1502025 1409210
62665A409210q7131q1084p4856o8758o2896n7020n0946m4900l9296l4476l0700
$$ 1409210 1322079 1240995 1166139 1097381 1034485 977465 926519 881619 842323 807847 777147
62654G77147k7981k5831k3560k1041j8731j6923j5427j4114j3170j2569j1881
$$ 777147 749166 723335 699775 678734 660003 643080 627653 613539 600369 587800 575919
62643E75919j0894r899r070q105o870n762n025m245l066j844j042m18L98R45L84
$$ 575919 565025 555126 546056 537951 531081 525319 520294 516049 512983 511139 510097 509679 510077 511022 511406
62628E11406j226k820l563l524l114k479j722j128q59o81l83k10m88q90n61Q31
$$ 511406 510180 507360 503797 500273 497159 494680 492958 491830 490971 490290 489907 489697 489209 488319 487758 488589
62612D88589K441L117K804K570L145M002M305M196M538N681P149Q432R450J0360
$$ 488589 491030 494147 496951 499521 502666 506668 510973 515169 519707 525388 532537 540969 550419 560779
62598E60779J1541J3675J7116K1202K4848K7772L0459L3046L5274L7483M0484
$$ 560779 572320 585995 603111 624313 649161 676933 707392 740438 775712 813195 853679
62587H53679M4094M6915M8013M7831M6843M4491M0172L4365K7781K0187J1167
$$ 853679 897773 944688 992701 1040532 1087375 1131866 1172038 1206403 1234184 1254371 1265538
62576A265538J402p856j6198k3952l1013l6787m1103m4215m6051m6333m5341m3718
$$ 1265538 1266940 1259084 1242886 1218934 1187921 1151134 1110031 1065816 1019765 973432 928091 884373
62564H84373m1578l8604l5085l1940k9597k7487k4883k1743j8537j5701j3392
$$ 884373 842795 804191 769106 737166 707569 680082 655199 633456 614919 599218 585826
62553E85826j1501r871q666q283q632q868q333p395o704o017m581k536r15k19
$$ 585826 574325 564454 555788 547505 538873 530005 521672 514277 507573 501556 496975 494439 493524 493305
62539D93305J80R27J759K127K138K377L018L563L364K326J124P47J650L435N420
$$ 493305 493485 494412 496171 498298 500436 502813 505831 509394 512758 515084 516208 516955 518605 522040 527460
62524E27460P295R036J0583J1985J3632J5764J8011J9940K1859K4473K7892L1593
$$ 527460 534755 543791 554374 566359 579991 595755 613766 633706 655565 680038 707930 739523
62512G39523L5295L9157M3139M6849N0134N3219N6144N8594O0304O1039O0168
$$ 739523 774818 813975 857114 903963 954097 1007316 1063460 1122054 1182358 1243397 1303565
62501A303565N6957N1458M4380L5967K5852J4282K770p110j4902k0793k4618k6196
$$ 1303565 1360522 1411980 1456360 1492327 1518179 1532461 1535231 1528121 1513219 1492426 1467808 1441612
62489A441612k6139k5425k4103k1254j6403j0459m912m21L535P725J2174J6003
$$ 1441612 1415473 1390048 1365945 1344691 1328288 1317829 1312917 1312496 1316031 1323756 1335930 1351933
62477A351933J7965J7014J2652N366l174j0775j6349k0868k6370l3834m2239m9618
$$ 1351933 1369898 1386912 1399564 1404930 1401756 1390981 1374632 1353764 1327394 1293560 1251321 1201703
62465A201703n4613n7080n7693n7276n6218n4306n1241m7289m3165l9200l5073
$$ 1201703 1147090 1090010 1032317 975041 918823 864517 813276 765987 722822 683622 648549
62454F48549l0501k5798k1518j7839j4654j1948r785q066o640n487m534l475k145
$$ 648549 618048 592250 570732 552893 538239 526291 516506 508440 501800 496313 491779 488304 486159
62441D86159r07k80j59J34R27J739J981J789J782K130K309J873J054L86o2p38
$$ 486159 485252 484972 484813 484947 485874 487613 489594 491383 493165 495295 497604 499477 500531 500917 500855 500117
62425E00117j995l676n264o246o384n837n142m727m541m230l698l102k488j830
$$ 500117 498122 494446 489182 482936 476552 470715 465573 460846 456305 452075 448377 445275 442787 440957
62411D40957j446j768k501k650j802q09p05j310j573j052l57j84m59n98k17N55
$$ 440957 439511 437743 435242 432592 430790 429981 429276 427966 426393 425341 424984 424800 424341 423743 423526 424081
62395D24081J260J614J947K902M491N810O047N438M768M262L679L256L688N067
$$ 424081 425341 426955 428902 431804 436295 442105 448152 453590 458358 462620 466299 469555 473243 478310
62381D78310O581P414P416O835O081N870O831Q550R675R386Q298P505P266P160
$$ 478310 484891 492305 499721 506556 512637 518507 525338 533888 543563 552949 561247 568752 576018 583178
62367E83178P045P171P670Q562J0159J2742J5908J8824K1286K3984K7508L1584
$$ 583178 590223 597394 605064 613626 623785 636527 652435 671259 692545 716529 744037 775621
62355G75621L5647L9754M4389M9481N4179N7665N9811O0769O0289N7792N2957
$$ 775621 811268 851022 895411 944892 999071 1056736 1116547 1177316 1237605 1295397 1348354
62344A348354M5846L6702K6131J5550O618j25n681j1309j7204k2890k8328l3880
$$ 1348354 1394200 1430902 1457033 1472583 1479201 1479076 1473395 1462086 1444882 1421992 1393664 1359784
62332A359784l9273m3508m5898m6667m6378m5263m3357m0864l8100l5405l3157
$$ 1359784 1320511 1277003 1231105 1184438 1138060 1092797 1049440 1008576 970476 935071 901914
62321I01914l1576l0384k9036k7407k5876k4627k3342k1806k0341j9217j8053
$$ 901914 870338 839954 810918 783511 757635 733008 709666 687860 667519 648302 630249
62310F30249j6294j4118j2312j1277j0526r291p422n536m345l907l605k899j977
$$ 630249 613955 599837 587525 576248 565722 556431 549009 543473 539128 535221 531616 528717 526740
62297E26740j467j503j511r69p3O40J043J469K103K671K777K354J756J454J632
$$ 526740 525273 523770 522259 521290 521217 521857 522900 524369 526472 529143 531920 534274 536030 537484 539116
62282E39116J962J864J118J42m23l69k4K36M04P40J371K110K674L015L430M272
$$ 539116 541078 542942 544060 544202 543779 543410 543386 543622 544026 544766 546137 548247 550921 553936 557366 561638
62266E61638N594P121Q607J0155J2148J4812J7942K1147K4355K7955L2315L7283
$$ 561638 567232 574353 582960 593115 605263 620075 638017 659164 683519 711474 743789 781072
62254G81072M2295M6911N1078N4894N8337O1220O3137O3379O1160N6098M8396
$$ 781072 823367 870278 921356 976250 1034587 1095807 1158944 1222323 1283483 1339581 1387977
62243A387977L8638K7707J6885P331q51q741j7336k6377l4726m1623m7125n1535
$$ 1387977 1426615 1454322 1471207 1478538 1477687 1468946 1451610 1425233 1390507 1348884 1301759 1250224
62231A250224n4926n7190n8171n7676n5667n2423m8313m3497l8139l2788k8163
$$ 1250224 1195298 1138108 1079937 1022261 966594 914171 865858 822361 784222 751434 723271
62220G23271k4589k1827j9453j7150j4853j2876j1652j1115j0578r566q456p761
$$ 723271 698682 676855 657402 640252 625399 612523 600871 589756 579178 569612 561156 553395
62208E53395p141n856m049k721k374k415k145j656j379j271q90RJ313K699L757
$$ 553395 546254 540398 536349 533628 531254 528839 526694 525038 523659 522388 521498 521507 522820 525519 529276
62193E29276M269M527N092O098P118P841Q490R330J0178J0722J1058J1501J2071
$$ 529276 533545 538072 543164 549262 556380 564221 572711 582041 592219 602941 613999 625500 637571
62180F37571J2437J2314J1724J0838R738Q333O505M429K684J823J876K494L601
$$ 637571 650008 662322 674046 684884 694622 702955 709460 713889 716573 718396 720272 722766 726367
62167G26367N577Q724J2841J7402K2040K6718L1563L6567M1325M5180M7627M8426
$$ 726367 731944 740668 753509 770911 792951 819669 851232 887799 929124 974304 1021931 1070357
62155A070357M7194M3293L6582K8082J9374J1472M630j102n767r873j4126j8723
$$ 1070357 1117551 1160844 1197426 1225508 1244882 1256354 1260984 1259882 1254115 1244242 1230116 1211393
62143A211393k3366k7857l2021l5169l6447l5821l3947l1040k6757k1463j6478
$$ 1211393 1188027 1160170 1128149 1092980 1056533 1020712 986765 955725 928968 907505 891027
62132H91027j2531q860m555o9L485N981Q316J1023J3645J5500J6458J6923J7386
$$ 891027 878496 869636 865081 865012 868497 874478 882794 893817 907462 922962 939420 956343 973729
62119I73729J8025J8481J8165J6952J5265J3458J1424R157P141N790M768L213
$$ 973729 991754 1010235 1028400 1045352 1060617 1074075 1085499 1094656 1101797 1107587 1112355 1115568
62107A115568M58l704q911j4052j7615j8694j7475j4523j0268n489j605L54P31
$$ 1115568 1116026 1112322 1103411 1089359 1071744 1053050 1035575 1021052 1010784 1005295 1003690 1004044 1004775
62094A004775N78N08P91J942M178O612Q060Q594R295J0492J1334J1373J1437J2433
$$ 1004775 1005353 1005861 1006652 1008594 1012772 1019384 1027444 1036038 1045333 1055825 1067159 1078532 1089969 1102402
62080A102402J4036J5240J5754J6274J7622J9996K2838K5173K6346K6657K6955
$$ 1102402 1116438 1131678 1147432 1163706 1181328 1201324 1224162 1249335 1275681 1302338 1329293
62069A329293K7440K7230K5450K2352J8999J6053J3459J1150R562R235J0203J2067
$$ 1329293 1356733 1383963 1409413 1431765 1450764 1466817 1480276 1491426 1500988 1510223 1520426 1532493
62057A532493J4468J7149J9457K0191J8455J4804J1023Q405O524M062N73l302
$$ 1532493 1546961 1564110 1583567 1603758 1622213 1637017 1648040 1656445 1662969 1667031 1667604 1664302
62045A664302p223j1929j8206k5673l3138l9826m5688n0672n4397n6649n7700
$$ 1664302 1657079 1645150 1626944 1601271 1568133 1528307 1482619 1431947 1377550 1320901 1263201
62034A263201n7879n7082n5036n1900m8289m4689m1113l7321l3201k8859k4497
$$ 1263201 1205322 1148240 1093204 1041304 993015 948326 907213 869892 836691 807832 783335
62023G83335k0489j7363j5436j4396j3464j2187j0873j0134j0119j0379j0427
$$ 783335 762846 745483 730047 715651 702187 690000 679127 668993 658874 648495 638068
62012F38068j0108r462q514p418o501n861m993l202n51J945L318L703M092N166
$$ 638068 627960 618498 609984 602566 596065 590204 585211 582009 581458 583403 586721 590424 594516 599682
61998E99682O695Q023Q692Q503P441N796M063K425N74j631l683n016n893p188
$$ 599682 606377 614400 623092 631595 639036 644832 648895 651320 651894 650263 646580 641564 635671 628483
61984F28483r288j1602j3204j3617j2980j1815j0713r975r444q800p974p108o267
$$ 628483 619195 607593 594389 580772 567792 555977 545264 535289 525845 517045 509071 501963 495696
61971D95696n480m915m629m267l430k315j573j499j779j949j768j158k48N70J028
$$ 495696 490216 485301 480672 476405 472975 470660 469087 467588 465809 463860 462092 460934 460686 461256 462284
61956D62284J408K092K839L168L306L952N075N874O143O712Q091R632J0751J2043
$$ 462284 463692 465784 468623 471791 475097 479049 484124 489998 496141 502853 510944 520576 531327 543370
61942E43370J4291J6958J8813J9786K1014K3012K4846K5486K5304K5495K6414
$$ 543370 557661 574619 593432 613218 634232 657244 682090 707576 732880 758375 784789
61931G84789K7079K6429K4645K2854K1671K0488J8399J5401J2169Q942N372J384
$$ 784789 811868 838297 862942 885796 907467 927955 946354 961755 973924 982866 988238 989622
61919I89622k537o055r225j1817j3158j3062j2219j1178r614p076l835l35L566
$$ 989622 987085 981030 971805 959988 946830 933768 921549 910371 900757 893681 889846 889511 893077
61906H93077P993J2225J5320J7319J8860J9847J9374J7033J3385R050M110j345
$$ 893077 901070 913295 928615 945934 964794 984641 1004015 1021048 1034433 1043483 1047593 1046248
61894A046248o706j1297j4951j7832k0073k1735k2893k3510k3458k2776k1774
$$ 1046248 1039542 1028245 1013294 995462 975389 953654 930761 907251 883793 861017 839243
61883H39243k0727j9644j8382j6917j5445j4309j3744j3660j3761j3856j3876
$$ 839243 818516 798872 780490 763573 748128 733819 720075 706415 692654 678798 664922
61872F64922j3578j2565j0740q470o143l894j924o00J39J108L055N722Q149R795
$$ 664922 651344 638779 628039 619569 613426 609532 607608 607008 607147 608255 611310 617032 625181 634976
61858F34976J1000J2462J4581J7252K0091K2886K5935K9644L3676L6996L9063
$$ 634976 645976 658438 673019 690271 710362 733248 759183 788827 822503 859499 898562
61847H98562M0463M1994M3593M4649M4943M4552M3102L9903L4809K8415K1430
$$ 898562 939025 981019 1024612 1069261 1114204 1158756 1201858 1241761 1276570 1304985 1326415
61836A326415J4286P232L15o630j3478j9357k3114k4206k2861j9583j4877r255
$$ 1326415 1340701 1347933 1348248 1341618 1328140 1308783 1285669 1261463 1238602 1219019 1204142 1194887
61824A194887l083L468R959J5441J9048K0627K0387J8343J4501R168K459n908
$$ 1194887 1191804 1195272 1205231 1220672 1239720 1260347 1280734 1299077 1313578 1322746 1325205 1319297
61812A319297j5572k4753l1538l5817l8906m1491m2965m2809m1441l9404l6758
$$ 1319297 1303725 1278972 1247434 1211617 1172711 1131220 1088255 1045446 1004005 964601 927843
61801I27843l3674l0737k8164k5438k2258j9221j7052j5681j4551j3342j1985
$$ 927843 894169 863432 835268 809830 787572 768351 751299 735618 721067 707725 695740
61790F95740j0429q902p967p784p708p157o510o516p009o945n768m168l196l063
$$ 695740 685311 676409 668442 660658 652950 645793 639283 632767 625758 618813 613045 608877 605681 602618
61776F02618l112k784k183j685j356j047p72o38m95m3N67Q24O46O41J228J970
$$ 602618 599506 596722 594539 592854 591498 590451 589679 589041 588546 588503 589070 589894 590540 591181 592409 594379
61760E94379K227K109K274L027M097N056N480N029L875K875K680K881K542J400
$$ 594379 596606 598715 600989 604016 608113 613169 618649 623678 627553 630428 633108 635989 638531 639931
61746F39931Oj131j874k116j862j640k113l191m068m160l503k344r66J45O18P36
$$ 639931 639937 638806 636932 634816 632954 631314 629201 626010 621942 617782 614279 611935 610969 611114 611732 612468
61730F12468J017J349J226Q26J001K081L482M689N850P088Q017Q334Q313Q260
$$ 612468 613485 614834 616060 616886 617887 619968 623450 628139 633989 641077 649094 657428 665741 674001
61716F74001Q052P556P107P072P295P211O288M256J340j608l630m516m780m820
$$ 674001 682053 689609 696716 703788 711083 718294 724582 728838 730178 728570 724940 720424 715644 710824
61702G10824m621m330m422n031n686n950n870n657n431n401n719o017n747n109
$$ 710824 706203 701873 697451 692420 686734 680784 674914 669257 663826 658425 652706 646689 640942 635833
61688F35833m940n407n617m919l853l260l070k679k013j563j663k212k909l299
$$ 635833 630893 625486 619869 614950 611097 607837 604767 602088 600075 598512 596849 594637 591728 588429
61674E88429k935j903j000r48j620k298k494k199j632j062o78l88O1O72J125J268
$$ 588429 585494 583591 582591 581643 580023 577725 575231 573032 571400 570338 569660 569272 569333 570005 571130 572398
61658E72398J292J309J182R84J111J673K133J940J254P49R21J743K766L417L406
$$ 572398 573690 574999 576181 577165 578276 579949 582082 584022 585276 586025 586946 588689 591455 594872 598278
61643E98278K972K508K058J505J061J013J076O47k67j048j412j642j930k267l009
$$ 598278 601250 603758 605816 607321 608382 609395 610471 611118 610851 609803 608391 606749 604819 602552 599543
61628E99543m504n993o125m941m150m764n557m850k814r40O7O84J365K032K535
$$ 599543 595039 589046 582921 577980 573830 569066 563509 558659 555845 554905 554972 555656 557021 559053 561588
61613E61588K702K116O49j043k293l333m699o124o943p277p762q335q278p464
$$ 561588 564290 566406 567055 566012 563719 560386 555687 549563 542620 535343 527581 519246 510968 503504
61599E03504o548n841n028m133l766m073m311m052l960m743n822n909m647l033
$$ 503504 496956 491115 486087 481954 478188 474115 469804 465752 461792 457049 451227 445318 440671 437638
61585D37638k164k175k590l198m076m928n063m255l243k905l161l187k570j687
$$ 437638 435474 433299 430709 427511 423435 418507 413444 409189 405946 403041 399880 396693 394123 392436
61571C92436r87n88o21j252k052k114j206k17M5r7Q1M88M22l08j179j682j670
$$ 392436 391449 390861 390240 388988 386936 384822 383616 383399 383444 383347 383428 383916 384338 384030 382851 381169 379499
61554C79499j201m97L2K38N36J320K247K579K072J171M64L02O86J194J249Q71
$$ 379499 378298 377801 377833 378071 378607 379927 382174 384753 386825 387996 388460 388762 389448 390642 391891 392762
61538C92762Q13J555K534K936K911L247M020M375L724K452J354P70M58j4q96k028
$$ 392762 393575 395130 397664 400600 403511 406758 410778 415153 418877 421329 422683 423453 423911 423897 423001 420973
61522D20973l045l820m504n000m801l717k351j430j021q40r55j543k260k548k407
$$ 420973 417928 414108 409604 404604 399803 396086 393735 392305 391284 390444 389489 387946 385686 383138 380731
61507C80731k272k266k176j995j898j733j176l71J48J51j71o56j227j572j347
$$ 380731 378459 376193 374017 372022 370124 368391 367215 366844 366992 367143 366972 366316 365089 363517 362170
61492C62170p05j00L69R24J524J835J700J142O3j411k421k013m12J133J793J870
$$ 362170 361465 361365 361734 362658 364182 366017 367717 368859 368922 367511 365090 363077 362665 363798 365591 367461
61476C67461J886J809J467J080Q96Q17P00O37N82J67o56j208q03L33J266J382
$$ 367461 369347 371156 372623 373703 374599 375416 376116 376753 377335 377502 376846 375638 374835 375168 376434 377816
61460C77816Q60K12k49m40l65j00J24J00q0K0O91J580J943J483P26L51M20N51
$$ 377816 378676 378888 378639 378199 377834 377734 377858 377958 377878 377898 378589 380169 382112 383595 384321 384672 385092 385643
61442C85643N95Q05J365K100K631K681K297J925K118K926L789M190M179M020L675
$$ 385643 386238 387043 388408 390508 393139 395820 398117 400042 402160 405086 408875 413065 417244 421264 424939
61427D24939L048K455K264K256J864J062M02K31K99L77O68J394K214K478J953
$$ 424939 427987 430442 432706 434962 436826 437888 438290 438521 438820 439197 439865 441259 443473 445951 447904
61412D47904J072M28J04l30j143k003k425k564l031l924m575m475l947l549l276
$$ 447904 448976 449404 449508 449178 448035 446032 443607 441043 438012 434088 429513 425038 421091 417542 414266
61397D14266k827k227j702j239p43m08m73q03j147j526j935j965j285k47N30R52
$$ 414266 411439 409212 407510 406271 405528 405120 404647 403844 402697 401171 399236 397271 395986 395739 396269 397221
61381C97221J281J428J130P08R43K043L305L911L663K901K122J704J704J838J873
$$ 397221 398502 399930 401060 401768 402711 404754 408059 411970 415633 418534 420656 422360 424064 425902 427775
61366D27775J917K089K190K016J782J775J837J661J399J457J908K624L734N360
$$ 427775 429692 431781 433971 435987 437769 439544 441381 443042 444441 445898 447806 450430 454164 459524
61352D59524P031Q065Q470Q952R942J1187J2299J3160J3704J3769J3275J2260
$$ 459524 466555 474620 483090 492042 501984 513171 525470 538630 552334 566103 579378 591638
61340E91638J0647Q405N895L807K664K453K649K488J522Rj487k891m437n734n960
$$ 591638 602285 610690 616585 620392 623056 625509 628158 630646 632168 632177 630690 627799 623362 617628 611668
61325F11668n288n059n873o500n688m051l000k623k055j333j206j416q06P90K266
$$ 611668 606380 601321 595448 588948 583260 579209 576209 573586 571531 570198 568992 567576 566770 567560 569826
61310E69826K984L443L961M175M164M795O419Q344J0023J1708J3389J4254J3789
$$ 569826 572810 576253 580214 584389 588553 593348 599767 608111 618134 629842 643231 657485 671274
61297F71274J2403J0393P236K702k206o178q820j0420j1111j0974j0358r499q266
$$ 671274 683677 694070 701306 704008 701802 695624 686804 676384 665273 654299 643941 634442 626176
61284F26176o734n520n044m976m755m198l253j762J45J922L237M319N409O455
$$ 626176 619442 613922 608878 603902 599147 594949 591696 589934 590079 592001 595238 599557 604966 611421
61270F11421P439Q388Q934Q661Q038Q037Q628Q720P965P454Q072R315J0479J1858
$$ 611421 618860 627248 636182 644843 652881 660918 669546 678266 686231 693685 701757 711072 721551 733409
61256G33409J3854J5865J7146J7846J8161J7355J4798J1191P492L365j778o816
$$ 733409 747263 763128 780274 798120 816281 833636 848434 859625 867117 870482 868704 861888
61244H61888r765j0422j0479j0941j1114j0497r991j0318j0611r693p907o478
$$ 861888 852123 841701 831222 820281 809167 798670 788679 778361 767750 758057 750150 743672
61232G43672n626m486k781j400j087j330j106k10P20J375K253L743N217N602M723
$$ 743672 738046 733560 730779 729379 728292 726962 725856 725646 726366 727741 729994 733737 738954 744556 749279
61217G49279L534K924K762K372J522O50K69N12J110J605J621J170N95K60L54R27
$$ 749279 752813 755737 758499 760871 762393 763043 763312 763824 764934 766539 768160 769330 769925 770185 770539 771466
61201G71466J865K873L904N451Q002J1145J3881J5981J8349K1641K5154K7638
$$ 771466 773331 776204 780108 785559 793561 804706 818587 834568 852917 874558 899712 927350
61189I27350K8792K9300K9590K9175K7219K3361J8089J2608Q285N840M970M770
$$ 927350 956142 985442 1015032 1044207 1071426 1094787 1112876 1125484 1133769 1139609 1144579 1149349
61177A149349M409L386J575p13k986n094p325r766j1974j3535j4612j5681j6927
$$ 1149349 1153758 1157144 1158719 1158006 1155020 1149926 1142601 1132835 1120861 1107326 1092714 1077033 1060106
61164A060106j8233j9438k0361k0835k0960k1085k1297k1251k0663j9573j7885
$$ 1060106 1041873 1022435 1002074 981239 960279 939194 917897 896646 875983 856410 838525
61153H38525j5288j2046r226p510o218m273j736M91K157L871N687O538N420K480
$$ 838525 823237 811191 801965 794455 788237 783964 782228 782719 784876 788747 794434 800972 806392 808872
61139H08872j424n550r228j1622j2226j1396r867p889n306k273O31L071N237P334
$$ 808872 807448 801898 792670 781048 768822 757426 747559 739670 734364 732091 732722 735793 741030 748364
61125G48364R319J1272J3669J6758J9987K2479K4023K5226K6725K8697L1039L3529
$$ 748364 757683 768955 782624 799382 819369 841848 865871 891097 917822 946519 977558 1011087
61113A011087L5590L6465L5948L4716L3576L2694L1692L0205K8036K5123K1749
$$ 1011087 1046677 1083142 1119090 1153806 1187382 1220076 1251768 1281973 1310009 1335132 1356881
61102A356881J8497J5603J2546Q705M202l87m982j0128j6146k2579k8514l3221
$$ 1356881 1375378 1390981 1403527 1412232 1416434 1416047 1411065 1400937 1384791 1362212 1333698 1300477
61090A300477l6487l8607m0009m0767m0603l9494l7903l6194l4179l1613k8792
$$ 1300477 1263990 1225383 1185374 1144607 1104004 1064510 1026607 990413 956234 924621 895829
61079H95829k6186k3795k1330j8850j6681j4906j3335j1854j0414q897p331n942
$$ 895829 869643 845848 824518 805668 788987 774081 760746 748892 738478 729581 722250 716308
61067G16308m760l506k180j241q56n08J46P24R47J368K487L849M837N742P109
$$ 716308 711548 708042 705862 704621 703765 703257 703403 704127 705074 706442 708929 712778 717615 723357 730466
61052G30466Q645R801J0915J2634J4691J6301J7457J8722K0133K1438K2984K5188
$$ 730466 739111 748912 759827 772461 787152 803453 820910 839632 859765 881203 904187 929375
61040I29375K7497K9006K9773L0343L0497K9762K8651K8048K7742K7034K6294
$$ 929375 956872 985878 1015651 1045994 1076491 1106253 1134904 1162952 1190694 1217728 1244022
61029A244022K6352K6814K6694K6296K6714K7790K8553K9359L1476L4618L6947
$$ 1244022 1270374 1297188 1323882 1350178 1376892 1404682 1433235 1462594 1494070 1528688 1565635
61018A565635L7644L7561L7412L7466L9048M4039N2630O3457P5987R0700J07159
$$ 1565635 1603279 1640840 1678252 1715718 1754766 1798805 1851435 1914892 1990879 2081579 2188738
61007B188738J24449J43354J65671J91909K22630K61242L11643L73546M44523
$$ 2188738 2313187 2456541 2622212 2814121 3036751 3297993 3609636 3983182 4427705
60998D427705N26176O23103P36751Q67936J025840J224400J466039J738519K028528
$$ 4427705 4953881 5576984 6313735 7181671 8207511 9431911 10897950 12636469 14664997
60989A4664997K313904K519466K499521K118805J389313N18873k05289n96397
$$ 14664997 16978901 19498367 21997888 24116693 25506006 26024879 25819590 25223193
60981B5223193o42157m35108q2415K96054N27371M24238q5647q71828j667075
$$ 25223193 24581036 24145928 24063513 24359567 24886938 25311176 25225529 24353701 22686626
60972B2686626k235319k488118k471119k280080k001090j697879j412817j164491
$$ 22686626 20451307 17963189 15492070 13211990 11210900 9513021 8100204 6935713
60964F935713r53154p75085o29345n12945m18624l40850k78980k32350j96926
$$ 6935713 5982559 5207474 4578129 4065184 3646560 3305710 3026730 2794380 2597454
60955B597454j68890j47373j31446j18109j05448r4598q6381p8874p0255o1535
$$ 2597454 2428564 2281191 2149745 2031636 1926188 1831590 1745209 1666335 1596080 1534545
60945A534545n4349m8466m3437m0510m0695m2605m4102m4714m4924m4601m3574
$$ 1534545 1480196 1431730 1388293 1347783 1307088 1264483 1220381 1175667 1130743 1086142 1042568
60934A042568m2313m0722l7700l3170k9034k6730k5282k3124k0462j8344j6744
$$ 1042568 1000255 959533 921833 888663 859629 832899 807617 784493 764031 745687 728943
60923G28943j5096j3705j3101j2735j1649r878q141o803n874n361m928l946k463
$$ 728943 713847 700142 687041 674306 662657 652779 644638 637835 631961 626600 621672 617726 615263
60910F15263j256n06M96J964L107L569L956M365L837K142O28L58O27L24n35j537
$$ 615263 614007 613501 613997 615961 619068 622637 626593 630958 634795 636937 637565 637923 638550 638874 638339 636802
60894F36802k849m347n021m485l969m640n836o193n606m933m554m354m450m854
$$ 636802 633953 629606 624585 620100 616131 611491 605655 599462 593856 588923 584369 580015 575565 570711
60880E70711n082m986n257o214o942o585n704n350n455n239m556l845l170k277
$$ 570711 565629 560643 555386 549172 542230 535645 529941 524591 519136 513897 509341 505496 502326 500049
60866E00049j213j47R71K019K533K482K561L176L912M536N647P535R305R944R613
$$ 500049 498836 498689 499660 501679 504212 506694 509255 512431 516343 520879 526526 534061 543366 553310 562923
60851E62923R058Q445P549O452N424M558M094M418N285N793N580N137M534K984
$$ 562923 571981 580426 587975 594427 599851 604409 608503 612921 618206 623999 629579 634716 639250 642234
60837F42234L13k316l932m967o071o831o652n946n396m900m251l931m226m430
$$ 642234 642547 640231 636299 631332 625261 618430 611778 605832 600436 595536 591285 587354 583128 578698
60823E78698l943l350l342l461l088k773l402m627n455n770o124o511o534o333
$$ 578698 574755 571405 568063 564602 561514 558741 555339 550712 545257 539487 533363 526852 520318 513985
60809E13985o297o211n655m789l928k932j795j119j106q27L42J395J019l63j129
$$ 513985 507688 501477 495822 491033 487105 484173 482378 481259 480153 479326 479668 481063 482082 481719 480590
60794D80590o09N05J497K151K295J929J622J833K218K313K444L027L599L608L526
$$ 480590 479981 480486 481983 484134 486429 488358 489980 491813 494031 496344 498788 501815 505414 509022 512548
60779E12548M068M863N126N050N360N861N798N249M890M706M192L622L749M486
$$ 512548 516616 521479 526605 531655 537015 542876 548674 553923 558813 563519 567711 571333 575082 579568
60765E79568N045N282N649O026N860N307N068N075M671L950L727M047M055L467
$$ 579568 584613 589895 595544 601570 607430 612737 617805 622880 627551 631501 635228 639275 643330 646797
60751F46797K972K986L074K888K656K452J953J235R40J344J883J855J026m48k034
$$ 646797 649769 652755 655829 658717 661373 663825 665778 667013 667953 669297 671180 673035 674061 673613 671579
60736F71579k777k025l32J089J783K297L076L986M878N843O787P499Q231R468
$$ 671579 668802 666777 666445 667534 669317 671614 674690 678676 683554 689397 696184 703683 711914 721382
60722G21382J1039J2220J2779J3256J4052J4935J5586J6017J6255J6107J5458
$$ 721382 732421 744641 757420 770676 784728 799663 815249 831266 847521 863628 879086
60711H79086J4485J3510J2828J2510J2077J0717Q301N787M108L040J722j44k289
$$ 879086 893571 907081 919909 932419 944496 955213 963514 969301 973409 976449 978171 978027 975738
60698I75738m642p177r437j1064j2571j4581j6572j7372j6868j6182j6124j6348
$$ 975738 971096 963919 954482 943418 930847 916266 899694 882322 865454 849272 833148 816800
60686H16800j6245j5851j5597j5705j6001j5971j5065j3400j1866j1058j0451
$$ 816800 800555 784704 769107 753402 737401 721430 706365 692965 681099 670041 659590
60675F59590r267p689o471n781n281n077n528o323o671o351n645m512k827j308
$$ 659590 650323 642634 636163 630382 625101 620024 614496 608173 601502 595151 589506 584994 582167 580859
60661E80859j073k247l907n354o450o791n821l979k548j997j493m01P64J374J770
$$ 580859 579786 577539 573632 568278 561828 555037 549216 545237 542689 540692 539199 538798 539562 540936 542706
60646E42706K597L702M288L898K728J320K02m72j039j812k450k241j138M6N77
$$ 542706 545303 549005 553293 557191 559919 561239 561441 560969 559930 558118 555668 553427 552289 552335 552912
60631E52912M98L12L41N75Q35Q95P09M54L03K22J49P9j76q99j930k656k889l175
$$ 552912 553410 553722 554063 554638 555473 556368 557077 557531 557834 558056 558205 558284 558108 557209 555279 552623 549734 546559
60613E46559l827m286m040l530l381l359k910k231j914j941j924j952k276k571
$$ 546559 542732 538446 534406 530876 527495 524136 521226 518995 517081 515140 513216 511264 508988 506417
60599E06417k394k060k108k275k041j757k081k605k274j007K45R43J385J738J817
$$ 506417 504023 501963 499855 497580 495539 493782 491701 489096 486822 485815 486060 487003 488388 490126 491943
60584D91943J759J852J719P90m78r98p28o91j242j521r11L5N97Q65J303K085L173
$$ 491943 493702 495554 497273 498063 497585 496587 495859 495168 493926 492405 491494 491529 492126 492991 494294 496379 499552
60567D99552M460N689O723P852R290J0608J1425J2227J3594J4934J5118J4064
$$ 499552 504012 509701 516424 524276 533566 544174 555599 567826 581420 596354 611472 625536
60555F25536J2490J0371P045K845q89l555n710p559q385p853o541m869k647j03
$$ 625536 638026 648397 655442 658287 657398 653843 648133 640574 632189 624336 617795 612926 610279 610176
60541F10176J899L124M319N931P568R142J1257J3937J6126J7028J6969J6357J4805
$$ 610176 612075 615199 619518 625449 633017 642159 653416 667353 683479 700507 717476 733833 748638
60528G48638J1974Q300M279j35m755q631j0918j1601j0969r190o841m958l951
$$ 748638 760612 768912 773191 773056 768301 759670 748752 737151 726182 716992 710151 705193 701242
60515G01242l245k428j865j733j399m07P51J533K233L324M477N058N049M965N258
$$ 701242 697997 695569 693704 691971 690572 690165 690916 692449 694682 698006 702483 707541 712590 717555 722813
60500G22813O209P994J0469J3305J6545K0570K5404L0610L5886M1117M5852M9594
$$ 722813 729022 737016 747485 760790 777335 797905 823309 853919 889805 930922 976774 1026368
60488A026368N2523N4986N6225N4713M9966M2806L3711K2107P861p817k3437l8116
$$ 1026368 1078891 1133877 1190102 1244815 1294781 1337587 1371298 1393405 1401266 1393449 1370012 1331896
60476A331896n0793n9849o4373o5093o3287n9562n4214m7975m1679l5867l1066
$$ 1331896 1281103 1221254 1156881 1091788 1028501 968939 914725 866750 825071 789204 758138
60465G58138k7731k5500k3390k1069j9006j7117j4614j1622r567r127r053q017
$$ 758138 730407 704907 681517 660448 641442 624325 609711 598089 588522 579395 570342 562325
60453E62325o418n351m826m213l543l164k815k201j835k256k910k872k179j475
$$ 562325 555907 550556 545730 541517 537974 534810 531995 529794 527959 525703 522793 519921 517742 516267
60439E16267q68j28L56p6j255k280k624k522k398k425k452k013q59L88O17k90
$$ 516267 515399 515271 515627 515551 514296 512016 509392 506870 504472 502047 499595 497582 496723 497111 497728 497438
60423D97438j178j180p43n48m11M8N14O62R63J873K837L006K463J826J249O51
$$ 497438 496260 495080 494337 493789 493378 493426 493940 494602 495565 497438 500275 503281 505744 507570 508819 509470
60407E09470M07P91J218R55L17J84O72J109J154J084J117J162J229J484J930K349
$$ 509470 509877 510668 511886 512841 513158 513342 514014 515123 516277 517361 518478 519640 520869 522353 524283 526632
60391E26632K538K374J969J818K321L049L165K672K434K740K847K353J960K235
$$ 526632 529170 531544 533513 535331 537652 540701 543866 546538 548972 551712 554559 556912 558872 561107
60377E61107K676K738K836L440M031L914L326K803K176J125L4n48p59q33m39N35
$$ 561107 563783 566521 569357 572797 576828 580742 584068 586871 589047 590172 590206 589658 588899 588066 587627 588162
60361E88162J301J245R92J316J775J563J043J107J557J512J071J192K104L090
$$ 588162 589463 590708 591700 593016 594791 596354 597397 598504 600061 601573 602644 603836 605940 609030
60347F09030L804M656N796O754P247P523P924Q675R939J1393J2047J1195R299
$$ 609030 612834 617490 623286 630040 637287 644810 652734 661409 671348 682741 694788 705983 715282
60334G15282P130M547R73l185o742r163j0840j2019j2420j1958j0980r744q272
$$ 715282 722412 726959 727932 724747 718005 708842 698002 685983 673563 661605 650625 640881 632609
60321F32609o786n578m524l341k221j595j373j098p51p60j162j327n77J172L328
$$ 632609 625823 620245 615721 612380 610159 608564 607191 606093 605342 604582 603420 602093 601516 602688 606016
60306F06016M968N609N889P041R388J1892J3628J5049J7186K0167K3129K5108
$$ 606016 610984 616593 622482 629523 638911 650803 664431 679480 696666 716833 739962 765070
60294G65070K5347K3226J8629J2168M676l098r997j4570j6307j6027j4565j1931
$$ 765070 790417 813643 832272 844440 849116 846018 836021 821451 805144 789117 774552 762621
60282G62621q460n650m727n203n974p092r173j1754j3565j4130j3911j3258j2338
$$ 762621 754161 748511 743784 738581 732607 725515 716342 704588 691023 676893 662982 649724 637386
60269F37386j1607j1221j0376q421o248n285n459n463m722l776k970k101j402
$$ 637386 625779 614558 604182 595761 589513 584228 578769 573306 568584 564808 561838 559737 558335
60256E58335j446k006k132j507p31k17J91M53K69j79k92j2J80J93L78O65N42k4
$$ 558335 556889 554883 552751 551244 550513 550296 550487 550940 551209 551030 550738 550726 550906 551099 551477 552142 552684 552660
60238E52660m24k62L33J108J763J818J196P25J268K540L554M021M451N043N471
$$ 552660 552236 551974 552307 553415 555178 556996 558192 558917 560185 562725 566279 570300 574751 579794 585265
60223E85265N605N673N683N420M863M051K957K067K464M362O264O661O041N959
$$ 585265 590870 596543 602226 607646 612509 616560 619517 621584 624048 628410 634674 641335 647376 653335
60209F53335O660P048O715O470O823P338P604P648P268O069M344K925K035J223
$$ 653335 659995 667043 673758 680228 687051 694389 701993 709641 716909 722978 727322 730247 732282 733505
60195G33505M28O7R2r9o59j126j290j521k188l345m792n893n845m813m082m256
$$ 733505 733933 734000 734092 733993 733334 732208 730918 729397 727209 723864 719072 713179 707334 702521 698439 694183
60179F94183m187k814j104o52j289j787k186l256m246l542j512l43p68j170l94
$$ 694183 689996 687182 686078 685426 684137 682350 680164 676908 672662 669120 667608 667265 666497 665327 664933
60164F64933O57R44Q32Q57O50R6O1R87K009K275K061J897J733J599J901K445K315
$$ 664933 665590 666534 667366 668223 668873 668969 669030 670017 672026 674301 676362 678259 679992 681591 683492 685937 688252
60147F88252J368P03J040J766K195K584L247L787L994M432N434O402O786O870
$$ 688252 689620 690323 691363 693129 695324 697908 701155 704942 708936 713368 718802 725204 731990 738860
60133G38860P072P343P691Q306Q714P896N823L746K442J204p79l117m991o234
$$ 738860 745932 753275 760966 769272 777986 785882 791705 795451 797893 799097 798318 795201 790210 783976
60119G83976o939o790n569l607j359Q08K162J979O57n33j103j690k524k967k915
$$ 783976 777037 770247 764678 761071 759712 760520 762682 764661 765318 764785 763682 761992 759468 756501 753586
60104G53586l215m028m316l619k942k975k891j925p78k93L3R51J953K179K013
$$ 753586 750371 746343 742027 738408 735466 732491 729600 727675 726897 726604 726637 727588 729541 731720 733733
60089G33733K486L728N125O390P536Q339Q714R041R402R264Q504P907P761O980
$$ 733733 736219 739947 745072 751462 758998 767337 776051 785092 794494 803758 812262 820169 827930 834910
60075H34910M648J491j263l645o392r355j1707j3236j4315j4954j4953j4507j3789
$$ 834910 839558 841049 839786 836141 829749 820394 808687 795451 781136 766182 751229 736722 722933
60062G22933j2385j0126p936o862o638o232n408m783m636m597m374l946l312k595
$$ 722933 710548 700422 692486 685624 678986 672754 667346 662563 657927 653330 648956 645010 641698 639103
60048F39103k097j681o16J311L176M190M909O172P443P465O250N135M901M904
$$ 639103 637006 635325 634709 636020 639196 643386 648295 654467 661910 669375 675625 680760 685661 690565
60034F90565M225K785J022q21k722m551n973o610o407n874n713o162o970q002
$$ 690565 694790 697575 698597 697776 695054 690503 684530 677920 671513 665639 659926 653764 646794 638792
60020F38792r260j0305j0464r849r347r184q433o503m265k941k542k197j446m46
$$ 638792 629532 619227 608763 598914 589567 580383 571950 565447 561182 558241 555699 553502 552056 551610
60006E51610N94J444J766J632J731K434L228L587L826M394M953M977M790N094
$$ 551610 552204 553648 555414 557046 558777 561211 564439 568026 571852 576246 581199 586176 590966 596060
59992E96060N830O276O109N661N347N357N699O025N694M467K884J570N69l92j410
$$ 596060 601890 608166 614275 619936 625283 630640 636339 642364 648058 652525 655409 656979 657548 657156 655746
59977F55746k559l947n253n780n412m977n154n620n658n051l981k669j512r43
$$ 655746 653187 649240 643987 638207 632795 627818 622664 617044 611386 606335 602354 599685 598173 597230
59963E97230p17l4J258K377K840L124L598L874L745L744M055L884K740J383O37
$$ 597230 596513 596479 597737 600114 602954 606078 609676 613550 617295 621039 625094 628978 631718 633101 633738
59948F33738K09m01q48p68p62j403k098k105j927k488l600m473n084n766o079
$$ 633738 633947 633546 632698 631930 631168 629765 627667 625562 623635 621147 617547 613074 607990 602224 596145
59933E96145n409m332l960m220m037l072k084j661j567j346q08LP32R94J154K115
$$ 596145 590736 586404 582444 578224 574187 571115 569031 567370 565803 564457 563649 563652 564384 565378 566532 568647
59917E68647L716M392L451K545L424N191N592M376L403L687M348M590M771N096
$$ 568647 572363 576755 580206 582751 586175 591366 596958 601334 604737 608424 612772 617362 622133 627229
59903F27229M920M050L314L182K977K186J429J346J501J263J049J736L246M530
$$ 627229 632149 636199 639513 642695 645672 647858 649287 650633 652134 653397 654446 656182 659428 663958
59889F63958M942M959N440O481P269P030N942M886M370M099L703L305L147L158
$$ 663958 668900 673859 679299 685780 693049 700079 706021 710907 715277 719376 723079 726384 729531 732689
59875G32689L272L629L994L619K212N13p69k010l841n791o687o264n435n058n122
$$ 732689 735961 739590 743584 747203 749415 749928 749159 747149 743308 737517 730830 724566 719131 714073 708951
59860G08951n141m752l959l205l047l443l637l169k507k270k275j943j173j61
$$ 708951 703810 699058 695099 691894 688847 685404 681767 678598 676091 673821 671546 669603 668430 668269
59846F68269J156K854M575N983P231Q452R287R518R529R370Q059M813O43k376
$$ 668269 669425 672279 676854 682837 690068 698520 707807 717325 726854 736224 744283 749096 749739 747363
59832G47363l160k217m71J519L245M058L508J537j624n422r142j2386j5053j6695
$$ 747363 744203 741986 741515 743034 746279 750337 753845 755382 753758 748336 739194 726808 711755 695060
59818F95060j6601j4861j2631j0867r496q269p476p139o438m804k859j495q20
$$ 695060 678459 663598 650967 640100 630604 622335 614859 607720 601282 596478 593619 592124 591304
59805E91304o94j306k339k568j398R7O53M71L36J10o45j457j743j974k697l192
$$ 591304 590610 589304 586965 584397 582999 583096 583749 584220 584556 584666 584021 582564 580821 578847 576150 572958
59789E72958k581j529j247j541j355o22l6M05R94J090M2j256j521j209j600k261
$$ 572958 570377 568848 567601 566060 564705 564083 564047 564452 565446 566536 566578 565322 563801 562592 560992 558731
59773E58731j670p9O30M4p7J289K929L541L534L821M339M707N086N511N389M415
$$ 558731 557061 556982 557612 557656 557579 558868 561797 565338 568872 572693 577032 581739 586825 592336 597725 602140
59757F02140L288K911L486M623N748O287O138N911O122O403O304O331P122Q016
$$ 602140 605428 608339 611825 616448 622196 628483 634621 640532 646654 653057 659361 665692 672814 680830
59743F80830P768O357M819L616K502J693J577J540O35p23j299j116j234j590r76
$$ 680830 688598 694955 699774 703390 705892 707585 709162 710702 711337 710614 709315 708199 706965 705375 704399
59728G04399O36J701J435P62M81K50q9J19R44J403J114J000J636K258K170J822
$$ 704399 705035 706736 708171 708933 709414 709664 709575 709694 710638 712041 713155 714155 715791 718049 720219 722041
59712G22041J812J982K213K878L896M434M220M015M271M510M579N173O365O945
$$ 722041 723853 725835 728048 730926 734822 739256 743476 747491 751762 756272 760851 766024 772389 779334
59698G79334O049M455L348K782K172J444Q59M32J88K98M46k27j979l943n157n420
$$ 779334 785383 789838 793186 795968 798140 799584 800443 800875 801063 801361 801807 801580 799601 795658 790501 785081
59682G85081m905l845k908k862l467l575k787k054k190k803l224l584m313n266
$$ 785081 780176 776331 773423 770561 767094 763519 760732 758678 756488 753685 750461 746877 742564 737298
59668G37298n931o042n642n035m736m935n076m659m152m188m212l208j474k42
$$ 737298 731367 725325 719683 714648 709912 704977 699901 695242 691090 686902 682690 679482 678008 677766
59654F77766L53J334K799L544L108K519K478K351J582O50j02j169k742m143n051
$$ 677766 678119 679453 682252 685796 688904 691423 693901 696252 697834 698484 698382 697213 694471 690328 685277
59639F85277o034p218p771p372o841o536n494l159p05M02K23k57o71j235j884
$$ 685277 679243 672025 664254 656882 650041 643505 638011 634852 634147 634549 634772 634515 633844 632609 630725
59624F30725k340k584k681k654k672k785k396r87O12Q94k28j267j318j021j022
$$ 630725 628385 625801 623120 620466 617794 615009 612613 611626 612238 613132 612904 611637 610319 609298 608276
59609F08276r47m02K99R51J742K407K315J744J578J612P37q51j518p90j20l92
$$ 608276 607329 606927 607226 608177 609919 612326 614641 616385 617963 619575 620312 619461 617943 617153 617033 616641
59593F16641o27o3M65K98K58R07J292O80n4p4pm04m51L33O98l82j895k457k492
$$ 616641 616014 615951 616416 616714 616972 617879 619171 619851 619797 619723 619716 619312 618861 619194 619892 619510 617615 615158 612666
59574F12666l015l660l660l602m325n056m482k944j824j466j237j004r92q25q9
$$ 612666 609651 605991 602331 598729 594404 589348 584866 581922 580098 578632 577395 576391 575399 574574 574485
59559E74485P16J015J255J931K365J770P01J51N9J2M89J923L411L861L703L966
$$ 574485 575201 576216 577471 579402 581767 583537 584238 584389 584448 584460 584949 586872 590283 594144 597847 601813
59543F01813M510M635M710N609P211Q930J1038J3902J6746J8835K1110K4637K7828
$$ 601813 606323 610958 615668 621277 628488 637418 648456 662358 679104 697939 719049 743686 771514
59530G71514K7293K1583J2664L829k433m853l555k54K918N018O101N984M388K000
$$ 771514 798807 820390 833054 836883 834450 829597 826042 825788 828706 833724 839825 845809 850197 852197
59516H52197k3j619l770o931j0487j3651j6035j7460j8036j8256j8298j7571j5589
$$ 852197 852174 850555 846785 839854 829367 815716 799681 782221 764185 745929 727631 710060 694471
59503F94471j2875j0378q514p402p147p188o318m276k393j633j071N10K503L396
$$ 694471 681596 671218 662704 655302 648155 640967 634649 630373 627980 626347 625276 625786 628289 631685
59489F31685K927J952R07j46n92N3J094J575J764K475L641M761O013P542Q506
$$ 631685 634612 636564 637471 637325 636733 636786 637880 639455 641219 643694 647335 652096 658109 665651 674157
59474F74157Q348Q124R051J0488J1019J0690J0329R412O822L265P54j81p73j557
$$ 674157 682505 690629 699680 710168 721187 731877 742206 751618 758440 761705 762459 762278 761505 759948
59460G59948j582k35J934M452P424J0624J3456J5887J8170J9733J9776J8768J7872
$$ 759948 758366 758131 760065 764517 771941 782565 796021 811908 830078 849811 869587 888355 906227
59447I06227J7080J5543J3588J2611J2704J2049Q973L367l934j1750j8451k2732
$$ 906227 923307 938850 952438 965049 977753 989802 998775 1002142 998208 986458 968007 945275
59435I45275k4731k5304k4360k1307j6959j3246j0980r436q190p630p476o545
$$ 945275 920544 895240 870880 849573 832614 819368 808388 798952 790762 783132 775656 769111
59423G69111m418j798J084M845R287J3030J5405J7204J8969J9982J9712J8775
$$ 769111 764693 762895 763979 768824 778111 791141 806546 823750 842719 862701 882413 901188
59411I01188J7791J6673J5926J6960J9531K0000J4041J159j4415k7161l3844l4225
$$ 901188 918979 935652 951578 968538 988069 1008069 1022110 1023269 1008854 981693 947849 913624
59399I13624k9835k2750j4807o961P55P997J2636J1259K424j0788k2548k9040
$$ 913624 883789 861039 846232 839271 840026 848023 860659 871918 874342 863554 841006 811966
59387H11966l0672k9685k7183k3259j8566j4208j0734q226o717n724m213j975
$$ 811966 781294 751609 724426 701167 682601 668393 657659 649433 642716 636992 632779 630804
59375F30804j16P03J360K555L336K757J741J625J935J535R31J426K771L777M589
$$ 630804 630688 631391 632751 635306 638642 641399 643140 644765 646700 648235 649166 650592 653363 657140 661729
59360F61729O153Q004Q837Q949R765J1266J2197J2776J4633J7895K0760K2378
$$ 661729 667882 675886 684723 693672 703437 714703 726900 739676 754309 772204 792964 815342
59348H15342K3827K5664K6838K6794K6614K7057K7180K5913K3488K0509J6942
$$ 815342 839169 864833 891671 918465 945079 972136 999316 1025229 1048717 1069226 1086168
59337A086168J2810Q552M076j269p206j2272j5707j8304k0905k3185k4521k4824
$$ 1086168 1098978 1107530 1111606 1110337 1103131 1090859 1075152 1056848 1035943 1012758 988237 963413
59325I63413k4086k2286k0170j8906j8460j7521j5402j2951j1151j0035r348r024
$$ 963413 939327 917041 896871 877965 859505 841984 826582 813631 802480 792445 783097 774073
59313G74073q626p473n802m669m316l839k743j654j071o31k5N01R88J998L590
$$ 774073 765447 757974 752172 747503 743187 739348 736605 734951 733880 733249 733224 733725 734713 736711 740301
59298G40301N105O268P536R121J0747J2553J5099J8145K0442K0841J8701J3435
$$ 740301 745406 751674 759210 768331 779078 791631 806730 824875 845317 866158 884859 898294
59286H98294N196l832j0370j2846j2338j0672q739o649m137o11L967Q249J0756
$$ 898294 903490 899658 889288 876442 864104 853432 844693 838044 833907 833296 837263 845512 856268
59273H56268J1914J3358J5421J6991J7715J8319J8618J7263J4060J0595P893N150
$$ 856268 868182 881540 896961 913952 931667 949986 968604 985867 999927 1010522 1018415 1023565
59261A023565J496k687o866j1172j5306j8163j9373j9867k0191j9685j8041j6287
$$ 1023565 1025061 1022374 1015508 1004336 989030 970867 951494 931627 911436 891751 873710 857423
59249H57423j5327j4669j3458j1757j0060q412o535m159j078K281M583N055N003
$$ 857423 842096 827427 813969 802212 792152 783740 777205 773046 771968 774249 778832 783887 788890
59236G88890O278Q491R543Q809P739P084N755L042j19k774n159p562r724j1866
$$ 788890 795168 803659 813202 822011 829750 836834 842589 845631 845512 842738 837579 830017 820293 808427
59222H08427j4548j6991j7463j5932j4392j3887j3191j1237q827o974n470m141
$$ 808427 793879 776888 759425 743493 729101 715214 702023 690786 681959 674985 669515 665374
59210F65374l593l732l265j765m68j57J3O41J010Q08R76J759J895J025Q22K350
$$ 665374 661781 658049 654784 653019 652551 652394 652407 653048 654058 654866 655842 657601 659496 660521 661343 663693
59194F63693M215M815M630M746M926M761N072O435P780Q033P774P838P700O819
$$ 663693 667908 672723 677353 682099 687025 691786 696858 703293 711073 719106 726880 734718 742418 749237
59180G49237O085O381P102P506Q069Q975Q907P091N125M895N974O826P387Q552
$$ 749237 755322 761703 768805 776311 784380 793355 802262 809353 814478 819373 825347 832173 839560 848112
59166H48112J0213J1636J2853J3967J4015J2153R223O557M146J322j694m353o952
$$ 848112 858325 869961 882814 896781 910796 922949 932172 938729 942875 944197 942503 938150 931198
59153I31198r774j2084j3290j4087j5066j5452j4590j3455j3055j2554j0793q542
$$ 931198 921424 909340 896050 881963 866897 851445 836855 823400 810345 797791 786998 778456
59141G78456p385p242o896o127n553n022l904k535j744j415q77j12O72J865L517
$$ 778456 771071 763829 756933 750806 745253 740231 736327 733792 732048 730633 729756 729644 730316 732181 735698
59126G35698M512M086L412M136O055P765Q887J0157J1826J3357J4339J4617J4160
$$ 735698 740210 744296 747708 751844 757899 765664 774551 784708 796534 809891 824230 838847 853007
59113H53007J3661J4348J6197J7409J6703J4986J3591J2271J0327Q374P310O608
$$ 853007 866668 881016 897213 914622 931325 946311 959902 972173 982500 990874 998184 1004792
59101A004792N325L782K639J367p50l073m674n898p310q145p543o296n593n034
$$ 1004792 1010117 1013899 1016538 1017905 1017155 1014082 1009408 1003510 996200 988055 980512 974216 968623 963589
59087I63589l696k207j882k623l479m520o358q596j0487j2309j4439j5926j5767
$$ 963589 959893 957686 955804 953181 949702 945182 938824 930228 919741 907432 892993 877067 861300
59074H61300j4733j4163j3827j2769j1353j0515r886q571p071o445o381n971n554
$$ 861300 846567 832404 818577 805808 794455 783940 774054 765483 758412 751967 745586 739615 734061
59061G34061n824n999m979l525l175l667l635l155l349m034m055l458l156k942
$$ 734061 728237 722238 717259 713734 710559 706892 703257 700102 696753 692719 688664 685206 682050 679108
59047F79108k036j098j366k165j610L82K030K435K308K140J766J630K422L598
$$ 679108 677072 675974 674608 672443 670833 671215 673245 675680 677988 680128 681894 683524 685946 689544
59033F89544M152M533N737P033O901N925O319Q569J1000J2679J4386J6519J8305
$$ 689544 693696 698229 703966 710999 717900 723825 730144 738713 749713 762392 776778 793297 811602
59020H11602J9427K0355K0721J9432J6646J3680J0836P255L114k05k376m429o427
$$ 811602 831029 851384 872105 891537 908183 921863 932699 939954 943068 942863 940487 936058 929631
59007I29631p012n792m186l182k097k11K052M243O557Q750R846R567Q736P876
$$ 929631 922619 916827 912641 909459 907362 907151 909203 913446 920003 928753 938599 948166 956902 964778
58993I64778O650N019L620K618J438j69j977m255p441j0841j3090j4032j4681
$$ 964778 971428 976447 980067 982685 984123 983954 981977 977722 970281 959440 946350 932318 917637
58980I17637j5204j4562j2337r480o899m678k825j455j9K316N305P844R614J1312
$$ 917637 902433 887871 875534 866054 859155 854477 851652 850197 850178 852494 857799 865643 875257 886569
58966H86569J3276J5102J6608J7993J9047J9326J8962J8183J6451J3282R363N538
$$ 886569 899845 914947 931555 949548 968595 987921 1006883 1025066 1041517 1054799 1064162 1069700
58954A069700J293m184j0044j4638j7835k0572k2655k3013k1810k0378j9128j7443
$$ 1069700 1070993 1066809 1056765 1042127 1024292 1003720 981065 958052 936242 915864 896736 879293
58942H79293j5442j3910j2657j0745q213n753l121J47K876L393K256J482J245
$$ 879293 863851 849941 837284 826539 818326 812573 809452 809599 812475 815868 818124 819606 820851
58929H20851j83l174n946p408q338r258r387q437p452p172p196p123o850n690
$$ 820851 820668 817494 811548 804140 795802 786544 777157 768720 761268 754096 746900 739777 732927 727237
58915G27237l084l05N78l63r57r1J304K538M130O070P322P720Q401R854J1363
$$ 727237 724153 723848 724426 724063 723106 723015 724319 726857 730987 737057 744379 752099 760500 770354 781717
58900G81717J2756J4762J7246J8991J9684K0273K1107K1566K1719K2382K3340
$$ 781717 794473 809235 826481 845472 865156 885429 906536 928102 949821 972203 995543
58889I95543K3600K3571K4795K7337K9676L1243L2592L2850K9827K3391J6182
$$ 995543 1019143 1042714 1067509 1094846 1124522 1155765 1188357 1221207 1251034 1274425 1290607
58878A290607J0176M830o24n696j0335j5649k1668k6607k9410l0990l2002l1569
$$ 1290607 1300783 1305613 1304989 1299293 1288958 1273309 1251641 1225034 1195624 1164634 1132632 1101063
58866A101063k9262k6234k3284j9858j6034j3412j2745j2667j1976j1348j1553
$$ 1101063 1071801 1045567 1022283 1002425 986391 972979 960234 947567 935591 924243 912690
58855I12690j1822j1360j0835j0986j1192j0576r307p939o691o050o696q179r094
$$ 912690 900868 889508 878673 867687 856495 845919 836612 828673 821982 815932 809236 801057 791963
58842G91963r021q800q674p983o989o902p601p488o167n179n315n416m555l340
$$ 791963 782942 774142 765468 757485 750496 743594 735993 728505 722338 717159 711844 706428 701873 698533
58828F98533k225p61P26Q66l91j244p54j5J41L89R97R91K48J63J209K084K155
$$ 698533 696308 695547 696273 697139 696748 695504 694750 694735 694876 695265 696262 697253 697501 697664 698873 700957 703112
58811G03112K492L326L067J104p89j246j215j674j812j019n23j285k253k301k069
$$ 703112 705604 708930 711997 713101 712312 711066 709851 708177 706365 705346 704823 703538 701285 698984 696915
58796F96915k330k467k017j885k547k922k384j989k252j740N65L348M968N647
$$ 696915 694585 692118 690101 688216 685669 682747 680363 678374 676122 674382 674947 678295 683263 688910
58782F88910O237O588O557O857P532P362N984M755M362L650K032P17J55j293m379
$$ 688910 695147 701735 708292 715149 722681 730043 736027 740782 745144 748794 750826 751543 751698 750405 746026
58767G46026p061p476o710o575o713o014n020m726m568l643k429j497j04K201
$$ 746026 738965 731489 724779 718204 711491 705477 700457 695731 691163 687520 685091 683594 683490 685691
58753F85691M087M359L782L398K747J464Q68J995L728M689N425O906Q494R267
$$ 685691 689778 694137 697919 701317 704064 705528 706396 708391 712119 716808 722233 729139 737633 746900
58739G46900R852J1019J1934J1655J1017J1259J2055J2548J2962J3678J3962J3173
$$ 746900 756752 767771 779705 791360 802377 813636 825691 838239 851201 864879 878841 892014
58727H92014J1882J0608Q846O489M517L211J603l36j093l32L02L12J502M399O463
$$ 892014 903896 914504 923350 929839 934356 937567 939170 938834 937741 937409 937711 938023 939525 943924 950387
58712I50387O035N139N882O670M902J130k433n529r022j2159j3753j4724j6669
$$ 950387 956422 961561 967443 974113 979015 980145 977712 972183 963161 951002 937249 922525 905856
58699I05856j9054k0425k1183k2624k4293k4736k3918k2684k0789j7637j3984
$$ 905856 886802 866377 845194 822570 798277 773541 749623 726939 706150 688513 674529
58688F74529j0986q530o201m712m650n138n345n894p148p817o947n634n039m457
$$ 674529 663543 655013 648812 644100 639450 634312 628967 623073 615925 608108 601161 595527 590488 586031
58674E86031l019j437l34J172L380M767M666N006P225R839J1183J2220J4148J5687
$$ 586031 583012 581575 581241 582413 585793 590560 595226 600232 607457 617296 628479 640699 654847 670534
58660F70534J5305J3929J2670J0234N434K33k828m270n938p580q107q347r361
$$ 670534 685839 699768 712438 722672 728106 728339 725511 721241 715303 707723 699616 691269 681908
58647F81908r866q352o171n417n453m533l229l083l397k480p58L15J016K248L184
$$ 681908 672042 663690 657519 652102 646649 642116 638887 635804 632407 629927 629169 629484 630500 632748 635932
58632F35932K860K475L283L900K633O75l9l05j712l090k343k73Q52J205K550M809
$$ 635932 638792 641267 644550 648450 651083 651758 651719 651414 649702 646612 644269 643996 644848 646053 648603 653412
58616F53412O717Q538J1093J3347J3963J3819J4147J3894J1794R109P279M961
$$ 653412 660129 668667 679760 693107 707070 720889 735036 748930 760724 769833 777112 782073
58604G82073P15l563n427n927p186q219p203n700o288p792p310n265m066l344
$$ 782073 782788 779225 773798 767871 760685 752466 745263 739563 733275 725483 718173 712908 708842 705498
58590G05498j073J971L488M076O029Q890J0648J1974J4741J7720J8341J7442J7463
$$ 705498 704425 706396 709884 713960 719989 728879 739527 751501 766242 783962 802303 819745 837208
58577H37208J7290J4040Q954O131O076N817M908N895Q890J0978J1473J2908J6345
$$ 837208 854498 868538 877492 883623 889699 895516 900424 906319 915209 926187 937660 950568 966913
58564I66913K0095K3361K6936L0227L1717L2219L3500L4112L0972K4683J8634
$$ 966913 987008 1010369 1037305 1067532 1099249 1131468 1164968 1199080 1230052 1254735 1273369
58553A273369J3393O848m59n411p797j0512j4075j5985j5942j6619j8616j9519
$$ 1273369 1286762 1293610 1293151 1287740 1279943 1269431 1255356 1239371 1223429 1206810 1188194 1168675
58541A168675j8866j9262k1695k4137k5603k7231k8727k8182k5922k4298k3173
$$ 1168675 1149809 1130547 1108852 1084715 1059112 1031881 1003154 974972 949050 924752 901579
58530I01579k0130j5464j2315j1297r747o888m915m241k557M77K336K436L153
$$ 901579 881449 865985 853670 842373 832626 825738 820823 816582 814025 814502 816838 819274 822427
58517H22427N032N671M432L662M105L612J669O41J309J513M90J69J011Q64p89
$$ 822427 827459 833130 837562 841224 845329 848941 850610 851251 852560 854073 854563 854732 855743 856607 855818
58502H55818j681j088j140k601l522l224l566n128o048n593n068m524k602k9R16
$$ 855818 854137 853049 851909 849308 845786 842562 838996 833868 827820 822227 817159 812635 810033 810004 810920
58487H10920P41K160M982O399O492Q298J2013J4528J5425J7722K1683K3570K1924
$$ 810920 811661 813821 818803 825202 831694 839992 852005 866533 881958 899680 921363 944933 966857
58474I66857J9551J7731J4025P618J434k982p607j3079j6816j7791j8281j9036
$$ 966857 986408 1004139 1018164 1025782 1027216 1024234 1016627 1003548 986732 968941 950660 931624
58462I31624j7718j3821j0243q190n492j488J510L174O109J0246J1841R958Q347
$$ 931624 913906 900085 889842 881652 876160 874672 876182 879356 885465 895711 907552 917510 925857
58449I25857Q715P875L857o80l645o647j0350j2053j0697r234r316q526n467k622
$$ 925857 934572 942447 946304 945624 941979 935332 924982 912929 902232 892998 883682 875156 869689 867067
58435H67067j631n89J637L212L629N110P783Q684P630Q455J2265J5305J5785J6803
$$ 867067 865436 864847 866484 869696 873325 878435 886218 894902 902532 910987 923252 938557 954342 971145
58421I71145J9727K0873J7946J4024J1807R485N475J734q03m610j0251j4181j4885
$$ 971145 990872 1011745 1029691 1043715 1055522 1065007 1070482 1072216 1071413 1066803 1056552 1042371 1027486
58408A027486j5595j7935j8666j6019j3398j3325j3374j1432r404q382n939j575
$$ 1027486 1011891 993956 975290 959271 945873 932548 919174 907742 898338 889956 884017 882442
58396H82442J036N08N47L064M731L645K854L823L116n24k736j334n83l220n119
$$ 882442 883478 883986 884533 887597 892328 895973 898827 902650 905766 905242 902506 901172 900589 897369 892250
58381H92250k818L62R12J326M319P071O719N760O746P300N508M512O681Q960Q814
$$ 892250 889432 889794 890706 892032 896351 903422 910141 915901 922647 929947 935455 939967 946648 955608 964422
58366I64422Q902J1110J2260J0565R960J2898J5420J4501J3533J5143J5521J1703
$$ 964422 973324 984434 996694 1007259 1017219 1030117 1045537 1060038 1073571 1088714 1104235 1115938
58354A115938P522O393N078P54k696j841k97j625k494K95K932J797P70M074Q304
$$ 1115938 1123460 1129853 1134931 1135685 1132989 1131148 1130851 1129226 1126732 1127027 1129959 1131756 1132526 1136600 1144904
58339A144904R012Q865J1822J5321J5739J5599J8027K0066J8666J7143J8572J9174
$$ 1144904 1153916 1162781 1174603 1189924 1205663 1221262 1239289 1259355 1278021 1295164 1313736 1332910
58327A332910J5412J1092J0104Q980M205j79j42L52k869n630l144Q10J148Q35
$$ 1332910 1348322 1359414 1369518 1378498 1382703 1382524 1382382 1382734 1379865 1374235 1371091 1371901 1373049 1373884
58313A373884M164P715P234O528J0234J4542J4456J3375J6044J8898J7160J4560
$$ 1373884 1378048 1385763 1392997 1399525 1409759 1424301 1438757 1452132 1468176 1487074 1504234 1518794
58301A518794J6186J8618J6963J4618J6137J7756J5024J2298J4352J6476J3639
$$ 1518794 1534980 1553598 1570561 1585179 1601316 1619072 1634096 1646394 1660746 1677222 1690861
58290A690861J1193J5194K0330J9412J6601J8896K2639K1325J8849K1723K5903
$$ 1690861 1702054 1717248 1737578 1756990 1773591 1792487 1815126 1836451 1855300 1877023 1902926
58279A902926K4801K2750K6822L2774L3056L1148L3976L7805L6116L3690L8070
$$ 1902926 1927727 1950477 1977299 2010073 2043129 2074277 2108253 2146058 2182174 2215864 2253934
58268B253934M4777M5944M5634N1255N8080N8282N6952O2585O9967O9595O5659
$$ 2253934 2298711 2344655 2390289 2441544 2499624 2557906 2614858 2677443 2747410 2817005 2882664
58257B882664O7137O9549O3934N5560N4883N8093N5693N1975N6295O3608O4067
$$ 2882664 2949801 3019350 3083284 3138844 3193727 3251820 3307513 3359488 3415783 3479391 3543458
58246C543458O3229P1720Q3747Q7603Q8383R7691J10166J13922J14891J25983
$$ 3543458 3606687 3678407 3762154 3849757 3938140 4035831 4145997 4259919 4374810 4500793
58236D500793J41437J47591J49792J61883J78493J85692J89636K05427K27068
$$ 4500793 4642230 4789821 4939613 5101496 5279989 5465681 5655317 5860744 6087812
58227F087812K38898K47252K68905K97856L17014L33055L64562M05413M36889
$$ 6087812 6326710 6573962 6842867 7140723 7457737 7790792 8155354 8560767 8997656
58218H997656M66122N13604N72625O22539O72135P46043Q38399R26742J021529
$$ 8997656 9463778 9977382 10550007 11172546 11844681 12590724 13429123 14355865 15377394
58209A5377394J151999J313602J483366J676971J932987K251649K612139L038692
$$ 15377394 16529393 17842995 19326361 21003332 22936319 25187968 27800107 30838799
58201C0838799L579609M232292M966820N812893O836692Q042427R396240J0941089
$$ 30838799 34418408 38650700 43617520 49430413 56267105 64309532 73705772 84646861
58193H4646861J2781057J4969469J7549545K0684241K4544739K9024878L3725007
$$ 84646861 97427918 112397387 129946932 150631173 175175912 204200790 237925797
58186B37925797L8142419M1431721M1791725L6695731K4651037P089152j1779134
$$ 237925797 276068216 317499937 359291662 395987393 420638430 427727582 415948448
58179D15948448k7326383l6936790m0561811l9632613l5838789l0631435k5212366
$$ 415948448 388622065 351685275 311123464 271490851 235652062 205020627 179808261
58172A79808261k0538058j7200454j5278389j4329458j3661433j2765333j1543304
$$ 179808261 159270203 142069749 126791360 112461902 98800469 86035136 74491832
58165G4491832j0156046q755153p414367o203642n186366m354224l652013l060192
$$ 74491832 64335786 55580633 48166266 41962624 36776258 32422034 28770021 25709829
58157B5709829k590914k222877j908410j634784j418944j250797j097314r55251
$$ 25709829 23118915 20896038 18987628 17352844 15933900 14683103 13585789 12630538
58149A2630538q47228p70573o98247o26223n74119n41436n05883m63379m30062
$$ 12630538 11783310 11012737 10314490 9688267 9114148 8572712 8066829 7603450 7173388
58140G173388m05914l73937l34475l04951k85992k61245k30035k08103j96642
$$ 7173388 6767474 6393537 6059062 5754111 5468119 5206874 4976839 4768736 4572094
58131D572094j81627j63480j57116j62114j61756j52468j46737j46203j38847
$$ 4572094 4390467 4226987 4069871 3907757 3746001 3593533 3446796 3300593 3161746
58122C161746j24128j14985j13086j06679r4550q8267q8927q4812p4172o8010
$$ 3161746 3037618 2922633 2809547 2702868 2608318 2520051 2431124 2346312 2272140 2204130
58112B204130o8206o4557n5622n1520n3667n2083m5206m2699m6084m5786l9943
$$ 2204130 2135924 2071367 2015745 1964225 1910558 1858475 1813269 1770570 1724486 1678700 1638757
58101A638757l7561m0405l9879l4502l2786l6077l5744l0137k7509k9457k7975
$$ 1638757 1601196 1560791 1520912 1486410 1453624 1417547 1381803 1351666 1324157 1294700 1266725
58090A266725k1711j8872k1060k0184j4437j1761j4254j4457j0457r761j4559
$$ 1266725 1245014 1226142 1205082 1184898 1170461 1158700 1144446 1129989 1119532 1109771 1095212
58079A095212j7580j6181j6619k0811k2460j9928j9581k2894k3217j8857j6537
$$ 1095212 1077632 1061451 1044832 1024021 1001561 981633 962052 939158 915941 897084 880547
58068H80547j8485j8644j5036j3428j5313j4633r934p641r664r731n742l863o541
$$ 880547 862062 843418 828382 814954 799641 785008 775074 767433 757769 748038 742296 738433 731892
58055G31892q076o025n622q820j0159p639o828r915j1307q327n905o550n951k649
$$ 731892 723816 717791 712169 703349 693190 685551 678723 668808 657501 649174 643269 636719 630768 628119
58041F28119j775m914o298l537k205n282p753o429n569p840r036o777n648q463
$$ 628119 626344 621430 615132 611595 609390 604108 596355 589926 584357 576517 567481 560704 555056 546593
58027E46593j0836r487p958r087r670p424n748o804p140m655k886m020m679k807
$$ 546593 535757 526270 518312 509225 499555 492131 486383 479579 472439 467784 464898 460878 456199 453392
58013D53392j771l533m619k898j570k576k748m20R67m49j275M42J535K49k69J472
$$ 453392 451621 448088 443469 440571 439001 436425 433677 433257 434224 433775 432500 432942 434477 434726 434457 435929
57997D35929K125L68Q0L057N428N039N397Q432J0348Q752P099P819P803M973K720
$$ 435929 438054 438422 438502 441559 446987 452026 457423 465855 476203 484955 492054 499873 507676 512649 515369
57982E15369L400L854J823L67J475J683j250l598k380p43j797k977j566j38j458
$$ 515369 518769 522623 524446 524813 526288 527971 526721 523123 520743 520000 518203 515226 513660 513522 512064
57967E12064l164k562j611k483l150j977j569l525m464k010L85o66k764k762k514
$$ 512064 508900 506338 504727 502244 499094 497117 495548 492023 487559 485549 485934 485268 482504 479742 477228
57952D77228m547o660o068m614m895n242l487j628j938k355m61J760J853J783
$$ 477228 472681 466021 459953 455339 450444 445202 441715 440087 438149 435794 435333 437093 438946 440729
57938D40729M113P017P735P584R005J0914J1431J1897J3845J5209J3823J1538
$$ 440729 444842 451859 459594 467178 476183 487097 498528 510425 524270 539479 553302 564840
57926E64840J0777J0208P771M770K944Q33k952o213o874o947q900j1325j2079
$$ 564840 575617 585825 593596 598366 601310 602143 599191 592978 586104 579157 570257 558932 546853
57913E46853j2367j3734j4457j2929j1254j1485j1686r699p540p705q547p542
$$ 546853 534486 520752 506295 493366 482112 470627 458941 449242 441702 433997 425450 417908
57901D17908o032o372p390p014o397p227p817o091l725l145l254k066o74n94k45
$$ 417908 411876 405504 398114 391100 384703 377476 369659 363568 359843 356698 353444 351378 350704 350110 349865
57886C49865J886L643K976K081L467N095M072K073K208L314K402K23o45r08k734
$$ 349865 351751 355394 358370 360451 363918 369013 373085 375158 377366 380680 383082 383305 382660 381752 379018
57871C79018m951m970l690l676m296l326j610j468k022p57J648K615K353K965
$$ 379018 374067 369097 365407 361731 357435 354109 352499 351031 349009 348252 349900 352515 354868 357833
57857C57833M238M558M695O482Q962R832R485R786J0317R642Q747R255R799Q107
$$ 357833 362071 366629 371324 377806 386768 396600 406085 415871 426188 435830 444577 453832 463631 471738
57843D71738N206L622K998J453l58p33q49k921n885p069o843p403q336p649n994
$$ 471738 476944 480566 483564 485017 484659 483926 483077 480156 474271 467202 460359 452956 444620 436971 430977
57828D30977n588o032n343l980l680l575j711P34J162L44J080L040L488K337J961
$$ 430977 425389 419357 414014 410034 406354 402779 401068 401802 402964 403308 404388 407428 410916 413253 415214
57813D15214K576K319J410J830L175L150J857J346J197j070n221q208q971r297
$$ 415214 417790 420109 421519 423349 426524 429674 431531 432877 434074 433004 427783 419575 410604 401307
57799D01307r863r391p897o964o543n117l170k838l964m148k873k076k420k544
$$ 401307 391444 382053 374156 367192 360649 355532 352362 349524 345560 341412 338539 336463 334043 331499
57785C31499k161k491l392l365k469k021j538N91L492M490L520L247M620N799
$$ 331499 329338 326847 323455 320090 317621 315600 314062 314653 318145 322635 326155 329402 334022 339821
57771C39821N799N695N785M971L405K600K462J318q38k336l159n031p857r442
$$ 339821 345620 351315 357100 362071 365476 368076 370538 371856 371018 368682 365523 360492 352635 343193
57757C43193r215q971r385r045p539o371o100n468m017k775j876k95J642K302
$$ 343193 333978 325007 315622 306577 299038 292667 286567 281099 277082 274307 272431 272136 273778 276080
57743B76080J650J333J644J304M64P21J840J673n7j113n59j77j085k007j870j444
$$ 276080 277730 279063 280707 282011 282475 283196 285036 286709 286652 285539 284980 284803 283718 281711 279841 278397
57727B78397j342q36L37J252J579K022K542K280J470J174J076Jj428j452l71k24
$$ 278397 277055 276219 276556 277808 279387 281409 283951 286231 287701 288875 289951 289952 288524 287072 286701 286477
57711B86477j224j591j112j526k975l522k815k818m011m205k373n12l26q76r16
$$ 286477 285253 283662 282550 281024 278049 274527 271712 268894 264883 260678 258305 257793 257467 256591 255675
57696B55675r10j328j382p89n43q98o98L13Q19M01K91R08J078N55Q29K430L915
$$ 255675 254765 253437 252055 251266 250723 249825 249127 249440 250259 250660 250951 251859 252937 253492 254321 256751 260666
57679B60666M571N716Q226J1065J3405J5983J9325K2783K6293L1085L7691M5365
$$ 260666 265237 270953 279179 290244 303649 319632 338957 361740 388033 419118 456809 502174
57667E02174N4055O4639P6435Q6560R2139R0584P7750M9849R386l3506o7822q8477
$$ 502174 556229 620868 697303 783863 876002 966586 1044336 1094185 1103571 1070065 1002243 913766
57655I13766r6154r3731q4847p3414o1877n0644m0134l1727k5833k1066j6476
$$ 913766 817612 723881 639034 565620 503743 453099 412965 381238 355405 334339 317863
57644C17863j2815j0553q646o422m699l998l451k511j879j773j214L2P40L80L2
$$ 317863 305048 294495 285849 279427 274728 270730 267279 264768 262889 261116 259902 259934 260674 261054 261086
57629B61086L16M24J06L19J083R02n13j340n87K20l68j558k064j971j611n69Q82
$$ 261086 261402 261826 261932 262251 263334 264236 263723 262383 261796 262016 261648 260090 258026 256055 254444 253875 254757
57612B54757J288J75j101j611k065k808k880k128j983k885l192j942m78l6N4M06
$$ 254757 256045 256220 255119 253508 251443 248635 245755 243627 241644 238759 235567 233625 233147 233111 233165 233571
57596B33571J30j173k131j859j424j668j750j252j388k538k981j784o71j128k014
$$ 233571 233701 232528 230397 228538 227114 225446 223696 222444 221056 218518 215537 213753 213082 211954 209940
57581B09940j932j671k205k517j739j295k465l730l131j598j314k203k576k145
$$ 209940 208008 206337 204132 201615 199876 198581 196116 192386 189255 187657 186343 184140 181564 179419
57567A79419j908j948j557q17k29L56R01M43j225k417j844o31l91o66j99O54Q04
$$ 179419 177511 175563 174006 173189 172960 173316 174217 174660 173435 171018 169174 168543 168152 167486 167287 167941 168745
57550A68745N49P90J274J441J912L263M436M273L451L109K745J464Q8m4O32Q80
$$ 168745 169294 170084 171358 172799 174711 177974 182410 186683 190134 193243 195988 197452 197540 197496 198128 199008
57534A99008R09J604K389K013Q22K09L85N24N14P46P95J27m66J29J375J751R92
$$ 199008 199917 201521 203910 205923 206745 206954 207339 207863 208377 209123 209918 210045 209579 209708 211083 212834 213826
57517B13826J67lL26Q30J065M37q03j356o72J05n1n00l72j67n97j190j414j855
$$ 213826 213993 213990 214316 215146 216211 216648 215845 214489 213817 213922 213871 213371 212999 212832 212235 211045 209631 207776
57499B07776k772k994j938j136j921l123l092k495k857l649l301k155j841k451
$$ 207776 205004 202010 200072 198936 197015 193892 190800 188305 185448 181799 178498 176343 174502 172051
57485A72051k695k336k242k455k264j852j902k027j355k79J31n4r6j86q28j373
$$ 172051 169356 167020 164778 162323 160059 158207 156305 154278 152923 152644 152775 152721 152625 152439 151611 150238
57469A50238r40k17m35j273j533j229j149j006k3J218J491R67P15P34L39p7L72
$$ 150238 149298 149081 148646 147373 145840 144611 143462 142456 142433 143651 145142 146109 146824 147558 147897 147820 148192
57452A48192J251J440J065R61Q45Jq97p09J7n6n28J05J668K485K133J808J961
$$ 148192 149443 150883 151948 152909 153754 153755 152858 152149 152166 152110 151582 151687 153355 155840 157973 159781 161742
57435A61742J742R30L88L76J50n23j000j011q93o57j47J77r1l28O3L25l92j317
$$ 161742 163484 164414 164802 165178 165328 164805 163805 162794 161901 161244 161097 161274 161183 160855 160918 161243 160851 159534
57417A59534j281p81q64q70M42K260K624J504N78L56q0p54o96m1J34o0L25Q76
$$ 159534 158253 157472 156608 155738 156180 158440 161064 162568 163146 163502 163422 162668 161972 161931 162065 162005 162330 163206
57399A63206L96m95m7J336J370k72j239k50J123J307Q96Q85R12N09K27M62O73
$$ 163206 163602 163107 163060 164396 165766 165494 164255 164005 165128 166435 167331 168216 169128 169637 169864 170326 170999
57382A70999O71J186K437L525L846L694L103J666j19r20m94Kq4k74m94j351k443
$$ 170999 171670 172856 175293 178818 182664 186358 189461 191127 191008 190088 189594 189596 189512 189238 188744 187393 184950
57365A84950k364j007n2m74j203j093n06j08L92J340K221K539K539K429J946J157
$$ 184950 182586 181579 181527 181053 179850 178757 178251 178143 178535 179875 182096 184635 187174 189603 191549 192706
57349A92706P13R12J395J921K484K736K391J993K055J821M97q66o25O36P76m99
$$ 192706 193419 194331 195726 197647 200131 202867 205258 207251 209306 211127 211624 210758 210133 210769 211545 211046
57333B11046j293p51j72m21o28k15Nm12o12j83J44K05Q93K100K254Q46n06n61
$$ 211046 209753 209002 208830 208409 207781 207566 207571 207159 206547 206364 206508 206713 207606 209706 211960 212806 212300 211739
57315B11739j29j78j30O59J421J297P64N24L48K4J78J054J752J700J580J919K037
$$ 211739 211610 211432 211302 211961 213382 214679 215443 215967 216315 216339 216517 217571 219323 221023 222603 224522 226559
57298B26559J352N32L19M22L57L40N83P95R75J513K095J833R18O39J338J918J843
$$ 226559 227911 228443 228762 229184 229541 229881 230464 231259 232234 233747 235842 237675 238593 239232 240570 242488 244331
57281B44331J829K055J615N35K77J335K199J764Q80M95J85l50k67O38J047L65
$$ 244331 246160 248215 249830 250365 250642 251977 254176 255940 256820 257315 257500 257150 256883 257521 258568 258933
57265B58933K4R99J931J396M35Q42K388L542L801L586K906J801J176J640K416
$$ 258933 258957 259956 261887 263283 263718 264560 266948 270490 274291 277877 280783 282584 283760 285400 287816
57250B87816K665K851L494L813L049K012J854K315K587K850L467L780L210K585
$$ 287816 290481 293332 296826 300639 303688 305700 307554 309869 312456 315306 318773 322553 325763 328348
57236C28348K938L823M232M214M313M352M068L913M050L620K364J693K715M401
$$ 328348 331286 335109 339341 343555 347868 352220 356288 360201 364251 367871 370235 371928 374643 379044
57222C79044N198N321N841O655P035P158P391P098N937N279O429Q310Q866Q072
$$ 379044 384242 389563 395404 402059 409094 416252 423643 430741 436678 441957 448386 456696 465562 473634
57208D73634P610Q168Q947R383R649R741R601R794J0646J1289J0911J0273J0580
$$ 473634 481244 489412 498359 507742 517391 527132 536733 546527 557173 568462 579373 589646 600226
57195F00226J1575J2236J2541J3008J3297J3006J3004J4215J5795J6356J6227
$$ 600226 611801 624037 636578 649586 662883 675889 688893 703108 718903 735259 751486
57184G51486J6636J7407J7632J7899J9541K1963K3101K2486K1699K1685K1714
$$ 751486 768122 785529 803161 821060 840601 862564 885665 908151 929850 951535 973249
57173I73249K1171K0456J9771J8792J7840J7764J8425J8891J9222K0392K2286
$$ 973249 994420 1014876 1034647 1053439 1071279 1089043 1107468 1126359 1145581 1165973 1188259
57162A188259K3534K3699K3980K5244K6888K8141K9058K9721K9779K9304K9003
$$ 1188259 1211793 1235492 1259472 1284716 1311604 1339745 1368803 1398524 1428303 1457607 1486610
57151A486610K9084K8907K8140K7289K6836K6837K7556K9377L1906L4115L5642
$$ 1486610 1515694 1544601 1572741 1600030 1626866 1653703 1681259 1710636 1742542 1776657 1812299
57140A812299L7069L8797M0674M2643M4852M6996M8533M9615N0857N2332N3786
$$ 1812299 1849368 1888165 1928839 1971482 2016334 2063330 2111863 2161478 2212335 2264667 2318453
57129B318453N5685N8761O2661O6229O9273P2706P6900Q1258Q5583R0580R6634
$$ 2318453 2374138 2432899 2495560 2561789 2631062 2703768 2780668 2861926 2947509 3038089 3134723
57118C134723J03237J10082J17683J26688J37519J50833J67349J87012K09395
$$ 3134723 3237960 3348042 3465725 3592413 3729932 3880765 4048114 4235126 4444521
57109D444521K34942K64722K98851L36715L79261M29827M92167N68884O62513
$$ 4444521 4679463 4944185 5243036 5579751 5959012 6388839 6881006 7449890 8112403
57100H112403P77115R17877J089855J297733J545927J837858K175287K558419
$$ 8112403 8889518 9807395 10897250 12194983 13740910 15578768 17754055 20312474
57092B0312474K985704L452803L952335M474978N009467N539975O043727O492073
$$ 20312474 23298178 26750981 30703316 35178294 40187761 45727736 51771463 58263536
57084E8263536O853093P091722P168970P046858O699176O117161N301298M248784
$$ 58263536 65116629 72208351 79377321 86424179 93123355 99240516 104541814 108790598
57076A08790598K957736J453178j88971j848501l397906m740354n823169o628563
$$ 108790598 111748334 113201512 113012541 111164040 107766134 103025780 97202611 90574048
57068I0574048p159005p428162p457252p274661o917153o429048n857124n244545
$$ 90574048 83415043 75986881 68529629 61254968 54337815 47908767 42051643 36807098
57060C6807098m628097m037438l493251l005846k577455k206371j888675j618187
$$ 36807098 32179001 28141563 24648312 21642466 19065011 16858640 14969965 13351778
57052A3351778j387980j192679j028195q89855p72585o72769n88217n16435m54559
$$ 13351778 11963798 10771119 9742924 8853069 8080484 7407715 6819498 6303063 5848504
57043E848504m00932l55014l15691k81182k50643k24348k02086j82781j65836
$$ 5848504 5447572 5092558 4776867 4495685 4245042 4020694 3818608 3635827 3469991
57034C469991j51495j39518j28680j17881j06926r6079q5551p5424o5354n4593
$$ 3469991 3318496 3178978 3050298 2932417 2825491 2729412 2643861 2568437 2503083 2448490
57024B448490m2801l0330j7108j896J6598L8460O2003Q2102Q8370O9078K1423
$$ 2448490 2405689 2375359 2358251 2356355 2372953 2411413 2473416 2555518 2643888 2712966 2734389
57013B734389m2547j03135j46248j68612j73165j64371j47852j29456j12115r5587
$$ 2734389 2691842 2588707 2442459 2273847 2100682 1936311 1788459 1659003 1546888 1451301
57003A451301q0024o7316n8298n1368m5170m0290l7117l4324l0860k7554k5384
$$ 1451301 1371277 1303961 1245663 1194295 1149125 1108835 1071718 1037394 1006534 978980 953596
56992I53596k3782k1946k0245j9078j7747j5536j2732r615n790j330K595M960
$$ 953596 929814 907868 887623 868545 850798 835262 822530 812915 807125 805795 808390 813350
56980H13350N428L222k692j1419j9771k5243k8029k9236k8732k6028k1950j7959
$$ 813350 818778 822000 819308 807889 788118 762875 734846 705610 676878 650850 628900 610941
56968F10941j4627j1776r345p192m837k077P53L584O736J0056J3076J6171K0034
$$ 610941 596314 584538 575193 568001 563164 561087 561840 565424 572160 582216 595292 611463 631497
56955F31497K3568K3822J8807R216k885j5485k6324l3131l5336l4449l2000k8341
$$ 631497 655065 678887 697694 706910 704025 688540 662216 629085 593749 559300 527300 498959
56943D98959k3863j9656j6137j2493q276m116k02M310R578J4474J8614K3267K9192
$$ 498959 475096 455440 439303 426810 418534 414418 414216 418526 428104 442578 461192 484459 513651
56930E13651L5063L8879L9207L4268K2126L691j6088l1871m1762m6499m6687m2837
$$ 513651 548714 587593 626800 661068 683194 686885 670797 638926 597164 550665 503978 461141
56918D61141l6747l0698k5628k1444j8319j6216j4098j1169q321o949o863o668
$$ 461141 424394 393696 368068 346624 328305 312089 297991 286822 278501 271552 264689 258021
56906B58021n724m590l842l434k983k094p76K68M25L75J378L251M544M945N779
$$ 258021 252297 247707 243865 240431 237448 235354 234578 234846 235271 235646 237024 240275 244819 249764 255543
56891B55543P595R287J0514J2829J7062K1436K3929K4809K4997K3433J8142R176
$$ 255543 263138 272425 282939 295768 312830 334266 358195 383004 408001 431434 449576 458752
56879D58752j154j0346j6780j9741j9758j8242j5834j1993o885k186J143M286
$$ 458752 457598 447252 430472 410731 390973 372731 356897 344904 338019 335833 336976 341262
56867C41262Q506J3141J7191K1343K6746L3089L9593M6623N4346O0680O2305N7021
$$ 341262 349768 362909 380100 401443 428189 461278 500871 547494 601840 662520 724825 781846
56855G81846M4048K3717j147k4780m1737n0423n2408m9507m3084l4821k5977j6558
$$ 781846 825894 849611 848464 823684 781947 731524 679116 629609 586525 551704 525727 509169
56843E09169o661K359R653J6486K4372L2906M1318N0633O2034P4347Q5439R4514
$$ 509169 502508 504867 514520 531006 555378 588284 629602 680235 742269 816616 902055 996569
56831I96569J00037R6566P7748M3243N31m0375p2254r1758r8837r6322q8152p6911
$$ 996569 1096606 1193172 1270920 1314163 1314694 1274319 1202065 1110307 1011470 915148 826996 750085
56819G50085o3754n0151l7839k7139j7164p711P17Q643J7547K7857L8488M8555
$$ 750085 686331 636180 598341 571202 554038 546327 547044 555687 573234 601091 639579 688134
56807F88134N8023O6385P1615P0455N9396L6694N133k7880n4717p1928p9827p9573
$$ 688134 746157 812542 884157 954612 1014008 1050702 1055835 1027955 973238 901310 821483 741910
56795G41910p2830o2846n2950m3927l4832k5787j7910j1127m472J779O671J0915
$$ 741910 669080 606234 553284 509357 474525 448738 430828 419701 415229 417008 423679 434594
56783D34594J6212K2429K7854L1986L5360L6469L1832K0004L479j3845k9183m0550
$$ 434594 450806 473235 501089 533075 568435 604904 636736 656740 660219 646374 617191 576641
56771E76641m6538m7424m4999m0704l5199k9619k5251k1813j8022j4057j1485
$$ 576641 530103 482679 437680 396976 361777 332158 306907 285094 267072 253015 241530
56760B41530j0551r679q019o362n133l693k176j791k556k842k004j446k150l055
$$ 241530 230979 221300 213281 206919 201786 198093 195917 194126 191570 188728 186724 185278 183128 180073
56746A80073k968k350k066j919j508j247j451j554j101n45m13n52o83p36n09M7
$$ 180073 177105 174755 172689 170770 169262 168015 166564 165010 163909 163364 162951 162399 161716 160980 160471 160518
56730A60518J85o75j513q77O46R95j48q56rJ191J520J552K183K969L063K508J743
$$ 160518 160703 160028 158515 157638 158284 159279 159131 158275 158266 159457 160977 162529 164712 167681 170744 173252 174995
56713A74995R19L23L92Q56R47P22Q96J285R00k16r30r77j276j931j812o73J43
$$ 174995 175914 176237 176629 177485 178432 179154 180050 181335 182235 182019 181089 180112 178836 176905 175093 174420 174563
56696A74563k07r42j245j326j262m99O83R32j47j169j045m57n10j228k066k670
$$ 174563 174356 173414 172169 170843 169581 169082 169765 170697 170550 169381 168336 167879 167369 166141 164075 161405
56680A61405k601j502KP93R02J206J572J014k09o07J06N92K71Q4M12M41J62P33
$$ 161405 158804 157302 157304 158097 158999 160205 161777 162791 162582 161975 162081 162673 162944 163028 163440 163881 164043 164776
56662A64776K060K298P92o35m75M13O80M71L31Mm65j82R45J723J772K197L245
$$ 164776 166836 169134 169926 169291 168816 169229 169909 170380 170711 170715 170250 170068 171013 172736 174508 176705 179950
56645A79950L406K050P98R45J536J482J543K546L540L523L268L709M124L635K974
$$ 179950 183356 185406 186204 187149 188685 190167 191710 194256 197796 201319 204587 208296 212420 216055 219029
56630B19029L079L367L052K700K887K771J677O41P17J110P00N1J23L54j85r57
$$ 219029 222108 225475 228527 231227 234114 236885 238562 239203 239920 241030 241730 241781 241904 242258 242073 241116
56614B41116j041r22j415j885j330l15q0n11o01j44L75P36O89l08j853k317j082
$$ 241116 240075 239153 237738 235853 234523 234208 234128 233617 233016 232872 233247 233983 234672 234364 232511 230194 229112
56597B29112K10K2q89j053o92q64j427j626j574j623j318n27l38j216j562jK157
$$ 229112 229322 229344 228455 227402 226710 225846 224419 222793 221219 219596 218278 217751 217413 216197 214635 214634 216791
56580B16791K703J762J152J378J395Q50N40Q60J384J884K428K821K968L260L812
$$ 216791 219494 221256 222408 223786 225181 226031 226571 227431 228815 230699 233127 235948 238916 242176 245988
56565B45988M041L875M289N758P355Q431R794J2127J4632J6512J8211J9820J9864
$$ 245988 250029 253904 258193 263951 271306 279737 289531 301658 316290 332802 351013 370833 390697
56552C90697J7397J3739J0540P678M789L102L525M486L956K454J701J560O82q20
$$ 390697 408094 421833 432373 440051 444840 447942 451467 455953 459909 462363 464064 465624 466306 465486
56538D65486j839k532l793n141n493n371o142p618q505q731r208r900j0165j0398
$$ 465486 463647 461115 457322 452181 446688 441317 435175 427557 419052 410321 401113 391213 381048 370650
56524C70650j1269j1889j0938r112q315q749q931q256p479o878n936m759m014
$$ 370650 359381 347492 336554 327442 319127 310378 301447 293191 285712 278834 272898 268139 264125
56511B64125l564k802j992j823j956j655j257j439j652j031k71o96j970k613k370
$$ 264125 260561 257759 255767 253944 251988 250333 249076 247637 245985 244954 244683 243987 242017 239404 237034
56496B37034k226k448k379j923j516j011j00N77L18j51K80J184J346Q45O52P17
$$ 237034 234808 232360 229981 228058 226542 225531 225431 226008 226326 226175 226455 227639 228985 229830 230482 231199
56480B31199K18p00j083p40k13L31Q84R28L42J36R86J933J946J574J598J406M31
$$ 231199 231417 230717 229634 228894 228681 229012 229896 230824 231166 231302 232288 234221 236167 237741 239339 240745 241176
56463B41176j62P76K196K438J802J533J520J120R57J658K097J122j51j62L58q1
$$ 241176 241014 241790 243986 246424 248226 249759 251279 252399 253356 255014 257111 258233 258082 257920 258278 258197
56447B58197q31m69L39J18m94k2Q73O60N0O32J632J287L89Q73J883J046j020j432
$$ 258197 257366 256897 257236 257354 256860 256838 257711 258371 258421 259053 260685 261972 262361 263234 265117 266163 265143 263711
56429B63711N7Q35K0n73k92n84j688j958j136q78j409r71P13J650J070O19J193
$$ 263711 263768 264603 264623 264050 263758 263174 261486 259528 258392 257514 256105 255134 255847 257497 258567 259186 260379
56412B60379J549R38L53L41J27l66j05Q36J140P37Q77J480J142L2l6J156J846
$$ 260379 261928 262866 263219 263560 263687 263321 263216 264052 265192 265929 266806 268286 269428 269460 269424 270580 272426
56395B72426J550J687K444K121M10o25J42J352J810K074K528K448J833J809K485
$$ 272426 273976 275663 278107 280228 280638 280013 280155 281507 283317 285391 287919 290367 292200 294009 296494
56380B96494K714K464K902L782L447J832P68P84N16k98k07Q78J132P4n45m9J9
$$ 296494 299208 301672 304574 308356 311803 313635 314403 315187 315703 315405 315198 316076 317208 317282 316737 316688 316707
56363C16707j001j568q38j16k74l77R8K41j58j6N83J07j411j806k78J230J236
$$ 316707 315706 314138 313300 313184 312910 312533 312631 312872 312714 312698 313281 313388 311977 310171 309893 311123 312359
56346C12359O72O16O20L29L79P63N98J54P29K011K257J445J428K516L047K723
$$ 312359 313031 313647 314267 314596 314975 315738 316336 316490 317219 319230 321487 322932 324360 326876 329923 332646
56330C32646L191M616N089M216L847M445M190K694J974K559K272K95j134n90L38
$$ 332646 335837 340453 345542 349758 353605 358050 362240 364934 366908 369467 371739 372034 370900 370310 370648
56315C70648L02K89Q57O24p84j491p43l64j258j634l95Q80J026J237K253K775
$$ 370648 370950 371239 372096 372720 371936 370445 369702 369338 368080 366446 366051 366931 367957 369194 371447 374222
56299C74222K355K700M414N564N163M827N293M723K299K04J3L46j4J52J668L038
$$ 374222 376577 379277 383691 389255 394418 399245 404538 409261 411560 411764 411777 412123 412109 412261 413929 416967
56283D16967L262L523M317M147K826K663M591O442O881P399Q689Q882P392O640
$$ 416967 420229 423752 428069 432216 435042 437705 442296 448738 455619 463018 471707 480589 487981 494621
56269D94621P720Q333P257O878Q682J0370J0193J0203J2212J4377J4918J5510
$$ 494621 502341 510674 517931 524809 533491 543861 554054 564257 576469 590846 605764 621274
56257F21274J7818K0293K1582K3525K7518L1426L3501L5901M0894M6909N1764
$$ 621274 639092 659385 680967 704492 732010 763436 796937 832838 873732 920641 972405
56246I72405N6457O2310O7672P0956P3830P7866Q1221Q1914Q1211Q0351P7408
$$ 972405 1028862 1091172 1158844 1229800 1303630 1381496 1462717 1544631 1625842 1706193 1783601
56235A783601P0870O2876N5191M5543L1850J6609K992r996k4223l7617m7151n3735
$$ 1783601 1854471 1917347 1972538 2018081 2049931 2066540 2069532 2059536 2035313 1997696 1950545 1896810
56223A896810n9735o4470o6463o7414o9418p0836o9236o5943o3384o0587n5664
$$ 1896810 1837075 1772605 1706142 1638728 1569310 1498474 1429238 1363295 1299911 1239324 1183660
56212A183660n0260m6987m4813m1386l7600l5578l4278l1489k8054k5936k4220
$$ 1183660 1133400 1086413 1041600 1000214 962614 927036 892758 861269 833215 807279 783059
56201G83059k1168j8005j6604j5648j3159j0521r882r895q195n800m956m850l570
$$ 783059 761891 743886 727282 711634 698475 687954 678072 668177 659982 654182 649226 644376 640806
56188F40806j970j634j441n1Q18m51j782r65J36q54k146j117P70R48N46J562K410
$$ 640806 638836 637202 635761 635710 636528 636077 634295 633330 633466 632612 630466 629349 630119 631067 631613 633175 635585
56171F35585J106k54R26K790K706K525M882P534P079N182N371O666O290N722P820
$$ 635585 636691 636437 637363 640153 642859 645384 650266 657800 664879 670061 675432 682098 688388 694110 701930
56156G01930J0769J1147J0475J2378J5674J6709J6227J7535K0003K0902K1571
$$ 701930 712699 723846 734321 746699 762373 779082 795309 812844 832847 853749 875320
56145H75320K5195L0435L3775L6307M1791M9787N7205O4737P5175Q7253R7784
$$ 875320 900515 930950 964725 1001032 1042823 1092610 1149815 1214552 1289727 1376980 1474764
56134A474764J08231J22297J38464J51489J59617J63743J61325J48463J27149
$$ 1474764 1582995 1705292 1843756 1995245 2154862 2318605 2479930 2628393 2755542
56125B755542J03975Q2785O4570N2288M8397M8711M5498L5975K2192M966j5153
$$ 2755542 2859517 2942302 3006872 3059160 3107557 3156268 3201766 3237741 3259933 3264899 3249746
56114C249746l3128m3229m6493m8300n0869n4809o4743q4867j10594j32526j47189
$$ 3249746 3216618 3173389 3126896 3078596 3027727 2972918 2908175 2823308 2712714 2580188 2432999
56103B432999j56380j58707j50786j35359j19271j04211q7519p0597n7909m8743
$$ 2432999 2276619 2117912 1967126 1831767 1712496 1608285 1520766 1450169 1392260 1343517
56093A343517l8716k8455k2280j9338j4749q614n253m484k340O25O47q19J011
$$ 1343517 1304801 1276346 1254066 1234728 1219979 1211365 1206112 1201628 1199288 1199913 1200560 1199741 1200752
56080A200752N012N955M341N140P946Q015O055P063J0389J0858R026J0158J3863
$$ 1200752 1205764 1211719 1216060 1221200 1229146 1237161 1243216 1250279 1260668 1271526 1280552 1290710 1304573
56067A304573J4976J3910J5677J9368J9362J6367J6338J8895J7981J3657J1995
$$ 1304573 1319549 1333459 1349136 1368504 1387866 1404233 1420571 1439466 1457447 1471104 1483099
56056A483099J3497J2965J0558J1404J4525J3991J0841J1790J6326J7448J5015
$$ 1483099 1496596 1509561 1520119 1531523 1546048 1560039 1570880 1582670 1598996 1616444 1631459
56045A631459J5660J9519K0163J7800J9192K4147K5656K3785K5552L0659L1630
$$ 1631459 1647119 1666638 1686801 1704601 1723793 1747940 1773596 1797381 1822933 1853592 1885222
56034A885222K8693K9758L4977L6389L3766L5278M1229M3106M0296M1472M7588
$$ 1885222 1913915 1943673 1978650 2015039 2048805 2084083 2125312 2168418 2208714 2250186 2297774
56023B297774M9996M7507M8528N4054N5691N2864N4511O1223O3622O1081O3492
$$ 2297774 2347770 2395277 2443805 2497859 2553550 2606414 2660925 2722148 2785770 2846851 2910343
56012B910343P1694P5240P2652P4279Q1756Q4970Q2958Q6807R7663J03557J02461
$$ 2910343 2982037 3057277 3129929 3204208 3285964 3370934 3453892 3540699 3638362 3741919 3844380
56001C844380J06358J17635J24422J24611J30744J45251J55226J57897J66276
$$ 3844380 3950738 4068373 4192795 4317406 4448150 4593401 4748627 4906524 5072800
55992E072800J82961J94361J97890K08037K28150K44040K53254K71337L00903
$$ 5072800 5255761 5450122 5648012 5856049 6084199 6328239 6581493 6852830 7153733
55983G153733L25194L41267L67382M07885M44708M74026N15500N73800O28923
$$ 7153733 7478927 7820194 8187576 8595461 9040169 9514195 10029695 10603495 11232418
55974A1232418O77349P42840Q32658R25576J018370J139014J297283J471043J660174
$$ 11232418 11909767 12652607 13485265 14410841 15429211 16568225 17865508 19336551 20996725
55965B0996725J902134K214109K576340K994914L518115M164872M906537N749922
$$ 20996725 22898859 25112968 27689308 30684222 34202337 38367209 43273746 49023668
55957D9023668O761332P973294R354660J0916681J2754642J4943452J7515831
$$ 49023668 55785000 63758294 73112954 84029635 96784277 111727729 129243560
55950A29243560K0598840K4399034K8922148L3832851L8630019M2572821M4068669
$$ 129243560 149842400 174241434 203163582 236996433 275626452 318199273 362267942
55943C62267942M0526664K9802234J2404557p898572k6070944l8604429m4702436
$$ 362267942 402794606 432596840 445001397 437102825 411031881 372427452 327725016
55936C27725016m5489834m2706091l7984862l2611738k7392457k2677149j8583111
$$ 327725016 282235182 239529091 201544229 168932491 141540034 118862885 100279774
55929A00279774j5166009j2403365j0175525q363213o912313n773610m858134
$$ 100279774 85113765 72710400 62534875 54171662 47259349 41485739 36627605
55922C6627605m095595l473774k982714k575717k217307j916255j679173j478165
$$ 36627605 32532010 29058236 26075522 23499805 21282498 19366243 17687070 16208905
55914A6208905j292168j135337j017230r15662q14173p27771o67285o14322n54632
$$ 16208905 14916737 13781400 12764170 11848508 11034335 10306564 9639279 9024957 8470325
55905H470325n02288m68404m37841l98519l63598l43606l24882k96036k69103
$$ 8470325 7968037 7499633 7061792 6663273 6299675 5956069 5631187 5335151 5066048
55896E066048k54783k41819k19909j99355j89542j80420j63060j47318j42062
$$ 5066048 4811265 4569446 4349537 4150182 3960640 3780220 3617160 3469842 3327780
55887C327780j37994j26371j15445j12656j09306r8010q7374q4687q1505p0585
$$ 3327780 3189786 3063415 2947970 2835314 2726008 2627998 2540624 2455937 2374432 2303847
55877B303847o0093n7156n4062m4639l8046m2382m9893n1929n3745o1203o7277
$$ 2303847 2243754 2186598 2132536 2087897 2049851 2007469 1957576 1905647 1851902 1790699 1723422
55866A723422o5054o0680o0683n9537n1987m4771m3941m3143l6394l0145l0910
$$ 1723422 1658368 1597688 1537005 1477468 1425481 1380710 1336769 1293626 1257232 1227087 1196177
55855A196177l2856k9380k5373k6486k7564k3121j8448j9276k0975j8765j7888
$$ 1196177 1163321 1133941 1108568 1082082 1054518 1031397 1012949 993673 972698 953933 936045
55844I36045k2812k6936k4070j9900k1145k3302k0151j5809j6133j7392j4383
$$ 936045 913233 886297 862227 842327 821182 797880 777729 761920 745787 728395 714012
55833G14012j1098j2532j4368j1414p992r515j1780r118n323o065q053o168l955
$$ 714012 702914 690382 676014 664600 656608 647093 635313 626195 620872 614807 606754 600586 596631
55820E96631o639j0665j0455q783j0412j1991q565l883m016o381n064j619r49
$$ 596631 589992 579327 568872 560089 549677 537686 529121 525238 521222 514841 509777 508158 507209
55807E07209j549P25L988M414M300P422J1099J1188J0126J1845J3568J0903O162
$$ 507209 505660 506385 510373 514787 519087 526509 537608 548796 558922 570767 584335 595238 601400
55794F01400L502Q02n395j1849j3901j3987j6584j9342j7688j3803j2537j2495
$$ 601400 604902 605704 600309 588460 574559 560572 543988 524646 506958 493155 480618 468123
55782D68123r520n164l550l568k108j309m641r309j0343q832q601q345m764OJ815
$$ 468123 458603 453439 449889 446321 444213 442904 438263 428954 418611 409779 401178 392833 388069 388075 389890
55767C89890K104M603P653P185M156J856r54o797j2716j4250j3146j3811j5152
$$ 389890 391994 396597 404250 411435 415591 417447 416493 409696 396980 382730 369584 355773 340621
55754C40621j3323r643q159p944n345j549n77j941k298k163m057o270n437l212
$$ 340621 327298 317655 309496 301552 296207 294658 294081 292140 289842 287679 283622 277352 271915 268703
55740B68703l512n266m700k589k424l453k431l19l92j649q51Q17j25k517k633
$$ 268703 265191 259925 255225 252636 250212 246759 244328 244009 243617 241968 241117 241934 241809 239292 236659
55725B36659j386k496n126n250l140k612l856l708k089j694k126o75J782J944
$$ 236659 235273 232777 227651 222401 219261 216649 212793 209085 206996 205302 203176 202501 204283 206227
55711B06227L69O18K798L810L325L728M843M374K904K909L552J832j797m262n312
$$ 206227 206596 207214 210012 213822 217147 220875 225718 230092 232996 235905 239457 241289 239492 235230 229918
55696B29918o960q560p819n643m733m519k635r6M31l0J348L369K738M28K46K171
$$ 229918 222958 214398 206579 200936 196203 191684 189049 188953 189384 189354 190702 194071 196809 197237 197483 199654
55680A99654K985K536L413N355N827N269N973O708M464O17p92o8r36l319l540
$$ 199654 202639 205175 208588 213943 219770 225039 231012 237720 242184 242801 242009 241941 241005 237686 234146
55665B34146j302n1m50J52J769J533l01l19J791K883K559L671O183O653M558L181
$$ 234146 232844 232793 232343 232495 234264 235797 235496 235177 236968 239851 242410 246081 252264 258917 263475 266656
55649B66656L402K452l14k129k449m075p483r519r071q737r522r105o802n215
$$ 266656 270058 272510 272196 270067 267618 263543 256060 246541 237470 228733 219211 210106 203304 198089
55635A98089n405n228l823l151l732l491k067j707k767k922j912k302m314m742
$$ 198089 192684 187456 183633 180482 176750 173259 171192 169485 166718 163796 161884 159582 155268 150526
55621A50526k478m93p49j620j880k736m293m251j968Q6M77O32J319J211J63L2
$$ 150526 148048 147555 146806 145186 143306 140570 136277 132026 130058 130144 130621 131253 132572 133783 133946 133978
55605A33978R34O41j203k140j307p48j299j266k83l03j564j747m68k52j739k240
$$ 133978 134912 135553 134350 132210 130903 130155 128856 127590 127307 127004 125440 123693 123225 122973 121234 118994
55589A18994o52N08k56r66k43K41o55j311p23m44j258j430j36Q50O38P92J872
$$ 118994 118342 118850 118594 117628 117385 117626 116971 115660 114937 114493 113235 111805 111669 112519 113157 113949 115821
55572A15821J994O29J00J434K382J575R82K049K967K047O78N57R92J091J606K648
$$ 115821 117815 118444 118544 119978 122360 123935 124917 126966 129933 131980 132658 133215 134207 135298 136904 139552
55556A39552K476O17p33l45K5q72j385j84J099P41k13k41Q3j39j32P13J308R91
$$ 139552 142028 142645 141912 141567 141592 140720 139335 139151 140250 140991 140778 140537 140620 140481 140349 141062 142370 143361
55538A43361R21J749K126J184J60Q0J89JM09J404J351j30j257j398k294m489n683
$$ 143361 144282 146031 148157 149341 149501 149581 149770 149771 150180 151584 152935 152805 151548 150150 147856 143367 137684
55521A37684m488k888k891l521l226k645k771k773j821r65j191j609j280q44p88
$$ 137684 133196 130308 127417 123896 120670 118025 115254 112481 110660 109695 108504 106895 105615 104771 103983
55506A03983k80Q16J128L60K12J254J543O3j231o53M62L39l35k67rm25p71l14
$$ 103983 103703 104519 105647 106007 106219 107473 109016 109079 107848 107195 107657 107996 107661 107394 107385 106960 106189 105875
55488A05875k5p23j338q26n3j13n08m91m07m46O7R51Q51k36m37P91J430K73j027
$$ 105875 105850 105127 103789 102963 102910 102797 102289 101798 101391 100945 101012 101963 102814 102578 102141 102932 104362 104635 103608
55469A03608r26m60r53j565j066k1N25O82O13j89j311j259l3M71k91n21N23J062
$$ 103608 102682 102222 101269 99704 98638 98617 99142 99824 100437 100248 98937 97678 97645 98116 97825 97304 97827 98889
55451I8889J49n30J17N60k59p87J71J153Q90N90J300J714Q82L53J226J757L86
$$ 98889 99038 98508 98625 99185 98926 98139 98310 99463 100353 100943 102243 103957 104839 105192 106418 108175 108561
55434A08561j412j776j493j833j929q72m3o37j242m52M42K1m79K90R38L5p93L32
$$ 108561 107149 105373 103880 102047 100118 99246 99203 98566 97324 96872 97314 97335 96856 97146 98084 98119 97326 97658
55416I7658J906J600M06O34J684J380J60K07J428J794R50K98J36l86j026q40k77
$$ 97658 99564 101164 101570 102204 103888 105268 105428 105635 107063 108857 109807 110105 110241 109855 108829 107989 107712
55399A07712m54j037r74n49o11p38k85o5q25j349l27J116J187L84L41R14R15N88
$$ 107712 107258 106221 105247 104698 104087 103349 103064 102999 102174 100825 100498 101614 102801 103185 103526 104440 105355 105943
55381A05943Q88J349J034N57P96Q95o5p68L51K072K144R07L07L52m71k013k654
$$ 105943 106831 108180 109214 109771 110567 111462 111397 110629 110980 113052 115196 116103 116410 116762 116291 114278 111624
55364A11624k246k107k376k023j164r61j389j306n27J07L94O46N41j40l87N52
$$ 111624 109378 107271 104895 102872 101708 100747 99358 98052 97525 97632 98026 98672 99213 99073 98686 99238
55348I9238J477J016J8J06Q84Q83K72K44N85K45m70n83n03j119j692j051K2J9
$$ 99238 100715 101731 101749 101855 102739 103622 103894 104138 104723 104968 104498 103915 103412 102293 100601 99550 99572 99591
55330I9591n54k44M81J49o99k75J161J657Q71K79K76j69j029j008j8N80L71L52
$$ 99591 99037 98793 99274 99423 98724 98449 99610 101267 102138 102417 102693 102524 101495 100487 100469 101049 101420 101772
55312A01772Q35R83N44J64k6m06o09j2P97P73K24J89N29M45K38N69Q05J21n48
$$ 101772 102607 103590 104134 104298 104272 103866 103257 103245 104042 104815 105039 105228 105757 106202 106440 107009 107814 107935 107387
55293A07387O8J097Q66j28k01K92l46j678j485M59J905J731J210J247J023N3o69
$$ 107387 107455 108552 109418 109290 109089 109381 109035 107357 105872 106331 108236 109967 111177 112424 113447 113500 112831
55276A12831m33J71N08N84K02q54j796j636r35r83j516j259l95l03q62m36J281
$$ 112831 112398 112569 113077 113661 113863 113009 111213 109577 108642 107659 106143 104884 104489 104186 103324 102888 104169
55259A04169K614K438J448O30K69N39J345J579L74j065q43O28J204L85k59k9J9
$$ 104169 106783 109221 110669 111299 111568 112107 113452 115031 115405 114340 113497 114125 115329 115714 115455 115426 115445
55242A15445n72q26l81k04o47p85k88k4k73j48O26J109P91K95k7n33j041p12M25
$$ 115445 114873 114047 113666 113462 112815 112030 111742 111718 111445 111297 111923 113032 113823 114118 114091 113558 112517 111805 112230
55223A12230J316J493J421J128J62j028j343p67l06j54L96J228J377Q15N33P07
$$ 112230 113546 115039 116460 117588 117750 116722 115379 114612 114306 114152 114548 115776 117153 117968 118501 119208
55207A19208N26p9l00r9k25n36j45O69O40k63o69q8N04N46N73P38M60k12n29m90
$$ 119208 119734 119655 119355 119256 119031 118495 118350 119019 119659 119396 118727 118639 119143 119689 120262 121000 121460 121248 120719 120229
55187A20229p63j126p23J69M22M1m9K6o73j695j504p1R41Q14M67L96Q6l42j16
$$ 120229 119466 118340 117617 117786 118208 118249 118200 118226 117553 115858 114354 114283 115224 116038 116505 116901 116987 116645 116529
55168A16529L57j34j189j033M82J529J315J041J354J280M61L5M77P49L72K47O38
$$ 116529 116886 116752 115563 114530 115012 116541 117856 118897 120251 121531 121992 122027 122504 123253 123625 123872 124510
55151A24510N89PJ04R28P71r03k244j832o49n9J23L81K50m26o91j45K56K9M4O51
$$ 124510 125099 125106 125210 126138 126909 126006 123762 121930 121281 121222 121345 121726 121976 121550 120859 120714 120970 120999 121043 121694
55131A21694P52k06j050q32k89k13p9N91J082Q55N20N33L80q0p2M04J60j002j514
$$ 121694 122446 122240 121190 120358 120069 119856 119777 120368 121450 122305 122825 123358 123738 123658 123586 123990 124150 123148 121634
55112A21634n77M46L11j77J53R00J177J183J305J101L87lL26N16J05J4P55J268
$$ 121634 121057 121503 121814 121637 121790 122690 123867 125050 126355 127456 127843 127840 128166 128682 128787 128801 129556 130824
55094A30824P95L42R12J739J658R17K83l52j194j574j043l13l9J67N38L67n23
$$ 130824 131619 131961 132873 134612 136270 137187 137470 137118 135924 134350 133307 132994 132955 133122 133660 134027 133504
55077A33504j069p78p45j573j961q44N93P71J86K85J011J314J180J301J438P87
$$ 133504 132435 131657 130912 129339 127378 126534 127127 127898 128084 128369 129380 130694 131874 133175 134613 135400
55061A35400m20j164j116p44m17k61m52q26q18m73n85j252j415o30M4j52k68O43
$$ 135400 134980 133816 132700 131956 131539 131278 130826 130000 129182 128709 128124 126872 125457 124827 124871 124719 124451 125094
55043A25094J739J657O64P2K52N60O44O28M65R9j75k41m41p71o27J13O80P17Q90
$$ 125094 126833 128490 129154 129226 129478 130038 130682 131310 131775 131874 131699 131458 131017 130246 129619 129732 130412 131129 132019
55024A32019J522J756R22l47j174j514j491q55J21L97k57p32l86q8n36r50n36
$$ 132019 133541 135297 136219 135872 134698 133184 131693 130838 130959 131356 131099 130367 129981 129893 129357 128407 127871
55007A27871J08J77M2K92N79N28O53J208J402Q00K91N56Q52M93J90O47J153Q80
$$ 127871 127979 128156 128198 128490 129069 129597 130250 131458 132860 133660 133951 134507 135359 135852 136042 136689 137842 138722
54989A38722L71L76L80k78j019j076q60r25p59O6O93L71j01K10O88L68k61j79
$$ 138722 139093 139469 139849 139571 138552 137476 136616 135691 134932 134998 135691 136062 135961 136171 136859 137227 136966 136787
54971A36787M94J224K253L546L746J984k58r24j29N49O48Q74J277J242Q49O52
$$ 136787 137281 138505 140758 144304 148050 150034 149776 148852 148723 149272 149920 150794 152071 153313 154162 154814
54955A54814N52J94r0N8R6m12p71l95n5m34o52K55J425J508R11Q09R28L14n29
$$ 154814 155366 155560 155470 155528 155624 155212 154441 154046 153991 153557 152905 153160 154585 156093 157004 157813 158741 159055 158526
54936A58526l94L79M79jJ47J005J566J729K282L153L565L737M582N838O358O167
$$ 158526 158132 158511 158990 158989 159136 160141 161707 163436 165718 168871 172436 176173 180755 186593 192951 199118
54920A99118O409P308P984Q263Q831R387Q512N767K317q95m139p589j0419j1761
$$ 199118 205527 212835 220819 229082 237913 247300 255812 261579 263896 263001 258862 251273 240854 229093
54906B29093j1652j0565q905p156n784m747l749k866k379k163j944j819j824j513
$$ 229093 217441 206876 197971 190815 185031 180284 176535 173669 171290 169127 167183 165364 163540 162027
54892A62027o83J5N5K0O45J549J962K068K495L082L335L521M209N180N914O538
$$ 162027 161344 161359 161414 161434 162079 163628 165590 167658 170153 173235 176570 180091 184300 189480 195394 201932
54876B01932P264P600P259O974P202O888M979K197j74k341n113p756q787q329
$$ 201932 209196 216796 224055 231029 238231 245119 250098 252295 252121 249780 244667 236911 228124 219795
54862B19795p809p618o980n877n210n123m907m413m045l533k344j105r44j606
$$ 219795 211986 204368 197388 191511 186301 181178 176271 171858 167813 164280 161936 160831 159887 158281
54848A58281j889j742k103k802k505r41N68J083R60O21n5q09q99k68L13M50M03
$$ 158281 156392 154650 152547 149745 147240 146299 146867 147950 148910 149531 149476 148667 147768 147500 147813 148263 148666
54831A48666K07l13p57o00k39l71n90lJ081J527J234J041R60J91j065j500o15
$$ 148666 148873 148560 147803 147203 146964 146593 146003 146000 147081 148608 149842 150883 151843 152034 150969 149469 148854
54814A48854O24J251J201P29J65J06O82Q62k23j658j897j028l31k9N73J194R03
$$ 148854 149478 150729 151930 152659 152824 152930 153612 154474 154251 152593 150696 149668 149337 149308 149881 151075 151978
54797A51978J56L68J371J527M94k74q3J14j22J16J043J413O28j60LM90N55N46
$$ 151978 152134 152502 153873 155400 155894 155620 155537 155651 155529 155645 156688 158101 158729 158569 158572 159062 159617 160163
54779A60163Q45J012Q91J187K159L007L256L448L848L910L780M704P042R235R818
$$ 160163 161008 162020 162911 164098 166257 169264 172520 175968 179816 183726 187506 192210 199252 208487 218305
54764B18305R268Q809Q573P969O951N737M049J564j337m008o242q044r273r898
$$ 218305 227573 236382 244955 252924 259875 265612 269661 271225 269888 265880 259638 251594 242321 232423
54750B32423j0071r726q692p282n995m732l195j934j835k577k923k540k153j832
$$ 232423 222352 212626 203934 196652 190657 185925 182730 180796 178961 176384 173461 170921 168768 166936
54736A66936p87Q51J726J355R93J699K912L682L963L960L466K773K990M571O417
$$ 166936 166149 167000 168726 170081 171074 172773 175685 179367 183330 187290 190756 193529 196519 201090 207507
54721B07507P382P672Q003Q280P943O858N084K459q50m030o444q171r341r629
$$ 207507 214889 222561 230564 238844 246787 253645 258729 261188 260338 256308 249864 241693 232352 222723
54707B22723q892p670o566n727n091m596m013l248k757k871k912k054q75o89j392
$$ 222723 213831 206161 199595 193868 188777 184181 180168 176920 174163 171292 168380 166326 165451 164762 163370
54692A63370j516o02J28j26n50k78K71M20L16K93K04R9M39J080J051l6j302j828
$$ 163370 161854 161252 161380 161254 160704 160426 160697 161117 161433 161726 161930 162029 162468 163548 164599 164563 163261 161433
54674A61433j588q69J01O44O4j009j072L0P38J97n80o46n56r45j206p83l89o71
$$ 161433 159845 158976 159077 159721 159785 158776 157704 157734 158472 158669 158089 157443 156887 155942 154736 153953 153564 152893
54656A52893q75j74P00N69k79o20j25N26R05J096J125R61Q01O51J31p40j158n93
$$ 152893 152018 151844 152544 153113 152834 152214 152089 152615 153520 154616 155741 156702 157503 158154 158285 157545 156387 155794
54638A55794L46P62N86L09K05L51Q09J199Q05l81j321j231o11m09p63j068r13
$$ 155794 156140 156902 157488 157797 158002 158353 159162 160361 161166 160785 159464 158233 157622 157213 156450 155382 154469
54621A54469m36q8j41k30M68J974K862J892mp51Q3Q78N31k80o09n08k04L99Q84
$$ 154469 154033 153945 153804 153574 154042 156016 158878 160770 160766 160015 160098 160976 161507 161227 160618 160110 159906 160305 161189
54602A61189M09p46j084oJ309J755J576J183L17p99j020o6O67J74o14m66J95K31
$$ 161189 161598 160852 159768 159762 161071 162826 164402 165585 165902 165103 164083 164017 164684 164858 164244 163778 163973 164204
54584A64204l90q85r34o12J54J100J413Q46J84k2j88n87o17L2O31N85L52M01M40
$$ 164204 163814 162929 161995 161383 161537 162637 164050 164896 165080 165058 164870 164283 163666 163698 164329 164914 165266 165667 166107
54565A66107K84L51O07L71j81J18J340J901R56k65n95n88q72p21K17N97m89j604
$$ 166107 166391 166742 167349 167720 167539 167657 168997 170898 171854 171589 170994 170406 169534 168813 169030 169627 169138 167534
54547A67534j097K65P37L65K87L76k01r12n25P05J430J382J353J426J001L09K53
$$ 167534 166437 166702 167439 167804 168091 168467 168266 167354 166829 167534 168964 170346 171699 173125 174126 174435 174688
54530A74688R12J507J660J504R81J31l88j99N1j73j86O83J665J720J181Q56M32
$$ 174688 175600 177107 178767 180271 181252 181383 180995 180796 180847 180674 180488 181171 182836 184556 185737 186593 187025
54513A87025o46j645j616j194j588k432k483j787j338j075j66J131J656J217O17
$$ 187025 186379 184734 183118 181924 180336 177904 175421 173634 172296 171221 171055 172186 173842 175059 175676
54498A75676J12n38r18m63K19J62j88K55J089J023K48K16J147J735J417J003Q21
$$ 175676 175788 175250 174332 173869 174088 174250 174062 174317 175406 176429 176677 176893 178040 179775 181192 182195 183016
54481A83016J29j157j920j508n72J76P30J026P78M04Q32K009K753K443J653R76
$$ 183016 183145 181988 180068 178560 177988 178164 178894 179920 180698 181102 181934 183943 186696 189139 190792 191768
54465A91768L05l73o23k99K02N97Q26O00k09q51m97L85N98K6l07M4M42M14J82
$$ 191768 192073 191700 191077 190778 190980 191577 192403 193003 192794 191943 191446 191831 192429 192455 192148 192192 192634 193048 193230
54446A93230j51p86j456j547j125q49q49p44o09q23j068o24L21Q60Q27Q75J176
$$ 193230 193079 192293 190837 189290 188165 187316 186467 185723 185114 184291 183223 182599 182920 183780 184607 185482 186658
54429A86658J177P24K21l20j180j928j792r59l30MP23J727K071J588J186J291
$$ 186658 187835 188559 188780 188460 187280 185352 183560 182601 182271 182275 182998 184725 186796 188384 189570 190861
54413A90861J265O86r4q07j536j909j262Q4R07P31K74J11J31L89J191K045J838
$$ 190861 192126 192812 192718 191911 190375 188466 187204 187288 188195 188926 189200 189311 189442 189831 191022 193067 194905
54396A94905N48n12n95m43p58r72k67J102K215K538K121J310O22L64J49n60j520
$$ 194905 195453 194941 194346 193903 193145 192173 191906 193008 195223 197761 199882 201192 201814 202178 202327 201767 200247
54379B00247k033k004j846j409k29J222J725J000P7j94J9L29O90R55Q61O90R36
$$ 200247 198214 196210 194364 192955 192726 193948 195673 196673 196750 196556 196575 196904 197594 198549 199410 200100 201036
54362B01036J302R66k6p21o92l75k5N01Q44L57o01q87l23J4m83j183j442j374
$$ 201036 202338 203304 203278 202557 201865 201490 201465 201966 202810 203167 202566 201679 201356 201370 200887 199704 198262 196888
54344A96888j126o35l39p67j253n10J119J678M54q07m41P96J087P6j054j323p47
$$ 196888 195762 195127 194788 194021 192768 192258 193377 195055 195509 194702 194261 195057 196144 196220 195166 193843 193096
54327A93096N1L88N8k74J67R56Q66k54j034n21O38J366J512J420J157Q09P68J060
$$ 193096 193147 193535 193593 193319 193486 194442 195308 195054 194020 193499 194137 195503 197015 198435 199592 200401 201169 202229
54309B02229J178R89R88J373J686J695J697J607R30q4m07J55M91j12r80j366j569
$$ 202229 203407 204396 205384 206757 208443 210138 211835 213442 214372 214288 213881 214036 214527 214415 213435 212069 210500
54292B10500j984k198j909j684j914j956j193j53L30K78J31j14n16o46k33K84
$$ 210500 208516 206318 204409 202725 200811 198855 197662 197509 197839 198117 198248 198134 197618 196972 196739 197023
54276A97023M30L39J30n02j459j821j054R9O09M04rm23p24n26K37R23J069R88
$$ 197023 197453 197792 197922 197420 195961 194140 193086 193185 193794 194198 194189 193766 193042 192516 192753 193676 194745 195733
54258A95733J007P86R4m78l19K85O68P01N85L32M8J30N83P18J23o56r53r14r93
$$ 195733 196740 197526 197620 197142 196823 197108 197776 198477 199062 199394 199442 199572 200155 200873 200996 200340 199387 198473 197480
54239A97480j143j108r98r85q39l06L88P80O29J6n77m13O58J569J200O4l20K56
$$ 197480 196337 195229 194231 193246 192407 192101 192489 193269 193898 193914 193337 192924 193582 195151 196351 196415 196095 196351
54221A96351M29l84j004m84M18O22L13J28m6m11m65N6L74j14p04n89k87p16j508
$$ 196351 196780 196396 195392 194908 195326 195948 196261 196389 196343 195932 195467 195523 195897 195783 195079 194490 194203 193487 191979
54202A91979j556p23J21M21L70L09N15J180J895J720M26r26j295r25o13m79k68
$$ 191979 190423 189700 189821 190242 190612 190921 191436 192616 194511 196231 196657 195731 194436 193511 192898 192419 192151
54185A92151j47l31m88l35k02k79l7Q39J606J531R55N03Kp77j163n62K44M6j035
$$ 192151 192004 191673 191185 190850 190648 190369 190332 191171 192777 194308 195263 195766 195768 194991 193828 193266 193510 193556 192521
54166A92521j929k163j924j107L38J475J243J32k56O71J932K489K320J889J477
$$ 192521 190592 188429 186505 185398 185736 187211 188454 188586 188330 189001 190933 193422 195742 197631 199108
54151A99108J223J093P49J5o18o12k09n2k10l29m78r32j368j140l24K75K55J4
$$ 199108 200331 201424 202173 202188 201570 200958 200749 200697 200487 200158 199680 198748 197380 196240 195916 196191 196446 196460
54133A96460J6K93O96J052J044L83o86j427j187R6J701K470J774L35m80k86N8
$$ 196460 196476 196769 197465 198517 199561 199944 199258 197831 196644 196740 198441 200911 202685 203020 202540 202254 202312
54116B02312m7j40J27J71m18q40k29R58J656J775J895J929J266J9r47j140p80
$$ 202312 202265 202125 202252 202423 202005 201165 200936 201894 203550 205325 207220 209149 210415 210434 209487 208347 207567
54099B07567j70M12M33m27j556k004j634j034m75J84P47O99J29j71K30Q37R73
$$ 207567 207397 207809 208242 207815 206259 204255 202621 201587 201112 201296 202043 202742 202871 202700 202930 203767 204740
54082B04740O94O31J074J438R04m21j307q63K18O32L93P08J872K636K110J040
$$ 204740 205434 206065 207139 208577 209481 209060 207753 206890 207108 207740 208133 208841 210713 213349 215459 216499
54066B16499N12M74L67K25L06L98L01K95L73j1q00r49n9O59J56p54o65L89J419
$$ 216499 217011 217485 217852 218077 218383 218781 219082 219377 219750 219739 218939 217990 217931 218590 218746 217992 217327 217716 219135
54047B19135K165K915L372L143K788L028L428L232K896L354M231M395M016M414
$$ 219135 221300 224215 227587 230730 233518 236546 239974 243206 246102 249456 253687 258082 262098 266512
54033B66512N814O866O632N783N480O008O814P164O636N500M545M078L551K654
$$ 266512 272326 279192 285824 291607 297087 303095 309909 317073 323709 329209 333754 337832 341383 344037
54019C44037K061K276K516J828N99j40l46n62o72m42o96k334m546n655n462n146
$$ 344037 346098 348374 350890 352718 353317 353177 352831 352269 351597 351155 350459 348125 343579 337924 332462 327316
54003C27316n133m776m089l955m474m686m276l955l874l216j810o76m67n79k94
$$ 327316 322183 317407 313318 309363 304889 300203 295927 291972 288098 284882 283072 282396 281929 281350 281056
53988B81056L21J103K163L197L563L541M348O424Q770J0499J1918J3557J5166
$$ 281056 281377 282480 284643 287840 291403 294944 299292 305716 314486 324985 336903 350460 365626
53975C65626J6362J7197J7276J5157R676J460p429j5049k0323k2852k2738k0578
$$ 365626 381988 399185 416461 431618 441294 442754 435325 420276 399953 377101 354363 333785
53963C33785j7308j3910j1081q845o728m625l169k778k784k255j253m50P5O68
$$ 333785 316477 302567 291486 282641 275913 271288 268119 265341 262557 260302 259049 258599 258674 259342
53949B59342J046O50q3o8Q45J777K336L018L912M311L966L647M003M743N410O105
$$ 259342 260388 261038 260955 260887 261732 263509 265845 268863 272775 277086 281052 284699 288702 293445 298855 304960
53933C04960O984P757Q058P842P159O122N160M645M272L398K075J035P69J242
$$ 304960 311944 319701 327759 335601 342760 348882 354042 358687 362959 366357 368432 369467 370236 371478
53919C71478K285L494M055L632L192L859N233O024O131O647P839Q677Q538P967
$$ 371478 373763 377257 381312 384944 388136 391995 397228 403252 409383 416030 423869 432546 441084 449051
53905D49051P374O371M837L412K356J105n35j834k364k742l483m104l998l463
$$ 449051 456425 462796 467633 471045 473401 474506 473971 472137 469773 467031 463548 459444 455446 451983
53891D51983l241l687m746o126p250p737q085r029j0206j0402r348q128p554p206
$$ 451983 448742 445055 440309 434183 426933 419196 411111 402082 391876 381474 372126 363998 356444 349238
53877C49238o554n870n489n115m442l766l439l368l356l329l086k504k032k160
$$ 349238 342684 336814 331325 326210 321768 318002 314563 311195 307839 304510 301424 298920 296888 294728
53863B94728k506k379k066k362k914k498j064j8j84r91j849k778l294k499q57
$$ 294728 292222 289843 287777 285415 282501 280003 278939 278921 278737 277746 275897 273119 269825 267326 266469
53848B66469j96j121k098j948j493j657j679o94L97L30m02m59J64M93M15N75R11
$$ 266469 266273 265152 263054 261106 259613 257956 256277 255583 255980 256310 255908 255449 255613 256106 256521 257096 258007
53831B58007O73j86q80r14n00J2L75M16K98M51Q63J001Q24J005J786K497K833
$$ 258007 258680 258494 257614 256700 256200 256212 256587 257003 257301 257752 258615 259616 260440 261445 263231 265728 268561
53814B68561L473M737N741N807N687O416P925R800J2324J5547J8422K0249K2134
$$ 268561 272034 276771 282512 288319 294006 300422 308347 318147 330471 346018 364440 384689 406823
53801D06823K5470K9531L1971L1079K6254J7145M407q872j8465k2381k2017j9946
$$ 406823 432293 461824 493795 524874 551128 568273 572680 563808 545343 522962 500945 480999
53789D80999j7648j5350j2809r860o894m943m586m980m756l739k896k799l104
$$ 480999 463351 448001 435192 425332 418438 413495 408909 403929 399173 395434 392538 389739 386635
53776C86635l476m003m595m928n122n630o302o270n032l038j093L42J160J533
$$ 386635 383159 379156 374561 369633 364511 358881 352579 346309 341277 338239 337146 337488 338648 340181
53762C40181J896K546L147K995J809lj777l076l918m794o126p564q182p705o964
$$ 340181 342077 344623 347770 350765 352574 352571 350794 347718 343800 339006 332880 325316 317134 309429 302465
53747C02465o681o450n573m333l573l367k981j994p47J70L93j16q57j051n43j18
$$ 302465 295784 289334 283761 279428 275855 272488 269507 267513 266766 266936 267329 267213 266356 265305 264762 264644
53731B64644l28n65m9Q24J101Q73J162K194K903K432J293P07J236K415L348L458
$$ 264644 264316 263751 263702 264526 265627 266500 267662 269856 272759 275191 276484 277191 278427 280842 284190 287648
53715B87648K831J927J037K13k83n6O89J142R30O50Q92J383J672J967K584L114
$$ 287648 290479 292406 293443 293656 293373 293317 294006 295148 296078 296728 297620 299003 300675 302642 305226 308340
53699C08340L004K541K396K550K512K333K493K980L314L345L310L171K698K028
$$ 308340 311344 313885 316281 318831 321343 323676 326169 329149 332463 335808 339118 342289 344987 347015
53685C47015J544J278J036R01R85R52M76r5k50k17m68o99k63M98N05l98j075p40
$$ 347015 348559 349837 350873 351774 352759 353711 354187 354092 353842 353625 353157 352458 352195 352693 353198 352800 351725 350985
53667C50985rJ39k90n80m40l03o27j265j606j245m70M4K1j83k57l49n53m79J54
$$ 350985 350976 351115 350825 350245 349805 349502 348875 347610 346004 344759 344289 344333 344354 344171 343914 343565 343012 342533 342687
53648C42687Q57R16L58k00m47o33r75j325j387r65j90M00K83k19r4R97K093K205
$$ 342687 343544 344460 344818 344618 344171 343538 342563 341238 339851 338886 338696 339096 339379 339160 339066 340063 342156 344361
53630C44361J679J523J894K054J603R50O70J024J966L031L407K761J844J749K660
$$ 344361 346040 347563 349457 351511 353114 354064 354734 355758 357724 360755 364162 366923 368767 370516 373176
53615C73176L837M528M485L858L206L203L862M345M104L689L796M112L898L229
$$ 373176 377013 381541 386026 389884 393090 396293 400155 404500 408604 412293 416089 420201 424099 427328
53601D27328K802K818L041L533M351M821M237L083K474K546K420J733J005M89
$$ 427328 430130 432948 435989 439522 443873 448694 452931 456014 458488 461034 463454 465187 466192 466681
53587D66681j99j077j518j248p91n80n09o01j222k257k909k783k462k515k558
$$ 466681 466482 465405 463887 462639 461848 461268 460759 460158 458936 456679 453770 450987 448525 446010 443452
53572D43452j942r07m19j005k128k795k558j940j784k228k524k093j289p57m90
$$ 443452 441510 440603 440184 439179 437051 434256 431698 429758 427974 425746 423222 421129 419840 419083 418593
53557D18593n5N24Q30Q51R07R53O61J92J80Q00J491J794J895K165K582K815K624
$$ 418593 418538 419062 419892 420743 421650 422603 423264 423456 423636 424436 425927 427721 429616 431781 434363 437178 439802
53540D39802K118J794K180L200M130M484M650N272O323P282P879Q167Q187Q164
$$ 439802 441920 443714 445894 449094 453224 457708 462358 467630 473953 481235 489114 497281 505468 513632
53526E13632Q673J0001J1590J2749J3614J4781J6319J7873J9369K0755K1382K0539
$$ 513632 522305 532306 543896 556645 570259 585040 601359 619232 638601 659356 680738 701277
53514G01277J8579J6738J5865J5974J6794J8041J9335K0504K1811K3276K4261
$$ 701277 719856 736594 752459 768433 785227 803268 822603 843107 864918 888194 912455
53503I12455K4447K4671K5742K6998K7256K6746K6670K7060K6730K5468K4592
$$ 912455 936902 961573 987315 1014313 1041569 1068315 1094985 1122045 1148775 1174243 1198835
53492A198835K4941K5628K5522K4803K4372K4594K5241K5959K6222K5531K4127
$$ 1198835 1223776 1249404 1274926 1299729 1324101 1348695 1373936 1399895 1426117 1451648 1475775
53481A475775K2894K2197K1477K0288J9037J8341J8297J8714J9404J9838J9196
$$ 1475775 1498669 1520866 1542343 1562631 1581668 1600009 1618306 1637020 1656424 1676262 1695458
53470A695458J7205J4535J2030R920P959N847L337M15k497n032p557j0684j4103
$$ 1695458 1712663 1727198 1739228 1749148 1757107 1762954 1766291 1766706 1764209 1759177 1751620 1740936 1726833
53457A726833j6607j7504j7327j6987j6946j7346j8272j9562k0920k2395k4214
$$ 1726833 1710226 1692722 1675395 1658408 1641462 1624116 1605844 1586282 1565362 1542967 1518753
53446A518753k6085k7279k7517k7138k6374k5185k3835k2829k2142k1210j9812
$$ 1518753 1492668 1465389 1437872 1410734 1384360 1359175 1335340 1312511 1290369 1269159 1249347
53435A249347j8210j6390j4110j1715r946q747p255n255l618k798j985l05J956
$$ 1249347 1231137 1214747 1200637 1188922 1178976 1170229 1162974 1157719 1154101 1151303 1149318 1149013 1150969
53422A150969L975N568P126Q898J0878J2978J4895J6347J7616J9342K1512K3330
$$ 1150969 1154944 1160512 1167638 1176536 1187414 1200392 1215287 1231634 1249250 1268592 1290104 1313434
53410A313434K4386K5182K6267K7556K8912L0629L2784L4807L6259L7522L9201
$$ 1313434 1337820 1363002 1389269 1416825 1445737 1476366 1509150 1543957 1580216 1617738 1656939
53399A656939M1350M3775M6564M9829N3233N6241N8629O0475O1978O3346O4605
$$ 1656939 1698289 1742064 1788628 1838457 1891690 1947931 2006560 2067035 2129013 2192359 2256964
53388B256964O5443O5699O5906O6760O8049O8805O8480O7270O5248O2194N8404
$$ 2256964 2322407 2388106 2454012 2520772 2588821 2657626 2726106 2793376 2858624 2920818 2979222
53377B979222N4777N1693M8607M5048M1201L7292L3222K9096K5354K2008J8552
$$ 2979222 3033999 3085692 3134299 3179347 3220548 3257840 3291062 3320158 3345512 3367520 3386072
53366C386072J4762J0722N897p56r292j8563k7801l7314m6994n5416o1301o4943
$$ 3386072 3400834 3411556 3417453 3416697 3407405 3388842 3361041 3323727 3276733 3221317 3160016 3095073
53354C095073o7366o8878o9330o8988o8149o6608o4278o1816n9790n7873n5617
$$ 3095073 3027707 2958829 2889499 2820511 2752362 2685754 2621476 2559660 2499870 2441997 2386380
53343B386380n3470n2234n2048n2661n4011n5707n6563n5594n3150n0272m7378
$$ 2386380 2332910 2280676 2228628 2175967 2121956 2066249 2009686 1954092 1900942 1850670 1803292
53332A803292m4334m1302l8568l5876l2827k9644k6803k4162k1329j8633j6929
$$ 1803292 1758958 1717656 1679088 1643212 1610385 1580741 1553938 1529776 1508447 1489814 1472885
53321A472885j6512j6888j7496j8061j8377j8272j7723j6635j4768j2298j0070
$$ 1472885 1456373 1439485 1421989 1403928 1385551 1367279 1349556 1332921 1318153 1305855 1295785
53310A295785q704p783o462m641k909j563k67J322L110M759O043P131Q549J0682
$$ 1295785 1287081 1279298 1272836 1268195 1265286 1263723 1263456 1264778 1267888 1272647 1278690 1285821 1294370 1305052
53296A305052J3170J5222J6628J7987J9785K1865K4040K6460K8988L0917L1876
$$ 1305052 1318222 1333444 1350072 1368059 1387844 1409709 1433749 1460209 1489197 1520114 1551990
53285A551990L2407L3098L3721L3751L3171L2099L0225K7314K3933K0975J8794
$$ 1551990 1584397 1617495 1651216 1684967 1718138 1750237 1780462 1807776 1831709 1852684 1871478
53274A871478J7199J5854J4181J1382P285K845p84l366n391p252r188j1611j4758
$$ 1871478 1888677 1904531 1918712 1930094 1937379 1940224 1939440 1936074 1930683 1923431 1914243 1902632 1887874
53261A887874j8259k1525k4370k6925k9321l1694l3989l5578l5827l5299l5490
$$ 1887874 1869615 1848090 1823720 1796795 1767474 1735780 1701791 1666213 1630386 1595087 1559597
53250A559597l6790l7764l7178l5787l5066l5014l4483l3165l1795l0749k9676
$$ 1559597 1522807 1485043 1447865 1412078 1377012 1341998 1307515 1274350 1242555 1211806 1182130
53239A182130k8647k8405k9208l0253l0632l0280k9767k9479k9165k8091k5767
$$ 1182130 1153483 1125078 1095870 1065617 1034985 1004705 974938 945459 916294 888203 862436
53228H62436k2644j9777j7637j5717j3592j1717j0698j0385j0318j0531j1178
$$ 862436 839792 820015 802378 786661 773069 761352 750654 740269 729951 719420 708242
53217G08242j1825j1898j1580j1585j2236j3324j4570j5728j6463j6579j6166
$$ 708242 696417 684519 672939 661354 649118 635794 621224 605496 589033 572454 556288
53206E56288j5189j3460j1256r369q112p048o080n946o904p930q087p880q191
$$ 556288 541099 527639 516383 507014 498902 491854 485774 479828 472924 464994 456907 449027 440836
53193D40836q671q361p347o507n979n201m237l837m172m549m453m038l575l188
$$ 440836 432165 423804 416457 409950 403971 398770 394533 390696 386524 381975 377522 373484 369909 366721
53179C66721l027l054k804k053j395j500k010j987j171j22O20P73J63r29j623
$$ 366721 363694 360640 357836 355783 354388 352888 350878 348891 347720 347598 348218 348991 349154 348225 346602
53164C46602j447j005r49q65j53O74O74J3m25n11p26r18n45N5P1l15k22K25j2
$$ 346602 345155 344150 343201 342336 342183 342857 343531 343544 343119 342608 341882 340964 340419 340474 340545 340230 340008 340233 340221
53145C40221j057j776j537r44n67k16J27n4p56j155q53m91o25r09r13q42r33q54
$$ 340221 339164 337388 335851 334907 334340 334124 334251 334197 333441 332286 331433 330942 330317 329408 328495 327653 326720 325866
53127C25866k66N52J090J138O97j08q96j258j249j108o70K39J034R15J34k82j14
$$ 325866 325600 326152 327242 328380 329077 328969 328073 326815 325566 324458 323788 324027 325061 325976 326110 325828 325714
53110C25714j26n85p96m81m24j143j903j823j181r33j441k230k615k219j254n76
$$ 325714 325588 325003 324207 323726 323302 322159 320256 318433 317252 316319 314878 312648 310033 307814 306560 305984
53094C05984q78j720j935j201m60n67j245j738j755j369o36J72M76L9o30q63m50
$$ 305984 305106 303386 301451 300250 299790 299223 297978 296240 294485 293116 292480 292652 293128 293167 292537 291674 291224
53077B91224L58J045R38j53j315j232K18J760K368K279K088J708Q83K5k27P8L50
$$ 291224 291582 292627 293565 293412 292097 290865 291083 292843 295211 297490 299578 301286 302169 302194 301967 302045 302395
53060C02395K29k67j036j800j974j184J14R46Q15J80j11K74Q58J060J031J472
$$ 302395 302624 302357 301321 299521 297547 296363 296477 297423 298238 298418 298307 298581 299439 300499 301530 303002
53044C03002K490L208K893K037J610J678J473O88j65o16o79l97K45Q88J004O32
$$ 303002 305492 308700 311593 313630 315240 316918 318391 319079 318914 318298 317619 317222 317467 318355 319359 319991
53028C19991L00J49j65o60r33r44j097j376j215n08L5q6m25l28J40M34L37J78
$$ 319991 320291 320440 320275 319615 318682 317738 316641 315265 314050 313542 313577 313491 313066 312738 312878 313312 313649 313827
53010C13827L77R94J540J414O45oo1N0j44k16L66J049Q91J21j93L8j30q72j115
$$ 313827 314204 315198 316738 318152 318797 318791 318730 318780 318636 318420 318786 319835 320726 320847 320654 320692 320562 319690 318575
52991C18575l14O13O98K32K2J87L98O02Q63J046J136J369J681J599R97L91K06
$$ 318575 318261 318874 319572 319804 319826 320013 320411 321013 321876 322922 324058 325427 327108 328707 329704 330095 330301
52974C30301L06M50O50Q97J144J592K328K720K141J212J220K144K499J605O82
$$ 330301 330607 331057 331707 332604 333748 335340 337668 340388 342529 343741 344961 347105 349604 351209 351891
52959C51891R48J806J788N79q57j571j406q94q73j766k878k975j909q71p76j224
$$ 351891 352839 354645 356433 357012 356155 354584 353178 352284 351411 349645 346767 343792 341883 341012 340236 339012
52943C39012j476j523j583j390p44j10N5k5Rl0m36j004j342j331r43k18L65K06
$$ 339012 337536 336013 334430 333040 332296 332186 332241 332216 332225 332195 331759 330755 329413 328082 327139 326921 327286 327492
52925C27492m31o67m24n92j424j958j635j231j344j217j34J065J168M65J05K11
$$ 327492 327061 326394 325970 325378 323954 321996 320361 319130 317786 316569 316435 317500 318668 319133 319238 319449
52909C19449J3n47p04k24K36K37N8M9J62K28K20K35M38Q78J175Q61K18P3M79M55
$$ 319449 319462 318915 318211 317987 318223 318460 318518 318567 318729 318957 319177 319412 319850 320728 321903 322764 322982 323055 323534 323989
52889C23989m39j140n46Q25J543J058q8j312k287k587j995r82j87L02O34O20J62
$$ 323989 323550 322410 321864 322689 324232 325290 325202 323890 321603 319016 317021 316039 315852 316154 316788 317408 317570
52872C17570k15N8P78J307J322P31m94j845k283j517n03l5M19J487K455K292J423
$$ 317570 317355 317413 318191 319498 320820 321551 321057 319212 316929 315412 314909 314874 315293 316780 319235 321527 322950
52855C22950J079J311J113L03j81J00M02nj051k410l907n132n541n160m581m032
$$ 322950 324029 325340 326453 326756 326575 326675 327077 327072 326021 323611 319704 314572 309031 303871 299290 295258
52839B95258l197k046j163j088j720k469k651j829k79J000J201M96l43q11p29
$$ 295258 292061 290015 288852 287764 286044 283575 280924 279095 278816 279816 281017 281513 281170 280359 279630
52824B79630J1J142J852J605Q09Q4o19j484j987j546o08p3R5O34J604K278K395
$$ 279630 279641 280783 282635 284240 285049 285133 284514 283030 281043 279497 278889 278816 278911 279545 281149 283427 285822
52807B85822K484K936L595M251M752M544L084O53j844l863n323n946n390m025
$$ 285822 288306 291242 294837 299088 303840 308384 311468 312121 310277 306414 301091 295145 289755 285730
52793B85730k694j745j011n99p61j109r42l69j76n07o66l78j40j91j9O78J422
$$ 285730 283036 281291 280280 279681 278920 277811 276869 276500 276324 275817 275151 274773 274633 274442 274423 275101 276523
52776B76523J691J545J190O36P9ON43J209J527J430J011M31R5K89O38N97M04P42
$$ 276523 278214 279759 280949 281585 281664 281670 282213 283422 284949 286379 287390 287821 287916 288205 288843 289440 289844 290586
52758B90586J388J310K85n57l27M40P54N83N76R27J245J236J003P20M62J87k78
$$ 290586 291974 293284 293569 293012 292685 293125 293879 294462 295038 295965 297210 298446 299449 300169 300631 300818 300540
52741C00540r93j521j208j17P45N07n21j230j033m26k63p01j045o36K78Q79R43
$$ 300540 299547 298026 296818 296701 297446 297953 297432 296202 295169 294743 294480 293779 292734 292098 292376 293255 294198
52724B94198J144J931K703K560J510K35q95j858k320j855p99o2N2R9M94R91J299
$$ 294198 295342 297273 299976 302536 304046 304281 303386 301528 299208 297353 296554 296492 296544 296643 297137 298128 299427
52707B99427J521J677J416N75m38j062j155r12n80l52k51o5L51P38O59P0o45j077
$$ 299427 300948 302625 304041 304616 304178 303116 301961 301049 300469 300117 299866 299801 300152 300890 301549 301619 300974 299897
52689B99897r80k75P67J543J791J939K331K533K049J301J088J319J239P18L84
$$ 299897 298917 298642 299409 300952 302743 304682 307013 309546 311595 312896 313984 315303 316542 317260 317644
52674C17644M80O06O55J014J633J836J376Q42O85O05K46j97m10m56m80m69n06
$$ 317644 318124 318730 319385 320399 322032 323868 325244 326086 326771 327376 327622 327425 327015 326559 326079 325610 325104
52657C25104p02p16m4J052J612J273Q17J030J711K207K289K031J297n3j730l217
$$ 325104 324402 323686 323642 324694 326306 327579 328396 329426 331137 333344 335633 337664 338961 338908 337178 333961
52641C33961m189m472l961k806j470l88K37L17k7k88R1J037J954K508K879L227
$$ 333961 329772 325300 321339 318533 317063 316675 316912 317229 317202 316914 317005 318042 319996 322504 325383 328610
52625C28610L510L870M504N017M497K625K42j459k007j854j899k772m114m637
$$ 328610 332120 335990 340494 345511 350008 352633 352875 351416 349409 347555 345656 342884 338770 334133
52611C34133l515j620o48j053j682j568j009o42m47k22k40o72r83n82K49P23N71
$$ 334133 330618 328998 328350 327297 325615 324047 323038 322396 321949 321727 321487 320815 319832 319250 319499 320222 320793
52594C20793K73M20J140J951K091J358N63O75J453J643P39k32r5R73J909K175
$$ 320793 321066 321486 322626 324577 326668 328026 328589 329264 330717 332360 333099 332867 332772 333745 335654 337829
52578C37829K066J941J758J373Q60N00N00O57M44l17j031j005m09l9j70m01n38
$$ 337829 339895 341836 343594 344967 345827 346327 346827 347484 347928 347611 346580 345575 345166 345127 344957 344556 344018
52561C44018q88j512j983k077k012j836j284m95n3j20k31j95m19r97j335j024
$$ 344018 343130 341618 339635 337558 335546 333710 332426 331931 331878 331758 331527 331332 330913 329916 328581 327557
52545C27557l68L25J137J872J866J009J43j47l04q72j523j683j342o45N33J884
$$ 327557 327189 327514 328651 330523 332389 333398 333541 333394 333090 332218 330695 329012 327670 327025 327558 329442
52529C29442K388J591M53Q4K85K36q0j79j94n49r05n66L30J075J579K249K854
$$ 329442 331830 333421 333874 333958 334243 334479 334399 334220 334026 333477 332572 332006 332336 333411 334990 337239 340093
52512C40093K717K050J932K705L400L161K399J997K009J705O03j002k444l357
$$ 340093 342810 344860 346792 349497 352897 356058 358457 360454 362463 364168 364771 363769 361325 357968
52498C57968l952m637n336n393m391k761j333n13k41m47r78j353j173o97m86m94
$$ 357968 354016 349379 344043 338650 334259 331498 330165 329652 329411 328964 327986 326633 325460 324763 324277 323783
52482C23783j81N47J070J007Q35J231K127K758K567J753R20M28J77J5R6O49J492
$$ 323783 323602 324149 325219 326226 327061 328292 330419 333177 335744 337497 338417 338845 339022 339037 339133 339782 341274
52465C41274K121K347K558L172M083M782M766L782J962q5j613k421k892l299l432
$$ 341274 343395 345742 348300 351472 355555 360337 365103 368885 370847 370762 369149 366728 363836 360537 357105
52450C57105l152k842k918l163l083k664k340k288k180j673q68k12p8m47r27j114
$$ 357105 353953 351111 348193 345030 341947 339283 336943 334655 332475 330802 329934 329722 329644 329197 328270 327156
52434C27156r59p08n04l06j09K0J24K47J62l96j145j372q39j29P8j96m21k37L12
$$ 327156 326197 325489 324985 324679 324570 324590 324714 324961 325123 324727 323582 322210 321371 321242 321320 321124 320703 320466 320778
52415C20778R89J607K089K431K591K557K644L343M580N493N530N417O293Q204
$$ 320778 321767 323374 325463 327894 330485 333042 335686 339029 343609 349102 354632 360049 366342 374546
52401C74546J0232J1888J3314J4127J3292J0393O083J019m415r144j1467j0962
$$ 374546 384778 396666 409980 424107 437399 447792 453875 454894 450479 441335 429868 418906
52389D18906r296q300q046p574o585n490m434l301k273j507o73M64J406J629J495
$$ 418906 409610 401310 393264 385690 379105 373615 369181 365880 363607 362100 361427 361891 363297 364926 366421
52374C66421J721K380L085L775M547N162N450N770O307O363N139K984R83m02j461
$$ 366421 368142 370522 373607 377382 381929 387091 392541 398311 404618 410981 416120 419104 420087 419685 418224
52359D18224k277k519k153j574j025m54Q3M34O88J026J421J844K443L098L177
$$ 418224 415947 413428 411275 409701 408676 408222 408305 408739 409427 410453 411874 413718 416161 419259 422436
52344D22436K456J740J951K824L360L252L092L301L685M015M408N064O075P390
$$ 422436 424892 426632 428583 431407 434767 438019 441111 444412 448097 452112 456520 461584 467659 475049
52330D75049Q584Q994Q547Q210Q963J0649J2371J3667J4675J5443J5884J6157
$$ 475049 483633 492627 501174 509384 518347 528996 541367 555034 569709 585152 601036 617193
52318F17193J6479J6652J6391J5898J5584J5527J5772J6705J8422K0179K1199
$$ 617193 633672 650324 666715 682613 698197 713724 729496 746201 764623 784802 806001
52307H06001K1701K2282K2782K2760K2646K3184K3969K3814K2634K1698K1712
$$ 806001 827702 849984 872766 895526 918172 941356 965325 989139 1011773 1033471 1055183
52296A055183K1830K0973J9160J6933J4344J1157P619M327J623m98k029k837k994
$$ 1055183 1077013 1097986 1117146 1134079 1148423 1159580 1167199 1171526 1173149 1172651 1170622 1167785 1164791
52283A164791l002l605n081o749p497o979n906m996m236l481k987k826k426j416
$$ 1164791 1161789 1158184 1153103 1146354 1138857 1131878 1125972 1120976 1116740 1113259 1110272 1107446 1105020 1103604
52269A103604l05M69J472L335N507P000P970R329J1179J2837J4101J5277J6116
$$ 1103604 1103299 1103768 1105240 1108575 1114082 1121082 1129052 1138381 1149560 1162397 1176498 1191775 1207891
52256A207891J6096J5712J6158J7560J8797J9206J9268J9344J9008J7924J6327
$$ 1207891 1223987 1239699 1255857 1273417 1292214 1311420 1330688 1350032 1369040 1386964 1403291
52245A403291J4246J1393Q227N949M914M090K596Q09o42j922l319m363m517m126
$$ 1403291 1417537 1428930 1437157 1443106 1448020 1452110 1454706 1455515 1454873 1452951 1449632 1445269 1440752 1436626
52231A436626l991m428n294o448p628q323q300p883p398o808o214o055o386o457
$$ 1436626 1432635 1428207 1422913 1416465 1408837 1400514 1392214 1384331 1376933 1370125 1363911 1357856 1351470 1345013
52217A345013n602m142k933k282j711o26J036K655L408L198L018L912N665P111
$$ 1345013 1339411 1335269 1332336 1330054 1328343 1327717 1328753 1331408 1334816 1338014 1341032 1344944 1350609 1357720
52203A357720P662P772P893P912P755P661P558P054O417O694Q274J0136J1062
$$ 1357720 1365382 1373154 1381047 1388959 1396714 1404375 1411933 1418987 1425404 1432098 1440372 1450508 1461570
52190A461570J0973J0538J0055R315Q101O402M411K535R49r19l686o723q561q976
$$ 1461570 1472543 1483081 1493136 1502451 1510552 1516954 1521365 1523900 1524849 1523930 1520244 1513521 1504960 1495984
52176A495984r455j0993j2535j2564j1335j0248r750r100p978o964o373n690m468
$$ 1495984 1486529 1475536 1463001 1450437 1439102 1428854 1419104 1410004 1402026 1395062 1388689 1382999 1378531
52163A378531l048j973j223l10J063K639L794M089L639K840J815M57r89j920k134
$$ 1378531 1375483 1373510 1372287 1371977 1373040 1375679 1379473 1383562 1387201 1390041 1391856 1392313 1391324 1389404 1387270
52148A387270k049j908j341n9J514K729L437L753L574K808J676L91j119k695l688
$$ 1387270 1385221 1383313 1381972 1381913 1383427 1386156 1389593 1393346 1396920 1399728 1401404 1401795 1400676 1397981 1394293
52133A394293l699l142k563j800m68J228K814M414O472Q834J0931J2663J4409
$$ 1394293 1390594 1387452 1384889 1383089 1382621 1383849 1386663 1391077 1397549 1406383 1417314 1429977 1444386
52120A444386J6179J7627J8873K0509K2535K4021K4288K3850K3696K4021K4100
$$ 1444386 1460565 1478192 1497065 1517574 1540109 1564130 1588418 1612268 1635964 1659985 1684085
52109A684085K3308K1854K0493J9815J9846K0266K0838K1628K2733K3939K4758
$$ 1684085 1707393 1729247 1749740 1769555 1789401 1809667 1830505 1852133 1874866 1898805 1923563
52098A923563K4870K4348K3428K2055J9882J6680J2687Q315L669j407o695j1345
$$ 1923563 1948433 1972781 1996209 2018264 2038146 2054826 2067513 2075828 2079497 2078090 2071395 2060050
52086B060050j4587j6499j7790j8846j9369j8892j7412j5417j3468j1792j0206
$$ 2060050 2045463 2028964 2011174 1992328 1972959 1954067 1936655 1921238 1907770 1895978 1885772
$$ [...]
##END NTUPLES=NMR SPECTRUM
##END=
