
##TITLE=UV1279_M1_1242-1388_20_7534535_fD28k16YJs
##JCAMPDX= 6.0         $$ Bruker NMR JCAMP-DX V2.0
##DATA TYPE= NMR SPECTRUM
##DATA CLASS= NTUPLES
##ORIGIN= BRUKER
##OWNER= Administrator
$$ 1.72 TOPSPIN		Version 2.1
$$ 2013-02-22 02:39:02.607 -0500  Administrator@X
$$ Compression mode = diff/dup
##.OBSERVE FREQUENCY= 400.02188249412
##.OBSERVE NUCLEUS= ^1H
##.ACQUISITION MODE= SIMULTANEOUS (DQD)
##.ACQUISITION SCHEME= undefined
##.AVERAGES= 8
##.DIGITISER RES= 22
##SPECTROMETER/DATA SYSTEM= spect
##.PULSE SEQUENCE= zg30
##.SOLVENT NAME= COFFEE_meoh
##.SHIFT REFERENCE= INTERNAL, COFFEE_meoh, 1, 14.98509
##AUDIT TRAIL= $$ (NUMBER, WHEN, WHO, WHERE, PROCESS, VERSION, WHAT)
$$ ##TITLE= Audit trail, TOPSPIN		Version 2.1
$$ ##JCAMPDX= 5.01
$$ ##ORIGIN= Bruker BioSpin GmbH
$$ ##OWNER= Administrator
$$ $$ E:\/data/COFFEE/nmr/UV1279_M1_1242-1388_20_7534535_fD28k16YJs/10/pdata/1/auditp.txt
$$ ##AUDIT TRAIL=  $$ (NUMBER, WHEN, WHO, WHERE, PROCESS, VERSION, WHAT)
(   1,<2013-02-22 02:38:54.154 -0500>,<Administrator>,<X>,<go>,<TOPSPIN 2.1>,
      <created by zg
	started at 2013-02-22 02:37:47.951 -0500,
	POWCHK enabled, PULCHK disabled,
       configuration hash MD5:
       86 BA 57 50 F2 9D 5C 9B 26 00 A9 28 5F 66 2E 89
       data hash MD5: 64K
       9E FD 2B 39 2C A6 B4 26 74 09 63 1A 79 5A 6D 4A>)
(   2,<2013-02-22 02:38:57.357 -0500>,<Administrator>,<X>,<proc1d>,<TOPSPIN 2.1>,
      <Start of raw data processing
       efp LB = 0 FT_mod = 6 PKNL = 1 PHC0 = 0 PHC1 = 0 SI = 32K 
       data hash MD5: 32K
       F0 0F 00 42 84 C6 D8 82 F7 5A AC 06 0E 20 3C CD>)
(   3,<2013-02-22 02:38:57.857 -0500>,<Administrator>,<X>,<proc1d>,<TOPSPIN 2.1>,
      <pk PHC0 = 67.52197 PHC1 = 0 
       data hash MD5: 32K
       67 B1 52 6B ED 52 0D 20 86 E7 37 82 2E 7E CA 93>)
(   4,<2013-02-22 02:38:58.076 -0500>,<Administrator>,<X>,<proc1d>,<TOPSPIN 2.1>,
      <abs ABSG = 1 
       data hash MD5: 32K
       26 C9 DC 49 57 22 8C 2D 1F 75 62 5D 9E 02 5C 3B>)
(   5,<2013-02-22 02:38:58.248 -0500>,<Administrator>,<X>,<proc1d>,<TOPSPIN 2.1>,
      <abs ABSG = 2 
       data hash MD5: 32K
       89 83 15 A4 1F EA 14 76 83 DB 9B E7 0C 70 AC 76>)
(   6,<2013-02-22 02:38:58.404 -0500>,<Administrator>,<X>,<proc1d>,<TOPSPIN 2.1>,
      <abs ABSG = 3 
       data hash MD5: 32K
       41 1F 7A 8C 7B E0 7D C2 BF 6F 26 C6 3E 1B 5D 53>)
(   7,<2013-02-22 02:38:58.545 -0500>,<Administrator>,<X>,<proc1d>,<TOPSPIN 2.1>,
      <abs ABSG = 4 
       data hash MD5: 32K
       B6 F0 FD E0 AA 61 F4 98 72 DE B9 E7 F3 8A 2F CB>)
(   8,<2013-02-22 02:38:58.686 -0500>,<Administrator>,<X>,<proc1d>,<TOPSPIN 2.1>,
      <abs ABSG = 5 
       data hash MD5: 32K
       09 89 7A B6 94 DF D7 B9 65 4D 21 36 CD D6 A3 E7>)
$$ ##END=
$$ 
$$ $$ hash MD5
$$ $$ 49 51 9D 45 87 ED E5 66 0E 90 19 F9 B2 11 AF 43
##$RELAX= 
##$RELAX= 
##$RELAX= 
##$RELAX= 
##$RELAX= 
##$RELAX= 
##$RELAX= 
$$ Bruker specific parameters
$$ --------------------------
##$DU= <E:\>
##$EXPNO= 10
$$ [...]
##$TP= (0..7)
150 150 150 150 150 150 150 150
##$TP07= 0
##$TPNAME0= <>
##$TPNAME1= <>
##$TPNAME2= <>
##$TPNAME3= <>
##$TPNAME4= <>
##$TPNAME5= <>
##$TPNAME6= <>
##$TPNAME7= <>
##$TPOAL= (0..7)
0.5 0.5 0.5 0.5 0.5 0.5 0.5 0.5
##$TPOFFS= (0..7)
0 0 0 0 0 0 0 0
##$TUNHIN= 0
##$TUNHOUT= 0
##$TUNXOUT= 0
##$USERA1= <user>
##$USERA2= <user>
##$USERA3= <user>
##$USERA4= <user>
##$USERA5= <user>
##$V9= 5
##$VALIST= <valist>
##$VCLIST= <CCCCCCCCCCCCCCC>
##$VD= 0
##$VDLIST= <DDDDDDDDDDDDDDD>
##$VPLIST= <PPPPPPPPPPPPPPP>
##$VTLIST= <TTTTTTTTTTTTTTT>
##$WBST= 1024
##$WBSW= 4
##$XGAIN= (0..3)
0 0 0 0
##$XL= 0
##$YL= 0
##$YMAX_a= 518959
##$YMIN_a= -516852
##$ZGOPTNS= <>
##$ZL1= 120
##$ZL2= 120
##$ZL3= 120
##$ZL4= 120
##$ABSF1= 14.98509
##$ABSF2= -5.573092
##$ABSG= 5
##$ABSL= 3
##$ALPHA= 0
##$AQORDER= 0
##$ASSFAC= 0
##$ASSFACI= 0
##$ASSFACX= 0
##$ASSWID= 0
##$AUNMP= <proc_prof1d_extract_pilot.lims>
##$AXLEFT= 0
##$AXNAME= <>
##$AXNUC= <1H>
##$AXRIGHT= 0
##$AXTYPE= 0
##$AXUNIT= <>
##$AZFE= 0.1
##$AZFW= 0.1
##$BCFW= 0
##$BC_mod= 0
##$BYTORDP= 0
##$COROFFS= 0
##$CY= 15
##$DATMOD= 1
##$DC= 0
##$DFILT= <>
##$DTYPP= 0
##$F1P= 0
##$F2P= 0
##$FCOR= 0.5
##$FTSIZE= 32768
##$FT_mod= 6
##$GAMMA= 0
##$GB= 0
##$INTBC= 1
##$INTSCL= 1
##$ISEN= 128
##$LB= 0
##$LEV0= 0
##$LPBIN= 0
##$MAXI= 10000
##$MC2= 0
##$MEAN= 0
##$ME_mod= 0
##$MI= 0
##$NCOEF= 0
##$NC_proc= -8
##$NLEV= 6
##$NOISF1= 0
##$NOISF2= 0
##$NSP= 0
##$NTH_PI= 0
##$NZP= 0
##$OFFSET= 14.98509
##$PC= 1
##$PHC0= 67.52197
##$PHC1= 0
##$PH_mod= 1
##$PKNL= yes
##$PPARMOD= 0
##$PPDIAG= 0
##$PPIPTYP= 0
##$PPMPNUM= 2147483647
##$PPRESOL= 1
##$PSCAL= 4
##$PSIGN= 0
##$PYNMP= <proc.py>
##$REVERSE= no
##$SF= 400.02
##$SI= 32768
##$SIGF1= 0
##$SIGF2= 0
##$SINO= 400
##$SIOLD= 32768
##$SPECTYP= <>
##$SREGLST= <1H.CDCl3>
##$SSB= 0
##$STSI= 32768
##$STSR= 0
##$SW_p= 8223.68421052631
##$SYMM= 0
##$S_DEV= 0
##$TDeff= 65536
##$TDoff= 0
##$TI= <>
##$TILT= no
##$TM1= 0
##$TM2= 0
##$TOPLEV= 0
##$USERP1= <user>
##$USERP2= <user>
##$USERP3= <user>
##$USERP4= <user>
##$USERP5= <user>
##$WDW= 1
##$XDIM= 32768
##$YMAX_p= 459393860
##$YMIN_p= -776310
##$CURPLOT= <Network HP LaserJet P1505>
##$CURPRIN= <$Network HP LaserJet P1505>
##$DFORMAT= <normdp>
##$LAYOUT= <+/1D_H.xwp>
##$LFORMAT= <normlp>
##$PFORMAT= <normpl>
##$SURQMSG= 1
$$ End of Bruker specific parameters
$$ ---------------------------------
##NTUPLES= NMR SPECTRUM
##VAR_NAME=  FREQUENCY,     SPECTRUM/REAL,   SPECTRUM/IMAG
##SYMBOL=    X,             R,               I
##VAR_TYPE=  INDEPENDENT,   DEPENDENT,       DEPENDENT
##VAR_FORM=  AFFN,          ASDF,            ASDF
##VAR_DIM=   32768,         32768,           32768
##UNITS=     HZ,            ARBITRARY UNITS, ARBITRARY UNITS
##FACTOR=    0.250966925370066, 1,           1
##FIRST=     8223.43324360094, -154297,      -294270
##LAST=      0,             -47701,          -9569
##MIN=       0,             -776310,         0
##MAX=       8223.43324360094, 459393860,    0
$$ Real data points
##PAGE= N=1
##DATA TABLE= (X++(R..R)), XYDATA
$$ [...]
19567A89338E069a73946F3695a29012r5285b559q7559k44872a44525a6241k00025
19556b16266E0917e5286o5162J2168B6254b07433K578A1199d26133a61534C0232
19544d79934a88814D05770h474F7220a04347k82531J69294j4457E4793R3320b20087
19532d1684A45083d6643D31220a96607O5634B00070D142c14369P2742f3962O471
19521e7491j1210b9333m38250J83565B668Q5515C2020c80384A25803b0765k62629
19510b83394n1489B15408e9098A2434m646E01a98295c1249k6976A29335c44068
19498A26512K776k7511a20862M1188L5094m18006a77210D363a2158C1548a24569
19486D0577K48855i3236c2308C7572c33394F5751Q3600b3339D3491a62206a1744
$$ y = [189338, 5069, -173946, 63695, -129012, -224297, -2559, -90118, -334990, -144525, -16241, -216266, 50917, -55286, -120448, -108280, 26254, -207433, -204855, 11199, -426133, -161534, 30232, -479934, -188814, 405770, -8474, 67220, -104347, -386878, -217584, -232041, 54793, 148113, -220087, -41684, 145083, -46643, 431220, -196607, -130973, 200070, 4142, -314369, -241627, -63962, -57491, -68701, -29333, -467583, -284018, 2668, 88183, 32020, -380384, 125803, -20765, -283394, -334883, 215408, -59098, 12434, 7788, 501, -198295, -31249, -58225, 129335, -344068, 126512, 129288, 101777, -120862, -79674, -44580, -462586, -177210, 4363, -12158, 31548, -124569, 40577, 289432, -93236, -32308, 37572, -333394, 65751, 149351, -23339, 43491, -162206, -11744]
19474g76310A44089m2201b09709e2144A19106j2172K8822c85530J57699A3520
19463c53999D2980N7893a70424L0306A87999B2220a47828B29367b27335J11895
19453a15440d2534O342q1152p931A42684N5277b08279B6075a74400F3966D227
19441b00803R7083q5323e460D0091a58612e5764k30299G1057a42179b6430B01196
19429b27277C3610f7436r0936q1490d1690A05680f5128B8083F434L60297c14702
19417b24157a06355J6634D9074J56714c85202J48698g2871E2169N5112c7622q3764
19406a21386C5200a37235M6048j55242J14992n3743N6362k8469I0374a89756A35195
19394A0890a40936j5259B27312b37232h0010A62745d7316a1975j52008M3617A90619
$$ y = [-776310, 144089, 101888, -209709, -52144, 119106, 106934, 135756, -385530, -227831, 13520, -353999, 42980, 100873, -170424, -140118, 187999, 22220, -147828, 229367, -227335, -115440, -42534, -36192, -117344, -125275, 142684, 197961, -208279, 26075, -174400, 63966, 4227, -200803, -103720, -189043, -5460, 40091, -158612, -55764, -286063, 71057, -142179, -26430, 201196, -227277, 33610, -67436, -158372, -239862, -41690, 105680, -65128, 28083, 6434, 366731, -314702, -224157, -106355, -89721, 49074, 205788, -385202, -236504, -72871, 52169, 107281, -37622, -121386, 35200, -137235, -91187, -246429, -131437, -185180, -128818, -157287, 90374, -189756, 135195, 10890, -140936, -156195, 227312, -237232, -80010, 162745, -47316, -11975, -163983, -120366, 190619]
19382b31214J15187A9657f7047E1420A0119N6658b5368B81N42165k37711a16480
19370H1889a63596d7233G1164j0202p659J49974e896C03405A5366b39255B70878
19358A748J11707c82505B3732c63081J41877j33763a7267B07900c24619A43128
19347A95753F5103d32669A39877E2088P2286K30081a01088j74517h2051b6435
19336B10086a3143F5202b28790C4677L3855g712k09224H419c11509a39813F7983
19324a82014h5184j28036B6300a33524b5795Q53o0048a8793j10952A54676B901
19312b36796N7622B47839a83210B21524c8745q4261A66342H1236C6227b61709
19301e0740k02135F7607a29707F6606a90022A79709i2297C4322K4617g6340k8385
$$ y = [-231214, -116027, 19657, -67047, 51420, 10119, 66777, -25368, 281, 542446, 304735, -116480, 81889, -163596, -47233, 71164, 60962, 53303, 203277, -5896, 303405, 15366, -239255, 270878, 1748, 113455, -382505, 23732, -363081, -221204, -354967, -17267, 207900, -324619, 143128, 195753, 65103, -432669, 139877, 52088, 124374, 354455, -101088, -275605, -82051, -26435, 210086, -13143, 65202, -228790, 34677, 68532, -7712, -216936, 8419, -311509, -139813, 67983, -182014, -85184, -213220, 26300, -133524, -25795, -24942, -84990, -18793, -129745, 154676, 2901, -236796, -179174, 247839, -183210, 221524, -38745, -123006, 166342, 81236, 36227, -261709, -50740, -252875, 67607, -129707, 66606, -190022, 179709, -92297, 34322, 58939, -76340, -104725]
19290a04725H6068a07614l91518a05053j09533C1350d1955j56970g6159l658k4869
19279a04686H8954R6583b41299H3671c72704B6237a01069A07261b91064L6219
19269b54845e4535j7712I4386a1317m5936K8054n7618q9180r3228c803m9854l149
19257e6806B37490a45408B95329a49976k8700k30497H7439e7255j14808p1069
19247b43132H4336A8913b4662k52929a2011j03110N2892A93549a37680k32682
19237c70362e8813B83480b74976I172b39461d7385r6681A68091b6293A53854k951
19226A50903D6331c50028Q1010M2983J7996A33365a83400a2520j88224A0635a11039
19214a27031A93645b41622A9283a26723o2669g4617j86921G0583h6500F2681J13864
$$ y = [-104725, 86068, -107614, -499132, -105053, -214586, 31350, -41955, -198925, -76159, -79817, -104686, 88954, 185537, -241299, 83671, -372704, 26237, -101069, 107261, -291064, -254845, -54535, -72247, 94386, -11317, -57253, -29199, -86817, -175997, -269225, -3803, -53657, -56806, 237490, -145408, 295329, -149976, -178676, -409173, 87439, -57255, -172063, -243132, 84336, 18913, -24662, -277591, -12011, -115121, -62229, 193549, -137680, -370362, -58813, 283480, -274976, 9172, -239461, -47385, -144066, 168091, -26293, 153854, 150903, 46331, -350028, -269018, -226035, -208039, 133365, -183400, -12520, -200744, 10635, -111039, -127031, 193645, -241622, 19283, -126723, -189392, -74617, -261538, 70583, -86500, 62681, 176545]
19203A76545h6684j23995L1929G3227B2763e6318o840k12361F7987a3067B02962
19191G1295B0047b9810k35839P1051C16384d447j17850M4423m42961a26185l57326
19180d83511I4509L4402i0646c5780r4884n5410D27825E9188b99593j3519k1263
19169c34375J31623C93982G7878K2256Q4374G8692a16560c7504q99j31853H7320
19157g8688B27957b29326f6984n8042B18979d5019m2858c3181B09642P0065a3172
19145g3683r8761b5941A35763k8797i5368B8681R7678a7185l1417j11523L9464
19134a20661M8661F0660b8617m5141C435b25030h9556C5949J91748a19400J1775
19123a07625k72890e5906B8092d79238J61720P005a08908c180k70851H7646g5521
$$ y = [176545, -86684, -210679, -178750, 73227, 22763, -56318, -63158, -275519, 67987, -13067, 202962, 71295, 20047, -29810, -265649, -194598, 316384, -4447, -122297, -77874, -520835, -126185, -483511, 94509, 128911, -90646, -35780, -130664, -186074, 427825, 59188, -299593, -313112, -334375, -202752, 393982, 77878, 100134, 184508, 78692, -116560, -37504, -38403, -170256, 87320, -78688, 227957, -229326, -66984, -125026, 218979, -45019, -87877, -33181, 209642, 279707, -13172, -73683, -172444, -25941, 135763, 106966, -95368, 28681, 126359, -17185, -48602, -160125, -120661, -72000, 60660, -28617, -73758, 3435, -225030, -89556, 35949, 227697, -119400, -107625, -380515, -55906, 28092, -479238, -317518, -310513, -108908, -3180, -274031, 87646, -75521]
19111i4389a7838p6042q0751g0908l4290A2374c6457j38220A4122c18921d1949
19099B69175a71471h4680r8483k36442E7805d36036h2219l7874o7657F6233J918
19088F8151C0153e6476o1178k0239O3783A0997K74389a30547m0541A0052L78388
19077C88440i6201B90716n8022a93933E2778Q2009d48121C64P5252B886h3271
19065g7173g135j08061a3063A56573A4381J48099p1903p455d2828k64212l5521
19054c42561b7471j41722k2899K5729b7960j82193O9283A84223h7615l31683B0037
19042d9768C0425E975b68128a26388I848i0726C26646B1281c97300A87899c0574
19030B54216j13225K7950j2543b33073H1106h0459A05554a39946B54560G6323
$$ y = [-94389, -17838, -93880, -174631, -70908, -105198, 12374, -36457, -174677, 14122, -318921, -41949, 269175, -171471, -84680, -183163, -419605, 57805, -436036, -82219, -120093, -187750, 66233, 68151, 30153, -56476, -117654, -137893, -74110, 10997, 285386, -130547, -171088, 10052, 388440, -96201, 290716, 232694, -193933, 52778, 134787, -448121, 364, 75616, 2886, -83271, -77173, -7135, -115196, -13063, 156573, 14381, 162480, 90577, 83122, -42828, -307040, -342561, -27471, -169193, -192092, -166363, -27960, -210153, -140870, 184223, -87615, -419298, 20037, -49768, 30425, 5975, -268128, -126388, 9848, -90726, 326646, 21281, -397300, 187899, -30574, 254216, 140991, 168941, 156398, -233073, 81106, -80459, 105554, -139946, 254560, 76323]
19019F371f0289M370D6818i342A53293b45294j0665N0886A79730g2245j51797
19008b24042A25756b11474A22507b18410a2487j37075E2771K6252J15139n7835
18998A36327i2097j45833H8629c4527j55101B47905L3978a52490I1918b78818
18987d09869F7136C0219b7434B11964a59196B1062c09890A02827b60120C96680
18976a9613o6394a1939r1529A9595a20748A48425c72491a28160M1234B60920a23262
18964D2335g6294A84283c3725H4045a4715o8246G796Q679c1418k74897Q6657a9290
18951A06825b33504c1058r9233c6859A09283D4105a36864d4497C57908g6983J5136
18940f1847A94367i9901A83580a6176l75193D7925b57940f2872g607r3614l300
$$ y = [6371, -60289, -55919, 46818, -9342, 153293, -245294, -255959, -205073, 179730, -72245, -224042, 125756, -211474, 122507, -218410, -12487, -149562, 52771, 79023, 194162, 136327, -92097, -237930, 88629, -34527, -189628, 247905, 281883, -152490, 91918, -278818, -409869, 67136, 30219, -27434, 211964, -159196, 21062, -309890, 102827, -260120, 396680, -19613, -86007, -11939, -103468, 19595, -120748, 148425, -372491, -128160, -86926, 260920, -123262, 42335, -76294, 184283, -33725, 84045, -14715, -82961, 7796, 16475, -31418, -306315, -219658, -19290, 106825, -233504, -31058, -130291, -36859, 109283, 44105, -136864, -44497, 357908, -76983, -61847, 194367, -99901, 183580, -16176, -391369, 47925, -257940, -62872, -7607, -101221, -104521]
18929a04521A98254a13130D16365A07397c62601E7864b2794q7097j02477d6436
18918g8710A43587j7860a71221A65156a2569B08973H0443J20217a301C8146J37668
18907A75814a28197H9560N6965c35183M0963m7453a29120k21888A25841l3017
18897I2824c2825A0401J35565c6468E6170K5507J78036a18125j8154k19918N9824
18886b96373A87665a09742a3835k07528d7401j00212d3986F8761b23975I1569
18875f1101G0157b44027J13280p548B14985B354K9082a41309N4228j39778b4895
18863A90303b33097a5374k049I6301c7216B41816b80946J16442A93118d21726
18852a49347D5729c5345A11497c4684B24876f7223A88078I298b24195j31078a34399
$$ y = [-104521, 198254, -113130, 416365, 107397, -362601, 57864, -22794, -109891, -212368, -46436, -78710, 143587, 125727, -171221, 165156, -12569, 208973, 80443, 200660, -1301, 38146, 175814, -128197, 89560, 146525, -335183, -294220, -341673, -129120, -351008, 125841, 92824, -32825, 10401, 145966, -36468, 56170, 81677, 259713, -118125, -136279, -356197, -296373, 187665, -109742, -13835, -221363, -47401, -147613, -43986, 68761, -223975, 91569, -61101, 70157, -244027, -130747, -138295, 214985, 2354, 31436, -141309, -87081, -226859, -24895, 190303, -233097, -15374, -17423, 96301, -37216, 241816, -280946, -164504, 193118, -421726, -149347, 45729, -35345, 111497, -34684, 224876, -67223, 188078, 9298, -224195, -355273, -134399]
18840C1563a81849l6840A17914e3021p0443n7482P5913B5340b12077C5072a17421
18828a48002A46906m8271J9505c79769b091F9487b8225a621C7251M2631g8139
18816a36970E0550B4489a39309k1845A06080N1820a59721A37763M2453J00552
18806B80768b9832A82162a95985N3230n7376G4284J27625j0265b5324j59582N6873
18795a28033A43642b86881A60120B3873R728b16496j38207N5086a3184A19193
18784a00709A17004h4845C43290A9265P0574b18809m5816c5724C77713I4846A0556
18772H9252d34959a65979A5948c8073o6391j62374b3984k49235A51933b47228
18761a53220f6214C06L39388E1894d079o5025B07724o3911J0584a04096a9251
$$ y = [31563, -181849, -218689, 117914, -53021, -123464, -180946, -105033, 25340, -212077, 35072, -117421, -148002, 146906, 98635, 118140, -379769, -2091, 69487, -28225, -1621, 37251, 79882, -78139, -136970, 50550, 24489, -139309, -161154, 106080, 157900, -159721, 137763, 180216, 280768, -29832, 182162, -195985, -142755, -200131, 74284, 201909, 191644, -25324, -184906, -128033, 143642, -286881, 160120, 23873, 33601, -216496, -354703, -299617, -13184, 119193, -100709, 117004, -84845, 343290, 19265, 89839, -218809, -264625, -35724, 377713, 94846, 10556, 89252, -434959, -165979, 15948, -38073, -104464, -266838, -23984, -273219, 151933, -247228, -153220, -66214, 306, 339694, 51894, -4079, -69104, 207724, 143813, 154397, -104096, -19251]
18749b74113A91315j326F3738M7969b7865k14853h3917F3347b22150o8472a39497
18737A32143J20678a44238q4055D9422P5942h5509d0641m0500O526b1326j32319
18726a53645A10229a86730C54581D416b8563C01254c34j35628d5690D1699e1228
18714D2419r534a78887M9874j19795C97132B0495J47150a14552j41567P09d2597
18702b24920j57271a82509K45j6564B77237D9480a42753c5939r0210F5604b49068
18690c65383a63682M5392J2282H5007M4420b01421F9013j6399a20580m946j41046
18679b66572D8266a94395B69319a25824K0184G3575C3617j0228J02755a45787
18668a90122A53540J90904a0479B0385i3751j76639a00012A60129b87326d0974
$$ y = [-274113, 191315, 189989, 63738, 111707, -27865, -242718, -83917, 63347, -222150, -290622, -139497, 132143, 252821, -144238, -228293, 49422, 125364, -85509, -40641, -81141, -74615, -21326, -153645, 110229, -186730, 354581, 4416, -28563, 301254, -334, -135962, -45690, 41699, -51228, 42419, 32885, -178887, -129013, -248808, 397132, 20495, 167645, -114552, -256119, -255410, -42597, -224920, -382191, -182509, -182264, -198828, 277237, 49480, -142753, -35939, -126149, 65604, -249068, -365383, -163682, -118290, -106008, 85007, 129427, -201421, 69013, 52614, -120580, -125526, -266572, 48266, -194395, 269319, -125824, -105640, 73575, 33617, 23389, 126144, -145787, -190122, 153540, 344444, -10479, 20385, -93751, -270390, -100012, 160129, -287326, -40974]
18657f5108n614A36814b7502F194K49637C1622h308r0609A85253i593j264o7072
18645g7929q6825e1685m79191g4199l10463J34156a01120M8259I8933P0551a25784
18633a2614n8013C48765a04085j46760o8851M4674L0152c1182l53459A10h2037
18621a21158m4299O0279J5308b1144C7396a71771g3886b5424l6041l845A60911
18609g7679k24990B43373H6241j1229c13841g0218J5727B37736c28251A43022
18598A76490q804a07563c1116A12907g6687J4950a1822j85508i6860a7014j91164
18587b08178q7687i8707K2538a4594A3148L34136a49016O1098A5759J4667b67676
18575a46397D3828P928L45397g7799j55863C5708a0948p4717j62882f7512l84593
$$ y = [-65108, -70722, 136814, -27502, 6194, 255831, 31622, -8308, -98917, 185253, -9593, -10857, -77929, -164754, -51685, -530876, -74199, -384662, -250506, -101120, -52861, 98933, 169484, -125784, -12614, -70627, 348765, -104085, -250845, -319696, -275022, -244870, -31182, -384641, 110, -82037, -121158, -165457, -105178, -89870, -21144, 37396, -171771, -73886, -25424, -61465, -65310, 160911, -77679, -302669, 243373, 86241, 75012, -313841, -70218, -54491, 237736, -328251, 143022, 176490, 167686, -107563, -31116, 112907, -76687, -61737, -11822, -197330, -96860, -17014, -208178, -295865, -98707, -76169, -14594, 13148, 347284, -149016, -87918, 15759, 30426, -267676, -146397, 43828, 51756, 397153, -77799, -233662, 35708, -10948, -85665, -248547, -67512, -452105]
18564d52105i8823N385j36556L1543p9480J30904j03680F149b46401b0017J053
18553a8964l39749c6206m4299A44635B2339L7084a00215b9794j03829j00845e0842
18541A143M5426N1253l601J16224j00218d7972A55674K46707c58263D0108b18475
18529F2058j1032J07193B754J77373h7047L9408K0185j75514j8110D067c3515
18517a15786l72467G0747b56147k38931D6920b5811A260b48271J04224E8137R883
18506F8020J65868a95286n7906a26000C4825N2280A295L1474L36441F1642Q1022
18495A42664a34084N7513B80966b6377k14937M1243c6693A61383p402L135B5877
18483C37210A09915J8635c27034J55357A76748d0773p7562c9024F3937b88549
$$ y = [-452105, -98823, -93438, -229994, -198451, -277931, -147027, -250707, 6149, -246401, -20017, -18964, -358713, -36206, -80505, 144635, 22339, 59423, -100215, -29794, -133623, -234468, -50842, 1143, 46569, 97822, 94221, 210445, 110227, -47972, 155674, 402381, -358263, 40108, -218475, 62058, 51026, 158219, 2754, 180127, -87047, -47639, -27454, -202968, -221078, 4067, -33515, -115786, -488253, 70747, -256147, -495078, 46920, -25811, 1260, -248271, -144047, 58137, 68020, 233888, -195286, -253192, -126000, 34825, 87105, 1295, 32769, 369210, 61642, 142664, -134084, -76571, 280966, -26377, -241314, -200071, -36693, 161383, 153981, 157116, 25877, 337210, 109915, 128550, -327034, -171677, 176748, -40773, -118335, -39024, 63937, -288549]
18472i2279A01141m1681f2321j18079P2511A9326L684J7575Q4607Q482e0792n421
18460e6213k3413F9354b24496H7724a20528B3145A0222P577Q7491l297i9559A80170
18447B76408F9105b07020B24058H9334N672i9698M8676B845K7754a11715F26b03283
18434a72379A46718L9925D5673J26260Q3976e7314k92P136C5376j814j3284L2682
18422E2960c44931A37539a36343B06126c84036F475b00956B94237A38561b44712
18411E897b16795B1712d84211a77951n2652c6829j95450B25751b85650Q8008C11458
18399f7293K4868K0719H253J93898a58413r4777B55187a6923q7554d5208m3810
18388h9018B4866c73842A20569a33728J2512A42225e2981q2862l7845B1863K55305
$$ y = [-92279, 101141, 59460, -62321, -180400, -107889, 19326, 23010, 40585, 125192, 133674, -50792, -56213, -79626, 69354, -224496, 87724, -120528, 23145, 10222, 17799, 105290, 101993, -99559, 180170, 276408, 69105, -207020, 224058, 89334, 95006, -99698, -51022, 2845, 30599, -111715, 626, -203283, -172379, 146718, 186643, 45673, 171933, 255909, -57314, -57606, -50470, 35376, 33562, 20278, 52960, -344931, 137539, -136343, 206126, -384036, 6475, -200956, 294237, 138561, -244712, 5897, -216795, 21712, -484211, -177951, -230603, -36829, -232279, 225751, -285650, -197642, 311458, -67293, -42425, -21706, 8253, 202151, -158413, -253190, 255187, -16923, -104477, -45208, -89018, 24866, -373842, 120569, -133728, -121216, 142225, -52981, -135843, -173688, 21863, 277168]
18377B77168a52941p2489B00093F5214J55403a50730l14782B1841b70132C2777
18366i0575I6177A8343e0824E5140c69274a65752G8330O457J00836B6831c92C6675
18353A08676b00693l7479A2033i2394J1507K1896B46842c2772l5120j41007a475
18341g6376k33193G1613a06968A60064c52037B73570a79850j23681a04779q4802
18331a89581O0213l2881c8504j51740c689C4046N2910B1799a41959I0428a78820
18319e1894I3999K6385a87415A07919a13657A01368K27294a25021M7568J610b6014
18307C36712b8374B99678d3445l48467J44133k6504J24955d4840C2611b11936
18296i9275k12033a54479I6369b20824A01269b4630l75819i8829n2448I7600a47319
$$ y = [277168, -152941, -225430, 200093, 65214, 220617, -150730, -465512, 21841, -270132, 32777, -90575, 96177, 18343, -50824, 55140, -369274, -165752, 78330, 84787, 185623, 26831, -392, 36675, 108676, -200693, -238172, 12033, -92394, -80887, -58991, 246842, -32772, -67892, -208899, -1475, -76376, -309569, 71613, -106968, 160064, -352037, 273570, -179850, -303531, -104779, -189581, -129368, -162249, -38504, -190244, -3689, 34046, 86956, 21799, -141959, 90428, -178820, -51894, 93999, 120384, -187415, 107919, -113657, 101368, 328662, -125021, -77453, -75843, -26014, 336712, -28374, 299678, -43445, -391912, -247779, -274283, -149328, -44840, 32611, -211936, -99275, -311308, -154479, 96369, -220824, 101269, -24630, -400449, -98829, -151277, 97600, -147319]
18284G1284C866Q3807k6018L9268D7330K84363c65891C7183K30798g1791I1434
18272D8072k2796a57225l7911A97710a03170B6738J14185J04645b0849A04541
18261i01k27922o60D5225k1670a28386c0285G229b65338A1531m514O6642K18446
18249B92105a02196j79676A78124a00474e797k62012E720i7574k17514K8733A56939
18237A52496J02420i3516j57287B89812b39164K1092A32984h2713c2203A09259
18226A22351e880j83494a1473B66721b0442j04477N3619H9237b68502e1385j62831
18215b14216f9170K5847a248I7969a78542A59738b67049a0688l04681A46168a20454
18203b10582f3105A04110I239a09271A35870b53000P1432A17863D3388a77723
$$ y = [71284, 3866, 87673, 61655, 100923, 47330, 331693, -365891, 37183, 267981, -71791, 91434, 48072, 25276, -157225, -195136, 197710, -103170, 26738, 140923, 245568, -20849, 104541, -901, -228823, -229483, 45225, 23555, -128386, -30285, 7229, -265338, 11531, 7017, 73659, 292105, -102196, -281872, 178124, -100474, -5797, -267809, 5720, -97574, -315088, -286355, 156939, 152496, 254916, -93516, -250803, 289812, -239164, -218072, 132984, -82713, -32203, 109259, 122351, -5880, -189374, -11473, 266721, -20442, -124919, -71300, 89237, -268502, -51385, -214216, -69170, -43323, -1248, 97969, -178542, 159738, -267049, -10688, -315369, 146168, -120454, -210582, -63105, 104110, 9239, -109271, 135870, -253000, -181568, 117863, 43388, -177723]
18192a94752M8685A021d7227B24553q1078a35755N7709F8264K98086i1822H5003
18180B17703a80798j46396f017j44309m8384F7084C2794c77868a4460r023k1632
18169d5115m7156j04380f4958j7709A44633L8105b59292F5224C1729a10567D8745
18157H6055h9285k9246I7110b04820I7910a86115C66361c96937g1691I4941a51309
18145D9996a17545a0514I2355J75479c1340G5108M8319a98684d353j06189C26848
18133c09768I1031d6049A06471c56208a40059o2173a4820l28083J41833A88875
18122C47235G4573b38966i6488B69001a31754G6047A2503J15885d0536A01167
18111b83018A75571b423j8039B74986H1095a83943A08394i7062o5389D86374f2345
$$ y = [-194752, -146067, 1021, -47227, 224553, 143475, -135755, -78046, 68264, 366350, -91822, 85003, 217703, -180798, -327194, -6017, -150326, -198710, 67084, 32794, -377868, -14460, -23483, -45115, -92271, -196651, -64958, -82667, 144633, 182738, -259292, 65224, 31729, -110567, 48745, 86055, -89285, -118531, 97110, -204820, 97910, -186115, 366361, -396937, -71691, 94941, -151309, 49996, -117545, -10514, 92355, 267834, -31340, 75108, 123427, -198684, -4353, -110542, 326848, -309768, 91031, -46049, 106471, -356208, -140059, -202232, -14820, -342903, -201070, 188875, 347235, 74573, -238966, -96488, 269001, -131754, 76047, 12503, 128388, -40536, 101167, -283018, 175571, -2423, -20462, 274986, 81095, -183943, 108394, -97062, -162451, 486374, -62345]
18099b95670F2646K5182B2403B144c03517j3491j5560d4888D2572b13547A54389
18087A77915a80430l6100k0064k29512c0904m8210B08699b34848C28288G815a29206
18075B2412h0441k37982F7038J49575a15916A13940B8076e6648F4382J35881i7405
18063A79064a86080A6240a73840C2717L11593a95631A94036b31090E0700d3476
18052A89624c6002I487M8066o164b86322J19773B23299E8812J45891F1587B1208
18040d2211G021a03894C13390A35860d37110b4066l5113j35511O5943e7191j00770
18029a57961m4201b0200k6765j25936F0641k3082J12097J8102i4504A48442c54949
18017i6468j06293O6987e7837D00329g9816C76152a51010M7672B57195a31247
$$ y = [-295670, 62646, 87828, 22403, 2144, -303517, -317008, -332568, -44888, 42572, -213547, 154389, 177915, -180430, -216530, -236594, -466106, -30904, -79114, 208699, -234848, 328288, 7815, -129206, 22412, -80441, -318423, 67038, 216613, -115916, 113940, 28076, -56648, 64382, 200263, -97405, 179064, -186080, 16240, -173840, 32717, 344310, -195631, 194036, -231090, 50700, -43476, 189624, -36002, 9487, 57553, 51389, -286322, -166549, 223299, 58812, 204703, 61587, 21208, -42211, 7021, -103894, 313390, 135860, -437110, -24066, -59179, -194690, -128747, -57191, -157961, -202162, -20200, -46965, -172901, 60641, 37559, 149656, 167758, -94504, 148442, -354949, -96468, -202761, -135774, -57837, 400329, -79816, 376152, -151010, -103338, 257195, -131247]
18006A80184f2193j90453I239g804F7061a31186a3172D7549a59120I081P0345
17995G9426a12708j4873C634a10987D1990L7935r270b75825a32144A2698L9463
17984E2161j3847L884K52957A34384J10341h07l9485J1804A13167m5865d9799
17972c38892A12234B0020J42150b42013P1999A88813a44102E0635e14823E7538
17961A52681a46383p6152i5508B9183d18036J93939F2652c4985E560b36493p85
17950b37278A5354l777a5847k68687B5467c17822e6834a87j59916G2518a08891
17938B7236b31082D54354A085d8515F1533L6719b62565h66A46148b05581G100
17926F1067O4227e8748n7159B50208B0057K27931a6907l1860A85498q3367K08162
$$ y = [180184, -62193, -252646, 9239, -7804, 67061, -131186, -13172, 47549, -159120, 9081, 79426, -112708, -127581, 3634, -110987, 41990, 79925, 70655, -275825, -132144, 12698, 52161, 38314, 42198, 295155, 134384, 244725, -807, -40292, -28488, 113167, 67302, -49799, -338892, 112234, 20020, 162170, -242013, -170014, 188813, -144102, 50635, -514823, 57538, 152681, -146383, -222535, -95508, 29183, -418036, -224097, 62652, -34985, 5560, -236493, -237278, 15354, 11577, -15847, -284534, 25467, -317822, -56834, -187, -160103, 72518, -108891, 27236, -231082, 454354, 1085, -48515, 61533, 98252, -262565, -866, 146148, -205581, 7100, 61067, 125294, -58748, -115907, 250208, 20057, 247988, -16907, -48767, 185498, 102131, 310293]
17915C10293G9754b0077n5376j09993e758H0757a44283j2369i044A64964a90924
17903C5853c0786j17850B5523a24609q9003C1073a03120A62922c25064e1604I326
17891a16263N4476C31484E7688Q488K3742a12415D8979b39178N2430M2617C16146
17879A01695A7680a16662p4426G6902b02703b7007j41118O569f064B79234a41541
17867d38055K02253g6365A01609h2445A25355f1159C925K45828c56916L7240d909
17855B665a02565j49639a17689j0148b9180j02389A18879i9474k74930J60162
17845b14242B16719p6448L45589a12514d5090k60555A80702C6978a28391B82234
17834B11231k832b16375d8561o0981J4642m2288b8190G4541j9705K95058b04094
$$ y = [310293, 79754, -20077, -75453, -185446, -5758, 80757, -144283, -156652, -9044, 164964, -190924, 35853, -30786, -148636, 25523, -124609, -213612, 31073, -103120, 162922, -325064, -51604, 9326, -116263, -61787, 331484, 57688, 66176, 89918, -112415, 48979, -239178, -186748, -144131, 316146, 101695, 17680, -116662, -191088, 76902, -202703, -27007, -168125, -161556, -6064, 279234, -141541, -438055, -235802, -76365, 101609, -82445, 125355, -61159, 3925, 249753, -356916, -319676, -4909, 2665, -102565, -252204, -117689, -127837, -29180, -131569, 118879, -99474, -374404, -214242, 216719, 140271, 485860, -112514, -45090, -305645, 180702, 36978, -128391, 282234, 211231, 208399, -216375, -48561, -109542, -94900, -137188, -28190, 74541, 54836, 349894, -204094]
17822D22280a06230A17012a8817j88561B8442b09576f6146E7775b94829g892m2962
17811e0854C90054b45434i6483A50313b11186Q0193A42079C4033Q2076a41361
17800G9953l4166a28397l6801A11385A1980a43083A32213k8554J25786b13785
17789a2763C70110n9220E8633n669q389a08414a6896D03789G1141a3549j23124
17778a36673D5578i7791A28764L00783A54637b55735h9204B39018c98183J97808
17768b00375K4650L2142C56510a56088a0265A84170F015d10947B08896L4232j11056
17757A32072c70432A29264c56983d0522A25321a90489k9088A74179b24098J02041
17747a22057j02964a2055j80316B83017D7996j4170a94045k0208H5698b4860B70701
$$ y = [422280, -106230, 117012, -18817, -207378, 28442, -209576, -66146, 57775, -294829, -7892, -50854, 390054, -245434, -96483, 150313, -211186, -130993, 142079, 34033, 116109, -141361, 79953, 45787, -128397, -165198, 111385, 11980, -143083, 132213, 103659, 229445, -213785, -12763, 370110, 310890, 58633, 52964, 44575, -108414, -16896, 403789, 71141, -13549, -136673, 45578, -97791, 128764, 429547, 154637, -255735, -89204, 239018, -398183, -200375, -175725, -143583, 356510, -156088, -10265, 184170, 6015, -410947, 208896, 243128, 132072, -370432, 129264, -356983, -40522, 125321, -190489, -219577, 174179, -224098, -122057, -225021, -12055, -192371, 283017, 47996, 33826, -194045, -214253, 85698, -24860, 270701]
17735a42847j94531H7089l2825a10199A60612b43769B04535b7412C084g2970k48909
17724c21879a2446n332E1275R010a97694O7786D3960b29992g6523n91A80071P1431
17712B51502E23J27097d8515j84928H1124o274a5926D6211K20487j18210b80861
17700f6910K3933q5156o7458j00274D92298A75113J4450a26874k258E728K63196
17689B68924k5765a33254j43779h9840n4425C9468c08419G6541K03331b48798
17678c98530A4360g7137l3704B31998H0439a69731C8156b42006A5806b97473d5737
17666B65959a9362k11721M6152c3995B1383J10974J08998j05159k9125k9072B4265
17654B59714d8638G8340c9328C1351A3516e8916H5369J1341a30902l914D4025
$$ y = [-142847, -337378, 87089, 54264, -110199, 160612, -243769, 204535, -27412, 3084, -72970, -321879, -12446, -17778, 51275, 60285, -197694, -129908, 43960, -229992, -76523, -77114, 180071, 251502, 523, 127620, -48515, -233443, 81124, 74850, -15926, 46211, 266698, 148488, -280861, -66910, -42977, -128133, -195591, -295865, 492298, 175113, 189563, -126874, -129132, 5728, 268924, 243159, -133254, -277033, -89840, -144265, 39468, -308419, 76541, 279872, -248798, -398530, 14360, -77137, -110841, 231998, 80439, -169731, 38156, -242006, 15806, -297473, -45737, 265959, -19362, -231083, -184931, -33995, 21383, 132357, 241355, 136196, 107071, 77999, 24265, 259714, -48638, 78340, -39328, 31351, 13516, -58916, 85369, 96710, -130902, -134816, 44025]
17642c5994C38884G8229a41493o826D3791A834c8354b637M4B73191a98654C5941
17629C6975N668E477K65050a19944C9372Q321c0796J0052R594A87378b45670M6030
17617a99640c7256j47239A01610a10874A18208a80389j09147A27891m9156K13042
17607B91777b0333A59029a04955I287a74725N5512B4288K15085O4426I1068a14093
17595C51504a10460j05838i0297j04471j0103A52999J81246C5371b09745E2492
17584c23166B72782q3978b55967M5513B9692J98078C7468b71723A38211h0590
17573d1025C10299D4429J77300i7210o6617L0221C0727b28422A9611N32927j20298
17562D32240j65096H6006P5496i4787B05393q9063A6221J01192J38803b02346
$$ y = [-35994, 338884, 78229, -141493, -148319, 43791, 1834, -38354, -2637, -2593, 273191, -198654, 35941, 36975, 42643, 5477, 270527, -119944, 39372, 47693, -30796, -20744, -11150, 187378, -245670, -199640, -37256, -184495, 101610, -110874, 118208, -180389, -289536, 127891, 78735, 291777, -20333, 159029, -104955, 9287, -174725, -119213, 24288, 239373, 303799, 91068, -114093, 351504, -110460, -216298, -90297, -194768, -204871, 152999, 334245, 35371, -209745, 52492, -323166, 272782, 188804, -255967, -210454, 29692, 227770, 37468, -271723, 138211, -80590, -41025, 310299, 44429, 221729, -97210, -163827, -133606, 30727, -228422, 19611, 552538, 432240, 267144, 86006, 161502, -94787, 205393, 116330, 16221, 117413, 256216, -202346]
17551A69931a77057b5875G162J04673J50889A1814P3225j5564Q4311M9629f9226
17539a77432A12769b05685d467G1410J5522c6483A42907o4372P389N6224D304
17527C4810J2433P5230L87688A51706i2556j2141E3092b8531B11108o3061k5735
17516A22312L7527R2685m8233O6428r8821I063J75616q1317a23226d8604n652
17505e4256A58037J10738j22807l0607R3156R3287J94420A30420b5921B40180
17494b85555D97023d2406A95391b59648B5951J2507b24362c5222A32289A6013
17483a25784G9421J84423h9378A10499M2248b34880B67950g6974A42695L0475
17473A73170m4300J84010G4181a09869d1749D136a03016J9756A40966E0287J47981
$$ y = [169931, -177057, -25875, 7162, 111835, 262724, 11814, 85039, 69475, 153786, 203415, -69226, -177432, 112769, -205685, -4467, 71410, 86932, -36483, 142907, 78535, 85924, 142148, 4304, 34810, 47243, 122473, 510161, 151706, -92556, -104697, 53092, -28531, 211108, 148047, 122312, 159839, 252524, 204291, 270719, 171898, 9063, 184679, 103362, -123226, -48604, -54256, 158037, 268775, 145968, 115361, 208517, 301804, 496224, 130420, -25921, 240180, -285555, 497023, -42406, 195391, -259648, 25951, 38458, -224362, -35222, 132289, 16013, -125784, 79421, 263844, -89378, 110499, 152747, -234880, 267950, -76974, 142695, 173170, 128870, 312880, 74181, -109869, -41749, 4136, -103016, -83260, 140966, 50287, 198268]
17462A98268K35704h3315J1549A13769m8579a38392e9617H8552J48029R65D8565
17450G318R5749L82962A79273K64107B19789o7102M56700k46008j44903F4578
17439A91712l2705J56321p2419A1736J46454N0186e4907B42775J18298r2272H0302
17427B33246d5885E9298J1785L4252K73980j9063l7391r2648A2372N46199D0166
17415D2961J27181K52779N7882e3201A61614J02006O6386L601p0999L6820A41108
17403D9434J61969l5145a82878C74431b36025P2727B51363H6925J24482h9285
17392A53611a55124k54913d110A03484K32028l4750j12076N1278r3128g7384a0849
17380c59610F19196A96753B4241K21005k5086K7296j21497N18a66424B72254L6070
$$ y = [198268, 433972, -83315, -71766, 113769, 65190, -138392, -59617, 88552, 236581, 237546, 48565, 7318, 103067, 486029, 179273, 443380, 219789, 152687, 609387, 363379, 218476, 64578, 191712, 159007, 315328, 242909, 11736, 158190, 208376, -54907, 242775, 361073, 268801, 80302, 233246, -45885, 59298, 71083, 105335, 379315, 360252, 322861, 230213, 12372, 558571, 40166, 42961, 170142, 422921, 480803, -53201, 161614, 263620, 330006, 333607, 262608, 299428, 141108, 49434, 211403, 176258, -182878, 374431, -236025, -163298, 251363, 86925, 211407, -89285, 153611, -155124, -410037, -4110, 103484, 335512, 300762, 188686, 239964, 146836, -77384, -10849, -359610, 619196, 196753, 24241, 245246, 220160, 247456, 125959, 126477, -166424, 272254, 308324]
17369C08324a0492B50381d8814D27661j06867J0283j39977G2187J53530B3662
17358A0171J20266A6694M9921J71042D5612J62404B4905Q6179R7228n7079K93834
17347D45067j92332A927K53993A22051K57169R6452I8183P4727M0795n0340B9512
17335a20163A0812J79716j5543B7996a78667A68358q1998O9294R9282K28394E7751
17323B25122n9138a41342C1056K81066M64c48643C94862j76191p0769d53p3224
17312g3677m2265F6827d7514G2191e5650A32899j9827Q7802p5271e7357A65211
17300a33458A15900c8297m6899A33656R4443a0611j29542M1332A67252p1209L8817
17289A34860J08313E2791b9947G9776L00353A03194b42887B54640J05003j11459
$$ y = [308324, -10492, 250381, -48814, 427661, 320794, 331077, 191100, 72187, 225717, 23662, 10171, 130437, 16694, 66615, 237657, 45612, 208016, 24905, 111084, 208312, 151233, 445067, 252735, 1927, 255920, 122051, 379220, 475672, 98183, 172910, 213705, 163365, 29512, -120163, 10812, 190528, 174985, 27996, -178667, 168358, 86360, 155654, 254936, 483330, 57751, 225122, 165984, -141342, 31056, 312122, 312586, -348643, 394862, 218671, 147902, -453, -73677, -115942, 66827, -47514, 72191, -55650, 132899, 113072, 200874, 125603, -57357, 165211, -133458, 115900, -38297, -85196, 133656, 228099, -10611, -140153, -98821, 167252, 96043, 134860, 243173, 52791, -29947, 79776, 380129, 103194, -242887, 254640, 359643, 248184]
17279B48184D4252P6861R3800c8634A78252M2906e8469B07575n8230a05248q548
17268a13796N5561B11551k6213C7744A4888L22778D1124Q9793J24620G7820C8185
17256A11445B3916M6472i1068A14982Q3675J89656E6169J78948C9495K9507K33091
17245C02093A44784i1281A47437J78628a3724I3021R411J68140E8493K01181K3474
17234B83148E4261M32722A16639B1559L9399L51496H6186O4863R9512A3388M05859
17223D19247l5260q3056J09973A92367J29208g3529B17302I9883g3062F8934J59442
17212B28376k0779C2368J38698o6605m5989J49891j0470R9828B496e4483A48715
17200D31361F0136K42503i3232A82012m3628J42111J00852o3661L9763d9663F56998
$$ y = [248184, 44252, 121113, 214913, -38634, 178252, 221158, -58469, 207575, 149345, -105248, -113796, -58235, 211551, 185338, 37744, 14888, 337666, 41124, 130917, 255537, 77820, 38185, 111445, 23916, 70388, -91068, 114982, 198657, 388313, 56169, 235117, 39495, 69002, 302093, 144784, -91281, 147437, 326065, -13724, 93021, 102432, 270572, 58493, 259674, 283148, 54261, 486983, 116639, 21559, 60958, 412454, 86186, 151049, 250561, 13388, 419247, 383987, 300931, 410904, 192367, 321575, -73529, 217302, 99883, -73062, 68934, 228376, 207597, 32368, 171066, 104461, 58472, 208363, 197893, 297721, 2496, -54483, 148715, 431361, 60136, 302639, -93232, 182012, 138384, 280495, 381347, 317686, 357449, -49663, 656998]
17188B89992q0482K94440j60588m9438J82366j61104D3793J69141j6821b78247
17177C76536A55979R285r91J96933J67923j01087L0847C9553Q5303J25115R4898
17166C44869K3141N9295j56320K61300B15420M995F7391Q3838J66932J74922j18472
17155C74611r1069j23545K42822A97466O7718q8898m8425M74620j70285j05434
17145C26762L05341D7187J86864j04851J96661H2602d5595D55487F9292J28095
17135A97387j6793n5456N53709C31787K18351n8629N8754B74012J59642j34100
17125B99554E9222L53242l4290g0543B33307P6210K79197L6649A97274m1954K41047
17114C96367J1883J38862k67399J07616A79255L92064j27301k10965R8042M8843
$$ y = [289992, 209510, 503950, 343362, 293924, 476290, 315186, 43793, 212934, 196113, -278247, 376536, 155979, 165264, 164273, 361206, 529129, 428042, 458889, 39553, 124856, 249971, 344869, 368010, 427305, 270985, 532285, 215420, 220415, 67391, 151229, 318161, 493083, 374611, 283542, 159997, 402819, 197466, 265184, 176286, 127861, 602481, 432196, 326762, 632103, 47187, 234051, 129200, 325861, 82602, -45595, 455487, 69292, 197387, 180594, 125138, 678847, 331787, 550138, 491509, 550263, 274012, 433654, 299554, 59222, 412464, 378174, -70543, 233307, 309517, 588714, 625363, 197274, 155320, 396367, 408250, 547112, 279713, 387329, 179255, 571319, 444018, 233053, 331095, 379938]
17104C79938O8896A36738K34829P511J22864j64021J81412k02970j20276K85212
17094D81299K2922j69840q2455J83654j31368N2665q344A71338K28403l2981Q966
17083C75726K36412J25844C36824d1378F76768A39951e1846E49571A64613K90476
17073D55089J94598m7958J5490B79409J85152k27269N19236j79787j34852K6978
17063D68867j40987P4041p3568j30158M53423C01582K16451K15909A51284L17015
17053D68299O5059o475B08461N60867C56323J7938J85326J53901R0525C29006
17042C91072q7595J43868m3791O0865K36507J24019k07690p4238K16634l67488
17032C92163K62154O3985l50287K48918K9811k83159J19234R4494B88490M06168
$$ y = [379938, 448834, 136738, 371567, 379078, 501942, 337921, 519333, 316363, 196087, 481299, 504221, 334381, 251926, 435580, 304212, 356877, 348533, 171338, 399741, 366760, 375726, 612138, 737982, 336824, -41378, 676768, 139951, -51846, 549571, 164613, 455089, 649687, 601729, 617219, 279409, 464561, 237292, 756528, 576741, 441889, 468867, 327880, 401921, 328353, 198195, 651618, 301582, 518033, 733942, 151284, 468299, 533358, 526883, 208461, 769328, 356323, 374261, 559587, 713488, 804013, 329006, 391072, 303477, 447345, 403554, 464419, 700926, 824945, 617255, 543017, 759651, 392163, 654317, 718302, 368015, 616933, 646744, 363585, 482819, 577313, 288490, 694658]
17022F94658K096l43060L83210B43135J25921J54670J49073j77284K16600j98263
17012E13852K47406k96576M01606k08117j21412J81162n2796J94245l42576J74180
17002F90974j98177q8455J61945L90458l52780J90320q1566R0199j90995M26902
16992A038825D65356L06080j44481J72678q3819j5522j5968r6081K30924k60978
16982E58189K56994l3202n6614K80857j41006p7614k79132K55188M1300j04129
16972G00831K15942O7639l01766O1261P3161J77012K27982k48069j46406P348
16962H34935q7160J17636R4934n0821R076K32492k05803P8154M4008j8901j70660
16951H77890P1744q4419j86730O46236j94164m09289M43332k68208L88K22918
$$ y = [694658, 696754, 353694, 736904, 243135, 369056, 523726, 672799, 495515, 712115, 513852, 761258, 464682, 866288, 658171, 536759, 717921, 665125, 859370, 516794, 690974, 492797, 404342, 566287, 956745, 603965, 794285, 712719, 802918, 611923, 1038825, 465356, 771436, 626955, 799633, 715814, 700292, 684324, 588243, 819167, 558189, 815183, 781981, 725367, 1006224, 865218, 787604, 508472, 763660, 804960, 700831, 916773, 984412, 682646, 743907, 817068, 994080, 1222062, 973993, 827587, 834935, 747775, 865411, 960345, 909524, 918600, 1151092, 945289, 1023443, 1067451, 1048550, 877890, 949634, 865215, 678485, 1324721, 1130557, 721268, 1164600, 896392, 896780, 1119698]
16941A119698K72782l43595m4025J08869J27942O6890P4968J00199l15120k01743
16931I66865L67218k03803R5545J2882P590j13413K40126N4319l26254m0968K82834
16920A342941o5725l9091K82195l71906j1701M06025j8213m35381P52233n09219
16910A332158K31142j418k84974J26305K49465J96699l18914J40180J79123j12056
16900A737710p0437o4426K28688k36376k79753L24439J39973J59875k31004L70465
16890B079154q0925j13795l78004J13109K31229M0709j65445M50235J5818l50549
16880A841536M349J62803L58442k48190j73176M66110l40305K51035O2453K48265
16870B633322n36236K71431J25378q896l1200m3232J73008N2883l35587K84756
$$ y = [1119698, 1392480, 1048885, 1004860, 1113729, 1241671, 1308561, 1383529, 1483728, 1168608, 966865, 1334083, 1130280, 1225825, 1238707, 1246297, 1132884, 1373010, 1427329, 1101075, 1060107, 1342941, 1277216, 1238125, 1520320, 1148414, 1136713, 1542738, 1524525, 1089144, 1841377, 1332158, 1563300, 1561882, 1276908, 1403213, 1652678, 1849377, 1530463, 1670643, 1849766, 1737710, 1667273, 1602847, 1831535, 1595159, 1315406, 1639845, 1779818, 1939693, 1708689, 2079154, 1998229, 1884434, 1506430, 1619539, 1850768, 1891477, 1726032, 2176267, 2192085, 1841536, 1845885, 2008688, 2367130, 2118940, 1945764, 2411874, 2071569, 2322604, 2385057, 2633322, 2097086, 2368517, 2493895, 2484999, 2453799, 2410567, 2583575, 2636458, 2300871, 2585627]
16860B585627J02283K06737j42444j2087J11664J67917k90025K83900K2258M5898
16850C081728k3895o3554K54470n8959J5204J5130P1552J39225J0948L62271l42695
16839C461425P1654L64387J27812k94356M34074n3276J36987j84736K04630L55234
16829D623835L9751n0572k98848j7326N13501j30964o1574N20384q6401j14538
16819D937248M73945j01265j9228K77237M77190m78658L45334K53254l9985L45402
16809F470474L2696M4979P7177K77656k05799J78351Q23906J22455j50873Q7083
16799G758105J53033J79368J40146M05281l96088O25826m5632N95124K18970N88444
16789A0222577j07997K66384J34261K99623L38876M33353L66151L33972R2843
$$ y = [2585627, 2687910, 2894647, 2752203, 2740116, 2851780, 3019697, 2729672, 3013572, 3035830, 3081728, 3057833, 2994279, 3248749, 3189790, 3204994, 3220124, 3291676, 3430901, 3441849, 3804120, 3461425, 3533079, 3897466, 4025278, 3730922, 4164996, 4111720, 4248707, 4063971, 4268601, 4623835, 4663586, 4613014, 4314166, 4296840, 4810341, 4679377, 4617803, 5138187, 5051786, 4937248, 5411193, 5309928, 5290700, 5567937, 6045127, 5566469, 5911803, 6165057, 6125072, 6470474, 6503170, 6548149, 6625326, 6902982, 6697183, 6875534, 7699440, 7821895, 7671022, 7758105, 7911138, 8090506, 8230652, 8635933, 8239845, 8865671, 8820039, 9415163, 9634133, 10222577, 10114580, 10380964, 10515225, 10814848, 11153724, 11587077, 11953228, 12287200, 12380043]
16780A2380043M84202N28418N63501j59152R97136N12802L83436M82183N68116
16771A6740685K41610P94514K74963J000140P01260N17780R55632M64983P56312
16762B2447879J603488O30445R96490J037885P09410J484550J301007J307171
16754C1518325J433725J175948J601249J811295J546115K138853J821910K124641
16746D5172061K517629K372508K414719L135589L152784K954283L244461L974728
16738F8938762L661694M463822M245714M619611N370720N297944N299231O173984
16730A08071482O133462O117227O364013O820212O172439O606335O282654N595538
16722A58163362N516424M342932M228859K881551J901793M92619m7010j326976
$$ y = [12380043, 12864245, 13392663, 13956164, 13797012, 14794148, 15306950, 15690386, 16172569, 16740685, 16982295, 17776809, 18051772, 19051912, 19753172, 20270952, 21226584, 21691567, 22447879, 24051367, 24681812, 25678302, 26716187, 27425597, 28910147, 30211154, 31518325, 32952050, 34127998, 35729247, 37540542, 39086657, 41225510, 43047420, 45172061, 47689690, 50062198, 52476917, 55612506, 58765290, 61719573, 64964034, 68938762, 72600456, 77064278, 81309992, 85929603, 91300323, 96598267, 101897498, 108071482, 114204944, 120322171, 126686184, 133506396, 139678835, 146285170, 152567824, 158163362, 163679786, 168022718, 172251577, 175133128, 177034921, 177527540, 177480530, 176153554]
16714A76153554k570657l240734m485840m921640n526732o399428o283106o591614
16706A36133803o533554o652115o084281o821735n838613n753296n488764n721789
16698H7239656m366237n084591l955170m461235l891845l498814l131332l036707
16690E5813725l234387k813470k137904k426609k487283k020130j976975j527193
16682C7189774j963364j318016j918948j095951j527433r68214j438142q64954
16674B6094752j432588n48348j364872q37181q79281n45616q37804o97693n33243
16665A8418126j095825l69676o33153p72898j9783m25341r80985q9559l35507
16656A3695399n50695j76652m88095o60016k5046m95990j70993p06080j47432
$$ y = [176153554, 173582897, 170342163, 165856323, 160934683, 155407951, 149008523, 142725417, 136133803, 129600249, 122948134, 116863853, 110042118, 104203505, 98450209, 92961445, 87239656, 82873419, 77788828, 73833658, 69372423, 65480578, 61981764, 58850432, 55813725, 52579338, 49765868, 47627964, 45201355, 42714072, 40693942, 38716967, 37189774, 35226410, 33908394, 31989446, 30893495, 29366062, 28397848, 26959706, 26094752, 24662164, 24113816, 22748944, 21911763, 21032482, 20486866, 19649062, 18951369, 18418126, 17322301, 16952625, 16319472, 15546574, 15526791, 15101450, 14120465, 14030906, 13695399, 13144704, 12968052, 12479957, 11819941, 11794895, 11298905, 11127912, 10421832, 10274400]
16647A0274400k84427j0383n40527k63982J7272l62815l83650k89170n4547k96798
16637G805373k13749p8178k84628J7464k6325l18340j24385m91695j35010Q2765
16627F233292j81424J05701l86201K02574j20730j49274n14176J54028J4385m82468
16617D875707M2331l13403K606J56892k01257J8909j25766k0563q0606q1210k66532
16606D007108R0422j03668K35665o52269J98383k64629j9993j58346J95315M3517
16596C571505k08544k00576p529j35646J2732K2073J5636j92928J63220k65196
16586B774747Q7741k0683j39869K3792l13631P08429l88506j15622K61471n15794
16576B362075J81947k50116J18878j94172j33968J14639o2334l7659J44649J01176
$$ y = [10274400, 9989973, 9979590, 9439063, 9175081, 9192353, 8829538, 8445888, 8156718, 8102171, 7805373, 7591624, 7513446, 7228818, 7246282, 7219957, 6901617, 6777232, 6285537, 6150527, 6233292, 6051868, 6157569, 5771368, 5973942, 5853212, 5703938, 5189762, 5343790, 5358175, 4875707, 4918038, 4604635, 4607241, 4764133, 4562876, 4581785, 4456019, 4435456, 4354850, 4273640, 4007108, 4097530, 3993862, 4229527, 3577258, 3775641, 3511012, 3491019, 3332673, 3527988, 3571505, 3362961, 3162385, 3154856, 3019210, 3031942, 3054015, 3069651, 2876723, 3039943, 2774747, 2862488, 2841805, 2701936, 2725728, 2412097, 3120526, 2732020, 2616398, 2877869, 2362075, 2544022, 2293906, 2412784, 2218612, 2084644, 2199283, 2136949, 2099290, 2243939, 2345115]
16566B345115k42612J26352j76702R2479k32849l3008R1184n9304l53272K57708
16556A815091n0808K92515q820r6352n9182o8830o3594j62438K39065k04330J70518
16545A802835j01930n2190J68542m58020P7477k68544K62860J41120j05299J05742
16535A572593k47504J55075J81084m15887j09003M30806k0844k98563P5099M8500
16525A371356J17917k44110J50497k85462J2148L32976l69698P9047p5061J9356
16515A108966k4547J09023J84890k47504q6043l6226J38249L9452n5527k73355
16505H57378Q1918P2929J15745j70209j00194o7301J80996J17287K2607m43739
16495F67417L9896M78827j46049J30685l71229J53197n5288n9828L36953j93479
$$ y = [2345115, 2102503, 2228855, 2052153, 2144632, 1911783, 1878775, 1969959, 1910655, 1557383, 1815091, 1764283, 2056798, 2047978, 1951626, 1892444, 1823614, 1760020, 1597582, 1836647, 1632317, 1802835, 1700905, 1648715, 1817257, 1359237, 1436714, 1168170, 1431030, 1572150, 1466851, 1572593, 1325089, 1480164, 1661248, 1245361, 1136358, 1567164, 1546320, 1247757, 1322856, 1371356, 1489273, 1245163, 1395660, 1110198, 1122346, 1455322, 1085624, 1164671, 1089610, 1108966, 1084419, 1193442, 1378332, 1130828, 1044785, 1008559, 1146808, 1186260, 1130733, 857378, 939296, 1012225, 1127970, 957761, 857567, 790266, 971262, 1088549, 1111156, 667417, 707313, 1186140, 1040091, 1170776, 799547, 952744, 897456, 837628, 1174581, 981102]
16485I81102q8151n0880j54048l31994L11846K81408K4186l90319L54849n1950
16475H86049l61307M57980L553j37502M00504m09557j61400R9157j63534o061
16465F07882K88736j07859k31862q9312M14022m06549L61297k505o7457C02115
16454E82185n7773K00693j1385J94836l52413A72899O32674J9472j9888k28001
16444E77156J60816q5058L2769j41371Q2843R655B76529K55247l919j7716L54919
16433H65060q5620J3666l82833Q19114A44237J98833p5097K93311j44438j30777
16423B86069J99389J68804j069j85688k0716J6670p2392O7594L8759o0852j26252
16412C10316K213J61299A52896L23367A06017N77988B56605J99821L001P3633
$$ y = [981102, 892951, 842071, 688023, 356029, 667875, 949283, 973469, 583150, 937999, 886049, 524742, 982722, 986275, 848773, 1249277, 839720, 678320, 777477, 613943, 607882, 896618, 788759, 556897, 467585, 881607, 475058, 836355, 833850, 766393, 302115, 582185, 524412, 725105, 713720, 908556, 556143, 172899, 805573, 825045, 805157, 577156, 737972, 652914, 685683, 544312, 627155, 636810, 276529, 531776, 527857, 510141, 865060, 779440, 793106, 410273, 1229387, 144237, 343070, 267973, 561284, 416846, 286069, 485458, 654262, 653193, 467505, 446789, 463459, 391067, 458661, 497420, 436568, 310316, 312529, 473828, 152896, 476263, 106017, 684005, 256605, 456426, 459427, 533060]
16402E33060j67041k0499K77381j30662k01398K10518j62628R0317j23456P4225
16392C79817n2884p7099J77599J21415K14916l02456A93165J66408J69029k16515
16382C12087m8897A05911J89011J96563N8913Q976j0749B46696P0915K7507J273
16371C46391q5491D5213J03988K0135M01037j85252j08286K1943K30902e7316
16360B02142J24102O2408D9242R2957K26283Q0009n5177A89053J69462D3718O8939
16349A12657M08670j49433J04061j61379C0196M67436G0477M24063F4458J42944
16339B07402a8326A78746R0862K90828B17634P3681j36284J89359D6030J60605
16329B06635N9805K6719a35172B26030K6247K18964m9829A47614D9525K15626
$$ y = [533060, 366019, 345520, 622901, 492239, 290841, 501359, 338731, 429048, 305592, 379817, 326933, 249834, 427433, 548848, 763764, 461308, 193165, 359573, 528602, 312087, 263190, 105911, 294922, 491485, 550398, 559374, 548625, 246696, 317611, 345118, 346391, 260900, 45213, 149201, 169336, 570373, 385121, 276835, 298778, 529680, -57316, 202142, 326244, 388652, 49242, 142199, 368482, 448491, 393314, 189053, 358515, 43718, 112657, 521327, 371894, 475955, 314576, 30196, 497632, 70477, 494540, 64458, 207402, -18326, 178746, 269608, 560436, 217634, 291315, 155031, 344390, 46030, 206635, 266440, 293159, -135172, 226030, 252277, 471241, 421412, 147614, 49525, 265151]
16319B65151q8433N2458j08978K65390j12748c2811n7394A05987l6234R828K31550
16308C11131F8063J99244L16254B25243Q3153G5037d4947o0838B50274A08640
16297F6288J93674q9006G872L47511A57326f896B33607E503J469M6974K81815
16286C35761K70767E576e8558C06955j00641J38171O578j67474C8492b6311B40797
16274d1489A49737J7879M3404N6305j4614C7605J48829C186c5128G9193M88133
16263E67326I6403P6757J13635J83607A39566k8115J39141c0778o0675D12023
16252B21951J66847H5576l4949L18621j16884q7156D1555K1600a02150A21846
16241I6823J93332J967H9620J04958R8067a22886A71315J13330N0691p0725a36023
$$ y = [265151, 176718, 229176, 120198, 385588, 272840, -32811, -90205, 105987, 69753, 79581, 311131, 68063, 267307, 583561, 225243, 308396, 75037, -44947, -105785, 250274, 108640, 66288, 259962, 170956, 7872, 355383, 157326, -6896, 233607, 5503, 6972, 53946, 335761, 606528, 5576, -58558, 306955, 206314, 344485, 351063, 183589, 38492, -26311, 240797, -41489, 149737, 167616, 211020, 267325, 252711, 37605, 186434, 3186, -35128, 79193, 567326, 96403, 173160, 286795, 470402, 139566, 111451, 250592, -30778, -91453, 412023, 221951, 388798, 85576, 50627, 369248, 252364, 165208, 41555, 63155, -102150, 121846, 96823, 290155, 292122, 89620, 194578, 292645, -122886, 171315, 284645, 335336, 264611, -136023]
16229E5218M5544C8767a03476B27094B6705Q9421e2273A46247d402A54428h9887
16217b4330B06643d435H4168i099m3769G5483L7652d7046j41177C88108A39444
16205B58417A06389f2914n6609C3186a54952B40713b05055D7855J16121J07188
16195B71164b04300B02500k6049F1159K99344R9493A66422G2056M3152J88305
16185C03513j36335O6223J60927h9959l3522J8148A51805B2852f0822C37599F7983
16173f3046B5610j2124L41498K5195j47179K65143B5483L09511a05558D02842
16162a86160A42930E2357L4385l3453M8778d3982J3437I8101d7417j2192D7377
16150A39881L42546a14511A75393a6043k49360O4601h6714B21644b29541C64248
$$ y = [55218, 100762, 38767, -103476, 227094, 26705, 116126, -52273, 146247, -4402, 154428, -89887, -24330, 206643, -4435, 84168, -9099, -52868, 75483, 113135, -47046, -188223, 388108, 139444, 258417, 106389, -62914, -119523, 33186, -154952, 240713, -205055, 47855, 163976, 271164, -204300, 202500, 176451, 61159, 360503, 459996, 166422, 72056, 115208, 303513, 167178, 233401, 394328, -89959, -123481, -105333, 151805, 22852, -60822, 337599, 67983, -63046, 25610, 13486, 354984, 380179, 233000, 498143, 25483, 334994, -105558, 402842, -186160, 142930, 52357, 86742, 53289, 102067, -43982, -30545, 98101, -47417, -59609, 47377, 139881, 482427, -114511, 175393, -16043, -265403, -200802, -86714, 221644, -229541, 364248]
16139B96795b6574A7555J15732E0480e7452B0896J08692R0226g6666D0022K77321
16128C17343j15694D5807d9915A48550a13549F1753b36303I0652a41235j27361
16118b68596A48197a36775A86506P5201E6014h6219J2859c4223n8232L0738b6035
16106g9954q3318A00550b02186A30366P5222a26798B03290g8384B21638D125N235
16095I360Q5432C8410J75236a45801H2346c36981a27227R722E0592r74J2043Q6356
16083A48017A6664J31043l4400i527A11348J07786f8868F5248k5883a39475G6095
16071A47961f9570A56013F5871a76518A06738d3870j99478H5914Q382A3563a62630
16059i0231j57309C64108f0097k0734H76J7314b12595F7197a01484j05521L3337
$$ y = [296795, -26574, 17555, 133287, 50480, -57452, 20896, 129588, 219814, -76666, 40022, 317343, 201649, 45807, -49915, 148550, -113549, 61753, -236303, 90652, -141235, -268596, 148197, -136775, 186506, 261707, 56014, -86219, -73360, -34223, -92455, -61717, -26035, -79954, -163272, 100550, -202186, 130366, 205588, -126798, 203290, -78384, 221638, 4125, 9360, 94792, 38410, 213646, -145801, 82346, -336981, -127227, -117505, 50592, 49618, 61661, 148017, 16664, 147707, 113307, -9527, 111348, 219134, -68868, 65248, 39365, -139475, 76095, 147961, -69570, 156013, 65871, -176518, 106738, -43870, -243348, 85914, 94296, 13563, -162630, -90231, -247540, 364108, -60097, -80831, 876, 18190, -212595, 67197, -101484, -207005, -173668]
16048a73668j76829B7780J25730R822J37516g622q6021a0792j88927K1748g911
16036B0080J98259K4851j7128H0470i375A87975i1596l4899A73671O670a04078
16024A49487g5007j58311d5591m920B8124g4458C4368c4850n9061b0928l42350
16013c63278A79161g2290k8647n8968c5612A72093d8315A51004k860C4859c40201
16001H5664K2544m6301K03131d14731I2910a81433d6457j28898m478d5069C3942
15989b80159j1075K3538A43016i550B64938d0376j92553C35459j06089J29714
15979C59084J9391j50706I3974b71762F0276a41968C03739f5700C36537b72414
15968g9246h522E9956O9582b53314a15114j84890A62592J11226j23862e68472
$$ y = [-173668, -350497, 27780, 153510, 163332, 300848, -7622, -93643, -10792, -199719, -177971, -7911, 20080, 218339, 243190, 226062, 80470, -9375, 187975, -91596, -126495, 173671, 180341, -104078, 149487, -75007, -233318, -45591, -50511, 28124, -74458, 34368, -34850, -93911, -20928, -363278, 179161, -72290, -100937, -159905, -35612, 172093, -48315, 151004, 148144, 34859, -340201, 85664, 108208, 61907, 265038, -414731, 92910, -181433, -46457, -175355, -179833, -45069, 33942, -280159, -291234, -267696, 143016, -9550, 264938, -40376, -232929, 335459, 229370, 359084, 378475, 227769, 93974, -271762, 60276, -141968, 303739, -65700, 336537, -272414, -79246, -8522, 59956, 129538, -253314, -115114, -300004, 162592, 273818, 149956, -568472]
15957C12809a78101H8047g2788B06774i3470k3076k7373k72097D394R9877d53788
15945H3470j5915M7681a31618A45461d7671C5113a21813k4346N7259j29964M6388
15934a72476l074d8977j40859i3210n4999D7439a92360l37132H2472J23489L8658
15923B44619F657d7153k99234C11652b24271C21634D2951h4771D950J8375K4246
15912D7571J85403D1967B585b09337N2886D5377J77879E1977a12622A80453q6646
15901I3807M7323a08582A76633d0065a6015q3929b1596j50387l1844Q2472o1599
15890a82954D300K57740h2330E4779M0324K75482d9354q5778f7442A39932F4072
15878c0949j85797A14954K6611c794C68279a13438N1907j0092H0335h6651j70388
$$ y = [312809, -178101, 88047, -72788, 206774, -93470, -116546, -143919, -416016, 4394, 104271, -453788, 83470, 67555, 115236, -131618, 145461, -47671, 35113, -121813, -146159, -88900, -218864, -172476, -175550, -48977, -189836, -93210, -148209, 47439, -192360, -529492, 82472, 205961, 244619, 6657, -47153, -346387, 311652, -224271, 321634, 42951, -84771, 4950, 23325, 47571, 232974, 41967, 2585, -209337, -156451, 45377, 223256, 51977, -112622, 180453, 93807, 141130, -108582, 176633, -40065, -16015, -99944, -21596, -171983, -203827, -121355, -182954, 4300, 262040, -82330, 54779, 95103, 370585, -49354, -135132, -67442, 139932, 64072, -30949, -216746, 114954, 141565, -3794, 368279, -113438, -61531, -71623, 80335, -86651, -257039]
15867b57039L1920A07538a11501G7814L85511d6976I2949a87868B20367n069b6605
15855c8058C31483g4277E9534O697f935k38903a11335B2761P6732b34781Q5946
15844a48835E0334R7338a77602e8232a2884B46728c34094h2302A84402P5574o9476
15833A90500B5989a0673o1133j1310J9107c816B55541h1673H7711L8359a19555
15821A30590b54034R0244A1183a7598j48900A69188G2906b3932l19838J65965
15811a77805c7697p1549M1130B26456b4814n1083C77069b43350c6899n6370j31739
15800b25008B02239a47938A34325a90145H5321d28826a55410F5997i4985c0076
15789A63047B9698a58514k55082a83990A41735G172b92404a4764r2666m5917j41216
$$ y = [-257039, -225119, 107538, -111501, 77814, 463325, -46976, 92949, -187868, 220367, 215298, -26605, -38058, 331483, -74277, 59534, 66231, -6935, -245838, -111335, 22761, 99493, -234781, -148835, 50334, 147672, -177602, -58232, -12884, 246728, -334094, -82302, 184402, 259976, 190500, 25989, -10673, -71806, -83116, -64009, -3816, 255541, -81673, 87711, 126070, -119555, 130590, -254034, -163790, 11183, -17598, -166498, 169188, 72906, -23932, -343770, -177805, -37697, -109246, -68116, 226456, -24814, -75897, 377069, -243350, -36899, -93269, -225008, 202239, -147938, 134325, -190145, 85321, -428826, -155410, 65997, -94985, -30076, 163047, 29698, -158514, -413596, -183990, 141735, 7172, -292404, -14764, -107430, -153347, -294563]
15778b94563K5603d8388j47835C79848Q958A56203a75163H9879L02918a79832
15767A30699b4754q8465N3631a3811m564k42935B56366d4527j01934I3232J95913
15756B89145a54813j9372A67724f3125A79043p7185e5578B0571a13725c8612A12035
15744B0829J36752m8110f8906I6487C3531J9436h5037G5775b40679M2451A93287
15732d8201j27003j12876E0865Q6079b27930A42479b42197j02707g0799C745N1951
15721E5696c41817e7757r0950e3393D4914g2831p4278A54534F9475a00259G9877
15709c4487m7606A11885l9167b5007l9997k08311J34584C4135J80013fp3802A18505
15696B64351g8353B00905D7401R3463m585a94494A135Q7929a21865A48358g8367
$$ y = [-294563, -268960, -48388, -196223, 379848, 388806, 156203, -175163, 89879, 392797, -179832, 130699, -24754, -113219, -59588, -13811, -18375, -261310, 256366, -44527, -146461, 93232, 289145, -154813, -174185, 167724, -63125, 179043, 101858, -55578, 20571, -113725, -38612, 112035, 20829, 157581, 109471, -68906, 96487, 33531, 52967, -85037, 75775, -240679, -198228, 193287, -48201, -175204, -288080, 50865, 136944, -227930, 142479, -242197, -344904, -70799, 3745, 55696, -341817, -57757, -148707, -53393, 44914, -72831, -147109, 154534, 69475, -100259, 79877, -34487, -82093, 111885, 72718, -25007, -65004, -273315, -138731, 34135, 214148, -6, -73808, 118505, 264351, -78353, 200905, 47401, 140864, 136279, -194494, 1135, 89064, -121865, 148358, -78367]
15684a91411B94170j30699E9054J01524R5075f1928k27089J04393C14509A37529
15673b06638P3569D50846B11340b93063l8273q9681H6664d7558A76910F7027j4667
15662E2360a88051n467R6451I6548a97227h2495j21192M6977D34368F7148J26132
15651A93280b81723b3325j52594Q1995D7607L24082a08354l61518B00281e341
15640C9289j1409d72497a99134f5924p5967F6622a23246I1678j0355b7196B98802
15628b168j20787A25139a93911f5889j95318e7031C8410a1177F4052b6354A10187
15616b19957n8720H4493a36323F1381K8826J3000c05264o5835a14129c5611I2230
15604a95158Q8888C3425a49407D7805h8154l02082a34834o0630K1018B28658i8203
$$ y = [-191411, 294170, 163471, 59054, 160578, 255653, -61928, -289017, -184624, 314509, 137529, -206638, -133069, 450846, 211340, -293063, -331336, -421017, 86664, -47558, 176910, 67027, 52360, -188051, -193518, -97067, 96548, -197227, -82495, -203687, -156710, 434368, 67148, 193280, -281723, -23325, -175919, -93924, 47607, 371689, -108354, -469872, 200281, -5341, 39289, 27880, -472497, -199134, -65924, -141891, 66622, -123246, 91678, 81323, -27196, 298802, -2168, -122955, 125139, -193911, -65889, -261207, -57031, 38410, -11177, 64052, -26354, 110187, -219957, -278677, 84493, -136323, 61381, 90207, 103207, -305264, -371099, -114129, -35611, 92230, -195158, -106270, 33425, -149407, 47805, -88154, -390236, -134834, -195464, -174446, 228658, -98203]
15592a10949k68333C6305K47567a50670N4770F459J61128L8635O1283a33689B6018
15580A0186a88787E5317A9911R139a51169D59852r787A15343a4429G9586b88650
15568C6163a66621L8449c9237j15335B2206P4080g268A7623J54398J89969A758
15556a2139A13835m6179M5515a02095A41145a0520A11731a97836f23B24998h4129
15544A58141h5786k69981J59819I9588D9078K83559e8780A68276J56336n0499
15534B74113a39939k3803M0630A10567a69403j75472B06421p1972N6223B2783
15523a30353G8402l0914b31851A09477a17472A57226j090o4801g0216m1734J4584
15512i7366C25265a67801N1629L3756c6234A69527a00763k22801A95952a22222
$$ y = [-110949, -379282, 36305, 283872, -150670, -95900, 6459, 167587, 206222, 267505, -133689, 26018, 10186, -188787, 55317, 19911, 29050, -151169, 459852, 450065, 115343, -14429, 79586, -288650, 36163, -166621, -128172, -39237, -154572, 22206, 96286, -7268, 17623, 172021, 361990, 1758, -12139, 113835, 67656, 113171, -102095, 141145, -10520, 111731, -197836, -623, 224998, -84129, 158141, -85786, -355767, -195948, 99588, 49078, 332637, -58780, 168276, 324612, 274113, -139939, -163742, -123112, 110567, -169403, -344875, 206421, 134449, 190672, 22783, -130353, 78402, 47488, -231851, 109477, -117472, 157226, 156136, 91335, -70216, -111950, -97366, 325265, -167801, -116172, -82416, -36234, 169527, -100763, -323564, 195952, -122222]
15501A335J2189b33941a14948A60155a31224M3269A20953J03349h8258J1216l02046
15490c79088E2692j9953h5015b5038r8044A12890b61162Q7236a594A87810a96530
15478h6869A04752L09873a00000B9578b10389I6689c97645c3144q8059H0412E781
15466E69081c96683A03018B5239J5615J14478a72279A73795b44392N5296e9845
15455a89805M5188n8151f8165C46124B823b41347A34214g6232C065c69658i3156
15443A60040c21274r0333h735E6204a51384C95497b48316F16073A86008K4816
15433B10824b38082I2372J23188C7909l365L16452A1981K36235j04008n9545J18307
15422B02970A8706J96882F0535Q3815D395a50520G553J4090L9586a31347j9773
$$ y = [1335, 13524, -233941, -114948, 160155, -131224, -87955, 120953, 224302, -88258, -77042, -379088, 52692, 32739, -85015, -25038, -123082, 112890, -261162, -173926, -1594, 187810, -196530, -86869, 104752, 414625, -100000, 29578, -210389, 96689, -397645, -33144, -121203, 80412, 5781, 569081, -396683, 103018, 25239, 40854, 155332, -172279, 173795, -244392, -189096, -59845, -189805, -144617, -202768, -68165, 346124, 2823, -241347, 134214, -76232, 3065, -369658, -93156, 160040, -321274, -411607, -8735, 56204, -151384, 395497, -248316, 616073, 186008, 210824, -238082, 92372, 215560, 37909, 34544, 350996, 11981, 248216, 144208, 84663, 202970, 18706, 215588, 60535, 144350, 4395, -150520, 7553, 21643, 61229, -131347, -151120]
15411a51120A54407K06212A67539l1459c3792j01130L0185A28414a26100I0965
15400a34952f4536j36155B63342a23647k7852K0407N8108A65602G5621a96318
15389B6301J07146m0441a49171B25294j01461r785b70213J30267J5464l6127j00574
15378b61183C24378B3086N9234d1367F7392b48726H7105c0385G3986B9281Q6493
15367A15774b41896n6796H4624a76597q905B85812H7143b94999g3259j39368G7776
15355e5385A91053e9107k75657B8693J53353A5646L18019C9934c21958a21849
15344d2213n0398a7377j50926L449E0389M8297C7079a23349D1436N6879b05285
15332b83706R3789g1316C0491O1542h4912p5264C6449d5908F8716j101K894a46060
$$ y = [-151120, 154407, 360619, 167539, 136080, -33792, -134922, -104737, 128414, -126100, 90965, -134952, -64536, -200691, 263342, -123647, -151499, -131092, -72984, 165602, 75621, -196318, 26301, 133447, 93006, -149171, 225294, 123833, 114048, -270213, -139946, -124482, -160609, -261183, 324378, 23086, 82320, -41367, 67392, -248726, 87105, -30385, 73986, 29281, 115774, -241896, -298692, 84624, -176597, -185502, 285812, 87143, -294999, -73259, -212627, 77776, -55385, 191053, -59107, -334764, 28693, 182046, 15646, 333665, 39934, -321958, -121849, -42213, -92611, -17377, -168303, -164854, 50389, 98686, 37079, -123349, 41436, 98315, -205285, -283706, -189917, -71316, 30491, 92033, -84912, -160176, 36449, -45908, 68716, 67615, 70509, -146060]
15319a20747j8895d1395l7241a1683j0635r1123M5582n3649N5099C75798E0788
15307c27900A78605G3752N7562g9712J2971J6476l80152K14004N3028A87419E8123
15295G2087B433J60568a53158f5661C35268a52045f1350k14717i4893b7226j02494
15284a29720j00923H5709B9262J40714D4623Q6728a55163B7737O221J72045K02656
15273D08659B0150a28125A33170J97491j1413c702n6908E5084c35299D45562j80440
15262B65122M0312j22975q7554h7613A54286b26244A02769N3715b04726A1434
15251D4503Q0174L29375k13214L80380N35973O99333q09809N74891F33723B92954
15240b3838C296O4669M32797F4457J7674a94431C00860a44071A50785l0734j5798
$$ y = [-120747, -139642, -41395, -78636, -11683, -22318, -113441, -67859, -121508, -66409, 375798, 50788, -327900, 178605, 73752, 131314, -79712, -66741, -50265, -430417, -216413, -163385, 187419, 58123, 72087, 2433, 163001, -153158, -65661, 335268, -152045, -61350, -276067, -94893, -27226, -129720, -230643, 85709, 29262, 169976, 44623, 131351, -155163, 27737, 33958, 206003, 408659, 20150, -128125, 133170, 330661, 319248, -3702, -60610, 55084, -335299, 445562, 265122, 305434, 182459, 94905, -87613, 154286, -226244, 102769, 156484, -204726, 11434, 44503, 124677, 454052, 240838, 621218, 1157191, 1856524, 1046715, 1621606, 633723, 292954, -23838, 3296, 67965, 500762, 64457, 82131, -194431, 300860, -144071, 150785, 120051, 104253]
15229A04253b49146a7056B84766a24530e685j74058A29295K17788p0300d8595
15218b86662H491N62076B69781B75a90427A8670a45242p6580a6572A14980m2961
15207G2019k905a42113G9880c0017A75762p1081k7816l4466a92708a7379A71729
15195a4510N381G1496j6738a39833j55476g8176p5982E0053i1017B32617a6059
15183C19998B3713J5337Q7368b3832D9794a92931d418n4717A70311a7819B29004
15171F1723K02110I6450J10772b94737C18180F3509F77M1006a24469J851B00043
15159a80021q9804B65331h5658B0054b4501A99191E6222O2800J30841j11999B1419
15147b86513A50606K33384f6098C9789J22858p5033F021J7145J60896K12815A24500
$$ y = [104253, -249146, -17056, 284766, -124530, -5685, -179743, 129295, 347083, 276783, -48595, -286662, 8491, 570567, 269781, 275, -190427, 18670, -145242, -221822, -16572, 114980, 72019, 69114, -142113, 79880, -30017, 175762, 104681, 76865, 42399, -192708, -17379, 171729, -14510, -9129, 71496, 54758, -139833, -295309, -78176, -154158, 50053, -91017, 232617, -16059, 319998, 23713, 39050, 126418, -23832, 49794, -192931, -4418, -59135, 170311, -17819, 229004, 61723, 263833, 96450, 207222, -294737, 318180, 63509, 677, 41683, -124469, -122618, 200043, -180021, -269825, 265331, -85658, 20054, -24501, 199191, 56222, 119022, 249863, 137864, 21419, -286513, 150606, 383990, -66098, 39789, 162647, 87614, 6021, 23166, 184062, 396877, 124500]
15135C6859n845g8155C69291b35169a5192I6374C5671J83458j1405p7708R9299
15124B29315b11416E2212j9479b51984C28119f807A08484M7080M768O797a36636
15112A54221P8849q7562J7311H1136f6547B56645L4077A36754f9634L3483F8402
15100A89005B7026M6461l6524a7897C84637h8068K4468A5192N6772C4174c2986
15088E5188f0053K2928C90442A44199F0649R88J20062h8730B75238b21901A20207
15076a65709A08744i6898C71515A15503J58953N6994J01084d5396k260A67907
15065B42489a93738e7866C02293N8131K972b15299D42184B1699R1O2570A205b94209
15052b5029B7657K12190p9794M0101m7974F6180J95337d475p5158J1753H8513
$$ y = [36859, 31014, -78155, 369291, -235169, -15192, 96374, 35671, 219129, 207724, 130016, 229315, -211416, 52212, 32733, -251984, 328119, -6807, 108484, 155564, 160332, 167129, -136636, 154221, 233070, 145508, 162819, 81136, -66547, 256645, 290722, 136754, -69634, -36151, 68402, 189005, 27026, 73487, 36963, -17897, 384637, -88068, -63600, 15192, 71964, 34174, -32986, 55188, -60053, -37125, 390442, 144199, 60649, 61637, 181699, -88730, 275238, -221901, 120207, -165709, 108744, -96898, 371515, 115503, 274456, 331450, 432534, -45396, -47656, 167907, 242489, -193738, -57866, 302293, 360424, 363396, -215299, 442184, 21699, 21790, 84360, 1205, -294209, -25029, 27657, 239847, 160053, 200154, 152180, 66180, 261517, -4475, -79633, -67880, 88513]
15040B88122o2035a91137H9263C7888j8534b2621B17823J23603O3657A34703L0188
15029A64891a02402A0465J99180b8370C54926A70173Q2252A07763k9919J00265
15019A78109L9134J10510F7944L0400K21300G5168K47822j15986J49369j75254
15009A81119K850j8014B1154K16962J62557j78633R1294h0967L0053A73125Q4973
14998B58098r2912q728D4900a50208g2529C01837m1859A29123a07038D99470q3278
14987D16192A85186J16057A34173n7127J58843R7450b0309C62092r5035g7684
14976D63172B15730A04098J28218N2785m0208J74054p6901o2469K41542o3902
14966D57217E6528j0574g826B41483J59880A35572a51214A22694n6656L17729
$$ y = [288122, 226087, -191137, 89263, 37888, 19354, -22621, 217823, 341426, 405083, 134703, 164891, -102402, 10465, 209645, -28370, 354926, 170173, 252425, 107763, 77844, 178109, 217243, 327753, 67944, 98344, 319644, 75168, 322990, 207004, 356373, 181119, 183969, 165955, 21154, 238116, 400673, 222040, 313334, -80967, -50914, 173125, 258098, 165186, 156458, 44900, -150208, -72529, 301837, 259978, 129123, -107038, 499470, 416192, 185186, 301243, 134173, 77046, 235889, 333339, -20309, 362092, 267057, -77684, 463172, 215730, 104098, 232316, 285101, 244893, 418947, 342046, 279577, 521119, 457217, 56528, 45954, -7826, 241483, 401363, 135572, -151214, 122694, 66038, 383767]
14956C83767C4955L12370P6981E4897O1641N4436J22621D8267J67538R2944j16411
14945A92338G9644K10899K132A07038L7710C4792K75443j18428J61073d7900C38678
14933D76342F0022J62474J14764j58403J76667A66028d6897C14353O428A06009
14922I6134M5884M73242A70883Q4061R8777j55625a53693F50739B6317P8885L1949
14911A37151N74926l39568F9605M4894A1062K19057J59102J62390k38958r6861
14901B15792J21909p2598O7320J5608E7764M91163q7213p4992J70465H4063L29273
14890D13336J51733k23783J38546q6218j94709K00178a5862A93665J52961J78478
14880E25104d6797C86703D304J99959J79453J70667j96480N2352j28901J04154
$$ y = [383767, 34955, 347325, 424306, 54897, 116538, 170974, 293595, 48267, 215805, 308749, 192338, 79644, 290543, 292675, 107038, 144748, 34792, 310235, 191807, 352880, -47900, 338678, 476342, 60022, 222496, 337260, 178857, 355524, 166028, -46897, 314353, 320781, 106009, 96134, 142018, 615260, 170883, 254944, 353721, 198096, -153693, 650739, 26317, 105202, 137151, 712077, 372509, 69605, 114499, 11062, 230119, 389221, 551611, 312653, 215792, 337701, 265103, 332423, 348031, 57764, 548927, 461714, 386722, 557187, 84063, 413336, 565069, 341286, 479832, 393614, 198905, 399083, -15862, 193665, 346626, 525104, -46797, 386703, 4304, 204263, 383716, 554383, 357903, 410255, 281354, 385508]
14870C85508R3204j87083P55e6123A29621K70552f5186C30065A17895m0615J81491
14859B58771P256J14245q519K13081m0163G9362L41499m0276M9775j25343J91744
14848D96761A57286M84155k80908n3629A27766l444J84151K03595r8983A57490
14837C78881J10474p9850M30105l90893j29455b4043C36329J61715J01493M0495
14827F40032B65310J19942O7310k18038r3350M02967k11113L15570j02632p5227
14817D70739J9346K02201k29119J33548j62171P9744j6991q3953J66408j09092
14807D70660r5585M23352B49295K69193j09669j0366L9911J18351K64691l35370
14797D86036J21712B26031J90922N6136j08935O9194J60202A37059K27455M9633
$$ y = [385508, 478712, 291629, 292384, -56123, 129621, 400173, -65186, 330065, 117895, 77280, 258771, 266027, 380272, 371753, 584834, 544671, 79362, 420861, 380585, 430360, 305017, 496761, 157286, 641441, 360533, 306904, 127766, 124322, 308473, 512068, 413085, 157490, 378881, 489355, 409505, 839610, 448717, 319262, -24043, 336329, 498044, 599537, 640032, 265310, 385252, 452562, 234524, 141174, 544141, 333028, 648598, 545966, 470739, 490085, 692286, 463167, 596715, 434544, 514288, 497297, 413344, 579752, 470660, 375075, 798427, 249295, 518488, 408819, 398453, 438364, 556715, 821406, 486036, 607748, 226031, 416953, 473089, 364154, 433348, 593550, 137059, 364514, 414147]
14787D14147J79682m4880p9473j1964P3861j13615L01874l14869J68972B71470
14776D16873J35375J68427l28528M8788J85290m53K50314l16304j52966R1318
14766D98134o2769J63554K32556l01257j10621J26963L06380k06265j62949J22123
14756F05849k28510L47130K1948k31710K27530j22846O5733j78271k27014M48582
14746G28421k21700K3832L56975l87812K67240l00862J34629j77287J82863n5076
14736E51223B41891l6586M66473O0459C62798O27161B45958N06949k05309j62869
14726C84729J873J71815j70862K18506L2826q9789L5040K75942k66209J31780
14716G25651k17754M84629C83243L90502k64682N32230m50273P0321j5552J82358
$$ y = [414147, 593829, 548949, 469476, 457512, 531373, 417758, 719632, 404763, 573735, 271470, 416873, 552248, 720675, 392147, 440935, 626225, 625772, 876086, 559782, 406816, 498134, 435365, 598919, 831475, 530218, 419597, 546560, 852940, 646675, 483726, 605849, 377339, 724469, 746417, 514707, 742237, 619391, 685124, 506853, 279839, 728421, 506721, 530553, 887528, 499716, 766956, 466094, 600723, 423436, 606299, 551223, 241891, 205305, 671778, 732237, 362798, 989959, 245958, 752907, 547598, 384729, 386602, 558417, 387555, 606061, 638887, 549098, 584138, 860080, 593871, 725651, 507897, 992526, 383243, 773745, 509063, 1041293, 591020, 661341, 645789, 828147]
14706H28147j91255J62067p2764L20729k18797C75852N24793k77401j35479N1843
14696E39608L56558j67470L71824m54790K57729j75504k3352p7508O77629E42910
14685F22736J10386L811J50056J03049l59753L63879l23232K58624j01978M46
14675H28024J13552k68549K5519L7901K59851n2164q5462K19146n182K2288k26135
14664H68789J80744j89665n891K07061l65686L08296k82035N06681k57724K42824
14654A213394l39330P8123j3532N1433r2513j1551J13893J99930m67795L97527
14644A129579j41350K16307P9140j1265M80322n40846m05459L48821j09453K94222
14634A340018J00220k94037k16881J87178N1673K52354j21054k42495K87664m82881
$$ y = [828147, 636892, 798959, 726195, 1046924, 828127, 375852, 900645, 623244, 487765, 539608, 896166, 728696, 1100520, 645730, 903459, 727955, 704603, 627095, 1304724, 542910, 622736, 733122, 736933, 886989, 990038, 630285, 994164, 670932, 929556, 827578, 828024, 941576, 673027, 698546, 736447, 996298, 944134, 858672, 1077818, 1072636, 1094924, 868789, 1049533, 859868, 853977, 1061038, 695352, 1003648, 721613, 1228294, 970570, 1213394, 874064, 952187, 938655, 990088, 897575, 886024, 999917, 1199847, 732052, 1129579, 988229, 1204536, 1283676, 1272411, 1752733, 1211887, 806428, 1155249, 1045796, 1340018, 1440238, 1146201, 929320, 1116498, 1168171, 1420525, 1299471, 1056976, 1344640, 861759]
14624H61759q179M58752k73453l0545K99729j21438J35301j34094P984J07823
14614A303639o0929K15843k01059k56397K40293o01K33567j72649j65343M16865
14604A553229r7170o564K30281l20247N9794j15549J66814Q9327l34814M36115
14594A661216l37864K60061J15358L8667l00696J30300k22165L04599J41404j26384
14584A664496J57810m05182M17612m69365M19840j93120J28256r206K66448l99013
14574A578576N12943j76303j60384J1044K85683J12464n932J61537l60377L14791
14564B274042j26616j80372L09862N8716K7971J72677l38267O06496k39766L64814
14554B929557K59601R8439L63159P95127J105861J844352K983294Q257272J7771482
$$ y = [861759, 853580, 1312332, 1038879, 1008334, 1308063, 1186625, 1321926, 1187832, 1195816, 1303639, 1242710, 1458553, 1257494, 1001097, 1241390, 1240789, 1474356, 1301707, 1136364, 1553229, 1456059, 1449495, 1679776, 1359529, 1419323, 1303774, 1470588, 1559915, 1225101, 1661216, 1323352, 1583413, 1698771, 1737438, 1436742, 1567042, 1344877, 1649476, 1790880, 1664496, 1822306, 1417124, 1834736, 1365371, 1785211, 1592091, 1720347, 1711141, 1977589, 1578576, 2091519, 1915216, 1754832, 1765876, 2051559, 2164023, 2158091, 2319628, 1959251, 2274042, 2147426, 1967054, 2276916, 2335632, 2363603, 2536280, 2198013, 2804509, 2564743, 2929557, 3189158, 3287597, 3650756, 4445883, 5551744, 7396096, 10379390, 18636662, 36408144]
14545C6408144J1575304B1502577I240541m087233B548735n53248l43092k29036
14537A423359J81205K61028j94952o2848K9310L30637n0972o6135K18256k93399
14527A775489K54499n3139k80095N79021L03437k76714J21681j43197R8796j85277
14517B194501K28641m02814K60363L5943J82845L80692n29911K9873J325j53413
14507B228045J56655J95656K8090M87954k74191k70000K42291k03964k03639N6159
14497B443056K44294K18121J35872J14887o3246l53777M13502K44281n3661J50063
14487C493392j81976o9537k10035K83922k45381M48854l12947N13137k56432j23736
14477C339261J64821J59301l200R0573J6372R361K87537Q874k58969J68333j5838
$$ y = [36408144, 47983448, 21502577, 9240541, 5153308, 2548735, 1995487, 1652395, 1423359, 1604564, 1865592, 1670640, 1607792, 1637102, 1967739, 1916767, 1850632, 2068888, 1775489, 2029988, 1976849, 1696754, 2275775, 2579212, 2302498, 2424179, 2280982, 2379778, 2194501, 2423142, 2020328, 2280691, 2316634, 2499479, 2880171, 2350260, 2380133, 2381458, 2228045, 2384700, 2580356, 2608446, 3096400, 2822209, 2552209, 2794500, 2590536, 2386897, 2443056, 2687350, 2905471, 3041343, 3156230, 3092984, 2739207, 3152709, 3396990, 3343329, 3493392, 3311416, 3241879, 3031844, 3315766, 3070385, 3519239, 3206292, 3719429, 3462997, 3339261, 3504082, 3663383, 3660183, 3750756, 3767128, 3776489, 4064026, 4072900, 3813931, 3982264, 3966426]
14466C966426K01304k0714p0950J29462K6237k12830J88034j03747K43058J46408
14456D492688l23105K59745J76656J64183J2887J75747m72908R5750L82292L15343
14446E279278m06786m1664M38495n9936J34061l09514K31096K66320j92767J66839
14436E505422M08869j57569M8523j22350Q5590L94608J37511k28047J35715P4823
14426F283095L97294j21885p8692L22936K29397l40021K64801J99632K38675k8313
14416G366919M51436l89694L73536J3684O8798L18574j41366M50489k62590K50884
14406H500670M10796r2717p4269L78790J72469J31022L52852m3434L45659J51909
14396A0233747J85933l37496N03770K52172o8467M88146L29177k27138M45688
$$ y = [3966426, 4167730, 4147016, 4076066, 4205528, 4231765, 4018935, 4206969, 4103222, 4346280, 4492688, 4169583, 4429328, 4605984, 4770167, 4783054, 4958801, 4485893, 4581643, 4963935, 5279278, 4872492, 4830828, 5269323, 5209387, 5343448, 5033934, 5265030, 5531350, 5338583, 5505422, 5914291, 5756722, 5805245, 5682895, 5768485, 6163093, 6300604, 6072557, 6208272, 6283095, 6680389, 6558504, 6479812, 6802748, 7032145, 6692124, 6956925, 7156557, 7395232, 7366919, 7818355, 7428661, 7802197, 7815881, 7884679, 8203253, 8061887, 8512376, 8249786, 8500670, 8911466, 8818749, 8744480, 9123270, 9295739, 9426761, 9779613, 9736179, 10081838, 10233747, 10419680, 10082184, 10585954, 10838126, 10769659, 11257805, 11586982, 11359844, 11805532]
14387A1805532M3401L58735J07857q705K75139L19640L48514j7475O06685K58036
14377A4097359K29190J53443r0426N27082K85322K12144M67649J8241O01101K05564
14367A6706669P14208P6496L38852P63204Q9300L04387Q70197J82951K48043N66305
14357B0860612N82845O37027L32503M62140M60823P89379N69409O22123M74163
14348B5791024N64450P03352N61151N62869N60647J259062O40476J001564R12523
14339C2557118P37552O70300J448342R17260J341847K44946J478201J478677R57693
14330D1831936J623059J419099J585227J227211J649988J398042J932672J993492
14322E4660726J624790K124146K149479K392684J997874K667998K744386K616745
$$ y = [11805532, 11848933, 12207668, 12315525, 12306820, 12581959, 12901599, 13250113, 13232638, 13839323, 14097359, 14326549, 14479992, 14389566, 14916648, 15201970, 15414114, 15881763, 15900004, 16501105, 16706669, 17420877, 17497373, 17836225, 18599429, 18688729, 18993116, 19863313, 20046264, 20294307, 20860612, 21443457, 22080484, 22412987, 22875127, 23335950, 24125329, 24694738, 25316861, 25791024, 26355474, 27058826, 27619977, 28182846, 28743493, 30002555, 30643031, 31644595, 32557118, 33294670, 33964970, 35413312, 36330572, 37672419, 37917365, 39395566, 40874243, 41831936, 43454995, 44874094, 46459321, 47686532, 49336520, 50734562, 52667234, 54660726, 56285516, 58409662, 60559141, 62951825, 64949699, 67617697, 70362083, 72978828]
14314G2978828K800766K977194L321052L301161L698291L801400L983252M433195
14306A01295139M348254M934914M831726N709711N673979O024277O697453O688356
14298A46203809P797904P805192Q194697Q970410R789571R363504J1275888J1213155
14290B20614130J2067757J2940061J3119694J3839655J4454094J5071337J5632532
14283C17739260J5909614J6207511J5988530J6138323J5409449J4790723J4011772
14276D26195182J2186126J0044145N373733L510761K083913j039180J15379j466833
14268D57003226j965500l732358r126534j1122862j3093672j4057539j5065373
14261C88839388j6320607j6379271j6289478j6065340j6067807j5650754j4878687
$$ y = [72978828, 75779594, 78756788, 82077840, 85379001, 89077292, 92878692, 96861944, 101295139, 105643393, 110578307, 115410033, 121119744, 126793723, 132818000, 139515453, 146203809, 154001713, 161806905, 170001602, 178972012, 188761583, 198125087, 209400975, 220614130, 232681887, 245621948, 258741642, 272581297, 287035391, 302106728, 317739260, 333648874, 349856385, 365844915, 381983238, 397392687, 412183410, 426195182, 438381308, 448425453, 453799186, 457309947, 459393860, 458354680, 458470059, 457003226, 455037726, 451305368, 442178834, 431055972, 417962300, 403904761, 388839388, 372518781, 356139510, 339850032, 323784692, 307716885, 292066131, 277187444]
14254B77187444j4196760j2531785j3540404j2164976j2016589j0811422j0418907
14247A91506601r776633r390394q494967p575462p765840p147923o912557o172360
14239A28270465o150668n081648n023805n057353m722852m931871l730594l727926
14231H9843748l407944l530034l512898l402746k895036k543186k725512k658724
14223F5167668k408408k102547k039941j962683j905092j824521j929678j372587
14215D9622211j954384j275761r70425j615688j618570j152242j308891r73395
14207C8752855n87519q07418j359202j444547r43086n41559q20876q40307o95722
14198C0712619j329156p27451n57002n77186r18804j18090j147267k19577j185210
$$ y = [277187444, 262990684, 250458899, 236918495, 224753519, 212736930, 201925508, 191506601, 181729968, 172339574, 163844607, 156269145, 148503305, 141355382, 134442825, 128270465, 122119797, 117038149, 112014344, 106956991, 102234139, 97302268, 93571674, 89843748, 86435804, 82905770, 79392872, 75990126, 73095090, 70551904, 67826392, 65167668, 62759260, 60656713, 58616772, 56654089, 54748997, 52924476, 50994798, 49622211, 47667827, 46392066, 45421641, 43805953, 42187383, 41035141, 39726250, 38752855, 38165336, 37357918, 35998716, 34554169, 33611083, 33069524, 32248648, 31408341, 30712619, 29383463, 28656012, 28099010, 27521824, 26603020, 26484930, 25337663, 25118086, 23932876]
14189B3932876m08179o74820n67167m3506o30953n50527p92433N381o52861l33220
14179A9284591n60199j84008n50018k37983l26063k62571o22813o0559m70153
14170A6010224j32500l94156l17902k19024j53564m97996j48871j86777k38994
14161A3720440m74446l71557J89515m67536l6055l51126l68626k08147M1198j05036
14151A1568624n55269k26479k49475J89535j19893j85707m56939j0491j20466
14142I833440k6487k1641n00187j77277l67841J47782j74201K85342m21214k20270
14132H357446J65995n4845k32103k97539j2403o7558j50521N4722m88753M08504
14122G682945l91380O7878j73926n5505k15327o6676J96296n05457N31275l10598
$$ y = [23932876, 23524697, 22849877, 22282710, 22239204, 21608251, 21057724, 20265291, 20270672, 19617811, 19284591, 18724392, 18540384, 17990366, 17752383, 17426320, 17163749, 16540936, 16480377, 16010224, 15877724, 15483568, 15165666, 14946642, 14793078, 14295082, 14146211, 13959434, 13720440, 13245994, 12874437, 13063952, 12596416, 12560361, 12209235, 11840609, 11632462, 11673660, 11568624, 11013355, 10786876, 10537401, 10726936, 10607043, 10421336, 9964397, 9953906, 9833440, 9806953, 9785312, 9285125, 9107848, 8740007, 8887789, 8713588, 8998930, 8577716, 8357446, 8523441, 8468596, 8236493, 7938954, 7926551, 7858993, 7708472, 7763194, 7274441, 7682945, 7291565, 7359443, 7185517, 7130012, 6914685, 6848009, 7044305, 6538848, 7070123, 6759525]
14112F759525l58927J56855j91424J80359l54701j81156R5156k13242l03844j48490
14102E440111L84800j20097J18736j57263P7386k48715j76534J65801k06207J43838
14092E421856k69300n10265N77976r6721j53064l27275K81554l14369O8880J07585
14082D786857j84790J0710j06032K05619j08700k35705q4980k8985J83290l66853
14072D070431j64534J84087k33439J68362l89561K56450O7794O7230m32844K63054
14062C857030J0372m27895K47037k46718P4195J86844j39610k40816M8844R0355
14052C459638m3274L7632j55074m879k47523K44435J28296k82359k44482K64269
14042C156679j33384j05373L9385J19931k57658Q8951O8104m3414J37564l14776
$$ y = [6759525, 6400598, 6557453, 6366029, 6546388, 6191687, 6010531, 6105687, 5892445, 5588601, 5440111, 5824911, 5704814, 5823550, 5666287, 5743673, 5494958, 5318424, 5484225, 5278018, 5421856, 5152556, 4642291, 5220267, 5123546, 4970482, 4643207, 4924761, 4610392, 4679272, 4786857, 4602067, 4612777, 4506745, 4712364, 4603664, 4367959, 4282979, 4253994, 4437284, 4070431, 3905897, 4089984, 3856545, 4024907, 3635346, 3891796, 3959590, 4026820, 3593976, 3857030, 3867402, 3439507, 3686544, 3439826, 3514021, 3700865, 3561255, 3320439, 3369283, 3459638, 3416364, 3453996, 3298922, 3294043, 3046520, 3290955, 3419251, 3136892, 2892410, 3156679, 3023295, 2917922, 2957307, 3077238, 2819580, 2908531, 2976635, 2933221, 3070785, 2756009]
14032B756009P8327K68392J08487o9313k85067J41230j98249k38064L97982k20053
14022B739681J44803n05995P6191P8887k87266J81137j4667o3804k37973J29593
14012B240587J74917k50876o1297q212r551K77392L2911m2633n49000N12859o5259
14001B251838j90261j43558k60925K07515n1816J36356M5506M5505l37899K28799
13991A931060J87898M33136Q84144K674130O225292J6695072K0063477k1312032
13983B7782177A1716011n317741j357719j054777m40246l24377l41479j02923
13975B776749o1347j07614k20566M06541j95757j42359j58243J28755j22615m16022
13965A887522L48140m57736O851J27090N13755m31832J5157r7290J88552m56118
$$ y = [2756009, 2834336, 3102728, 3211215, 3141902, 2856835, 2998065, 2799816, 2561752, 2959734, 2739681, 2884484, 2378489, 2454680, 2533567, 2246301, 2427438, 2412771, 2348967, 2110994, 2240587, 2415504, 2164628, 2103331, 2095119, 2085568, 2362960, 2395871, 2353238, 1804238, 2317097, 2251838, 2061577, 1918019, 1657094, 1864609, 1812793, 1949149, 1994655, 2040160, 1702261, 1931060, 2118958, 2552094, 3436238, 6110368, 12335660, 29030732, 49094209, 27782177, 11716011, 6398270, 5040551, 3985774, 3545528, 3221151, 2879672, 2776749, 2715402, 2607788, 2387222, 2793763, 2598006, 2455647, 2297404, 2426159, 2303544, 1887522, 2235662, 1777926, 1784777, 1911867, 2425622, 1993790, 2008947, 1911657, 2100209, 1644091]
13955A644091L39170P8345m69004J69585k15497o5757K26941L9615K00369k8442
13945A919416l6946o37580M47956p6717Q4158p9702R769J36261Q8801l38185L37355
13934A854586o93087N22318l19778K19721j52155m038L35692l27155J29642j78645
13924A387101K9952j56780J50043j68783L06127K16738j67728l29213K80549k11121
13914A336885K02866j52100J75702j2898n87227J81752K45527r2532j58721K77858
13904A417112M0467o5367K26119m00971k0331N819J01788j73271j14292K79569
13894A296642l24458L99351k87901J48912l55491J64408P9175o1959K63790M3914
13884A366383n9518k42239j0664K11764k16076O9954j37383J72526j06667Q2589
$$ y = [1644091, 1983261, 2061606, 1592602, 1762187, 1546690, 1480933, 1707874, 1747489, 1947858, 1919416, 1882470, 1244890, 1692846, 1616129, 1700287, 1620585, 1630354, 1766615, 1855416, 1517231, 1854586, 1161499, 1683817, 1364039, 1583760, 1431605, 1427567, 1763259, 1436104, 1565746, 1387101, 1417053, 1260273, 1410316, 1241533, 1547660, 1764398, 1596670, 1267457, 1548006, 1336885, 1539751, 1387651, 1563353, 1550455, 963228, 1144980, 1390507, 1297975, 1139254, 1417112, 1457579, 1392212, 1618331, 1217360, 1197029, 1202848, 1304636, 1131365, 1017073, 1296642, 972184, 1371535, 1083634, 1232546, 877055, 1041463, 1120638, 1058679, 1322469, 1366383, 1306865, 1064626, 1053962, 1265726, 1049650, 1119604, 982221, 1154747, 1048080, 1130669]
13874A130669K37425k41921p6607K24160l03800q2493J36769L4240l95352O96153
13864A359243o54768J32635R4519p5107J69993J63573o5158l20414Q79q3554L33234
13853A055075P714j26938j76154J67678j43841j96706J84014M12898R92k34133
13843I50599j7530J45457K8748l32495K69596k10097K70783l35201L75978m74640
13833F71198L26086j44227j14436O0366P9323L38634n11125J93959j52670O49
13823G47757J12406n5434K98074n3466j78626J9479J41267l13725j80812J55758
13813F92678J8338L21452k00696k08630K40339J05393j68938j3335j93652J92551
13803G85500k06736L88080l09198l06669P70617l09486m2359k56181L88222k36855
$$ y = [1130669, 1368094, 1126173, 1049566, 1273726, 969926, 887433, 1024202, 1058442, 663090, 1359243, 704475, 837110, 931629, 856522, 1026515, 1190088, 1124930, 804516, 805395, 721841, 1055075, 1062789, 935851, 759697, 927375, 783534, 586828, 770842, 1183740, 1184732, 950599, 933069, 1078526, 1107274, 774779, 1044375, 834278, 1105061, 769860, 1145838, 671198, 997284, 853057, 738621, 798987, 878310, 1216944, 705819, 899778, 747108, 747757, 860163, 804729, 1102803, 1049337, 870711, 890190, 1031457, 717732, 536920, 692678, 711016, 1032468, 831772, 623142, 863481, 968874, 799936, 786601, 592949, 785500, 578764, 966844, 657646, 350977, 1121594, 812108, 769749, 513568, 901790, 664935]
13793F64935P2594J75754k44025k25991O73591E17443L30419j84790K62063l75875
13783E49260K71688k35101K01806L1840l77994N99791l19789k5432P1607l38052
13773D29624K68203q0640j14054A99727O24058l52718N47284m96322Q2730n2878
13763E51881K35125l775C70144J7194J53058j00463J06311L27685Q0093l78486
13753E75536l0384L0772J40957j92239P6484J70919o0299j01957j06843n3506
13743D49440J8122Q5840n65N1921J20491l0687J05421p2626k08899K26815l20324
13732D24949L17669q6530B97816J52118L23485l03959L36095C61094K68324J2429
13722F41847j86551M7671l0172j05480A64849K39184Q1738p0651n6346K58712
$$ y = [664935, 737529, 913283, 669258, 443267, 1116858, 517443, 847862, 663072, 925135, 549260, 820948, 585847, 787653, 819493, 441499, 1041290, 721501, 696069, 767676, 429624, 697827, 617187, 503133, 199727, 823785, 471067, 1018351, 522029, 604759, 551881, 787006, 783231, 370144, 387338, 540396, 439933, 546244, 873929, 954022, 575536, 545152, 575924, 716881, 524642, 601126, 772045, 711746, 609789, 502946, 449440, 467562, 553402, 552837, 604758, 725249, 694562, 799983, 727357, 518458, 745273, 424949, 742618, 656088, 297816, 449934, 773419, 469460, 805555, 361094, 629418, 641847, 455296, 502967, 472795, 367315, 164849, 404033, 485771, 415120, 358774, 617486]
13712F17486D2922M80227K67887A09630N21662j16938J73307N602j65037N6277
13702E84503O7560k9689p3212J24919j69342J95425k10235N0235j70739J36821
13692E06246K8011Q7315l06392K02713o3615J721Q9204B54180K57215B06161n4732
13681A51429J76663L88369l2633j72298k2751J27317j71083J0838k25598R4220
13671C24473R7090M2246j90484K88935j09520p8178K08700o187j65267o4436J05981
13660D53353j99889J77851K48320B18612M22535J7A79061p2641L88887K47612
13650G42919k58706p7625o0750l7166J80173j69007A02658L69064A42655M64739
13640F07394k81141J68397B17070Q4043L28700D143J87989J55078A07095L32767
$$ y = [617486, 42922, 523149, 791036, 109630, 631292, 514354, 687661, 693263, 528226, 584503, 652063, 622374, 549162, 674081, 504739, 700164, 489929, 540164, 369425, 506246, 534257, 621572, 315180, 517893, 454278, 455999, 545203, 254180, 511395, 206161, 151429, 328092, 716461, 683828, 511530, 488779, 616096, 445013, 455851, 230253, 324473, 421563, 463809, 273325, 562260, 452740, 374562, 583262, 577075, 411808, 347372, 453353, 253464, 431315, 679635, 218612, 641147, 641164, 179061, 106420, 495307, 742919, 484213, 406588, 345838, 308672, 488845, 319838, 102658, 471722, 142655, 607394, 326253, 494650, 217070, 301113, 629813, 4143, 192132, 347210, 107095, 439862]
13630D39862j62854G2254N46700k14213j12345J61292I0834K47778P3177m6672
13620C65117j38014K85806k21818M9903E1466K73350M3173o1239A40452a20210
13609B64989J37678p2406R5430p6030A31232L29487m3589Q4202M0461l6085B24013
13597E66346j23621k2385P3864B03890N5366R4913H5009J1831L08099N47136C3828
13585F18856A92298K15405J16875k07659p5353N0493R0265J91666j67723j52799
13575B53468m2697K36729j73038L8236A23122A5823K34540L7838O3951K4133J3380
13564C89665A93261J56637n4815r2664J01032A35293B9672K13935q3883E1170
13553C99131r4362G1811c3931E67499k26355J58337c39275E45682j26510A15064
$$ y = [439862, 277008, 72254, 618954, 404741, 292396, 453688, 90834, 338612, 411789, 365117, 227103, 512909, 291091, 340994, 51466, 324816, 367989, 306750, 140452, -120210, 264989, 402667, 330261, 425691, 349661, 131232, 460719, 417130, 501332, 541793, 505708, 224013, 566346, 442725, 420340, 494204, 203890, 259256, 354169, 85009, 96840, 404939, 952075, 33828, 618856, 192298, 407703, 524578, 316919, 241566, 292059, 382324, 573990, 406267, 253468, 210771, 447500, 274462, 312698, 123122, 15823, 250363, 288201, 352152, 376285, 389665, 193261, 349898, 295083, 202419, 303451, 135293, 29672, 243607, 159724, 51170, 399131, 304769, 71811, -33931, 567499, 341144, 499481, -339275, 545682, 419172, 115064]
13542G52285A84203L36437F1618L31403A01776J88108O8804r7590R8548j70187
13532A89459J12467k589r163m8376D2724O5438K8103J09532f4950B80263l0746
13521B49517J62891l5824A45218K43896j94426N6746b2029D8810K87302N2201
13511C88313A19265L47369O2835A89237K35206j22418A28992K14593k9578B6611
13500B61978G8824J86579J43418l8647r9879O6602m3857Q888J59283A76490q6741
13489H9749N0751J71833A29949J27117N6947n0503r7581K02684b0722B12512L01181
13478E13693A31517l6249L74829B00862J75515K71183l17074O6065a99587I4509
13467G6719K75739g6674B41748M9359j41688a57556A73783K6848O0535m0156G4860
$$ y = [752285, 184203, 520640, 61618, 393021, 101776, 289884, 358688, 261098, 359646, 189459, 301926, 299337, 290174, 241798, 42724, 108162, 136265, 245797, -64950, 280263, 249517, 412408, 376584, 145218, 389114, 194688, 251434, -22029, 48810, 336112, 388313, 119265, 466634, 529469, 189237, 424443, 302025, 128992, 343585, 314007, 26611, 261978, 78824, 265403, 408821, 370174, 270295, 336897, 293040, 301928, 461211, 176490, 89749, 140500, 312333, 129949, 257066, 314013, 263510, 165929, 368613, -20722, 212512, 513693, 131517, 95268, 470097, 200862, 376377, 647560, 330486, 396551, -199587, 94509, 76719, 352458, -76674, 241748, 291107, 149419, -157556, 173783, 200631, 261166, 221010, 74860]
13455C10005a29067A13302O0462J29684j22670m4967J37466i754D57777o1366
13445C96411j6371K54870C11258M7797j41958J24642b5578l5550B11027L0170
13435B41197I3003J21492K7934j05465M9061G7308A5847J40091F3618Q0857j2851
13424A31624J20828E88J68186K98330A6636L49515d4641A33166J16989A20315
13413b38887h5518A11381M5014L47061j97984j44173J94181q0331n1909L5069
13403B58309R0487J402A18690a0179C2445K50584a08645A27310J33177M0809J52490
13392D53786L1525C3272K80413p7634m5356c5884D3245J06804n1263J78922f4600
13380B49971O8854G1680L07386j75131d8098k78845C00921k9595r2650p4184Q6855
$$ y = [310005, -129067, 113302, 173764, 303448, 180778, 135811, 273277, -9754, 457777, 396411, 380040, 634910, 311258, 359055, 217097, 341739, -25578, -61128, 211027, 241197, 93003, 214495, 242429, 136964, 186025, 77308, 15847, 155938, 63618, 144475, 131624, 252452, 588, 168774, 467104, 16636, 366151, -44641, 133166, 250155, 120315, -238887, -85518, 111381, 156395, 503456, 305472, 161299, 355480, 275149, 223240, 258309, 348796, 350198, 118690, -10179, 32445, 283029, -108645, 127310, 260487, 301296, 453786, 485311, 33272, 313685, 236051, 190695, -35884, 43245, 150049, 98786, 277708, -64600, 249971, 318825, 71680, 379066, 203935, -48098, -326943, 300921, 271326, 178676, 104492, 191347]
13369A91347J47876j64942j436l8370K22998j59028K01862j61773J77830K302
13359D18666A33700R1628J94972k07303L16735k55583j35607a0178A46942b9372
13348a21280C23331A30099J82626M9702m4895O5721Q6305A02897I882L07315B0782
13336E37790k66263G7707J81062m799n1138n8783K0201g38B08697A9980J80322
13325B00302K01149q414j27471A10066a79684A3048K03974J34892F8269H983J95294
13314B04277I2510R091J34314r8037J57867h6665B63146A07530K60469a45151
13303a56225C38756a97579B83427G2603J48132j00674K18421O2391h361C22711
13292A79676l8859J36366F0974J02950R8672P8182C9948a71540E2510K64752r5097
$$ y = [191347, 339223, 174281, 172845, 134475, 357473, 198445, 400307, 238534, 416364, 418666, 133700, 225328, 420300, 212997, 529732, 274149, 138542, -10178, 146942, -29372, -121280, 323331, 130099, 312725, 362427, 317532, 383253, 469558, 102897, 9882, 317197, 20782, 537790, 271527, 77707, 258769, 253970, 202832, 144049, 164250, -738, 208697, 19980, 200302, 401451, 393037, 265566, 110066, -179684, 13048, 217022, 351914, 68269, 8983, 204277, 92510, 101601, 235915, 137878, 295745, -86665, 263146, 107530, 367999, -145151, -156225, 338756, -197579, 283427, 72603, 220735, 120061, 338482, 400873, -8361, 322711, 179676, 140817, 277183, 60974, 163924, 262596, 340778, 39948, -171540, 52510, 317262, 222165]
13281B22165r9900K16126j06523L0763q0284f4981B58980K7128J78088A19411
13270B85863b61005A02196m2320J24913g2247B51107J07416j32412d9401A7280
13259A26571N953C1546J73357f3655a2126H5854a65373F4092J05598H0855J10144
13248A90999d423C2958C366a17751B99078k9523c2097f918C92376A60842E5308
13236C79815b32649B8638a22816B73131a86658B98590a54492C90705b43229C01666
13225A47431g0627r376A63410q1400b13250B06630N2158H9947J37688J6247M4426
13214B88308J25974I9157N5526a06856A21007B7953a030k66661H4356K4452J87465
13203B96273c22519d4981F5728Q9937Q6312i0169K8325B65183j6676C1310A3597
$$ y = [222165, 122265, 338391, 231868, 262631, 182347, -64981, 258980, 286108, 464196, 119411, 285863, -261005, 102196, 59876, 184789, -72247, 251107, 358523, 226111, -49401, 17280, 126571, 132524, 31546, 204903, -63655, -12126, 85854, -165373, 64092, 169690, 80855, 190999, -4423, 32958, 3366, -117751, 299078, 269555, -32097, -6918, 392376, 160842, 55308, 379815, -232649, 28638, -122816, 273131, -186658, 298590, -154492, 390705, -243229, 301666, 147431, -70627, -80003, 163410, 82010, -213250, 206630, 258788, 89947, 227635, 243882, 288308, 414282, 99157, 154683, -106856, 121007, 27953, -1030, -267691, 84356, 108808, 296273, -322519, -44981, 65728, 155665, 241977, -90169, -61844, 265183, 248507, 31310, 13597]
13191A37619P3816L989N6311a04402B35134G1866K96544B5681K62808e1823I4057
13179C37550l840A29177K15805h8319A15319i8357A43441n6719h1984A17296K54905
13168C72201B3770J46531h0162g0I4074J66337I2254A8918J05546Q0162h7032
13156B79480n5116e5430I4102F413K90859r1310q2139e3595K2460N305j92753
13145b18583O8477A83507j5465b5363A46345h0223b5240A52706E9865b69263A19389
13133C0824J06908C3688K21845b7671j626l0593C20849a27260A10401g6566C6787
13121B41491f4111j47401A38984b7577C8867P6131a59797o0715F4936L55147p5216
13110C44867D8832J22328G6361a07574A97928b29181A85445J36373A02780k7553
$$ y = [137619, 211435, 215424, 271735, -104402, 235134, 71866, 368410, 25681, 288489, -51823, 94057, 337550, 333710, 129177, 344982, -88319, 115319, -98357, 143441, 86722, -81984, 117296, 372201, 23770, 170301, -80162, -70, 94074, 260411, 92254, 18918, 124464, 204626, -87032, 279480, 224364, -55430, 94102, 6413, 297272, 205962, 123823, -53595, -31135, -25830, -218583, -150106, 183507, 168042, -25363, 146345, -80223, -25240, 152706, 59865, -269263, 119389, 30824, 137732, 33688, 255533, -27671, -29297, -59890, 320849, -127260, 110401, -76566, 36787, 241491, -64111, -211512, 138984, -27577, 38867, 114998, -159797, -220512, 64936, 420083, 344867, 48832, 171160, 76361, -107574, 197928, -229181, 185445, 321818, 102780, 75227]
13100G5227P9180K12593G3439J52800C2143h4648A9226f5089l4309j9583A05987
13088A61823a2659k2089A74051A8217K80761n0449Q4906n2845a05995B19790j08546
13077A11244B5942e3876C22040q2722K74382B9476h4976m1341B29905J15796a51094
13065d57516B35361D0130a45216h325A28405f8484C34502j61452B7437K12233
13055B39670l8359J75633C1270J74189M0194j14779c135A77540K19183g9370c6048
13043C01581a37072H1582j4021a4854D657L77689A19399b48996A73599H3363b5280
13031F1546d1090B82171k7143j9210r4774m4382K26055F0962J76535L3099A4519
13019B4240a78181C15752O949A02607K7685b24816i9499A25644B0542i8350H7732
$$ y = [75227, 154407, 367000, 73439, 226239, 32143, -84648, 19226, -65089, -99398, -118981, 105987, 161823, -12659, -34748, 174051, 18217, 298978, 248529, 333435, 280590, -105995, 219790, 111244, 25942, -53876, 322040, 239318, 513700, 29476, -84976, -126317, 229905, 345701, -151094, -457516, 235361, 40130, -145216, -8325, 128405, -68484, 334502, 173050, 27437, 239670, 201311, 376944, 31270, 205459, 245653, 130874, -3135, 177540, 396723, -79370, -36048, 301581, -137072, 81582, 67561, -14854, 4657, 382346, 119399, -248996, 173599, 83363, -25280, 61546, -41090, 282171, 255028, 235818, 141044, 96662, 322717, 60962, 237497, 270596, 14519, 24240, -178181, 315752, 322701, 102607, 130292, -224816, -99499, 125644, 20542, -98350, 87732]
13007A19815L67676a50132E6931K86058k6156C6664J26016D1156j9802K26547
12997B47901k11b7874C95898j76772r7139B8860f3888B69926f5480j91523Q9913
12986a67090C2042l693J20892E9311J02137q0688I689M31069a38343c5126I2813
12974B57689P5032l6785A08659c6460E6184J47830j7961j4415c86754B7051a02716
12962a01554B45028K77498A36572K18008A19958n8128c30441A54603b75206N4062
12952b21144i3582a1644D1868a64589D21518A94153J8680J13863A62027E38e196
12940B42985f9573m07300A09405N8215Q5332a51365C5480d3180B15537b66344
12929a62767m1141b161p6709j58913A9266J01121N3261R9029B0100O6558i5775
$$ y = [119815, 487491, -150132, 56931, 342989, 316833, 36664, 162680, 41156, 21354, 247901, 247690, -27874, 395898, 219126, 121987, 28860, -63888, 269926, -65480, -257003, -167090, 32042, 28349, 149241, 59311, 161448, 80760, 9689, 440758, -138343, -35126, 92813, 257689, 332721, 295936, 108659, -36460, 56184, 204014, 186053, 171638, -386754, 27051, -102716, -101554, 245028, 522526, 136572, 354580, 119958, 61830, -330441, 154603, -275206, -221144, -93582, -11644, 41868, -164589, 421518, 194153, 212833, 326696, 162027, 538, -5196, 242985, -69573, -476873, 109405, 167620, 252952, -151365, 35480, -43180, 215537, -266344, -162767, -203908, -2161, -78870, -237783, 19266, 120387, 173648, 272677, 20100, 86658, -95775]
12917e0254A23614A1927b03389g1696E5867c941m2347A13399a21160B01640D9268
12905A90967F3975f4168B87805c42905R2237D7105a4461B27487D8801R5678E8002
12893A08208J85703a16920m9014B73784a61096a3281B78660c0943j1563A78395
12882i2062n9478r1001R4481C38906C6186K15682G9909k3610J32014M6961b0547
12870a17863d837k4943G6837f7388B84208g8393B7787b18109A27366a98270g2371
12858H3452K76568D743Q6312h7808d565k2210j38613A9574j582a10811L6686l6066
12846a10191I8453J49940C7473a99295h8352E3019J01363d3458C23102a84197
12835A29755C151K2088a27666j17072F9143d84081a8232k15759A81637b12237
$$ y = [-50254, 123614, 11927, -203389, -71696, 55867, -3941, -46288, 113399, -121160, 201640, 49268, 190967, 63975, -64168, 287805, -342905, -250668, 47105, -14461, 227487, 48801, 144479, 58002, 108208, 293911, -116920, -165934, 273784, -161096, -13281, 278660, -30943, -42506, 178395, -92062, -151540, -242541, -148060, 338906, 36186, 251868, 79909, 56299, 188313, 235274, -20547, -117863, -4837, -29780, 76837, -67388, 284208, -78393, 27787, -218109, 127366, -198270, -72371, 83452, 360020, 4743, 91055, -87808, -4565, -26775, -165388, 19574, 17992, -110811, -74125, -110191, 98453, 248393, 37473, -199295, -88352, 53019, 154382, -43458, 323102, -184197, 129755, 3151, 25239, -127666, -244738, 69143, -484081, -18232, -233991, 181637, -212237]
12824B52594b5015A32659C4171N5018k8989c38878A41252l5152J74924G1946a58714
12812A95471b46049h219B08651a31252B33667c830I2968a25874H509Q8450a40378
12800c96812a2142I6542J16301O358N7509B67J50322e5694n339l15448d3077B15592
12787a06490B80661A2083b51409a01162p8146L7983G5132k1183K0497L7073C9804
12775a4615k84414A12602I764J31884l3563E3896Q1588j5929f3986G4553f3903
12763d7981G0538J28004a82348B4121b29371g0870B08754J2750g3661B745b22187
12751B9399c6754C77185a82505f6859A03130c9059A97033j9010C7842a39479C81172
12739B05974C3328K5043e9137A36795n1281d5058C7527f763D19888n9605a86009
$$ y = [252594, -25015, 132659, 34171, 89189, 60200, -338878, 141252, 106100, 281024, 71946, -158714, 195471, -246049, -8219, 208651, -131252, 233667, -3830, 92968, -125874, 8509, 96959, -140378, -396812, -12142, 96542, 212843, 219201, 276710, 267, 150589, -55694, -61033, -376481, -43077, 215592, -106490, 280661, 12083, -251409, -101162, -179308, -141325, 75132, 53949, 74446, 111519, 39804, -14615, -299029, 112602, 9764, 141648, 108085, 53896, 135484, 119555, -63986, 74553, -63903, -47981, 70538, 198542, -182348, 24121, -229371, -70870, 208754, 221504, -73661, 2745, -222187, 29399, -36754, 377185, -182505, -66859, 103130, -39059, 197033, 178023, 37842, -139479, 381172, 205974, 33328, 58371, -59137, 136795, 85514, -45058, 37527, -6763, 419888, 360283, -186009]
12727A52915m0155J24089a9297F6304b6802A68732m1459M6458g5669B82405F469
12715B22484d10937a39531A3881d4204m9421j65414P6758H754K82683K0586J9571
12704C31594j00284H116K01997b71061D3798i298I1002R5856k617E4926J44277
12693A99203o0598J86217D0043N7376A9713K4824i8807j0671J7501p4757C09919
12681C83630b38836B88069J24857C1358b03863B21403Q6447L6745a43386Q916
12671a34470B7000K82142A49031j8755N9153a32834N4353B8950i3944A77245J38327
12660C15572A02036b79454C3526L5285J27917J18102b56366C35092a32851j5069
12650a47920K3425C07326h6020C5561c4260k7417B68619G2857B4622H943Q160
$$ y = [152915, 112760, 236849, -19297, 66304, -26802, 168732, 127273, 173731, -75669, 282405, 6469, 222484, -410937, -139531, 13881, -44204, -93625, -259039, -182281, 8754, 291437, 312023, 331594, 231310, 8116, 210113, -271061, 43798, -9298, 91002, 186858, 184241, 54926, 199203, 138605, 324822, 40043, 97419, 19713, 44537, -98807, -109478, -91977, -166734, 309919, 383630, -238836, 288069, 412926, 31358, -203863, 221403, 307850, 344595, -143386, -134470, 27000, 309142, 149031, 130276, 189429, -132834, -78481, 28950, -93944, 177245, 315572, 102036, -279454, 33526, 68811, 196728, 314830, -256366, 335092, -132851, -147920, -124495, 307326, -86020, 35561, -34260, -61677, 268619, 72857, 24622, 8943, 17103]
12639A7103J12145i5613c0115A09775O8989a34211C0721K96729a1639k19191C76112
12627B99254Q3870H5015K79511j21326q7528J8673C1882A4228L88023A95429M9009
12616B44438n9136N1416e2624m4420A70002A2249c6236k01191a12087n5263D27807
12604A04155d4420r9777A83873E0611Q9306G424L48412j15037e7414A91944p7635
12593A14309B0972e7977A05754l1914d7965A91562J13452C6537a990k84844C0985
12581A03356c5746k2700d260l27330A58006e164l5657j97084N9845A83965a38226
12569B5000J27018a97446A97590J1416E4826J61905E1576J72880k6030H0497k4864
12558E5633h5827I3423l2774J16613P0645e0869K2889B45796b79210a39221D1026
$$ y = [17103, 129248, -95613, -30115, 109775, 178764, -134211, 30721, 327450, -11639, -230830, 376112, 299254, 383124, 85015, 364526, 243200, 155672, 174345, 31882, 14228, 402251, 195429, 244438, 185302, 236718, -52624, -97044, 170002, 12249, -36236, -237427, -112087, -167350, 427807, 104155, -44420, -144197, 183873, 50611, 139917, 7424, 355836, 240799, -57414, 191944, 114309, 20972, -57977, 105754, 73840, -47965, 191562, 305014, 36537, -1990, -286834, 30985, 103356, -35746, -58446, -4260, -331590, 158006, -5164, -40821, -237905, -178060, 183965, -138226, 25000, 152018, -197446, 197590, 209006, 54826, 216731, 51576, 224456, 198426, 80497, 55633, -85827, 93423, 60649, 177262, 247907, -50869, -27980, 245796, -279210, -139221, 41026]
12546b03894i5465C3853c96829J54281E1238r761A9716a22712A24063b98569C7611
12534A46329a16581c2455k20371I1789C81f0577A44169l6306l6662J81765a00570
12522d7919a1762E8762c638B8293K19837d28363G4596K8765P2750a44193I7994
12510B42133c2888A41393e7786D6932b01360A70887a55683P5568a9947c22E6766
12498B00950a62185a2448j3576j30189j48315R0488A79380n099N9349d3738F586
12486b8153B67303p7570r2099a85763B68603C8076b03338B4076M235R9026J49404
12475B76741E8159J76718a13487B00414c02956C9918g0861A31226k7319c6234
12464A861J15438f4152E2444c29932Q0228A17896J84453a51056I80a20763A34924
$$ y = [-203894, -95465, 33853, -396829, -242548, 51238, 41477, 19716, -122712, 124063, -298569, 37611, 146329, -116581, -32455, -252826, 91789, 381, -60577, 144169, 107863, 71201, 252966, -100570, -47919, -11762, 58762, -3638, 28293, 248130, -428363, 74596, 103361, 176111, -144193, 97994, 242133, -32888, 141393, -57786, 46932, -201360, 170887, -155683, -80115, -19947, -322, 56766, 200950, -162185, -12448, -26024, -156213, -304528, -214040, 179380, 174281, 233630, -43738, 6586, -28153, 267303, 189733, 97634, -185763, 268603, 38076, -203338, 24076, 28311, 127337, 276741, 58159, 234877, -113487, 200414, -302956, 39918, -70861, 131226, 103907, -36234, 1861, 117299, -64152, 52444, -329932, -249704, 117896, 302349, -151056, 980, -120763, 134924]
12452F7632L66194g544A409g9629G8351a7855F4951j0659b9851D1987a43982F1287
12439c25602A31255e8588C7400K76298a32647H4831l4917c68454E0789J4295d24496
12427G1147M61466A3965a1331I9883m2775a99838E8205J12362L8126B8815i7637
12415A21575D853L26992f2326G626e5531G267K9631K66002a27915k5266O4238
12404h8943A78089g6333r9385H372R432d3023F4125K02702f3370B13895i1391
12392C21030j09245c7369p468H3371a10260Q144c8226j3899A85812l8688A2642
12380B416i9930n2914A7532p144a16972A36414D4557f7519l43159A62654g1849
12368A1805P0024B2524f8116K2740A05155a08379e092A6592b86879a6507j81583
$$ y = [67632, 433826, -7544, 1409, -79629, 78351, -17855, 64951, 54292, -29851, 41987, -143982, 61287, -325602, 131255, -58588, 37400, 313698, -132647, 84831, 49914, -368454, 50789, 65084, -424496, 71147, 532613, 13965, -11331, 99883, 57108, -199838, 58205, 170567, 208693, 28815, -97637, 121575, 4853, 331845, -62326, 7626, -55531, 7267, 36898, 302900, -127915, -153181, -88943, 178089, -76333, -175718, 8372, 17804, -43023, 64125, 266827, -63370, 213895, -91391, 321030, 211785, -37369, -44837, 83371, -110260, -102116, -38226, -52125, 185812, 147124, 12642, 2416, -99930, -152844, 17532, 10388, -116972, 136414, 44557, -67519, -410678, 162654, -71849, 11805, 81829, 22524, -68116, -45376, 105155, -108379, -5092, 16592, -286879, -16507, -198090]
12357a98090B17812g4797B1073J0302J08921d6666j7955B7346P0448B8139i1549
12345A83263m7470O9515b76308b0454C066c7986o1497D5050N8489K758a46531
12333a20662A43855J9771b2722C1919a75194Q140E10557g9186A005J54946a02707
12321A81210e038k36399j332h8187a3249B6365b48450g1420o6042A442K11056
12310B12498C2558J76534G9352a18203A89258f8394k94077A58937M5327h580G9152
12298A39798J30967C1121d3827k5129q3344B84132b11658m8637a5832j44268k32277
12287c92377a14519k7635B36553I1177K0538L71339D4001q535d1263a4928B0362
12275B14604l2047e955B75726J21134A74160q0617J38790A08382b39121D2277
$$ y = [-198090, 217812, -74797, 21073, 31375, 140296, -46666, -64621, 27346, 97794, 28139, -91549, 183263, 135793, 205308, -276308, -20454, 3066, -37986, -99483, 45050, 103539, 106297, -146531, -120662, 143855, 163626, -22722, 31919, -175194, -167054, 510557, -79186, 1005, 155951, -102707, 181210, -5038, -241437, -242769, -88187, -13249, 26365, -248450, -71420, -137462, 1442, 212498, 32558, 209092, 79352, -118203, 189258, -68394, -362471, 158937, 204264, -8580, 79152, 139798, 270765, 31121, -43827, -68956, -152300, 284132, -211658, -260295, -15832, -160100, -392377, -114519, -142154, 236553, 91177, 111715, 483054, 44001, 35466, -41263, -14928, 20362, 214604, 182557, -5955, 275726, 396860, 174160, 93543, 232333, 108382, -239121, 42277]
12264a62099A51125J7670o4129a54390A90484o4963a12707E7958J03423b0828
12253A99507O8305A03608b55083b0212A98780e9138A04295i3978B08207a14045
12242A55782c78519A88313a46120f5262F3788O0300R1909q8438J15008b35760
12231e3968C05455g14C74338i1003C18860r1104m9751O5387O2403J4832J49914
12220D70541j56155L5032h3841B06569O5039L86369A96520L62529A80791F9583
12209B98934I9481B7867i3316C89829P3980A68977K17377a64870D71435g1333
12198A71495K3018r22a38966D66691A99005O6355C7108a55870B6739J37246L13426
12187D77411a8411C69835a81570B11769L20470A42448e2318C60671a56075D28869
$$ y = [-162099, 151125, 168795, 104666, -154390, 190484, 125521, -112707, 57958, 161381, -20828, 199507, 267812, 103608, -255083, -20212, 198780, -59138, 104295, -93978, 208207, -114045, 155782, -378519, 188313, -146120, -65262, 63788, 124088, 215997, 127559, 242567, -235760, -53968, 305455, -714, 374338, -91003, 318860, 227756, 178005, 243392, 305795, 320627, 470541, 314386, 349418, -83841, 206569, 271608, 657977, 196520, 559049, 180791, 69583, 298934, 99481, 27867, -93316, 389829, 463809, 168977, 386354, -164870, 471435, -71333, 171495, 194513, 193591, -138966, 466691, 199005, 265360, 37108, -155870, 26739, 163985, 477411, -18411, 369835, -181570, 211769, 532239, 142448, -52318, 360671, -156075, 428869]
12176E1202J57194k0588a22437B77277A27130J86267p959F8090B4511L38315a07162
12164B83929A40404k8831K07b15357Q1573I9356a0322C83896H9651B6923J15712
12153A42635J12773B7193e5945C5607N2654j8890a34318d2822j32449N3107C50879
12141b19731n587m8359Q3891j45228a55767A00249J54744p7270j802D7268a08781
12129I7243N5448a55700A69989a26466l0706E014c28556d5381l999A40522k5754
12118A14768J79585D0547f930B15139a6009B22073c30799B8839c1240B24703a87721
12106B5216L434J19686i2377l4560N8723l6j24714M8645A33232E0667d44187H0212
12093E519a31644F3683d08264a00448c5412B10322f005j22675B92814g9178A60861
$$ y = [51202, 208396, 187808, -122437, 277277, 127130, 313397, 305438, 68090, 24511, 362826, -107162, 283929, 140404, 111573, 111780, -215357, -133784, 99356, -10322, 383896, 89651, 26923, 142635, 255408, 27193, -55945, 35607, 88261, 69371, -134318, -42822, -175271, -122164, 350879, -219731, -225318, -273677, -189786, -335014, -155767, 100249, 254993, 177723, 175921, 47268, -108781, 97243, 152691, -155700, 169989, -126466, -157172, 5014, -328556, -45381, -49380, 140522, 114768, 294353, 40547, -6930, 215139, -16009, 222073, -330799, 28839, -31240, 224703, -187721, 25216, 28650, 148336, -92377, -126937, -68214, -68250, -192964, -144319, 133232, 50667, -444187, 80212, 5519, -131644, 63683, -408264, -100448, -35412, 210322, -6005, -128680, 292814, -79178, 160861]
12081D01P3042k5754e7538A27069K86259A44188h7592m5423A43035L59b20462
12069A44523h3070o5771H0704l9409i0788E0423R2461g4176E94693P83040P0212
12058A447945F59919j86867a2048B19207i688r9813B8609e910A06482J4390b23981
12046a69563I4609m1325J54521A5795Q376h7439A30406N3761e2369o0559d1221
12034A91562G8820a13967B92735a72788h4974A25364O537m0204L4823e8283A63994
12022a33890d9061C6445a54108H7807E374K63546c54728A7632b31246A7810J27771
12011A45581E1596a19840B35140g8260C8243b0585m1889j42324A88499K46883
12001D35382a18260J6839E7010K14127a88370H8141c2239k47714B67491d0228
$$ y = [401, 73443, 47689, -57538, 127069, 413328, 144188, -87592, -133015, 143035, 143394, -220462, 144523, -83070, -148841, 80704, 41295, -90788, 50423, 142884, -74176, 594693, 1377733, 1447945, 659919, 473052, -12048, 219207, -9688, -109501, 28609, -5910, 106482, 120872, -223981, -169563, 94609, 53284, 207805, 15795, 24171, -87439, 130406, 184167, -52369, -112928, -41221, 191562, 78820, -113967, 292735, -172788, -84974, 125364, 131901, 91697, 126520, -58283, 163994, -133890, -49061, 36445, -154108, 87807, 5374, 268920, -354728, 17632, -231246, 17810, 145581, 51596, -119840, 235140, -78260, 38243, -20585, -62474, -204798, 188499, 435382, -118260, -101421, 57010, 271137, -188370, 88141, -32239, -279953, 267491, -40228]
11990F5096L2348K06125a84686I2633b7896j45136c9832j45857A95282j8766l3574
11979A42942J14661E3754A9861K20182p6594B2712a93903A54963A5157J978c8765
11967b62440h5287B07165e3225K6384r7099A81335n7016O9880A5458J97268a37780
11955a34628A35472R8479q5347a21285I9075C5422L03034A11998D8598a32416
11944H5678a2361A50043d58034c0785A38043a51070A12756L8541a4991A23621
11933b25118d1171k60772E3129N7922l4282e4481B05531L0028b43609O1998d7044
11921B80175I312K47705b16901C65004i4202b3143B2632K17767d5919m2250d2091
11909a37909f2892j9615G2129b31549C56627j51449a07351A33917o3338O2046
$$ y = [65096, 97444, 303569, -184686, 92633, -27896, -173032, -39832, -185689, 195282, 176516, 142942, 257603, 53754, 19861, 240043, 163449, 22712, -193903, 154963, 15157, 17135, -38765, -262440, -85287, 207165, -53225, -26841, -123940, 181335, 124319, 194199, 15458, 212726, -137780, -134628, 135472, 233951, 148604, -121285, 99075, 35422, 338456, 111998, 48598, -132416, 85678, -12361, 150043, -458034, -30785, 138043, -151070, 112756, 151297, -14991, 123621, -225118, -41171, -301943, 53129, 111051, 76769, -54481, 205531, 235559, -243609, -181611, -47044, 280175, 9312, 257017, -216901, 365004, -94202, -23143, 22632, 240399, -45919, -88169, -42091, -137909, -62892, -82507, 72129, -231549, 356627, 205178, -107351, 133917, 70579, 132625]
11899A32625E4444b01830i978n3254B33358H5351K57520a2011D00066B2682J92433
11888B15115d0984l775A45988e5636q8975j67043A16050a01282C2467d0433j96992
11877b37425a04084B42020H7905b4356j0551A82972b66559g2190o9891f5405j69208
11866b34613g0135j23421e1040B88J52728Q7951j3101c15401g732D45817H4699
11854D6871a44640f2292D7872O9853D7619k0486a51571K2563d8570j02932L1289
11843a20213h810A83472f1259j93171F9876A6557J53525k9803b26503A92677b12825
11831a07089c565j63727e7378A30581M1578a54124P0542B0190L1903f1022C385
11819b52076C5763a56860k4809p9576H9710a02675I761a61473K860G0411j1706
$$ y = [132625, 54444, -201830, -9978, -63232, 233358, 85351, 342871, -12011, 400066, 22682, 215115, -40984, -44759, 145988, -55636, -144611, -311654, 116050, -101282, 32467, -40433, -237425, -104084, 242020, 87905, -24356, -34907, 182972, -266559, -72190, -142081, -65405, -234613, -70135, -193556, -51040, 288, 153016, 240967, 227866, -315401, -7732, 445817, 84699, 46871, -144640, -62292, 47872, 117725, 47619, 27133, -151571, -129008, -48570, -151502, -120213, -8810, 183472, -61259, -254430, 69876, 16557, 170082, 140279, -226503, 192677, -212825, -107089, -3565, -167292, -57378, 130581, 172159, -154124, -83582, 20190, 52093, -61022, 3385, -252076, 35763, -156860, -181669, -261245, 89710, -102675, 9761, -161473, -158613, 70411, 58705]
11808E8705a62299G9603C2520c28923A41230o4945d9238I1774c3108j0070D7561
11796a34651G246c57901A93793A0844a21549R96D8358a09453C19082F7625L4073
11785A01698b7635l2683A99345g2250k28098I7662b78518B68500G136J7376L57059
11774C81571a73466g6708B415a88780C51747a41406D1084K24963E1347b364l552
11763e916l13637c3589k338l9324K639q2386p3479A98174r4505k138J2534a30579
11750f1285q8796R441j690B58595e4561A19672P5135a31954B60229b49170A52328
11738B05229C2026g73A27908c9269q4353C13872A28181a17204B17737B0059J83500
11727B03559o9825M348o0743B4646h5647B55133p5586c39325G6025J32442I9140
$$ y = [58705, -162299, 79603, 32520, -328923, 141230, 76285, -49238, 91774, -33108, -43178, 47561, -134651, 7246, -357901, 193793, 10844, -121549, -120553, 48358, -109453, 319082, 67625, 101698, -27635, -60318, 199345, -72250, -300348, 97662, -278518, 268500, 7136, 24512, 381571, -173466, -76708, 2415, -188780, 351747, -141406, 41084, 266047, 51347, -2364, -5916, -319553, -33589, -35927, -75251, -72612, -154998, -228477, 198174, 103669, 101531, 114065, -130579, -61285, -150081, -140640, -142330, 258595, -54561, 119672, 194807, -131954, 260229, -249170, 152328, 205229, 32026, -773, 127908, -39269, -123622, 313872, 128181, -117204, 217737, 20059, 203559, 133734, 138082, 77339, 24646, -85647, 255133, 179547, -339325, 76025, 208467, 99140]
11715a23921k6033f1521p457a5977o3939k2762A48382M0243a79597C19319j6768
11704C02551b48895B78444l6952e52A12468A4534K59261q8305a69067A08398K62773
11693C71171j26409a58808O1486A3085c90812A11039J12119g5623k0408A15008
11682d6714B99469j46146J04856k3799N4f0202A38273g1510k01251E075J00637
11671A05712a32348A99955i5705B2058a56657g636m5034b089A67611n7256B2281
11659g5738A46433a12986D7922Q5262C5821m642Q095a42213f0838A16506e0480
11647C69334e2175k361G4014F285K12963J45042a39380B11249r7339L8712K22722
11636C75344B0064K5386a52740r2896c2689m0315B01812A4073L11524H1027k3232
$$ y = [-123921, -149954, -61521, -68978, -15977, -79916, -102678, 148382, 188625, -179597, 319319, 302551, -248895, 278444, 241492, -552, 112468, 14534, 273795, 185490, -169067, 108398, 371171, 244762, -158808, -97322, 13085, -390812, 111039, 223158, -75623, -96031, 115008, -46714, 299469, 153323, 258179, 234380, 234434, -60202, 138273, -71510, -272761, 5075, 105712, -132348, 199955, -95705, 22058, -156657, -7636, -52670, -2089, 167611, 110355, 22281, -75738, 146433, -112986, 47922, 133184, 35821, 31179, 39274, -142213, -60838, 116506, -50480, 369334, -52175, -54536, 74014, 6285, 219248, 364290, -139380, 211249, 113910, 152622, 375344, 20064, 45450, -152740, -245636, -32689, -73004, 201812, 14073, 325597, 81027, 57795]
11625E7795c05995A11730R2923c5986j2606A58310k8961K23401q6434d8730B83822
11613h1061m9725B31404F1415J34384h9812c4330n3914d3499A86306O9739E7380
11601i0053l7421H5019A8552i7897j5590G352K43496g9402C91500A26571O2150
11590A88721O4598c9954A01721L39035A31394e5860B41604k4325G2243K3568a0604
11578A79087G9477a49281I8022M4773P082o9194L42774j14960j2869a12758C6974
11566A84885J67408A57684J6526b08204B63933m4765K84579k47658G1284J02527
11556A73811N971b42327B63102C7793p722R4871g2146J8919C54286F7160a41451
11544d9804A3430b59440A57178m9495a20822B26168J0274g7692A32378K3504J8593
$$ y = [57795, -305995, 111730, 204653, -35986, -48592, 158310, 129349, 352750, 266316, -48730, 283822, -81061, -130786, 231404, 61415, 195799, -89812, -34330, -88244, -43499, 186306, 256045, 57380, -90053, -127474, 85019, 18552, -97897, -113487, 7352, 250848, -79402, 391500, 126571, 188721, 253319, -39954, 101721, 440756, 131394, -55860, 241604, 217279, 72243, 95811, -10604, 179087, 79477, -149281, 98022, 142795, 149877, 80683, 423457, 308497, 295628, -112758, 36974, 184885, 352293, 157684, 174210, -208204, 263933, 219168, 503747, 256089, 71284, 173811, 179782, -242327, 263102, 37793, 30071, 124942, -72146, -53227, 354286, 67160, -141451, -49804, 13430, -259440, 157178, 107683, -120822, 226168, 236442, -77692, 132378, 155882, 174475]
11533A74475b5834C2256J87087q1590C6931J36916R981K30364a34809D4661f5396
11521C021a81532d4752B04941A4714K07760a62692g4127D6970K32058J50668A84557
11509B44090F7563L20934C4710K08138a09249G2009M49362k11922A06751a12028
11498E0980b26843F9840G406M6106J45639c8924k41930A41072J60888A23987n1443
11487G2544i1278c8814I6817L5391E0965J90436J4238o0780c41764C9968p989
11476C1979L6354K83540A18223e5338B22060K20414h7147d3570C5027J99503G5281
11464B24482f1949D9126N5974k1287P3114L9942H2882B5317d0362I1783B9194
11452a03566A71N5817K9866j6874b82894C49925A31857K1763F5288A4211L95467
$$ y = [174475, -25834, 32256, 219343, 137753, 36931, 173847, 183828, 414192, -134809, 44661, -65396, 3021, -181532, -44752, 204941, 14714, 222474, -162692, -74127, 46970, 279028, 429696, 184557, 244090, 67563, 388497, 34710, 242848, -109249, 72009, 521371, 309449, 106751, -112028, 50980, -226843, 69840, 7406, 53512, 199151, -38924, -280854, 141072, 301960, 123987, 72544, -91278, -38814, 96817, 132208, 50965, 241401, 255639, 194859, -341764, 39968, 31979, 68333, 351873, 118223, -55338, 222060, 442474, -87147, -43570, 35027, 234530, 75281, 224482, -61949, 49126, 105100, 83813, 156927, 196869, 82882, 25317, -40362, 91783, 29194, -103566, 171, 55988, 85854, 68980, -282894, 349925, 131857, 153620, 65288, 14211, 409678]
11441D09678a64076c0478B63674A4338J39424J2614L12E7158K39520d2896C74503
11429e0217A20114c4904j14542A0565d21875b0364k12295g2930B82340j15957
11419A66383l5003o0428a07690e587k03862A55869b63757d3940C11341a28189
11408B22976L0547d3934J7178A49828P8721E4822K88445a95172R1364A49529J43987
11397B93516L3036J18218f8610A98546b8933C76184m9010A16927L1344j4343b88637
11385F377L7457k565K3432a84348a6063G9527L33404j13632C1963J12539F2396
11373A85932a47013f9389j74389O6776A12548J09699I0733b29479B35672k5492
11363B10180a09937G881a64460h996A22942f9806k1144B5556N8116J27837B9652
$$ y = [409678, -164076, -30478, 263674, 14338, 153762, 166376, 166688, 57158, 296678, -42896, 374503, -50217, 120114, -34904, -149446, 10565, -421875, -20364, -232659, -72930, 282340, 166383, 131380, 70952, -107690, -5587, -209449, 155869, -263757, -43940, 311341, -128189, 222976, 253523, -43934, -26756, 149828, 228549, 54822, 343267, -195172, -103808, 149529, 293516, 326552, 444770, -68610, 198546, -28933, 376184, 327174, 116927, 148271, 133928, -288637, 6377, 43834, 41269, 64701, -184348, -16063, 79527, 412931, 299299, 31963, 144502, 62396, 185932, -147013, -69389, -243778, -177002, 112548, 222247, 90733, -229479, 235672, 210180, -109937, 7881, -164460, -8996, 122942, -69806, -90950, 25556, 83672, 211509, 29652]
11351I3098a58492B1181c70477B11090a98321h1460n6443k4428L6094B97400E5565
11339B69345r8105a10735F4863J47854J51304c4358k8724r2455n9899a869G9913
11327b77682c2796p1757M4766H8310M7265j3984i051A54870A5605J37554I641
11315B7253K5632i2676B03178a37278l1390C7984c1336B59403a66329A7813a44284
11303C4465J48692h3779A92103m592I618a19989A39822a4240m7474J8103A5593
11291a75416E0571c29516I1132h7439j36460c0429k69865a24148o5712A01415
11280a4874A57706B8336a28076j05418j99540i1805b7604A9639c300j98676g2105
11268B33471b93176g0400A56124J70306a11037j63576c3764j47813A22888J4360
$$ y = [93098, -158492, 21181, -370477, 211090, -198321, -81460, -137903, -162331, -126237, 297400, 55565, 269345, 171240, -110735, 64863, 212717, 364021, -34358, -63082, -155537, -215436, -1869, 79913, -277682, -32796, -104553, -59787, 88310, 135575, 121591, -9051, 154870, 15605, 153159, 9641, 27253, 52885, -92676, 203178, -137278, -168668, 37984, -31336, 259403, -166329, 17813, -144284, 34465, 183157, -83779, 192103, 187511, 9618, -119989, 139822, -14240, -61714, -43611, 15593, -175416, 50571, -329516, 91132, -87439, -223899, -30429, -300294, -124148, -189860, 101415, -14874, 157706, 28336, -128076, -233494, -433034, -91805, -27604, 19639, -3300, -201976, -72105, 233471, -293176, -70400, 156124, 326430, -111037, -274613, -33764, -181577, 122888, 137248]
11258A37248a30487e8589k69787B45144A20509o0103a09860B6456a59597A26625
11247e94914B2360Q3123a72948J0442C8444K39167B6611R311f3270l3157A06923
11235a22390A19529C1306a08523m477m5209B5845f978j39443O1809C12023f5206
11223d3132A49151k8124a43095A1024J30954a32845k5052L5546j39284J28053
11213a33582d0278G664c7528B9852a14610J7278r1683E1862K59746a22490C4170
11201A75646c09252B93262f5467j52265A59789e172j25744K3151J3766m3703j5615
11190a53317A40674n7756a79904Q3623A1186R4889d0983n3947A35654c5944k03902
11179b39846p6041E7369Q4910a10759n7756e7187j0127j47650C34812b11898a00824
$$ y = [137248, -130487, -58589, -328376, 245144, 120509, 60406, -109860, 26456, -159597, 126625, -594914, 22360, 105483, -172948, -162506, 38444, 277611, 26611, 35922, -63270, -96427, 106923, -122390, 119529, 31306, -108523, -113000, -158209, 25845, -6978, -146421, -84612, 312023, -65206, -43132, 149151, 121027, -143095, 11024, 141978, -132845, -157897, -122351, -261635, -133582, -40278, 7664, -37528, 29852, -114610, -97332, -189015, 51862, 311608, -122490, 34170, 175646, -309252, 293262, -65467, -217732, 159789, -5172, -130916, -107765, -93999, -137702, -153317, 140674, 82918, -179904, -96281, 11186, 106075, -40983, -94930, 135654, -35944, -239846, -315887, 57369, 142279, -110759, -168515, -57187, -67314, -214964, 334812, -211898, -100824]
11167B8334a14277d9295I0085l2189b17344a4037C16033C4098L2866P474M7740
11156A22178J37403g5881k3206A10686a5141k65181E7935d8140l60427B55201
11145A02628c06114f4978k54636O2471R7852B39725b05921j752G2901a1321A32542
11133A9910M11103i3979f289k18587A68686l5654J206k5971E0842K4522b74027
11121A92648a50381A95751q9535B4104J4941M4532R5001J8320J83957C8358j8535
11110A9823o576Q8659L47769c47132A35729R693j1275b8182j0516B23914q9286
11099A34628B1615J84142q2984J4586P8706k3050b34157B7755J72835K43137A52971
11087C60332M6435j84693J39452j25215h0683m3138a4374A87318L07687k26760
$$ y = [28334, -114277, -49295, 90085, 57896, -217344, -14037, 316033, 34098, 66964, 74438, 122178, 259581, -75881, -99087, 110686, -15141, -280322, 57935, -48140, -408567, 255201, 102628, -306114, -64978, -319614, -257143, -159291, 239725, -205921, -207673, 72901, -11321, 132542, 19910, 431013, -93979, -6289, -224876, 168686, 133032, 134238, 108267, 50842, 75364, -274027, 192648, -150381, 195751, 106216, 24104, 39045, 83577, 178578, 196898, 380855, 38358, 19823, 13247, 101906, 449675, -347132, 135729, 145422, 134147, -28182, -38698, 223914, 134628, 21615, 205757, 122773, 137359, 216065, 193015, -234157, 27755, 200590, 443727, 152971, 360332, 406767, 222074, 361526, 236311, -80683, -123821, -14374, 187318, 495005, 268245]
11077B68245q7578P8423L89849B31596M0874J19898j30653o3879L83309A18308
11066C27136k7412K29897B4676L42056J86100j00990m2060J40406B32309J47794
11056C80103Q7720k4948N57813p9453M3149l28052O1934p9535K31414M6461K56714
11045A153320l32010o2001r1681Q2701M5377C31079L61387K67930k56540L1072
11035G34928L7818k45363K15824r6301J893n4800K77538J12350k30417L6621J22056
11024I12147m8448k77271j36908M57296B19444N27148l25185P5706J09715k35020
11014C71808L73021p7918N13718m00788j7627C49105M6127L12570q762P3226k34104
11003E38162K0884L19699m2819k31352L52368l59115L00439k53205J13708C36556
$$ y = [268245, 180667, 259090, 648939, 231596, 272470, 392368, 261715, 197836, 581145, 118308, 327136, 299724, 529621, 24676, 366732, 552832, 451842, 409782, 550188, 232309, 380103, 467823, 442875, 1000688, 921235, 964384, 636332, 698266, 618731, 850145, 896606, 1153320, 821310, 759309, 667628, 750329, 795706, 331079, 692466, 960396, 703856, 734928, 772746, 527383, 743207, 646906, 648799, 593999, 871537, 983887, 753470, 790091, 912147, 863699, 586428, 449520, 906816, 219444, 746592, 421407, 497113, 606828, 371808, 744829, 666911, 1180629, 779841, 762214, 349105, 395232, 707802, 699040, 772266, 538162, 559046, 878745, 835926, 604574, 956942, 597827, 898266, 645061, 758769, 336556]
10992F01620L00290j96864j00036J8477K45303Q426l8845L04288K13165j76418
10982A179406j84697J70781j1111j1061J67228N15210K6121L3922K13778M76921
10972B576498K09363L81809N198n8080K11339n91976r7906j19039k81994m39377
10962A795835K1253j02483J66695p0336J77430Q9578k1178l75188R446J43364
10952A834416n74689N6796m19325j50274A23036M94051j86895A13551M20779A56985
10941B16802I1582J49805r5825J35930N9897J5241p6827a7945q7966F3194B2384
10929a53140B6966K58067l0453P5568a6855B53535h1172K4289B5811d5916o1262
10918a07178a98A44536J27352j30535a45262B45530o4794b43691R0910L2270C09612
$$ y = [601620, 901910, 705046, 605010, 623487, 868790, 877216, 838371, 1142659, 1355824, 1179406, 994709, 1165490, 1154379, 1143318, 1310546, 1825756, 1851877, 1885799, 2099577, 2576498, 2785861, 3167670, 3172868, 3114788, 3326127, 2734151, 2636245, 2517206, 2235212, 1795835, 1817088, 1714605, 1881300, 1810964, 1988394, 2077972, 2056794, 1681606, 1691052, 1834416, 1259727, 1316523, 897198, 746924, 123036, 617087, 430192, 113551, 534330, 156985, 216802, 91582, 241387, 145562, 281492, 341389, 356630, 279803, -17945, -105911, 63194, 22384, -153140, 26966, 285033, 254580, 330148, -16855, 253535, -81172, -56883, 25811, -45916, -107178, -198, 144536, 271888, 141353, -145262, 245530, 180736, -243691, -152781, -120511, 309612]
10906c4789B64416c7651o34j87559A13123c27621b2851o4098A26807L8325a98609
10894A061L21104a83940q076C4315a6351j79643O385J4273F2026M0386A1278J73674
10882A84952h3558A95199h1314m807A61811d3030C9468g0551F9404D249K8313
10871C2562c6914O408k84598J22242A18054C3401J00693e7309C9879a562A29902
10859A93198B0269b55995N5263B4306L24068j73976A0028c7986A92202p0130c16644
10847E3920g262j10055o4140d0449a4889j03293j6948I0473N5316a28380q1043
10836b09423A74212a5483j59694C37592R0767A4966h3288j11880A66903c51303
10825B0078h9063I6506n266L6786b99964B68541a60211P3972j44431G9444A2098
$$ y = [-34789, 264416, -37651, -38285, -225844, 113123, -327621, -22851, -86949, 126807, 165132, -198609, 1061, 322165, -183940, -192016, 34315, -16351, -195994, -189609, -175336, 62026, 102412, 11278, 184952, -83558, 195199, -81314, -86121, 161811, -43030, 39468, -70551, 69404, 4249, 32562, -36914, -30506, -315104, -192862, 118054, 33401, 134094, -57309, 39879, -1562, 129902, 193198, 20269, -255995, -200732, 24306, 348374, 174398, 10028, -37986, 192202, 122072, -316644, 53920, -7262, -117317, -181457, -40449, -14889, -118182, -135130, 90473, 145789, -128380, -209423, 174212, -15483, -175177, 337592, 428359, 14966, -83288, -195168, 166903, -351303, 20078, -89063, 96506, 91240, 128026, -299964, 268541, -160211, -86239, -230670, 79444, 12098]
10813b83081a40013A01968K06358i5266j14891N6087A72907a7152A23788c11173
10802e386j44876q8804A17234a50579A68934m2276i8893b5461j38304O7286A02088
10790c6117l00183A55601o8495b71157A05609a6271A8911a2355l47229a10069
10779b8441B03786a96496E6883a6626A89468d01886a04778B1017J60053C7004
10768C8696a16270q1427q9333J21883j1882C8006J0971b50512B00623p8155c8869
10756C43281a23708l8394E8195e0513J8709j46269G0809g2952B698J46749c62334
10744A53382e0256A8288J62305d03871a91483b4816n2801B41516a3621c627A70996
10732f282k27923A10367J07413H1966a65581K9855C03626A7993J2433f4647p8067
$$ y = [-283081, -140013, 101968, 308326, -95266, -210157, -154070, 172907, -17152, 123788, -311173, -5386, -150262, -239066, 117234, -150579, 168934, 126658, -98893, -25461, -163765, -96479, 102088, -36117, -336300, 155601, 87106, -271157, 105609, -16271, 18911, -12355, -359584, -110069, -28441, 203786, -196496, 56883, -16626, 189468, -401886, -104778, 21017, 181070, 37004, 38696, -116270, -197697, -287030, -165147, -177029, 38006, 48977, -250512, 200623, 122468, -38869, 343281, -123708, -162102, 58195, -50513, -31804, -178073, 70809, -72952, 2698, 149447, -362334, 153382, -50256, 18288, 180593, -403871, -191483, -24816, -77617, 241516, -13621, -3627, 170996, -6282, -234205, 110367, 217780, 81966, -165581, -135726, 303626, 17993, 30426, -64647, -142714]
10721a42714A58268f1103e379r4648o3528I4044b17742j3238e3842E9717J29009
10710A88726n6471m0666b01649C3959J23961B5686a14208j10429O1416g4595A01325
10698A22019b59004Ec42014R1381H6961f9795q0157c5407A57341J9871p2593E1753
10685h9051A07434a66796g9446B5867a2664l4432n6478C22314a481B28918a07737
10673A98620a19652D5114d25282A09925J32689b26096C65141A50868a10769J2381
10663i8388C3385M5161a14404j1974f1216N181J2626k37562a37548A08784i6644
10651b86623A33617a53141F6941B3039b30553k4035d1362j67721Q0162C4992a65302
10639A99422p1084b47619H3597a82046C24446h2870j12194L4868e8205N841o7626
$$ y = [-142714, 158268, -61103, -5379, -100027, -163555, 94044, -217742, -230980, -53842, 59717, 188726, 132255, 91589, -201649, 33959, 157920, 25686, -114208, -224637, -163221, -74595, 101325, 122019, -259004, 5, -342014, -250633, 86961, -69795, -149952, -35407, 157341, 177212, 104619, 51753, -89051, 107434, -166796, -79446, 25867, -12664, -47096, -103574, 322314, -1481, 228918, -107737, 198620, -119652, 45114, -425282, 109925, 242614, -226096, 365141, 150868, -110769, -98388, 33385, 78546, -114404, -126378, -61216, -56035, -43409, -280971, -137548, 108784, -96644, -286623, 133617, -153141, 66941, 23039, -230553, -254588, -41362, -209083, -128921, 34992, -165302, 199422, 128338, -247619, 83597, -182046, 324446, -82870, -195064, -160196, -58205, -52364, -119990]
10628a19990c6144G3254e8281A91760b39205O8158j68683e6670A42011O2207i9740
10616c09631A5802J6046R0310D9008a39477H463J52007h2569D5940a05525b0867
10604b17677j42795A83703i7914B8923c34499J8152G1440b0813k31908R4725d1014
10592C6091b21941h392B90942a68978E6909a00375j55544a07984J5088A38815
10581H7511F76L7653P9990b49645A85571a3638j60804K8899B98543a31081L8431
10570i2650j27321A01576a81608e9332A0408a31347O330a4477o7721A5233J88436
10559B03669a27273j78026F4608A6623e00916A09412b24813h4311A49523g3817
10548H8843b2587n9831k76002a78702d4690A98086i9014d6220q7175B78577c7770
$$ y = [-119990, -36144, 73254, -58281, 191760, -239205, -171047, -339730, -56670, 142011, 204218, -99740, -309631, 15802, 31848, 122158, 49008, -139477, 8463, 160470, -82569, 45940, -105525, -20867, -217677, -360472, 183703, -97914, 28923, -334499, -316347, 71440, -20813, -252721, -157996, -41014, 36091, -221941, -8392, 290942, -168978, 56909, -100375, -255919, -107984, -92896, 138815, 87511, 676, 38329, 118319, -249645, 185571, -13638, -174442, -145543, 298543, -131081, -92650, -219971, 101576, -181608, -59332, 10408, -131347, -125017, -14477, -82198, 15233, 203669, -127273, -305299, 64608, 16623, -500916, 109412, -224813, -84311, 149523, -73817, 88843, -22587, -82418, -358420, -178702, -44690, 198086, -99014, -46220, -133395, 278577, -37770]
10536b11987a8680B82996d07558b140F1134b9909l05352a03743l92100a44538
10525g315A16691J78817A8699K58766c10741A46413h2715P763p2999F4606K11169
10514B75775a90575B52694a56741c9780o3363j87038R6358A36537b81528A77701
10503A22763h2236j08471A89138B7661J87099a75232A1871a38436D9952J09086
10493A59038b06174j91072e4616G1725a40863A29399a86591d7126A359P6891b49666
10481D5273N02545K44582k50820B64262J14483A55042D7485L38836H1573G607
10470a42390A4891J63524c2851B4935J84992H3930g8400l2707l2271o5254a01111
10458c06446J1027J34386I1093b60193A07939d9958n3414A124i511j56130m933
$$ y = [-211987, -18680, 282996, -407558, -2140, 61134, -29909, -335261, -103743, -495843, -144538, -7315, 116691, 295508, 18699, 277465, -310741, 146413, -82715, -74952, -147951, 64606, 275775, -190575, 252694, -156741, -39780, -103143, -290181, -193823, 136537, -281528, 177701, 122763, -82236, -190707, 189138, 27661, 214760, -175232, 11871, -138436, 49952, 159038, -206174, -397246, -54616, 71725, -140863, 129399, -186591, -47126, 1359, 78250, -249666, 45273, 547818, 792400, 541580, 264262, 378745, 155042, 47485, 386321, 81573, 7607, -142390, 14891, 178415, -32851, 24935, 209927, 83930, -78400, -111107, -143378, -208632, -101111, -306446, -295419, -161033, 91093, -260193, 107939, -49958, -103372, 1124, -9511, -165641, -170574]
10447a70574J3817C2572g1096D2169b82129A73140c9739a9355B33883F6785L2933
10436I9718M6089c46452A26771i3612E0320a1813A94364a98648n88g2840r4255
10425a67095f6950J150j35908j58420A37491b0638j83125A61592a56211J7771
10415a38440j17144E1247p046e56643a64047A79209F0651E879d3166k78648D8655
10403a72106A21378J70086a33987G2062N3978P2053I5583K16176j28087J10371
10393B94043r6365a22765L1992A37379F4068J39944a1225q1440r5707I2635L30233
10382D22868h1473B73903J87448A04527J05947J27850j36360j4240J35108A09769
10371C27760C5915K59149D1474N04081k49149L24300l1208A93237J72994M7372
$$ y = [-170574, -156757, 32572, -71096, 42169, -282129, 173140, -39739, -19355, 233883, 66785, 99718, 145807, -346452, 126771, -93612, 50320, -11813, 194364, -198648, -199236, -72840, -167095, -66950, -65800, -201708, -360128, 137491, -20638, -203763, 161592, -156211, -138440, -255584, 51247, 44201, -556643, -164047, 179209, 60651, 5879, -43166, -321814, 48655, -172106, 121378, 291464, -133987, 72062, 126040, 198093, 95583, 311759, 183672, 294043, 197678, -122765, -90773, 137379, 64068, 204012, -11225, -92665, -188372, 92635, 422868, -81473, 273903, 461351, 104527, 210474, 338324, 201964, 187724, 322832, 109769, 327760, 35915, 295064, 41474, 545555, 296406, 620706, 589498, 193237, 366231, 413603]
10361D13603r1586O4969A30419J41918A13295b2F5276J72174K57574A37194L98755
10350E35949j57260L08115l06374r1975q278L06563h2189C38481J57073j56362
10340C39192H0229K39975K2673G4313O239b901B76078K11997B14023O9875r7384
10329A86514c30925A16824J1117J09124E9961f532A27074K5467L3522K57838A57931
10317f1026C44751F5824d753D6918b17382j7888i108m9264j1757B8124K18952
10306B47076f9844H6558b37252q2162J42315A77176Q6870R876b00599B07939a43184
10294a00316j82898A91342a62074P3418F4945c137F9150D408Q6086C0939b15755
10282d9957j10289e0534K4334r1227j34070Q9217H7406a37803I3110k3244b8855
$$ y = [413603, 322017, 386986, 130419, 272337, 113295, -22, 65276, 237450, 495024, 137194, 535949, 378689, 686804, 380430, 288455, 280177, 586740, -82189, 338481, 495554, 339192, 80229, 320204, 342877, 74313, 80552, -2901, 276078, 488075, 214023, 283898, 186514, -330925, 116824, 127941, 237065, 59961, -6532, 127074, 152541, 186063, 443901, 157931, -61026, 344751, 65824, -4753, 46918, -217382, -235270, -9108, -58372, -70129, 28124, 247076, -69844, 86558, -237252, -319414, -177099, 177176, 264046, 273922, -200599, 207939, -143184, -100316, -283214, 191342, -162074, -88656, 64945, -3137, 69150, 4408, 90494, 30939, -215755, -49957, -160246, -50534, -26200, -117427, -251497, -162280, 87406, -137803, 93110, 69866, -28855]
10270a39150C07209A31132f5193C2957a84189A64926C9658J6625k979b67708B94769
10258D09441j49167J64759G2310L15669b6720A20644J20647D7491O1599a6312
10247b3515C3949f5234j66860C0983e2636k39508B6716P7519J54943a55505K3675
10236a31830E9526J94186a83576d6343A44365a03338I0381c4011A41270b7086
10225A8393a94463A43372P8867c14904d7799o3194k2688F1558f1727F397a52908
10213C2734a0423r6859A1331g1032p5614j46498K7786A72272a86909A207K15515
10202B16722b46387b8966j37193B4070M2768c2463b721l6545j55596O4044k5287
10191a56105p427E8081a47170k11475e5582I9162h3634r7931A8125b60728E9232
$$ y = [-139150, 307209, 131132, -65193, 32957, -184189, 164926, 39658, 56283, 53304, -267708, 294769, 409441, 260274, 425033, 72310, 387979, -26720, 120644, 241291, 47491, 109090, -16312, -23515, 33949, -65234, -232094, 30983, -52636, -292144, 26716, 104235, 259178, -155505, -131830, 59526, 253712, -183576, -46343, 144365, -103338, 90381, -34011, 141270, -27086, 18393, -194463, 143372, 222239, -314904, -47799, -110993, -133681, 61558, -61727, 6397, -152908, 32734, -10423, -107282, 11331, -71032, -146646, -293144, -265358, 172272, -186909, 1207, 216722, -246387, -28966, -166159, 24070, 66838, -32463, -2721, -39266, -194862, -130818, -156105, -163532, 58081, -147170, -358645, -55582, 99162, -83634, -181565, 18125, -260728, 59232]
10179a29082C41505b41748e381j87675f1660K1564A53966c37118D5728a82512
10168A24240O4912G6706b18645L8905j48152a16519N4073l01888P0933a9755H4931
10156a63818A5119b11885i1737J1004k02632k0341a10861C12200H8572a83900
10145a13458j26903C8290d33138A97781e26920b60684j1607D3511K7698l1690
10135C9519b48092B18446b35675L4786h299C10369d987j50909f3664B57293r2611
10124A64682f5802G1953b02549B5195a2375k23213A77078a84127l87858a29525
10113a36080o3594j38721f8228J5311B22624N143i5875l4918g641l7656E1734
10101A83921c30980B36707p3181Q554K4936H3171l9635b4059C50615a65483K6634
$$ y = [-129082, 341505, -241748, -5381, -193056, -61660, -40096, 153966, -337118, 45728, -182512, 124240, 189152, 76706, -218645, -179740, -327892, -116519, -62446, -364334, -293401, -19755, 84931, -163818, 15119, -211885, -91737, -80733, -283365, -303706, -110861, 312200, 88572, -183900, -113458, -240361, 38290, -433138, 197781, -526920, -260684, -272291, 43511, 71209, 39519, -248092, 218446, -235675, -200889, -8299, 310369, -4987, -155896, -63664, 257293, 164682, -65802, 71953, -202549, 25195, -12375, -235588, 177078, -184127, -571985, -129525, -136080, -199674, -338395, -68228, -52917, 222624, 227767, -95875, -130793, -7641, -45297, 51734, 183921, -330980, 236707, 163526, 172080, 197016, 83171, 43536, -24059, 350615, -165483, -138849]
10090a38849k86684a50812J1493l7917D5014D933J10581a17555A02072e65298
10079H44M7836g1159A03774e1689j71068o8345M1021B22653I5111i8352c3298
10067B64247b99274B3628f6765A62035b90629b1264C5827b10424g0577r9525N5889
10056a14213j43313a25368k30548a66320h0964K0153C0812J64652b15847a7364
10045c40579M9416I7240a3033q6762D1128b44713k3608h0436E0869B1065K91194
10034C12259a08723b8705B23176h7366k9335B6e0891A08446J62529a10637J1387
10023i9250D1514a35127A13531E1606a38527p6607H6714g6434j57077A98457R0664
10012B89121f0044I2976j0278d796k11703A32490b18376f5862A0603L7870a4962
$$ y = [-138849, -425533, -150812, -139319, -177236, 45014, 4933, 115514, -117555, 102072, -565298, 844, 48680, -71159, 103774, -51689, -222757, -291102, -250081, 222653, 95111, -98352, -33298, 264247, -299274, 23628, -66765, 162035, -290629, -21264, 35827, -210424, -70577, -170102, -114213, -257526, -125368, -355916, -166320, -80964, -60811, 30812, 195464, -215847, -17364, -340579, -291163, 97240, -13033, -99795, 41128, -244713, -268321, -80436, 50869, 21065, 312259, -108723, -28705, 223176, -87366, -116701, 26, -50891, 108446, 270975, -110637, -99250, 41514, -135127, 113531, 51606, -138527, -215134, 86714, -76434, -233511, 198457, 289121, -60044, 92976, 82698, -4796, -216499, 132490, -218376, -65862, 10603, 48473, -14962]
10000a747r2539c1506k33763A85329o6813a93383B91334A8115N8344b58976E7679
9988A59666b62095A41395F4676f6931A64229c7124p2294j39714B4404A332h5132
9976I3199C0022f640k39005k0873A53731b12916C07714b67863k02657A8384b31757
9964a78194Q0777K677A32536B4252b61254M3929M4731l6904d2245B12579l1744
9953A80835h5806A74228D6984O4135b96009g24j65026B7799B929f5882q9225e3044
9940A20199J47346j05646a70278g1060K4783j07263I464a51757J5682k54429J48032
9929b42472d6302q604l7155j77346b4506A3124O4715b24552K7660f4730j56007
9918b20737o1842a30036k6092e1932A8011J25563a67548m1092C2942b78833J7920
$$ y = [-1747, -94286, -31506, -265269, 185329, 118516, -193383, 291334, 18115, 76459, -258976, 57679, 159666, -262095, 141395, 64676, -66931, 164229, -37124, -109418, -249132, 24404, 1332, -85132, 93199, 30022, -6640, -245645, -266518, 153731, -212916, 307714, -267863, -470520, 18384, -231757, -178194, -97417, -94740, 132536, 24252, -261254, -217325, -172594, -209498, -42245, 212579, 180835, -85806, 174228, 46984, 111119, -296009, -724, -165750, 27799, 2929, -65882, -155107, -53044, 120199, 267545, 161899, -170278, -71060, -46277, -153540, 9464, -151757, -136075, -390504, -242472, -46302, -54906, -92061, -269407, -24506, 13124, 77839, -224552, -196892, -64730, -220737, -282579, -130036, -156128, -51932, 18011, 143574, -167548, -208640, 32942, -278833, -260913]
9907b60913e789o6258C1339A1529d3441J7421m5571i651C5337g2783A40306b9805
9894e2795D7601b09173n9649M8957A65608a03094j0400F5511i6353k26780d1154
9882A45319e2871j5032B41808c31746J43987A48281a85705A95931f7385n6337
9872a23722B9288M7939a20731b0867E8901b08885b7504R175k50672F7587c9733
9860B73257a76392L4725r204c2474B91968m4129a78980B54731B0215e55575J88753
9849c66822d6426C8388M9683K41016a56885j00239J6867E3227J01870o7928b84328
9837b4529H0526h1982j33197e2045j94657Q799q5370J856A39623c08359g1271
9825c37568B56577f4222a0177j27589D5064L0496K61601a70176O5707d0992l40719
$$ y = [-260913, -5789, -72047, 31339, 11529, -43441, -26020, -71591, -9651, 35337, -72783, 140306, -29805, -52795, 47601, -209173, -268822, -219865, 165608, -103094, -113494, 65511, -96353, -323133, -41154, 145319, -52871, -67903, 241808, -331746, -187759, 148281, -185705, 195931, -67385, -123722, 29288, 77227, -120731, -20867, 58901, -208885, -27504, -18329, -269001, 67587, -39733, 273257, -176392, -141667, -150871, -32474, 291968, 247839, -178980, 254731, 20215, -555575, -366822, -46426, 38388, 88071, 329087, -156885, -257124, -240257, 53227, 155097, 87169, -284328, -24529, 80526, -81982, -215179, -52045, -246702, -237903, -323273, -321417, 139623, -308359, -71271, -337568, 256577, -64222, -10177, -137766, 45064, 75560, 337161, -170176, -104469, -40992, -381711]
9814c81711e5351b5439C2614N7567i7087F5850a59901F408c6054k7582q8847e1124
9801F4178a8797H9326R1069a72080j09894J12741L2679A71034E3517A5281b27889
9789B1679a21097B00891b79723f7105O526r47k3955q879j47207B38347c20520
9777b5095j80000f594l30569R4606c2856g155K17B32954i4115C3694g1067a2780
9764A63237b72472J18040a4325l6497k78199J7340A676b51889B7990a72308j00590
9753b72898L7132J12684q3725R2292k6800b4308G0093a69313l36096J74598j9367
9742c50178m749J64595c0370j21931k28406a22339b7003A97841f8078p829I4557
9730G3947i841j4348p0824k16538o0372a825A09404b84227P9009h546A58201F5953
$$ y = [-381711, -55351, -25439, 32614, 90181, -97087, 65850, -159901, 6408, -36054, -63636, -152483, -51124, 64178, -18797, 89326, 180395, -172080, -281974, -169233, -136554, 171034, 53517, 15281, -227889, 21679, -121097, 200891, -279723, -67105, -60579, -61526, -85481, -94360, -241567, 238347, -320520, -25095, -205095, -6594, -337163, -242557, -32856, -7155, -6938, 232954, -94115, 33694, -71067, -12780, 163237, -272472, -154432, -14325, -50822, -329021, -311681, 1676, -251889, 27990, -172308, -272898, -235766, -123082, -206807, -114515, -141315, -24308, 70093, -169313, -505409, -330811, -350178, -354927, -190332, -30370, -152301, -380707, -122339, -27003, 197841, -68078, -75907, 94557, 73947, -9841, -24189, -95013, -311551, -371923, -1825, 109404, -284227, -205218, -8546, 158201, 65953]
9717A20182a33563k47372h5037G0939A2609a9707A71503a32625d2681l05235A45573
9705a1116k11280i690n4752A20548f2916A9824c22830C8884a9060C26719h9035
9693a14961d3017a2200A54036A878a94726G3720a51688D7377F467e4639j10190
9682a64829O396k68011B52660j01910b4491k38773G3149d6323a5386k02157E9681
9670b23576J2009A14391a48641j08591J23972B9543c33193c4824B415c971F024
9658e256k28822o172A84160a13757A24018a19694B59803I5847d7496a8247j33252
9647a51499j73229H547a16038c8808O460j55886j43945G3151B2328f2849C52436
9635a88258k6310a06127n2685g431k7256j02587j45937G1134a84989P2671C68420
$$ y = [120182, -133563, -380935, -85037, 70939, 12609, -19707, 171503, -132625, -42681, -347916, 145573, -11116, -222396, -9690, -64442, 120548, -62916, 19824, -322830, 38884, -19060, 326719, -89035, -114961, -43017, -12200, 154036, 1878, -194726, 73720, -151688, 47377, 6467, -54639, -164829, -158433, -426444, 252660, 150750, -24491, -263264, 73149, -46323, -15386, -217543, 59681, -223576, -211567, 114391, -148641, -257232, -133260, 29543, -333193, -34824, 2415, -3971, 6024, -5256, -234078, -240250, 184160, -113757, 124018, -119694, 259803, 95847, -47496, -18247, -151499, -324728, 8547, -116038, -38808, -32348, -188234, -332179, 73151, 22328, -62849, 352436, -188258, -214568, -106127, -158812, -7431, -34687, -137274, -283211, 71134, -184989, -112318, 368420]
9623D3267a40512M5991A61006p1920J10646b46692L1925B61031j01715G171b6192
9611I722R6600A8515L7158O6817a0274j9511k01329e3725q085B28202d9412A26261
9598i5709J5520r1547Q1154B2559J74937j6736a69865D2820c0298l66260H2606
9586A22823R1765a75465K9361A112K10721A04987J61196h6747j74743h8085j33297
9575b21382c4234B23844a28461c9460B52182a80527q6917j1409A33608a82868
9564b71959A17523g5456A37431a59148a8245l70731B6460a47987I375a48894O8578
9553h0316A42085f0255p9751j25409B86262A02079B2839B071c4324A85507b79423
9541a52960j51136J33356q4315J09816p685d1297m2789A32050f7998c1180p6671
$$ y = [43267, -140512, -94521, 161006, 89086, 199732, -246692, -214767, 261031, 159316, 7171, -26192, 9722, 106322, 18515, 55673, 122490, -10274, -29785, -231114, -53725, -61810, 228202, -49412, 126261, -95709, -80189, -171736, -90582, 22559, 197496, 180760, -169865, 42820, -30298, -396558, 82606, 122823, 214588, -175465, -146104, 1112, 211833, 104987, 266183, -86747, -261490, -88085, -221382, -34234, 223844, -128461, -39460, 252182, -180527, -267444, -278853, 133608, -182868, -271959, 117523, -75456, 137431, -159148, -18245, -388976, 26460, -147987, 9375, -148894, -80316, 142085, -60255, -140006, -265415, 286262, 102079, 22839, 2071, -34324, 185507, -279423, -152960, -304096, -170740, -255055, -145239, -152924, -41297, -84086, 132050, -67998, -31180, -107851]
9530a07851o4667I1147a23643J7901r3911k34676D0504a14146D5934L9b1227A99629
9517G3680c079A44930c68360J26996i9223k75865a68928B52419a44690B4951J08084
9506A33035e1881j25960g6305A17083Q1485h3659b0234k28867A66214F3248c2305
9494b1003l27821f6309j45589A13482h9926k06378J35225A09683e23659B379J07550
9483A09929B9515b42828I9017c77064h8766B34539c3087O574k509k3045o7518
9472a19585r4565a6124a209j53076E491a44494N5079k2942k00670c5957j66307
9461b02264B30059a78933L9516M0737I6627a24027q1550R1571A3003o07K40310
9450B52706f1033I069J9030J00853J87702c44726A02700f3181k61193a54306D4547
$$ y = [-107851, -172518, 91147, -123643, -105742, -199653, -434329, 40504, -114146, 45934, 45973, -21227, 199629, 73680, -3079, 144930, -368360, -241364, -99223, -375088, -168928, 252419, -144690, 24951, 133035, -51881, -177841, -76305, 117083, 198568, -83659, -20234, -249101, 166214, 63248, -32305, -21003, -348824, -66309, -211898, 113482, -89926, -296304, -161079, 109683, -523659, 2379, 109929, 29515, -242828, 99017, -377064, -88766, 234539, -33087, -26513, -29022, -52067, -119585, -214150, -16124, -1209, -154285, 5491, -144494, -89415, -112357, -313027, -35957, -202264, 230059, -178933, -139417, -98680, 96627, -124027, -205577, -114006, 13003, 12396, 252706, -61033, 9069, 28099, 128952, 316654, -344726, 102700, -63181, -324374, -154306, 44547]
9438D4754a51365B5646c257A71252C4797b2134k78002A88243f0111n1590G8403
9426b12620j50640C4182b78571M5038F9729a84923f2894N301A46898l0403J8692
9415A35187k8609a8454m1491e068C7587m434h1665J2734B16071a60408B94885
9403H0267H409L2037b06919h8567n1788k4842b7399k6412O927B00713b29442A19889
9390B47025d2134j28361J9860e4382I0111J77844a07584j40077C9045b83024A64184
9378E1877c24675n3895c2488q1572j9733B65199a54252b3570J0944H5355a25614
9366d38886J35758P6534L3986M5119G2448N0981b70027C6850K3551a87532A08317
9354b00104N7855M4049c9645b451j73850A70008f81k82749D35382a37394p1589
$$ y = [44754, -151365, 25646, -3257, 171252, 34797, -22134, -300136, 188243, -60111, -111701, 78403, -212620, -363260, 34182, -278571, -233533, 69729, -184923, -62894, -57593, 146898, 116495, 135187, 106578, -18454, -59945, -5068, 37587, 33153, -81665, -68931, 216071, -160408, 294885, 80267, 8409, 40446, -206919, -88567, -140355, -165197, -27399, -53811, -46884, 200713, -229442, 119889, 247025, -42134, -170495, -150635, -54382, 90111, 267955, -107584, -247661, 39045, -283024, 164184, 51877, -324675, -378570, -32488, -114060, -133793, 265199, -154252, -23570, -12626, 85355, -125614, -438886, -303128, -226594, -192608, -147489, 72448, 123429, -270027, 36850, 60401, -187532, 108317, -200104, -142249, -98200, -39645, -2451, -176301, 170008, -681, -283430, 435382, -137394, -208983]
9343b08983M1521m7787K3165B5227b57102A97252a15990G5742b87715h1022G0842
9331E7692a60156o3418M0085B29987a46796l9645A76030m3867a0774k44499J13806
9320a41467j55054a38989A9868g3182C02433b14758i0232p9456A91532b09083
9309e8644l71111i4138G2991i2517R58j730j28644p0542H2722O8398a77855N7992
9297a19863j22083Q1598A07875D2629J28680a01751r1419h339r9760A15874d10917
9285c66696D9314J61320d00k59933J10138A34293N3965c72209a35047M4255G1545
9273B11689B1990K00018A1059b6599A32385L7445a8194A9346M3006a51302F5569
9261C08135a55899L0241q7867e0304o7284p1157J3579A80111b9836k26013p7272
$$ y = [-208983, -167462, -215249, -192084, 25227, -257102, 197252, -115990, 75742, -287715, -81022, 70842, 57692, -160156, -223574, -183489, 229987, -146796, -186441, 176030, 132163, -10774, -255273, -141467, -296521, -138989, 19868, -73182, 302433, -214758, -90232, -169688, 191532, -209083, -58644, -429755, -94138, 72991, -92517, -91559, -93289, -221933, -292475, 82722, 151120, -177855, -119863, -241946, -160348, 107875, 42629, 171309, -101751, -193170, -8339, -108099, 115874, -410917, -366696, 49314, 210634, -400, -260333, -150195, 134293, 188258, -372209, -135047, -90792, 71545, 211689, 21990, 222008, 11059, -26599, 132385, 169830, -18194, 19346, 62352, -151302, 65569, 308135, -155899, -125658, -213525, -50304, -117588, -188745, -175166, 180111, -29836, -255849, -333121]
9250c33121k3915a71019M9383m9450B15789a59349C1526J44576c14162c8106A75030
9238E8369b18618q7052p8504A24606a15134A54067I645c83169a8671j77229A37806
9226a93429Q2386M2026E22561c98484C9458O8494J27912b5148k32172j10684b506
9214f0819l9212D45178c39372B7296b85231d3131H7524b7621k89644c5768j6735
9203e2503H1771O4785d01732b5792k23135Q124a07756m2556m1364G176c33569
9191a15581A65064b84034j04601A39950i04D1780a61005A61695a02718M2498B58201
9179a66198a7707A87069N9547c7904j59073j65096M2127J54357j24917A17443
9168C22155j56104g7098r4488A24228b46371g3586I4641a7289A71050a99363j687
$$ y = [-333121, -357036, -171019, -121636, -171086, 215789, -159349, 31526, 176102, -314162, -38106, 175030, 58369, -218618, -305670, -384174, 124606, -115134, 154067, 9645, -383169, -18671, -195900, 137806, -193429, -111043, -69017, 522561, -398484, 39458, 107952, 235864, -25148, -257320, -368004, -2506, -60819, -100031, 445178, -339372, 27296, -285231, -43131, 87524, -27621, -317265, -35768, -52503, 81771, 146556, -401732, -25792, -248927, -240803, -107756, -150312, -191676, 7176, -333569, -115581, 165064, -284034, -388635, 139950, -904, 41780, -161005, 161695, -102718, -60220, 258201, -166198, -17707, 187069, 246616, -37904, -196977, -362073, -319946, -165589, -290506, 117443, 322155, 166051, -77098, -171586, 124228, -246371, -73586, 94641, -17289, 171050, -199363, -201050]
9157b01050O3886A00922J34227j04452a11849m4524J7503A10030a25182N0816
9147g4366c0439p8211d0825F5546a23309I0178a54048K0486C40627I9097q813
9136I0284i3073k03259B14032i035B0869e2610j76737J5767c7146A60424f879
9124b27990A45782k3556h2273I559b9664j89133N4231O768j23407h892o3427j57019
9112b29338b9115j05784e8412l07659j13911a50423A13037a33528h918k50408
9102b59326h5599j0199l4063A66451f1385K7067r3329I0686B5394C245a22768
9090a06162b4848j70034L7270C26102d09821J7100E0047M246b09967l4338F1615
9078a92985E7928a97417F3988a76952j15446f2387k12970B8169d9518b0333A22190
$$ y = [-201050, -137164, 100922, 235149, 130697, -111849, -156373, -138870, 110030, -125182, -74366, -30439, -108650, -40825, 65546, -123309, 90178, -154048, -133562, 340627, 99097, 90284, -93073, -296332, 214032, -9035, 20869, -52610, -229347, -213580, -37146, 160424, -6879, -227990, 145782, 122226, -82273, 9559, -29664, -218797, -164566, -157798, -281205, -8892, -72319, -229338, -29115, -134899, -58412, -366071, -479982, -150423, 113037, -133528, -8918, -259326, -85599, -95798, -129861, 166451, -61385, -34318, -127647, 90686, 25394, 3245, -122768, -106162, -24848, -194882, -157612, 326102, -409821, -392721, 50047, 54293, -209967, -244305, 61615, -192985, 57928, -197417, 63988, -176952, -292398, -62387, -275357, 28169, -49518, -20333, 122190]
9066B17627j5350c46491O643a68287O9018f421D013J92121c36082P3125L5911
9055b27046P783A5918a68898M5060o3999m6644e0685B60483a37742e6612A89360
9043e9764j90505F946g3990A18529a3898G8618B8755c25738A1277c70890A8272
9031c69250E6884a25924n2869p0731a17961F638K5777L511a58512q790O6855B0736
9018b38074d4627b014j58142k44826A38910c10930i0451A59939a67963H4385a74927
9006A95933C0351b0793F6330c02185D38076a54104j42556A14796a46005D1810
8995B343b70426B408e3413A54545l7148J41634r4899P7139a83926k02354A08271
8983A92758a62152C9680h3424r4012A80077b1538k26362C990L3835c67593a52931
$$ y = [217627, 202277, -346491, -339848, -168287, -99269, -6421, 4013, 196134, -336082, -262957, -227046, -219263, 15918, -168898, -123838, -187837, -234481, -50685, 260483, -137742, -56612, 189360, -59764, -250269, 6946, -73990, 118529, -13898, 78618, 28755, -325738, 11277, -370890, 18272, -369250, 56884, -125924, -178793, -249524, -117961, 6638, 32415, 35926, -158512, -167302, -100447, 20736, -238074, -44627, -2014, -160156, -404982, 138910, -310930, -90451, 159939, -167963, 84385, -174927, 195933, 30351, -20793, 66330, -302185, 438076, -154104, -296660, 114796, -146005, 41810, 2343, -270426, 2408, -53413, 154545, 117397, 259031, 164132, 241271, -183926, -386280, 108271, 192758, -162152, 39680, -83424, -177436, 180077, -21538, -247900, 3990, 37825, -367593, -152931]
8971A93511a86740A45040a5112I1703a56292e3582p6663L8052j63289B339J04459
8960A06798a53490a4701A10101b90054H1922J136B6464b41572d2123l11978J31683
8949b22418i5256J5181j39808B22869O3624A09256a15212M8830m3225p1003L6122
8938a44488F819a92469a5147C04959K26417b12850A23088b14705j1545A4995L09848
8927C24843E1196K63703J76017O87269O14870L426108Q944118D828585A032177
8917C64525j53797q1264b89186k776A90238a97199K9764J9432B05408j3680Q9535
8906B81263D6893b50724g9250c7508J862j58954e9151k48957A3935Q5592P5762
8895A75289a45488c6834n9565b9402o6726C7349b949k23664f8706b6903l83050
$$ y = [193511, -186740, 145040, -15112, 91703, -156292, -53582, -130245, -92193, -255482, 2339, 106798, -153490, -14701, 110101, -290054, 81922, 83058, 26464, -241572, -42123, -354101, -222418, -95256, -80075, -219883, 222869, 286493, 109256, -115212, -66382, -109607, -180610, -144488, 6819, -192469, -15147, 304959, 531376, -212850, 123088, -214705, -226250, 14995, 324843, 51196, 314899, 490916, 1178185, 1793055, 5219163, 14163281, 4828585, 1032177, 364525, 210728, 129464, -289186, -291962, 190238, -197199, -167435, -148003, 205408, 191728, 281263, 46893, -250724, -79250, -37508, -35646, -194600, -59151, -308108, 13935, 99527, 175289, -145488, -36834, -96399, -29402, -96128, 37349, -2949, -226613, -68706, -26903, -409953]
8884d09953a63718A69612a1257q8871G1821b22169k03968Q3857D3533j5680J68945
8873A96798a48306k9958E7299M8205a14373l1600p4115Q2369j49911A05915J7729
8862A23644n8842a1328m77414e1763I2301m3114a14685o6309D2155a15975B31858
8850a44432n3897g9617k58740K2897C33211c8355k09721A5392b15360Q0935A20393
8838a9841j31014A1549a67682j08893H238f7721n8706C15090a50593b9854j79575
$$ y = [-409953, -163718, 169612, -11257, -100128, 71821, -222169, -426137, -342280, 43533, 27853, 196798, -148306, -178264, 57299, 105504, -114373, -145973, -220088, -137719, -287630, 105915, 123644, 64802, -11328, -488742, -51763, 92301, 49187, -114685, -180994, 42155, -115975, 231858, -144432, -198329, -79617, -338357, -315460, 333211, -38355, -248076, 15392, -215360, -134425, 120393, -19841, -150855, 11549, -167682, -276575, 8238, -67721, -126427, 315090, -150593, -29854, -209429]
$$ [...]
##END NTUPLES=NMR SPECTRUM
##END=
