
##TITLE=UV1279_M1_1242-1388_20_7534535_fD28k16YJs
##JCAMPDX= 6.0         $$ Bruker NMR JCAMP-DX V2.0
##DATA TYPE= NMR SPECTRUM
##DATA CLASS= NTUPLES
##ORIGIN= BRUKER
##OWNER= Administrator
$$ 1.72 TOPSPIN		Version 2.1
$$ 2013-02-22 02:52:05.315 -0500  Administrator@X
$$ Compression mode = diff/dup
##.OBSERVE FREQUENCY= 400.02188249412
##.OBSERVE NUCLEUS= ^1H
##.ACQUISITION MODE= SIMULTANEOUS (DQD)
##.ACQUISITION SCHEME= undefined
##.AVERAGES= 64
##.DIGITISER RES= 22
##SPECTROMETER/DATA SYSTEM= spect
##.PULSE SEQUENCE= noesygpps1d.comp
##.SOLVENT NAME= COFFEE_meoh
##.SHIFT REFERENCE= INTERNAL, COFFEE_meoh, 1, 14.96122
##AUDIT TRAIL= $$ (NUMBER, WHEN, WHO, WHERE, PROCESS, VERSION, WHAT)
$$ ##TITLE= Audit trail, TOPSPIN		Version 2.1
$$ ##JCAMPDX= 5.01
$$ ##ORIGIN= Bruker BioSpin GmbH
$$ ##OWNER= Administrator
$$ $$ E:\/data/COFFEE/nmr/UV1279_M1_1242-1388_20_7534535_fD28k16YJs/12/pdata/1/auditp.txt
$$ ##AUDIT TRAIL=  $$ (NUMBER, WHEN, WHO, WHERE, PROCESS, VERSION, WHAT)
(   1,<2013-02-22 02:51:58.762 -0500>,<Administrator>,<X>,<go>,<TOPSPIN 2.1>,
      <created by zg
	started at 2013-02-22 02:40:29.029 -0500,
	POWCHK enabled, PULCHK disabled,
       configuration hash MD5:
       86 BA 57 50 F2 9D 5C 9B 26 00 A9 28 5F 66 2E 89
       data hash MD5: 64K
       FD BC C9 77 72 63 89 E1 D2 33 6D F7 35 40 D9 C8>)
(   2,<2013-02-22 02:52:02.080 -0500>,<Administrator>,<X>,<proc1d>,<TOPSPIN 2.1>,
      <Start of raw data processing
       efp LB = 0.3 FT_mod = 6 PKNL = 1 PHC0 = 0 PHC1 = 0 SI = 128K 
       data hash MD5: 128K
       9D A6 04 66 EB 36 DA B7 8A C5 D8 0D 0E C1 BC B0>)
(   3,<2013-02-22 02:52:03.428 -0500>,<Administrator>,<X>,<proc1d>,<TOPSPIN 2.1>,
      <pk PHC0 = 249.6698 PHC1 = 0 
       data hash MD5: 128K
       02 43 AD 62 13 88 CD F9 77 88 D0 D0 6C 93 F7 E5>)
(   4,<2013-02-22 02:52:04.186 -0500>,<Administrator>,<X>,<proc1d>,<TOPSPIN 2.1>,
      <abs ABSG = 1 
       data hash MD5: 128K
       F0 85 E6 41 00 4F 37 45 D6 C1 1D AE 95 FE 65 05>)
(   5,<2013-02-22 02:52:04.405 -0500>,<Administrator>,<X>,<proc1d>,<TOPSPIN 2.1>,
      <abs ABSG = 2 
       data hash MD5: 128K
       73 AC 2C A3 20 31 86 25 32 F1 7E 3D 37 38 F0 AC>)
(   6,<2013-02-22 02:52:04.675 -0500>,<Administrator>,<X>,<proc1d>,<TOPSPIN 2.1>,
      <abs ABSG = 3 
       data hash MD5: 128K
       F3 5F 17 CC B6 E8 30 1F 12 AB 93 81 B3 F4 ED 6F>)
(   7,<2013-02-22 02:52:04.826 -0500>,<Administrator>,<X>,<proc1d>,<TOPSPIN 2.1>,
      <abs ABSG = 4 
       data hash MD5: 128K
       B3 D7 A8 85 5C 0D EF 6B D8 F7 C5 C0 FB F0 38 10>)
(   8,<2013-02-22 02:52:04.978 -0500>,<Administrator>,<X>,<proc1d>,<TOPSPIN 2.1>,
      <abs ABSG = 5 
       data hash MD5: 128K
       BA 3A 6D 36 F3 BB 6B BC B7 04 6F EA 04 4E 96 25>)
$$ ##END=
$$ 
$$ $$ hash MD5
$$ $$ FA A5 F9 53 AE 3C 0A 09 2E B5 5E 90 9E 6A 65 C9
##$RELAX= 
##$RELAX= 
##$RELAX= 
##$RELAX= 
##$RELAX= 
##$RELAX= 
##$RELAX= 
##$RELAX= 
$$ Bruker specific parameters
$$ --------------------------
##$DU= <E:\>
##$EXPNO= 12
$$ [...]
150 150 150 150 150 150 150 150
##$TP07= 0
##$TPNAME0= <>
##$TPNAME1= <>
##$TPNAME2= <>
##$TPNAME3= <>
##$TPNAME4= <>
##$TPNAME5= <>
##$TPNAME6= <>
##$TPNAME7= <>
##$TPOAL= (0..7)
0.5 0.5 0.5 0.5 0.5 0.5 0.5 0.5
##$TPOFFS= (0..7)
0 0 0 0 0 0 0 0
##$TUNHIN= 0
##$TUNHOUT= 0
##$TUNXOUT= 0
##$USERA1= <user>
##$USERA2= <user>
##$USERA3= <user>
##$USERA4= <user>
##$USERA5= <user>
##$V9= 5
##$VALIST= <valist>
##$VCLIST= <CCCCCCCCCCCCCCC>
##$VD= 0
##$VDLIST= <DDDDDDDDDDDDDDD>
##$VPLIST= <PPPPPPPPPPPPPPP>
##$VTLIST= <TTTTTTTTTTTTTTT>
##$WBST= 1024
##$WBSW= 4
##$XGAIN= (0..3)
0 0 0 0
##$XL= 0
##$YL= 0
##$YMAX_a= 5876500
##$YMIN_a= -11246160
##$ZGOPTNS= <>
##$ZL1= 120
##$ZL2= 120
##$ZL3= 120
##$ZL4= 120
##$ABSF1= 14.96122
##$ABSF2= -5.596962
##$ABSG= 5
##$ABSL= 3
##$ALPHA= 0
##$AQORDER= 0
##$ASSFAC= 0
##$ASSFACI= 0
##$ASSFACX= 0
##$ASSWID= 0
##$AUNMP= <proc_prof1d_extract.lims>
##$AXLEFT= 0
##$AXNAME= <>
##$AXNUC= <1H>
##$AXRIGHT= 0
##$AXTYPE= 0
##$AXUNIT= <>
##$AZFE= 0.1
##$AZFW= 0.1
##$BCFW= 0
##$BC_mod= 0
##$BYTORDP= 0
##$COROFFS= 0
##$CY= 15
##$DATMOD= 1
##$DC= 0
##$DFILT= <>
##$DTYPP= 0
##$F1P= 0
##$F2P= 0
##$FCOR= 0.5
##$FTSIZE= 131072
##$FT_mod= 6
##$GAMMA= 0
##$GB= 0
##$INTBC= 1
##$INTSCL= 1
##$ISEN= 128
##$LB= 0.3
##$LEV0= 0
##$LPBIN= 0
##$MAXI= 10000
##$MC2= 0
##$MEAN= 0
##$ME_mod= 0
##$MI= 0
##$NCOEF= 0
##$NC_proc= -2
##$NLEV= 6
##$NOISF1= 0
##$NOISF2= 0
##$NSP= 0
##$NTH_PI= 0
##$NZP= 0
##$OFFSET= 14.96122
##$PC= 1
##$PHC0= 249.6698
##$PHC1= 0
##$PH_mod= 1
##$PKNL= yes
##$PPARMOD= 0
##$PPDIAG= 0
##$PPIPTYP= 0
##$PPMPNUM= 2147483647
##$PPRESOL= 1
##$PSCAL= 4
##$PSIGN= 0
##$PYNMP= <proc.py>
##$REVERSE= no
##$SF= 400.020009548503
##$SI= 131072
##$SIGF1= 0
##$SIGF2= 0
##$SINO= 400
##$SIOLD= 131072
##$SPECTYP= <>
##$SREGLST= <1H.CDCl3>
##$SSB= 0
##$STSI= 131072
##$STSR= 0
##$SW_p= 8223.68421052631
##$SYMM= 0
##$S_DEV= 0
##$TDeff= 65536
##$TDoff= 0
##$TI= <>
##$TILT= no
##$TM1= 0
##$TM2= 0
##$TOPLEV= 0
##$USERP1= <user>
##$USERP2= <user>
##$USERP3= <user>
##$USERP4= <user>
##$USERP5= <user>
##$WDW= 1
##$XDIM= 131072
##$YMAX_p= 385298691
##$YMIN_p= -13388
##$CURPLOT= <Network HP LaserJet P1505>
##$CURPRIN= <$Network HP LaserJet P1505>
##$DFORMAT= <normdp>
##$LAYOUT= <+/1D_H.xwp>
##$LFORMAT= <normlp>
##$PFORMAT= <normpl>
##$SURQMSG= 1
$$ End of Bruker specific parameters
$$ ---------------------------------
##NTUPLES= NMR SPECTRUM
##VAR_NAME=  FREQUENCY,     SPECTRUM/REAL,   SPECTRUM/IMAG
##SYMBOL=    X,             R,               I
##VAR_TYPE=  INDEPENDENT,   DEPENDENT,       DEPENDENT
##VAR_FORM=  AFFN,          ASDF,            ASDF
##VAR_DIM=   131072,        131072,          131072
##UNITS=     HZ,            ARBITRARY UNITS, ARBITRARY UNITS
##FACTOR=    0.0627417313425164, 1,          1
##FIRST=     8223.62146879497, 4835,         -64679
##LAST=      0,             6347,            -63892
##MIN=       0,             -13388,          0
##MAX=       8223.62146879497, 385298691,    0
$$ Real data points
##PAGE= N=1
##DATA TABLE= (X++(R..R)), XYDATA
$$ [...]
61641E12012K515K376K442K605K461J728O89k9j61j88q74k482m370n400m950l585
$$ 512012 514527 516903 519345 521950 524411 526139 526828 526799 526638 526450 525576 523094 518724 513324 508374 504789
61625E04789k555k510k907k851k128j184m06J23L69L28K13K02Q5m91j419k205
$$ 504789 502234 499724 496817 493966 491838 490654 490248 490371 490740 491068 491281 491483 491568 491077 489658 487453
61609D87453k672l193m067n068n787o161o426o751p003o869o152n101m340m293
$$ 487453 484781 481588 477521 472453 466666 460505 454079 447328 440325 433456 427304 422203 417863 413570
61595D13570m672m814m437l805l202k686k396k595l201l626l440k940k690k686
$$ 413570 408898 404084 399647 395842 392640 389954 387558 384963 381762 378136 374696 371756 369066 366380
61581C66380k370j503o53n80j277j869j652j021j040k037l039k933j881j034r97
$$ 366380 364010 362507 361854 361274 359997 358128 356476 355455 354415 352378 349339 346406 344525 343491 342494
61566C42494j250j170r33r40r80n67J39M16j5n68n40P4P11R35Q23P64R66J194
$$ 342494 341244 340074 339141 338201 337221 336654 336793 337209 337194 336626 336086 336160 336871 337806 338629 339393 340359 341553
61548C41553J044N15J65N20J372J937J719J016N01N46J080J884K764L501L913
$$ 341553 342597 343112 343277 343797 345169 347106 348825 349841 350342 350888 351968 353852 356616 360117 364030
61533C64030L961L726L225K480J715J158O07m46k042l396l782l562l715m424m840
$$ 364030 367991 371717 374942 377422 379137 380295 380902 380456 378414 375018 371236 367674 363959 359535 354695
61518C54695m395l630l268l131k661j958j478j093m01K52P9p13r69l45Q4m52j136
$$ 354695 350300 346670 343402 340271 337610 335652 334174 333081 332680 332932 333011 332298 331329 330984 331068 330616 329480
61501C29480q36J09N21J84r3J4o5o39j182j181p48j23O81J471J756J441J057Q90
$$ 329480 328644 328753 329274 329458 329365 329379 329314 328675 327493 326312 325564 325441 326122 327593 329349 330790 331847 332737
61483C32737N27k85r07o11K40N68J3n85k93Q72K090K637K418J812J195O69K40
$$ 332737 333264 332979 332072 331461 331701 332269 332282 331697 331404 332276 334366 337003 339421 341233 342428 343097 343337
61466C43337J18N36J208J389P26k19o23l35J26L55L88M26O08J050J654J945J540
$$ 343337 343455 343991 345199 346588 347314 347095 346472 346137 346263 346618 347006 347432 348040 349090 350744 352689 354229
61449C54229P58L32M18M44P0k38pM43N06L18N99J552K513K843K681K626K981L568
$$ 354229 354987 355319 355737 356181 356251 356013 356006 356449 356955 357273 357872 359424 361937 364780 367461 370087 373068 376636
61431C76636M033M095L671K937K201J536P72m3m05J00J069J576J252P15P88J577
$$ 376636 380669 384764 388435 391372 393573 395109 395881 395838 395433 395533 396602 398178 399430 400145 400933 402510
61415D02510K461K849K597J838P65l81j318j904k242k518k853l287l817m284m371
$$ 402510 404971 407820 410417 412255 413020 412639 411321 409417 407175 404657 401804 398517 394700 390416 386045
61400C86045l863k938k082j605j372j088p63o98r78j232j099o79l07o5J96M36
$$ 386045 382182 379244 377162 375557 374185 373097 372334 371636 370658 369426 368327 367648 367341 367276 367472 367908
61384C67908N11O20J113J739J720R86N99J372K508K558J442N34P55J584K214K663
$$ 367908 368419 369039 370152 371891 373611 374597 375196 376568 379076 381634 383076 383610 384365 385949 388163 390826
61368C90826L168L363K878K179J969K108K003J716J831K333K640K724L238M241
$$ 390826 393994 397357 400235 402414 404383 406491 408494 410210 412041 414374 417014 419738 422976 427217
61354D27217M842M655M757O295Q695J0255J0409J0363J1298J2757J3362J2573
$$ 427217 432059 436714 441471 447766 456461 466716 477125 487488 498786 511543 524905 537478
61342E37478J1084R715Q597P518O391N101L349J233l77o72o6J24o98j803k408
$$ 537478 548562 558277 566874 574392 580783 585884 589233 590466 590089 589417 589351 589475 588777 586974 584566
61327E84566k843l869n304o154n875m863l754k967k839l429m067l860k847j966
$$ 584566 581723 577854 572550 566396 560521 555658 551904 548937 546098 542669 538602 534742 531895 529929
61313E29929j625j062M01K241L491M114M819N900P045Q050Q988R767J0210J0520
$$ 529929 528304 527242 527643 529884 533375 537489 542308 548208 555253 563303 572291 582058 592268 602788
61299F02788J0999J1241J0335Q016N020K112o59l470o073q046r260r712r266p998
$$ 602788 613787 625028 635363 643379 648399 650511 649852 646382 640309 632263 623003 613291 604025 596027
61285E96027o535n609n320n196m853m264l522k642j601l23J294L116M652N519
$$ 596027 589492 583883 578563 573367 568514 564250 560728 558086 556485 556162 557456 560572 565224 570743
61271E70743N968O613P624Q498Q747Q471Q123P998Q094Q281Q391Q348Q420R216
$$ 570743 576711 583324 590948 599446 608193 616664 624787 632785 640879 649160 657551 665899 674319 683535
61257F83535J1029J3261J4807J5128J4648J3974J2963J0916P580L631N4k729m918
$$ 683535 694564 707825 722632 737760 752408 766382 779345 790261 797841 801472 801526 798797 793879
61244G93879o718p963q484q576q859r622j0444j0650r987q743p228n513l755k529
$$ 793879 787161 779198 770714 762138 753279 743657 733213 722563 712576 703833 696605 691092 687337 684808
61230F84808k348k963l424l019j879o26L21R40J394J876K504L129L397L187K819
$$ 684808 682460 679497 676073 673054 671175 670549 670870 671810 673204 675080 677584 680713 684110 687297 690116
61215F90116K610K388J829J134R36J521K501L337L873M118L969L342K488J883
$$ 690116 692726 695114 696943 698077 699013 700534 703035 706372 710245 714363 718332 721674 724162 726045
61201G26045J919K820M627P047R480J1482J3174J5037J7314J9776K2066K4012
$$ 726045 727964 730784 735411 742458 751938 763420 776594 791631 808945 828721 850787 874799
61189H74799K5528K6333K5968K4197K1328J8013J4699J1412Q131N140K828J276
$$ 874799 900327 926660 952628 976825 998153 1016166 1030865 1042277 1050408 1055548 1058376 1059652
61177A059652L33r9k67r08k747n501p959r404j0425j1961j3974j5712j6906j7982
$$ 1059652 1059985 1059886 1059619 1058711 1055964 1050463 1042504 1033100 1022675 1010714 996740 981028 964122 946140
61163I46140j9191k0201k0672k0611k0122j9276j8367j7684j6909j5287j2706
$$ 946140 926949 906748 886076 865465 845343 826067 807700 790016 773107 757820 745114
61152G45114j0040q062o514m738k751r99N22K109L393L433K006R3j299k278l561
$$ 745114 735074 727012 720498 715760 713009 712010 712532 714641 718034 721467 723473 723566 722267 719989 716428
61137G16428n276o803p611p667p015n520l230o89J486L224M999P271R975J2622
$$ 716428 711152 704349 696738 689071 682056 676536 673306 672617 674103 677327 682326 689597 699572 712194
61123G12194J4788J6496J8082J9704K1194K2479K3940K5954K8155K9653L0144
$$ 712194 726982 743478 761560 781264 802458 824937 848877 874831 902986 932639 962783
61112I62783L0351L0971L1550L1023K9158K6819K4711K2529J9734J6618J4027
$$ 962783 993134 1024105 1055655 1086678 1115836 1142655 1167366 1189895 1209629 1226247 1240274
61101A240274J2190J0328P505L489j269o247j1299j6534k1803k6468k9844l1989
$$ 1240274 1252464 1262792 1270297 1273786 1272517 1266270 1254971 1238437 1216634 1190166 1160322 1128333
61089A128333l3658l5251l6160l5568l3738l1923l0958l0392k9158k6790k3752
$$ 1128333 1094675 1059424 1023264 987696 953958 922035 891077 860685 831527 804737 780985
61078G80985k0885j8729j7176j5651j3733j1672j0052q967p837o210m384l027
$$ 780985 760100 741371 724195 708544 694811 683139 673087 664120 656283 650073 645689 642662
61066F42662k422k273k066j350KJ511K341K185J758K013L069M307N432O799Q603
$$ 642662 640240 637967 635901 634551 634553 636064 638405 640590 642348 644361 647430 651737 657169 663968 672571
61051F72571J0333J1479J2335J3625J5415J7022J8095J9283K1426K4288K6647
$$ 672571 682904 694383 706718 720343 735758 752780 770875 790158 811584 835872 862519
61040H62519K7669K7734K7689K7751K7613K7252K7009K6909K6610K6115K5947
$$ 862519 890188 917922 945611 973362 1000975 1028227 1055236 1082145 1108755 1134870 1160817
61029A160817K6319K6661K6359K5611K5202K5741K7365K9797L2319L4096L4969
$$ 1160817 1187136 1213797 1240156 1265767 1290969 1316710 1344075 1373872 1406191 1440287 1475256
61018A475256L5645L6837L8722M1598M6469N4226O4773P7666R2990J10643J29303
$$ 1475256 1510901 1547738 1586460 1628058 1674527 1728753 1793526 1871192 1964182 2074825 2204128
61007B204128J47517J65806J86626K12487K45490K88591L45420M18140N06786
$$ 2204128 2351645 2517451 2704077 2916564 3162054 3450645 3796065 4214205 4720991
60998D720991O10989P30738Q65260J014098J180780J371327J582562J788917J941827
$$ 4720991 5331980 6062718 6927978 7942076 9122856 10494183 12076745 13865662 15807489
60989A5807489J984318J871081J586383J158392O63896K10751j03224k32781k00870
$$ 15807489 17791807 19662888 21249271 22407663 23071559 23282310 23179086 22946305 22745435
60980B2745435q1463L1327M9303q9073l97603q29366j289321j674316j916311
$$ 22745435 22663972 22695299 22744602 22655529 22257926 21428560 20139239 18464923 16548612
60971A6548612k000060j949836j804720j602677j376380j152126r47575p71026
$$ 16548612 14548552 12598716 10793996 9191319 7814939 6662813 5715238 4944212
60963D944212o24083n04864m09554l33573k73262k26444j90950j63594j41313
$$ 4944212 4320129 3815265 3405711 3072138 2798876 2572432 2381482 2217888 2076575
60954B076575j22764j07890r6308q6908p8662p1012o3590n6262m9473m3944m0000
$$ 2076575 1953811 1845921 1749613 1662705 1584043 1513031 1449441 1393179 1343706 1299762 1259762
60943A259762l7547l6482l6586l7156l7398l7238l7168l7229l6706l4981l2240
$$ 1259762 1222215 1185733 1149147 1111991 1074593 1037355 1000187 962958 926252 891271 859031
60932H59031k9172k6381k4176k2565k1205j9697j8048j6521j5013j3076j0715
$$ 859031 829859 803478 779302 756737 735532 715835 697787 681266 666253 653177 642462
60921F42462q658p449o726n798m688l996l962m065l633k483r08O33J772K413K732
$$ 642462 633804 626355 619629 613831 609143 605147 601185 597120 593487 591004 590096 590729 592501 594914 597646
60906E97646K916K892K536K055J843J880J554L37j514l172m050m241m184m190
$$ 597646 600562 603454 605990 608045 609888 611768 613322 613659 612145 608973 604923 600682 596498 592308
60892E92308m453n167o336p446p806p313o675o574o779o437n195l686k800k826
$$ 592308 587855 582688 576352 568906 561100 553787 547112 540538 533759 527322 522127 518441 515641 512815
60878E12815l381l945m138l743k861j962j562j799k408k973k986j936J81K512
$$ 512815 509434 505489 501351 497608 494747 492785 491223 489424 487016 484043 481057 479121 479302 481814
60864D81814L991M494M874N714O564O779O599O800P497Q031Q007P802P821P812
$$ 481814 485805 490299 495173 500887 507451 514230 520829 527629 535126 543157 551164 558966 566787 574599
60850E74599P289O289N255M459L883L546L587L925M161L860K823J095j061l200
$$ 574599 581888 588177 593432 597891 601774 605320 608907 612832 616993 620853 623676 624771 623710 620510
60836F20510m895o020o785p411p883p973p514o620n665n004m686m570m563m595
$$ 620510 615615 609595 602810 595399 587516 579543 572029 565409 559744 554740 550054 545484 540921 536326
60822E36326m402l719k815k490l168m216m559l860k751j986j726j673j487j015
$$ 536326 531924 528205 525390 522900 519732 515516 510957 507097 504346 502360 500634 498961 497474 496459
60808D96459l82L7j7l14k98L18J295K225K919L419L862M331M702M698M328M112
$$ 496459 496077 496114 496097 495783 495485 495803 497098 499323 502242 505661 509523 513854 518556 523254 527582 531694
60792E31694M567N528O402O995P569Q164Q476Q561Q925R703J0323J0407J0438
$$ 531694 536261 541789 548191 555186 562755 570919 579395 587956 596881 606584 616907 627314 637752
60779F37752J1022J1946J2526J2556J2360J2146J1873J1596J1446J1346J1177
$$ 637752 648774 660720 673246 685802 698162 710308 722181 733777 745223 756569 767746
60768G67746J1080J1245J1542J1763J2005J2329J2340J1761J1222J1677J2953
$$ 767746 778826 790071 801613 813376 825381 837710 850050 861811 873033 884710 897663
60757H97663J3632J2602J0207P598N534M105L073J997M04j671l513m525m994n758
$$ 897663 911295 923897 934104 941702 947236 951341 954414 956411 956815 955144 951631 947106 942112 936354
60743I36354p177q781r988j0793j1701j3083j4724j6056j6730j6914j6978j6990
$$ 936354 929177 920396 910408 899615 887914 874831 860107 844051 827321 810407 793429 776439
60731G76439j6700j5969j4994j4052j3230j2431j1540j0523r486q602p845o946
$$ 776439 759739 743770 728776 714724 701494 689063 677523 667000 657514 648912 641067 634121
60719F34121n823m919m741n159n535n610n679n763n283l973k702k699m060n618
$$ 634121 628298 623379 618638 613479 607944 602334 596655 590892 585609 581636 578934 576235 572175 566557
60705E66557o297o126n829n828n964n936n688n415n437n987o911p558p227n926
$$ 566557 560260 554134 548305 542477 536513 530577 524889 519474 514037 508050 501139 493581 486354 480428
60691D80428m545m025m424m915m749l913k908k167j833j773j584q84J15O15K07
$$ 480428 475883 471858 467434 462519 457770 453857 450949 448782 446949 445176 443592 442708 442823 443438 443645
60676D43645m38l67L58Q25O73N30Q72J204R33M16M60J116J610J460R39M46jm64
$$ 443645 443207 442840 443198 444023 444696 445226 446098 447302 448235 448651 449111 450227 451837 453297 454236 454682 454681 454217
60658D54217p90q88r41j016p54J54J420K506L392M448N546N935N300M427M230
$$ 454217 453427 452539 451598 450582 449828 449982 451402 453908 457300 461748 467294 473229 478529 482956 487186
60643D87186M497M223L055J710Q71M23r4q61j907l166m055l675k019l87Q7j86
$$ 487186 491683 495906 498961 500671 501542 501965 501871 501010 499103 495937 491882 488207 486188 485801 485888 485702
60627D85702j43K15K6q16j456j536j658k199k660k704k808l325l678l210k271
$$ 485702 485559 485774 485800 484984 483528 481992 480334 478135 475475 472771 469963 466638 462960 459750 457479
60612D57479j751j942k414k676k492j913j400j501j941j656k36J194J270J28r75
$$ 457479 455728 453786 451372 448696 446204 444291 442891 441390 439449 437793 437557 438751 440021 440149 439174
60597D39174j382j449j458j147l87M14Q69R51P73N47P88J784K840K838J730P26
$$ 439174 437792 436343 434885 433738 433351 433765 434634 435585 436358 436905 437693 439477 442317 445155 446885 447611
60581D47611O51Q91N10k57m40J53P08O73N03Q88J772K543K976L488M460N673O674
$$ 447611 448262 449153 449663 449406 448966 449119 449827 450500 451003 451891 453663 456206 459182 462670 467130 472803 479477
60564D79477P524Q727J0385J1870J2617J2821J2996J3029J2237J0272P452M218
$$ 479477 487001 495728 506113 517983 530600 543421 556417 569446 581683 591955 599407 603625
60552F03625P31k758n637p316p623o698m795k428l54R73J828K785M007N227O396
$$ 603625 604356 601598 595961 588645 581022 574324 569529 567101 566747 567720 569548 572333 576340 581567 587963
60537E87963P858R844J2004J3705J4670J5085J5105J4455J2756J0095P031L984
$$ 587963 595821 605665 617669 631374 646044 661129 676234 690689 703445 713540 720571 724555
60525G24555R04k319n330p528q638q827q383p556o689o018n314m054k236o58j02
$$ 724555 725459 723140 717810 710282 701644 692817 684434 676878 670189 664171 658857 654803 652567 651909 651807
60510F51807l72m38M56K076L553M270M313M258M706N992Q155J0994J4177J7432
$$ 651807 651435 650997 651453 653529 657082 661352 665665 669923 674629 680621 688776 699770 713947 731379
60496G31379K0682K3988K7368L0785L4405L8528M3112M7343M9953N0086M7801
$$ 731379 752061 776049 803417 834202 868607 907135 950247 997590 1047543 1097629 1145430
60485A145430M3716L8273L1359K2610J1941j80j2876k5176l6214m5262n1786n5511
$$ 1145430 1189146 1227419 1258778 1281388 1293329 1293149 1280273 1255097 1218883 1173621 1121835 1066324
60473A066324n6475n5053n1950m7973m3645l9143l4721l0869k7799k5024k1973
$$ 1066324 1009849 954796 902846 854873 811228 772085 737364 706495 678696 653672 631699
60462F31699j8937j6719j5364j3966j1976j0022q895q297p296n694m278l778m067
$$ 631699 612762 596043 580679 566713 554737 544715 535820 527523 520227 514533 510255 506477 502410
60449E02410m458m340l549k423j496r69o05l09m72j431k821l905m318m115l385
$$ 502410 497952 493612 490063 487640 486144 485175 484570 484261 483789 482358 479537 475632 471314 467199 463814
60434D63814k321j463j280j529j547j067l39L50Q08P75K24k89k15J91K82J17L41
$$ 463814 461493 460030 458750 457221 455674 454607 454268 454618 455426 456201 456425 456136 455921 456112 456394 456511 456852
60417D56852J030J477J301R81J004J225J369J469J482J115M66J82N66J056J053
$$ 456852 457882 459359 460660 461641 462645 463870 465239 466708 468190 469305 469771 469953 470519 471575 472628
60402D72628P26N50N39M83M80P04J074J565K489L832M742M324K806J365R47J605
$$ 472628 473354 473904 474443 474926 475406 476110 477184 478749 481238 485070 489812 494136 496942 498307 499254 500859
60386E00859K792L766L932L271K365J673J109N85M95J080J784J958J938K540L614
$$ 500859 503651 507417 511349 514620 516985 518658 519767 520352 520847 521927 523711 525669 527607 530147 533761
60371E33761M033L231J943J132R27Q91P21K89m23j027q27K65J359J565J151J097
$$ 533761 537794 541025 542968 544100 545027 545918 546639 546928 546505 545478 544651 544916 546275 547840 548991 550088
60355E50088J744K428K516K247K333L091M197N108N508N458N371N797O993Q582
$$ 550088 551832 554260 556776 559023 561356 564447 568644 573752 579260 584718 590089 595886 602879 611461
60341F11461R800J0206J0027R679R019P406M536R92k304m983p262r227j0470j0633
$$ 611461 621261 631467 641494 651173 660192 667598 672134 673126 670822 665839 658577 649350 638880 628247
60327F28247j0046r465r241r014q295p118n958n119m463l711k775j799j062q45
$$ 628247 618201 608736 599495 590481 582186 575068 569110 563991 559528 555817 553042 551243 550181 549336
60313E49336j095j195m04J227K737L400L676M574O290Q128R638J1172J3125J5296
$$ 549336 548241 547046 546642 547869 550606 554006 557682 562256 568546 576674 586312 597484 610609 625905
60299F25905J7321J9212K0936K1842K1142J8821J5556J1750P180J771l639p697
$$ 625905 643226 662438 683374 705216 726358 745179 760735 772485 779665 781436 777797 770100
60287G70100r688j0076r969j0173j0805j1603j2331j2894j3310j3674j4036j4235
$$ 770100 760412 750336 740367 730194 719389 707786 695455 682561 669251 655577 641541 627306
60275F27306j4001j3308j2422j1531j0575r561q667p829o677n161l826l012k272
$$ 627306 613305 599997 587575 576044 565469 555908 547241 539412 532735 527574 523748 520736 518464
60262E18464j208m07o62j539j733q83k6o5o69r74o53J19J010J536J321P35O39
$$ 518464 517256 516849 516187 514648 512915 512032 512006 511941 511272 510298 509645 509764 510774 512310 513631 514366 515005
60245E15005J229J723J491P77J5p55j348j206l28L54K25q7K77J160J943K624L405
$$ 515005 516234 517957 519448 520225 520240 519485 518137 516931 516603 516957 517182 517095 517372 518532 520475 523099 526504
60228E26504L820L353K583K605L526M463M867M947M859M432L757L285L283L733
$$ 526504 530324 533677 536260 538865 542391 546854 551721 556668 561527 565959 569716 573001 576284 580017
60214E80017M629N790O623O784O783P151P371O639N391M897N380N716N233M564
$$ 580017 584646 590436 597059 603843 610626 617777 625148 631787 637178 642075 647455 653171 658404 662968
60200F62968M369M310L797K922K019J050l9r21j364j602j783j598r93o67j322
$$ 662968 667337 671647 675444 678366 680385 681435 681396 680475 679111 677509 675726 674128 673135 672468 671146
60185F71146k673l746l935l458k970l067l878m842n096m319l109k334k204k157
$$ 671146 668473 664727 660792 657334 654364 651297 647419 642577 637481 633162 630053 627719 625515 623358
60171F23358j579n55J13j78r36r65J57J482J979J830J807J882J451N55j74o62
$$ 623358 621779 621224 621337 621159 620223 619258 619415 620897 622876 624706 626513 628395 629846 630401 630227 629565
60155F29565j359k081k017j057l2N92J156J730J775J355J482K639L974M641M940
$$ 629565 628206 626125 624108 623051 623019 623611 624767 626497 628272 629627 631109 633748 637722 642363 647303
60140F47303N369N606N347N269O033P057P354P039O908P036O877O414N987N263
$$ 647303 652672 658278 663625 668894 674927 681984 689338 696377 703285 710321 717198 723612 729599 734862
60126G34862L516J004j062k029k469l060l674l813l408k749k093j548j133q07
$$ 734862 738378 739382 738320 736291 733822 730762 727088 723275 719867 717118 715025 713477 712344 711537
60112G11537n55m37m17l79m65j047k091k957l204l175l347l542l445l372l794
$$ 711537 710982 710545 710128 709749 709284 708237 706146 703189 699985 696810 693463 689921 686476 683104 679310
60097F79310m237l615j624Q25K636L417L458L376L859N102O453P064O883O578
$$ 679310 675073 671458 669834 670659 673295 676712 680170 683546 687405 692507 698960 706024 712907 719485
60083G19485O603O837P072P260P192O496N074L197J158q94k882m925p327j0005
$$ 719485 726088 732925 739997 747257 754449 760945 766019 769216 770374 769480 766598 761673 754346 744341
60069G44341j2167j3079j2965j2608j2220j1395j0024q567p415o634o273o332
$$ 744341 732174 719095 706130 693522 681302 669907 659883 651316 643901 637267 630994 624662
60057F24662o384n941n193m708m494m029l212k504k067j578r77n16M4J303L029
$$ 624662 618278 612337 607144 602436 597942 593913 590701 588197 586130 584552 583575 583059 583103 584406 587435
60042E87435M145M353M665N677O346N456L536K091J448O63o39j628j773j836k713
$$ 587435 591580 595933 600598 606275 612621 618077 621613 623704 625152 625815 625176 623548 621775 619939 617226
60027F17226l971m429l959l885n339p737r452r738r366r246r120q205o658n497
$$ 617226 613255 608826 604867 600982 595643 587906 578454 568716 559350 550104 540984 532779 526121 520624
60013E20624n194n130m600l618k514j369k91L67N15O49J258K171K885L234L406
$$ 520624 515430 510300 505700 502082 499568 498199 497908 498275 498790 499439 500697 502868 505753 508987 512393
59998E12393L611M018M749N615O172O334O559P061P287O671N568M878M864M904
$$ 512393 516004 520022 524771 530386 536558 542892 549451 556512 563799 570470 576038 580916 585780 590684
59984E90684M399L464K641K242K008J339p4j789l027l627m183n018n587n342m736
$$ 590684 595083 598547 601188 603430 605438 606777 606703 604914 601887 598260 594077 589059 583472 578130 573394
59969E73394m676n199n396m608l066j321K86J504K083K194K452L173L870L832
$$ 573394 568718 563519 558123 553515 550449 549128 549414 550918 553001 555195 557647 560820 564690 568522
59955E68522L085K372K196K203J664M61p21j206j102r84j022q87m66j41j69l26
$$ 568522 571607 573979 576175 578378 580042 580503 579782 578576 577474 576490 575468 574581 574115 573974 573805 573479
59939E73479n62j402l118m808n093l799k272j845k459l118l225l044k935k622
$$ 573479 572917 571515 568397 563589 558496 554697 552425 550580 548121 545003 541778 538734 535799 533177
59925E33177j570lR84O75k05l01N82J234Q73L14P18J926K927L498M263N347O015
$$ 533177 531607 531604 532588 533263 533058 532757 533339 534573 535446 535760 536478 538404 541331 544829 549092 554439 560454
59908E60454N912N585N519N428M975M413M014L507K691K086K289L026L474L339
$$ 560454 566366 571951 577470 582898 587873 592286 596300 599807 602498 604584 606873 609899 613373 616712
59894F16712L050L005L207L587M140M672M812M467L950L574L303K939K508K287
$$ 616712 619762 622767 625974 629561 633701 638373 643185 647652 651602 655176 658479 661418 663926 666213
59880F66213K492K976L320L258L002K935L011K706J683L02p97j440k011k933m168
$$ 666213 668705 671681 675001 678259 681261 684196 687207 689913 691596 691898 691101 689661 687650 684717 680549
59865F80549n279n833n807n661n901o468o740o228n136m131l642l501l155k103
$$ 680549 675270 669437 663630 657969 652068 645600 638860 632632 627496 623365 619723 616222 613067 610964
59851F10964l92J311K319K697L177M195N427O445P371Q427R283R392Q789P955
$$ 610964 610572 611883 614202 616899 620076 624271 629698 636143 643514 651941 661224 670616 679405 687360
59837F87360O969N437L332J359K77K45R33J835K345J942N86j296l350n526p709
$$ 687360 694329 699766 703098 704457 704734 704979 705912 707747 710092 712034 712620 711324 707974 702448 694739
59822F94739r556j0871j1817j2488j2646j2147j1299j0454r499q147o529n160
$$ 694739 685183 674312 662495 650007 637361 625214 613915 603461 593962 585815 579286 574126
59810E74126m415m275m406m235l235j580k36L6l14k03N99J170P33m09j518k344
$$ 574126 569711 565436 561030 556795 553560 551980 551744 551780 551466 551263 551862 553032 553765 553356 551838 549494
59794E49494k938l044k383j430j171j942l013l475l187k591k028j573j323j306
$$ 549494 546556 543512 541129 539699 538528 536586 533573 530098 526911 524320 522292 520719 519396 518090
59780E18090j242q31l50m31j056j293m51Q46J419J116R67J640K476K555K101K232
$$ 518090 516848 516017 515667 515236 514180 512887 512436 513282 514701 515817 516784 518424 520900 523455 525556 527788
59764E27788L431M882N439M861L961L687M235M986N295N203N228N488N516N083
$$ 527788 531219 536101 541540 546401 550362 554049 558284 563270 568565 573768 578996 584484 590000 595083
59750E95083M757N133N832N920N209M513M498M838M738L915K774J923J705J970
$$ 595083 599840 604973 610805 616725 621934 626447 630945 635783 640521 644436 647210 649133 650838 652808
59736F52808K146J789J129P60P52N01k48q20m38O96J645J895J710J450J094N37
$$ 652808 654954 656743 657872 658632 659384 659885 659637 658817 658379 659075 660720 662615 664325 665775 666869 667406
59720F67406j5k09N2N40R55J180J345J590J850J949J966K243K913L628L993M045
$$ 667406 667391 667182 667234 667774 668729 669909 671254 672844 674694 676643 678609 680852 683765 687393 691386 695431
59704F95431M025L961L732L433L259L121K784K325K106K241K478K669K878K993
$$ 695431 699456 703417 707149 710582 713841 716962 719746 722071 724177 726418 728896 731565 734443 737436
59690G37436K582J470L4j232k244l097l667l839l863m063m277m014l232k519k343
$$ 737436 740018 741488 741522 740290 738046 734949 731282 727443 723580 719517 715240 711226 707994 705475 703132
59675G03132k520k698k982l692m647n189m994m464m165m179m288m499m968n523
$$ 703132 700612 697914 694932 691240 686593 681404 676410 671946 667781 663602 659314 654815 649847 644324
59661F44324n676n158m160k944j593k40P79J273J463J642J761J657J479J518J709
$$ 644324 638648 633490 629330 626386 624793 624553 625332 626605 628068 629710 631471 633128 634607 636125 637834
59646F37834J613R62j26j459l002m631n980o679o689o238n562m763l867k869j797
$$ 637834 639447 640409 640283 638824 635822 631191 625211 618532 611843 605605 600043 595280 591413 588544 586747
59631E86747p21K73J088J525J258J83j263k321k623k465k302k174j835j234o39
$$ 586747 586026 586299 587387 588912 590170 590353 589090 586769 584146 581681 579379 577205 575370 574136 573497
59616E73497k67j41l31r86j973k639k372j324l37j5j19K6P44J791K643K862K299
$$ 573497 573230 573089 572758 571772 569799 567160 564788 563464 563127 563112 562993 563019 563763 565554 568197 571059 573358
59599E73358J290N11K87K07l02j131j636j572j315j114p32n6N12O41N94P20Q21
$$ 573358 574648 575159 575446 575653 575351 574220 572584 571012 569697 568583 567851 567795 568307 568948 569542 570262 571083
59582E71083N38K6l33o89j544k880m069m677m853m834m531l851l034k374j875
$$ 571083 571621 571647 571314 570625 569081 566201 562132 557455 552602 547768 543237 539386 536352 533978 532103
59567E32103j386r93r64j356j783j664p79M41J347J762K018K287K269J822J456
$$ 532103 530717 529724 528760 527404 525621 523957 523178 523619 524966 526728 528746 531033 533302 535124 536580
59552E36580J720K367K652K351K001K131K748L532M172M491M606M982N941P234
$$ 536580 538300 540667 543319 545670 547671 549802 552550 556082 560254 564745 569351 574333 580274 587508
59538E87508Q498J0026J2519J6021J9539K1823K2039J9867J5592J0316N470J840
$$ 587508 596006 606032 618551 634572 654111 675934 697973 717840 733432 743748 749218 751058
59526G51058n85j805j554j6J919L477M584N236M957L382Q79j944m938q048j0671
$$ 751058 750473 748668 747114 747098 749017 752494 757078 762314 767271 770653 771532 769588 764650 756602 745931
59511G45931j2140j2677j3139j3792j3998j3226j1862j0717j0080r536q579p211
$$ 745931 733791 721114 707975 694183 680185 666959 655097 644380 634300 624764 616185 608974
59499F08974n870m910m248l596k860k194j682j220o61J04J107K104K560K263J810
$$ 608974 603104 598194 593946 590350 587490 585296 583614 582394 581733 581837 582944 585048 587608 589871 591681
59484E91681K015K856L652M226N112O438P482P816Q132R218J0771J1852J2087
$$ 591681 593696 596552 600204 604430 609542 615980 623462 631278 639410 648628 659399 671251 683338
59471F83338J1645J0502Q564O278M305K641Q09j131k438k591j766l62J416L396
$$ 683338 694983 705485 714049 720327 724632 727273 728082 726951 724513 721922 720156 719794 721210 724606
59457G24606N426P606J0106J2694J4833J6275J7176J7642J7612J7239J6862J6469
$$ 724606 730032 737638 747744 760438 775271 791546 808722 826364 843976 861215 878077 894546
59445H94546J5627J4041J1779Q790M638r51p467j3709j8451k1044k1664k0989
$$ 894546 910173 924214 935993 944783 949421 948470 941003 927294 908843 887799 866135 845146
59433H45146j9536j7413j4824j2537j1371j1277j1292j0474q570n889k952k04
$$ 845146 825610 808197 793373 780836 769465 758188 746896 736422 727852 721963 719011 718807
59421G18807K292M932Q074J1498J4569J6835J8162J8570J8400J8414J9125K0086
$$ 718807 721099 726031 734105 745603 760172 777007 795169 813739 832139 850553 869678 889764
59409H89764K0310J9133J6101J0443J834q270j7123k2851k5408k5234k2197j6427
$$ 889764 910074 929207 945308 955751 957585 949315 932192 909341 883933 858699 836502 820075
59397H20075r251k411K912N648M388j337r664j7463k2811k5665k6441k5134k2048
$$ 820075 810824 808413 811325 816973 821361 820024 810360 792897 770086 744421 717980 692846 670798
59384F70798j8309j4994j2248r655p093m840l155k041j305o00L64J518K482K981
$$ 670798 652489 637495 625247 615592 608499 603659 600504 598463 597158 596558 596922 598440 600922 603903
59370F03903L082K972K769K651K891L577M460N170N557N795O289P349Q867J0232
$$ 603903 606985 609957 612726 615377 618268 621845 626305 631475 637032 642827 649116 656465 665332 675564
59356F75564J0915J1091J1465J2507J4150J6191J8507K0749K2347K3131K3623
$$ 675564 686479 697570 709035 721542 735692 751883 770390 791139 813486 836617 860240
59345H60240K4251K4701K4436K3556K2552K1257J8818J4804R821M731j94m989
$$ 860240 884491 909192 933628 957184 979736 1000993 1019811 1034615 1044436 1049167 1048973 1043984
59333A043984r388j3032j6045j8839k1369k3107k3723k3439k2669k1697k0661
$$ 1043984 1034596 1021564 1005519 986680 965311 942204 918481 895042 872373 850676 830015
59322H30015j9452j7629j4993j2346j1039j1360j1909j1103q961o808n507m708
$$ 830015 810563 792934 777941 765595 754556 743196 731287 720184 711223 704415 698908 694200
59310F94200l812k875k226j773j116j49Q84J781K636L635M820O009O920P487Q093
$$ 694200 690388 687513 685287 683514 682398 682249 683133 684914 687550 691185 696005 702014 708934 716421 724514
59295G24514R375J1598J4261J6353J6973J5685J2544Q014K875j988n877q455r714
$$ 724514 733889 745487 759748 776101 793074 808759 821303 829317 832192 830204 824327 815872 806158
59282H06158r817q961p317n065k451J79K499M448O360Q625J1135J3148J4029J3977
$$ 806158 796341 787380 780063 774998 772547 772726 775225 779673 786033 794658 805793 818941 832970 846947
59268H46947J3728J3464J2591J0724Q399O315M232J300k579o466r530j1910j4057
$$ 846947 860675 874139 886730 897454 905853 912168 916400 917700 915121 908655 899125 887215 873158
59255H73158j5780j6497j6229j5709j5393j4858j3470j1403r528q363p480o201
$$ 873158 857378 840881 824652 808943 793550 778692 765222 753819 744291 735928 728448 722247
59243G22247m492k887j632l85J297L462N784P710Q543P906O330M951M287L649
$$ 722247 717755 714868 713236 712851 714148 717610 723394 731104 739647 747553 753883 758834 763121 766770
59229G66770K127k53k763m987p008q820j0186j1072j1661j1928j1688j1058j0395
$$ 766770 768897 768644 765881 760894 753886 745066 734880 723808 712147 700219 688531 677473 667078
59216F67078r762q911p806o717n766m868m100l650l239k259o78P20J271J195J108
$$ 667078 657316 648405 640599 633882 628116 623248 619148 615498 612259 610000 609322 610042 611313 612508 613616
59201F13616J230J450J847K682L985N418O519O946O712O281O204O549O883O903
$$ 613616 614846 616296 618143 620825 624810 630228 636747 643693 650405 656686 662890 669439 676322 683225
59187F83225O771O673O533O338O334O597O659N995M634L093J878J289J418K032
$$ 683225 689996 696669 703202 709540 715874 722471 729130 735125 739759 742852 744730 746019 747437 749469
59173G49469K624K929L239M010N315O846Q260R292R752R744R643R557R075P804
$$ 749469 752093 755022 758261 762271 767586 774432 782692 791984 801736 811480 821123 830680 839755 847559
59159H47559N898L739J343j373l996n882o998q050r559j1275j2601j3273j3383
$$ 847559 853457 857196 858539 857166 853170 847288 840290 832240 822681 811406 798805 785532 772149
59146G72149j3039j2281j1169r727p973o172m902m468m373l783k626j792j894
$$ 772149 759110 746829 735660 725933 717960 711788 706886 702418 698045 694262 691636 689844 687950
59133F87950k279j871p75j94o14j003k69J201K306K915L821N291O731P813Q885
$$ 687950 685671 683800 683025 682831 682217 681214 680945 682146 684452 687367 691188 696479 703210 711023 719908
59118G19908J0044J0777J0884J0968J1475J2052J2267J2328J2435J2169J1215
$$ 719908 729952 740729 751613 762581 774056 786108 798375 810703 823138 835307 846522
59107H46522J0130R596R344Q618P375O183N139L776K045N39m40j380k843m648
$$ 846522 856652 866248 875592 884210 891585 897768 902907 906683 908728 909267 908827 907447 904604 899956
59093H99956o048o447n869m895m137l658l052k239j852k512l981n492o705p844
$$ 899956 893908 887461 881592 876697 872560 868902 865850 863611 861759 859247 855266 849774 843069 835225
59079H35225r076j0231j1089j1516j1424j0971j0635j0662j0652j0097r093p987
$$ 835225 826149 815918 804829 793313 781889 770918 760283 749621 738969 728872 719779 711792
59067G11792o694n108l943m107n247n835n094l926l605m211m849m856m248l415
$$ 711792 705098 699990 696047 691940 686693 680858 675764 671838 668233 664022 659173 654317 650069 646654
59053F46654k808k668k761k665k472k715l339l415k350q41N5L27P34J472J970
$$ 646654 643846 641178 638417 635752 633280 630565 627226 623811 621461 620620 620675 621002 621736 623208 625178
59038F25178J998K080K602L225L518L661M077M752N400O026O868P863Q701R402
$$ 625178 627176 629256 631858 635083 638601 642262 646339 651091 656491 662517 669385 677248 685949 695351
59024F95351J0354J1695J3006J3942J4716J5554J5970J5198J3258J0951Q690O044
$$ 695351 705705 717400 730406 744348 759064 774618 790588 805786 819044 829995 838685 844729
59012H44729K751m20k458l372l999m639m646l476j553J87J321K172L278M775O300
$$ 844729 847480 847060 844602 841230 837231 832592 827946 824470 822917 823104 824425 826597 829875 834650 840950
58997H40950P368P818P820P412O362M676K997K000J491N68j312l788o146p945
$$ 840950 848318 856136 863956 871368 877730 882406 885403 887403 888894 889462 888150 884362 878216 870271
58983H70271r124r845j0399j0859j0777r599p407m957k839j047O47K379M329O614
$$ 870271 861147 851302 840903 830044 819267 809668 802261 797304 794465 793418 794065 796444 800773 807387
58969H07387Q851J0390J1247J2187J3593J4881J5441J5535J5607J5349J4168J2223
$$ 807387 816238 826628 837875 850062 863655 878536 893977 909512 925119 940468 954636 966859
58957I66859J0115P816M748Q71l172o992j0724j4233j6926j8594j9668k0310k0028
$$ 966859 976974 984790 989538 990409 987237 980245 969521 955288 938362 919768 900100 879790 859762
58944H59762j8652j6933j5520j3925j1345q106n370l588k167p27K34K07m70j128
$$ 859762 841110 824177 808657 794732 783387 775281 769911 766323 764156 763429 763663 763870 763400 762272
58930G62272j590k110k808l656m716n989p148p817p954p717p126o219n340m820
$$ 762272 760682 758572 755764 752108 747392 741403 734255 726438 718484 710767 703641 697422 692082 687262
58916F87262m439l602k128m46R92K168L248M217M952N450N803O114O582P475Q920
$$ 687262 682823 679221 677093 676647 677639 679807 683055 687272 692224 697674 703477 709591 716173 723648 732568
58901G32568J0763J2689J4441J5904J7130J8188J8962J9229J9116J9180J9713
$$ 732568 743331 756020 770461 786365 803495 821683 840645 859874 878990 898170 917883
58890I17883K0309K0554K0930K2284K4531K6541K7442K7201K5805K2876J8579
$$ 917883 938192 958746 979676 1001960 1026491 1053032 1080474 1107675 1133480 1156356 1174935
58879A174935J4000R873N522oo313j2041j6620k0602k4317k7148k8367k7928k6262
$$ 1174935 1188935 1198808 1204330 1204324 1198011 1185970 1169350 1148748 1124431 1097283 1068916 1040988 1014726
58866A014726k3885k1456j9491j7734j5350j2235r624q847r731j0780j0867j0271
$$ 1014726 990841 969385 949894 932160 916810 904575 894951 886104 876373 865593 854726 844455
58854H44455r963j0288j0727j0712j0247r594q770p734o868o729p271p907q349
$$ 844455 834492 824204 813477 802765 792518 782924 774154 766420 759552 752823 745552 737645 729296
58841G29296q839r349r256q347p435p251p189o069l926k125j684k267k972l300
$$ 729296 720457 711108 701852 693505 686070 678819 671630 665561 661635 659510 657826 655559 652587 649287
58827F49287l170k623j894j309q71l33K47N19N21P89J555K353K682K612K429K113
$$ 649287 646117 643494 641600 640291 639420 639087 639334 639853 640374 641163 642718 645071 647753 650365 652794 654907
58811F54907J518P25r4q92j545j773j526j129q55o48m94o93j435k351k843k744
$$ 654907 656425 657150 657056 656164 654619 652846 651320 650191 649336 648688 648194 647501 646066 643715 640872 638128
58795F38128k367k107k138k342k372k009j522j355j361p78Q01K827M514N736O822
$$ 638128 635761 633654 631516 629174 626802 624793 623271 621916 620555 619777 620578 623405 627919 633655 640477
58780F40477P723P964P327O149M881L713K672J818J218P73J34j151l172n290o468
$$ 640477 648200 656164 663491 669640 674521 678234 680906 682724 683942 684715 684849 683698 680526 675236 668768
58765F68768o219n121m214m012m166l945k879j123O01J578J785J882K394L087
$$ 668768 662549 657428 653214 649202 645036 641091 638212 637089 637690 639268 641053 642935 645329 648416
58751F48416L332K892K111J429J075J148J796L090M886O791Q333R250R689J0067
$$ 648416 651748 654640 656751 658180 659255 660403 662199 665289 670175 676966 685299 694549 704238 714305
58737G14305J0615J1140J1278J0994J0740J1048J1956J2835J2921J2047J0723
$$ 714305 724920 736060 747338 758332 769072 780120 792076 804911 817832 829879 840602
58726H40602R444Q120O365M133J812j82j544j999j431j24J410K800L821M258M132
$$ 840602 850046 858166 864531 868664 870476 870294 868750 866751 865320 865196 866606 869406 873227 877485 881617
58711H81617L904L948L828K665K49k723n531q022j0219j1964j3312j4791j6817
$$ 881617 885521 889469 893297 895962 896211 893488 887957 879935 869716 857752 844440 829649 812832
58698H12832j9173k1244k2579k2963k2331k0872j8980j6856j4460j1992j0018
$$ 812832 793659 772415 749836 726873 704542 683670 664690 647834 633374 621382 611364
58687F11364q804p921o875n846n339n359n434n374n367n333m663l003r93K12K15
$$ 611364 602560 594639 587764 581918 576579 571220 565786 560412 555045 549712 545049 542046 541053 541265 541480
58672E41480j42K56J631L320M776O060P382Q733J0114J1650J3120J3860J3540
$$ 541480 541338 541594 543225 546545 551321 557381 564763 573496 583610 595260 608380 622240 635780
58659F35780J2572J1259R052N349O84l677o978r140j0043r641q645q005p729p121
$$ 635780 648352 659611 668663 674012 674696 671019 664041 654901 644858 635217 626572 618567 610838 603717
58645F03717o177n644n606n183m012k843k171j371J17J675K385K376K414K679
$$ 603717 597540 591896 586290 581107 577095 574252 572081 570710 570827 572502 574887 577263 579677 582356
58631E82356K688K102J062n0p83r31r01j300j889j708m93Q22J513K137L499N362
$$ 582356 585044 587146 588208 588158 587375 586444 585543 584243 582354 580646 580153 580975 582488 584625 588124 593486
58615E93486O944Q124R356J0737J1900J2473J2079J0376P656M903K701O50j621
$$ 593486 600430 608554 617910 628647 640547 653020 665099 675475 683131 688034 690735 691385 689764
58602F89764l600m787n660o782p607p308o283n586n201m152k216l00J041K412
$$ 689764 686164 681377 675717 668935 661328 654020 647737 642151 636950 632798 630582 630282 631323 633735
58588F33735M538P191R534J1051J1957J2962J4570J6287J6868J5780J4019J2843
$$ 633735 638273 645464 654998 666049 678006 690968 705538 721825 738693 754473 768492 781335
58576G81335J2167J1035R320P941P491P674Q106Q741R387R778J0404J2406J6179
$$ 781335 793502 804537 813857 821798 829289 836963 845069 853810 863197 872975 883379 895785 911964
58563I11964K0680K4515K7174K8860K9564K8929K6775K3420J9369J4933J0223
$$ 911964 932644 957159 984333 1013193 1042757 1071686 1098461 1121881 1141250 1156183 1166406
58552A166406N473J148k448n566q580j1245j2909j3566j4074j5071j6320j7408
$$ 1166406 1171879 1173027 1170579 1165013 1156433 1145188 1132279 1118713 1104639 1089568 1073248 1055840
58540A055840j8451j9640k0812k1937k3335k4809k5296k4103k1875j9609j7368
$$ 1055840 1037389 1017749 996937 975000 951665 926856 901560 877457 855582 835973 818605
58529H18605j4742j1951r505p369n343l759k807j798j10J619K381K376K513K830
$$ 818605 803863 791912 782407 775038 769695 765936 763129 761331 761221 762840 765221 767597 770110 772940
58515G72940K682K143J823J567P10m47q42k98K97M08K31k93j417k559k791k449
$$ 772940 775622 777765 779588 781155 781865 781418 780576 780278 780575 780983 781214 780921 779504 776945 774154 771705
58499G71705k780l873m427l956l582m042m455l815k472j239j11J216K501L414
$$ 771705 768925 765052 760625 756669 753087 749045 744590 740775 738303 737064 736953 738169 740670 744084
58485G44084M242N432O998Q815J0826J2718J4135J5496J7524J9723K0398J8685
$$ 744084 748326 753758 760756 769571 780397 793115 807250 822746 840270 859993 880391 899076
58473H99076J5471J1802P573K594k245n939q722j1388j3890j5450j5602j4401
$$ 899076 914547 926349 933922 936516 934271 928332 919610 908222 894332 878882 863280 848879
58461H48879j2095r245o656m560k357L27K905M761O193P691Q935R256Q545O958
$$ 848879 836784 827539 820883 816323 813966 814293 817198 821959 828152 835843 844778 854034 862579 869537
58447H69537M294N72l190n744o998p858q793r330q911p561n602l307r62J045K487
$$ 869537 873831 874403 871213 865469 858471 850613 841820 832490 823579 816018 810416 807109 806147 807192 809679
58432H09679L488M441N656P013Q061Q648R339J0834J3029J5025J6096J6147J5359
$$ 809679 813167 817608 823264 830277 838338 846986 856325 867159 880188 895213 911309 927456 942815
58419I42815J3868J1877R523O624L006r58m594p628j0136j1989j3060j3673j4111
$$ 942815 956683 968560 978083 984707 987713 986755 982161 974533 964397 952408 939348 925675 911564
58406I11564j3895j2625j1157j0696j0754r463o306l098j647j587j306n4J661
$$ 911564 897669 885044 873887 863191 852437 842974 836668 833570 831923 830336 829030 828976 830637
58393H30637L026L565L339K927K826K684J811M82k34j24j93j063k044k264j746
$$ 830637 833663 837228 840567 843494 846320 849004 850815 851297 851063 850939 850746 849683 847639 845375 843629
58378H43629q76J63R77R78L46P1N90J337K057L389N538P514Q478Q815R252R879
$$ 843629 842753 842916 843893 844871 845217 845288 845878 847215 849272 852661 858199 865713 874191 883006 892258 902137
58362I02137J0741J2319J4506J6045J5896J4410J2551J0717Q998P539O027L774
$$ 902137 912878 925197 939703 955748 971644 986054 998605 1009322 1018320 1025859 1031886 1035660
58350A035660J055p05q69n65q60j102j43J806L792N670P820R973J1548J2676J3849
$$ 1035660 1036715 1036010 1035141 1034576 1033716 1032614 1032471 1034277 1038069 1043739 1051559 1061532 1073080 1085756 1099605
58335A099605J4989J5831J6673J7792J8523J7868J5857J3526J1674J0136Q163
$$ 1099605 1114594 1130425 1147098 1164890 1183413 1201281 1217138 1230664 1242338 1252474 1260637
58324A260637N381K501R48J181J750J046l94o78N54J846K547L640N520P029P592
$$ 1260637 1266018 1268519 1269467 1270648 1272398 1273444 1273050 1272372 1272926 1274772 1277319 1280959 1286479 1293508 1301100
58309A301100Q273R735J1002J1383J1818J3045J4215J4619J5013J5871J6071J4907
$$ 1301100 1309373 1319108 1330110 1341493 1353311 1366356 1380571 1395190 1410203 1426074 1442145 1457052
58297A457052J3697J3731J4225J4031J3757J4431J5439J5772J5989J7088J8596
$$ 1457052 1470749 1484480 1498705 1512736 1526493 1540924 1556363 1572135 1588124 1605212 1623808
58286A623808J9563K0265K1206K1735K1442K1553K3087K4926K5652K5989K7342
$$ 1623808 1643371 1663636 1684842 1706577 1728019 1749572 1772659 1797585 1823237 1849226 1876568
58275A876568K9125K9794K9566L0049L1847L4425L7505M0849M3559M5222M6862
$$ 1876568 1905693 1935487 1965053 1995102 2026949 2061374 2098879 2139728 2183287 2228509 2275371
58264B275371M9369N2116N4435N6904N9689O1375O1131O0180N9406N7614N4190
$$ 2275371 2324740 2376856 2431291 2488195 2547884 2609259 2670390 2730570 2789976 2847590 2901780
58253B901780N1305N1052N2536N4176N6706O1179O6245P0320P4489Q0314Q6806
$$ 2901780 2953085 3004137 3056673 3110849 3167555 3228734 3294979 3365299 3439788 3520102 3606908
58242C606908R2514R8452J05809J13087J18786J24560J32216J40129J46472J53382
$$ 3606908 3699422 3797874 3903683 4016770 4135556 4260116 4392332 4532461 4678933 4832315
58232D832315J63701J75997J87354J98739K12869K29007K44761K61054K80305
$$ 4832315 4996016 5172013 5359367 5558106 5770975 5999982 6244743 6505797 6786102
58223F786102L01857L24264L49858L81623M17760M54971M94823N41134N93690
$$ 6786102 7087959 7412223 7762081 8143704 8561464 9016435 9511258 10052392 10646082
58214A0646082O50915P16253P95243Q88977R97653J128256J291488J493481J736637
$$ 10646082 11296997 12013250 12808493 13697470 14695123 15823379 17114867 18608348 20344985
58205B0344985K023707K352790K714391L104994L540351M046768M647767N373762
$$ 20344985 22368692 24721482 27435873 30540867 34081218 38127986 42775753 48149515
58197D8149515O277216P420165Q849953J0598546J2688101J5111060J7825311
$$ 48149515 54426731 61846896 70696849 81295395 93983496 109094556 126919867
58190A26919867K0813918K4126237K7752889L1369911L4199603L5154213L3162596
$$ 126919867 147733785 171860022 199612911 230982822 265182425 300336638 333499234
58183C33499234K7512139J8179450O107868o827687j8396201k6886687l1673811
$$ 333499234 361011373 379190823 385298691 378471004 360074803 333188116 301514305
58176C01514305l3122440l2089013k9505200k6213798k2896521j9975199j7565046
$$ 301514305 268391865 236302852 206797652 180583854 157687333 137712134 120147088
58169A20147088j5563698j3810124j2191859j0664644r227783p897245o690095
$$ 120147088 104583390 90773266 78581407 67916763 58688980 50791735 44101640
58162D4101640n620402m699131l929040l298538k785496k367919k027976j748897
$$ 44101640 38481238 33782107 29853067 26554529 23769033 21401114 19373138 17624241
58154A7624241j515455j318403j153411j015495q98696q00237p19681o54079n98291
$$ 17624241 16108786 14790383 13636972 12621477 11722781 10922544 10202863 9548784 8950493
58145H950493n49586n07591m70219m34124l98856l66331l36544l07659k79765
$$ 8950493 8400907 7893316 7423097 6988973 6590117 6223786 5887242 5579583 5299818
58136E299818k54647k32303k11569j93575j80581j71706j63723j55850j49898
$$ 5299818 5045171 4812868 4601299 4407724 4227143 4055437 3891714 3735864 3585966
58127C585966j45828j41062j34410j27192j20061j12059j03243r5260q8848q3340
$$ 3585966 3440138 3299076 3164666 3037474 2917413 2805354 2702111 2606851 2518003 2434663
58117B434663p8631p5158p2055o7970o3464o0094n7467n3993n0183m8068m7507
$$ 2434663 2356032 2280874 2208819 2140849 2077385 2017291 1959824 1905831 1855648 1807580 1760073
58106A760073m6287m3962m2483m2513m2176m0306l8254l7438l7316l6741l5498
$$ 1760073 1713786 1669824 1627341 1584828 1542652 1502346 1464092 1426654 1389338 1352597 1317099
58095A317099l3716l1374k8993k7339k6151k4483k2359k0586j9070j6972j4404
$$ 1317099 1283383 1252009 1223016 1195677 1169526 1145043 1122684 1102098 1083028 1066056 1051652
58084A051652j2381j1250j0685j0925j2338j4184j5530j6844j8781k0196j9586
$$ 1051652 1039271 1028021 1017336 1006411 994073 979889 964359 947515 928734 908538 888952
58073H88952j7984j7794j9094j9677j8668j7355j6375j4851j2722j1272j0676
$$ 888952 870968 853174 834080 814403 795735 778380 762005 747154 734432 723160 712484
58062G12484r514p489o208o336o352n194m025m162n139o031o996q228q941q582
$$ 712484 702970 695481 689273 682937 676585 671391 667366 663204 658065 652034 645038 636810 627869 619287
58048F19287p839p375o807n772m850m506m297l943l987m676n222n068m731m752
$$ 619287 611448 604073 597266 591494 586644 582138 577841 573898 569911 565235 560013 554945 550214 545462
58034E45462m848m775m949n512n833n671n779o691p809q364q370q090p491o774
$$ 545462 540614 535839 530890 525378 519545 513874 508095 501404 493595 485231 476861 468771 461280 454506
58020D54506o490o568o198n139m177l765l330k466j759j732j955j821j376p92
$$ 454506 448016 441448 435250 430111 425934 422169 418839 416373 414614 412882 410927 409106 407730 406938
58006D06938L6Q23Q15J8m82j4P52J029J005R83N00p89k154k772k959l519m283
$$ 406938 406974 407797 408612 408630 408148 408134 408886 409915 410920 411903 412403 411614 409460 406688 403729 400210 395927
57989C95927m295l134j289N21J852K554K766K722K383J569N76J6p9l39j006j466
$$ 395927 391632 388498 387209 387730 389582 392136 394902 397624 400007 401576 402152 402168 402089 401750 400744 399278
57973C99278j220n88p1M06J108J879K342K327J864J135N83O04J059J522J983K674
$$ 399278 398058 397470 397399 397805 398913 400792 403134 405461 407325 408460 409043 409647 410706 412228 414211 416885
57957D16885L371L587L310K709J364j065l543m488m010l869m777n325m266k408
$$ 416885 420256 423843 427153 429862 431226 430161 426618 422130 418120 414251 409474 404149 399883 397475
57943C97475j198o58J28J315K356L106L866M693N529O650Q196R649J0368J0330
$$ 397475 396277 395619 395747 397062 399418 402524 406390 411083 416612 423262 431458 441107 451475 461805
57929D61805R903R298Q680Q146P272N273K196p82k770m208n890p605q515q395
$$ 461805 471708 481006 489686 497832 505104 510377 512573 511791 509021 504813 498923 491318 482803 474408
57915D74408p815p415p526q028q222p378n859m981n345o005n839m970m119l442
$$ 474408 466593 459178 451652 443624 435402 428024 422165 417184 411839 405834 399995 395025 390906 387464
57901C87464k848k778l624m827n457n450n467n804o166o230n828m852l568k673
$$ 387464 384616 381838 378214 373387 367930 362480 357013 351209 345043 338813 332985 328133 324565 321892
57887C21892k477k343j556l02P41J402J897K164J960J413P49j98j576k942l622
$$ 321892 319415 317072 315516 315214 315955 317357 319254 321418 323378 324791 325540 325342 323766 320824 317202
57872C17202l569l318l318l691m322m774m499l496k386j493l89J197K684L423
$$ 317202 313633 310315 306997 303306 298984 294210 289711 286215 283829 282336 281947 283144 285828 289251
57858B89251L633L878M214M463M845N613O525P300Q055Q661Q413P125N901N779
$$ 289251 292884 296762 300976 305439 310284 315897 322422 329722 337777 346438 354851 361976 367877 373656
57844C73656O232O059N216M566M193L305J711J03j131k307l468m070l796k941
$$ 373656 379888 385947 391163 395729 399922 403227 404938 405041 403910 401603 398135 394065 390269 387328
57830C87328j838o85J8k51j245k141k564k665k322j228Q2M44l85j269j225o01
$$ 387328 385490 384805 384823 384572 383327 381186 378622 375957 373635 372407 372489 372933 372548 371279 370054 369453
57814C69453k12j32J0J47p9n82r42j183j928l681o119q181q858q039o564n414
$$ 369453 369241 369109 369119 369266 369187 368605 367663 366480 364552 360871 354752 346571 337713 329674 323110 317696
57798C17696m911m785m670m258l315j998j018q66j113j000n47l40l25K85J663
$$ 317696 312785 308000 303330 299072 295757 293759 292741 291875 290762 289762 289215 288875 288550 288835 290498
57783B90498K788K711J834J374J943L109M117M578M578M488M647M952M841L972
$$ 290498 293286 295997 297831 299205 301148 304257 308374 312952 317530 322018 326665 331617 336458 340430
57769C40430K760J934J490N80j310l451m655m884n371o896q624r157q379p424
$$ 340430 343190 345124 346614 347194 345884 342433 337778 332894 327523 320627 312003 302846 294467 287043
57755B87043p092p114o938o387n394l943k526j895k047k193j992j951k271k266
$$ 287043 279951 272837 265899 259512 254118 250175 247649 245754 243707 241514 239522 237571 235300 233034
57741B33034j581r80j203j869k378k955l847m255l316j597l41K62Q93J563J652
$$ 233034 231453 230473 229270 227401 225023 222068 218221 213966 210650 209053 208712 208974 209867 211430 213082
57726B13082J265J156J339J105M89L94R98J295O59k24n53n18o86j070j375j600
$$ 213082 214347 215503 216842 217947 218436 218830 219828 221123 221782 221558 221005 220487 219801 218731 217356 215756
57710B15756j882k125k184k082j914j845k161k891l476l376k871k591k516k222
$$ 215756 213874 211749 209565 207483 205569 203724 201563 198672 195196 191820 188949 186358 183842 181620
57696A81620j847j758j472j64J669K432J602M59J79N21R37J660K859L869M270
$$ 181620 179773 178015 176543 176379 178048 180480 182082 182541 182720 183241 184178 185838 188697 192566 196836
57681A96836M815O221P855Q722R158J0416J2978J6361K0299K5106L0811L6940
$$ 196836 201651 207872 215727 224449 233607 244023 257001 273362 293661 318767 349578 386518
57669C86518M3246N0070N7755O5910P3073P6710P3906O2771M3501J8253r559l5816
$$ 386518 429764 479834 537589 603499 676572 753282 827188 889959 933460 951713 942154 906338
57657I06338n6557o9493p4833p4361o9886o2736n4153m5334l7104k9857k3729
$$ 906338 849781 780288 705455 631094 561208 498472 444319 398985 361881 332024 308295
57646C08295j8602j4243j0764q550p538p005o378n739n208m520l644l134l183
$$ 308295 289693 275450 264686 256136 248598 241593 235215 229476 224268 219748 216104 212970 209787
57633B09787l003j925n36J71K33L65N68K81m34r65j337k155l301l817l386k804
$$ 209787 206784 204859 204323 204494 204727 205092 205660 205941 205507 204542 203205 201050 197749 193932 190546 187742
57617A87742k686k660k341k129k368k495j822o11L55R24J513K085K057J232K45
$$ 187742 185056 182396 180055 177926 175558 173063 171241 170630 170985 171909 173422 175507 177564 178796 179041
57602A79041k05j30m2k14m00l05j05l48j258k317k783k574k382k743l322l367
$$ 179041 178836 178706 178664 178450 178050 177745 177640 177292 176034 173717 170934 168360 165978 163235 159913 156546
57586A56546k735k125k241k979l557l346k406j279m99l34p63j500k081k216k069
$$ 156546 153811 151686 149445 146466 142909 139563 137157 135878 135379 135045 134282 132782 130701 128485 126416
57571A26416k073k392k715k619j975j019j84J55p4n32q00q31q89j075j247j355
$$ 126416 124343 121951 119236 116617 114642 113623 113439 113594 113520 112988 112188 111357 110468 109393 108146 106791
57555A06791j475j438r18p7L68R3k89l5P10J278J468J662J996K094J645P86j36
$$ 106791 105316 103878 102960 102883 103251 103344 103055 103020 103730 105008 106476 108138 110134 112228 113873 114659 114523
57538A14523q25j022o97k74l50j005j800k470l152l775l774k806j425n57m73o88
$$ 114523 113698 112676 111979 111705 111355 110350 108550 106080 102928 99153 95379 92573 91148 90591 90118 89430
57522H9430p89r02j251j656j680j064J71J776L208L772L197K041J114O11J76j72
$$ 89430 88641 87739 86488 84832 83152 82088 82259 84035 87243 91015 94212 96253 97367 97978 98154 97982
57506I7982J02J047J709J233K3q42j050j181j531j709j513j337j423j386r51n96
$$ 97982 98084 99131 100840 102073 102096 101254 100204 99023 97492 95783 94270 92933 91510 90124 89173 88577
57490H8577r56j928k789k968k364j212N2J005J553J835J786J150J21n92o14l54
$$ 88577 87621 85693 82904 79936 77572 76360 76412 77417 78970 80805 82591 83741 83862 83270 82656 82302
57474H2302k83l01k23l15q49j485j748j699j604j304n76J70K94j45n24o30p79
$$ 82302 82019 81718 81495 81180 80331 78846 77098 75399 73795 72491 71915 72085 72379 72234 71710 71080 70301
57457G0301j023r14j95P60J411J554J368J185J217J290R69K17l86l81p0N1N5K40
$$ 70301 69278 68364 68169 68929 70340 71894 73262 74447 75664 76954 77923 78140 77754 77373 77303 77354 77409 77649
57439G7649L93J52j79n2L01J99k69k54M70J110J093P87O29L85k23q35r14n65l07
$$ 77649 78042 78194 78015 77963 78264 78463 78194 77940 78410 79520 80613 81400 82029 82414 82191 81356 80442 79877 79570
57420G9570m46r04j401j589j346j073j251j588j233m7J018J113M77j54m88n83
$$ 79570 79124 78220 76819 75230 73884 72811 71560 69972 68739 68692 69710 70823 71300 71146 70658 70075
57404G0075m39k34m29j043j324p49R0L47J19M7M7n17j533k044j627r58o50l55
$$ 70075 69636 69402 68973 67930 66606 65857 65947 66294 66413 66460 66507 65990 64457 62413 60786 59828 59178 58823
57386E8823M67J484J873J467Q81O67P83R59J056R65N58Mj48M04J119J035o6j294
$$ 58823 59290 60774 62647 64114 64995 65662 66445 67404 68460 69425 69983 69987 69839 70243 71362 72397 72331 71037
57368G1037j666j225q06q94j187j241j055q47o60m54k39J02Q39J978K934L023
$$ 71037 69371 68146 67340 66446 65259 64018 62963 62116 61456 61002 60763 60865 61704 63682 66616 69639
57352F9639K192J109N06N95J003J173Q86M35K43K27j43j067j989k187j625q78
$$ 69639 71831 72940 73446 74041 75044 76217 77103 77538 77781 78008 77865 76798 74809 72622 70997 70119
57336G0119l77o4K57O13R44J226J337J054K94o79j465j825j767j392q25k68M4
$$ 70119 69742 69678 69935 70548 71492 72718 74055 75109 75403 74724 73259 71434 69667 68275 67450 67182 67226
57319F7226K3j47j85p9j64p29j537j948j562o62K4N7l77p43p11l63L1K48J04m25
$$ 67226 67249 67102 66917 66838 66674 65945 64408 62460 60898 60236 60260 60317 59940 59197 58486 58123 58154 58402 58506 58081
57299E8081r53q05K42J420J686R91L14L74Q01R20P35P15R81J264J410J441J294
$$ 58081 57128 56323 56565 57985 59671 60662 60976 61350 62151 63071 63806 64521 65502 66766 68176 69617 70911
57282G0911J009R31J227J425J008K83M6N20J273K052K889L411K984J758P36M67
$$ 70911 71920 72851 74078 75503 76511 76794 76840 77360 78633 80685 83574 86985 89969 91727 92463 92930
57266I2930L73k23j063j515j601j806k175k256j833j216p54m33%O55J293J510
$$ 92930 93303 93080 92017 90502 88901 87095 84920 82664 80831 79615 78861 78428 78428 79083 80376 81886
57250H1886J207P46N08M43L37K98N41Q55Q88Q11J090J525J414P06K00L00M04M7
$$ 81886 83093 83839 84347 84790 85127 85425 85966 86821 87709 88520 89610 91135 92549 93255 93455 93755 94159 94206
57232I4206k47J36P88Q37K34k87k75M5L53O22R52J361J692J607R35J08q3N72J384
$$ 94206 93959 94095 94883 95720 95954 95667 95392 95437 95790 96412 97364 98725 100417 102024 102959 103067 102984 103556 104940
57213A04940J599J175N08j08m65l37J96P37J112J511J858J747J260J120J529J670
$$ 104940 106539 107714 108222 108114 107649 107312 107508 108245 109357 110868 112726 114473 115733 116853 118382 120052
57197A20052J030M54J011K350L169K952K348K089K342K982L703L985L602L021
$$ 120052 121082 121536 122547 124897 128066 131018 133366 135455 137797 140779 144482 148467 152069 155090
57183A55090K773K681K303J840J839K354L024L801M819N804O358O634O998P235
$$ 155090 157863 160544 162847 164687 166526 168880 171904 175705 180524 186328 192686 199320 206318 213553
57169B13553O892O280O317P404R065J0587J1423J1262J0437J0045J0872J2371
$$ 213553 220445 226725 233042 240446 249511 260098 271521 282783 293220 303265 314137 326508
57157C26508J3451J3978J4661J5667J6409J6648J6852J7358J7959J8406J8702
$$ 326508 339959 353937 368598 384265 400674 417322 434174 451532 469491 487897 506599
57146E06599J8879J9139K0001K1590K3082K3617K3550K3895K4819K5704K6434
$$ 506599 525478 544617 564618 586208 609290 632907 656457 680352 705171 730875 757309
57135G57309K7491K8950L0388L1811L3571L5466L7027L8561M0735M3250M5197
$$ 757309 784800 813750 844138 875949 909520 944986 982013 1020574 1061309 1104559 1149756
57124A149756M6733M8978N2301N6015N9890O4475O9712P4742P9356Q4296Q9868
$$ 1149756 1196489 1245467 1297768 1353783 1413673 1478148 1547860 1622602 1701958 1786254 1876122
57113A876122R5808J02787J12250J24012J35678J45695J56125J71541J95835K30167
$$ 1876122 1971930 2074717 2186967 2310979 2446657 2592352 2748477 2920018 3115853 3346020
57103C346020K73013L21853L75928M37717N11252N99818P06801Q37920J000255
$$ 3346020 3619033 3940886 4316814 4754531 5265783 5865601 6572402 7410322 8410577
57094H410577J199103J437293J715938K031875K374430K728280L079863L418121
$$ 8410577 9609680 11046973 12762911 14794786 17169216 19897496 22977359 26395480
57086B6395480L731031M007497M241729M427313M546961M581084M531365M417433
$$ 26395480 30126511 34134008 38375737 42803050 47350011 51931095 56462460 60879893
57078F0879893M228702L884809L271116K332122J130071j87764j470406k615249
$$ 60879893 65108595 68993404 72264520 74596642 75726713 75538949 74068543 71453294
57070G1453294l568324m305428m821170n123509n227618n153831m931033m596958
$$ 71453294 67884970 63579542 58758372 53634863 48407245 43253414 38322381 33725423
57062C3725423m191580l750423l302987k872759k475576k119185j806043j536110
$$ 33725423 29533843 25783420 22480433 19607674 17132098 15012913 13206870 11670760
57054A1670760j307089j114251r52089q16256p03670o11402n35884m72882m18338
$$ 11670760 10363671 9249420 8297331 7481075 6777405 6166003 5630119 5157237 4738899
57045D738899l69696l26285k87976k53960k23404j96542j73897j54819j37914
$$ 4738899 4369203 4042918 3754942 3500982 3277578 3081036 2907139 2752320 2614406
57036B614406j22637j09335r7878q7445p7688o8946o1092n3178m4485l5127k5380
$$ 2614406 2491769 2382434 2284556 2197111 2119423 2050477 1989385 1936207 1891722 1856595 1831215
57025A831215j5130m149P770K1107L6293N2334O5727P0818O1925L6699j111m2434
$$ 1831215 1816085 1811936 1819706 1840813 1877106 1929440 1995167 2065985 2127910 2164609 2163498 2121064
57013B121064p7794j02301j16239j21774j20452j13472j02638r0046p7356o5656
$$ 2121064 2043270 1940969 1824730 1702956 1582504 1469032 1366394 1276348 1198992 1133336
57003A133336n5546m7021l9815l4076l0183k7807k5777k3246k0449j8087j6353
$$ 1133336 1077790 1030769 990954 956878 926695 898888 873111 849865 829416 811329 794976
56992G94976j4941j3541j2024j0336q538o758m929k721J07L274N996P262O237
$$ 794976 780035 766494 754470 744134 735596 728838 723909 721188 721295 724569 730565 737827 744064
56979G44064K633l100r902j6317k0826k2558k2052k0889k0061j8983j6562j2858
$$ 744064 746697 743597 733695 717378 696552 673994 651942 631053 610992 592009 575447 562589
56967E62589r105o209l920j525J253M196P000R611J2305J5446J8833K1382K1723
$$ 562589 553484 547275 543355 541830 543083 547279 554279 563890 576195 591641 610474 631856 653579
56954F53579J9070J3412N296m116j3130k0291k5102k7722k8251k6796k3908k0316
$$ 653579 672649 686061 691357 687241 674111 653820 628718 600996 572745 545949 522041 501725
56942E01725j6406j2432q831n685k252K123O892J1046J4700J8869K3707K8087
$$ 501725 485319 472887 464056 458371 456119 458242 465134 476180 490880 509749 533456 561543
56930E61543L0985L2025L0437K4779J4582J465j1956k3638l2315l7213l8439l7083
$$ 561543 592528 624553 654990 679769 694351 695816 683860 660222 627907 590694 552255 515172
56918E15172l4244l0308k5608k1058j7462j4700j2264j0196q828q074p589p281
$$ 515172 480928 450620 425012 403954 386492 371792 359528 349332 340504 332430 324841 317560
56906C17560p066o525n441m375l965l996l786l210k610j948q27P30K305L873N851
$$ 317560 310494 303969 298528 294153 290188 286192 282406 279196 276586 274638 273811 274541 276846 280719 286570
56891B86570Q309J0761J2914J5106J7755K0720K3359K4814K4229K1106J5716R018
$$ 286570 294879 305640 318554 333660 351415 372135 395494 420308 444537 465643 481359 490377
56879D90377K084m265r400j2848j4370j3985j1990r073o086l334k85L671Q387
$$ 490377 492461 488196 478796 465948 451578 437593 425603 416530 410444 407110 406825 410496 418883
56866D18883J3307J8355K3877K9846L5818M1700M7715N3282N6456N5007M7835
$$ 418883 432190 450545 474422 504268 540086 581786 629501 682783 739239 794246 842081
56855H42081L5233J8370q28j9500l4448m3567m6749m5417m1153l4849k6976j8209
$$ 842081 877314 895684 894856 875356 840908 797341 750592 705175 664022 629173 602197 583988
56843E83988r421j075P018J5268K3937L3291M3687N5130O6894P7739Q6202R0387
$$ 583988 574567 573492 580510 595778 619715 653006 696693 751823 818717 896456 982658 1073045
56831A073045Q7923P6867N6890K9649j599l2516n8556p6530q5730q7394q3220
$$ 1073045 1160968 1237835 1294725 1324374 1322775 1290259 1231703 1155173 1069443 982049 898829
56820H98829p4747o3665n1706l9924k8642j8071q364R46J0735K1111L1137M0070
$$ 898829 824082 760417 708711 668787 640145 622074 613710 614656 625391 646502 677639 717709
56808G17709M8204N5826O1665O3060N7576M4368K4472M97k4026m5552o1343o9892
$$ 717709 765913 821739 883404 946464 1004040 1048408 1072880 1073377 1049351 1003799 942456 872564
56796H72564p1260o7209o0449n2977m5189l6741k7949j9792j2815o601m44N857
$$ 872564 801304 734095 673646 620669 575480 538739 510790 490998 478183 471582 471138 476995
56784D76995J1998J7594K2483K6633K9770L1003K8992K2787J2591j91j3545k5415
$$ 476995 488993 506587 529070 555703 585473 616476 645468 668255 680846 680655 667110 641695
56772F41695l4249l9483m1556m1293l9330l6174l2377k8336k4114j9870j6178
$$ 641695 607446 567963 526407 485114 445784 409610 377233 348897 324783 304913 288735
56761B88735j3447j1273q942o539m894m317m092l491k744k490k727k848k516k008
$$ 288735 275288 264015 255073 248534 243640 239323 235231 231740 228996 226506 223779 220931 218415 216407
56747B16407j656j414j054n38p7M1l87j238j962j953j163k34J05k57q89j360j532
$$ 216407 214751 213337 212283 211745 211668 211709 211322 210084 208122 206169 205006 204772 204877 204620 203731 202371 200839
56730B00839j407j005m73m8K81P80J464J825J461P64N48J014J558J708J688J846
$$ 200839 199432 198427 197954 197906 198187 198967 200431 202256 203717 204481 205029 206043 207601 209309 210997 212843
56714B12843K055K102K266K869L485L278K109P52q4m22m91j20Q58J943K271J660
$$ 212843 214898 217000 219266 222135 225620 228898 231007 231759 231675 231253 230762 230642 231500 233443 235714 237374
56698B37374Q67P01J122J428J176O12K46K07K14l7n44j036j142o29L18J067J019
$$ 237374 238241 238942 240064 241492 242668 243280 243526 243733 243947 243910 243366 242330 241188 240559 240877 241944 242963
56681B42963K32o51j141j288j305j139p25l73m91r89j326j179q20p81j267j970
$$ 242963 243195 242544 241403 240115 238810 237671 236946 236573 236082 235093 233767 232588 231768 230987 229720 227750
56665B27750k354k157j665j458j784k317k540k149j110L79J792K561K715K939
$$ 227750 225396 223239 221574 220116 218332 216015 213475 211326 210216 210595 212387 214948 217663 220602
56651B20602L609M161L861K926K242K190K313K140J724J368J312J735K465K773
$$ 220602 224211 228372 232233 235159 237401 239591 241904 244044 245768 247136 248448 250183 252648 255421
56637B55421J997M44q02j041l59R35K412L151K316M83o62l91J16m15j578k185
$$ 255421 257418 257862 257060 256019 255660 256595 259007 262158 264474 264957 264295 263904 264020 263605 262027 259842
56621B59842k136k266k800l098k848k438k157j865j561j452j466j310j061r94
$$ 259842 257706 255440 252640 249542 246694 244256 242099 240234 238673 237221 235755 234445 233384 232390
56607B32390q92l07M49N29q0m34j63j87j200k378k491j734j423k069k755k507
$$ 232390 231498 231191 231640 232169 232089 231655 231492 231305 230105 227727 225236 223502 222079 220010 217255 214748
56591B14748j511o76m89o89p25k91M75J120J305J157J122J405J782J970K024K150
$$ 214748 213237 212561 212072 211383 210658 210367 210842 211962 213267 214424 215546 216951 218733 220703 222727 224877
56575B24877K270K073J521J082J216J808K327K527K667L039L616M335N383O797
$$ 224877 227147 229220 230741 231823 233039 234847 237174 239701 242368 245407 249023 253358 258741 265538
56561B65538Q069Q706R101J0276J2520J4765J5586J4592J2563J0458Q668P105
$$ 265538 273607 282313 291414 301690 314210 328975 344561 359153 371716 382174 390842 397947
56549C97947N677M538L998M105M378M015K669Q99l76q93j288k265l759n132o000
$$ 397947 403624 408162 412160 416265 420643 424658 427327 428226 427850 426957 425669 423404 419645 414513 408513
56534D08513o569p114p492p428p076p021p616q593r337r406q765p697o591n690
$$ 408513 401944 394830 387338 379910 372834 365813 358197 349604 340267 330861 322096 314399 307808 302118
56520C02118m969m397m160m379m676m489l844l356l292l164k602k078k212k751
$$ 302118 297149 292752 288592 284213 279537 275048 271204 267848 264556 261392 258790 256712 254500 251749
56506B51749k831k097j003j74J5n69j633k343j990q29K40P36Q40O97J88n02q42
$$ 251749 248918 246821 245818 245644 245659 245090 243457 241114 239124 238295 238535 239271 240111 240808 240996 240494 239652
56489B39652o51l08j21J9J57J22pJ43N42N95L5o16p83n54k75L4M53Q25J056J340
$$ 239652 239001 238693 238572 238591 238748 238870 238863 239006 239548 240143 240178 239562 238779 238225 237950 237984 238437 239262 240318 241658
56469B41658J700J744J309Q64P98P93M58J29L23Q08R91R63J298J939K131J589
$$ 241658 243358 245102 246411 247275 248073 248866 249324 249453 249776 250584 251575 252538 253836 255775 257906 259495
56453B59495R39P48P50L54m73j192j349j009o39o25q21o53J22R68J104M33l64
$$ 259495 260434 261182 261932 262286 261813 260621 259272 258263 257624 256999 256178 255525 255647 256615 257719 258152 257788
56436B57788n99j76M54O46N2r49j451r85j47J73n2j54Q5J86q2k53Q9O88J143J446
$$ 257788 257189 257013 257467 258113 258165 257216 255765 254780 254633 254806 254754 254600 254685 254871 254789 254536 254625 255313 256456 257902
56416B57902J659J474P30j8j18J97Q6n68q19M5J414K064J679J087J077J499J693
$$ 257902 259561 261035 261765 261747 261629 261826 261912 261344 260525 260570 261984 264048 265727 266814 267891 269390 271083
56399B71083J306M62m97j052o72N44J591J487M83k32l5M99O56N65P64J247J536
$$ 271083 272389 272851 272354 271302 270630 271174 272765 274252 274735 274503 274468 274967 275623 276188 276952 278199 279735
56382B79735J396J007N50Q6k10j00M10J008J382J440J305J241J419J670J628J152
$$ 279735 281131 282138 282688 282774 282564 282464 282874 283882 285264 286704 288009 289250 290669 292339 293967 295119
56366B95119M45k80r59j425j383q32j90J89L02J83k48q51j167r25k84N79J567
$$ 295119 295564 295284 294325 292900 291517 290685 290495 290684 290986 291169 290921 290070 288903 287978 287694 288273 289840
56349B89840K224J907Q46K39P64J647J855J525J418J542J351R01P75J053J284
$$ 289840 292064 293971 294817 295056 295820 297467 299322 300847 302265 303807 305158 306059 306834 307887 309171
56334C09171J387J612J838J777J755K282K968K850J940J342J662K305K654K886
$$ 309171 310558 312170 314008 315785 317540 319822 322790 325640 327580 328922 330584 332889 335543 338429
56320C38429L150K875J613nq44n36L17R32J006P67N45K95k60q95p43N36J926K318
$$ 338429 341579 344454 346067 346062 345218 344682 344999 345931 346937 347704 348249 348544 348284 347389 346646 347182 349108 351426
56302C51426K207L000M753N978N884N328N074M521L078J560J021J092P60K32O32
$$ 351426 353633 356633 361386 367364 373248 378576 383650 388171 391249 392809 393830 394922 395682 395914 396546
56287C96546K077L333L522L194L375M262N194N452M803L597K596K550L658N375
$$ 396546 398623 401956 405478 408672 412047 416309 421503 426955 431758 435355 437951 440501 444159 449534
56273D49534O724O956O144N213N140O071P375Q484R329J0060J0821J1888J3531
$$ 449534 456258 463214 469358 474571 479711 485782 493157 501641 510970 521030 531851 543739 557270
56260E57270J5581J7487J9012K0430K2112K4342K7504L1778L6481M0502M3652
$$ 557270 572851 590338 609350 629780 651892 676234 703738 735516 771997 812499 856151
56249H56151M6990N1406N6604O1788O6600P0915P4403P6972P9060Q0759Q1139
$$ 856151 903141 954547 1011151 1072939 1139539 1210454 1284857 1361829 1440889 1521648 1602787
56238A602787P9155P4888O9217O2473N4156M3836L1805J8845N748p032j9471l1526
$$ 1602787 1681942 1756830 1826047 1888520 1942676 1986512 2018317 2037162 2042910 2035878 2016407 1984881
56226A984881m2453n1081n7120o1662o5809o9257p0902p0465o8835o6883o4667
$$ 1984881 1942428 1891347 1834227 1772565 1706756 1637499 1566597 1496132 1427297 1360414 1295747
56215A295747o1821n8258n4333n0583m7233m3943m0267l6436l3289l1133k9261
$$ 1295747 1233926 1175668 1121335 1070752 1023519 979576 939309 902873 869584 838451 809190
56204H09190k6940k4386k2227k0503j8736j6713j4530j2217r851p867o664o110
$$ 809190 782250 757864 735637 715134 696398 679685 665155 652938 643087 635220 628556 622446
56192F22446n815n633n453m859l671k508k096k195j890r07L3K21j97n47l47L29
$$ 622446 616631 610998 605545 600686 597015 594507 592411 590216 588326 587419 587452 587673 587476 586929 586582 586911
56176E86911J017J292J213J191J371J489J486J839K898M262N281N842O221O546
$$ 586911 587928 589220 590433 591624 592995 594484 595970 597809 600707 604969 610250 616092 622313 628859
56162F28859O811P172P682Q041Q078Q185Q782R678J0422J1075J2018J3373J5086
$$ 628859 635670 642842 650524 658565 666643 674828 683610 693288 703710 714785 726803 740176 755262
56149G55262J7299J9993K2549K4399K5976K8383L2152L6973M2549M9024N6425
$$ 755262 772561 792554 815103 839502 865478 893861 926013 962986 1005535 1054559 1110984
56138A110984O4324P2417Q1080R1044J02474J14433J25111J32651J35781J33749
$$ 1110984 1175308 1247725 1328805 1419849 1522323 1636756 1761867 1894518 2030299 2164048
56128B164048J26125J13307R7286Q1178O7467N6861M8700M1837L4879K6501J6181
$$ 2164048 2290173 2403480 2500766 2581944 2649411 2706272 2754972 2796809 2831688 2858189 2874370
56117B874370M441p867j9962l0740l8983m4696m9775n6734o6989q0446r5836j10836
$$ 2874370 2878811 2870944 2850982 2820242 2781259 2736563 2686788 2630054 2563065 2482619 2386783 2275947
56105B275947j22658j29429j30862j27349j19251j07503r4014q0538o7627n5346
$$ 2275947 2153289 2023860 1892998 1765649 1646398 1538895 1444881 1364343 1296716 1241370
56095A241370m4307l5252k8158k2547j8178j4845j1991r238o789m827l107j573
$$ 1241370 1197063 1161811 1133653 1111106 1092928 1078083 1066092 1056854 1050065 1045238 1042131 1040558
56083A040558n67M3J070K693L964M294M375M908N516N791O289P500Q916J0106
$$ 1040558 1039991 1040034 1041104 1043797 1047761 1052055 1056430 1061338 1066854 1072645 1078934 1086434 1095350 1105456
56069A105456J1553J3345J4396J4231J4160J5299J6706J7011J6540J6193J5594
$$ 1105456 1117009 1130354 1144750 1158981 1173141 1188440 1205146 1222157 1238697 1254890 1270484
56058A270484J4185J2877J2530J2094J0424Q770Q955J0244J0616J0345J1357J3579
$$ 1270484 1284669 1297546 1310076 1322170 1332594 1341364 1350319 1360563 1371179 1381524 1392881 1406460
56046A406460J4920J4782J4794J5909J7375J8791K0674K2625K3362K3004K3198
$$ 1406460 1421380 1436162 1450956 1466865 1484240 1503031 1523705 1546330 1569692 1592696 1615894
56035A615894K4566K6039K6961K7803K8661K9095K9640L1434L4177L6444L8045
$$ 1615894 1640460 1666499 1693460 1721263 1749924 1779019 1808659 1840093 1874270 1910714 1948759
56024A948759L9975M2208M3742M4743M6223M7721M7837M7160M7960N0784N4024
$$ 1948759 1988734 2030942 2074684 2119427 2165650 2213371 2261208 2308368 2356328 2407112 2461136
56013B461136N6991O0638O4943O8481P1123P4347P8373Q1741Q4306Q7827R2954
$$ 2461136 2518127 2578765 2643708 2712189 2783312 2857659 2936032 3017773 3102079 3189906 3282860
56002C282860R8358J03467J09165J15255J20225J24244J29495J36734J44429J51930
$$ 3282860 3381218 3484685 3593850 3709105 3829330 3953574 4083069 4219803 4364232 4516162
55992D516162J60525J70680J81271J92220K04948K19599K34885K51032K69665
$$ 4516162 4676687 4847367 5028638 5220858 5425806 5645405 5880290 6131322 6400987
55983F400987K90589L12258L35573L63342L95838M30986M68976N12307N61408
$$ 6400987 6691576 7003834 7339407 7702749 8098587 8529573 8998549 9510856 10072264
55974A0072264O15294O76632P50702Q39233R41354J061301J209339J394373J620972
$$ 10072264 10687558 11364190 12114892 12954125 13895479 14956780 16166119 17560492 19181464
55965A9181464J892006K206339K555454K933101L349929L830566M399276N082566
$$ 19181464 21073470 23279809 25835263 28768364 32118293 35948859 40348135 45430701
55957D5430701N926036O992258Q337344R999491J2002188J4342307J6980048J9883222
$$ 45430701 51356737 58348995 66686339 76685830 88688018 103030325 120010373 139893595
55949A39893595K3083509K6601001L0204805L3213976L4568856L3157227K8197172
$$ 139893595 162977104 189578105 219782910 252996886 287565742 320722969 348920141
55942C48920141J9555357P972181m938756j7105416k6732980l2902875l5643072
$$ 348920141 368475498 376447679 371508923 354403507 327670527 294767652 259124580
55935B59124580l5556274l3414485k9969481k5904325k1779552j7971518j4668824
$$ 259124580 223568306 190153821 160184340 134280015 112500463 94528945 79860121
55928G9860121j1923206r703080p932326o524342n404964m514304l800966l223971
$$ 79860121 67936915 58233835 50301509 43777167 38372203 33857899 30056933 26832962
55920B6832962k755165k372870k056302j789327j563732j373768j211478j070452
$$ 26832962 24077797 21704927 19648625 17859298 16295566 14921798 13710320 12639868
55912A2639868r49129q46397p57944o80093o12937n56509n07672m63718m25214
$$ 12639868 11690739 10844342 10086398 9406305 8793368 8236859 7729187 7265469 6840255
55903F840255l92452l62787l34239l08203k85830k65153k44554k25744k10344
$$ 6840255 6447803 6085016 5750777 5442574 5156744 4891591 4647037 4421293 4210949
55894D210949j96537j82117j68151j56678j47070j37522j28173j20060j12670
$$ 4210949 4014412 3832295 3664144 3507466 3360396 3222874 3094701 2974641 2861971
55885B861971j04957r7361r0677q4279p7318p0392o4347n8729n2955m7788m4391
$$ 2861971 2757014 2659653 2568976 2484697 2407379 2336987 2272640 2213911 2160956 2113168 2068777
55874B068777m3019m3663m6526n0840n4753n7305n9143o0483o0189n7757n4405
$$ 2068777 2025758 1982095 1935569 1884729 1829976 1772671 1713528 1653045 1592856 1535099 1480694
55863A480694n1153m7537m3228l9193l6169l3625l1264k9772k9144k7980k5648
$$ 1480694 1429541 1382004 1338776 1299583 1263414 1229789 1198525 1168753 1139609 1111629 1085981
55852A085981k3406k2316k1739k0986k0667k1198k1692k1587k1646k2122k1744
$$ 1085981 1062575 1040259 1018520 997534 976867 955669 933977 912390 890744 868622 846878
55841H46878j9931j8217j7920j8053j7218j5947j5297j4688j3157j1542j1313
$$ 846878 826947 808730 790810 772757 755539 739592 724295 709607 696450 684908 673595
55830F73595j1995j1815j0362q794p804o987o102n501n345n427n683o163o693
$$ 673595 661600 649785 639423 630629 622825 615838 609736 604235 598890 593463 587780 581617 574924
55817E74924p114p457p498o817n678m901m464l314j177P24J527K021L195M798
$$ 574924 567810 560353 552855 546038 540360 535459 530995 527681 526504 527228 528755 530776 533971 538769
55803E38769O316Q067J0112J1325J0899R728Q896P771N140J326k316n347q213
$$ 538769 545085 553152 563264 574589 585488 595216 604112 611883 617023 618349 616033 610686 602473
55790F02473j0826j2688j3961j5052j5448j4346j2052r602p363n195l681l768
$$ 602473 591647 578959 564998 549946 534498 520152 508100 498498 491135 485940 482259 478491
55778D78491n284o911p655p433o435m811k925j008J245M049O791Q613R329Q980
$$ 478491 473207 466296 458641 451208 444773 439962 437037 436029 437274 441323 448114 456727 466056 475036
55764D75036P065L219j691o205r780j2763j5133j6346j6295j5582j4768j4041
$$ 475036 482101 485320 483629 477424 467644 454881 439748 423402 407107 391525 376757 362716
55752C62716j3502j3138j2703j2130j1780j1692j1072r231o663m448l009k174
$$ 362716 349214 336076 323373 311243 299463 287771 276699 267468 260805 256357 253348 251174
55740B51174j878j946j588k19J512K385K132J455Q72M04J09k7m59j514k667l284
$$ 251174 249296 247350 245762 245543 247055 249440 251572 253027 253899 254303 254412 254385 253926 252412 249745 246461
55724B46461l680m436m996m246k378r57q98j473j613j184o52k65K5L39R41K031
$$ 246461 242781 238345 233349 229103 226725 225768 224870 223397 221784 220600 219948 219683 219708 220047 220988 223019
55708B23019L376M498N231N644N537M591K964J155o23k441m079n145n667n974
$$ 223019 226395 230893 236124 241768 247305 251896 254860 256015 255392 252951 248872 243727 238060 232086
55694B32086o032n524m579l747l215k616j678o18K16O54Q05J093J986L304M176
$$ 232086 226054 220530 215951 212204 208989 206373 204695 204077 204293 204947 205752 206845 208831 212135 216311
55679B16311M248M419N569O969P026N409L357J920R66Q9o54j274k139l222l750
$$ 216311 220559 224978 230547 237516 244542 249951 253308 255228 256194 256283 255629 254355 252216 248994 245244
55664B45244l175j857m11R88K245K885K636K075K052K671L315L545L532L553L465
$$ 245244 242069 240212 239801 240789 243034 245919 248555 250630 252682 255353 258668 262213 265745 269298 272763
55649B72763K809J354n73k315l470m158m726n368o197p325q550r147q455o733
$$ 272763 275572 276926 276353 274038 270568 266410 261684 256316 250119 242794 234244 225097 216642 209909
55635B09909n062m304m345m396l866k904k140j942j963j711j373j583k260k468
$$ 209909 204847 200543 196198 191802 187936 185032 182892 180950 178987 177276 175903 174320 172060 169592
55621A69592j738r42j153k160k865k816k508k332k052j482r52q70j230j687j854
$$ 169592 167854 166912 165759 163599 160734 157918 155410 153078 151026 149544 148592 147722 146492 144805 142951
55606A42951j528r47o75r53j329j242q01n12m98m68k85n4K17N35N75k5j046j803
$$ 142951 141423 140476 139801 138848 137519 136277 135476 134964 134466 133998 133713 133659 133876 134411 134986 134961 133915 132112
55588A32112j897j459p70l6N14P26O79N14K58Nl6Q7Q3P2O51J810K493J951R48
$$ 132112 130215 128756 127986 127950 128464 129190 129869 130383 130641 130646 130610 130697 130780 130852 131503 133313 135806 137757 138705
55569A38705P23J292J752J778J741J612J033L46L53R58J168O19j1k62n26j068
$$ 138705 139428 140720 142472 144250 145991 147603 148636 148982 149335 150293 151461 152080 152069 151807 151281 150213
55553A50213j405j118m65J16M37K39o73j714j836q42M16J402K433L498L705K641
$$ 150213 148808 147690 147225 147341 147778 148017 147344 145630 143794 142952 143368 144770 147203 150701 154406 157047
55537A57047J314Q57J106J270J343J762K224J964J011K19m0l30j144k090k411
$$ 157047 158361 159218 160324 161594 162937 164699 166923 168887 169898 170117 170077 169747 168603 166513 164102
55522A64102j923j161p62r25j431k044k691l236l340k821k014j425j115q41o91
$$ 164102 162179 161018 160256 159331 157900 155856 153165 149929 146589 143768 141754 140329 139214 138373 137682
55507A37682r88j592j912j659j152p64o11q39j543k287k394j951j828k379k769
$$ 137682 136694 135102 133190 131531 130379 129615 129004 128165 126622 124335 121941 119990 118162 115783 113014
55492A13014k071m51J139J979J872R93j44q33q01l75J15O59J126J098N14n8j75
$$ 113014 110943 110492 111631 113610 115482 116475 116331 115498 114697 114322 114437 115096 116222 117320 117834 117776 117601
55475A17601o3nJ14K90M3p62j333q88K05R69J073Q74N51j0o02p43l64P2J41j78
$$ 117601 117538 117533 117647 117937 117980 117218 115885 114997 115202 116171 117244 118118 118669 118659 118057 117314 116950 117022 117163 116985
55455A16985o03o63LJ049J425N23r21j630j291o67m02m12m08l87m23m63n07o17
$$ 116985 116382 115719 115722 116771 118196 118719 117798 116168 114877 114210 113808 113396 112988 112601 112178 111715 111208 110591
55437A10591o91n17r8L66P86J156J328J110N89j1n49q58o07J96Q10N05l36n67
$$ 110591 109900 109383 109285 109651 110437 111593 112921 114031 114620 114609 114060 113202 112595 112791 113601 114106 113770 113203
55419A13203K16J151J346R73P73R42J140J216J391J664J610R57O3m38l73k08m35
$$ 113203 113419 114570 115916 116889 117662 118604 119744 120960 122351 124015 125625 126582 126645 126207 125834 125626 125191
55402A25191j013j493j586j431j342j457j636j616j285q27n69n77n48k90n8j31
$$ 125191 124178 122685 121099 119668 118326 116869 115233 113617 112332 111505 110936 110359 109811 109521 109463 109332
55386A09332k38M4N02M42k36p85p42n80q94j360j161j48R74J489J279O86J46p0
$$ 109332 109094 109138 109640 110082 109846 109061 108319 107739 106845 105485 104324 104176 105150 106639 107918 108604 108750 108680
55368A08680MJ61L91Q91J621K188K376K378K272J746P60o1k56k99q35j520j474
$$ 108680 108684 108845 109236 110127 111748 113936 116312 118690 120962 122708 123468 123407 123151 122852 122017 120497 119023
55351A19023p37l23p37j300j203n11K18P36J019Q87K68m03n58j81J51j8n27p58
$$ 119023 118286 117963 117226 115926 114723 114212 114430 115166 116185 117072 117340 116937 116379 116198 116349 116331 115804 115046
55333A15046k94O03J161Q76Q6m61n37n79q48r25l63N30R85P69L98L70N94O92N34
$$ 115046 114752 115355 116516 117392 117478 117017 116480 115901 115053 114128 113765 114295 115280 116049 116447 116817 117411 118103 118637
55314A18637K55j0j65j15M5m1n48j031q51p3N08M26J31K52P05R97J041J027P52
$$ 118637 118892 118882 118717 118602 118647 118606 118058 117027 116176 116103 116611 117037 117168 117420 118125 119122 120163 121190 121942
55295A21942j18j197j536r09k13k55o51m69N46J795K610K690K056J016J86N5M54
$$ 121942 121824 120627 119091 118182 117969 117714 117063 116594 117140 118935 121545 124235 126291 127307 127493 127548 128002
55278A28002O64R3j197k487k912k214j104o02q73j074n35K94N27J25j08L22R86
$$ 128002 128666 128759 127562 125075 122163 119949 118845 118243 117370 116296 115761 116055 116582 116707 116599 116921 117907
55261A17907J239J055R26J104J334J278R65O22K38l62r76j047m83Rj65n97n35
$$ 117907 119146 120201 121127 122231 123565 124843 125808 126430 126668 126306 125330 124283 123800 123809 123644 123047 122512
55244A22512p8P0j43o9M62Q56Q50Q85J039P01k69j013r95q82j258j434n52Q34
$$ 122512 122434 122504 122361 122292 122754 123610 124460 125345 126384 127085 126816 125803 124808 123926 122668 121234 120682 121516
55226A21516J455J136P17N71L59Q7J92N79N72J1n42p54q32q44n58q0J69K12N04
$$ 121516 122971 124107 124824 125395 125754 125841 126033 126612 127184 127195 126653 125899 125067 124223 123665 123585 123754 123966 124470
55207A24470R80R84L25l27m16j32J84N44Q73P12j59j220j743j511q16r9K39P9
$$ 124470 125450 126434 126759 126432 126016 125884 126068 126612 127485 128197 128038 126818 125075 123564 122748 122649 122888 122967
55189A22967k08r1M62J023J343J509J488J118N54K01R9p4l57m61m00m66n82m08
$$ 122967 122759 122668 123130 124153 125496 127005 128493 129611 130165 130366 130465 130391 130034 129573 129173 128707 128125 127717
55171A27717j33k94o81m21N65J216Q97L30M10R16J144R87O56L8q23j253p93k5
$$ 127717 127584 127290 126609 126188 126753 127969 128866 129196 129606 130522 131666 132653 133309 133347 132524 131271 130478 130453
55153A30453L02M43J006J648J476N29k46l99l77m86m59k04j25m35q19r79r81q47
$$ 130453 130755 131198 132204 133852 135328 135857 135611 135212 134835 134349 133890 133686 133561 133126 132307 131328 130347 129500
55135A29500m76j23k99r71j406j127m83L3M32Q44R97O70K89M95J230J748J504
$$ 129500 129024 128901 128602 127631 126225 125098 124615 124648 125080 125924 126921 127591 127880 128375 129605 131353 132857
55118A32857O12n25j615k425k661k178j191j30O91J201J415J290Q33K70k7J21
$$ 132857 133469 132944 131329 128904 126243 124065 122874 122744 123435 124636 126051 127341 128174 128444 128417 128538
55102A28538M91P33P74P92Q90R47R19J016J401J851J939J536R02L10j98n68n64
$$ 128538 129029 129762 130536 131328 132218 133165 134084 135100 136501 138352 140291 141827 142729 143039 142841 142273 141709
55085A41709j36K60J13l62m11K46R49R37K79l82p19q38p67l99N9J20l59r71j309
$$ 141709 141573 141833 141946 141584 141173 141419 142368 143305 143584 143202 142483 141645 140878 140479 140538 140658 140299 139328 138019
55066A38019j399j416j345j086o60j58L14N18K50k87n66l50J03M98P92R02O17
$$ 138019 136620 135204 133859 132773 132113 131955 132269 132787 133037 132750 132184 131834 131937 132435 133227 134129 134746
55049A34746O8j60K10O56N41k2m65o35p95r18o50pM36K80j85m15k67oJ07L6j28
$$ 134746 134814 134654 134864 135520 136061 136039 135574 134939 134144 133226 132576 132569 133005 133285 133100 132685 132418 132412 132519 132555 132427
55028A32427l31n49p14o71l08K38O34O57M02N0l23o04n46j09L25M22M40Q73J568
$$ 132427 132096 131547 130833 130162 129854 130092 130726 131383 131785 131835 131512 130908 130362 130253 130578 131000 131440 132313 133881
55009A33881J721Q92l43j061r41k99M73J115J323R20K50k2L68J018J463J629J589
$$ 133881 135602 136494 136151 135090 134149 133850 134323 135438 136761 137681 137931 137909 138277 139295 140758 142387 143976
54992A43976J168L20m53n07J25P83J064J157J215R56J60q10j340j160m08N84J296
$$ 143976 145144 145464 145011 144504 144629 145412 146476 147633 148848 149804 149964 149154 147814 146654 146246 146830 148126
54975A48126J287P66N45R73J371J058M49L96Q22R16N06K34L43K90j75n22l97k19
$$ 148126 149413 150179 150724 151697 153068 154126 154575 154971 155793 156709 157215 157449 157792 158082 157907 157385 156988 156769
54957A56769l26l23J32N84N25L36O98J435J679J017q5r22j091o13J04M75L50J69
$$ 156769 156443 156120 156252 156836 157361 157697 158395 159830 161509 162526 162441 161519 160428 159815 159919 160394 160744 160913
54939A60913K48K36k60q74q19J27J455K534K948K580J870J727K555L611L982L920
$$ 160913 161161 161397 161137 160263 159444 159571 161026 163560 166508 169088 170958 172685 175240 178851 182833 186753
54923A86753M392N530O443O704O939P620Q117P569O062M242K255k47l128n555
$$ 186753 191145 196675 203118 209822 216761 224381 232498 240067 246129 250371 252626 252379 249251 243696
54909B43696o843p186p315p670q043p995p424o623n783m735l334j940j206j338
$$ 243696 236853 229667 222352 214682 206639 198644 191220 184597 178814 174079 170745 168805 167599 166261
54895A66261j794j776r42L46J312J418R37P67J494K714L540L588L220K943L025
$$ 166261 164467 162691 161749 162095 163407 164825 165762 166529 168023 170737 174277 177865 181085 184028 187053
54880A87053L618M696N807O338O254O203O662P286P290O194L999J004k178m693
$$ 187053 190671 195367 201174 207512 213766 219969 226631 233917 241207 247401 251400 252404 250226 245533
54866B45533o013o471o875p573q179q252p908p469o814n544l823k530k280k597
$$ 245533 239520 233049 226174 218601 210422 202170 194262 186793 179979 174435 170612 168082 165802 163205
54852A63205k529j844j130q03o52m68m81q23j102r52o60p25j153j568j728j525
$$ 163205 160676 158832 157702 156899 156247 155779 155298 154475 153373 152421 151761 151036 149883 148315 146587 145062
54836A45062q18J28M61k71j207j021L30J515J524P37R5n4N8K22M08O39R36J225
$$ 145062 144244 144372 144833 144562 143355 142334 142664 144179 145703 146440 146535 146481 146539 146761 147169 147808 148744 149969
54818A49969J215P02Jl54l38l55m09m9O88J034N59j38l20j28j57m53n85m24k44
$$ 149969 151184 151886 151887 151533 151195 150840 150431 150382 151070 152104 152663 152525 152205 152077 151920 151467 150882 150458 150214
54799A50214j39M2K78L33J40r4j22K34J039J978K337J674M20n23p00l02K94P86
$$ 150214 150075 150117 150395 150728 150868 150774 150652 150886 151925 153903 156240 157914 158334 157811 157111 156809 157103 157889
54781A57889Q97O55O45J412K512K782J863R17J327K999M506M822M436M593N853
$$ 157889 158786 159441 160086 161498 164010 166792 168655 169572 170899 173898 178404 183226 187662 192255 198108
54766A98108P631Q993R480R182Q335P171N919M652L065P29k285n252p383q402
$$ 198108 205739 214732 224212 233394 241729 248900 254819 259471 262536 263265 260980 255728 248345 239943
54752B39943q471p812o698n622n087n123n212m835l970l025k379k002j564q73
$$ 239943 231472 223660 216962 211340 206253 201130 195918 191083 187113 184088 181709 179707 178143 177270
54738A77270k11j9k31j74O21J651J917J184M09O49J866L169M030M771N746O617
$$ 177270 177059 177040 176809 176635 177256 178907 180824 182008 182417 183066 184932 188101 192131 196902 202648 209265
54722B09265O875O715O791P154P029N837L877J747m69k870n076o493p148p617
$$ 209265 216140 222855 229646 236800 243829 249666 253543 255290 254821 251951 246875 240382 233234 225617
54708B25617q099q158p489o420n428m623l900l250k603j830j093q80j265j567
$$ 225617 217518 209360 201871 195451 190023 185400 181500 178250 175647 173817 172724 171844 170579 169012
54694A69012j159l06K33K89L24N86P64O26L41k2p59j883k651k290j068m4K06J03
$$ 169012 167853 167547 167780 168069 168393 168979 169743 170369 170710 170688 169929 168046 165395 163105 162037 161993 162199 162302
54676A62302J27P4m17j022j104o82l53l07j72O7j48q81j289q39k63m19q31l60
$$ 162302 162429 162503 162086 161064 159960 159278 158925 158618 158446 158513 158365 157484 156195 155356 155093 154674 153843 153483
54658A53483Q79J523Q59k76q20o98l83n1K77L77J72l9o0q4j86p9L16N89N12L82
$$ 153483 154362 155885 156744 156468 155648 154950 154567 154516 154793 155170 155342 155303 155243 155159 154973 154894 155210 155799 156311 156693
54638A56693L11j20r50j349p23K68O37M85O16J163J532J391Q22k22j585k290j453
$$ 156693 157004 156884 155934 154585 153862 154130 154767 155252 155868 157031 158563 159954 160776 160554 158969 156679 155226
54621A55226K36J045L59o41p59j12N67J005J154Q27J93L3P21J506J368L20o84
$$ 155226 155462 156507 156866 156225 155466 155354 155921 156926 158080 158907 159100 159133 159854 161360 162728 163048 162364
54604A62364q28n9J031J583J085j7p07n95k85l03l83k26k18o25p72K1J161J456
$$ 162364 161536 161477 162508 164091 165176 165159 164452 163857 163572 163269 162886 162660 162442 161817 161045 161066 162227 163683
54586A63683Q14J71q0m25r34q87j21L69j18q38p23k5J43m14p47k72M14N75M17
$$ 163683 164497 164668 164588 164163 163229 162342 162221 162590 162472 161634 160911 160886 161029 160615 159868 159596 160010 160585 161002
54567A61002O13J154J286O15l03o62m25k98p40j346j341n28N12J088J011N97L16
$$ 161002 161615 162769 164055 164670 164367 163705 163280 162982 162242 160896 159555 159027 159539 160627 161638 162235 162551
54550A62551N18J174J769J664Q08j07m09j54Q3Qk05l33l06K0Q43J952K667K507
$$ 162551 163069 164243 166012 167676 168484 168377 167968 167814 167897 167905 167700 167367 167061 167081 167924 169876 172543 175050
54532A75050J698Q71M21L81O05P86M86l99j292j490j034o48p46r32o33J26Q31
$$ 175050 176748 177619 178040 178421 179026 179812 180298 179899 178607 177117 176083 175435 174689 173757 173124 173250 174081
54515A74081J068P68J59k65o6N65Q32K85n63r62r09q64p50j34O74O35m66j389
$$ 174081 175149 175917 176076 175811 175745 176310 177142 177427 176864 175902 174993 174129 173379 173245 173919 174554 174088 172699
54497A72699r43M64J446J405Q45K51m08j043j230r31p54j070j374r66Q9J108J616
$$ 172699 171756 172220 173666 175071 175916 176167 175759 174716 173486 172555 171801 170731 169357 168391 168480 169588 171204
54480A71204J603J209N93N9j91k84l93l12K65J082J477J266R95J128J411J386
$$ 171204 172807 174016 174609 174668 174477 174193 173800 173488 173753 174835 176312 177578 178573 179701 181112 182498
54464A82498J135J061J162J007L98l44q54j092j151r68n09p0q7o08j094r32q4
$$ 182498 183633 184694 185856 186863 187261 186917 186063 184971 183820 182852 182343 182273 182186 181578 180484 179552 179468
54447A79468Q44J199R08M43K23K18J89O9r1l72q97j474j653j236n51l8K77O33
$$ 179468 180312 181511 182419 182862 183085 183303 183492 183561 183470 183098 182201 180727 179074 177838 177287 177249 177526 178159
54429A78159J012J076O68J25j10NJ85L20N78R59J053N11l44p59m06K49N59M28
$$ 178159 179171 180247 180915 181040 180930 180935 181120 181440 182018 182977 184030 184541 184197 183438 183032 183281 183840 184268
54411A84268K32J64K2l95q86j068q09l33P3L42N32O22N04K60K42P18J461J938
$$ 184268 184500 184664 184686 184291 183405 182337 181528 181195 181268 181610 182142 182764 183268 183528 183770 184488 185949 187887
54393A87887J930J734J649J532J066L37j64j20L01P18Q99P73K49o98j767k351
$$ 187887 189817 191551 193200 194732 195798 196135 195971 195851 196152 196870 197769 198542 198791 198093 196326 193975
54377A93975k036j124m35m43p18n42P5L72r3q07r54k95Q05J853K342J852N44o50
$$ 193975 191939 190815 190380 189937 189219 188677 188752 189124 189031 188224 187270 186975 187780 189633 191975 193827 194371 193721
54359A93721q97m00j4o5j57k9M2j48l46k92j04QO8J49J82J16J8j19l80o93q57
$$ 193721 192824 192424 192410 192345 192188 192159 192201 192053 191707 191415 191311 191319 191387 191536 191718 191834 191852 191733 191353 190660 189803
54338A89803q03n62m8P29J328J281P75L68R1m48j056r75j00P37J028J221J631
$$ 189803 189000 188438 188390 189119 190447 191728 192503 192871 192962 192514 191458 190483 190383 191120 192148 193369 195000
54321A95000J742J284J051J691K472K369J749J751K422K712K195J486R74K72q07
$$ 195000 196742 198026 199077 200768 203240 205609 207358 209109 211531 214243 216438 217924 218898 219170 218363
54306B18363j797k379k788l117l003k349j639j208q78n37m59o91q56q23r67j367
$$ 218363 216566 214187 211399 208282 205279 202930 201291 200083 199205 198668 198209 197518 196662 195839 194872 193505
54290A93505j468r40k90j33l75n82o26n12j04M53N63l8o79o02L2N09N94N38L93
$$ 193505 192037 191097 190807 190674 190299 189717 189091 188579 188475 188928 189491 189453 188774 188172 188204 188713 189307 189845 190238
54271A90238J3l59k45L93J129J628J753J326L76m36l14O04J279J003J32n28o05
$$ 190238 190251 189892 189647 190040 191169 192797 194550 195876 196252 195816 195502 196106 197385 198388 198520 197992 197387
54254A97387k80J07L04K67K09L45N39M69R9k66m94p03q42o24p2K52j23r74j675
$$ 197387 197107 197214 197518 197785 197994 198339 198878 199347 199446 199180 198686 197983 197141 196517 196445 196697 196574 195600 193925
54235A93925j820j387n94J56M18K12J33O00J173J017P4q00q71k91L22O60Q31R56
$$ 193925 192105 190718 190124 190280 190698 190910 191043 191643 192816 193833 193907 193107 192236 191945 192267 192927 193758 194714
54217A94714J012R09N30j66q76j040n10J19K09r4k15j65n05j235j533r53k40l29
$$ 194714 195726 196635 197165 196999 196123 195083 194573 194692 194901 194807 194592 194427 193922 192687 191154 190201 189961 189632
54199A89632j027j395j104o22j90M78J375J877J607R98O34M58J18k72k66J75O18
$$ 189632 188605 187210 186106 185484 185294 185772 187147 189024 190631 191629 192263 192721 192839 192567 192301 192476 193094
54182A93094P29N85L63L7m54r52j095o72O6N98O76N52N39N07J86j95o7O29J229
$$ 193094 193823 194408 194771 194808 194354 193402 192307 191635 191701 192299 192975 193527 194066 194573 194759 194564 194497 195126 196355
54163A96355J158N46j34o14q56q94r27j183j465j287o80l25o19j110j303j327
$$ 196355 197513 198059 197925 197311 196455 195561 194634 193451 191986 190699 190019 189694 189075 187965 186662 185335
54147A85335j310p59N42J601J254j28j055r55o23o00l60M48J115R81N75Q25J676
$$ 185335 184025 183266 183808 185409 186663 186535 185480 184525 183902 183302 182942 183390 184505 185486 186061 186886 188562
54130A88562K255K062J252J66q05j140p23k03k24m14L7J003J444R43L79O24J313
$$ 188562 190817 192879 194131 194297 193492 192352 191629 191426 191202 190788 190825 191828 193272 194215 194594 195218 196531
54113A96531J488R90N38N32M85j40j016j282o93RK9n05p88m48J3J3l02l54M8N11
$$ 196531 198019 199009 199547 200079 200564 200424 199408 198126 197433 197442 197471 196966 196178 195730 195743 195756 195454 195100 195148 195659
54093A95659N81J43n32r05n14M27R89N82j71j36Q01J609J589J167R23O25j56r77
$$ 195659 196240 196383 195851 194946 194432 194859 195848 196430 196259 196123 196924 198533 200122 201289 202212 202837 202681 201704
54075B01704r37J47J480K209K053J269M78L87J075J633J109j99j017o82J70O19
$$ 201704 200767 200914 202394 204603 206656 207925 208403 208790 209865 211498 212607 212408 211391 210709 210879 211498
54059B11498M67j1o38j229j383q54O2Q82J385J503J154N09J09L68J191K302L531
$$ 211498 211965 211954 211316 210087 208704 207850 207912 208794 210179 211682 212836 213345 213454 213822 215013 217315 220846
54042B20846M501M619L895L280L602M483M996N063N356O006O368O149N937O303
$$ 220846 225347 229966 233861 237141 240743 245226 250222 255285 260641 266647 273015 279164 285101 291404
54028B91404P023P531P558P006N710L795J940Q98Q24J282J743J910J817J723J802
$$ 291404 298427 305958 313516 320522 326232 330027 331967 332865 333689 334971 336714 338624 340441 342164 343966
54013C43966J908J837J703J700J659J252O92P07J685L323N186P123Q975J0388
$$ 343966 345874 347711 349414 351114 352773 354025 354717 355424 357109 360432 365618 372741 381716 392104
53999C92104J1088J0888R230N408l97o788j2185j5836j7659j7787j6698j5239
$$ 392104 403192 414080 423310 428718 428321 421533 409348 393512 375853 358066 341368 326129
53987C26129j3885j2358j0399q438o981n859m705l795l593l756l389k267j126
$$ 326129 312244 299886 289487 281049 274068 268209 263504 259709 256116 252360 248971 246704 245578
53974B45578o52p89j049j145j080r84r17p71m45j83l46p79q29l47rk41m40k6M31
$$ 245578 244926 244137 243088 241943 240863 239879 238962 238191 237746 237563 237217 236438 235609 235262 235253 235012 234572 234546 234977
53955B34977L7q61j048j97Q81J628K274K899L051K695K501K809L125L085L109
$$ 234977 235014 234153 233105 232908 233789 235417 237691 240590 243641 246336 248837 251646 254771 257856 260965
53940B60965L572M090M226M294M803N551N947N866N637N448N188M752M124L452
$$ 260965 264537 268627 272853 277147 281950 287501 293448 299314 304951 310399 315587 320339 324463 327915
53926C27915L148L592M437M754M150L255K752K500K186K218L147M536N274N007
$$ 327915 331063 334655 339092 343846 347996 351251 354003 356503 358689 360907 364054 368590 373864 378871
53912C78871M504M618N447O626P770Q415Q052O619M777L335K493J751N83q95k001
$$ 378871 383375 387993 393440 400066 407836 416251 424303 430922 435699 439034 441527 443278 443861 442966 440965
53897D40965k253k020k124k860l711m172m417m880n546o099o540p180q099q926
$$ 440965 438712 436692 434568 431708 427997 423825 419408 414528 408982 402883 396343 389163 381064 372138
53883C72138r223q865q069p257o764o524o160n476m671l864k866j697r53j173
$$ 372138 362915 354050 345981 338724 331960 325436 319276 313800 309129 305265 302399 300702 299749 298576
53869B98576k032k671k692k340j911j576j694k540l631l926l046j764j021q82
$$ 298576 296544 293873 291181 288841 286930 285354 283660 281120 277489 273563 270517 268753 267732 266850
53855B66850q44p18p32r48j089r31n37j3O26J326J906K248K461K746L130L501
$$ 266850 266006 265288 264556 263608 262519 261588 261051 261038 261664 262990 264896 267144 269605 272351 275481 278982
53839B78982L906M687O153Q174J0354J2591J5205J8347K1452K3465K3473K0986
$$ 278982 282888 287575 293728 301902 312256 324847 340052 358399 379851 403316 426789 447775
53827D47775J5895Q632L80p213j2790j5794j6442j5474j3859j2404j1396j0742
$$ 447775 463670 472302 472682 465469 452679 436885 420443 404969 391110 378706 367310 356568
53815C56568j0356j0180r938r142p632n880m577l967l691l232k390j348l21P59
$$ 356568 346212 336032 326094 316952 309320 303440 298863 294896 291205 287973 285583 284235 283914 284673
53801B84673K166L902N440O109N759M970M520M668M978M811M022L051K365J914
$$ 284673 286839 290741 296181 302290 308049 313019 317539 322207 327185 331996 336018 339069 341434 343348
53787C43348J423J006J042J402J354N29n08j066j327j943k910l551l574l476l743
$$ 343348 344771 345777 346819 348221 349575 350104 349596 348530 347203 345260 342350 338799 335225 331749 328006
53772C28006m302m878n360n561n240m663m575n176n576m845l358k377k463k884
$$ 328006 323704 318826 313466 307905 302665 298002 293427 288251 282675 277830 274472 272095 269632 266748
53758B66748k737k067j629j830k286k341j786j049o95q39j057r28n01j11J34M35
$$ 266748 264011 261944 260315 258485 256199 253858 252072 251023 250328 249489 248432 247504 247003 246892 247026 247461
53742B47461R22J342J343Q82L19M0O9Q9j06l19j91K59N77M49R7q1j02k78o25p57
$$ 247461 248383 249725 251068 251950 252269 252309 252378 252467 252361 252042 251851 252110 252687 253136 253233 253152 253050 252772 252147 251390
53722B51390n09k64m28p73o43K23J356K067K055J510Q90O76J126J953K467K246
$$ 251390 250881 250617 250189 249416 248773 248996 250352 252419 254474 255984 256874 257550 258676 260629 263096 265342
53706B65342J709J727K621L732M088L399K302J655J764K212K418K249K083K311
$$ 265342 267051 268778 271399 275131 279219 282618 284920 286575 288339 290551 292969 295218 297301 299612
53692B99612K927L646M225M487M198L281K113J254Q78P31P11R96J433J323K62
$$ 299612 302539 306185 310410 314897 319095 322376 324489 325743 326621 327352 328063 329059 330492 331815 332077
53677C32077j108j715j292n12%K21L09K16n8k24j69k44p27j207r86p1O87N88j78
$$ 332077 330969 329254 327962 327450 327450 327671 327980 328196 328138 327914 327745 327501 326774 325567 324581 324510 325197 325785 325607
53658C25607r90j604k104k308j811q02j79m87j141j193o28k35l12k57M04J246
$$ 325607 324617 323013 320909 318601 316790 315988 315809 315322 314181 312988 312360 312125 311813 311556 311960 313206
53642C13206J562J212N25k12o31k45R44K105K429K088J789J631J135K65l63l27
$$ 313206 314768 315980 316505 316293 315662 315417 316361 318466 320895 322983 324772 326403 327538 327803 327440 327113
53626C27113J63P48J274J556J448J269J606K458L195L475L628L831L649K868K206
$$ 327113 327276 328024 329298 330854 332302 333571 335177 337635 340830 344305 347933 351764 355413 358281 360487
53611C60487K537L711M700M738L933K956K554L083M085M521L845K738K324K847
$$ 360487 363024 366735 371435 376173 380106 383062 385616 388699 392784 397305 401150 403888 406212 409059
53597D09059L489L453K770K006J585J448J234O90j8m86o01n93m96mQ55J324P97
$$ 409059 412548 416001 418771 420777 422362 423810 425044 425734 425716 425230 424629 424036 423540 423536 424391 425715 426512
53580D26512k37p40n08l55r46k023k951l365l194k482j593j112j237j522j512
$$ 426512 426275 425535 425027 424672 423726 421703 418752 415387 412193 409711 408118 407006 405769 404247 402735
53565D02735j309j241j246j063q10r12j404j738j429n83L37J081J614J804J479
$$ 402735 401426 400185 398939 397876 397066 396154 394750 393012 391583 391000 391337 392418 394032 395836 397315
53550C97315Q62N50Q72J498J965K330K945L693M030L821L747M514O015P490Q366
$$ 397315 398177 398727 399599 401097 403062 405392 408337 412030 416060 419881 423628 428142 434157 441647 450013
53535D50013Q658Q628Q308P368N527L188J450J122J776K409K922M246O679R027
$$ 450013 458671 467299 475607 482975 488502 491690 493140 494262 496038 498447 501369 505615 512294 521321
53521E21321J0031R944R960J0579J1495J2629J4197J5840J6799J7056J7452J8474
$$ 521321 531352 541296 551256 561835 573330 585959 600156 615996 632795 649851 667303 685777
53509F85777J9740K0885K2065K3284K4005K3988K3766K3875K4102K4043K3864
$$ 685777 705517 726402 748467 771751 795756 819744 843510 867385 891487 915530 939394
53498I39394K3921K4012K3691K3045K2655K2818K3198K3246K2714K1896K1457
$$ 939394 963315 987327 1011018 1034063 1056718 1079536 1102734 1125980 1148694 1170590 1192047
53487A192047K1755K2291K2167K1179K0020J9239J8625J7870J7229J6998J6935
$$ 1192047 1213802 1236093 1258260 1279439 1299459 1318698 1337323 1355193 1372422 1389420 1406355
53476A406355J6788J6881J7502J8064J7700J6401J4820J3144J0947Q166N348K779
$$ 1406355 1423143 1440024 1457526 1475590 1493290 1509691 1524511 1537655 1548602 1556768 1562116 1564895
53464A564895M6l186o488r104j0776j1872j2891j4024j5122j5954j6503j6912
$$ 1564895 1564941 1561755 1555267 1546163 1535387 1523515 1510624 1496600 1481478 1465524 1449021 1432109
53452A432109j7213j7323j7482j8223j9628k0985k1594k1592k1482k1278k0708
$$ 1432109 1414896 1397573 1380091 1361868 1342240 1321255 1299661 1278069 1256587 1235309 1214601
53441A214601j9964j9398j8745j7411j5613j4265j3654j3036j1746j0028q430
$$ 1214601 1194637 1175239 1156494 1139083 1123470 1109205 1095551 1082515 1070769 1060741 1052311
53430A052311p051n685m246k692j044L72J213J847L123N196P267Q757J0072J1732
$$ 1052311 1045260 1039575 1035329 1032637 1031593 1031965 1033178 1035025 1038148 1043344 1050611 1059368 1069440 1081172
53416A081172J3468J4758J5662J6597J7779J9384K1669K4284K6102K6525K6491
$$ 1081172 1094640 1109398 1125060 1141657 1159436 1178820 1200489 1224773 1250875 1277400 1303891
53405A303891K7324K8969L0370L1310L2747L5283L8263M0787M2775M4660M6623
$$ 1303891 1331215 1360184 1390554 1421864 1454611 1489894 1528157 1568944 1611719 1656379 1703002
53394A703002M8533N0328N2054N3751N5438N7097N8586N9717O0433O0666O0214
$$ 1703002 1751535 1801863 1853917 1907668 1963106 2020203 2078789 2138506 2198939 2259605 2319819
53383B319819N8967N7171N5116N2786N0200M7751M5683M3437M0265L6420L2994
$$ 2319819 2378786 2435957 2491073 2543859 2594059 2641810 2687493 2730930 2771195 2807615 2840609
53372B840609L0454K8055K4901K0921J6621J2438Q598M937N63n713j4060k3145
$$ 2840609 2871063 2899118 2924019 2944940 2961561 2973999 2982597 2987534 2988097 2982384 2968324 2945179
53360B945179l1390l8272m4083m8992n2911n5871n7920n8861n8692n8022n7452
$$ 2945179 2913789 2875517 2831434 2782442 2729531 2673660 2615740 2556879 2498187 2440165 2382713
53349B382713n6723n5110n2619n0089m8112m6454m4860m3835m4078m5412m6699
$$ 2382713 2325990 2270880 2218261 2168172 2120060 2073606 2028746 1984911 1940833 1895421 1848722
53338A848722m6899m5931m4386m2666m0628l8088l5354l2963l0994k8967k6511
$$ 1848722 1801823 1755892 1711506 1668840 1628212 1590124 1554770 1521807 1490813 1461846 1435335
53327A435335k3798k1194j8853j6890j5702j5622j6328j6961j6926j6379j5792
$$ 1435335 1411537 1390343 1371490 1354600 1338898 1323276 1306948 1289987 1273061 1256682 1240890
53316A240890j5297j4605j3483j2104j0790r549q073o222m300k664j332k25N13
$$ 1240890 1225593 1210988 1197505 1185401 1174611 1165062 1156989 1150767 1146467 1143803 1142471 1142246 1142759
53303A142759Q55J396K803M868O674P871R083J0849J2898J4871J7023J9585K2054
$$ 1142759 1143614 1145010 1147813 1152681 1159355 1167226 1176309 1187158 1200056 1214927 1231950 1251535 1273589
53290A273589K3850K5203K6547K7486K7315K6380K5845K6054K6150K5505K4544
$$ 1273589 1297439 1322642 1349189 1376675 1403990 1430370 1456215 1482269 1508419 1533924 1558468
53279A558468K3712K2569K0534J7939J5596J3696J1761R427O709L717O65j967
$$ 1558468 1582180 1604749 1625283 1643222 1658818 1672514 1684275 1693702 1700411 1704128 1704793 1702826
53267A702826l857n396p313r781j2343j4750j7321k0273k3162k5387k6966k8381
$$ 1702826 1698969 1693573 1686260 1676479 1664136 1649386 1632065 1611792 1588630 1563243 1536277 1507896
53255A507896k9780l0768l1064l1004l1150l1585l1812l1293k9914k8043k6341
$$ 1507896 1478116 1447348 1416284 1385280 1354130 1322545 1290733 1259440 1229526 1201483 1175142
53244A175142k5443k5507k5985k6106k5681k5195k5103k5382k5837k6372k6627
$$ 1175142 1149699 1124192 1098207 1072101 1046420 1021225 996122 970740 944903 918531 891904
53233H91904k5912k4046k1907k0505j9663j8375j6374j4406j2889j1215q950o966
$$ 891904 865992 841946 820039 799534 779871 761496 745122 730716 717827 706612 697662 690696
53221F90696o563p837r675j1181j2375j3491j4316j4494j4039j3298j2654j2381
$$ 690696 684133 676296 666621 655440 643065 629574 615258 600764 586725 573427 560773 548392
53209E48392j2533j2693j2175j0742q983p742p235p053o881o817o930o875o331
$$ 548392 535859 523166 510991 500249 491266 483524 476289 469236 462355 455538 448608 441733 435402
53196D35402n633n467n990o624o848o821o922p001o550n564m767m857n675o329
$$ 435402 429769 424302 418312 411688 404840 398019 391097 384096 377546 371982 367215 362358 356683 350354
53182C50354n975m546k802j713j643k084k298k124j947j990j962j517p27M8N63
$$ 350354 344379 339833 337031 335318 333675 331591 329293 327169 325222 323232 321270 319753 319026 319074 319637
53167C19637Q10Q36O83M64L20L20L90L92K54M6j60m55r53j478j614j277r69j161
$$ 319637 320447 321283 321966 322430 322750 323070 323460 323852 324106 324152 323992 323537 322584 321106 319492 318215 317246 316085
53149C16085j634j787j396p80k52J44M36N83N39J72p09j870k488k048j193r75
$$ 316085 314451 312664 311268 310488 310236 310380 310816 311399 311938 312110 311401 309531 307043 304995 303802 302827
53133C02827j318j146r4Q86R06K85k21m58o14n71k27J36M20J021J956K347J621
$$ 302827 301509 300363 300269 301155 302061 302346 302125 301667 301053 300482 300255 300391 300811 301832 303788 306135 307756
53116C07756O35N10Q58L73r99j834j259j01L39k89j466k501k793k162j304j248
$$ 307756 308391 308901 309759 310132 309133 307299 306040 305939 306278 305989 304523 302022 299229 297067 295763 294515
53100B94515k005k416j647k25P91R63M21n35j293j064P4Q85M02p53j301j078r61
$$ 294515 292510 290094 288447 288222 289013 289976 290397 289862 288569 287505 287579 288464 288866 288113 286812 285734 284773
53083B84773j337j671j543j221r40m73K80R21J118J056R45N68k31j008j106m84
$$ 284773 283436 281765 280222 279001 278061 277588 277868 278789 279907 280963 281908 282476 282245 281237 280131 279647
53067B79647K65O47O70O10O00N38K48k55o57n74j1O07R46J143J486J936K221K265
$$ 279647 279912 280559 281229 281839 282439 282977 283225 282970 282313 281739 281728 282335 283281 284424 285910 287846 290067 292332
53049B92332K247K217K028J692J476J496J483J164O04K8n54j239j935k401k567
$$ 292332 294579 296796 298824 300516 301992 303488 304971 306135 306739 306767 306213 304974 303039 300638 298071
53034B98071k490k133j471p94n76r05j356j446j072l94L63Q87Q67L38k31l80r9
$$ 298071 295581 293448 291977 291183 290607 289702 288346 286900 285828 285434 285797 286684 287551 287889 287658 287278 287179
53017B87179L00N59O20N58M81L93J15l89o68j72Q56J393Q67q5m33K4P07J077R27
$$ 287179 287479 288038 288658 289216 289697 290090 290205 289816 289148 288976 289832 291225 292092 292007 291574 291598 292305 293382 294309
52998B94309K48n97q26p1R66J348J152J101J162O27m26q71j76P58R66P66R93J597
$$ 294309 294557 293960 293134 293063 294029 295377 296529 297630 298792 299419 298993 298122 297946 298704 299670 300436 301429 303026
52980C03026J893J753J591J440R45K81K23J078K131K457J915J141Q59J313K133
$$ 303026 304919 306672 308263 309703 310648 310929 311152 312230 314361 316818 318733 319874 320733 322046 324179
52965C24179K665K491J717P50o7m73k68M39J062R77J89p35j301j439j308j065
$$ 324179 326844 329335 331052 331802 331735 331262 330994 331433 332495 333472 333661 332926 331625 330186 328878 327813
52949C27813r01j045j569k313k946l123k643j680p37k44k32m48o65p47o28m13
$$ 327813 326912 325867 324298 321985 319039 315916 313273 311593 310856 310612 310380 309932 309267 308520 307892 307479
52933C07479k82k19o2L5m13j436k177j823p16K8p6m18k92K19M92J81m37o79m6
$$ 307479 307197 306978 306916 306951 306538 305102 302925 301102 300386 300414 300338 299920 299628 299847 300339 300520 300083 299404 299358
52914B99358J199K022J661N84L8M97J111Q46k02j008q22J07Q54O90k47j041q77
$$ 299358 300557 302579 304240 304824 304862 305359 306470 307316 307114 306106 305284 305391 306245 306935 306688 305647 304770
52897C04770J32J170J628J487Q60k52j563k397k294j412j40J240K217K020N35
$$ 304770 304902 306072 307700 309187 310047 309795 308232 305835 303541 302129 301989 303229 305446 307466 308001
52882C08001j138j729j307j028j481j983j727r33m67o54r39o95J5N32M10L2K71
$$ 308001 306863 305134 303827 302799 301318 299335 297608 296675 296208 295554 294615 293920 293935 294467 294877 294909 295180
52865B95180J364K368K138Q23j35K33J208J362M50l44K1J204K077K036J280K21
$$ 295180 296544 298912 301050 301873 301738 301971 303179 304541 304991 304647 304668 305872 307949 309985 311265 311486
52849C11486r41k038k856l330l570l603l348k900k524k254j857j386j378k089
$$ 311486 310545 308507 305651 302321 298751 295148 291800 288900 286376 284122 282265 280879 279501 277412
52835B77412k866k808j933j139r93j146j139j134j373j357l09J586L057L088J967
$$ 277412 274546 271738 269805 268666 267673 266527 265388 264254 262881 261524 261215 262801 265858 268946 270913
52820B70913P59M8l47o12n37pN19N37K61M04J182K080K705L308M100M520L813
$$ 270913 271672 271720 271373 270761 270224 270217 270736 271273 271534 271938 273120 275200 277905 281213 285313 289833 293646
52803B93646K115L01j111k251l123l322k813k309k370k634k461j952j672j650
$$ 293646 295761 296062 294951 292700 289577 286255 283442 281133 278763 276129 273668 271716 270044 268394
52789B68394j316m91K08J18o46j323j307o68MK12J03K68Q74J334J077M36K23O24
$$ 268394 267078 266587 266795 266913 266267 264944 263637 262969 262973 263185 263288 263556 264430 265764 266841 267277 267500 268124
52771B68124J044J097J058J190J186P84L99N63J035J114P73P89J539K238J876
$$ 268124 269168 270265 271323 272513 273699 274483 274882 275445 276480 277594 278367 279156 280695 282933 284809
52756B84809N76m72m69J48M33O9n39j013j280j252q12k31o4l05k01O57J522J421
$$ 284809 285385 284913 284444 284592 285025 285094 284555 283542 282262 281010 280198 279967 279903 279598 279397 280054 281576 282997
52738B82997N73O0K03K18k95n66J20J176J495R92N02M46N04N05O95R70P52j5n32
$$ 282997 283570 283630 283833 284051 283756 283190 283310 284486 285981 286973 287475 287921 288425 288930 289625 290595 291347 291332 290800
52719B90800l46j71p47j422r41N69J473Q21l03k88Q31J557J011j01p29p93q26
$$ 290800 290454 290283 289536 288114 287173 287742 289215 290036 289733 289445 290276 291833 292844 292743 292014 291221 290395
52702B90395r05o59q4L25L44L49O27Q98P93N83Q25J452J670R41k79j023q59k04
$$ 290395 289490 288831 288747 289072 289416 289765 290392 291290 292083 292666 293491 294943 296613 297554 297275 296252 295393 295189
52684B95189L37O57J079J817K668L211L187K620J728Q12J89O2L54O54N00k53j225
$$ 295189 295526 296183 297262 299079 301747 304958 308145 310765 312493 313305 313494 313556 313910 314564 315064 314811 313586
52667C13586j773j553q95n00o93j077j077o60k97k35k12M9M12O37Q07J171J702
$$ 313586 311813 310260 309365 308865 308172 307095 306018 305358 305061 304826 304614 304663 305075 305712 306519 307690 309392
52650C09392K154K415K433J975Q64n42j615k230k813l461l566k672j258k13J91
$$ 309392 311546 313961 316394 318369 319233 318691 317076 314846 312033 308572 305006 302334 301076 300863 301054
52635C01054L29M85N65N74P52J187J648K004K423K979L343L145K489J823J371
$$ 301054 301383 301868 302433 303007 303759 304946 306594 308598 311021 314000 317343 320488 322977 324800 326171
52620C26171Q35k59j944l523m035l185j744q14p47j003j027p88m97k59j80m34
$$ 326171 327006 326747 324803 321280 317245 314060 312316 311502 310755 309752 308725 307937 307440 307181 307001 306567
52604C06567r46j291j262j115j018o53J86R68J019N45M06R29J601J915J917J782
$$ 306567 305621 304330 303068 301953 300935 300282 300468 301436 302455 303000 303406 304335 305936 307851 309768 311550
52588C11550J506J220J177J198P78P0Q2J235K424K288J097L46O39R60L03q45j263
$$ 311550 313056 314276 315453 316651 317429 317499 317581 318816 321240 323528 324625 324971 325610 326570 326873 326028 324765
52571C24765o28J93L44j04m81m34k41l11n14l71J30J91p89k209k814k263j445
$$ 324765 324137 324330 324674 324570 324089 323655 323414 323103 322589 322218 322348 322539 321750 319541 316727 314464 313019
52554C13019j105r05l16K49j6r71j571j217l48L78Q13R94P39k1q60j183p73J63
$$ 313019 311914 311009 310693 310942 310926 309955 308384 307167 306819 307197 308010 309004 309743 309722 308862 307679 306906 307069
52536C07069J202J749J324K02n46j99O40P36j51j001r64l98j59l39l23K30J020
$$ 307069 308271 310020 311344 311546 311000 310801 311441 312177 312026 311025 310061 309663 309504 309165 308842 309072 310092
52519C10092J685K201K545K434J720P86K27K53O36J234K130L271M191M326L483
$$ 310092 311777 313978 316523 318957 320677 321463 321690 321943 322579 323813 325943 329214 333405 337731 341214
52504C41214J906Kj781k986l372l191l028l202l429l210k535j935j831k021j971
$$ 341214 343120 343122 341341 338355 334983 331792 328764 325562 322133 318923 316388 314453 312622 310601 308630
52489C08630j507r35m55K14J359K554K871J934M63m42m12N3M32P37J243J913K389
$$ 308630 307123 306188 305733 305947 307306 309860 312731 314665 315128 314686 314274 314327 314759 315496 316739 318652 321041
52472C21041K435K228K113K139J913J047k10j021p71K59J292J956K441K851K866
$$ 321041 323476 325704 327817 329956 331869 332916 332706 331685 330914 331173 332465 334421 336862 339713 342579
52457C42579K171Q94n59j845k654k788k528k592l300m004l825k817j902j686j838
$$ 342579 344750 345644 345085 343240 340586 337798 335270 332678 329378 325374 321549 318732 316830 315144 313306
52442C13306j728j200n69j54q0l03o55r36j114j241j224r08l92l2kj39l04n97
$$ 313306 311578 310378 309809 309655 309575 309272 308617 307681 306567 305326 304102 303194 302802 302770 302768 302629 302325 301728
52424C01728j021j220q06J57J145J551J103J47m39N0J378K562L042L260L825M537
$$ 301728 300707 299487 298681 298838 299983 301534 302637 302784 302345 302395 303773 306335 309377 312637 316462 320999
52408C20999M735M381M231M918O366Q125R842J1222J1854J1381R803P430M621
$$ 320999 325734 330115 334346 339264 345630 353755 363597 374819 386673 398054 407857 415287 419908
52395D19908J553j707m939p635r298r886r709q895p389n586m363l966l419j763
$$ 419908 421461 419754 414815 407180 397882 387996 378287 369392 362003 356417 352054 348088 344669 342906
52381C42906L53J335Q03J64O97J990K803K813K699K951L405L840M308M747M857
$$ 342906 343259 344594 345397 345561 346258 348248 351051 353864 356563 359514 362919 366759 371067 375814 380671
52366C80671M481L844L137K194P81r17k269k675k092j125n04m18m53j97K85O85
$$ 380671 385152 388996 392133 394327 395108 394191 391922 389247 387155 386030 385526 385108 384655 384458 384743 385428
52350C85428Q98J009J032J009J221J840K486K560K165K162L030M138M555M305
$$ 385428 386326 387335 388367 389376 390597 392437 394923 397483 399648 401810 404840 408978 413533 417838
52336D17838M231M727N258N301N157N402N975O451P043Q479J0771J2795J3582
$$ 417838 422069 426796 432054 437355 442512 447914 453889 460340 467383 475862 486633 499428 513010
52323E13010J3506J3597J4074J4256J3798J3183J2956J3156J3682J4561J5574
$$ 513010 526516 540113 554187 568443 582241 595424 608380 621536 635218 649779 665353
52312F65353J6203J6399J6798J7713J8482J8449J8120J8528J9717K0769K1221
$$ 665353 681556 697955 714753 732466 750948 769397 787517 806045 825762 846531 867752
52301H67752K1524K1944K1904K0866J9179J7506J5925J4084J1995J0004Q191O298
$$ 867752 889276 911220 933124 953990 973169 990675 1006600 1020684 1032679 1042683 1050874 1057172
52289A057172M256K344P74o00j989l366m517n311n793o063o132n866n158m146
$$ 1057172 1061428 1063772 1064546 1063946 1061957 1058591 1054074 1048763 1042970 1036907 1030775 1024909 1019751 1015605
52275A015605l213k687k547k451j994r78M23J767K834L924N529P666R803J1470
$$ 1015605 1012392 1009705 1007158 1004707 1002713 1001735 1002158 1003925 1006759 1010683 1016212 1023878 1033681 1045151
52261A045151J2606J3236J3278J2950J2931J3651J4681J5242J5249J5323J5888
$$ 1045151 1057757 1070993 1084271 1097221 1110152 1123803 1138484 1153726 1168975 1184298 1200186
52250A200186J6653J7047J6686J5450J3462J1096Q746O469M219K324J286R99P07
$$ 1200186 1216839 1233886 1250572 1266022 1279484 1290580 1299326 1305795 1310014 1312338 1313624 1314623 1315330
52237A315330j17j250k300l270m204m769m707m365m364m887n749o868q087q791
$$ 1315330 1315213 1313963 1311663 1308393 1304189 1299420 1294713 1290348 1285984 1281097 1275348 1268480 1260393 1251602
52223A251602q353p024n836n501n815o133n978n192l989k977k613k507j788k42
$$ 1251602 1243249 1236225 1230389 1224888 1219073 1212940 1206962 1201770 1197781 1194804 1192191 1189684 1187896 1187654
52209A187654J403K505L209L897M562N124N753O409O525N785M853M703N532O804
$$ 1187654 1189057 1191562 1194771 1198668 1203230 1208354 1214107 1220516 1227041 1232826 1237679 1242382 1247914 1254718
52195A254718Q120R394J0435J0949J0879J0237Q930P194N813N100M140J981o55
$$ 1254718 1262838 1272232 1282667 1293616 1304495 1314732 1323662 1330856 1336669 1341769 1345909 1347890 1347235
52182A347235k129k300k781m526o505p468p765q428r388r744r262q477p681o804
$$ 1347235 1345106 1342806 1340025 1335499 1328994 1321526 1313761 1305333 1295945 1286201 1276939 1268462 1260781 1253977
52168A253977o004n517n068m231l182k325j431l4J477K169J944J667J819J938
$$ 1253977 1247973 1242456 1237388 1233157 1229975 1227650 1226219 1226185 1227662 1229831 1231775 1233442 1235261 1237199
52154A237199J646J280J152R42L19m35q42p74k87N43J327J469R49M76M74M97R4
$$ 1237199 1238845 1240125 1241277 1242219 1242538 1242103 1241261 1240487 1240200 1240743 1242070 1243539 1244488 1244964 1245438 1245935 1246029
52137A246029l69l60j51m05j084j461j100k03Q89K144L735N829Q360J0817J2578
$$ 1246029 1245660 1245300 1245149 1244744 1243660 1242199 1241099 1240896 1241785 1243929 1247664 1253493 1261853 1272670 1285248
52122A285248J3716J5057J7021J8907J9931K0439K1229K2071K2008K1070K0479
$$ 1285248 1298964 1314021 1331042 1349949 1369880 1390319 1411548 1433619 1455627 1476697 1497176
52111A497176K0844K1192K0483J9176J8512J8748J9089J9059J9115J9712K0505
$$ 1497176 1518020 1539212 1559695 1578871 1597383 1616131 1635220 1654279 1673394 1693106 1713611
52100A713611K0800K0414J9733J9040J8048J6201J3282R657N857K047j897n869
$$ 1713611 1734411 1754825 1774558 1793598 1811646 1827847 1841129 1850786 1856643 1858690 1856793 1850924
52088A850924r399j2219j4563j6582j7712j7185j5162j2901j1547j1061j0657
$$ 1850924 1841525 1829306 1814743 1798161 1780449 1763264 1748102 1735201 1723654 1712593 1701936
52077A701936r904r023q195p233o018m806l724k341j96K440M747O275P228P888
$$ 1701936 1692032 1683009 1674814 1667581 1661563 1656757 1653033 1650692 1650496 1652936 1657683 1663958 1671186 1679074
52063A679074Q336Q871J0110J2197J4353J5618J5890J5805J5781J5607J4909J3604
$$ 1679074 1687410 1696281 1706391 1718588 1732941 1748559 1764449 1780254 1796035 1811642 1826551 1840155
52051A840155J1931J0333R213Q377O835L721n18m283o440p389q315r775j1323
$$ 1840155 1852086 1862419 1871632 1880009 1886844 1890565 1890047 1885764 1879324 1871935 1863620 1853845 1842522
52038A842522j2354j2827j3162j3717j4442j5027j5229j5075j4688j4109j3416
$$ 1842522 1830168 1817341 1804179 1790462 1776020 1760993 1745764 1730689 1716001 1701892 1688476
52027A688476j2955j3093j3736j4329j4496j4419j4452j4553j4335j3537j2283
$$ 1688476 1675521 1662428 1648692 1634363 1619867 1605448 1590996 1576443 1562108 1548571 1536288
52016A536288j0890r610q546p719p119o731o487o356o463p067q265r907j1863
$$ 1536288 1525398 1515788 1507242 1499523 1492404 1485673 1479186 1472830 1466367 1459300 1451035 1441128 1429265
52003A429265j4261j7223k0441k3317k5445k6766k7297k7051k6120k4701k2999
$$ 1429265 1415004 1397781 1377340 1354023 1328578 1301812 1274515 1247464 1221344 1196643 1173644
51992A173644k1346k0248j9892j9810j9466j9080j9353k0352k1275k1457k0988
$$ 1173644 1152298 1132050 1112158 1092348 1072882 1053802 1034449 1014097 992822 971365 950377
51981I50377k0232j9347j8526j8067j7846j7385j6712j6510j6857j6630j4854
$$ 950377 930145 910798 892272 874205 856359 838974 822262 805752 788895 772265 757411
51970G57411j2045r380p100m666k160l22P64J928L668N418O365O309N461L991
$$ 757411 745366 735986 728886 724220 722060 721738 722502 724430 728098 733516 739881 746190 751651 755642
51956G55642K103K2k246m753p046q391q687q583q464p898o420m328k227k68J788
$$ 755642 757745 757767 755521 750768 743722 735331 726644 718061 709597 701699 695279 690951 688724 688456 690244
51941F90244M044O376Q564J0236J1023J0991J0621J0101R081P334N171K868K08
$$ 690244 694288 700664 709228 719464 730487 741478 752099 762200 771281 778615 783786 786654 786862
51928G86862k936o038q463j0211j1692j3077j4381j5776j7164j7833j7223j5815
$$ 786862 783926 777888 769425 759214 747522 734445 720064 704288 687124 669291 652068 636253
51916F36253j4549j3583j2353j0751r260p958o253l921j586K04J734L417M988
$$ 636253 621704 608121 595768 585017 575757 567799 561546 557625 556039 556243 557977 561394 566382
51903E66382N958O502P261Q393R321R326Q043N479K008j699n052p906j0339j2165
$$ 566382 572340 578842 586103 594496 603817 613143 621186 626665 628673 626974 621922 614016 603677 591512
51889E91512j2931j2522j1385j0042q547o625m230j724N13K438M234O069Q082
$$ 591512 578581 566059 554674 544632 536085 529460 525230 523506 524019 526457 530691 536760 544842
51876E44842J0500J3364J6146J8030J8683J8556J8150J7318J5582J2942J0011
$$ 544842 555342 568706 584852 602882 621565 640121 658271 675589 691171 704113 714124
51865G14124P373N196L453K192J441J011M73p05k838n597q119r843j1070j2331
$$ 714124 721497 726693 730146 732338 733779 734790 735263 734558 731720 726123 718004 708161 697091 684760
51851F84760j3337j3256j1989j0571j0034j0362j0827j0898j0428r416q139p272
$$ 684760 671423 658167 646178 635607 625573 615211 604384 593486 583058 573642 565503 558231
51839E58231p310p879q035p260n890m487l169j705m7J486K557L149L443L406K767
$$ 558231 550921 543042 535007 527747 521857 517370 514201 512496 512449 513935 516492 519641 523084 526490 529257
51824E29257J482M8r63j513j939k309k360k037j594j069j55J154K322K955L234
$$ 529257 530739 530787 529824 528311 526372 524063 521703 519666 518072 517003 516848 518002 520324 523279 526513
51809E26513L325K819J384m31j677k148k445k978l504l684l559l269k812k228
$$ 526513 529838 532657 534041 533610 531933 529785 527340 524362 520858 517174 513615 510346 507534 505306
51795E05306j659j079k60P60J514J614J236Q19M82oo90j203j157o76l43n59j144
$$ 505306 503647 502568 502308 503068 504582 506196 507432 508251 508733 508727 508037 506834 505677 505001 504658 504099 502955
51778E02955j715k268l010l647l355j744N95K777M548O061P150P531P536P890
$$ 502955 501240 498972 495962 492315 488960 487216 487811 490588 495136 501197 508347 515878 523414 531304
51764E31304Q662R010Q177O282L970J685m93k692n100p614r579j0257r768r010
$$ 531304 539966 548976 557153 563435 567405 569090 568597 565905 560805 553191 543612 533355 523587 514577
51750E14577q461p634o091m442l627l539l130j869l63N98J127J929L261M659N657
$$ 514577 506116 498482 492391 487949 484322 480783 477653 475784 475421 476019 477146 479075 482336 486995 492652
51735D92652O342P028P629P750P399P127P136O655M825K072j8m19L18R78J124
$$ 492652 498994 506022 513651 521401 528800 535927 543063 549718 554543 556615 556597 556178 556496 557474 558598
51720E58598J177J447J682J440N21r24k386l242l315l072k977k827k122r79j35
$$ 558598 559775 561222 562904 564344 564865 563941 561555 558313 554998 551926 548949 546122 544000 543021 542886
51705E42886j4k15o0P35K070L732N354O307O044M604K651R30k07q13r74n50N66
$$ 542886 542872 542657 542597 543332 545402 549134 554488 560795 566839 571443 574094 575024 574817 574004 573030 572480 573046
51688E73046J991K843K351M21k465n670q489j0111j0022q567o787n490m542l367
$$ 573046 575037 577880 580231 580652 578187 572517 564028 553917 543895 535328 528541 523051 518509 515142
51674E15142j873p08m50p49n77N73J941K370J826J612K889N405P982R794J0592
$$ 515142 513269 512561 512111 511362 510785 511358 513299 515669 517495 519107 521996 527401 535383 545177 555769
51659E55769J0076P929M510Q14k549n699q546j0123r476o908l688p60J727L662
$$ 555769 565845 573774 578284 579098 576549 570850 562304 552181 542705 535797 532109 531349 533076 536738
51645E36738M492L842K136R8k175n170q852j2114j3684j3481j2580j1828j0944
$$ 536738 541230 545072 547208 547306 545131 539961 531109 518995 505311 491830 479250 467422 456478
51632D56478r294p038m964l386j909l66P06Q75O11P44J406J969J945J506J082
$$ 456478 447184 440146 435182 431796 429887 429521 430227 431102 431713 432457 433863 435832 437777 439283 440365
51617D40365Q55P27N51K27k81r01j489j903k016j776j311r23o95k94N98J650K114
$$ 440365 441220 441947 442498 442725 442444 441543 440054 438151 436135 434359 433048 432125 431430 431136 431734 433384 435498
51600D35498J815J592K380M045N547O239O620P620R476J1650J3622J5181J5854
$$ 435498 437313 438905 441285 445330 450877 457116 463736 471356 480832 492482 506104 521285 537139
51587E37139J4694J1182O175J492j546k899l193k834j874l04J914M961Q869J3213
$$ 537139 551833 563015 569190 570682 569136 566237 563044 560210 558336 558032 559946 564907 573776 586989
51573E86989J7279K0595K3074K4800K5976K7060K8573L0617L2689L4111L4539
$$ 586989 604268 624863 647937 672737 698713 725773 754346 784963 817652 851763 886302
51562H86302L4055L3060L2267L2620L4825L8730M3250M6892M8504M7493M3518
$$ 886302 920357 953417 985684 1018304 1053129 1091859 1135109 1182001 1230505 1277998 1321516
51551A321516L6281K5803J2827j385j5680k9258m1333n1001n7734o1767o3620
$$ 1321516 1357797 1383600 1396427 1395042 1379362 1350104 1308771 1257770 1200036 1138269 1074649
51540A074649o3476o1460n8220n4573n0565m5491l9187l2642k7013k2495j8593
$$ 1074649 1011173 949713 891493 836920 786355 740864 701677 669035 642022 619527 600934
51529F00934j5114j2270j0087q380p200o722o595o089n021m039l711l846l909
$$ 600934 585820 573550 563463 555083 547883 541161 534566 528477 523456 519417 515706 511860 507951
51516E07951l734l454l100k692k400k284k084j639j269j367j826k306k789l382
$$ 507951 504217 500763 497663 494971 492571 490287 488203 486564 485295 483928 482102 479796 477007 473625
51502D73625l750l459k797k562k881k957k182r05K23J012J495J540J317J531K500
$$ 473625 469875 466416 463619 461057 458176 455219 453037 452132 452355 453367 454862 456402 457719 459250 461750
51487D61750L365L071J851Q72N38J05r10j899k207k193k606l435m019l986l455
$$ 461750 465115 468186 470037 470909 471447 471552 470642 468743 466536 464343 461737 458302 454283 450297 446842
51472D46842k555j404m62k97q45j363j310q60m99l54k14J02O22J384K411L512
$$ 446842 444287 442883 442421 442124 441279 439916 438606 437746 437247 436893 436679 436781 437403 438787 441198 444710
51456D44710M213M059L001J572N40K58M03M60M46Q67K008L553N067O598Q504J0809
$$ 444710 448923 452982 455983 457555 458095 458353 458756 459216 459662 460529 462537 466090 471157 477755 486259 497068
51440D97068J3075J4865J5968J6052J4569J1401P458M139K149J063Q5j177k739
$$ 497068 510143 525008 540976 557028 571597 582998 590456 594595 596744 597807 597892 596715 593976
51427E93976m602o629q483j0049j1697j3521j4611j3807j1292q631o932n725m105
$$ 593976 589374 582745 574262 564213 552516 538995 524384 510577 499285 490654 483722 477997 473892
51414D73892k284j148p06m8J152K124K209J785J516J390J118J002J584K594L030
$$ 473892 471608 470460 469754 469706 470858 472982 475191 476976 478492 479882 481000 482002 483586 486180 489210
51399D89210K458J660J681K626L694M266M629N583P491R822J1702J2905J4143
$$ 489210 491668 493328 495009 497635 501329 505595 510224 515807 523298 533120 544822 557727 571870
51386E71870J6252J9254K2601K6138L0376L5608M1287M6721N1997N7595O3216
$$ 571870 588122 607376 629977 656115 686491 722099 763386 810107 862104 919699 982915
51375I82915O7643P0039P0731P0214O7755O1708N1228L7189K1327M940j1351k6959
$$ 982915 1050558 1120597 1191328 1261542 1329297 1391005 1442233 1479422 1500749 1505689 1494338 1467379
51363A467379m1091n3047o2444o9104p2895p3852p2238o8513o3359n7676n2268
$$ 1467379 1426288 1373241 1310797 1241693 1168798 1094946 1022708 954195 890836 833160 780892
51352G80892m7348m2496l7287l1845k6665k2118j8345j5514j3740j2716j1785
$$ 780892 733544 691048 653761 621916 595251 573133 554788 539274 525534 512818 501033
51341E01033j0611r511q836q294p294n863m766m532m750m576l656k328j119l60
$$ 501033 490422 480911 472075 463781 456487 450624 445858 441326 436576 432000 428344 426016 424897 424537
51327D24537j64m24p31n87J60J175J885J903J290N96L96O48O81J14m64k21O22
$$ 424537 424373 423949 423218 422631 422791 423966 425851 427754 429044 429640 430036 430684 431365 431479 431015 430794 431416
51310D31416R84M63JN72J791K455K122J481J197J110P02o1p58j175j641k608l962
$$ 431416 432400 432863 432864 433436 435227 437682 439804 441285 442482 443592 444294 444233 443475 442300 440659 438051 434089
51293D34089m975n032m398l935m038m169l680k689j739r31P8J396K695L727M495
$$ 434089 429114 424082 419684 415749 411711 407542 403862 401173 399434 398503 398581 399977 402672 406399 410894
51278D10894M948M939M645M574M971N518N744N489M853L945K868J727O87J47O40
$$ 410894 415842 420781 425426 430000 434971 440489 446233 451722 456575 460520 463388 465115 465802 465949 466589
51263D66589K107L416L288J752N6r87j862l183m512m964m483l761l229k813k529
$$ 466589 468696 472112 475400 477152 477208 476221 474359 471176 466664 461700 457217 453456 450227 447414 444885
51248D44885k678l331m155m692m581l681k332j279r42r16o47l26n00j046j238
$$ 444885 442207 438876 434721 430029 425448 421767 419435 418156 417214 416298 415651 415325 414825 413779 412541
51233D12541p70o0M61P05N98J43j19N31J884K800K608J875J388J158Q72P00Q90
$$ 412541 411771 411711 412172 412877 413475 413618 413499 414030 415914 418714 421322 423197 424585 425743 426615 427315 428205
51216D28205J076P58K09J65P99J600K170K558K886L173L511L967M286M155L714
$$ 428205 429281 430039 430248 430413 431212 432812 434982 437540 440426 443599 447110 451077 455363 459518 463232
51201D63232L349L109K730K233J937J856J558P75k79j263k024k494k666k716k784
$$ 463232 466581 469690 472420 474653 476590 478446 480004 480779 480500 479237 477213 474719 472053 469337 466553
51186D66553k585j770o42K8O2J37P57J529J831J585R84j5j282k056j699o74r1
$$ 466553 463968 462198 461556 461584 461646 461783 462540 464069 465900 467485 468469 468454 467172 465116 463417 462743 462652
51169D62652l01o00m09m6p8m89q39r30r41j024j105j018p14l26j32l20q06j334
$$ 462652 462351 461751 461342 461296 461218 460729 459890 458960 458019 456995 455890 454872 454158 453832 453700 453380 452574 451240
51151D51240j760k079k217k041j599j117o57q0M79M28n83j904k284j245L00J037
$$ 451240 449480 447401 445184 443143 441544 440427 439770 439690 440169 440597 440014 438110 435826 434581 434881 435918
51135D35918P13L00P47J855K627K463J776J413J738K365K571J976Q74J6l6N80
$$ 435918 436631 436931 437678 439533 442160 444623 446399 447812 449550 451915 454486 456462 457336 457352 457316 457896
51119D57896J234J557J730K053K501K885L211L539L708L502L049K734K689K650
$$ 457896 459130 460687 462417 464470 466971 469856 473067 476606 480314 483816 486865 489599 492288 494938
51105D94938K301J576O33k14o25n32l38m91q80r95o45j79J00K63L08q1r87j734
$$ 494938 497239 498815 499448 499234 498609 498077 497739 497248 496368 495373 494728 494549 494649 494912 495220 495139 494152 492418
51087D92418j458j11J393K039J531M04m33l92L50J077J325J260J240J302J433
$$ 492418 490960 490849 492242 494281 495812 496216 495783 495391 495741 496818 498143 499403 500643 501945 503378
51072E03378J898K823L620L481K474J587J564K139K630K771K740K793L274M559
$$ 503378 505276 508099 511719 515200 517674 519261 520825 522964 525594 528365 531105 533898 537172 541731
51058E41731O550Q407R264R125Q647Q189P536O515N419M663M436M877O147Q047
$$ 541731 548281 556688 565952 575077 583724 591913 599449 605964 611383 616046 620482 625359 631506 639553
51044F39553R863J0994J1610J2229J2711J2147R991O961M441L103K420J535K02
$$ 639553 649416 660410 672020 684249 696960 709107 719098 726059 730500 733603 736023 737558 737760
51031G37760j345l168n748r211j2783j5342j6400j6325j5675j4649j3252j1620
$$ 737760 736415 733247 727499 718288 705505 690163 673763 657438 641763 627114 613862 602242
51019F02242r888p911n488k796l55J530K989M202N086N554N845O272O726O812
$$ 602242 592354 584443 578955 576159 575804 577334 580323 584525 589611 595165 601010 607282 614008 620820
51005F20820O509O370O904P943Q803Q990Q573P949P503P475P899Q528Q964R067
$$ 620820 627329 633699 640603 648546 657349 666339 674912 682861 690364 697839 705738 714266 723230 732297
50991G32297R154R659J0661J1984J3574J5436J7160J8011J7860J7688J8525K0152
$$ 732297 741451 751110 761771 773755 787329 802765 819925 837936 855796 873484 892009 912161
50979I12161K1394K1761K2085K3143K4342K4365K2771K0387J8239J6771J6085
$$ 912161 933555 955316 977401 1000544 1024886 1049251 1072022 1092409 1110648 1127419 1143504
50968A143504J6309J7535J9817K3394K8516L4862M1426M7218N1877N5596N8741
$$ 1143504 1159813 1177348 1197165 1220559 1249075 1283937 1325363 1372581 1424458 1480054 1538795
50957A538795O1585O4019O5417O5147O3300O0524N7002N2232M6084L9476L3476
$$ 1538795 1600380 1664399 1729816 1794963 1858263 1918787 1975789 2028021 2074105 2113581 2147057
50946B147057K8246K3441J9163J5814J3287J1097R273Q361Q472Q847Q452O554
$$ 2147057 2175303 2198744 2217907 2233721 2247008 2258105 2267378 2275739 2284211 2293058 2301510 2308064
50934B308064K928j885o616j0289j3328j6984k1610k6307l0352l4144l8334m2873
$$ 2308064 2310992 2309107 2302491 2292202 2278874 2261890 2240280 2213973 2183621 2149477 2111143 2068270
50922B068270m7510n2406n7531o1951o4635o5661o5925o5906o5304o3648o0658
$$ 2068270 2020760 1968354 1910823 1848872 1784237 1718576 1652651 1586745 1521441 1457793 1397135
50911A397135n6264n0950m5907m2017l8822l5215l1101k7478k4866k2602k0058
$$ 1397135 1340871 1289921 1244014 1201997 1163175 1127960 1096859 1069381 1044515 1021913 1001855
50900A001855j7642j6008j4884j3413j1290r026p213n986n109m257l302k526k343
$$ 1001855 984213 968205 953321 939908 928618 919592 912379 906393 901284 897027 893725 891199 888856
50887H88856k665k807k217j081M6Q78J455J942K661L984N756P235P982Q518R499
$$ 888856 886191 883384 881167 880086 880132 881010 882465 884407 887068 891052 896808 904043 912025 920543 930042
50872I30042J0638J1165J1129J1368J2235J3177J3827J4663J6249J8476K1056
$$ 930042 940680 951845 962974 974342 986577 999754 1013581 1028244 1044493 1062969 1084025
50861A084025K4109K7708L1324L4419L7326M0769M4815M9040N3671N9676O7421
$$ 1084025 1108134 1135842 1167166 1201585 1238911 1279680 1324495 1373535 1427206 1486882 1554303
50850A554303P5962Q4197R2151J00508J09209J17328J24413J31193J38519J45949
$$ 1554303 1630265 1714462 1806613 1907121 2016330 2133658 2258071 2389264 2527783 2673732
50840B673732J51885J55060J55390J53324J48867J41545J31070J17587J01447
$$ 2673732 2825617 2980677 3136067 3289391 3438258 3579803 3710873 3828460 3929907
50831C929907Q3202O3954M5174K7903J2356j474j3095k1643k6573k7839k5565
$$ 3929907 4013109 4077063 4122237 4150140 4162496 4161022 4147927 4126284 4099711 4071872 4046307
50820D046307k0071j2308l884L627R271J2494J2592Q718M44j1866k7277m4748
$$ 4046307 4026236 4013928 4010044 4013671 4022942 4035436 4048028 4056746 4057190 4045324 4018047 3973299
50808C973299o3302q1906r9549j15594j29935j42424j52217j58019j59283j56861
$$ 3973299 3909997 3828091 3728542 3612948 3483013 3340589 3188372 3030353 2871070 2714209
50798B714209j52057j45217j35683j23187j08865r4498q1212o9108n7976m7838
$$ 2714209 2562152 2416935 2281252 2158065 2049200 1954702 1873490 1804382 1746406 1698568
50788A698568l8755l0498k2768j5584r304m294o54J708K911L079K346P50j733
$$ 1698568 1659813 1629315 1606547 1590963 1581659 1577365 1576711 1578419 1581330 1584409 1586755 1587505 1585772
50775A585772m900q094j0596j2287j3673j5112j6390j7248j8079j9570k1802k4078
$$ 1585772 1580872 1572778 1562182 1549895 1536222 1521110 1504720 1487472 1469393 1449823 1428021 1403943
50763A403943k5722k6672k7285k7847k8374k8546k7821k5891k3154k0340j7653
$$ 1403943 1378221 1351549 1324264 1296417 1268043 1239497 1211676 1185785 1162631 1142291 1124638
50752A124638j4642j1103p620m914k983j168J126M062P426J0761J3689J6397J9533
$$ 1124638 1109996 1098893 1091273 1086359 1083376 1082208 1083334 1087396 1094822 1105583 1119272 1135669 1155202
50739A155202K3404K7586L1658L5843M0453M5082M9123N2851N7237O2593O8117
$$ 1155202 1178606 1206192 1237850 1273693 1314146 1359228 1408351 1461202 1518439 1581032 1649149
50728A649149P2931P6945Q0444Q3397Q5470Q6358Q5912Q4165Q1427P7963P3498
$$ 1649149 1722080 1799025 1879469 1962866 2048336 2134694 2220606 2304771 2386198 2464161 2537659
50717B537659O7377N9278M9307L7397K3421Q149o575j9173k9276l6839m1061m1021
$$ 2537659 2605036 2664314 2713621 2751018 2774439 2782588 2776013 2756840 2727564 2690725 2649664 2608643
50705B608643l7075l0702k3100j4741o286J055O379R668J1174J0654P525J424
$$ 2608643 2571568 2540866 2517766 2503025 2496739 2497794 2504173 2513841 2525015 2535669 2543194 2544618
50693B544618p608j9140l2251m5720n8523o9952p9238q5498q8290q7845q4574
$$ 2544618 2537010 2517870 2485619 2439899 2381376 2311424 2232186 2146688 2058398 1970553 1885979
50682A885979p8739p0925o2294n3815m5455l6614k7199j7773q739O2Q868J7511
$$ 1885979 1807240 1736315 1674021 1620206 1574751 1538137 1510938 1493165 1484426 1484488 1493356 1510867
50670A510867K5513L2391L7783M1587M4016M5356M5544M4228M1213L6667L0985
$$ 1510867 1536380 1568771 1606554 1648141 1692157 1737513 1783057 1827285 1868498 1905165 1936150
50659A936150K4817J9123J4736J1678R249O920M752K831Q58j316l155m024m102
$$ 1936150 1960967 1980090 1994826 2006504 2015753 2022673 2027425 2030256 2031114 2029798 2026643 2022619 2018517
50646B018517m157m461m390l172o04L052P488J2401J7405K2158K6538L0525L3983
$$ 2018517 2014360 2009899 2005509 2002337 2001733 2004785 2012273 2024674 2042079 2064237 2090775 2121300 2155283
50633B155283L6639L8347L9267L9748L9963L9735L8918L7791L6795L5661L3198
$$ 2155283 2191922 2230269 2269536 2309284 2349247 2388982 2427900 2465691 2502486 2538147 2571345
50622B571345K8052J9511P419p971k5360m1955n4556o1415o2759n9668n3154m4337
$$ 2571345 2599397 2618908 2626327 2618356 2592996 2551041 2496485 2435070 2372311 2312643 2259489 2215152
50610B215152l4647k5324j6995r936m404m72J973K887K031n93m738j0454j7972
$$ 2215152 2180505 2155181 2138186 2128250 2123846 2123374 2125347 2128234 2130265 2129672 2124934 2114480 2096508
50597B096508k6812l5679m3633n0747n7105o1891o4239o4385o3274o1363n8615
$$ 2096508 2069696 2034017 1990384 1939637 1882532 1820641 1756402 1692017 1628743 1567380 1508765
50586A508765n5295n1791m7888m3168l7992l3256k9182k5251k1261j7560j4175
$$ 1508765 1453470 1401679 1353791 1310623 1272631 1239375 1210193 1184942 1163681 1146121 1131946
50575A131946j0644o973l797j336R40L312N276O519P522Q671R496R475Q979Q682
$$ 1131946 1121302 1114329 1110532 1109196 1110136 1113448 1118724 1125243 1132765 1141436 1150932 1160407 1169386 1178068
50561A178068Q643Q710R424J1600J5191J9288K3225K7058L1005L4943L8596M1806
$$ 1178068 1186711 1195421 1204845 1216445 1231636 1250924 1274149 1301207 1332212 1367155 1405751 1447557
50549A447557M4509M6594M7778M7594M5739M2581L8961L5354L1709K8271K5961
$$ 1447557 1492066 1538660 1586438 1634032 1679771 1722352 1761313 1796667 1828376 1856647 1882608
50538A882608K5392K6131K7535K9843L3543L8127M2404M5984M9548N3657N8161
$$ 1882608 1908000 1934131 1961666 1991509 2025052 2063179 2105583 2151567 2201115 2254772 2312933
50527B312933O2923O8224P4115Q0091Q5787R1398R6948J01637J04366J04686J02782
$$ 2312933 2375856 2444080 2518195 2598286 2684073 2775471 2872419 2974056 3078422 3183108 3285890
50516C285890R8838R2820Q4669P4344O1743M6969L0616J3596l460k0444l7389
$$ 3285890 3384728 3477548 3562217 3636561 3698304 3745273 3775889 3789485 3786025 3765581 3728192
50505C728192n3851o8797q1172r0561r7121j00839j01127r7454r0101p9973o7783
$$ 3728192 3674341 3605544 3524372 3433811 3336690 3235851 3134724 3037270 2947169 2867196 2799413
50494B799413n3823l8482k2506o748Q006K0934L1228L8348M1897M1208L5506K4590
$$ 2799413 2745590 2707108 2684602 2677854 2685860 2706794 2738022 2776370 2818267 2859475 2894981 2919571
50482B919571R165r552l0092n0675o9514q5489r8177j07183j11997j12847j11018
$$ 2919571 2928736 2919184 2889092 2838417 2768903 2683414 2585237 2478054 2366057 2253210 2142192
50471B142192j07720j03003r6436q8513q0590p3485o6914o0473n4490m9486m5291
$$ 2142192 2034472 1931469 1835033 1746520 1665930 1592445 1525531 1465058 1410568 1361082 1315791
50460A315791m1219l6891l2438k8035k3728j9759j6541j4140j2008r580o898m435
$$ 1315791 1274572 1237681 1205243 1177208 1153480 1133721 1117180 1103040 1091032 1081452 1074554 1070119
50448A070119k467q38P20K381M228O109P511Q023P977Q218Q989R541R136Q086
$$ 1070119 1067652 1066814 1067534 1069915 1074143 1080252 1087763 1095786 1103763 1111981 1120970 1130511 1139647 1147733
50434A147733P342P352P830Q456R277J0338J1482J2517J3344J3869J4164J4690
$$ 1147733 1155075 1162427 1170257 1178713 1187990 1198328 1209810 1222327 1235671 1249540 1263704 1278394
50422A278394J5938J7856J9972K2113K4507K7122K9457L1276L3090L5566L8718
$$ 1278394 1294332 1312188 1332160 1354273 1378780 1405902 1435359 1466635 1499725 1535291 1574009
50411A574009M2110M5587M9335N3237N6603N8711N9524N9677N9779N9707N8683
$$ 1574009 1616119 1661706 1711041 1764278 1820881 1879592 1939116 1998793 2058572 2118279 2176962
50400B176962N6037N1796M6428M0188L2949K4626J5380N407n219j6376k7734l8810
$$ 2176962 2232999 2284795 2331223 2371411 2404360 2428986 2444366 2449773 2444554 2428178 2400444 2361634
50388B361634m9007n7694o4488o9476p2814p4157p2819o8628o2289n4706m6289
$$ 2361634 2312627 2254933 2190445 2120969 2048155 1973998 1901179 1832551 1770262 1715556 1669267
50377A669267l7146k7595j8186r293j018O469J2628J6740J8404J7845J5481J1191
$$ 1669267 1632121 1604526 1586340 1577047 1576029 1582498 1595126 1611866 1630270 1648115 1663596 1674787
50365A674787M438m606j4468k3528l1467l8831m5272m9316n0172m8895m7112m5321
$$ 1674787 1679225 1674619 1660151 1636623 1605156 1566325 1521053 1471737 1421565 1372670 1325558 1280237
50353A280237m3136m0607l8336l6419l4256l1492k8493k5710k3096k0465j7983
$$ 1280237 1237101 1196494 1158158 1121739 1087483 1055991 1027498 1001788 978692 958227 940244
50342I40244j5889j4090j2284j0473q965p932p165o388n581m854m135l225k162
$$ 940244 924355 910265 897981 887508 878543 870611 863446 857058 851477 846623 842488 839263 837101
50329H37101j271o58LR97K110K934L452L903M284M473M730N498O628P405P526
$$ 837101 835830 835172 835175 836172 838282 841216 844668 848571 852855 857328 862058 867556 874184 881589 889115
50314H89115P510P939Q726R470J0075J0650J1142J1434J1589J1767J2078J2687
$$ 889115 896625 904564 913290 922760 932835 943485 954627 966061 977650 989417 1001495 1014182
50302A014182J3634J4467J4534J3951J3727J4508J5708J6376J6509J6813J7426
$$ 1014182 1027816 1042283 1056817 1070768 1084495 1099003 1114711 1131087 1147596 1164409 1181835
50291A181835J7551J6287J3338Q985L924q82m602o923p899p623o431n231n140
$$ 1181835 1199386 1215673 1229011 1237996 1241920 1241038 1236436 1229513 1221614 1213991 1207560 1202329 1197189
50278A197189o661r384j2380j4625j5267j4049j1528q576n700k922k54K073L760
$$ 1197189 1190528 1181144 1168764 1154139 1138872 1124823 1113295 1104719 1099019 1096097 1095843 1097916 1101676
50265A101676M639M757M389L828L102K136J198P31O38L91O7M70J721K483J582
$$ 1101676 1106315 1111072 1115461 1119289 1122391 1124527 1125725 1126456 1127094 1127485 1127552 1128022 1129743 1132226 1133808
50250A133808l01j527j699j826k459k967k837k493k443k569k696l019l440l237
$$ 1133808 1133507 1131980 1130281 1128455 1125996 1123029 1120192 1117699 1115256 1112687 1109991 1106972 1103532 1100295
50236A100295k002l58Q44J536K104K491K394K030K013K461K866K877K813L177
$$ 1100295 1098293 1097935 1098779 1100315 1102419 1104910 1107304 1109334 1111347 1113808 1116674 1119551 1122364 1125541
50222A125541L929M557M690M514M504M864N403O014O998Q762J1359J4568J8222
$$ 1125541 1129470 1134027 1138717 1143231 1147735 1152599 1158002 1164016 1171014 1179776 1191135 1205703 1223925
50209A223925K2213K6318L0411L4659L9121M3272M6328M8004M8461M7645M5284
$$ 1223925 1246138 1272456 1302867 1337526 1376647 1419919 1466247 1514251 1562712 1610357 1655641
50198A655641M1620L7579L4009L1185K9119K7792K6855K5532K3125J9261J3478
$$ 1655641 1697261 1734840 1768849 1800034 1829153 1856945 1883800 1909332 1932457 1951718 1965196
50187A965196N090o113j9251l2751m5184n5591o3360o8139o9905o8914o5632o0609
$$ 1965196 1970286 1964173 1944922 1912171 1866987 1811396 1748036 1679897 1609992 1541078 1475446 1414837
50175A414837n4255m6812l8733l1003k4632j9892j6501j4514j4505j6673k0183
$$ 1414837 1360582 1313770 1275037 1244034 1219402 1199510 1183009 1168495 1153990 1137317 1117134
50164A117134k3620k5897k6688k6251k4942k2788j9680j6140j3373j1907j0637
$$ 1117134 1093514 1067617 1040929 1014678 989736 966948 947268 931128 917755 905848 895211
50153H95211q101m517j494K63J609L160M088L458J679k50k037l783n098n522n433
$$ 895211 887110 882593 881099 881362 882971 886131 890219 893677 895356 895106 893069 889286 884188 878666 873233
50138H73233n519n736n487m598l351j786K80K662M920O759P893P863O701N370
$$ 873233 867714 861978 856491 851893 848542 846756 847036 849698 854618 861377 869270 877133 883834 889204
50124H89204M740M491L877L203L427M448N004M504L890M262N538O961Q226R510
$$ 889204 893944 898435 902312 905515 908942 913390 918394 922898 926788 931050 936588 943549 951775 961285
50110I61285J0869J2203J3543J4945J6295J7540J8895K0548K2304K3769K4781
$$ 961285 972154 984357 997900 1012845 1029140 1046680 1065575 1086123 1108427 1132196 1156977
50099A156977K5621K6857K9040L2321L6356M0757M5601N1288N7960O5358P3224
$$ 1156977 1182598 1209455 1238495 1270816 1307172 1347929 1393530 1444818 1502778 1568136 1641360
50088A641360Q1391Q9424R6421J01413J03797J03471J00817R6613R1726Q6856
$$ 1641360 1722751 1812175 1908596 2010009 2113806 2217277 2318094 2414707 2506433 2593289
50078B593289Q2647P9759P8340P7462P5451P0917O3163N1699L6083J6532n600
$$ 2593289 2675936 2755695 2834035 2911497 2986948 3057865 3121028 3172727 3208810 3225342 3219742
50067C219742k8359n0129o9978q7320j01480j11685j17529j19543j19006j16910
$$ 3219742 3191383 3141254 3071276 2983956 2882476 2770791 2653262 2533719 2414713 2297803
50057B297803j13189j07341r9655r1224q2813p4332o5656n7375n0295m4595l9922
$$ 2297803 2184614 2077273 1977618 1886394 1803581 1729249 1663593 1606218 1555923 1511328 1471406
50046A471406l6003l2682k9537k6037k2176j8537j5541j2869r912o625l605j284
$$ 1471406 1435403 1402721 1373184 1347147 1324971 1306434 1290893 1278024 1268112 1261487 1257882 1256598
50034A256598O47K789N106O869P541P388P033O695O165N269M043K578R74o13k127
$$ 1256598 1257245 1260034 1265140 1272009 1279550 1286938 1293971 1300666 1306831 1312100 1316143 1318721 1319695 1319082 1316955
50019A316955l630n007n876o203o649p925r965j2250j4655j7230j9259j9527j7879
$$ 1316955 1313325 1308318 1302442 1296239 1289590 1281665 1271700 1259450 1244795 1227565 1208306 1188779 1170900
50006A170900j5684j4279j3523j2470j0896r285p618n179j735J879M740O865Q746
$$ 1170900 1155216 1140937 1127414 1114944 1104048 1094763 1087145 1081966 1080231 1082110 1086850 1093715 1102461
49993A102461J0268J0718R862Q364O988N866M803L814K897J651j95k001k640j839
$$ 1102461 1112729 1123447 1133309 1141673 1148661 1154527 1159330 1163144 1166041 1167692 1167497 1165496 1162856 1161017
49979A161017m13R75K700N533R661J4713K0233K5679L0525L4919L9775M5613N1638
$$ 1161017 1160604 1161579 1164279 1169812 1179473 1194186 1214419 1240098 1270623 1305542 1345317 1390930 1442568
49966A442568N6564N9919O1929O2496O1242N8363N4686N0948M7685M5548M4834
$$ 1442568 1499132 1559051 1620980 1683476 1744718 1803081 1857767 1908715 1956400 2001948 2046782
49955B046782M4781M4196M2727M0499L6611K9171J7235J727j5834l4328n2346
$$ 2046782 2091563 2135759 2178486 2218985 2255596 2284767 2302002 2303729 2287895 2253567 2201221
49944B201221o7763p9096q6534r0771r1588q8660q3245p7737p3450o9757o5496
$$ 2201221 2133458 2054362 1967828 1877057 1785469 1696809 1613564 1535827 1462377 1392620 1327124
49933A327124o0456n5308n0709m6850m3512m0297l6926l3404k9849k6282k2746
$$ 1327124 1266668 1211360 1160651 1113801 1070289 1029992 993066 959662 929813 903531 880785
49922H80785j9444j6582j4162j2140j0477q880o791m053j343M53J193J498J912
$$ 880785 861341 844759 830597 818457 807980 799100 792309 788256 786913 787366 788559 790057 791969
49909G91969K485L117L939N184O944R080J1338J3425J5055J6016J6285J6165J6050
$$ 791969 794454 797571 801510 806694 813638 822718 834056 847481 862536 878552 894837 911002 927052
49896I27052J5885J4948J2570Q956M957J133k469n833q870j1885j5328j8833k1214
$$ 927052 942937 957885 970455 979411 984368 985501 983032 977199 968329 956444 941116 922283 901069
$$ [...]
##END NTUPLES=NMR SPECTRUM
##END=
