
##TITLE=UV1280_M1_1242-1388_30_7534315_PKF8gpDg69
##JCAMPDX= 6.0         $$ Bruker NMR JCAMP-DX V2.0
##DATA TYPE= NMR SPECTRUM
##DATA CLASS= NTUPLES
##ORIGIN= BRUKER
##OWNER= Administrator
$$ 1.72 TOPSPIN		Version 2.1
$$ 2013-02-22 02:02:27.794 -0500  Administrator@X
$$ Compression mode = diff/dup
##.OBSERVE FREQUENCY= 400.02188249412
##.OBSERVE NUCLEUS= ^1H
##.ACQUISITION MODE= SIMULTANEOUS (DQD)
##.ACQUISITION SCHEME= undefined
##.AVERAGES= 8
##.DIGITISER RES= 22
##SPECTROMETER/DATA SYSTEM= spect
##.PULSE SEQUENCE= zg30
##.SOLVENT NAME= COFFEE_meoh
##.SHIFT REFERENCE= INTERNAL, COFFEE_meoh, 1, 14.98509
##AUDIT TRAIL= $$ (NUMBER, WHEN, WHO, WHERE, PROCESS, VERSION, WHAT)
$$ ##TITLE= Audit trail, TOPSPIN		Version 2.1
$$ ##JCAMPDX= 5.01
$$ ##ORIGIN= Bruker BioSpin GmbH
$$ ##OWNER= Administrator
$$ $$ E:\/data/COFFEE/nmr/UV1280_M1_1242-1388_30_7534315_PKF8gpDg69/10/pdata/1/auditp.txt
$$ ##AUDIT TRAIL=  $$ (NUMBER, WHEN, WHO, WHERE, PROCESS, VERSION, WHAT)
(   1,<2013-02-22 02:02:19.435 -0500>,<Administrator>,<X>,<go>,<TOPSPIN 2.1>,
      <created by zg
	started at 2013-02-22 02:01:13.044 -0500,
	POWCHK enabled, PULCHK disabled,
       configuration hash MD5:
       86 BA 57 50 F2 9D 5C 9B 26 00 A9 28 5F 66 2E 89
       data hash MD5: 64K
       21 32 A0 0C 9D 66 FE 81 71 A3 84 52 78 37 19 8D>)
(   2,<2013-02-22 02:02:22.544 -0500>,<Administrator>,<X>,<proc1d>,<TOPSPIN 2.1>,
      <Start of raw data processing
       efp LB = 0 FT_mod = 6 PKNL = 1 PHC0 = 0 PHC1 = 0 SI = 32K 
       data hash MD5: 32K
       07 8E 99 C9 DD CA C4 25 82 63 56 C4 12 E8 76 F3>)
(   3,<2013-02-22 02:02:23.029 -0500>,<Administrator>,<X>,<proc1d>,<TOPSPIN 2.1>,
      <pk PHC0 = 67.99438 PHC1 = 0 
       data hash MD5: 32K
       5F 69 23 2F C9 E7 AE 9F 75 B8 8A EF C8 8C FE 05>)
(   4,<2013-02-22 02:02:23.341 -0500>,<Administrator>,<X>,<proc1d>,<TOPSPIN 2.1>,
      <abs ABSG = 1 
       data hash MD5: 32K
       62 75 F4 6D D9 F8 0F 05 68 F4 D2 66 C5 DC 85 28>)
(   5,<2013-02-22 02:02:23.497 -0500>,<Administrator>,<X>,<proc1d>,<TOPSPIN 2.1>,
      <abs ABSG = 2 
       data hash MD5: 32K
       44 2C 60 B8 9C FE 1E E3 D7 1F 0B 2C 94 39 DB 96>)
(   6,<2013-02-22 02:02:23.638 -0500>,<Administrator>,<X>,<proc1d>,<TOPSPIN 2.1>,
      <abs ABSG = 3 
       data hash MD5: 32K
       ED B7 4E 08 F7 EA CD F6 7A FB 90 61 00 05 A8 63>)
(   7,<2013-02-22 02:02:23.794 -0500>,<Administrator>,<X>,<proc1d>,<TOPSPIN 2.1>,
      <abs ABSG = 4 
       data hash MD5: 32K
       C6 68 53 10 8C 3E 7A 18 AF 68 FE 79 3D C3 C4 F5>)
(   8,<2013-02-22 02:02:23.935 -0500>,<Administrator>,<X>,<proc1d>,<TOPSPIN 2.1>,
      <abs ABSG = 5 
       data hash MD5: 32K
       10 B7 A2 C5 A9 C7 DB 7C 3A 95 C5 3C 73 1F E5 E2>)
$$ ##END=
$$ 
$$ $$ hash MD5
$$ $$ 0A 21 76 65 E0 39 D7 F8 14 40 F4 8F F9 3E E8 34
##$RELAX= 
##$RELAX= 
##$RELAX= 
##$RELAX= 
##$RELAX= 
##$RELAX= 
##$RELAX= 
$$ Bruker specific parameters
$$ --------------------------
##$DU= <E:\>
##$EXPNO= 10
$$ [...]
150 150 150 150 150 150 150 150
##$TP07= 0
##$TPNAME0= <>
##$TPNAME1= <>
##$TPNAME2= <>
##$TPNAME3= <>
##$TPNAME4= <>
##$TPNAME5= <>
##$TPNAME6= <>
##$TPNAME7= <>
##$TPOAL= (0..7)
0.5 0.5 0.5 0.5 0.5 0.5 0.5 0.5
##$TPOFFS= (0..7)
0 0 0 0 0 0 0 0
##$TUNHIN= 0
##$TUNHOUT= 0
##$TUNXOUT= 0
##$USERA1= <user>
##$USERA2= <user>
##$USERA3= <user>
##$USERA4= <user>
##$USERA5= <user>
##$V9= 5
##$VALIST= <valist>
##$VCLIST= <CCCCCCCCCCCCCCC>
##$VD= 0
##$VDLIST= <DDDDDDDDDDDDDDD>
##$VPLIST= <PPPPPPPPPPPPPPP>
##$VTLIST= <TTTTTTTTTTTTTTT>
##$WBST= 1024
##$WBSW= 4
##$XGAIN= (0..3)
0 0 0 0
##$XL= 0
##$YL= 0
##$YMAX_a= 573332
##$YMIN_a= -570472
##$ZGOPTNS= <>
##$ZL1= 120
##$ZL2= 120
##$ZL3= 120
##$ZL4= 120
##$ABSF1= 14.98509
##$ABSF2= -5.573092
##$ABSG= 5
##$ABSL= 3
##$ALPHA= 0
##$AQORDER= 0
##$ASSFAC= 0
##$ASSFACI= 0
##$ASSFACX= 0
##$ASSWID= 0
##$AUNMP= <proc_prof1d_extract_pilot.lims>
##$AXLEFT= 0
##$AXNAME= <>
##$AXNUC= <1H>
##$AXRIGHT= 0
##$AXTYPE= 0
##$AXUNIT= <>
##$AZFE= 0.1
##$AZFW= 0.1
##$BCFW= 0
##$BC_mod= 0
##$BYTORDP= 0
##$COROFFS= 0
##$CY= 15
##$DATMOD= 1
##$DC= 0
##$DFILT= <>
##$DTYPP= 0
##$F1P= 0
##$F2P= 0
##$FCOR= 0.5
##$FTSIZE= 32768
##$FT_mod= 6
##$GAMMA= 0
##$GB= 0
##$INTBC= 1
##$INTSCL= 1
##$ISEN= 128
##$LB= 0
##$LEV0= 0
##$LPBIN= 0
##$MAXI= 10000
##$MC2= 0
##$MEAN= 0
##$ME_mod= 0
##$MI= 0
##$NCOEF= 0
##$NC_proc= -8
##$NLEV= 6
##$NOISF1= 0
##$NOISF2= 0
##$NSP= 0
##$NTH_PI= 0
##$NZP= 0
##$OFFSET= 14.98509
##$PC= 1
##$PHC0= 67.99438
##$PHC1= 0
##$PH_mod= 1
##$PKNL= yes
##$PPARMOD= 0
##$PPDIAG= 0
##$PPIPTYP= 0
##$PPMPNUM= 2147483647
##$PPRESOL= 1
##$PSCAL= 4
##$PSIGN= 0
##$PYNMP= <proc.py>
##$REVERSE= no
##$SF= 400.02
##$SI= 32768
##$SIGF1= 0
##$SIGF2= 0
##$SINO= 400
##$SIOLD= 32768
##$SPECTYP= <>
##$SREGLST= <1H.CDCl3>
##$SSB= 0
##$STSI= 32768
##$STSR= 0
##$SW_p= 8223.68421052631
##$SYMM= 0
##$S_DEV= 0
##$TDeff= 65536
##$TDoff= 0
##$TI= <>
##$TILT= no
##$TM1= 0
##$TM2= 0
##$TOPLEV= 0
##$USERP1= <user>
##$USERP2= <user>
##$USERP3= <user>
##$USERP4= <user>
##$USERP5= <user>
##$WDW= 1
##$XDIM= 32768
##$YMAX_p= 467785573
##$YMIN_p= -732278
##$CURPLOT= <Network HP LaserJet P1505>
##$CURPRIN= <$Network HP LaserJet P1505>
##$DFORMAT= <normdp>
##$LAYOUT= <+/1D_H.xwp>
##$LFORMAT= <normlp>
##$PFORMAT= <normpl>
##$SURQMSG= 1
$$ End of Bruker specific parameters
$$ ---------------------------------
##NTUPLES= NMR SPECTRUM
##VAR_NAME=  FREQUENCY,     SPECTRUM/REAL,   SPECTRUM/IMAG
##SYMBOL=    X,             R,               I
##VAR_TYPE=  INDEPENDENT,   DEPENDENT,       DEPENDENT
##VAR_FORM=  AFFN,          ASDF,            ASDF
##VAR_DIM=   32768,         32768,           32768
##UNITS=     HZ,            ARBITRARY UNITS, ARBITRARY UNITS
##FACTOR=    0.250966925370066, 1,           1
##FIRST=     8223.43324360094, -140454,      -64103
##LAST=      0,             127036,          -136720
##MIN=       0,             -732278,         0
##MAX=       8223.43324360094, 467785573,    0
$$ Real data points
##PAGE= N=1
##DATA TABLE= (X++(R..R)), XYDATA
$$ [...]
19565a89848E3894A8787K315a51924k5638J3686Q0224r2955B2085f28566a44345
$$ -189848 53894 18787 21102 -151924 -177562 -163876 -83652 -176607 22085 -628566 -144345
19553d4936A6577h9269m5528A65746A4816J36524a31132l8641o2957A48959b73315
$$ -44936 16577 -89269 -134797 165746 14816 151340 -131132 -169773 -232730 148959 -273315
19541d33242a1261A49734b39654c8118k12056H6257a86435A35792d024l21884
$$ -433242 -11261 149734 -239654 -38118 -250174 86257 -186435 135792 -4024 -325908
19531c25908F4918a25185D6312a93605r8906o1452a03424J573J5126d0689G3504
$$ -325908 64918 -125185 46312 -193605 -292511 -353963 -103424 -101851 -86725 -40689 73504
19519a23209K1090j57566B8694b37667a16753j60971d6067n4000c8121k50723
$$ -123209 -102119 -259685 28694 -237667 -116753 -277724 -46067 -100067 -38121 -288844
19509b88844F7852O8389c54417j8790A58121b00828q7598G519b58713J16041d7677
$$ -288844 67852 136241 -354417 -373207 158121 -200828 -288426 7519 -258713 -142672 -47677
19497b25644K0178A95002c85770e1958l10509I0498O8589k7092J10476b82620
$$ -225644 -205466 195002 -385770 -51958 -362467 90498 159087 131995 242471 -282620
19486b40447a10919p5223g2556A22514J19952k8244K53470f2497p4105E763J2011
$$ -240447 -110919 -186142 -72556 122514 242466 214222 467692 -62497 -136602 5763 17774
19475A7774a96605J6424d5622C0105b95593E821g2840b1167r998j13562C38b8001
$$ 17774 -196605 -180181 -45622 30105 -295593 5821 -72840 -21167 -31165 -144727 338 -28001
19462H3365b98596h0295k79181g0728o8751B701e0461n7406p5100A16724a15168
$$ 83365 -298596 -80295 -359476 -70728 -139479 2701 -50461 -107867 -182967 116724 -115168
19450B09237b41121b2273f033H0949h0505g464l34445a18272a5004B80229e4672
$$ 209237 -241121 -22273 -6033 80949 -80505 -7464 -341909 -118272 -15004 280229 -54672
19438b05578H4810b50613q865B39694g3091b3415A75864b77363p04g7323f298
$$ -205578 84810 -250613 -259478 239694 -73091 -23415 175864 -277363 -278067 -77323 -6298
19426a84626K8038L1528k8395A4390N5329d1980l64741H0102k3400a53476l2779
$$ -184626 -156588 -125060 -153455 14390 69719 -41980 -406721 80102 56702 -153476 -186255
19415a86255E1623O9171b17044I4724N2491G1845a17939e6863k38110J10779A10725
$$ -186255 51623 120794 -217044 94724 147215 71845 -117939 -56863 -294973 -184194 110725
19403b15819k33310e3151j01334a9448B63905o0801b7152j26599e9289A7338c34485
$$ -215819 -449129 -53151 -154485 -19448 263905 203104 -27152 -153751 -59289 17338 -334485
19391C6237g7175m57702a59410A12538D1918K6051c44350C7946d4813A27874J35167
$$ 36237 -77175 -534877 -159410 112538 41918 67969 -344350 37946 -44813 127874 263041
19380B63041D0122a23853j32733J3740c6905B19493e5797E1286H335a16714G0148
$$ 263041 40122 -123853 -256586 -242846 -36905 219493 -55797 51286 8335 -116714 70148
19368F1044H512a74811A31165b71787e5338o8553A5485P2258e4655q8642K5023
$$ 61044 8512 -174811 131165 -271787 -55338 -123891 15485 87743 -54655 -143297 -118274
19357a18274d6417B55542J22002h8656A6338J79628m3555H067e9314l0739K6257
$$ -118274 -46417 255542 377544 -88656 16338 195966 152411 8067 -59314 -90053 -63796
19346f3796C34527A33548J04096B0942f317r2947A15403e4099b835j11695l82671
$$ -63796 334527 133548 237644 20942 -6317 -99264 115403 -54099 -2835 -114530 -497201
19335d97201F3462f7821q7041g0292a1169A12385a83587A12109E0966P8003a09205
$$ -497201 63462 -67821 -154862 -70292 -11169 112385 -183587 112109 50966 128969 -109205
19323a55172J6449c9693A2676N8255a49161D6515J5967a27605d6554l05454A41802
$$ -155172 -138723 -39693 12676 70931 -149161 46515 62482 -127605 -46554 -352008 141802
19311a39931j17113e3344A62244F2662c08096a09358H0317c7425l15245J57764
$$ -139931 -257044 -53344 162244 62662 -308096 -109358 80317 -37425 -352670 -194906
19301a94906f3469B48899a31522a0415j17261p2617k94695B16149a9657n4389
$$ -194906 -63469 248899 -131522 -10415 -127676 -200293 -494988 216149 -19657 -74046
19291g4046m0485c8998j70968h7615K9393K2887o9418E5325j8539J6135a9168
$$ -74046 -114531 -38998 -209966 -87615 -58222 -35335 -104753 55325 36786 52921 -19168
19279d03748J72285A98548q5169b98006L8531C26620b53229G4025e76980a2533
$$ -403748 -231463 198548 113379 -298006 -259475 326620 -253229 74025 -576980 -12533
19268A98277a8637k15425B32393C4865b50210a4410A17927a23932L7146j49337
$$ 198277 -18637 -234062 232393 34865 -250210 -14410 117927 -123932 -86786 -236123
19258b36123l8638A39950P1227d19636E5631D460a94192C3954J63511a23078o8749
$$ -236123 -274761 139950 211177 -419636 55631 4460 -194192 33954 197465 -123078 -191827
19247a91827m6095P8087P6706b9053j62988E0015e02215E4712g0385A02616a79995
$$ -191827 -237922 -159835 -83129 -29053 -192041 50015 -502215 54712 -70385 102616 -179995
19235a63569G1860a2514A43893l5742a33618b8885j47376A1032K77455E1605b4250
$$ -163569 71860 -12514 143893 108151 -133618 -28885 -176261 11032 288487 51605 -24250
19223A4914a189l16571h3737j05032j73734J11401k492J24759l7934k50706B86521
$$ 14914 -1189 -317760 -83737 -188769 -362503 -251102 -253594 -128835 -166769 -417475 286521
19211a47669A347c79369g088k17656B7206f7803p5514j50371a04496k96152i5888
$$ -147669 1347 -379369 -7088 -224744 27206 -67803 -143317 -293688 -104496 -400648 -95888
19199a39947D6699b1771j62372b9541m2041q6964f3147A28925k1294b42639n6510
$$ -139947 46699 -21771 -184143 -29541 -71582 -158546 -63147 128925 107631 -242639 -299149
19188b99149O3996j17461E3166a47065r0725d9510C6834J07822c7270A836O6636
$$ -299149 -235153 -352614 53166 -147065 -237790 -49510 36834 144656 -37270 1836 68472
19177F8472e5471j10796F8707a80375l3192d4380j83422g4279j12193N1167C3112
$$ 68472 -55471 -166267 68707 -180375 -213567 -44380 -227802 -74279 -186472 -135305 33112
19165C1161L4574J41122H520h6855C46429a68869B3132O9533b08258d1160C2427
$$ 31161 65735 206857 8520 -86855 346429 -168869 23132 92665 -208258 -41160 32427
19153A48815a19319I1205l2671b05448B52525L9835r6209n9996a53467n4872B65895
$$ 148815 -119319 91205 58534 -205448 252525 292360 196151 136155 -153467 -208339 265895
19141b68882I1565A3126M6581i0480A9650J9364K91107c387n1737j76986a05755
$$ -268882 91565 13126 59707 -90480 19650 39014 330121 -3387 -55124 -232110 -105755
19129C63417c4940m32554a4021A68511a47850K45j17928f6300A89533a10468j50884
$$ 363417 -34940 -467494 -14021 168511 -147850 -147605 -265533 -66300 189533 -110468 -261352
19118b61352k10298I2507k9691l0311h8799I6657d7198l34015B29506L89b16588
$$ -261352 -471650 92507 62816 32505 -88799 96657 -47198 -381213 229506 229895 -216588
19106D6378b38721j9836A10456a88259C64970c137q8951C32000J10216b53290
$$ 46378 -238721 -258557 110456 -188259 364970 -3137 -92088 332000 442216 -253290
19095a50385k2081G64J84218G42J82561p2660C4612c39568B34525c0888q1200
$$ -150385 -172466 764 184982 742 183303 110643 34612 -339568 234525 -30888 -112088
19084a12088p2119d3620A99843H8391B7457J06090a49561f4435B71278j12083
$$ -112088 -184207 -43620 199843 88391 27457 133547 -149561 -64435 271278 159195
19074A59195a8539n21091f8422B28156f1419o6724q6521g6546l06854g2480J7121
$$ 159195 -18539 -539630 -68422 228156 -61419 -128143 -214664 -76546 -383400 -72480 -55359
19063e5359A04321c20845B29184d093k77033A67042a81720O9330j1228G7870a51941
$$ -55359 104321 -320845 229184 -4093 -281126 167042 -181720 -112390 -123618 77870 -151941
19051a754A074i2542H4588a14318c7365B8014R8836J7958a13645j88756B2938
$$ -1754 1074 -92542 84588 -114318 -37365 28014 126850 144808 -113645 -302401 22938
19039d25766e2838k5517j44993f1357K1008j6391k70011h1004q2736l7469B4380
$$ -425766 -52838 -78355 -223348 -61357 -40349 -56740 -326751 -81004 -163740 -201209 24380
19027A12188N8408M4676J55747f9731A64658d9887B23198A8591L9327Q5313B3716
$$ 112188 170596 215272 371019 -69731 164658 -49887 223198 18591 57918 143231 23716
19015h6775j75384B16488d29337C65367d4686j90641q491j40036A488a71019A56137
$$ -86775 -262159 216488 -429337 365367 -44686 -235327 -243818 -383854 1488 -171019 156137
19003b89629b8588A44886a1021A21823e5397I845f4017j9739j94104D7011d1582
$$ -289629 -28588 144886 -11021 121823 -55397 9845 -64017 -83756 -277860 47011 -41582
18991A1238a12383j24556A59725a58090A0164a28337M7252k49621b0336B41836
$$ 11238 -112383 -236939 159725 -158090 10164 -128337 -81085 -330706 -20336 241836
18980A4327c1557e207k40147H1068a21112O0195B20343a0016l7003r4675Q997
$$ 14327 -31557 -5207 -245354 81068 -121112 -60917 220343 -10016 -47019 -141694 -132697
18969a32697G3026k1034a78597H2338e06726A75000Q0739E573J09114g9920B69631
$$ -132697 73026 51992 -178597 82338 -506726 175000 255739 5573 114687 -79920 269631
18957D5489R2716a77729E5197h8608r2556q446B7261c69423a12663B46966I5857
$$ 45489 138205 -177729 55197 -88608 -181164 -189610 27261 -369423 -112663 246966 95857
18945B26092a16245A05679a05451n4143A54395E9228b53437I6078r915O9681i4949
$$ 226092 -116245 105679 -105451 -159594 154395 59228 -253437 96078 86163 155844 -94949
18933b67323A11502L10474c9364A18541A278K0869b36963j4708J10984C13666
$$ -267323 111502 421976 -39364 118541 1278 22147 -236963 -251671 -140687 313666
18922C1852a27121D8611J08529d30169a06288C2996a83482A1221b07834c8165
$$ 31852 -127121 48611 157140 -430169 -106288 32996 -183482 11221 -207834 -38165
18911a40807J6442R589C4063h1508b9287l99547E1834J62674b22929b1057J049
$$ -140807 -124365 -114776 34063 -81508 -29287 -428834 51834 214508 -222929 -21057 -20008
18900b0008K791j10417a8124n6115B86178K49098C1238a50440j7519l5471K0034
$$ -20008 -17217 -127634 -18124 -74239 286178 535276 31238 -150440 -167959 -203430 -183396
18889a83396b0645k57677a28704E6490A1547P1054c37398a04632j58546c432n3389
$$ -183396 -20645 -278322 -128704 56490 11547 82601 -337398 -104632 -263178 -3432 -56821
18878e6821A03717K3526a98669B49263d988H720d39415a27798n848A69300J2458
$$ -56821 103717 127243 -198669 249263 -4988 8720 -439415 -127798 -133646 169300 181758
18867A81758c70925q1325B02638d12738F8221a61777N158D7569i7706G5153i4360
$$ 181758 -370925 -452250 202638 -412738 68221 -161777 -156619 47569 -97706 75153 -94360
18855F7671c79990A8680a42898j10851f1949j86700A13921a9096E6025d0649k2889
$$ 67671 -379990 18680 -142898 -253749 -61949 -248649 113921 -19096 56025 -40649 -63538
18844f3538B5661i8590B5874Q9555J56826j03306c4772b026o0034K6035k18683
$$ -63538 25661 -98590 25874 115429 272255 168949 -34772 -2026 -62060 -36025 -254708
18833b54708J09767l1100b8003k0438k27185A41379f3361k26580b7746a222A473
$$ -254708 -144941 -176041 -28003 -48441 -275626 141379 -63361 -289941 -27746 -1222 1473
18821E2985i1682A13601f0427A38984D484L83908d8775F0105K26285P0762D6014
$$ 52985 -91682 113601 -60427 138984 4484 388392 -48775 60105 286390 357152 46014
18809G4001L1798m9888M33375c1887L496l73916A25098a68342g2589A21588c98116
$$ 74001 105799 55911 489286 -31887 -28391 -402307 125098 -168342 -72589 121588 -398116
18797I205b69463i6157O43b7461k55441B98080a11168n1513c1093l7755k27415
$$ 9205 -269463 -96157 -95514 -27461 -282902 298080 -111168 -162681 -31093 -68848 -296263
18786b96263J20119G8083h5922B76718A06611f614j40201e6486j73746d275B0510
$$ -296263 -176144 78083 -85922 276718 106611 -6614 -146815 -56486 -230232 -4275 20510
18774I296b77669D5919n974b53673e6277A89595c0231l1353l02254a25883C126
$$ 9296 -277669 45919 39945 -253673 -56277 189595 -30231 -61584 -363838 -125883 3126
18762b29831M9478e4996j34821C70964o5558a68729F5852b40853F7951c92968
$$ -229831 -180353 -54996 -189817 370964 305406 -168729 65852 -240853 67951 -392968
18751i2030A6492g4073F4478g1398A11251C035J84278g1368A28714b74072g5138
$$ -92030 16492 -74073 64478 -71398 111251 3035 187313 -71368 128714 -274072 -75138
18739h5270k84079a1338A5262d8248l39385f5559A21663a78763K3511B60737a47819
$$ -85270 -369349 -11338 15262 -48248 -387633 -65559 121663 -178763 -155252 260737 -147819
18727a77181L8855l5948B1968a73908C17367b38912e5036E8919b6622j86910A21446
$$ -177181 -138326 -174274 21968 -173908 317367 -238912 -55036 58919 -26622 -213532 121446
18715I5780D398a92819B00102E2551J49329F9061N0764B628Q7458a16038j697
$$ 95780 4398 -192819 200102 52551 201880 69061 119825 2628 90086 -116038 -117735
18704a17735H137d2170B95632C3484b06010c5634m5222K2335k40906J33733l7035
$$ -117735 8137 -42170 295632 33484 -206010 -35634 -80856 -58521 -299427 -165694 -202729
18693b02729g1162C22908c47904G7697f8443m2437h438D4272h1284j01949N1381
$$ -202729 -71162 322908 -347904 77697 -68443 -110880 -8438 44272 -81284 -183233 -131852
18682a31852b251j94084o2423a08953A12448b97349A27416i1379j55184l8127
$$ -131852 -2251 -196335 -258758 -108953 112448 -297349 127416 -91379 -246563 -284690
18672b84690i6829I7231c033B2597K22517c6533r7976B25292A00183c00179f241
$$ -284690 -96829 97231 -3033 22597 245114 -36533 -134509 225292 100183 -300179 -6241
18660B24467A08084a70502k43149c5853j0240j57193D3872c32060A62484J9691
$$ 224467 108084 -170502 -413651 -35853 -46093 -203286 43872 -332060 162484 182175
18650A82175g2670H7515J22810r2017b91523J07575A20321i2371A86557P5696
$$ 182175 -72670 87515 210325 118308 -291523 -183948 120321 -92371 186557 262253
18640B62253b51900F3248b28874A26009O9408d6252m3722j55746J6537h7910A75391
$$ 262253 -251900 63248 -228874 126009 195417 -46252 -89974 -245720 -229183 -87910 175391
18628a20518d4161r5151B910K9685g1310A78402H4771a6667E6014b17355C7703
$$ -120518 -44161 -139312 2910 32595 -71310 178402 84771 -16667 56014 -217355 37703
18616a91272j26172J48954p6436H8514f3262c974j90154q6509J11368k11093a71553
$$ -191272 -317444 -168490 -244926 88514 -63262 -3974 -194128 -280637 -169269 -380362 -171553
18604a35635A60604M1439l8198a09794J6554B38601c7768l12206a14517o2596
$$ -135635 160604 202043 163845 -109794 -93240 238601 -37768 -349974 -114517 -177113
18594a77113j04925J28811j14025h000A56188a3643k23061G2787l3687g5218c2698
$$ -177113 -282038 -153227 -267252 -8000 156188 -13643 -236704 72787 39100 -75218 -32698
18582D8849b70766i4790o0903A71414h6136A23829B2778G707a78314h6078A36276
$$ 48849 -270766 -94790 -155693 171414 -86136 123829 22778 7707 -178314 -86078 136276
18570f3087j65994b8143j78837i0760K7242l2168M3192n6755C6449g8708A27276
$$ -63087 -229081 -28143 -206980 -90760 -63518 -95686 -52494 -109249 36449 -78708 127276
18558a27455K5426k3547B8103R3506c76484D5416J17235J27850e613A72417H1355
$$ -127455 -102029 -125576 28103 121609 -376484 45416 162651 290501 -5613 172417 81355
18546a4055o1414c3535C05698e3710l28658e4772j16660I7b99581P9321b5782
$$ -14055 -75469 -33535 305698 -53710 -382368 -54772 -171432 97 -299581 -220260 -25782
18534e1428k58938J11623a5919F6286J87131c25221A52256c6511C8499P4457J11225
$$ -51428 -310366 -198743 -15919 66286 253417 -325221 152256 -36511 38499 112956 224181
18523B24181a40171j11753A39692a40850J3341k8335N4739p4504k6963B19936
$$ 224181 -140171 -251924 139692 -140850 -127509 -155844 -101105 -175609 -202572 219936
18512C50430b18246Q3800B9119N733M1829e3067j3456B6331a49279j52738a1813
$$ 350430 -218246 -134446 29119 34852 76681 -53067 -66523 26331 -149279 -302017 -11813
18500a41833e6471j24838P7806K707F6118c2563B12168a44507k37877A55560b6250
$$ -141833 -56471 -181309 -103503 -100796 66118 -32563 212168 -144507 -382384 155560 -26250
18488a55914b1197k93537a22767K9379j19396A38007f8180b9711A42114E3038
$$ -155914 -21197 -314734 -122767 -93388 -212784 138007 -68180 -29711 142114 53038
18477f2945B25134d7065m4330j00998A46730c6914H8157h6711j24410r085k0591
$$ -62945 225134 -47065 -91395 -192393 146730 -36914 88157 -86711 -211121 -220206 -240797
18466b40797c6867J1780j62448B5352L1239a31655A38730l8058J83715b41771
$$ -240797 -36867 -25087 -187535 25352 56591 -131655 138730 100672 284387 -241771
18455D6707J7481b5073r0048A47183A1579O5612c53428O4209A04274b14534B28949
$$ 46707 64188 -25073 -115121 147183 11579 77191 -353428 -289219 104274 -214534 228949
18443D7696a15327A13926K8218a05069K7088p0691L2569N6404k30856A09705c7168
$$ 47696 -115327 113926 142144 -105069 -77981 -148672 -116103 -59699 -290555 109705 -37168
18431h7796j39328A69094F6350R561b23336m102A51563a2150A37549c26913A00479
$$ -87796 -227124 169094 66350 75911 -223336 -227438 151563 -12150 137549 -326913 100479
18419a19446C2005d53534B2934a86462g1535b6366l25783E9493R0598K6915i0402
$$ -119446 32005 -453534 22934 -186462 -71535 -26366 -352149 59493 150091 177006 -90402
18407d4738J8540A33496a29907b4890n7424B28663a2560C0865d557a573E6294
$$ -44738 -26198 133496 -129907 -24890 -82314 228663 -12560 30865 -4557 -1573 56294
18395a40046G4529a34712j2395A20392h7052p4803B8094i1368j53370g1278l9246
$$ -140046 74529 -134712 -147107 120392 -87052 -161855 28094 -91368 -244738 -71278 -110524
18384a10524e1444J339l93270a23097D1251a12675r3339K2444O4047A07a20861
$$ -110524 -51444 -50105 -443375 -123097 41251 -112675 -206014 -183570 -119523 107 -120861
18372F0904a9107j3783j56623j45869b0911j97671a05842m1604k13939e4050j42601
$$ 60904 -19107 -32890 -189513 -335382 -20911 -218582 -105842 -147446 -361385 -54050 -196651
18361a96651O6453B00640l7778K9464g326A10524a76165k29852a32985A34674
$$ -196651 -130198 200640 162862 192326 -7326 110524 -176165 -406017 -132985 134674
18350E3124J452q17b69888A07998i0675m02980d4201j1330r880A07626h4266B19295
$$ 53124 54576 53759 -269888 107998 -90675 -493655 -44201 -55531 -65411 107626 -84266 219295
18337A44757F9774b85833I3395a52795A17662a17169A14763h9746d0379j16871
$$ 144757 69774 -285833 93395 -152795 117662 -117169 114763 -89746 -40379 -157250
18327a57250I5312d16743b4576j77497b4304k33002H2303a1481B17866f4107C2533
$$ -157250 95312 -416743 -24576 -202073 -24304 -257306 82303 -11481 217866 -64107 32533
18315f4671k46423F4365a3179B193K21004c865k18503h9300j19084C4236J46393
$$ -64671 -311094 64365 -13179 2193 223197 -3865 -222368 -89300 -208384 34236 180629
18304A80629o0425C1010P1574f0346l8521B532L96615a57716A7809b78883A38962
$$ 180629 120204 31010 102584 -60346 -98867 2532 399147 -157716 17809 -278883 138962
18292D1990a26753d8034A21660n4480O8779a4769j51759j5539I1838a60520k15654
$$ 41990 -126753 -48034 121660 67180 135959 -14769 -166528 -182067 91838 -160520 -376174
18281c76174A34131J04745d4278m9250b2358k57733D5585A9358K35608F2928L0754
$$ -376174 134131 238876 -44278 -93528 -22358 -280091 45585 19358 254966 62928 93682
18270I3682k115n546b3325C6245A4187a06357A98336D5581J00366c91510f3799
$$ 93682 91567 86021 -23325 36245 14187 -106357 198336 45581 145947 -391510 -63799
18258A92559C089a8288k44908J28533B1155K40151r8851a05690k2631A22543a46480
$$ 192559 3089 -18288 -263196 -134663 21155 261306 162455 -105690 -128321 122543 -146480
18246D5044l737a82869D395a15016L5389B33586g9854C62580b8512C8012a27031
$$ 45044 41307 -182869 4395 -115016 -79627 233586 -79854 362580 -28512 38012 -127031
18234b06867A25339K738b64221b2506B82459h6905A65884c01296c3482G2543c8911
$$ -206867 125339 128077 -264221 -22506 282459 -86905 165884 -301296 -33482 72543 -38911
18222c7621j37679F2161a15334B32897f1595j03787B38390B2238f560j50753k83516
$$ -37621 -175300 62161 -115334 232897 -61595 -165382 238390 22238 -6560 -157313 -440829
18211d40829J21064F7725c35558H9599d34210A21074b3701k23003e3046E5188
$$ -440829 -319765 67725 -335558 89599 -434210 121074 -23701 -246704 -53046 55188
18200A48210c70291a51879b1275k4523C7808d9820j3477j73761A8519e8782k0094
$$ 148210 -370291 -151879 -21275 -45798 37808 -49820 -63297 -237058 18519 -58782 -78876
18189g8876A93890M6339l2010i1480j7650k09252A90372a70087I753K1006b46911
$$ -78876 193890 240229 208219 -91480 -109130 -318382 190372 -170087 9753 30759 -246911
18177g0624A77367e2097A87246F3711i588j73123n9391J16400G2904c58993A33747
$$ -70624 177367 -52097 187246 63711 -9588 -182711 -242102 -125702 72904 -358993 133747
18165H2046c78785J36688Q9918A73119e7617r5694N5939K407A72201c5928E975
$$ 82046 -378785 -242097 -152179 173119 -57617 -153311 -97372 -94965 172201 -35928 5975
18153f480l16782A77937J8076h420r887j26393n3463A01926B6253d0804K159j53009
$$ -6480 -323262 177937 196013 -8420 -18307 -144700 -198163 101926 26253 -40804 -38645 -191654
18141a91654j6317P6171A991a3677D7402g545K355l44886J42530h3056j8032B72361
$$ -191654 -207971 -131800 1991 -13677 47402 -7545 -5190 -350076 -207546 -83056 -101088 272361
18128A21364i7458A00294D7116J91817q3581L815d21269A28477i907A38050J32785
$$ 121364 -97458 100294 47116 238933 155352 159167 -421269 128477 -9907 138050 270835
18117B70835D5295r487a43945C15819a54669A4257L9921e8364q23R875B50495
$$ 270835 45295 35808 -143945 315819 -154669 14257 54178 -58364 -59187 -49312 250495
18105A66032a30492A56596F581J17188o649b7831l8550J8740G7770h5097j90443
$$ 166032 -130492 156596 6581 123769 117120 -27831 -66381 -47641 77770 -85097 -275540
18094b75540M9150A07645l091C8339h6257I5932g9586p0802b5936k85699D4814
$$ -275540 -226390 107645 104554 38339 -86257 95932 -79586 -150388 -25936 -311635 44814
18082B37698p4415G7261a77210P1353F9546a34968e1730j02241j18646a0041A46505
$$ 237698 163283 77261 -177210 -105857 69546 -134968 -51730 -153971 -272617 -10041 146505
18070b4242A00896C7567c2312l05385g7058l4439j35689E2269O151Q886a33461
$$ -24242 100896 37567 -32312 -337697 -77058 -111497 -247186 52269 58420 67306 -133461
18058A96444b419j94385j31810J8530a3324A38303a99646m6569B24001k4776a81819
$$ 196444 -2419 -196804 -328614 -310084 -13324 138303 -199646 -246215 224001 199225 -181819
18046a56051A70054h966B63915A1201a01035r4595l73125B37021a27313k8314
$$ -156051 170054 -8966 263915 11201 -101035 -195630 -568755 237021 -127313 -155627
18036a55627e1877A24889a17554j09540E624f36027H5943E178f4240K6902j53037
$$ -155627 -51877 124889 -117554 -227094 5624 -636027 85943 5178 -64240 -37338 -190375
18025a90375A29465A7184F839R5831c18066D8152n519E6d8065r6246n7157A13583
$$ -190375 129465 17184 6839 102670 -318066 48152 42633 56 -48065 -144311 -201468 113583
18012b09038j19484i0461B30232b27485E9450d8309B360J68527b64761C69954
$$ -209038 -328522 -90461 230232 -227485 59450 -48309 2360 170887 -264761 369954
18001E2447J28047p4317j3517a56338B68266a0627q5974k59720a28118N9737k40829
$$ 52447 180494 106177 92660 -156338 268266 -10627 -96601 -356321 -128118 -68381 -309210
17990c09210C5925d2817a0795r8918L8636c2498a1400B17490c36312I5995a05920
$$ -309210 35925 -42817 -10795 -109713 -71077 -32498 -11400 217490 -336312 95995 -105920
17978A56081f4519O289G375b70044g7073n7168a0789k55173D0012a996A53840
$$ 156081 -64519 -58230 7375 -270044 -77073 -134241 -10789 -265962 40012 -1996 153840
17966B21814f7458j5126J8108j57009B16057b73916d6340j01440I0632a98489
$$ 221814 -67458 -82584 -64476 -221485 216057 -273916 -46340 -147780 90632 -198489
17955f4831k50859J02332L6266D51268c6258D1980G260b61776g723o2675K1095
$$ -64831 -315690 -213358 -177092 451268 -36258 41980 7260 -261776 -7723 -70398 -49303
17944d9303B79141D0402c2699j65470c6956C3365c2535B1463L14872D7993O5272
$$ -49303 279141 40402 -32699 -198169 -36956 33365 -32535 21463 336335 47993 113265
17933A13265C3615P0814b1884j31747j19501N4985e1275H197a88588k7441A62356
$$ 113265 33615 104429 -21884 -153631 -273132 -218147 -51275 8197 -188588 -216029 162356
17921b7093A4025a50773l1333l8373A89816M2415d41320J71473C4201l223K90475
$$ -27093 14025 -150773 -182106 -220479 189816 232231 -441320 -269847 34201 30978 321453
17910C21453B1054g0174j06108A21056J62647A27635J3087i5737a391B8248a86241
$$ 321453 21054 -70174 -176282 121056 283703 127635 140722 -95737 -1391 28248 -186241
17898c6655c891k0202B83862j12177a52770I3106b29977e1432q7734C5044N458
$$ -36655 -3891 -24093 283862 171685 -152770 93106 -229977 -51432 -139166 35044 40502
17887D0502P6805J29742e1199R543n7894A33224a05379j70951R5756k12653A31123
$$ 40502 117307 247049 -51199 -41656 -99550 133224 -105379 -276330 -180574 -393227 131123
17875G0926i2329m73671K78609A02531J9092B8216b50765b5463k3801E7111i0241
$$ 70926 -92329 -566000 -287391 102531 121623 28216 -250765 -25463 -49264 57111 -90241
17863a13669P940L4203j08348a2954j31346A33112O8058j1800b29064G3399a90577
$$ -113669 -105729 -71526 -179874 -12954 -144300 133112 201170 189370 -229064 73399 -190577
17851A67135c32905A90508a21028L0372A0584e3531k36363A30573J81725m793
$$ 167135 -332905 190508 -121028 -90656 10584 -53531 -289894 130573 312298 307505
17841C07505j43263c53791O3278B05013e4006B78378I8136a05726k81016B22218
$$ 307505 164242 -353791 -290513 205013 -54006 278378 98136 -105726 -386742 222218
17830d6872j12145B00985a45858B09840o8357E1926f3160q5182N4459c5753k41087
$$ -46872 -159017 200985 -145858 209840 141483 51926 -63160 -148342 -93883 -35753 -276840
17819b76840I0820J17148F7243b3521A35494l8738Q5466a38475A15971c2350A11985
$$ -276840 90820 207968 67243 -23521 135494 96756 182222 -138475 115971 -32350 111985
17807c2996n4703l4289B59269b79816d3224B3249J89004f7480A06742J22909D7872
$$ -32996 -87699 -121988 259269 -279816 -43224 23249 212253 -67480 106742 229651 47872
17795a12407A31114k019a5746j92473e4661A46742e7334m0354K8381b7113D5034
$$ -112407 131114 129095 -15746 -208219 -54661 146742 -57334 -97688 -69307 -27113 45034
17783A85210b3532A9033a22426o1376G9975h3012L7592A65896n588i183j32581
$$ 185210 -23532 19033 -122426 -183802 79975 -83012 -45420 165896 160308 -9183 -141764
17772a41764b2376A58109b17499j02024g3374H5788i6935j1583F108i6852A63456
$$ -141764 -22376 158109 -217499 -319523 -73374 85788 -96935 -108518 6108 -96852 163456
17760I356K46649D5390R5352j6621i2507k27858a14807k02296G2547a04380A36327
$$ 9356 256005 45390 140742 124121 -92507 -320365 -114807 -317103 72547 -104380 136327
17748B01558r060c6985A82109J60471j15009d05107A4566a63263c3472p7938k24086
$$ 201558 192498 -36985 182109 342580 227571 -405107 14566 -163263 -33472 -111410 -335496
17737c35496I0937C6743J39208b58191i55j42319d2483k10805B11472F8722a14789
$$ -335496 90937 36743 175951 -258191 -955 -143274 -42483 -253288 211472 68722 -114789
17725b86508A64636B2376a66061N350A24039n5408e548l07243I2227a28785E5491
$$ -286508 164636 22376 -166061 -160711 124039 68631 -5548 -312791 92227 -128785 55491
17713H200J85877J20372E3592O5734a45894e0733F1015a01095k7712j53442B3585
$$ 8200 194077 314449 53592 119326 -145894 -50733 61015 -101095 -128807 -282249 23585
17701E4350b5016j09656B00218I1894k5437i896I532K14913A10J49335I821K3889
$$ 54350 -25016 -134672 200218 91894 66457 -9896 9532 224445 110 149445 9821 33710
17689C3710a1640C5812g907A34964m0317C5859a26197G5605K8214a71815I3819
$$ 33710 -11640 35812 -7907 134964 94647 35859 -126197 75605 103819 -171815 93819
17677A05331M2571b25082A00733K13294D9096C701a22162B9843A3916K35302i850
$$ 105331 147902 -225082 100733 314027 49096 3701 -122162 29843 13916 249218 -9850
17665A954a3400k55767C30654A41048f4351j72623B25479E2308a4424j57138A44333
$$ 1954 -13400 -269167 330654 141048 -64351 -236974 225479 52308 -14424 -171562 144333
17653h4477B29381r7418O6921D3730R6355b54967C59551a11128I2409d6548B92440
$$ -84477 229381 131963 198884 43730 140085 -254967 359551 -111128 92409 -46548 292440
17641G7081j1853a02538H2060b2729C21428F5813b07444C11223D1097a7583B31139
$$ 77081 65228 -102538 82060 -22729 321428 65813 -207444 311223 41097 -17583 231139
17629I0396j1198J31483a65906J3065K6074B3457J65001C5280J61045F1207M5826
$$ 90396 79198 210681 -165906 -152841 -126767 23457 188458 35280 196325 61207 107033
17618A07033e5616A22406J98746a14157B5032a48720A96441I0116e6642b7336
$$ 107033 -55616 122406 321152 -114157 25032 -148720 196441 90116 -56642 -27336
17607A05478d4022D70J2538a70194f2594j04613h3437l73401a08154n9945A43397
$$ 105478 -44022 470 13008 -170194 -62594 -167207 -83437 -456838 -108154 -168099 143397
17595A19235l8780J04482J15088e0783D8550M7194a17570A32077J2834a11664
$$ 119235 80455 184937 300025 -50783 48550 95744 -117570 132077 144911 -111664
17584b3868A89155H2026a21658I9350b7500j22571B49324c19593B08528B2870
$$ -23868 189155 82026 -121658 99350 -27500 -150071 249324 -319593 208528 22870
17573c04200C215a96l33821D2699a2205j22998K7697C36681F0971A3514g1667
$$ -304200 3215 -196 -334017 42699 -12205 -135203 -107506 336681 60971 13514 -71667
17561A45872m2835K25084e1663A44833G2098L3194B640h5169A88825h2997A13271
$$ 145872 103037 328121 -51663 144833 72098 105292 2640 -85169 188825 -82997 113271
17549B20954K1964G7285P8585h7808C47176A43626L37387c5950A62685A4512L8223
$$ 220954 242918 77285 155870 -87808 347176 143626 481013 -35950 162685 14512 52735
17538E2735a62055E3739f1061B9553P0595K15519f896j94825B47301E4195k4119
$$ 52735 -162055 53739 -61061 29553 100148 315667 -6896 -201721 247301 54195 30076
17527C0076J71496e9582A38165L8525b67052i7672A54639h23D03171A44861K99556
$$ 30076 201572 -59582 138165 176690 -267052 -97672 154639 -823 403171 144861 444417
17516D44417B9372a4554B16980a0720B27316b03377j38207a01940D54432j74858
$$ 444417 29372 -14554 216980 -10720 227316 -203377 -341584 -101940 454432 279574
17506B79574G8755a15611A26243h9505A91198R5570A42335b16611B05871C4800
$$ 279574 78755 -115611 126243 -89505 191198 286768 142335 -216611 205871 34800
17495C04157c3351C19820j47205G5886a1423A66591P7131L8832A5686J80669h3619
$$ 304157 -33351 319820 172615 75886 -11423 166591 243722 282554 15686 196355 -83619
17483a47545f3742A68573a40981E1611I910d6342B51565F8306e1859A20412J17603
$$ -147545 -63742 168573 -140981 51611 9910 -46342 251565 68306 -51859 120412 238015
17472B38015j6176H7993J30745H5609b4473C0934J51436J4743m6322n3232h3606
$$ 238015 221839 87993 218738 85609 -24473 30934 182370 197113 150791 97559 -83606
17460B30275J07771A54188C1803e2511I9329K31295H5619a0301A40124N189K15796
$$ 230275 338046 154188 31803 -52511 99329 330624 85619 -10301 140124 145313 361109
17449C61109P5240j29297k7788P8890K07944c8927B37824J46952m4837o8603j34767
$$ 361109 436349 307052 279264 358154 566098 -38927 237824 384776 339939 271336 136569
17438A36569J21361P0443L583M3012j86197O8774c6574J6695A5855O79883A04448
$$ 136569 257930 328373 331956 374968 188771 257545 -36574 -19879 15855 695738 104448
17426C17573r2551M73449F7962K24181J61183A87897O7193K17182j14943A46449
$$ 317573 225022 698471 67962 292143 453326 187897 255090 472272 357329 146449
17415C93097J653K3358c7700B81829q1437K15620f7272E1661J15376F3107J04646
$$ 393097 394750 418108 -37700 281829 200392 416012 -67272 51661 167037 63107 167753
17404A67753k975Q9025k7953J58548G0130J81317m3175J57303F7325K55134A41440
$$ 167753 164778 253803 225850 384398 70130 251447 208272 365575 67325 322459 141440
17392D09881C5991L50904I3919J59765L65980I7014O9439f2480E6140k0463K31788
$$ 409881 35991 386895 93919 253684 619664 97014 166453 -62480 56140 35677 267465
17381B67465D9372R619j5708O5581m4674a9562A81009J3944j5601e2857C70995
$$ 267465 49372 58991 43283 108864 64190 -19562 181009 194953 179352 -52857 370995
17369B01196f2194C58413M4658g225D37339f8700B14493D5676i423F12419A19155
$$ 201196 -62194 358413 403071 -7225 437339 -68700 214493 45676 -9423 612419 119155
17357a26560B71495H1297a3581F6365e4310q0016A16553a95253g637A87328N9073
$$ -126560 271495 81297 -13581 66365 -54310 -134326 116553 -195253 -7637 187328 246401
17346B46401a18477B16239Q3999o4531D2022J52983E1706P1594J28851p9139c882
$$ 246401 -118477 216239 300238 235707 42022 195005 51706 123300 252151 173012 -3882
17334B1689J73632K683m1457C3361R6864M3871J47741C0392c9697B10879a05227
$$ 21689 195321 198004 156547 33361 130225 174096 321837 30392 -39697 210879 -105227
17322B54462p1388J38607A55696J63561H9721m2668K96359r8126J03719d0330
$$ 254462 183074 321681 155696 319257 89721 47053 343412 245286 349005 -40330
17311B42487A02892J18850J05890C5571J1915L15786A48228K09568I9147i9304
$$ 242487 102892 221742 327632 35571 47486 363272 148228 357796 99147 -99304
17300B55682N8469m7361c29987C33625A32083O8333n4444h8451C91954a49200
$$ 255682 314151 266790 -329987 333625 132083 200416 145972 -88451 391954 -149200
17289B49249k6045A11018J81220l3819H8247L05913o3495a06979D09497E0652
$$ 249249 223204 111018 292238 258419 88247 394160 330665 -106979 409497 50652
17278B57771b11165D43867B20011K5115I8168R1062o4574K12356j19135A6512
$$ 257771 -211165 443867 220011 245126 98168 189230 124656 337012 217877 16512
17267g3990A30169L72017k00698J60023A98488J06851j33287k3634J70064G2463
$$ -73990 130169 502186 301488 461511 198488 305339 172052 148418 318482 72463
17256D85790p6649j24724c5310A18692L90555k26254j30098J41801R0643J06855
$$ 485790 409141 284417 -35310 118692 509247 282993 152895 294696 385339 492194
17246D92194j16381m3124q0095k9350J16808j04030J57825b1464C00425p7711
$$ 492194 375813 332689 252594 223244 340052 236022 393847 -21464 300425 222714
17236B22714J0479R6556K2246j7760A3402K90643I5479O6046B6000K27263D8713
$$ 222714 233193 329749 351995 334235 13402 304045 95479 161525 26000 253263 48713
17224D86248A15303J85792P2183A35536D2074M81227k45309e0750j91391A11869
$$ 486248 115303 301095 373278 135536 42074 523301 277992 -50750 -242141 111869
17213C56141J33072r6786o6520Q6283A98718d0268I3475K91892G1829L48467k10124
$$ 356141 489213 392427 325907 412190 198718 -40268 93475 385367 71829 420296 210172
17202B10172q4901O5541J11238J87868j24767P5924r5241b8879A34103J22503
$$ 210172 125271 190812 302050 489918 365151 441075 345834 -28879 134103 256606
17192B56606N6821l9061j6921L2329j1879m1784L33770k11573j7435L57701b09022
$$ 256606 313427 274366 257445 289774 277895 236111 569881 358308 340873 698574 -209022
17180C94300A89267J3941K45661r8703J91697k53275A07514K21049J17030A76190
$$ 394300 189267 203208 448869 350166 541863 288588 107514 328563 445593 176190
17169b20312B78433K07917a465A97171K2119J35282A41217L35195q5086L5099
$$ -220312 278433 486350 -1465 197171 219290 354572 141217 476412 391326 426425
17159D26425q0039j2465j4387A07226M24547A51517O08599l47567j38906K89649
$$ 426425 346386 333921 319534 107226 531773 151517 760116 412549 273643 563292
17149E63292k22518n9063p6443o0978O1697q631J88861J71974k4605j8574A60207
$$ 563292 340774 281711 205268 144290 205987 197356 386217 558191 533586 515012 160207
17137C43467J30187l4241m1255l0674P2043c2347A50785L24055k5618j36734A08756
$$ 343467 473654 439413 398158 367484 439527 -32347 150785 474840 449222 312488 108756
17125a4775D84704B27969Q7717J84501j74159H6080K95764A61505J25372J20277
$$ -14775 484704 227969 315686 500187 326028 86080 381844 161505 286877 407154
17115D07154J10910K19454l64016o510J57549k25778K94908A96090J62211K17107
$$ 407154 518064 737518 373502 366992 524541 298763 593671 196090 358301 575408
17105E75408q6142J15807j75856K75340k70112N8309q9133j2371L99000j45744
$$ 575408 489266 605073 429217 704557 434445 492754 403621 391250 790250 644506
17095F44506p8524q8157K08057j03425k89809J39434K14431k04408M4788k25075
$$ 644506 565982 477825 685882 582457 292648 432082 646513 442105 486893 261818
17085B61818K58296P4415k006A89184L24663J6755K0116N7911j54423j59311K04583
$$ 261818 520114 594529 592523 189184 513847 530602 550718 608629 454206 294895 499478
17074D99478n0568K1972M42741B63539K56406B35338L61292k59000M58461l69097
$$ 499478 448910 470882 913623 263539 519945 235338 596630 337630 796091 426994
17064D26994L34868k52457K15358j32077j37538J81961j39330O2820B45256L43705
$$ 426994 761862 509405 724763 592686 455148 637109 497779 560599 245256 588961
17054E88961j41122M79121k57959K1681R2697L1909q6400k33934L30727m3826
$$ 588961 447839 926960 669001 690682 783379 815288 728888 494954 825681 781855
17044G81855j83704j00147P9013K9360J62450M195j40416k76004K65281j08098
$$ 781855 598151 498004 577017 606377 768827 773022 632606 356602 621883 513785
17034E13785K50309Q3072p7694k6477Q9989j00381k45594J93151J97914r7041
$$ 513785 764094 847166 769472 742995 832984 732603 487009 680160 878074 781033
17024G81033J15122j78103K07990l68513M12172J6741k28699l22J01129J14925
$$ 781033 896155 718052 926042 557529 969701 986442 757743 757421 858550 973475
17014I73475k13261k01520m4785M08955j96893r8611O3246q1071J13228M47750
$$ 973475 760214 558694 513909 922864 725971 627360 690606 609535 722763 1170513
17004A170513n56267K43335j89191J82598J49513j51435J44405k69478N1064j28707
$$ 1170513 614246 857581 668390 850988 1000501 849066 993471 723993 775057 646350
16994F46350J67096m7905J10755O4819l502m58843M38907j03879L81811m40220
$$ 646350 813446 765541 876296 941115 937613 478770 917677 813798 1195609 755389
16984G55389Q4172J47942l03065M20329k85466K32274k93509N96553k81220r7332
$$ 755389 839561 987503 684438 1104767 819301 1051575 758066 1354619 1073399 976067
16974I76067K85552q4769l92177L0842L08090j66160j2156K59550J84513k92162
$$ 976067 1261619 1176850 784673 815515 1123605 957445 945289 1204839 1389352 1097190
16964A097190N6232M1258k88784q3126K39753j04169J23374J40457J5213J96214
$$ 1097190 1153422 1194680 905896 822770 1062523 958354 1081728 1222185 1237398 1433612
16954A433612n20916L06306J25639j67708K35321n6601m1222K6752l64N6700k94732
$$ 1433612 912696 1219002 1344641 1176933 1412254 1355653 1314431 1341183 1340819 1397519 1102787
16943A102787J45946o2401P6333J36987J97776j93271k07913j1410N557K16951
$$ 1102787 1248733 1186332 1262665 1399652 1597428 1404157 1196244 1184834 1190391 1407342
16933A407342J76729J02160l46228K53078k71185J27475J42139r0793L48959j63662
$$ 1407342 1584071 1686231 1340003 1593081 1321896 1449371 1591510 1500717 1849676 1686014
16923A686014k74452K91504J84807N3668j49399o6255P1043k63263N19881o87731
$$ 1686014 1411562 1703066 1887873 1941541 1792142 1725887 1796930 1533667 2053548 1365817
16913A365817J47057N01668k07352N4113J1243j34775J74102K8938k07087M6416
$$ 1365817 1512874 2014542 1807190 1861303 1872546 1737771 1911873 1940811 1733724 1780140
16903A780140O2502J60251L6502K6975J19495Q7272L8906k52738K71459l53391
$$ 1780140 1842642 2002893 2039395 2066370 2185865 2273137 2312043 2059305 2330764 1977373
16893A977373L09318k00767M13148l5664k75601M49469m53988M5482M5806J00927
$$ 1977373 2286691 2085924 2499072 2463408 2187807 2637276 2183288 2228770 2274576 2375503
16883B375503O8680Q7658J0035J09587J35924k23019N8517K18018m9050q1621
$$ 2375503 2444183 2531841 2541876 2651463 2787387 2564368 2622885 2840903 2791853 2710232
16873B710232J50060j03107L2363L41144l09232K11937m5733j11043M22419k82583
$$ 2710232 2860292 2757185 2789548 3130692 2821460 3033397 2987664 2876621 3299040 3016457
16863C016457L95481k65033j54064k9194M03882j04198N1278l1789J25343k6178
$$ 3016457 3411938 3146905 2992841 2963647 3367529 3263331 3314609 3282820 3408163 3381985
16853C381985Q7431l9139K16530J98112n2479N9112J42173K05575j15925q9839
$$ 3381985 3469416 3430277 3646807 3844919 3792440 3851552 3993725 4199300 4083375 3993536
16843C993536N33771j35051R8234r8699K51889r154N2908R0995o9797K5520K77769
$$ 3993536 4527307 4392256 4490490 4391791 4643680 4634526 4687434 4778429 4708632 4734152 5011921
16832E011921j38425N59121l37775L06587J72785r2610J54052M0590O0078K71407
$$ 5011921 4873496 5432617 5094842 5401429 5574214 5481604 5635656 5676246 5736324 6007731
16822F007731O2352Q0692L59456k82662J15808L25389L80905j97459L83397q2707
$$ 6007731 6070083 6150775 6510231 6227569 6343377 6668766 7049671 6852212 7235609 7152902
16812G152902L59446j46277K49690L09825L28217M9574N104L34188k25861M61713
$$ 7152902 7512348 7366071 7615761 7925586 8253803 8303377 8308481 8642669 8416808 8878521
16802H878521j26490O11808L35543L03200M5954J17588K43314M88586M52481k11733
$$ 8878521 8752031 9363839 9699382 10002582 10048536 10166124 10409438 10898024 11350505 11138772
16792A1138772K30668O88676K19233J06598O29754L60056l77158Q84823M24508
$$ 11138772 11369440 12058116 12277349 12383947 13013701 13373757 12996599 13881422 14305930
16783A4305930O37658M85213K58675M42289M61065M31281K44164Q72990K24303
$$ 14305930 14943588 15428801 15687476 16129765 16590830 17022111 17266275 18139265 18363568
16774A8363568Q14587P78729P04582O72104O47459P36848Q07542Q51562J032778
$$ 18363568 19178155 19956884 20661466 21333570 21981029 22717877 23525419 24376981 25409759
16765B5409759J135011O74624J212749P67313J419055J149964J423869J537908
$$ 25409759 26544770 27219394 28432143 29199456 30618511 31768475 33192344 34730252
16757C4730252J223702J815190R92447K080107K242089J771807K170922K188172
$$ 34730252 35953954 37769144 38761591 40841698 43083787 44855594 47026516 49214688
16749D9214688K218103K966613K538141K809650L101440L187607L625070L366097
$$ 49214688 51432791 54399404 56937545 59747195 62848635 66036242 69661312 73027409
16741G3027409M311779L971031M424551M836315N095645M923579N923486N689853
$$ 73027409 77339188 81310219 85734770 90571085 95666730 100590309 106513795 112203648
16733A12203648O106401O545612O101162P014700O436845O609691O513852O076936
$$ 112203648 118310049 124855661 130956823 137971523 144408368 151018059 157531911 163608847
16725A63608847N726273N591835M548854L919125K838400J805850J159199m32359
$$ 163608847 169335120 174926955 179475809 183394934 186233334 188039184 189198383 188766024
16717A88766024r44025k229143l439567m173887m951849n640007o224669n977051
$$ 188766024 187821999 185592856 182153289 177979402 173027553 167387546 161162877 155185826
16709A55185826o660498o899964o643482o844134o541622o020781o548481n831373
$$ 155185826 148525328 141625364 134981882 128137748 121596126 115575345 109026864 103195491
16701A03195491n571523m987828n326075m724537m515051m111052l859535l382541
$$ 103195491 97623968 92636140 87310065 82585528 78070477 73959425 70099890 66717349
16693F6717349l664667l036623k917536l105921k803732k373039k260812k262961
$$ 66717349 63052682 60016059 57098523 53992602 51188870 48815831 46555019 44292058
16685D4292058k043187j885610j730154j546954j919924j161075j493094j517888
$$ 44292058 42248871 40363261 38633107 37086153 35166229 34005154 32512060 30994172
16677C0994172j227161j421891q14971j283748p89346n28705j275122j017609
$$ 30994172 29767011 28345120 27530149 26246401 25457055 24928350 23653228 22635619
16669B2635619o98962j056954o95321l98830r98925m77313m71199r63479l86713
$$ 22635619 21936657 20879703 20184382 19785552 18786627 18309314 17838115 16874636 16487923
16660A6487923n17117m79147n14115l84441p17121k5767p03909j38113o13952
$$ 16487923 15970806 15491659 14977544 14593103 13875982 13850215 13146306 13008193 12394241
16651A2394241n088m38003l37891l73305l43174l53246k18724j20612k31292n33489
$$ 12394241 12389153 11951150 11613259 11239954 10896780 10543534 10324810 10204198 9972906 9439417
16641I439417J41903q05330P3773M0247n13663Q9262n34710k41085J2251k07673
$$ 9439417 9581320 8775990 8849763 8890010 8376347 8465609 7930899 7689814 7702065 7494392
16631G494392k12166J9117l37231n5030m52764J90501j94508k62460p0908k01037
$$ 7494392 7282226 7301343 6964112 6909082 6456318 6646819 6452311 6189851 6118943 5917906
16621E917906N8394k36923j72646l08112k5630J65913K58163m40136l25048q2007
$$ 5917906 5976300 5739377 5566731 5258619 5232989 5398902 5657065 5216929 4891881 4809874
16611D809874J16122o1316k89724k92154R8946l49097K68620p7630j46453r9953
$$ 4809874 4925996 4864680 4574956 4282802 4381748 4032651 4301271 4223641 4077188 3977235
16601C977235j07791K87008m41048K41149K2400m36451L1391n1055J13128O6343
$$ 3977235 3869444 4156452 3715404 3956553 3978953 3542502 3573893 3522838 3635966 3702309
16591C702309k89150r943J12681o17540K01706N30526p47808K70242j14931q454
$$ 3702309 3413159 3403216 3515897 2898357 3100063 3630589 2882781 3153023 3038092 3029638
16581C029638J2219j06747L51029q70259M17676l14365Q2573P7229j79732p5605
$$ 3029638 3041857 2935110 3286139 2415880 2833556 2519191 2601764 2678993 2499261 2423656
16571B423656J68730J36204l4067o5944j40505k04405L07379n46535K58852k9437
$$ 2423656 2592386 2728590 2694523 2628579 2488074 2283669 2591048 2044513 2303365 2273928
16561B273928K8669j77168j71077K32332L2517k49962L09465k12367m53559J97362
$$ 2273928 2302597 2125429 1954352 2186684 2219201 1969239 2278704 2066337 1612778 1810140
16551A810140k84707N00496q4820l9569j16086K44881m82594j77825L97121j8800
$$ 1810140 1525433 2025929 1941109 1901540 1785454 2030335 1547741 1369916 1767037 1748237
16541A748237R5551m23237M24801j70167K28876l27955j11536n9366k84434P26178
$$ 1748237 1843788 1420551 1845352 1675185 1904061 1576106 1464570 1405204 1120770 1846948
16531A846948n67471M67317m34623j11815M64207l17269M19956m54401J86236
$$ 1846948 1279477 1746794 1312171 1200356 1664563 1347294 1767250 1312849 1499085
16522A499085m08895K08863q5157R780N8876j02495M56666l82686P3856R3275
$$ 1499085 1090190 1299053 1213896 1223676 1282552 1180057 1636723 1254037 1327893 1421168
16512A421168j11178L4536l19748K76451j94678j04382K95130j25256n4890j60102
$$ 1421168 1309990 1344526 1024778 1301229 1106551 1002169 1297299 1172043 1117153 957051
16502I57051J17836j70550K70417J5397p5451p7261O4316k1591J99791o7144l19314
$$ 957051 1074887 904337 1174754 1190151 1114700 1037439 1101755 1080164 1279955 1212811 893497
16491H93497J43519J87301k18882M9912j61498K56253l14643k66396L44354j86773
$$ 893497 1037016 1224317 1005435 1055347 893849 1150102 835459 569063 913417 726644
16481G26644L19370k52590J14130l32928K56873q9295K76145j9238m8560m16148
$$ 726644 1046014 793424 907554 574626 831499 742204 1018349 999111 950551 534403
16471E34403N78770m71060J71370k16j61871K90800j1553l2635m489k67373J93049
$$ 534403 1113173 642113 813483 813267 651396 942196 930643 898008 893519 626146 819195
16460H19195j31948K22579l13319r8906l2347N03432D53395J59363j60807P7599
$$ 819195 687247 909826 596507 497601 465254 968686 453395 612758 451951 529550
16450E29550p0951O86394n20487J15937J32203o7169j47416r391k48552R6145
$$ 529550 458599 1144993 624506 740443 872646 805477 658061 648670 400118 496263
16440D96263M27374k92038K22619l55097J49572j38882K649p8299K94241j05745
$$ 496263 923637 631599 854218 499121 648693 509811 512460 434161 728402 622657
16430F22657A85248L30962R8218j45432r9952J16842K40633j00386J21082C32374
$$ 622657 185248 516210 614428 468996 369044 485886 726519 626133 747215 332374
16419C32167L39839Q9501C69037n2857M13304j39538p1498j39650O6153Q6660
$$ 332167 672006 761507 369037 316180 729484 589946 518448 378798 444951 531611
16409E31611k24657N23818B83885K00902j73289K62389L5332B98701J41294L90974
$$ 531611 306954 830772 283885 484787 311498 573887 609219 298701 439995 830969
16399H30969k90208B05551K78074k4560B00370a5363C41170o8781P0407J93198
$$ 830969 540761 205551 483625 459065 200370 -15363 341170 272389 342796 535994
16389E35994I6426N00029j51020j06078J77667A36565K93867J63047A79662L3762
$$ 535994 96426 596455 445435 339357 517024 136565 430432 593479 179662 213424
16379B13424K5074C4589L22419J20140B34216K30663j26108P2616j76191Q241
$$ 213424 238498 34589 357008 477148 234216 464879 338771 411387 235196 243437
16369B43437K76989r951B05342A7647J42182K13284Q6596M7022A28972J34503
$$ 243437 520426 510475 205342 17647 159829 373113 459709 506731 128972 263475
16359B63475A17856O6285m243L81006j42463n8540A39936k0079K05789j06038
$$ 263475 117856 184141 179898 560904 418441 359901 139936 119857 325646 219608
16349B19608K1525P7799P103Q5542J0800r4282j63811K26052q0950H3159J37746
$$ 219608 241133 318932 326035 411577 422377 328095 164284 390336 309386 83159 220905
16338B20905j06416O4646K23146H6597L54032I8224J27530J21196j20884a35085
$$ 220905 114489 179135 402281 86597 440629 98224 225754 346950 226066 -135085
16327C5778J41359K03298j42639j05448J34245K22209H0679j1196a18196H5526
$$ 35778 177137 380435 237796 132348 266593 488802 80679 69483 -118196 85526
16316C24932c49658D5979P16587C5641L42117j75777Q1335j09884n6331M42500
$$ 324932 -349658 45979 762566 35641 377758 201981 283316 173432 117101 559601
16306E59601B50884C291L51645j06965K59476a63033E54123I5342L33758a4022
$$ 559601 250884 3291 354936 247971 507447 -163033 554123 95342 429100 -14022
16295B54005I0312n431O4053m132R9893J10068A15371J78989C5856e9410B5510
$$ 254005 90312 84881 148934 144802 244695 354763 115371 294360 35856 -59410 25510
16283E0000Q0248J52560C3922J00675J25128K00822A69617O0428J29950P31d03707
$$ 50000 130248 282808 33922 134597 259725 460547 169617 230045 359995 360726 -403707
16271A72945R923k6466k7953J98686A35462cB88817C2622L48082K3509A13021
$$ 172945 182868 156402 128449 327135 135462 -3 288817 32622 380704 404213 113021
16259a5104A9195i257B75365D0300a884C42907I9544h8511d3506D638a86571A19063
$$ -15104 19195 -9257 275365 40300 -1884 342907 99544 -88511 -43506 4638 -186571 119063
16246C1931a20522C8097a77913e2869I2911A9051L22360a57817B47422n3154Q8045
$$ 31931 -120522 38097 -177913 -52869 92911 19051 341411 -157817 247422 194268 282313
16235B82313a38944A34220L32984A31104g7329C64783b6796H3523K7192L7931
$$ 282313 -138944 134220 467204 131104 -77329 364783 -26796 83523 110715 148646
16225A48646Q2073A4171a54168B55451A03228K48181q0528H2052j535M97860c295
$$ 148646 230719 14171 -154168 255451 103228 351409 270881 82052 80517 578377 -3295
16213B07635C170J7715K32881e0372j04677A90543p1556c4832C81215j57240o7874
$$ 207635 3170 20885 253766 -50372 -155049 190543 118987 -34832 381215 223975 156101
16202A56101D9663J60515b1426C08606A38450J05270g0122A20336k0435B1551
$$ 156101 49663 210178 -21426 308606 138450 243720 -70122 120336 99901 21551
16191A17794i6902j1838D6297J96425B0727P8287K64062A18932P5048H4432a4210
$$ 117794 -96902 -108740 46297 242722 20727 99014 363076 118932 193980 84432 -14210
16179A17116E6327a99387I2721e5845A67102M5129g3023j39431d1861A90899E0621
$$ 117116 56327 -199387 92721 -55845 167102 212231 -73023 -212454 -41861 190899 50621
16167I9412k0925j8753c7071m34G0573R1778L863H0370B7205a49845A3391c93693
$$ 99412 78487 59734 -37071 -37505 70573 162351 166214 80370 27205 -149845 13391 -393693
16154D3281M2647c8283A46668O9438h4806C51739C4590R1891J10991E0506M6126
$$ 43281 85928 -38283 146668 216106 -84806 351739 34590 126481 237472 50506 96632
16143I6632m7972a4529I366N05c678n0222q1361k9094K5572K7377I6667b98373
$$ 96632 48660 -14529 9366 9871 -3678 -53900 -135261 -164355 -138783 -111406 96667 -298373
16130A17121E8132J37029b91151J0172B64015P8919A07061L42141f9651k34963
$$ 117121 58132 195161 -291151 -280979 264015 342934 107061 449202 -69651 -304614
16120c04614E6969J5182K14169K42576a17576I9200f2340A1988b05318B14699
$$ -304614 56969 72151 286320 528896 -117576 99200 -62340 11988 -205318 214699
16109C1618h4082k54882J67193O4594A90152B0600K07023r089J94422r178j47743
$$ 31618 -84082 -338964 -171771 -107177 190152 20600 227623 218534 412956 403778 256035
16098B56035E1388K35385j04509H5979J26353a8835j42219d4892r9125A62914
$$ 256035 51388 286773 182264 85979 212332 -18835 -161054 -44892 -144017 162914
16087I2058J28005r4429Q751n2177J68237c20466a13838k533q0893P9048A29877
$$ 92058 220063 125634 134385 82208 250445 -320466 -113838 -116371 -197264 -118216 129877
16075d820k98768F218N0595J21748c25298B04838j8689I0766L0557e3319j05864
$$ -4820 -303588 6218 56813 178561 -325298 204838 186149 90766 121323 -53319 -159183
16064a59183B3351Q1955g0399L4895A81718a00426j67487g2065o0555K4410b4624
$$ -159183 23351 105306 -70399 -35504 181718 -100426 -267913 -72065 -132620 -108210 -24624
16052C3890N2089C2061O7241A4889P3046J41955C1096o1a64344P0103E3494b9782
$$ 33890 85979 32061 99302 14889 87935 229890 31096 31035 -164344 -94241 53494 -29782
16039A6025d19679F7342a42636H2525l2999b41126A55134g1184l39680G9377b73696
$$ 16025 -419679 67342 -142636 82525 49526 -241126 155134 -71184 -410864 79377 -273696
16027d044F4391K06656B3620a83778P7251L4695B92710b50855K0685k48108a98634
$$ -4044 64391 271047 23620 -183778 -106527 -71832 292710 -250855 -230170 -478278 -198634
16015G59e4789j34190f007l36452B56090G891a15487d7629C1978K070b1924c559
$$ 759 -54789 -188979 -6007 -342459 256090 7891 -115487 -47629 31978 34048 -21924 -3559
16002H4529i8563C99161c88B37227b08020H8415c40704d068A14899b50122C480
$$ 84529 -98563 399161 -388 237227 -208020 88415 -340704 -4068 114899 -250122 3480
15990A32908N440e4176B19484k8423K25906j74034o5894C8876J50016R8040J28629
$$ 132908 138348 -54176 219484 191061 416967 242933 177039 38876 188892 286932 415561
15979D15561j93465a50653A89903R4436E3160m387J59065a00585B55571r2142
$$ 415561 222096 -150653 189903 284339 53160 48773 207838 -100585 255571 163429
15969A63429b2993A833J96550R2539c67118A97648r2802A9500J95990a57355C45675
$$ 163429 -22993 1833 198383 290922 -367118 197648 104846 19500 215490 -157355 345675
15957b27413D3743i2420B9247b05546c279r9695B51854b21503B23714E6137c575
$$ -227413 43743 -92420 29247 -205546 -3279 -102974 251854 -221503 223714 56137 -3575
15945f712j35438C54854i7712A86787e811p9694A34496a82792p9289I8184Q8633
$$ -6712 -142150 354854 -97712 186787 -5811 -85505 134496 -182792 -262081 98184 186817
15934A86817b19026Q8902J3556j06876f3537A89553p1744a15819l22885B24197
$$ 186817 -219026 -130124 -116568 -223444 -63537 189553 117809 -115819 -438704 224197
15923b07461l4805N4062j10740P6822N8628A43929b68282j04037F5594j0368a49323
$$ -207461 -242266 -188204 -298944 -222122 -163494 143929 -268282 -372319 65594 55226 -149323
15911G3879L20J80846q9548a98506j0381A96910n4001b7444E5737k7231J74811
$$ 73879 74199 255045 165497 -198506 -208887 196910 142909 -27444 55737 28506 203317
15900B03317a15971j91232k1274G9651J30669A718c44870J41297c948k6416r1815
$$ 203317 -115971 -307203 -328477 79651 210320 1718 -344870 -203573 -3948 -30364 -122179
15889a22179A06605b99441E02611a96339C54099F5480R2969i3119j25486B8403
$$ -122179 106605 -299441 502611 -196339 354099 65480 158449 -93119 -218605 28403
15878e54207e3655A42493c07364A75359b99299J27771F3577a1881B72546a3184
$$ -554207 -53655 142493 -307364 175359 -299299 -171528 63577 -11881 272546 -13184
15867D7909M0457d33174A58186j3687J20702c58966J45696B9770b16069B2813
$$ 47909 88366 -433174 158186 144499 265201 -358966 -213270 29770 -216069 22813
15856A3244J23481D6115b89620C05929B801J54087C2286a66697F3232k7462A2542
$$ 13244 136725 46115 -289620 305929 2801 156888 32286 -166697 63232 35770 12542
15844c3927e052j32984I9680a39031e6674j6122B36025F2850n995h4055n462K0554
$$ -33927 -5052 -138036 99680 -139031 -56674 -72796 236025 62850 56855 -84055 -89517 -68963
15832f8963K6584D9263K6866b58876I4308A8089J86058E8485O9476c22029J39059
$$ -68963 -42379 49263 76129 -258876 94308 18089 204147 58485 127961 -322029 -182970
15821a82970j28077a29892d2936k04392a6102r7446G4805a37566D9077A6430c21491
$$ -182970 -311047 -129892 -42936 -247328 -16102 -113548 74805 -137566 49077 16430 -321491
15809D3249a32767M2504R205j21808B18698b28240F60g1143C88127a00486M7091
$$ 43249 -132767 -90263 -81058 -202866 218698 -228240 660 -71143 388127 -100486 -53395
15798e3395B28241o0952a13012j98643F7651N1894e2247j78897B15109b0492B54404
$$ -53395 228241 167289 -113012 -311655 67651 119545 -52247 -231144 215109 -20492 254404
15786F3031b1999k02382R0731o2994N8380j8905N501a094l50867g4973B74793
$$ 63031 -21999 -224381 -133650 -196644 -138264 -157169 -151668 -1094 -351961 -74973 274793
15774a72774P6129H9641k7394a04207r5807E8434f0881l4389J222L9299j26473
$$ -172774 -96645 89641 62247 -104207 -200014 58434 -60881 -95270 -94048 -54749 -181222
15763a81222B50640C5682a59311H9142e2061A79564d2610D93794C3230M0360a6334
$$ -181222 250640 35682 -159311 89142 -52061 179564 -42610 493794 33230 73590 -16334
15751B21520l8088K69726G1924K97996B9497f274j22336B61469e1539k21035C16169
$$ 221520 183432 453158 71924 369920 29497 -6274 -128610 261469 -51539 -272574 316169
15739E5025d9124A69337a19887a2039j37931b8237B31761b21435n0175a24636
$$ 55025 -49124 169337 -119887 -12039 -149970 -28237 231761 -221435 -271610 -124636
15728F4286J46835h0028J7167A09181L174a23798L0742c9430D2598a56939l7617
$$ 64286 211121 -80028 -62861 109181 112355 -123798 -93056 -39430 42598 -156939 -194556
15717a94556j00848A51740a6413k51813A09326a36192k9215r102A8557b26636
$$ -194556 -295404 151740 -16413 -268226 109326 -136192 -165407 -174509 18557 -226636
15706C4923P8810J689a12359n79b595k95086J08771j21268c3384j22253A71047
$$ 34923 113733 115422 -112359 -112938 -2595 -297681 -188910 -310178 -33384 -155637 171047
15694F6297g682k16049b7064k43506e4862B03899a44803A30508h4292B01582a69893
$$ 66297 -7682 -223731 -27064 -270570 -54862 203899 -144803 130508 -84292 201582 -169893
15682H78b018B05895b20807M6889k3412c984I5023b24503b1095D4138J7918J3584
$$ 878 -2018 205895 -220807 -173918 -197330 -3984 95023 -224503 -21095 44138 62056 75640
15670G5640a6885A78415o5062a19297d7713j48034i5935j64962d6228A89029F1723
$$ 75640 -16885 178415 113353 -119297 -47713 -195747 -95935 -260897 -46228 189029 61723
15658A15462E3449b61217a1786l06889A21359k8488Q0969c73200a46004F1473
$$ 115462 53449 -261217 -11786 -318675 121359 92871 173840 -373200 -146004 61473
15647a94099j9337B7115a06784J6462I8916g8121l8149A07203L3171n7476a2071
$$ -194099 -213436 27115 -106784 -90322 98916 -78121 -116270 107203 140374 82898 -12071
15635H2725l2170b75529J35580e4835R395k36077G5569G250a35118b8546A60937
$$ 82725 50555 -275529 -139949 -54835 -45440 -281517 75569 7250 -135118 -28546 160937
15623D4482Q4210n8009h4411A08736J86308c6323A17701a71391N8686a9125q4011
$$ 44482 128692 70683 -84411 108736 295044 -36323 117701 -171391 -112705 -19125 -103136
15612a03136j10085F3372J1104f4783A12186a83894k8387B4148a93093B81821
$$ -103136 -213221 63372 74476 -64783 112186 -183894 -212281 24148 -193093 281821
15601f1444k3437k08953F0098L70411h0163G3320f921k65516J00718A23385J55772
$$ -61444 -84881 -293834 60098 430509 -80163 73320 -6921 -272437 -171719 123385 279157
15590B79157j25305J20014f1130A48132b5365B91171B6213i4063A70667m1868
$$ 279157 153852 273866 -61130 148132 -25365 291171 26213 -94063 170667 128799
15580A28799f1337o3214L5701F0356L46106c43345A35386m9562a73980B40153
$$ 128799 -61337 -124551 -88850 60356 406462 -343345 135386 85824 -173980 240153
15569a65701A49538b13654C28476a07826d5468A0125b44701H028a36855N6703
$$ -165701 149538 -213654 328476 -107826 -45468 10125 -244701 8028 -136855 -80152
15559h0152A35623G625c4195B34691A10021D4986a53769B58151m500F0507O7057
$$ -80152 135623 7625 -34195 234691 110021 44986 -153769 258151 253651 60507 127564
15548A27564M856b16258A05773B3623i1700A74161F9492A3156O8968h5369A14277
$$ 127564 132420 -216258 105773 23623 -91700 174161 69492 13156 82124 -85369 114277
15536C2999a10973K2867H5224R6894e6076D4263h9746F329J10739m5711b998k14308
$$ 32999 -110973 -88106 85224 182118 -56076 44263 -89746 6329 117068 71357 -2998 -217306
15524b17306c7456D601J53263b05751B02437c52630C4113a79746j86692h8469
$$ -217306 -37456 4601 157864 -205751 202437 -352630 34113 -179746 -366438 -88469
15513a96531a8142A23502M5254a47500I567e8685F6794c706B4324P6424e3550
$$ -196531 -18142 123502 168756 -147500 9567 -58685 66794 -3706 24324 100748 -53550
15501a08795j05238h1701b0581A72315a11771A46226a90374A42019c009j68097
$$ -108795 -214033 -81701 -20581 172315 -111771 146226 -190374 142019 -3009 -171106
15491a71106A17956f6528E910J4544c89920J36419A07118J06046A2266c10612
$$ -171106 117956 -66528 5910 20454 -389920 -253501 107118 213164 12266 -310612
15480A15481j0863L5108d9147D41715A50689a75574e7310D112b07768A73661l4032
$$ 115481 104618 139726 -49147 441715 150689 -175574 -57310 4112 -207768 173661 139629
15469A39629c9233p0803L5946B88300c2309j31030d7708A4266c7223n6425d6277
$$ 139629 -39233 -110036 -74090 288300 -32309 -163339 -47708 14266 -37223 -93648 -46277
15457b18611B9874J34574B3744K28993b46520H7439J64342a51155A19386b61256
$$ -218611 29874 164448 23744 252737 -246520 87439 251781 -151155 119386 -261256
15446A43402A6101P8491Q7978n2493E6057B1915a33479l13324a57293D9371J20236
$$ 143402 16101 94592 182570 130077 56057 21915 -133479 -446803 -157293 49371 169607
15435A69607J75841f3126A74127n9827a8484H3684f9759j24286N5815M5323c8970
$$ 169607 345448 -63126 174127 114300 -18484 83684 -69759 -194045 -138230 -92907 -38970
15423a96555E256L4808M2191R6166b01737A5087J3992n541J703a36456q8100A36559
$$ -196555 5256 40064 82255 178421 -201737 15087 29079 23538 25241 -136456 -224556 136559
15410B43157P1114a6146B9734J50953i127j4729A87296A8487J05624D9587c10542
$$ 243157 314271 -16146 29734 180687 -9127 -23856 187296 18487 124111 49587 -310542
15398B68611a13839l3200B57944D1677j4848b75601R4935N9228J2538I3935a65354
$$ 268611 -113839 -147039 257944 41677 26829 -275601 -180666 -121438 -108900 93935 -165354
15386A3036J67935G202J34468J32631o8024g9884c9804A79186a4999n9378B73241
$$ 13036 180971 7202 141670 274301 206277 -79884 -39804 179186 -14999 -74377 273241
15374A59462a83721g6689b895m18835a92009D3999a02494F1028A924J57253b92109
$$ 159462 -183721 -76689 -2895 -421730 -192009 43999 -102494 61028 1924 159177 -292109
15362b31417l013A5001i0842o273k3018r9529B73960m9254J07201b08802M5389
$$ -231417 -234430 15001 -90842 -97115 -120133 -219662 273960 224706 331907 -208802 -163413
15351a63413G7159a70284D3097K67956b42230j70213C2130K67407d7418D10419
$$ -163413 77159 -170284 43097 311053 -242230 -412443 32130 299537 -47418 410419
15340c21738B10862J0734r9031n5495J84549d9349j60515A67027F0804a28690
$$ -321738 210862 221596 122565 67070 251619 -49349 -209864 167027 60804 -128690
15329A85692a79812r218A21510a74577B23775P2692g4020A44135C7759j2251J88987
$$ 185692 -179812 -189030 121510 -174577 223775 296467 -74020 144135 37759 25508 214495
15318B14495A9931J23662D6352m32l796L1097e0681C20300A53880g8412D1336
$$ 214495 19931 143593 46352 45920 42124 73221 -50681 320300 153880 -78412 41336
15306a49613B93278A32035R406f8165l3918M4103A12884G371K7271a92010A77746
$$ -149613 293278 132035 141441 -68165 -102083 -57980 112884 7371 34642 -192010 177746
15294h6706b4197A07560N8201a20991j17753k210f2409I3555a74615B0083J45595
$$ -86706 -24197 107560 165761 -120991 -238744 -240954 -62409 93555 -174615 20083 165678
15283A65678N2929D1824R4261i5889j06511c1681q7445C15764B8747c7712o4995
$$ 165678 218607 41824 136085 -95889 -202400 -31681 -119126 315764 28747 -37712 -102707
15272a02707A32640e7699l8658A36369a05814B69176j3359B5359a62102q468j25586
$$ -102707 132640 -57699 -96357 136369 -105814 269176 255817 25359 -162102 -170570 -296156
15261b96156B98589A20981K38541A26936a15527A84020M3727b65424c1833j62564
$$ -296156 298589 120981 359522 126936 -115527 184020 227747 -265424 -31833 -194397
15251a94397C16845A9642J38352K38053Q46272P04997n73448J27041L13082D85806
$$ -194397 316845 19642 157994 396047 1242319 1947316 1373868 1500909 1813991 485806
15240A72692k5622M499b45940J13491B42154b26814c6878l07767A53986K40845
$$ 172692 147070 151569 -245940 -132449 242154 -226814 -36878 -344645 153986 394831
15230C94831p1989j9668a1371A43181m0766K03802h3510A10007b35034f215r3323
$$ 394831 322842 303174 -11371 143181 102415 306217 -83510 110007 -235034 -6215 -99538
15219i9538B71405j19081B1154r152a85796j51088C6019J56238m4173J01418l1994
$$ -99538 271405 152324 21154 12002 -185796 -336884 36019 192257 148084 249502 217508
15208B17508C1411M9851J45758E0764a15666B65247j8240j08399m1017C4349b9823
$$ 217508 31411 81262 227020 50764 -115666 265247 247007 138608 97591 34349 -29823
15196C11290p3990F2405R2919a85007C13534J53112b10731A26975b01235I4869
$$ 311290 237300 62405 155324 -185007 313534 466646 -210731 126975 -201235 94869
15185i6625B02851a9659G5412M42836d4296C86446M0279b0693F0636a07279A05055
$$ -96625 202851 -19659 75412 518248 -44296 386446 426725 -20693 60636 -107279 105055
15173a54015E8809J8478K26209r771f875I8437a90487A35859J15942k366A01068
$$ -154015 58809 77287 303496 293725 -6875 98437 -190487 135859 251801 249435 101068
15161b2974j44422A80180L5791J5798Q6341j7265K3767j8647k7984j6968D8048
$$ -22974 -167396 180180 215971 231769 318110 300845 324612 305965 277981 261013 48048
15149A20621m8310J04842e2275n397B19860I6753b40367E145J63786j9827F6580
$$ 120621 72311 177153 -52275 -57672 219860 96753 -240367 5145 168931 149104 66580
15137B46235a52989B76143c7041H1693K79080k5314A60413B5350d2041C06273
$$ 246235 -152989 276143 -37041 81693 360773 335459 160413 25350 -42041 306273
15126A43931P6911F4792J01010o6559L27722j31340q4394f8070B50092e4110A8202
$$ 143931 220842 64792 165802 99243 426965 295625 211231 -68070 250092 -54110 18202
15114B82922H7010J122J08306b30877D7637k624J9361R9352R1100j14622g4853
$$ 282922 87010 88132 196438 -230877 47637 45013 64374 163726 254826 140204 -74853
15102D62678f4715g177E5161J03969O4253N2018j18304F5040J79447I0776i4515
$$ 462678 -64715 -7177 55161 159130 223383 275401 157097 65040 244487 90776 -94515
15090B02549R4234P4431j34355A08467K86595j35224P3833b0233A58582L48269
$$ 202549 296783 371214 236859 108467 395062 259838 333671 -20233 158582 506851
15080E06851a22339C9614a60183j1434H8704K47004p0792F5739B8084f2536B7067
$$ 506851 -122339 39614 -160183 -171617 88704 335708 264916 65739 28084 -62536 27067
15068B59954N8840j40696q6635J18211a23065C17813a5311m130I7289J34118a17502
$$ 259954 318794 178098 91463 209674 -123065 317813 -15311 -19441 97289 231407 -117502
15056A28053J45433A15602k6912J24571C6247M62434A67710Q9302Q8395K14069
$$ 128053 273486 115602 88690 213261 36247 498681 167710 257012 345407 559476
15046E59476A27288k406b81010E81736l6878B27459j7647j3884E7316k2507J48882
$$ 559476 127288 124882 -281010 581736 544858 227459 209812 195928 57316 34809 183691
15035A83691J49808j5680n5221g7437K1099m6394m1135D10112L14873b1276A53735
$$ 183691 333499 317819 262598 -77437 -56338 -102732 -143867 410112 724985 -21276 153735
15023A31728L56647J32737B9434K31619a07123I6205d2148D42844A02996a04650
$$ 131728 488375 621112 29434 261053 -107123 96205 -42148 442844 102996 -104650
15012D09405j48479L5034a59509G655a58884A56023L70716l9237j23047k9119
$$ 409405 260926 295960 -159509 7655 -158884 156023 526739 487502 364455 335336
15002C35336j22703P6378k6259c8669C82065A52932F0979A8673N92102j6210a53057
$$ 335336 212633 289011 262752 -38669 382065 152932 60979 18673 610775 594565 -153057
14990B6752J89916J87249M626I4773L11924J96716k68322H9484J71203a63254
$$ 26752 216668 403917 408543 94773 406697 603413 335091 89484 260687 -163254
14979D21875A69007K76229l5765A60816J8182J16104O6102q8014j07238e9229
$$ 421875 169007 445236 409471 160816 178998 295102 361204 273190 165952 -59229
14968C29766L5374I7899K88080g0077B88362J08621N0369j74777J2674j04657
$$ 329766 365140 97899 385979 -70077 288362 396983 447352 272575 285249 180592
14958A80592K66350j38500p3612Q4280m6364J3433J92006H0296K78034j28071
$$ 180592 446942 308442 234830 319110 272746 286179 478185 80296 358330 230259
14948B30259L23543E5917K92466E7408M11599O3155R9165A40199R4015r1072K48481
$$ 230259 553802 55917 348383 57408 469007 532162 631327 140199 234214 143142 391623
14937C91623j59021J8763j0277N0977J51420j9199q0606J60769A90668J81447
$$ 391623 232602 251365 241088 292065 443485 424286 343680 504449 190668 372115
14927C72115j67708J52247o6118N972K03864j46631J56444O1832k18641A24716
$$ 372115 204407 356654 290536 296508 500372 353741 510185 572017 353376 124716
14916B37488J79352l073D7051M72993k11597j05725J37158j18307D3316K64347
$$ 237488 416840 413767 47051 520044 308447 202722 339880 221573 43316 307663
14906C07663C9747A3984K91825J0908m6348J19440K20609k40794J3796j12923
$$ 307663 39747 13984 305809 316717 270369 389809 610418 369624 383420 270497
14896B70497A14895J13926M14069d107E76826I0118O825J53058K79301k50229
$$ 270497 114895 228821 642890 -4107 576826 90118 96943 250001 529302 279073
14886B79073L41562j26988P0963j52936c055G42100A15637M08694Q891I9771K00689
$$ 279073 620635 493647 564610 411674 -3055 742100 115637 524331 533222 99771 300460
14875C00460J60941j90046j25241J98792j01624O4426L6513O1230J67812J09263
$$ 300460 461401 271355 146114 344906 243282 307708 344221 405451 573263 682526
14865F82526k36969J38464j67801A49775K91327J79908K1342Q3868l37530K59432
$$ 682526 445557 584021 416220 149775 441102 621010 642352 726220 388690 648122
14855F48122j23406O360L7886l3883r3170j12052J1881J26526O8956j00832o0314
$$ 648122 524716 531076 568962 535079 441909 329857 341738 468264 537220 436388 376074
14844C76074o0509M60137o3381C37759m0442J55482L5936j31538O4950B00837
$$ 376074 315565 775702 712321 337759 297317 452799 488735 357197 422147 200837
14833H21454j04484k54998K35437B51204N02718j96835q8327B26360K49831o1034
$$ 821454 716970 461972 697409 251204 753922 557087 468760 226360 476191 415157
14823D15157J36310R5593l22141k857L45624k00246l8654Q6464K78139l24978
$$ 415157 551467 647060 324919 322062 667686 467440 428786 515250 793389 468411
14813D68411J73388k63975n8255J95103L139j77501j0459M05050B17231F6375
$$ 468411 641799 377824 319569 514672 517811 340310 329851 734901 217231 66375
14802C44033L462P81155l50166N4481J04065k45973k01973K65889j58425M1721
$$ 344033 347495 1128650 778484 832965 937030 691057 489084 754973 596548 638269
14792F38269q5287L9370K42169j57216q2459r1284J02251M0011j12991n1742K59378
$$ 638269 552982 592352 834521 677305 594846 503562 605813 645824 532833 481091 740469
14781G40469k45367m2563O9286J40394M0790j12158j43900K07294K1917J80873
$$ 740469 495102 452539 521825 662219 703009 590851 446951 654245 676162 857035
14771H57035K89660m37555o8864L40867k04416j12080K37973j53683J0256K78569
$$ 857035 1146695 709140 640276 981143 776727 664647 902620 748937 759193 1037762
14761A037762l57999L76707D34495j8028L20083n4831J9510q119J60967k21460
$$ 1037762 679763 1056470 434495 416467 736550 681719 701229 693110 854077 632617
14751F32617K99508k13786L22022l03753j88717J35090K79578N9760j98337r4622
$$ 632617 932125 718339 1040361 736608 547891 682981 962559 1022319 823982 729360
14741G29360m9720k25693J74976J43689k30094J14309k33331J99319O08629n61460
$$ 729360 679640 453947 628923 772612 542518 656827 423496 622815 1231444 669984
14731F69984l0839L10460k23102J55912l09816K8255N10241r8012k54551K50792
$$ 669984 639145 949605 726503 882415 572599 600854 1111095 1013083 758532 1009324
14721A009324k1731k23000p0473L14786N0163o0995j28304L16970m12648j8467
$$ 1009324 987593 764593 694120 1008906 1059069 998074 869770 1186740 774092 755625
14711G55625J36946J67237j77243L12559J5311k22441O8661j00306j33554K55658
$$ 755625 892571 1059808 882565 1195124 1210435 987994 1056655 956349 822795 1078453
14701A078453J35265j68040k97718j3489R6405N1960J59097r0511r0998K77995
$$ 1078453 1213718 1045678 747960 734471 830876 882836 1041933 951422 860424 1138419
14691A138419J44591m86333r1895r4482N63053p4533o3762J3724K27443l66567
$$ 1138419 1283010 796677 704782 610300 1173353 1098820 1035058 1048782 1276225 909658
14681I09658j05449O4572M299j40095N44389m18129K94471j23000p6901L34940
$$ 909658 804209 868781 873080 732985 1277374 859245 1153716 1030716 953815 1288755
14671A288755p1013j06627J86207m7481n4777r0539l86072J94766N40727Q8589
$$ 1288755 1217742 1111115 1297322 1249841 1195064 1104525 718453 913219 1453946 1542535
14661A542535p03708O78933l17738q3088J39177M2341n1106k84140K73034p3693
$$ 1542535 838827 1517760 1200022 1116934 1256111 1298452 1247346 963206 1236240 1162547
14651A162547j0590J82248k9700j20289k9524L78249j78776l4103k7837K37065
$$ 1162547 1151957 1334205 1304505 1184216 1154692 1532941 1354165 1320062 1292225 1529290
14641A529290k12900P5425L36606l75727k69310L62736j3662L15648l01102j11496
$$ 1529290 1316390 1391815 1728421 1352694 1083384 1446120 1432458 1748106 1447004 1335508
14631A335508K11467j41234o5617K85595j60515K6431l0078J3956r9843j58064
$$ 1335508 1546975 1405741 1340124 1625719 1465204 1491635 1461557 1475513 1375670 1217606
14621A217606M10313J64232k72317j1790J99412j72332J32395K03360k02103K22081
$$ 1217606 1627919 1792151 1519834 1508044 1707456 1535124 1667519 1870879 1668776 1890857
14611A890857j16136q6103K523J63199K9505o8304k68173N9108K84802j79180
$$ 1890857 1774721 1688618 1691141 1854340 1883845 1815541 1547368 1606476 1891278 1712098
14601A712098J89460J24461m36408K44599L50066n5417m40916k6273M82460k36438
$$ 1712098 1901558 2026019 1589611 1834210 2184276 2128859 1687943 1661670 2144130 1907692
14591A907692k72641N48863m6315k81822M63628l37316J11946k84897M0452J23251
$$ 1907692 1635051 2183914 2137599 1855777 2319405 1982089 2094035 1809138 1849590 1972841
14581A972841K73920J49126j64080j20093J73181J74438j42274n5664J93163J62243
$$ 1972841 2246761 2395887 2231807 2111714 2284895 2459333 2317059 2261395 2454558 2616801
14571B616801j88650Q9817n0280Q3424l98886N91860k44894L03617j58684K05772
$$ 2616801 2428151 2517968 2467688 2551112 2152226 2744086 2499192 2802809 2644125 2849897
14561B849897J1065L05221o8707k63603N50803j16501l8980N34236N00707l51554
$$ 2849897 2860962 3166183 3097476 2833873 3384676 3268175 3229195 3763431 4264138 3912584
14551C912584P68121J544710J473436L609953P856288J6967994K1085726B7272887
$$ 3912584 4680705 6225415 7698851 11308804 19165092 36133086 57218812 27272887
14542A0525480l033273C419466r23099o02042P9425k370K5412n3303L0328L69687
$$ 10525480 7492207 3419466 2496367 1894325 1973750 1971380 1996792 1943489 1973817 2343504
14532B343504k4848K2357k35529K73461o8873M1614L49567k23061M9086M34015
$$ 2343504 2318656 2341013 2105484 2378945 2310072 2351686 2701253 2478192 2527278 2961293
14522B961293k91252N9035J95144J65707k24357k05028N4707M40913j42827M7105
$$ 2961293 2670041 2729076 2924220 3089927 2865570 2660542 2715249 3156162 3013335 3060440
14512C060440O6680j02668j28556J43987J06197J84663j47686J10282J34271O418
$$ 3060440 3127120 3024452 2895896 3039883 3146080 3330743 3183057 3293339 3427610 3434028
14502C434028j27944K8019p2797K51625r7702K30148j50089K32945K19158k92448
$$ 3434028 3306084 3334103 3261306 3512931 3415229 3645377 3495288 3728233 3947391 3654943
14492C654943N7811j50075J70252K23895l5209P0437m6965J18549J54744n2436
$$ 3654943 3712754 3562679 3732931 3956826 3921617 3992054 3945089 4063638 4218382 4165946
14482D165946k20496J17698M0488J61164O9986M9363J54732j50062K43566j99887
$$ 4165946 3945450 4063148 4103636 4264800 4334786 4384149 4538881 4388819 4632385 4432498
14472D432498L40823k36282J17034p0143L52995l21965j01709O40401k52075L8615
$$ 4432498 4773321 4537039 4654073 4583930 4936925 4614960 4513251 5153652 4901577 4940192
14462D940192J23539J68356J91318l0601K42429m26727K74214R9591j84127L63454
$$ 4940192 5063731 5232087 5423405 5392804 5635233 5208506 5482720 5582311 5398184 5761638
14452E761638q614k28160M97069k68944K35008k8236K47862J17035q2172m5757
$$ 5761638 5753024 5524864 6021933 5752989 5987997 5959761 6207623 6324658 6242486 6196729
14442F196729O68496n7808k17045K09783M3653L20214k28446P82380o40271L71211
$$ 6196729 6865225 6807417 6590372 6800155 6843808 7164022 6935576 7717956 7077685 7448896
14432G448896J00035l7242K0170J77709j35793L03364K03912m9133O7348J85832
$$ 7448896 7548931 7511689 7531859 7709568 7573775 7877139 8081051 8031918 8099266 8285098
14422H285098J07699J96335K8302K56287j4714J18733J37959K10352K46607j22886
$$ 8285098 8392797 8589132 8617434 8873721 8859007 8977740 9115699 9326051 9572658 9449772
14412I449772J45135J44916L30477L18312l21321K11136P87072l98181K90590
$$ 9449772 9594907 9739823 10070300 10388612 10067291 10278427 11065499 10667318 10957908
14403A0957908k46324L76895K54234k2339K12501K78990O45793k44843J23501
$$ 10957908 10711584 11088479 11342713 11320374 11532875 11811865 12457658 12212815 12336316
14394A2336316L49062J92785J20157O28120j17099M80747J27074J92798K98256
$$ 12336316 12685378 12878163 12998320 13626440 13509341 13990088 14117162 14309960 14608216
14385A4608216L5318J72068N40924L81748K411O81518Q9754N59977L39161j40596
$$ 14608216 14643534 14815602 15356526 15738274 15740685 16422203 16511957 17071934 17411095 17270499
14375A7270499N88692L37560K49721K90908K84435M69610M05245P22657L57733
$$ 17270499 17859191 18196751 18446472 18737380 19021815 19491425 19896670 20619327 20977060
14366B0977060M95978K34247P34110L0908P99670O09914k9936J029147L81630
$$ 20977060 21473038 21707285 22441395 22472303 23271973 23881887 23851951 24881098 25262728
14357B5262728K22157Q67150O61547Q30812M80274L83830O86613P24169Q80438
$$ 25262728 25484885 26352035 27013582 27844394 28324668 28708498 29395111 30119280 30999718
14348C0999718P50883P93491Q39722R57017O35402J264441N32050R82902J114124
$$ 30999718 31750601 32544092 33383814 34340831 34976233 36240674 36772724 37755626 38869750
14339C8869750Q02342J413742J196530J342072J346938R96381J399314J360196
$$ 38869750 39672092 41085834 42282364 43624436 44971374 45967755 47367069 48727265
14331D8727265J403817J472036J999883J458139J788232J682277K077244K225713
$$ 48727265 50131082 51603118 53603001 55061140 56849372 58531649 60608893 62834606
14323F2834606J866827K144566K275003K234766K731042K518159L174258K569504
$$ 62834606 64701433 66845999 69121002 71355768 74086810 76604969 79779227 82348731
14315H2348731L150620L353942L500254L759182L584189M171051M559049M314797
$$ 82348731 85499351 88853293 92353547 96112729 99696918 103867969 108427018 112741815
14307A12741815M850234N048547N009255N506118O124026O634096O549637P051816
$$ 112741815 117592049 122640596 127649851 133155969 139279995 145914091 152463728 159515544
14299A59515544P441742Q040591Q398472Q653146R462786J0177579J0037452J1069977
$$ 159515544 166957286 174997877 183396349 192049495 201512281 211689860 221727312 232797289
14291B32797289J1396287J2260860J2244711J3405638J3418008J3883711J4550068
$$ 232797289 244193576 256454436 268699147 282104785 295522793 309406504 323956572
14284C23956572J4736633J4834198J4878481J5144811J4348250J4205333J3311892
$$ 323956572 338693205 353527403 368405884 383550695 397898945 412104278 425416170
14277D25416170J2253692J1112426R262867O547176K499908O93334p91367p62920
$$ 425416170 437669862 448782288 458045155 464592331 467092239 467785573 466994206 466231286
14269D66231286L64146k742670l384024p222950q975634j1507186j2335152j3765898
$$ 466231286 466595432 463852762 460468738 453245788 444270154 432762968 420427816 406661918
14261D06661918j4206275j4945389j4995260j5220237j5127374j4707191j4602556
$$ 406661918 392455643 377510254 362514994 347294757 332167383 317460192 302857636
14254C02857636j4122817j2620061j2531168j2734387j1761865j1820463j0688748
$$ 302857636 288734819 276114758 263583590 250849203 239087338 227266875 216578127
14247B16578127j0024252r903514r037010q294876q206120q194291p184905o872637
$$ 216578127 206553875 196650361 187613351 179318475 171112355 162918064 155733159 148860522
14239A48860522o832442n860461n552064n199852n810990m953503m598949m440625
$$ 148860522 142028080 136167619 130615555 125415703 119604713 114651210 110052261 105611636
14231A05611636l652093m117603l915493l589721l196576l308832l323981k607331
$$ 105611636 101959543 97841940 93926447 90336726 87140150 83831318 80507337 77900006
14223G7900006l214545k241937k525937k349115k097781k323052k031666j762310
$$ 77900006 74685461 72443524 69917587 67568472 65470691 63147639 61115973 59353663
14215E9353663j994548j725400j302120j793640j808371j223255j671686j353925
$$ 59353663 57359115 55633715 54331595 52537955 50729584 49506329 47834643 46480718
14207D6480718r50565r76493j642530j294443j444032j116728l45355q80893j232990
$$ 46480718 45530153 44553660 42911130 41616687 40172655 39055927 38710572 37829679 36596689
14198C6596689j316569p66286r20771o15854r02219m76887p85699j031125o80823
$$ 36596689 35280120 34513834 33593063 32977209 32074990 31598103 30812404 29781279 29100456
14189B9100456j045728m00378l93890r04598n42428q11771k16271n88388n66842
$$ 29100456 28054728 27654350 27260460 26355862 25813434 25001663 24785392 24197004 23630162
14180B3630162o13423k31151p74912j72676q78698j80517l00889k39525m44235
$$ 23630162 23016739 22785588 22010676 21838000 20959302 20778785 20477896 20238371 19794136
14171A9794136q0662q81805l89515j99193j78579j77137o34143q3770m72686K7788
$$ 19794136 19713474 18831669 18442154 18242961 18064382 17887245 17253102 17169332 16696646 16724434
14161A6724434n32876o22856J23660m18983l45321m17610J18531n08039n4028
$$ 16724434 16191558 15568702 15692362 15273379 14928058 14510448 14628979 14120940 14066912
14152A4066912J19487o90748J0144j96472l76205j79067l92914j3571k34327r1667
$$ 14066912 14186399 13495651 13505795 13309323 12933118 12754051 12361137 12347566 12113239 12021572
14142A2021572l24682J25884k40672k26671m4607m07336j00464j88593K6290P8037
$$ 12021572 11696890 11822774 11582102 11355431 11310824 10903488 10803024 10614431 10640721 10718758
14132A0718758n28542k05622N4283k70320j66815l08448j7739K07046j75328m81518
$$ 10718758 10190216 9984594 10038877 9768557 9601742 9293294 9275555 9482601 9307273 8825755
14122H825755j61974r9389j16429p4103M77727n11950M2810k31925M2718k09450
$$ 8825755 8663781 8564392 8447963 8373860 8851587 8339637 8382447 8150522 8193240 7983790
14112G983790j65177j88895j39946j95048J56516m16204M75916l69081k09839
$$ 7983790 7818613 7629718 7489772 7294724 7451240 7035036 7510952 7141871 6932032
14103F932032Q7331J88522n93911j136K99745l42051l43641N13315o45603L59653
$$ 6932032 7019363 7207885 6613974 6612838 6912583 6570532 6226891 6740206 6094603 6454256
14093F454256m40664J37946k04431j48885j98475L3882q8935L86375k35509p3521
$$ 6454256 6013592 6151538 5947107 5798222 5599747 5633629 5544694 5931069 5695560 5622039
14083E622039J88359k61132k11594j03723L28021m11859N4619M6970o8146J19087
$$ 5622039 5810398 5549266 5337672 5233949 5561970 5150111 5204730 5251700 5183554 5302641
14073E302641j35844k00122J54360n30852K12069j16257k77068J06480K59473
$$ 5302641 5166797 4966675 5121035 4590183 4802252 4685995 4408927 4515407 4774880
14064D774880j08748m84501O21328j66924J2862j13738j22973l34671J72492J64743
$$ 4774880 4666132 4181631 4802959 4636035 4648897 4535159 4412186 4077515 4250007 4414750
14054D414750n60334K33491q9584O3834j53511J6793J0487k24788O4480J32608
$$ 4414750 3854416 4087907 3998323 4062157 3908646 3925439 3935926 3711138 3775618 3908226
14044C908226M22611j028820L36706j86412l26203O46660n44417K29402J26208
$$ 3908226 4330837 3302017 3638723 3452311 3126108 3772768 3228351 3457753 3583961
14035C583961k86621k4648J15252J61415k43723o1154N1039q6870Q2479K9136
$$ 3583961 3297340 3272692 3387944 3549359 3305636 3244482 3295521 3208651 3291130 3320266
14025C320266l27956K23966K10272m45117r7186k44726O83807l50588l95975K86928
$$ 3320266 2992310 3216276 3426548 2981431 2884245 2639519 3323326 2972738 2576763 2863691
14015B863691J51160m594k07249n16551M33849k38306M5450K79977m46383K23119
$$ 2863691 3014851 3010257 2803008 2286457 2720306 2482000 2527450 2807427 2361044 2584163
14005B584163l3862J53186m27418M57555l56225r7368m4212Q7913q4038n4440
$$ 2584163 2550301 2703487 2276069 2733624 2377399 2280031 2235819 2323732 2239694 2185254
13995B185254j54475K34104k42679J85861J71821k31750J309747K396025N809486
$$ 2185254 2030779 2264883 2022204 2208065 2379886 2148136 3457883 5853908 11663394
13986A1663394J5091693K8728605k0064881A5456523o840739k597751r04544q37268
$$ 11663394 26755087 55483692 35418811 15456523 8615784 6018033 5113489 4276221
13978D276221m46183o6326l51660l35450O7704j43717J63890n16217P1915j97210
$$ 4276221 3830038 3763712 3412052 3076602 3144306 3000589 3164479 2648262 2720177 2522967
13968B522967k81979K06787O4512p4305j39626J41012O538J26606l88137Q5631
$$ 2522967 2240988 2447775 2512287 2437982 2298356 2439368 2445906 2572512 2184375 2270006
13958B270006J72989l79560K03801m9006j59588K64055q5406m01688N25711J8834
$$ 2270006 2442995 2063435 2267236 2218230 2058642 2322697 2237291 1835603 2361314 2380148
13948B380148l77344K18891l06777J74365K61324J33600m93026p8687J45199l41236
$$ 2380148 2002804 2221695 1914918 2089283 2350607 2484207 1991181 1912494 2057693 1716457
13938A716457N20305j67957K64527k44496m93444K63458P1045k14987q6845O460
$$ 1716457 2236762 2068805 2333332 2088836 1595392 1858850 1929895 1714908 1628063 1634523
13928A634523K04323l24440J75379L9319K21692k66553J39140j52250j57658N1297
$$ 1634523 1838846 1514406 1689785 1729104 1950796 1684243 1823383 1671133 1513475 1564772
13918A564772j27470M7219J90409k89143K88202l4360J98173m49216N07815m55308
$$ 1564772 1437302 1484521 1674930 1385787 1673989 1639629 1837802 1388586 1896401 1441093
13908A441093r9832J5229M46533m13243J08514p6613J65329l49622L41000P5782
$$ 1441093 1341261 1356490 1803023 1389780 1498294 1421681 1587010 1237388 1578388 1654170
13898A654170n92966O45535m7383k6790k31820J18727k32144J10282J03031j23274
$$ 1654170 1061204 1706739 1659356 1632566 1400746 1519473 1287329 1397611 1500642 1377368
13888A377368K63170k34701M3656o1493l0478M26J45385P4030m61938K22630k41389
$$ 1377368 1640538 1405837 1449493 1388000 1357522 1357948 1503333 1577363 1115425 1338055 1096666
13877A096666j6509L68939k70334J81394J86442n8877k05105P6440J49725j58478
$$ 1096666 1080157 1449096 1178762 1360156 1546598 1487721 1282616 1359056 1508781 1350303
13867A350303P5680r9216m00401N47558j50127q5736j12920j99618M33083k11253
$$ 1350303 1425983 1326767 926366 1473924 1323797 1238061 1125141 925523 1358606 1147353
13857A147353J85038M0189l71403K20998j74206L36423J94506m56877j29958K17548
$$ 1147353 1332391 1372580 1001177 1222175 1047969 1384392 1578898 1122021 992063 1209611
13847A209611r4702P7570m94746L07836n1362K02448j81302j38664L95427l45952
$$ 1209611 1114909 1192479 697733 1005569 954207 1156655 975353 836689 1232116 886164
13837H86164M01893k14153J15648j81440K85587Q5152o29031M8006J13061L2722
$$ 886164 1288057 1073904 1189552 1008112 1293699 1378851 749820 797826 910887 943609
13827I43609K19292k90389L34885R2552n61998L75482J095l81264j49349M83884
$$ 943609 1162901 872512 1207397 1299949 737951 1113433 1114528 733264 583915 1067799
13817A067799j96517K4241K21108j12478L6110l15633J78654j1238k60998K45909
$$ 1067799 871282 895523 1116631 1004153 1040263 724630 903284 892046 631048 876957
13807H76957J06563N5495O8890j70868L9176L33977n56995P6754j84659J00008
$$ 876957 983520 1039015 1107905 937037 976213 1310190 753195 829949 645290 745298
13797G45298K1875L51960q7502l30485J52185m275l69067M68967l31359K68135
$$ 745298 767173 1119133 1031631 701146 853331 849056 479989 948956 617597 885732
13787H85732m8416k78239J88419L30379l11510l53028J10354K35075n1367j22024
$$ 885732 837316 559077 747496 1077875 766365 413337 523691 758766 707399 585375
13777E85375M40180l65245L7058j53674N32609k57511l13423K6342J51714j80021
$$ 585375 1025555 660310 697368 543694 1076303 818792 505369 531711 683425 503404
13767E03404P2571J99867k6563j70782M5582J14425J085K23449k15442L5231j36379
$$ 503404 575975 775842 749279 578497 624079 738504 739589 963038 747596 782827 646448
13756F46448k0981m423o0802n8531J65519K03550j93492j39368P2058B89880R2226
$$ 646448 625467 621044 560242 501711 667230 870780 677288 537920 609978 289880 382106
13745C82106J01450N62119k55798Q8022p5791j97571B43113L84615k68827L72222
$$ 382106 483556 1045675 789877 877899 802108 604537 243113 627728 358901 731123
13735G31123j40620J48996J4191j98819J50572J15261l06124K37385k09268J04884
$$ 731123 590503 739499 753690 554871 705443 820704 514580 751965 542697 647581
13725F47581j34589K74656o1914k47384K54615k96340k0303K42933q0992p2534
$$ 647581 512992 787648 725734 478350 732965 436625 416322 659255 578263 505729
13715E05729N4135A85666M39664k61803J75976B64861P18624l12549M6681J49314
$$ 505729 559864 185666 625330 363527 539503 264861 983485 670936 717617 866931
13705H66931B92652N72522l99752K66604j89871j29947m8870L28992C31991L22250
$$ 866931 292652 865174 465422 732026 542155 412208 363338 692330 331991 654241
13695F54241j84766J01938L4112p5942l6053J68031q5243K9335m2314q7841q1051
$$ 654241 469475 571413 605525 529583 493530 661561 576318 605653 563339 475498 394447
13684C94447K07810j57566K41464l15432L18597O0540j27393k94787Q1806R2931
$$ 394447 602257 444691 686155 370723 689320 749860 622467 327680 409486 502417
13674E02417k33947M34643l23688p2060M62749j81938B73374O47717l67716j97980
$$ 502417 268470 703113 379425 307365 770114 588176 273374 921091 553375 355395
13664C55395J27230A68432L8336M13259K48333B98200J05219J37260n8149j63815
$$ 355395 482625 168432 206768 620027 868360 298200 403419 540679 482530 318715
13654C18715J90176O9165j54530J43285J4582j92617J87571L24771m32142j338
$$ 318715 508891 578056 423526 566811 581393 388776 576347 901118 468976 467638
13644D67638k2915p939k1914J67755j78483L82734l87444j25150L35173A94264
$$ 467638 444723 436784 414870 582625 404142 786876 399432 274282 609455 194264
13633C61745M3538A67633K86852k16394K02677K76447j76882k28944J17351J30036
$$ 361745 405283 167633 454485 238091 440768 717215 540333 311389 428740 558776
13623E58776j39545m9386K19045b6809E80873j05618n8130j63741J66675j78324
$$ 558776 419231 369845 588890 -26809 580873 475255 417125 253384 420059 241735
13613B41735K86358A66961M50978j74740j40503K71988A76811L98014D5779O24924
$$ 241735 528093 166961 617939 443199 302696 574684 176811 574825 45779 670703
13603F70703h2150D22113j3367R4472o7510K17280k95263k2227L3195L29487j87863
$$ 670703 -82150 422113 408746 503218 435708 652988 357725 335498 368693 698180 510317
13592E10317j33768m4960R4987m1885j1473N8762A51413m7743L15956j17789j43644
$$ 510317 376549 331589 426576 384691 373218 431980 151413 103670 419626 301837 158193
13581A58193L83211j64559L23485k92621n696j80777K85001j19807L6791j53868
$$ 158193 541404 376845 700330 407709 402013 221236 506237 386430 423221 269353
13571B69353L62652A21176L09632b6638B25537J43158m3424p0439O4911P5475
$$ 269353 632005 121176 430808 -26638 225537 368695 325271 254832 319743 395218
13561C95218R027q3310q2716K25998B02694K13968q2077H3752L15238r2316j52914
$$ 395218 404245 320935 238219 464217 202694 416662 334585 83752 398990 306674 153760
13550A53760o1724M37063J5046j85239J17606j77476q7615J59787K1673g2256
$$ 153760 92036 529099 544145 358906 476512 299036 211421 371208 392881 -72256
13539D00595o1318o7402M49808B58378J2674O7400M7177j74859N3850P7325K28149
$$ 400595 339277 271875 721683 258378 271052 338452 385629 210770 264620 341945 570094
13528E70094j80494j68916J59964K38941A29887K95053J65385G4771L05929J38400
$$ 570094 389600 220684 380648 619589 129887 424940 590325 74771 380700 519100
13518E19100a55811E14272k27143j4620K9679J0212A27608J13448q7999O1509
$$ 519100 -155811 514272 287129 272509 302188 312400 127608 241056 153057 214566
13508B14566L30321j41765F6565K37936K85121B40963J39553m8732J26073D3738
$$ 214566 544887 403122 66565 304501 589622 240963 380516 331784 457857 43738
13497B40530a5538A13051K18012j62234j9624J00100R3472j31784a9171A63506
$$ 240530 -15538 113051 331063 168829 149205 249305 342777 210993 -19171 163506
13486A66073a65356B07786E4261j7572N0511J85937O982D4785J33303K00680j68680
$$ 166073 -165356 207786 54261 36689 87200 273137 280119 44785 178088 378768 210088
13475B10088R5732l9490J34476j89420o1956J32726A28667J73115m8919J34712
$$ 210088 305820 266330 400806 211386 149430 282156 128667 301782 252863 387575
13465C87575A88589J80431e6552F9612G515K42351C8691L05400J45598j14810
$$ 387575 188589 369020 -56552 69612 7515 249866 38691 344091 489689 374879
13455C74879H6124c19797G38979B53109j19650J10704q3738l0930h3525B43033
$$ 374879 86124 -319797 738979 253109 133459 244163 160425 129495 -83525 243033
13444B74438K0822J36271A49976J5992M0322L06930o9158l2241A28933J32508
$$ 274438 295260 431531 149976 165968 206290 513220 444062 411821 128933 261441
13434B61441J80827A2168J46814J62206B0316J8666a3869j506A00441K7530J7794
$$ 261441 442268 12168 158982 321188 20316 38982 -13869 -15375 100441 127971 145765
13423A45765J22313r2440M0036L1085a72973p772F7774P4541i470A79734k267
$$ 145765 268078 175638 215674 246759 -172973 -180745 67774 142315 -9470 179734 177467
13412A77467L6052N959L0252J53426q7290l3155A14200L32384A51443j0081j3407
$$ 177467 213519 219478 249730 403156 315866 282711 114200 446584 151443 141362 127955
13401A27955l6197e1579D39772j28037G5713M0975m5374h0159B46741J31384j30243
$$ 127955 91758 -51579 439772 311735 75713 116688 71314 -80159 246741 378125 247882
13390B47882J50581D7756P8024J69649I4974A0656L54369A72461N1832g6881B65181
$$ 247882 398463 47756 125780 295429 94974 10656 365025 172461 224293 -76881 265181
13378a46079F3415K73321C6076K90977A61367J7629J33950l8918N8355o001H3501
$$ -146079 63415 336736 36076 327053 161367 178996 312946 274028 332383 326382 83501
13366C34294O6855j37136N7331o8955G4368J89310n9877l7591L1091C9071K9620
$$ 334294 401149 264013 321344 252389 74368 263678 203801 166210 197301 39071 68691
13355F8691B9410L71686J0054k7521A12185a64741b1443B61406K14376A33358
$$ 68691 29410 401096 411150 383629 112185 -164741 -21443 261406 475782 133358
13344C13443l3564M7268J74734j43680j1044j8827q4106q1467J02761K99918H8763
$$ 313443 279879 327147 501881 358201 347157 328330 244224 162757 265518 565436 88763
13332C67101g9090A08077J486M55185j82057H8358K35753p7698n2726R5325A02037
$$ 367101 -79090 108077 109563 564748 382691 88358 324111 246413 193687 289012 102037
13320D57715q4974A69127K78799A48031J86810C3153N58645B17210q955R7872
$$ 457715 372741 169127 447926 148031 334841 33153 591798 217210 208255 306127
13310C06127j45590D686K56257r0987J04434H0269l5438J46417J34609R1790O0700
$$ 306127 160537 4686 260943 169956 274390 80269 44831 191248 325857 417647 478347
13299D78347I4203L2592O5924J54255Q804a49305A40922F145J48864M1670g6318
$$ 478347 94203 126795 192719 346974 355778 -149305 140922 6145 155009 196679 -76318
13287B3713Q6440J55518p7644c55172A45301A3133c0675H9999J46147h3331E3216
$$ 23713 110153 265671 188027 -355172 145301 13133 -30675 89999 236146 -83331 53216
13275f2909E7884I758J06715f842B36308q1053J32558h3771A76055J86581A1040
$$ -62909 57884 9758 116473 -6842 236308 155255 287813 -83771 176055 362636 11040
13263d9435A86843J67908A155J39544K97416a5947B17938J00620J50520B25744
$$ -49435 186843 354751 1155 140699 438115 -15947 217938 318558 469078 225744
13252B03724l2274D6773L09754A17534a09193C67181q1694d55j38659I660K19316
$$ 203724 171450 46773 356527 117534 -109193 367181 285487 -455 -139114 9660 228976
13241B28976j00570J89336A3765J13612a13108C04603g7957D852J82215J69714
$$ 228976 128406 317742 13765 127377 -113108 304603 -77957 4852 187067 356781
13231C56781r7050j09371L15922j90309j30100J3794R4177N9028J33933C5006
$$ 356781 259731 150360 466282 275973 145873 159667 253844 312872 446805 35006
13220A07675m5612J66105j01836K01631b08188F3778R4499g7362B08608o7297
$$ 107675 62063 228168 126332 327963 -208188 63778 158277 -77362 208608 141311
13210A41311e0783H9115k4539R8877e6492A70106k0529a14305C28268g7959A94434
$$ 141311 -50783 89115 64576 163453 -56492 170106 149577 -114305 328268 -77959 194434
13198b7548A87607h1654D6603J13918J2374J46666j21817k7465f0209F6871J09782
$$ -27548 187607 -81654 46603 160521 172895 319561 197744 170279 -60209 66871 176653
13187A76653c8041A41463B4165b04697B21029A06585O1527k9322J31327F6800
$$ 176653 -38041 141463 24165 -204697 221029 106585 168112 138790 270117 66800
13176B99K94299J48678B08654j355r8968a91861e7271C75776r8717K4022f6416
$$ 299 294598 443276 208654 207299 108331 -191861 -57271 375776 277059 301081 -66416
13164b69891B37222A4819K40511C7051J624K12166k28b00966E3405J50911g1108
$$ -269891 237222 14819 255330 37051 38675 250841 250613 -200966 53405 204316 -71108
13152B62954E9832M0665f4246j182a4251A1915J01912a11836B38088N7725g5821
$$ 262954 59832 100497 -64246 -65428 -14251 11915 113827 -111836 238088 295813 -75821
13140A39014L98265b30526d2284B60948F7144b38552f5954o9956C57672A75314
$$ 139014 537279 -230526 -42284 260948 67144 -238552 -65954 -135910 357672 175314
13129F9695L10299d9232l36613a19295N0650B34245j06673B2139g1468B02655
$$ 69695 379994 -49232 -385845 -119295 -68645 234245 127572 22139 -71468 202655
13118b71934P4012G1853N1247L402a09420B11678H0186N6498a23438I6665B6493
$$ -271934 -197922 71853 123100 126502 -109420 211678 80186 136684 -123438 96665 26493
13106b79721C33896j26402p3566f0083j14891B71657o0576r6060J02496n3097
$$ -279721 333896 207494 133928 -60083 -174974 271657 211081 115021 217517 164420
13096A64420R301p9134J0940b61252A28316c5298G6823d11311A53430J37264a57770
$$ 164420 173721 94587 105527 -261252 128316 -35298 76823 -411311 153430 290694 -157770
13084A09273a19162N3406B13261A02116k1630J95954D1911L15090A37427J55025
$$ 109273 -119162 -65756 213261 102116 80486 276440 41911 357001 137427 292452
13074B92452a7996H660a29976B6806R9765J11926o2873q7383Q1891d0869A39708
$$ 292452 -17996 8660 -129976 26806 126571 238497 175624 88241 170132 -40869 139708
13062A78391h0022B66707J63984j16337b52542A35953a82384m732J3531A64455
$$ 178391 -80022 266707 430691 314354 -252542 135953 -182384 -187116 -173585 164455
13051B63691d9597A83622C260N8588Q2229h8794F0652J69330g186E61823I4872
$$ 263691 -49597 183622 3260 61848 144077 -88794 60652 229982 -7186 561823 94872
13039a95918F4646K23385a98570H2599A4690e9028p1638A57832J0193I921K63286
$$ -195918 64646 288031 -198570 82599 14690 -59028 -130666 157832 168025 9921 273207
13028B73207A09913c12994C2352J51799m2897K14734j22472c3635A19898c3131
$$ 273207 109913 -312994 32352 184151 141254 355988 233516 -33635 119898 -33131
13017a37927A58805K68251j09649e5387B19430L0737i2198G2065h8642E8224J54087
$$ -137927 158805 427056 317407 -55387 219430 250167 -92198 72065 -88642 58224 212311
13006B12311j04781R7372j00119K69449a96476A13257J3769J72017a8148D4497
$$ 212311 107530 204902 104783 374232 -196476 113257 127026 299043 -18148 44497
12995a37177O6332p9669B9204c00692A9658J71488f3317A278J8097a31918c7329
$$ -137177 -70845 -150514 29204 -300692 19658 191146 -63317 1278 19375 -131918 -37329
12983B35851d7006f352B33728C2316a46582C01621E4276j7874b1280I2035m5147
$$ 235851 -47006 -6352 233728 32316 -146582 301621 54276 36402 -21280 92035 46888
12972D6888a11579A07273M60050F4596K32718a0404A69305b10980C98290D5695
$$ 46888 -111579 107273 567323 64596 297314 -10404 169305 -210980 398290 45695
12961B37728r7037D7079K25251a9755A16535R9195j06270a23630C48003I5427
$$ 237728 140691 47079 272330 -19755 116535 215730 109460 -123630 348003 95427
12950e5740m6738k65622b2777C24795d8827B47268A12624R6014A8752Q8476a01709
$$ -55740 -102478 -368100 -22777 324795 -48827 247268 112624 208638 18752 107228 -101709
12938i4518G2377L0530Q3191C6515a60285C18179p7300K90920j03352j87788E7453
$$ -94518 72377 102907 186098 36515 -160285 318179 240879 531799 428447 240659 57453
12926A95736g0228O910A71797c2336H992a58390j4984c6592H7598J0687a8997
$$ 195736 -70228 -63318 171797 -32336 8992 -158390 -173374 -36592 87598 98285 -18997
12914h489B30529a02082H7211J12226q6754l5610i0034a5463A98483I2114O5603
$$ -8489 230529 -102082 87211 199437 112683 77073 -90034 -15463 198483 92114 157717
12903A57717J9791B3201a60381A3254P5919a32796E3854M6599e7925A51494R9754
$$ 157717 177508 23201 -160381 13254 89173 -132796 53854 100453 -57925 151494 251248
12892B51248k3146e4778l4322a3447k2702B49810H244c2008D3201i5969A42529
$$ 251248 228102 -54778 -89100 -13447 -36149 249810 8244 -32008 43201 -95969 142529
12880A6667a58872D4451a72151g3554q8927p1421B70061a8603A96862G3895O9577
$$ 16667 -158872 44451 -172151 -73554 -162481 -233902 270061 -18603 196862 73895 143472
12869A43472g7601A23453a27190D8795J57283C5278K88484a87501Q1877A26142
$$ 143472 -77601 123453 -127190 48795 206078 35278 323762 -187501 -105624 126142
12858g2198A37553P1352a51070l6613j8271K9364GK82068q773G6777J18744K6131
$$ -72198 137553 208905 -151070 -187683 -205954 -176590 7 282075 273302 76777 195521 221652
12846B21652N1373q761a32204E3670J01085Q2904M7066A36968d913I7049F752
$$ 221652 273025 264264 -132204 53670 154755 237659 284725 136968 -4913 97049 6752
12834h8326j60682a4381m6987G9366b22749Q6293A29390a2004p589C05808a32575
$$ -88326 -249008 -14381 -61368 79366 -222749 -136456 129390 -12004 -19593 305808 -132575
12822b08178M2516j6923B999f5768l3349I0856K7336e76646B39186e6804H7104
$$ -208178 -165662 -182585 2999 -65768 -99117 90856 118192 -576646 239186 -56804 87104
12810D1540a0484k6603k21788g0763G4635Q4851a52473H2320P6214b86168E3417
$$ 41540 -10484 -37087 -258875 -70763 74635 159486 -152473 82320 158534 -286168 53417
12798A29352m0233K15117p0648p8920L3453m6912D4288e1334G7373M2886B7091
$$ 129352 89119 304236 233588 154668 188121 141209 44288 -51334 77373 120259 27091
12786A15758n19c30576a35787H1378L57335d4985p3102B05377B8918d9655A65273
$$ 115758 115239 -330576 -135787 81378 438713 -44985 -118087 205377 28918 -49655 165273
12774b29967n2652A23618J02923d5973B1023J69750n1103B6501c74873J63234
$$ -229967 -282619 123618 226541 -45973 21023 190773 139670 26501 -374873 -211639
12764b11639F1394J09077J27807e6246B08343a63818D6366a22625r4471B69459
$$ -211639 61394 170471 298278 -56246 208343 -163818 46366 -122625 -217096 269459
12753f8495I6792b22766b2544k03747e3105F6663a3461A0666N1548b2868A45973
$$ -68495 96792 -222766 -22544 -226291 -53105 66663 -13461 10666 62214 -22868 145973
12741A75316B0546b1680B01034L7674K190J97416C2402J85230d5445I236d2240
$$ 175316 20546 -21680 201034 238708 240898 438314 32402 217632 -45445 9236 -42240
12729C0536O8647p236a06409A00245e2494A44317a4186A22361l7655L2133Q8792
$$ 30536 99183 91947 -106409 100245 -52494 144317 -14186 122361 84706 116839 205631
12718B05631M2175F0722B8026J03028F959R5278d10461H88Q3976c0541A96902
$$ 205631 247806 60722 28026 131054 6959 102237 -410461 888 84864 -30541 196902
12706A03305K86083j83777L2271L2025j01841K81028j23081D7080K05295r9163
$$ 103305 389388 205611 237882 269907 168066 449094 326013 47080 252375 153212
12696A53212l7824J28434i523E1826a64080B10777b28475d7476j49646c060A36729
$$ 153212 115388 243822 -9523 51826 -164080 210777 -228475 -47476 -197122 -3060 136729
12684a38622C31338H7357j7811d090C70181j25732L4447j25537L4918m9563m2766
$$ -138622 331338 87357 69546 -4090 370181 244449 278896 153359 188277 138714 95948
12673I5948K8206N958C9458J47986B6721b48723H1281g8341C89783A81999i5520
$$ 95948 124154 130112 39458 187444 26721 -248723 81281 -78341 389783 181999 -95520
12661I1003m1927e8313k96578p7014A33947J53780H8616J89558i2090B67569o0382
$$ 91003 49076 -58313 -354891 -431905 133947 287727 88616 278174 -92090 267569 207187
12650B07187K40166a67943H0928J02286f3216F1728i3547A42368d0885j70743
$$ 207187 447353 -167943 80928 183214 -63216 61728 -93547 142368 -40885 -211628
12640b11628D4667g6061A82614K1979p7699C8583b0790j06485B96972I3551N59995
$$ -211628 44667 -76061 182614 204593 126894 38583 -20790 -127275 296972 93551 653546
12629F53546l06267j45656R9030C0323J00823l6283K77582f0392p3409D07635
$$ 653546 347279 201623 300653 30323 131146 94863 372445 -60392 -133801 407635
12618A29296c2955J1574A71464p8065j6646a75622D09929a21669l7667N2056c1220
$$ 129296 -32955 -21381 171464 93399 76753 -175622 409929 -121669 -159336 -107280 -31220
12606A74607J17539A33665O0151C4201b9846j46321E1481K62113i6963a4753j02307
$$ 174607 292146 133665 193816 34201 -29846 -176167 51481 313594 -96963 -14753 -117060
12595a17060k02789A2757J02323a18692K8653D3967a03170A68199b22589P8587
$$ -117060 -319849 12757 115080 -118692 -90039 43967 -103170 168199 -222589 -144002
12585a44002B4988J12474E7068J91029p8440b52177A05735i2170A1075b905D139
$$ -144002 24988 137462 57068 248097 169657 -252177 105735 -92170 11075 -2905 4139
12573F9250a94362b5595A77912h4901A84208J8771a45718L5771B05095r4788J18300
$$ 69250 -194362 -25595 177912 -84901 184208 202979 -145718 -109947 205095 110307 228607
12562B28607H2621b4318A56485f6277A22767b17618i8261D13692A74741a69468
$$ 228607 82621 -24318 156485 -66277 122767 -217618 -98261 413692 174741 -169468
12551h5878A81885Q0238D0240R83j0206L37377e3749R584B72295g7799C00677
$$ -85878 181885 262123 40240 41223 31017 368394 -53749 -44165 272295 -77799 300677
12539a72367A270J27571J91330A9472b1540j21551B56138A03849a2029A65856
$$ -172367 1270 128841 320171 19472 -21540 -143091 256138 103849 -12029 165856
12528A26926e4807B46902a90521B5891a50200I9942K11826F3024J83477c9955
$$ 126926 -54807 246902 -190521 25891 -150200 99942 311768 63024 246501 -39955
12517F784P4285f0723B51839j21182C4544J42786B0369J78688c08877A02904P745
$$ 6784 81069 -60723 251839 130657 34544 177330 20369 199057 -308877 102904 110649
12506A10649a33609l9198P088A05905h6331B4812M4842R3196E9464d5191p1931
$$ 110649 -133609 -172807 -165719 105905 -86331 24812 69654 162850 59464 -45191 -117122
12495a17122j75344H3092O4685O6529b29314B52850K8026k3313a37900B110L7294
$$ -117122 -292466 83092 147777 214306 -229314 252850 280876 257563 -137900 2110 39404
12484C9404J17262D3168b67268A97297q3004b93573D1915b59309A18183R522N2481
$$ 39404 156666 43168 -267268 197297 114293 -293573 41915 -259309 118183 127705 180186
12473A80186a83108A07088a74410O7942j4469D71520E0986a89841A0998J13821
$$ 180186 -183108 107088 -174410 -106468 -120937 471520 50986 -189841 10998 124819
12463A24819J67794k3011h1058n0566N7828C16677j46911R7411a21138M8931B6262
$$ 124819 292613 269602 -81058 -131624 -73796 316677 169766 267177 -121138 -72207 26262
12451A42628a59946I1280J51570j13678R1943a7742H8052j1689J27486a9045F287
$$ 142628 -159946 91280 242850 129172 221115 -17742 88052 76363 203849 -19045 6287
12439A19154c51353I9780Q096M3962b1154j02358A85867G399d6046k2256n8654
$$ 119154 -351353 99780 107876 151838 -21154 -123512 185867 7399 -46046 -68302 -126956
12428a26956H0097d5420C9150J70421p4330b6780f479A46593P2607b0078l52956
$$ -126956 80097 -45420 39150 209571 135241 -26780 -6479 146593 219200 -20078 -373034
12417c73034A58482N5016d2756R80j50821A70571M2989c38136k67765G7589h0707
$$ -373034 158482 213498 -42756 -41776 -192597 170571 213560 -338136 -605901 77589 -80707
12405a22134A52084B8864a22124A07323K99452a87786M2729r1751j20001D6368
$$ -122134 152084 28864 -122124 107323 406775 -187786 -145057 -236808 -356809 46368
12394B73573C351c5461A35399l3638a43385G009c03265C09465A23426k9055a16382
$$ 273573 3351 -35461 135399 101761 -143385 7009 -303265 309465 123426 94371 -116382
12382B08402q6423E1379c8421n8418j3836H989a22724A7362a18059G775a73378
$$ 208402 121979 51379 -38421 -96839 -110675 8989 -122724 17362 -118059 7775 -173378
12370b3978E3679A0044J03430J55670A19495e0812o2375G9648j4071e08282D5205
$$ -23978 53679 10044 113474 269144 119495 -50812 -113187 79648 65577 -508282 45205
12358a5714A14388i4807I1710J01707E3696Q3301b62934N9696E9913d6682i393
$$ -15714 114388 -94807 91710 193417 53696 136997 -262934 -203238 59913 -46682 -9393
12346A74824a17522m0266M3445A57276c1770A02869J64668a6579j59366A21688
$$ 174824 -117522 -157788 -114343 157276 -31770 102869 267537 -16579 -175945 121688
12335a63927A98777C3023O7933O153a2821A2921R2179J00551K03151a69972E7520
$$ -163927 198777 33023 100956 107109 -12821 12921 105100 205651 408802 -169972 57520
12323F6429c10484g770C19697a16812r7150E4805H583L01913F8658A3623J6129
$$ 66429 -310484 -7770 319697 -116812 -213962 54805 8583 310496 68658 13623 29752
12312B9752J27460a18756m7794N8801F9561a19536j26012B45013B0437O5012C8710
$$ 29752 157212 -118756 -166550 -107749 69561 -119536 -245548 245013 20437 85449 38710
12300A01472a04777c9977p7125l9469j17854N9337B1496a62425A37284N2869h1374
$$ 101472 -104777 -39977 -117102 -156571 -274425 -215088 21496 -162425 137284 190153 -81374
12288A22993a04256F8307J80903j13979e2620A31369n279J5497f302A28298C8190
$$ 122993 -104256 68307 249210 135231 -52620 131369 126090 141587 -6302 128298 38190
12276A52562a4708C02254B6075M05523j84880a75940F3600j7978L67679j99757
$$ 152562 -14708 302254 26075 431598 246718 -175940 63600 45622 413301 213544
12266B13544j8556C9206J25542a97672A71649G8729p579c12975A59867E8468J73842
$$ 213544 194988 39206 164748 -197672 171649 78729 71150 -312975 159867 58468 232310
12255B32310G1264Q055J8214L9129c03343A23886R8766E9041K68321A45677a67572
$$ 232310 71264 79319 97533 136662 -303343 123886 222652 59041 327362 145677 -167572
12243h4858F41470k34582A17737o808L1272b5659A15077h1098j100D71244A10873
$$ -84858 641470 406888 117737 110929 142201 -25659 115077 -81098 -82198 471244 110873
12231A80241m6153o6831P3095K2647K13132K3017r4384A33172J61543A23950K81237
$$ 180241 134088 67257 140352 162999 376131 399148 304764 133172 294715 123950 405187
12220D05187j66152R8624L24773B21559L5921j7713e3389B03990a08872E8283
$$ 405187 239035 337659 662432 221559 257480 239767 -53389 203990 -108872 58283
12209C44605r5435A15613J43644a60547D18324A84119E3370i290G6222M57414
$$ 344605 249170 115613 259257 -160547 418324 184119 53370 -9290 76222 533636
12199E33636B29804a50672B318K32940N3386r5615P1684A19261b0776A99961b5710
$$ 533636 229804 -150672 2318 235258 288644 193029 264713 119261 -20776 199961 -25710
12187a09645C0435L14265b18106A30836M9697R3742o3698J41018N4058d6103B2089
$$ -109645 30435 344700 -218106 130836 180533 274275 210577 351595 405653 -46103 22089
12175A06768K67661K26357A04534f5839A13764j6598L01990A5484K44266A6817
$$ 106768 374429 600786 104534 -65839 113764 97166 399156 15484 259750 16817
12164H5126A4723K87502c24231a35560A89186J41433r5624C282a04343k336d0101
$$ 85126 14723 302225 -324231 -135560 189186 330619 234995 3282 -104343 -106679 -40101
12152F0359A9941R3037J11309J13554j02042G8497J08890a89494F1316B5920N6308
$$ 60359 19941 112978 224287 337841 235799 78497 187387 -189494 61316 25920 82228
12141H2228K21499l1033m8837a80915d7655D09500A75811h2375H5994L1716l7594
$$ 82228 303727 272694 223857 -180915 -47655 409500 175811 -82375 85994 117710 80116
12130H0116f8969A91859m7940K4337a17425B20338a36500B25713J36343a74578
$$ 80116 -68969 191859 143919 168256 -117425 220338 -136500 225713 362056 -174578
12119a35271J649a4102D2996g2749b0580j66264b2403A1041J48999g571B50895
$$ -135271 -133622 -14102 42996 -72749 -20580 -186844 -22403 11041 160040 -7571 250895
12107B51260g4988C0394c638j7076k10181M7409a2219k81234C4353i5728C9924
$$ 251260 -74988 30394 -3638 -20714 -230895 -183486 -12219 -293453 34353 -95728 39924
12095C37283i6884A18052c11281E7166Q956K4457B4987b07290k748B25547J0932
$$ 337283 -96884 118052 -311281 57166 66122 90579 24987 -207290 -210038 225547 236479
12084B36479F6478J0019a1124j74620K0925A56575B1976J42855c44367g6245b6537
$$ 236479 66478 76497 -11124 -185744 -164819 156575 21976 164831 -344367 -76245 -26537
12072A15481K2252F0735A9753e8828j76169G4336C6690L62566K53521R10869L16526
$$ 115481 137733 60735 19753 -58828 -234997 74336 36690 399256 652777 1563646 1880172
12061A880172G43728C22885G0767N5918a1488B17347k3952i0755k7660B2256N3768
$$ 1880172 743728 322885 70767 126685 -11488 217347 193395 -90755 -118415 22256 76024
12050G6024f747j36392N7146r1760e2731B3352b38129n810A28162g7384B9385
$$ 76024 -6747 -143139 -85993 -177753 -52731 23352 -238129 -243939 128162 -77384 29385
12038d09466c8611C2102a05059B84064d6611C55981f0905A19142e4101B18294
$$ -409466 -38611 32102 -105059 284064 -46611 355981 -60905 119142 -54101 218294
12027c62415j91023a95778j7110A62659K2006b42997b9062e282j04253A14517
$$ -362415 -553438 -195778 -212888 162659 184665 -242997 -29062 -5282 -109535 114517
12016a34564A21915B5785P282J26623J4293K00579a63176G844J49370c28543A78624
$$ -134564 121915 25785 33067 159690 173983 374562 -163176 7844 157214 -328543 178624
12004f8859B55006B0686N9145R418b39973B40058b43639a9206A00267d2216l0202
$$ -68859 255006 20686 79831 89249 -239973 240058 -243639 -19206 100267 -42216 -72418
11993g2418K4633A25963J42635I316J40240c8439j80922B2925b3177A25303b35815
$$ -72418 -47785 125963 268598 9316 149556 -38439 -219361 22925 -23177 125303 -235815
11981a8005k18108B1024b632D9260b0990A27997e1362H1263c23205D4744N4014
$$ -18005 -236113 21024 -2632 49260 -20990 127997 -51362 81263 -323205 44744 98758
11970I8758a02308r2078j24730h22j47071m391j19548B67490b36034j78016a09175
$$ 98758 -102308 -194386 -319116 -822 -147893 -152284 -271832 267490 -236034 -414050 -109175
11958e3024A58147o5014c24733b4018j00308b4690j69431c2046j66080A75043
$$ -53024 158147 93133 -324733 -24018 -124326 -24690 -194121 -32046 -198126 175043
11947C44638n58b8952l49817a21198p5245I5794b45195B40020f7430D8997q974
$$ 344638 344080 -28952 -378769 -121198 -196443 95794 -245195 240020 -67430 48997 40023
11936D0023K74355F0286P7146a60829H2579J68950b69982G8448b3319j00979m3215
$$ 40023 314378 60286 137432 -160829 82579 251529 -269982 78448 -23319 -124298 -167513
11925a67513k7372O6641n0716D8769b0671j32154a5482A47827f5518p162D8775
$$ -167513 -194885 -128244 -178960 48769 -20671 -152825 -15482 147827 -65518 -72680 48775
11913f128B14698a55652A14398b03362H2632Q3751P6672D4910a1068E2305J35646
$$ -6128 214698 -155652 114398 -203362 82632 166383 243055 44910 -11068 52305 187951
11902A87951a40850B84855K0956e0907j32726A22158C2310f5658j02716B3224
$$ 187951 -140850 284855 305811 -50907 -183633 122158 32310 -65658 -168374 23224
11891a7815F8804k8152b08007F0412L03269a6443A27671J54233E1000j4646j7085
$$ -17815 68804 40652 -208007 60412 363681 -16443 127671 281904 51000 36354 19269
11880A9269c68604N2518c9631A68026f4403A2896e1520m38753K10246A39157c7742
$$ 19269 -368604 -316086 -39631 168026 -64403 12896 -51520 -490273 -280027 139157 -37742
11868A82498e0816I8538O8444J68312a40791e6260A10734A1302k714e6031I1618
$$ 182498 -50816 98538 166982 335294 -140791 -56260 110734 11302 8588 -56031 91618
11856A24125d27944g9073k26507g3684C0083b51968C1325L090A2521d53371A39168
$$ 124125 -427944 -79073 -305580 -73684 30083 -251968 31325 34415 12521 -453371 139168
11844i9615L4053B2274a01154A46076a71962A4874K28787e26571d7310h06F6668
$$ -99615 -65562 22274 -101154 146076 -171962 14874 243661 -526571 -47310 -806 66668
11832C478e69200B03944P6495c0807a2613j07745J8157B55919b61189A72055h3871
$$ 3478 -569200 203944 280439 -30807 -12613 -120358 -102201 255919 -261189 172055 -83871
11820b69193H8521b27962A75347a06276B67335b9900j45690O8217g676A33421
$$ -269193 88521 -227962 175347 -106276 267335 -29900 -175590 -107373 -7676 133421
11809F3289b53266g8835r380A61760a78029j94838B00137g0003j34676b3747B54953
$$ 63289 -253266 -78835 -88215 161760 -178029 -372867 200137 -70003 -204679 -23747 254953
11797D2921b35578a5468C2885a96311g1734I4599f9416e085B32010o2343J17910
$$ 42921 -235578 -15468 32885 -196311 -71734 94599 -69416 -5085 232010 169667 287577
11786B87577c2109l1913m82405A30823a31286n3034B3810a97452A21859B2649
$$ 287577 -32109 -64022 -546427 130823 -131286 -184320 23810 -197452 121859 22649
11775G3688R1257B0234a2255A31130J12858d30131h3677A76479J39501B7338g4086
$$ 73688 164945 20234 -12255 131130 243988 -430131 -83677 176479 315980 27338 -74086
11763A61303b47068I1950B6683J3256M9136J43242C542i8394A10276b0814C8344
$$ 161303 -247068 91950 26683 39939 89075 232317 3542 -98394 110276 -20814 38344
11751B7095h8614b8105E8348Q9883b30710B23753K676a12229C07694a3946A23651
$$ 27095 -88614 -28105 58348 148231 -230710 223753 226429 -112229 307694 -13946 123651
11739a24671c452j52214A93410O2637H3278b57804A22278b31712A01054h0277
$$ -124671 -3452 -155666 193410 256047 83278 -257804 122278 -231712 101054 -80277
11728b25854G557J20900i2177A33751h5683B23622b1653C4316J12037f9046j9330
$$ -225854 7557 128457 -92177 133751 -85683 223622 -21653 34316 146353 -69046 -88376
11717h8376B74110h5005C12038A33445i4911F705J03660b43076a00847C7121a15599
$$ -88376 274110 -85005 312038 133445 -94911 6705 110365 -243076 -100847 37121 -115599
11705I5448d4509n3928C2687f7294D00600A90085b11945D7100c8727k2059C60936
$$ 95448 -44509 -98437 32687 -67294 400600 190085 -211945 47100 -38727 -60786 360936
11693a76319A73616e6798b5589A59922J72438I340a43699N8684B08224J5846J3293
$$ -176319 173616 -56798 -25589 159922 332360 9340 -143699 -85015 208224 224070 237363
11682B37363O648e5307A17383a30932L3759B27551b78087k7170A09186J10904
$$ 237363 244011 -55307 117383 -130932 -97173 227551 -278087 -305257 109186 220090
11672B20090h0428B32266B7788b38619I5697K48741j69375e7320A31926a81835
$$ 220090 -80428 232266 27788 -238619 95697 344438 175063 -57320 131926 -181835
11661F7039h4169A28457m8674e5215l2655j58390I1284M120e9327C82399A08865
$$ 67039 -84169 128457 79783 -55215 -87870 -246260 91284 95404 -59327 382399 108865
11649H6973c4909J578j40060I4902g3182A45580h0219A50149e6876G8926P8958
$$ 86973 -34909 -33331 -173391 94902 -73182 145580 -80219 150149 -56876 78926 157884
11638A57884Q6932p6814n4147C275R9558E0255f1130k4975G0716a72520h6175
$$ 157884 244816 168002 113855 3275 102833 50255 -61130 -86105 70716 -172520 -86175
11626B66885k2222j8075r1559J2880n9349a10763M2579B10579q7746a58020j88430
$$ 266885 244663 226588 135029 147909 88560 -110763 -68184 210579 122833 -158020 -346450
11615c46450J28625A04364h1329A15485E7232B2026K47494J84363A4764J10740
$$ -346450 -217825 104364 -81329 115485 57232 22026 269520 453883 14764 125504
11605A25504A9358b84878I4563b96120b8059B22421p1469a19481A21880e3743
$$ 125504 19358 -284878 94563 -296120 -28059 222421 150952 -119481 121880 -53743
11594I5818J256b13928n751B08447b9079m1563o5401A34385a75653a171A33643
$$ 95818 97074 -213928 -219679 208447 -29079 -70642 -136043 134385 -175653 -1171 133643
11582A99812e0911b1784A18884J12918a28126D5663J05153f8959E3790b13377
$$ 199812 -50911 -21784 118884 231802 -128126 45663 150816 -68959 53790 -213377
11571a11315L5977D7955K25997D1916Q4239k6148h9080A12315Q572l8316M21173
$$ -111315 -75338 47955 273952 41916 126155 100007 -89080 112315 120887 82571 503744
11560E03744F5563I17a62071G3292N1301a06392H5920a24524B29735d0719B13014
$$ 503744 65563 917 -162071 73292 124593 -106392 85920 -124524 229735 -40719 213014
11548a98702n5536P6276I4315K5577J69039b48217H9716C4104b7938C13638a05277
$$ -198702 -254238 -177962 94315 119892 288931 -248217 89716 34104 -27938 313638 -105277
11536B07994C4754L27917e8118I7607N0455D4849M0217K08818A42001h5029B9296
$$ 207994 34754 362671 -58118 97607 148062 44849 85066 293884 142001 -85029 29296
11524A11370n5255i066j18605j42483R9076E38412i1653D45481H7599b09472A46917
$$ 111370 56115 -9066 -127671 -270154 -171078 538412 -91653 445481 87599 -209472 146917
11512B07395G2660g1894B35596A10490L5423c01772A23103K80997G8576a3364
$$ 207395 72660 -71894 235596 110490 145913 -301772 123103 404100 78576 -13364
11501D45736A95591q9340J09644j9502l175J97482j47146m2959J56635b0990A80974
$$ 445736 195591 106251 215895 196393 193218 390700 243554 200595 357230 -20990 180974
11489E3241b7810j28468o6834e91A61791p7494g1716B09082a59734f8017H7196
$$ 53241 -27810 -156278 -223112 -591 161791 84297 -71716 209082 -159734 -68017 87196
11477A92781j8149b6501B35139J08716J58021j57239J49018j72142B9358L32183
$$ 192781 174632 -26501 235139 343855 501876 344637 493655 321513 29358 361541
11467C61541c3335C2119M4316J73937E2928C827M75018j31580a8036A14893J52122
$$ 361541 -33335 32119 76435 250372 52928 3827 478845 347265 -18036 114893 267015
11456B67015j18156e8459A23351K81545p4838k9345d7233r0363r0993B48330e0851
$$ 267015 148859 -58459 123351 404896 330058 300713 -47233 -137596 -228589 248330 -50851
11444G1747a09381B51966j08315O9150o3859J06859C1155J45483K87643I2583
$$ 71747 -109381 251966 143651 212801 148942 255801 31155 176638 464281 92583
11433a63357B09352f4065D15121k03651f1313C9551j1214a89701B29166p8252
$$ -163357 209352 -64065 415121 211470 -61313 39551 28337 -189701 229166 150914
11423A50914A3160J93383J00485J07733o4564a24388j4647A90813B0845M0036
$$ 150914 13160 206543 307028 414761 350197 -124388 -139035 190813 20845 60881
11413F0881R7346P1416o1384c7544I2342Q0584m3563A0959f3551r0294O1992A8635
$$ 60881 158227 229643 168259 -37544 92342 172926 129363 10959 -63551 -153845 -91853 18635
11400A06515j6129h5392n2317D877N18725f0339m7100j14371m0538c4243j29099
$$ 106515 90386 -85392 -137709 4877 523602 -60339 -107439 -221810 -262348 -34243 -163342
11389a63342D4562a53641A67464G3646k3882a92411a7726k6889j4982j61095H1825
$$ -163342 44562 -153641 167464 73646 49764 -192411 -17726 -44615 -59597 -220692 81825
11377a57452b9263o8680A38107e135E4258J21399J01163C0100D191L3013a58659
$$ -157452 -29263 -97943 138107 -5135 54258 175657 276820 30100 4191 37204 -158659
11365A72353F4397b49796h3993A9531J10723Q982a4703A79287a71511r4275I5396
$$ 172353 64397 -249796 -83993 19531 130254 139236 -14703 179287 -171511 -265786 95396
11353b49526A91978c62747d3164A02213b3981A26625k8459a48467M1622H9639
$$ -249526 191978 -362747 -43164 102213 -23981 126625 98166 -148467 -106845 89639
11342b08825G4591L7485a14403J5622A84493n2367n7476a10558F1554a52633B4537
$$ -208825 74591 112076 -114403 -98781 184493 132126 74650 -110558 61554 -152633 24537
11330G5358B1421J40250a85828E8068b85215O1102J4097h407B42995C659J35197
$$ 75358 21421 161671 -185828 58068 -285215 -224113 -210016 -8407 242995 3659 138856
11319A38856m6927j0141a77378A11241a65734L8681c2687j16277f8425C8015a77653
$$ 138856 91929 81788 -177378 111241 -165734 -127053 -32687 -148964 -68425 38015 -177653
11307h1720j36753i5865H6259m2917b55239c8616k97383i0744B64216f7908J8588
$$ -81720 -218473 -95865 86259 43342 -255239 -38616 -335999 -90744 264216 -67908 -49320
11296d9320k60645E455a35292G9350e7243j10346q2855e6659k9376L3951A30578
$$ -49320 -309965 5455 -135292 79350 -57243 -167589 -250444 -56659 -86035 -52084 130578
11284B3310K79866A28509K20419c4932k22772l1508J15002C68067d247C9250a45964
$$ 23310 303176 128509 348928 -34932 -257704 -289212 -174210 368067 -4247 39250 -145964
11272f0474p7391C7406A3146P8951b00394A02351l3109a24801l2914D3478d0608
$$ -60474 -137865 37406 13146 92097 -200394 102351 69242 -124801 -157715 43478 -40608
11260C03685B0527J69861a21235j28158B05558j01437e2934C86965I2608J73270
$$ 303685 20527 190388 -121235 -249393 205558 104121 -52934 386965 92608 265878
11250B65878a52878d5686g991G1579i5246o2063k25420B58243L5210L7576g1348
$$ 265878 -152878 -45686 -7991 71579 -95246 -157309 -382729 258243 293453 331029 -71348
11238B81922h6542p12B01918E9768J36580b1787H040h2865q1156e9144k63197
$$ 281922 -86542 -87254 201918 59768 196348 -21787 8040 -82865 -164021 -59144 -322341
11227c22341A13718a34292A11640m8481j3387b51037b3286j00332L4589N147m25757
$$ -322341 113718 -134292 111640 63159 49772 -251037 -23286 -123618 -89029 -83882 -509639
11216e09639J32276E6478a56497A09465b29453B22932k7849J56344e0454B93380
$$ -509639 -377363 56478 -156497 109465 -229453 222932 195083 351427 -50454 293380
11205c8927j82117B75078a51425B5412b57464a8014B14359j05375D3131L24851
$$ -38927 -221044 275078 -151425 25412 -257464 -18014 214359 108984 43131 367982
11195C67982E4895a28028A81815k49j2056L9683F9869h5591B27681b54569A44601
$$ 367982 54895 -128028 181815 181566 169510 209193 69869 -85591 227681 -254569 144601
11183i810I8713a56777H1497N0034d4660k09355I4795C504g9237j40624i99k10465
$$ -9810 98713 -156777 81497 131531 -44660 -254015 94795 3504 -79237 -219861 -999 -211464
11171b11464A34249a05472j2176o8612q5206A05628j9594g7328j40275n0098a14355
$$ -211464 134249 -105472 -117648 -186260 -271466 105628 86034 -77328 -217603 -267701 -114355
11159a17242A94458a0571A40561L876b1011l5531a217n3815a1962j16948A93594
$$ -117242 194458 -10571 140561 144437 -21011 -56542 -1217 -55032 -11962 -128910 193594
11147B91463a84754o7486C31355h7355A9254Q3257R0076b02887c960A627L84332
$$ 291463 -184754 -252240 331355 -87355 19254 102511 192587 -202887 -3960 1627 385959
11136C85959h1007B05756N094e3828b6424A32737a89301A86554a69414E4446J45617
$$ 385959 -81007 205756 210850 -53828 -26424 132737 -189301 186554 -169414 54446 200063
11125B00063n9811B257c4044j8147F0234Q0294i4023j01548p7464P4399L8700
$$ 200063 140252 2257 -34044 -52191 60234 140528 -94023 -195571 -273035 -198636 -159936
11114a59936C3486e3518B68491H5563J75632I0016e7198D24817a96533I9041f6476
$$ -159936 33486 -53518 268491 85563 261195 90016 -57198 424817 -196533 99041 -66476
11102B87934r4533J028e6053B31616Q1655A11167K42341j39487R015o0516J44470
$$ 287934 193401 194429 -56053 231616 313271 111167 353508 214021 223036 162520 306990
11091C06990a24586B12924n8551M57353F5078K23968q722n7033A03299B379K73260
$$ 306990 -124586 212924 154373 611726 65078 289046 280324 223291 103299 2379 275639
11080B75639R144B4476L27638A31318K43021j14210J04432K03358I4746K09421
$$ 275639 284783 24476 352114 131318 374339 260129 364561 567919 94746 304167
11070C04167P2530K75400Q471k99808j26003m9940o9080J76924L78477j80802
$$ 304167 376697 652097 660568 360760 234757 184817 115737 292661 671138 490336
11060D90336j36735K21092n3629J02566O2671k68713M07421n5908J11730j87678
$$ 490336 353601 574693 521064 623630 686301 417588 825009 769101 880831 693153
11050F93153j24118J38391j24547K58852j19103J59930j21538J15685j89256N05744
$$ 693153 569035 707426 582879 841731 722628 882558 761020 876705 687449 1193193
11040A193193l76446j68327P1384L43327m34734M54950E40032K51049J80720j55666
$$ 1193193 816747 648420 719804 1063131 628397 1083347 540032 791081 971801 816135
11030H16135j45620l6873L6104L80382j23799J28113j16460m46082Q9397Q6569
$$ 816135 670515 633642 669746 1050128 926329 1054442 937982 491900 581297 667866
11020F67866j27030J67262J79034Q1951k81020K48874j28156k99069J61119N2942
$$ 667866 540836 708098 887132 969083 688063 936937 808781 509712 670831 723773
11010G23773k53018J16167L75827j27081j63993j25338R6016J11603q1983P3213
$$ 723773 470755 586922 962749 835668 671675 546337 642353 753956 671973 745186
11000G45186J94966o1938p786k60229n2510M47645k98798L13809l19190q2731
$$ 745186 940152 878214 870428 610199 557689 1005334 706536 1020345 701155 618424
10990F18424K67295j74173N9402k13456L14536K20392k26649l9698K88423J23066
$$ 618424 885719 711546 770948 557492 872028 1092420 865771 826073 1114496 1237562
10980A237562K89713J71044k89135K27745J47514L6504K07049M27298J71496M54748
$$ 1237562 1527275 1698319 1409184 1636929 1784443 1820947 2027996 2455294 2626790 3081538
10970C081538J38295R716J38247O7714o24130p119k27819n22896m00632O96735
$$ 3081538 3219833 3229549 3367796 3435510 2811380 2804261 2576442 2053546 1652914 2349649
10960B349649k16964j19690J03734j30917L88880j54470r9866j35314l34274q5964
$$ 2349649 2132685 2012995 2116729 1985812 2374692 2220222 2120356 1985042 1650768 1564804
10950A564804l28390k85443M62325o15017l59495J1292M219k26619J47297N709
$$ 1564804 1236414 950971 1413296 798279 438784 450076 454295 227676 374973 380682
10940C80682A49612K50950L0410j38714m9656g0457C09555A16217K27673j48353
$$ 380682 149612 400562 430972 292258 242602 -70457 309555 116217 343890 195537
10930A95537P2512a30434H7910L49359A55755M236C6258c55249C64157c1976K63
$$ 195537 268049 -130434 87910 437269 155755 159991 36258 -355249 364157 -31976 -31713
10919c1713A57193R4302g332G1872P0749L6483c8436l08022A64409B2919d6726
$$ -31713 157193 251495 -7332 71872 142621 179104 -38436 -346458 164409 22919 -46726
10907b06086A57991o2792a3199B15272J5712a92479C01842F2821b48155h8650
$$ -206086 157991 95199 -13199 215272 230984 -192479 301842 62821 -248155 -88650
10896C2229L8657b6936n4175A07388h4115j4714C92258F3471c0917k81407G7989
$$ 32229 70886 -26936 -81111 107388 -84115 -98829 392258 63471 -30917 -312324 77989
10884C13437I0692e7473A57526J4073d3817l182A959c72163A72693E1173a52976
$$ 313437 90692 -57473 157526 171599 -43817 -46999 1959 -372163 172693 51173 -152976
10872E6331a55500C52481A08276a31576e7415H8073a98131C11720b70178E8022
$$ 56331 -155500 352481 108276 -131576 -57415 88073 -198131 311720 -270178 58022
10861A14968K2845b21528m4254R2744A54170h7654D709c51288F6295g4786A37487
$$ 114968 137813 -221528 -265782 -173038 154170 -87654 4709 -351288 66295 -74786 137487
10849c62738A42294N890a15023B43956g0688k28665f9241o1214A85070b9068b829
$$ -362738 142294 148184 -115023 243956 -70688 -299353 -69241 -130455 185070 -29068 -2829
10837A62287N8374d1407F3914B3706f5513D18828f3628A2673a94043q7001D8940
$$ 162287 220661 -41407 63914 23706 -65513 418828 -63628 12673 -194043 -281044 48940
10825A83339b00263A7703b19539e0791C79834a64647j12164g7040j95717J01323
$$ 183339 -200263 17703 -219539 -50791 379834 -164647 -276811 -77040 -272757 -171434
10815a71434p1765M5329o3592F40b55298C7886a1158j01824B04056f8165E0481
$$ -171434 -243199 -197870 -261462 640 -255298 37886 -11158 -112982 204056 -68165 50481
10803I6091i2747O97G1524B0083b4237A69242J36967j37976N5880r1221n3812
$$ 96091 -92747 -92050 71524 20083 -24237 169242 306209 168233 224113 132892 79080
10792G9080d99122H2210a12523l16208C4864N1959R0695b12013b2092F0572P3305
$$ 79080 -499122 82210 -112523 -428731 34864 86823 177518 -212013 -22092 60572 133877
10781A33877b29559g2357l29592A76958a48685N3002A89296a17441J4195H1725
$$ 133877 -229559 -72357 -401949 176958 -148685 -95683 189296 -117441 -103246 81725
10770g2475J2152D67613i961j97578o9859M716A14746Q3227l4704a39589o5742
$$ -72475 -60323 467613 -9961 -207539 -277398 -272682 114746 197973 163269 -139589 -205331
10759b05331L7845c8908B03186h3665H6176q318a64435N4687B39509g2852C8135
$$ -205331 -167486 -38908 203186 -83665 86176 77858 -164435 -109748 239509 -72852 38135
10747C4206c83173J56717j86101F5681k3240j9726e4577B63120B6307a37971j51480
$$ 34206 -383173 -226456 -412557 65681 42441 22715 -54577 263120 26307 -137971 -289451
10736b89451D0150j5235a94171A901b30401F4674i6704c6752j45410C3288K4336
$$ -289451 40150 24915 -194171 1901 -230401 64674 -96704 -36752 -182162 33288 57624
10725E7624e8877r461j50973L4992N5894j51827J29188j50912a16229E4230C468
$$ 57624 -58877 -68338 -219311 -184319 -128425 -280252 -151064 -301976 -116229 54230 3468
10713f6934B6550R4850J26446B2419K96878E4682b14494r985f8094E1181a7125
$$ -66934 26550 121400 247846 22419 319297 54682 -214494 -224479 -68094 51181 -17125
10701e2076A81337a98006B0781N3064b56308D13839A76954a30943A53422a32560
$$ -52076 181337 -198006 20781 73845 -256308 413839 176954 -130943 153422 -132560
10690c54850e3527b6071k51338j96612a17327N4726m2585A22032b93A61732o0441
$$ -354850 -53527 -26071 -277409 -474021 -117327 -62601 -105186 122032 -293 161732 101291
10679A01291g357F4833a29606A15287c46667g5464o3035A14808J05041a82183
$$ 101291 -7357 64833 -129606 115287 -346667 -75464 -138499 114808 219849 -182183
10668b76864j33137A226h9459r0295O6005A21041c05041A0560c2577E6524c1788
$$ -276864 -410001 1226 -89459 -179754 -113749 121041 -305041 10560 -32577 56524 -31788
10656H9037J46078e2685A24903a32471n83905A42887c3865O539l80741e513l17211
$$ 89037 235115 -52685 124903 -132471 -716376 142887 -33865 -27326 -408067 -5513 -322724
10645c22724B50193i4922k37607J07709D2565K4355b8448j36617E9523b63797
$$ -322724 250193 -94922 -332529 -224820 42565 66920 -28448 -165065 59523 -263797
10634b8476E6029K33053l5789b29243G1029a38738A34040a10422a7676l66559
$$ -28476 56029 289082 253293 -229243 71029 -138738 134040 -110422 -17676 -384235
10624c84235a08395B04903a07731a4131k12951N0848f732q1695D9964c54045a5834
$$ -384235 -108395 204903 -107731 -14131 -227082 -176234 -6732 -88427 49964 -354045 -15834
10612d9589F4231b18193k7431C5967e5773A7910b28219A33789D6139d68586M8582
$$ -49589 64231 -218193 -245624 35967 -55773 17910 -228219 133789 46139 -468586 -420004
10601d20004P5600h0499k88612I4345i4429A21426a96711B01648D1334b29524
$$ -420004 -344404 -80499 -369111 94345 -94429 121426 -196711 201648 41334 -229524
10590f7972B98066f9755B7396a94296E5069A6405J89388r7801e93956B06123i7537
$$ -67972 298066 -69755 27396 -194296 55069 16405 205793 107992 -593956 206123 -97537
10578b84246J18794L6228l228b0039p2076p3686j11806J11796g8192m1514L4852
$$ -284246 -165452 -129224 -132452 -20039 -92115 -165801 -277607 -165811 -78192 -119706 -84854
10567h4854j33973A80004g3579D385a29266B20363c86391a391j48664D0261a44518
$$ -84854 -218827 180004 -73579 4385 -129266 220363 -386391 -1391 -150055 40261 -144518
10555e01321d0764I7094a37361N9201n1128j26658a02963k9918J5322M2074b3118
$$ -501321 -40764 97094 -137361 -78160 -129288 -255946 -102963 -132881 -117559 -75485 -23118
10543b47135B09416b09598B259J23048J08951l049d37502J96343o8633O1624H3079
$$ -247135 209416 -209598 2259 125307 234258 231209 -437502 -241159 -309792 -248168 83079
10531a35169B69071M2700h3773g491m8070A39777K8363J59075a08324j84805B02210
$$ -135169 269071 311771 -83773 -7491 -55561 139777 168140 327215 -108324 -293129 202210
10519d5949C83232g9021q3467C0284b6776B4924Q4397J8901a51680j63350O872
$$ -45949 383232 -79021 -162488 30284 -26776 24924 109321 128222 -151680 -315030 -308158
10508c08158f1412A57453a19853k05548f1863B08737k8467b49152A23602e908
$$ -308158 -61412 157453 -119853 -325401 -61863 208737 180270 -249152 123602 -5908
10497i6378j07281A10377h2330A49130C2166P7742l7102a46421K1999j43195B84492
$$ -96378 -203659 110377 -82330 149130 32166 109908 72806 -146421 -124422 -267617 284492
10485i6274H5657d8068J9418B64609n0267J93965K11230j72570M178j65412k6873
$$ -96274 85657 -48068 -28650 264609 214342 408307 619537 446967 451145 285733 258860
10474B58860Q2277a46878C30529i2725B2631a77188m2189A17713c0557A87461
$$ 258860 341137 -146878 330529 -92725 22631 -177188 -219377 117713 -30557 187461
10463A06530E004b26655e3629A31174A0523P688i5703j53466C26308f8892l02620
$$ 106530 5004 -226655 -53629 131174 10523 18211 -95703 -249169 326308 -68892 -371512
10452c71512A17129N9583a20207B3995b3669l1410G8953A1658b9398q4009B02312
$$ -371512 117129 176712 -120207 23995 -23669 -55079 78953 11658 -29398 -113407 202312
10440b77602a02566q4668B50362h0938B0157d32842E45215a27237N3134D1268
$$ -277602 -102566 -187234 250362 -80938 20157 -432842 545215 -127237 -74103 41268
10429f7035A25998N2581M7241m01b26322I4101N8168A8969M6338K17908b24049
$$ -67035 125998 178579 225820 225419 -226322 94101 152269 18969 65307 283215 -224049
10417A69377K76037c3099l0590C10457B163J70177i151p6519A94260b81647A8638
$$ 169377 445414 -33099 -63689 310457 2163 172340 -9151 -85670 194260 -281647 18638
10405E4111c1530j7540D0748c19973h9242A28577d9670C852a91284g2424k09311
$$ 54111 -31530 -49070 40748 -319973 -89242 128577 -49670 3852 -191284 -72424 -281735
10394b81735A49372C9980K84651p8184q9318c42234c7109j4316j1536B88460i7113
$$ -281735 149372 39980 324631 246447 157129 -342234 -37109 -51425 -62961 288460 -97113
10382e4732E8566b29078C10795B446K5243A2801J32255K17432J28472o1347r1388
$$ -54732 58566 -229078 310795 2446 27689 12801 145056 362488 490960 429613 338225
10371C38225E968N17139k36864K1050j01842R3379K07858j24141q6612p3850k4659
$$ 338225 5968 523107 286243 307293 205451 298830 506688 382547 295935 222085 197426
10360A97426k794K17468O8365A01389N1998J00539P255J63390j60771R5454J66180
$$ 197426 194632 412100 480465 101389 153387 253926 261181 424571 263800 359254 525434
10349E25434J19277o7310j61296r2177j31242O2800K46686O0840A29262Q3028
$$ 525434 644711 577401 416105 323928 192686 255486 502172 563012 129262 212290
10339B12290J39439A29574L75062j88606c2418A39181Q4224q5888h4707n1312
$$ 212290 351729 129574 504636 316030 -32418 139181 223405 137517 -84707 -136019
10329a36019B84207a8958H5404i7648J2483B14922e9223E23138B44463L00639
$$ -136019 284207 -18958 85404 -97648 -85165 214922 -59223 523138 244463 545102
10319E45102I9108K34514A24248g4073A24785j0597m0381b3456B23441d0326j5928
$$ 545102 99108 333622 124248 -74073 124785 114188 73807 -23456 223441 -40326 -56254
10308e6254K0342H4674a18226A01172d5285B43151f5633j85955C4521a7346I7159
$$ -56254 -35912 84674 -118226 101172 -45285 243151 -65633 -251588 34521 -17346 97159
10296B30285L081n3818D3732N8763A7975c6003B39195d7145p5978N6143k29799
$$ 230285 233366 179548 43732 102495 17975 -36003 239195 -47145 -123123 -66980 -296779
10285b96779B073a35871N8006j65904L5594A27982f530j4287j357F7699O465B0111
$$ -296779 2073 -135871 -77865 -243769 -208175 127982 -6530 -20817 -22174 67699 74164 20111
10272c2055l903B9241K87906b1185j98728E6012A666a90869A57162l0261f9889
$$ -32055 -35958 29241 317147 -21185 -219913 56012 1666 -190869 157162 126901 -69889
10260a12745B31794C3182K54522J6588J30544j84610n7751j3857g0118E76456
$$ -112745 231794 33182 287704 304292 434836 250226 192475 178618 -70118 576456
10249B51613B0354b24112M8820E1862O4156c62512a42787j89927J63611A61433
$$ 251613 20354 -224112 -175292 51862 116018 -362512 -142787 -332714 -169103 161433
10238g6090m4631m2372A63099a20284A83717a41375B47449j05342A6604K21494
$$ -76090 -120721 -163093 163099 -120284 183717 -141375 247449 142107 16604 238098
10228B38098A00126a84776Q4040k9163o0089A81076c89542a87265c2442B1612
$$ 238098 100126 -184776 -100736 -129899 -189988 181076 -389542 -187265 -32442 21612
10217A15240a6082k48900N1470d2872l5645c8395J600j6159l892D745a07114B25477
$$ 115240 -16082 -264982 -213512 -42872 -78517 -38395 -36795 -52954 -56846 4745 -107114 225477
10204a31095C0142L26493a19741j33622e3756B4052I814M9263A1604J16904b20248
$$ -131095 30142 356635 -119741 -253363 -53756 24052 9814 59077 11604 128508 -220248
10192D8363b02226A60276c45112a21113m2481c5665j82392A01348b13028q604
$$ 48363 -202226 160276 -345112 -121113 -163594 -35665 -218057 101348 -213028 -221632
10182b21632A31734c15035C6616g4980j21m6670B70098b16612i9561k01141n6236
$$ -221632 131734 -315035 36616 -74980 -75101 -121771 270098 -216612 -99561 -300702 -356938
10171c56938a68543B4458K7063a03534C3948e5018B30497a50110B99173d14752
$$ -356938 -168543 24458 51521 -103534 33948 -55018 230497 -150110 299173 -414752
10160a60749m52275b41748d270C03560B933J01080e6608J7673j2128r4902e4646
$$ -160749 -613024 -241748 -4270 303560 2933 104013 -56608 -38935 -51063 -145965 -54646
10148b59057A29877a84680j94794a57785d6436p3405B4478b4812p9900E1311B4060
$$ -259057 129877 -184680 -379474 -157785 -46436 -119841 24478 -24812 -104712 51311 24060
10136E6816E360a04467j1226r5274K9972C70071E0662a39506B63386e4350J9963
$$ 56816 5360 -104467 -115693 -210967 -180995 370071 50662 -139506 263386 -54350 -34387
10125c4387k1219l474l1805A29990n4329j4746b02126n3381A07920c17722E9012
$$ -34387 -55606 -59080 -90885 129990 75661 60915 -202126 -255507 107920 -317722 59012
10113b92962i7475A06832A7569N1248b70736I9530b52446j2843a0109B65479o6321
$$ -292962 -97475 106832 17569 68817 -270736 99530 -252446 -265289 -10109 265479 199158
10102A99158g129k12728f1722H9363K0395d58761B9507K39342d1275m17965a51060
$$ 199158 -7129 -219857 -61722 89363 109758 -458761 29507 268849 -41275 -459240 -151060
10090e3425A8412a3715k2617m0561J1323k679A01228b02326R2787j15061j64416
$$ -53425 18412 -13715 -36332 -76893 -65570 -68249 101228 -202326 -109539 -224600 -389016
10079c89016B1360L8715J53661c44178a65560J3452A06170J84305a626p2154A30242
$$ -389016 21360 60075 213736 -344178 -165560 -152108 106170 290475 -1626 -73780 130242
10067a6886A11747c4365d153p2479D0401a31317k7177A650e0711q5926L6971B74738
$$ -16886 111747 -34365 -4153 -76632 40401 -131317 -158494 1650 -50711 -136637 -99666 274738
10054a58609A67832o9235a51655O4116L9085B42996b38157k249j15133J13713
$$ -158609 167832 98597 -151655 -87539 -48454 242996 -238157 -240406 -355539 -241826
10044b41826P9035C0860c0918n9107o3120J2501H5628a98637D2452F91c97051
$$ -241826 -162791 30860 -30918 -90025 -153145 -140644 85628 -198637 42452 691 -397051
10032a49087J414q644n9197A56390a20523Q096d7861l1996H50b82892E8219M5619
$$ -149087 -147673 -156317 -215514 156390 -120523 -112427 -47861 -79857 850 -282892 58219 103838
10020A03838a61379j42705J27711M0551N3019A11843K5351a80878D5325e9781
$$ 103838 -161379 -304084 -176373 -135822 -82803 111843 137194 -180878 45325 -59781
10009d57916a46099L0419m499j08368f9853J9443j82858q9774A12405h1142D6556
$$ -457916 -146099 -115680 -120179 -228547 -69853 -50410 -233268 -323042 112405 -81142 46556
9997A12107B0523K13638N952b31191j09177L8048F3794a76774d2104m5257k31710
$$ 112107 20523 234161 240113 -231191 -340368 -302320 63794 -176774 -42104 -87361 -319071
9986c19071g3945E6614c37150P1450F00013B7204K24990C9726a49597G8698F477
$$ -319071 -73945 56614 -337150 -265700 600013 27204 252194 39726 -149597 78698 6477
9974a25582c6669j54769m9260H3330b62716a16408L4084K8700A01234C357J18768
$$ -125582 -36669 -191438 -240698 83330 -262716 -116408 -82324 -53624 101234 3357 122125
9963A22125n170B727M784b31659R4833k1556A48741R2384b6392r6666N7151A03528
$$ 122125 116955 2727 7511 -231659 -136826 -158382 148741 241125 -26392 -123058 -65907 103528
9950G1277C0809J0191K900a07876L8682j57354a02950r3107F5501b636B79420
$$ 71277 30809 41000 43900 -107876 -69194 -226548 -102950 -196057 65501 -2636 279420
9938a43805G9702e5965E1339n354Q345c32303c368A41953a31570k71307a43449
$$ -143805 79702 -55965 51339 45985 54330 -332303 -3368 141953 -131570 -402877 -143449
9926b61114a9024C9241a36315C3588a22672l5138j17323e9866C877K80556I8664
$$ -261114 -19024 39241 -136315 33588 -122672 -157810 -275133 -59866 3877 284433 98664
9914i5895j558c827j17910j58866l7522J54405P1960A8832c24391A262i3333A87573
$$ -95895 -97453 -3827 -121737 -280603 -318125 -163720 -91760 18832 -324391 1262 -93333 187573
9901B2983N1743J38363C3455K25296a39854A4372d17372a42787k18712a62224
$$ 22983 74726 213089 33455 258751 -139854 14372 -417372 -142787 -361499 -162224
9890a99630j80557J63248H9325L07838G4857a99117p2697F9791c3303A9076J20108
$$ -199630 -380187 -216939 89325 397163 74857 -199117 -271814 69791 -33303 19076 139184
9879A39184f4815j79856Q4177n5419L9919H9007N2910h0113j30052M7622g2469
$$ 139184 -64815 -244671 -160494 -215913 -175994 89007 141917 -80113 -210165 -162543 -72469
9867g7694B82841a38029r4532c5975A08654h0878l5478j6787m3077k40754f194
$$ -77694 282841 -138029 -232561 -35975 108654 -80878 -116356 -133143 -176220 -416974 -6194
9855f9326j57063o268J00325B0765J04077n7408I188b43827j21076a67978k15482
$$ -69326 -226389 -232657 -132332 20765 124842 67434 9188 -243827 -364903 -167978 -383460
9844c83460A73950c44479N9833J26043j25556B392c43699A12587c04507R8508
$$ -383460 173950 -344479 -284646 -158603 -284159 2392 -343699 112587 -304507 -205999
9834b05999c1283H1466J92669a21083D10408c39564a2049k08080B79361b61704
$$ -205999 -31283 81466 274135 -121083 410408 -339564 -12049 -220129 279361 -261704
9823b30924a06026G3618g9786A75382a46185I3671b9950j82187O6264D7239d3048
$$ -230924 -106026 73618 -79786 175382 -146185 93671 -29950 -212137 -145873 47239 -43048
9811A19376J70774a42123j04193K328J9711B3696b06551Q6977C4666f2009m3846
$$ 119376 290150 -142123 -246316 -243988 -224277 23696 -206551 -119574 34666 -62009 -105855
9800a05855d5783j42124Q837J0317j82777c5830j47556m0597n9771A54648b89307
$$ -105855 -45783 -187907 -179070 -168753 -351530 -35830 -183386 -223983 -283754 154648 -289307
9788A6604a80460d9747A7375J13447a07953l804j63264A95121a20006c8479A32171
$$ 16604 -180460 -49747 17375 130822 -107953 -111757 -275021 195121 -120006 -38479 132171
9776g52A01478c26678G529L6237j0082b30899n4026A27417f681D2417d1103k83742
$$ -752 101478 -326678 7529 43766 33684 -230899 -284925 127417 -6681 42417 -41103 -324845
9764c24845J44580O0016j0640J1694c2743A2919K06926F8125e04265A2966b52157
$$ -324845 -180265 -120249 -130889 -119195 -32743 12919 219845 68125 -504265 12966 -252157
9752A6102N6435P4228f1966j80359k9317j6338h2882C0920b24965r3099g9290
$$ 16102 72537 146765 -61966 -242325 -271642 -287980 -82882 30920 -224965 -318064 -79290
9740a09546B56077D9234e2114l07340J76596M8045j42212i5023H7221a94017f320
$$ -109546 256077 49234 -52114 -359454 -182858 -134813 -277025 -95023 87221 -194017 -6320
9728g2836k5661J7272J3506j03246j05437L839E1131K13345e0133B39519a40368
$$ -72836 -98497 -81225 -67719 -170965 -276402 -272563 51131 264476 -50133 239519 -140368
9716A60767k7740E0271c07963J06648f4040H7122P5979g6054b1334n6754j49516
$$ 160767 133027 50271 -307963 -201315 -64040 87122 163101 -76054 -21334 -78088 -227604
9705b27604C5621d8727m4948j16191P9617f4701q3670M5433r0084B72995a00854
$$ -227604 35621 -48727 -93675 -209866 -130249 -64701 -148371 -102938 -193022 272995 -100854
9693a54660b4444O191A07093B8479b230A41633c10127c3595j34979n6319j08424
$$ -154660 -24444 -18253 107093 28479 -2230 141633 -310127 -33595 -168574 -224893 -333317
9682c33317f9128a1286A07048a60962A75517a7072A40b63699B04629h4137k7120
$$ -333317 -69128 -11286 107048 -160962 175517 -17072 140 -263699 204629 -84137 -111257
9671a11257K8167L2016l07603a49048C0215d0709A16066d4554k1178j20011n2417
$$ -111257 -83090 -51074 -358677 -149048 30215 -40709 116066 -44554 -65732 -185743 -238160
9660b38160A6670L3181q668a07701j6796A50281b34626E6765a0929q8988C8676
$$ -238160 16670 49851 41183 -107701 -124497 150281 -234626 56765 -10929 -99917 38676
9648a99268M4656D9005c52170a73137I3173c72498a00307K9425f542B13417N513
$$ -199268 -154612 49005 -352170 -173137 93173 -372498 -100307 -70882 -6542 213417 218930
9637B18930b52497K4022B17630b34436A0118d1235j82518C42645c09807d8106
$$ 218930 -252497 -228475 217630 -234436 10118 -41235 -223753 342645 -309807 -48106
9626A14024a55023A92961E1924b22079j96419g1051j3976l3435F4876b3613A23270
$$ 114024 -155023 192961 51924 -222079 -418498 -71051 -85027 -118462 64876 -23613 123270
9614A03165b07235r6607g1771B0635K3466b66106J01935p0963d3918l63175e3639
$$ 103165 -207235 -303842 -71771 20635 44101 -266106 -164171 -235134 -43918 -407093 -53639
9602a25014r303B3060J7440g8529B9340N8261b91596J38786A0076a43643A43958
$$ -125014 -134317 23060 40500 -78529 29340 87601 -291596 -152810 10076 -143643 143958
9590I735a3866I0200a75748l13122h1389D9485a55571K0084k35990a05748c9070
$$ 9735 -13866 90200 -175748 -488870 -81389 49485 -155571 -135487 -371477 -105748 -39070
9578c3355C8015c43817a41346l0261b454k11078E7171J683J00193a4570p057A35200
$$ -33355 38015 -343817 -141346 -171607 -2454 -213532 57171 58854 159047 -14570 -21627 135200
9565A25172f938j03529l21587B9297L0079b18319B9756g8526c445I1227b76420
$$ 125172 -6938 -110467 -432054 29297 59376 -218319 29756 -78526 -3445 91227 -276420
9553A7952P8826c0986m34215D1861a04289A02061A0163K9871a43469r2719r7914
$$ 17952 96778 -30986 -465201 41861 -104289 102061 10163 40034 -143469 -236188 -334102
9542c34102A86753P4358B2106b25281a07969K6737p6072j22721B2703a84379n6166
$$ -334102 186753 261111 22106 -225281 -107969 -81232 -157304 -280025 22703 -184379 -240545
9531b40545D9502b61213e4217k8199A86853D9800d6147j27335L6778k58737a16470
$$ -240545 49502 -261213 -54217 -82416 186853 49800 -46147 -173482 -136704 -395441 -116470
9519A2942O2232b44921b9364j33670N0235o0294f8957I0797a55379d8350k0770
$$ 12942 75174 -244921 -29364 -163034 -112799 -173093 -68957 90797 -155379 -48350 -69120
9508f9120o8579p3526R3570B6355g1218k38727J28312c1787A06933c66563c5588
$$ -69120 -137699 -211225 -117655 26355 -71218 -309945 -181633 -31787 106933 -366563 -35588
9496a40282r2188k9484f2960j9895p5052G1235a65805A5579J02890k572a68542
$$ -140282 -232470 -261954 -62960 -82855 -157907 71235 -165805 15579 118469 115897 -168542
9484b94879f5829p8534F8731l0566J48834a81536c559A86737h8002I7525e9667
$$ -294879 -65829 -144363 68731 38165 186999 -181536 -3559 186737 -88002 97525 -59667
9472e7115H833a59480j80836B64461a5980j51248j4097O9611a820A61893B1046
$$ -57115 8833 -159480 -340316 264461 -15980 -167228 -181325 -111714 -1820 161893 21046
9460b51531r078K9917g0846k67746H7758b74358A9826c8917A449b11093D9334
$$ -251531 -260609 -230692 -70846 -338592 87758 -274358 19826 -38917 1449 -211093 49334
9448a93353P4763A23145i9977o9445d9362n8382N0913j8891J2782k49985A82880
$$ -193353 -118590 123145 -99977 -169422 -49362 -107744 -56831 -75722 -62940 -312925 182880
9436a14345k86451A08154b0475k19664h324j93429B559g7952n5690R455o8631
$$ -114345 -400796 108154 -20475 -240139 -8324 -201753 2559 -77952 -133642 -124187 -192818
9425a92818b0373k68157K6274J04978P6847q9994O2356K4337l37315a05636j77657
$$ -192818 -20373 -288530 -262256 -157278 -80431 -170425 -108069 -83732 -421047 -105636 -283293
9414b83293A09373a26454d9924j65021B2152b93989l1392b0062H9519a43112B61442
$$ -283293 109373 -126454 -49924 -214945 22152 -293989 -325381 -20062 89519 -143112 261442
9402e1451j16074Q2245j1111m47678g2961G3078b59867I2349a63239K2358j91177
$$ -51451 -167525 -85280 -96391 -544069 -72961 73078 -259867 92349 -163239 -140881 -332058
9391c32058B02600m8719c09934e5222n632n5524D3713b55391f7895j82130J14162
$$ -332058 202600 153881 -309934 -55222 -60854 -116378 43713 -255391 -67895 -250025 -135863
9380a35863D6369a17428K2432k84906m4911C56711a63786B9464g9440k80320D8063
$$ -135863 46369 -117428 -94996 -379902 -424813 356711 -163786 29464 -79440 -359760 48063
9368a60063q187A11244L6511a20335j17006J0300Q7169L095A4058R5886a73098
$$ -160063 -168250 111244 147755 -120335 -237341 -227041 -139872 -136777 14058 109944 -173098
9356A1062c17017J6004a5170B95302i4251c687l4239d397D2905k641b4000j50090
$$ 11062 -317017 -301013 -15170 295302 -94251 -3687 -37926 -4397 42905 40264 -24000 -174090
9344a74090H5963b55825B97250D3557a38326N5414j46611f6262j11682J620J5100
$$ -174090 85963 -255825 297250 43557 -138326 -82912 -229523 -66262 -177944 -176324 -161224
9333a61224j07922F9888P1722c3221B33585c54155A95482l4791g7980C2593b47335
$$ -161224 -269146 69888 141610 -33221 233585 -354155 195482 160691 -77980 32593 -247335
9321a76567j21725A22238a65045m7225i7806j34304A05226J5901A9565f9663H4534
$$ -176567 -298292 122238 -165045 -212270 -97806 -232110 105226 121127 19565 -69663 84534
9309c0094B07282i5767k11638D1937L71448f79A51692A2566R4030J0000b90386
$$ -30094 207282 -95767 -307405 41937 413385 -679 151692 12566 106596 116596 -290386
9297a8450l3167q4618G8603a12975B05178D567b04888F8192M3073b63844j749
$$ -18450 -51617 -136235 78603 -112975 205178 4567 -204888 68192 111265 -263844 -265593
9286b65593A36586a20130l32407a72448k1139q0753q0136C53797A65733c59937
$$ -265593 136586 -120130 -452537 -172448 -193587 -274340 -354476 353797 165733 -359937
9275D0683a16838A10054a7339j32280N1966F904Q2985N5069c8383C0091C970J13642
$$ 40683 -116838 110054 -17339 -149619 -97653 6904 89889 144958 -38383 30091 3970 117612
9263A17612m6551G835J70267b1503k85987R6997N7799d1267E0447h7265F026h6863
$$ 117612 71061 7835 178102 -21503 -307490 -210493 -152694 -41267 50447 -87265 6026 -86863
9250D008b21513A5662p176b70706k8310J39803A31624i9254G948e05773b2773
$$ 4008 -221513 15662 8486 -270706 -299016 -159213 131624 -99254 7948 -505773 -22773
9238a3450J042A77080a68223C7854b37872B6769N3518a22017a3225n1101C6038
$$ -13450 -12408 177080 -168223 37854 -237872 26769 80287 -122017 -13225 -64326 36038
9226a44868j01741j55988B94469b6114m939j08319k23172a58770C4951a83255
$$ -144868 -246609 -402597 294469 -26114 -31053 -139372 -362544 -158770 34951 -183255
9215a04366o7423H8513d65024h4117A57972b46548m0266C812b74718d5189A35511
$$ -104366 -171789 88513 -465024 -84117 157972 -246548 -286814 3812 -274718 -45189 135511
9203F8001a02399j34311A99176b28476D3650a93669M6605e7645j58014i1650A28715
$$ 68001 -102399 -236710 199176 -228476 43650 -193669 -147064 -57645 -215659 -91650 128715
9191F1061h3846a7917B37J34650J70529e09192b31037E3781d96819E9497L24458
$$ 61061 -83846 -17917 237 134887 305416 -509192 -231037 53781 -496819 59497 383955
9180C83955f042j87888a6059k1485o3281D295M9709l176a29213O2347K7383j34586
$$ 383955 -6042 -193930 -16059 -37544 -100825 4295 54004 50828 -129213 -66866 -39483 -174069
9168a74069j39201J44902N9737G9279a43878M8650j57774g309C1279c05479B54696
$$ -174069 -313270 -168368 -108631 79279 -143878 -95228 -253002 -7309 31279 -305479 254696
9156h2633B3502a8367m9193A98681a69414B5753J21674b34711a05531l1433k8346
$$ -82633 23502 -18367 -67560 198681 -169414 25753 147427 -234711 -105531 -136964 -165310
9145a65310j14333B79972e5832A0693a12006b0161j9767n508A14221C9102b60728
$$ -165310 -279643 279972 -55832 10693 -112006 -20161 -39928 -45436 114221 39102 -260728
9133A41070B5853a55634D889f2007E2029M8648a60173C6811a37062a386j10957
$$ 141070 25853 -155634 4889 -62007 52029 100677 -160173 36811 -137062 -1386 -112343
9122a12343B11743a05255c9070G6540f6614D8473j7830J33458G5873Q80b42335
$$ -112343 211743 -105255 -39070 76540 -66614 48473 30643 164101 75873 76753 -242335
9110h7230q7447L295L2804E4092c5901j91627Q5016f0247k06944C01426i0477
$$ -87230 -174677 -171382 -138578 54092 -35901 -227528 -142512 -60247 -267191 301426 -90477
9098a41664J1567I9930b40711h6776k87602a57724A41549b9482a4288A06452b92762
$$ -141664 -130097 99930 -240711 -86776 -374378 -157724 141549 -29482 -14288 106452 -292762
9086a35335K042K6668I1305a77147c2547l24105E5053I052f2867J3041k42539
$$ -135335 -133293 -106625 91305 -177147 -32547 -356652 55053 9052 -62867 -49826 -292365
9075b92365H5062l4909b21794J6383k53825a65483b212A74479h945A60109a74237
$$ -292365 85062 50153 -221794 -205411 -459236 -165483 -2212 174479 -8945 160109 -174237
9063c07739J50650A788a65479k452B43767d124m03272a73541A0473J35233a31597
$$ -307739 -157089 1788 -165479 -167931 243767 -4124 -407396 -173541 10473 145706 -131597
9051F1363e9312j86980A50181c21884C11107H6010J4555g8818A73885d47916A20990
$$ 61363 -59312 -246292 150181 -321884 311107 86010 100565 -78818 173885 -447916 120990
9039A93064c3756j11795A45114n7980a35301j4208o7619j23607N0946A6621J89695
$$ 193064 -33756 -145551 145114 87134 -135301 -149509 -217128 -340735 -289789 16621 206316
9028B06316p7039D1807a01747l651M2277A89702b67988r4763d9800a9517A85525
$$ 206316 129277 41807 -101747 -105398 -63121 189702 -267988 -362751 -49800 -19517 185525
9016c01042d6488k3634j00599P8506k09599R541e7625C31860A36627a35826A71213
$$ -301042 -46488 -70122 -170721 -92215 -301814 -292273 -57625 331860 136627 -135826 171213
9004a46828j44905E0023L2906c49233j7963a00323A04144a41599A97764a45852
$$ -146828 -291733 50023 82929 -349233 -367196 -100323 104144 -141599 197764 -145852
8993h7010A73099d61905A29856C2710f3129A04792a69958l6417A09793a23726
$$ -87010 173099 -461905 129856 32710 -63129 104792 -169958 -206375 109793 -123726
8982f377F8443a02775F177L01792o9893n5454c4003p1513B2335a9015k31379G5813
$$ -6377 68443 -102775 6177 307969 238076 182622 -34003 -105516 22335 -19015 -250394 75813
8969B14903a72646K0188j2159K2872N6046A63781J52650h633n8756H9777c21701
$$ 214903 -172646 -152458 -164617 -141745 -85699 163781 316431 -8633 -67389 89777 -321701
8957e2530l19984G0843a27861k58046B96472J84688b03317j7571A11963b64147
$$ -52530 -372514 70843 -127861 -385907 296472 481160 -203317 -220888 111963 -264147
8946f4610q8111j10381E6896M5909n1382b77122J28453K5262j3523D460J3467
$$ -64610 -152721 -263102 56896 102805 51423 -277122 -148669 -123407 -136930 4460 17927
8935A7927M7627K31554j46035f2343j60644i0229j32715Q1299D3561J87713g2424
$$ 17927 65554 297108 151073 -62343 -222987 -90229 -222944 -141645 43561 231274 -72424
8923E38477M80333J952529P108453r25326A632713C34948H5181M01655B35235
$$ 538477 1018810 2971339 10079792 9154466 1632713 334948 85181 486836 235235
8913d964m05l05969C8452a90352A60300K20842l7550H0475L6373a77857M4310
$$ -4964 -5369 -311338 38452 -190352 160300 381142 343592 80475 116848 -177857 -133547
8902a33547C11233A51481l2735g7697A82291r0590e3424j19149B10479C4572P5557
$$ -133547 311233 151481 118746 -77697 182291 91701 -53424 -172573 210479 34572 110129
8891A10129C2059a54505j26228a7760A52188b24524A8732b47645d1473A60415
$$ 110129 32059 -154505 -280733 -17760 152188 -224524 18732 -247645 -41473 160415
8880f3180J3202A82176A5825i0681l73262A06310i2249D3501Q4947E1299k5521
$$ -63180 -49978 182176 15825 -90681 -463943 106310 -92249 43501 128448 51299 25778
8869B5778a81210h3796n918A40222o2336g9226A55602b56228A85265H8606a28652
$$ 25778 -181210 -83796 -89714 140222 77886 -79226 155602 -256228 185265 88606 -128652
$$ [...]
##END NTUPLES=NMR SPECTRUM
##END=
