
##TITLE=UV1281_M1_1242-1388_50_7534447_KqYNpUImUc
##JCAMPDX= 6.0         $$ Bruker NMR JCAMP-DX V2.0
##DATA TYPE= NMR SPECTRUM
##DATA CLASS= NTUPLES
##ORIGIN= BRUKER
##OWNER= Administrator
$$ 1.72 TOPSPIN		Version 2.1
$$ 2013-02-22 03:51:18.172 -0500  Administrator@X
$$ Compression mode = diff/dup
##.OBSERVE FREQUENCY= 400.02188249412
##.OBSERVE NUCLEUS= ^1H
##.ACQUISITION MODE= SIMULTANEOUS (DQD)
##.ACQUISITION SCHEME= undefined
##.AVERAGES= 8
##.DIGITISER RES= 22
##SPECTROMETER/DATA SYSTEM= spect
##.PULSE SEQUENCE= zg30
##.SOLVENT NAME= COFFEE_meoh
##.SHIFT REFERENCE= INTERNAL, COFFEE_meoh, 1, 14.98509
##AUDIT TRAIL= $$ (NUMBER, WHEN, WHO, WHERE, PROCESS, VERSION, WHAT)
$$ ##TITLE= Audit trail, TOPSPIN		Version 2.1
$$ ##JCAMPDX= 5.01
$$ ##ORIGIN= Bruker BioSpin GmbH
$$ ##OWNER= Administrator
$$ $$ E:\/data/COFFEE/nmr/UV1281_M1_1242-1388_50_7534447_KqYNpUImUc/10/pdata/1/auditp.txt
$$ ##AUDIT TRAIL=  $$ (NUMBER, WHEN, WHO, WHERE, PROCESS, VERSION, WHAT)
(   1,<2013-02-22 03:51:09.656 -0500>,<Administrator>,<X>,<go>,<TOPSPIN 2.1>,
      <created by zg
	started at 2013-02-22 03:50:02.797 -0500,
	POWCHK enabled, PULCHK disabled,
       configuration hash MD5:
       86 BA 57 50 F2 9D 5C 9B 26 00 A9 28 5F 66 2E 89
       data hash MD5: 64K
       65 1E 53 10 B0 45 F7 48 10 A3 84 CE CD 35 5C 6F>)
(   2,<2013-02-22 03:51:12.875 -0500>,<Administrator>,<X>,<proc1d>,<TOPSPIN 2.1>,
      <Start of raw data processing
       efp LB = 0 FT_mod = 6 PKNL = 1 PHC0 = 0 PHC1 = 0 SI = 32K 
       data hash MD5: 32K
       C9 8D 0B 0D 56 E0 BB 95 DA 34 25 A1 60 79 71 AE>)
(   3,<2013-02-22 03:51:13.359 -0500>,<Administrator>,<X>,<proc1d>,<TOPSPIN 2.1>,
      <pk PHC0 = 67.02209 PHC1 = 0 
       data hash MD5: 32K
       BD D5 8B 1D AB DB 2C B2 15 B5 8E A6 91 03 F4 98>)
(   4,<2013-02-22 03:51:13.609 -0500>,<Administrator>,<X>,<proc1d>,<TOPSPIN 2.1>,
      <abs ABSG = 1 
       data hash MD5: 32K
       95 CB C6 26 8F 5D 95 5F 03 07 75 E2 B0 5A B3 9D>)
(   5,<2013-02-22 03:51:13.750 -0500>,<Administrator>,<X>,<proc1d>,<TOPSPIN 2.1>,
      <abs ABSG = 2 
       data hash MD5: 32K
       BB AD FD BC 59 51 C1 42 27 E3 07 A2 45 95 8C 0F>)
(   6,<2013-02-22 03:51:13.906 -0500>,<Administrator>,<X>,<proc1d>,<TOPSPIN 2.1>,
      <abs ABSG = 3 
       data hash MD5: 32K
       58 09 29 61 13 A1 44 34 AE AE 32 44 50 EE 75 7A>)
(   7,<2013-02-22 03:51:14.047 -0500>,<Administrator>,<X>,<proc1d>,<TOPSPIN 2.1>,
      <abs ABSG = 4 
       data hash MD5: 32K
       AD 35 EF 2B 5F 3A 20 B3 74 C9 68 87 EA 55 57 A7>)
(   8,<2013-02-22 03:51:14.250 -0500>,<Administrator>,<X>,<proc1d>,<TOPSPIN 2.1>,
      <abs ABSG = 5 
       data hash MD5: 32K
       CF 5D 74 36 B4 5F 4C E9 EB DB 05 4F 5A 36 84 2D>)
$$ ##END=
$$ 
$$ $$ hash MD5
$$ $$ DA 89 9D 40 A1 1E EA 5D 7F 48 9C 02 C1 32 AD BA
##$RELAX= 
##$RELAX= 
##$RELAX= 
##$RELAX= 
##$RELAX= 
##$RELAX= 
##$RELAX= 
$$ Bruker specific parameters
$$ --------------------------
##$DU= <E:\>
##$EXPNO= 10
$$ [...]
150 150 150 150 150 150 150 150
##$TP07= 0
##$TPNAME0= <>
##$TPNAME1= <>
##$TPNAME2= <>
##$TPNAME3= <>
##$TPNAME4= <>
##$TPNAME5= <>
##$TPNAME6= <>
##$TPNAME7= <>
##$TPOAL= (0..7)
0.5 0.5 0.5 0.5 0.5 0.5 0.5 0.5
##$TPOFFS= (0..7)
0 0 0 0 0 0 0 0
##$TUNHIN= 0
##$TUNHOUT= 0
##$TUNXOUT= 0
##$USERA1= <user>
##$USERA2= <user>
##$USERA3= <user>
##$USERA4= <user>
##$USERA5= <user>
##$V9= 5
##$VALIST= <valist>
##$VCLIST= <CCCCCCCCCCCCCCC>
##$VD= 0
##$VDLIST= <DDDDDDDDDDDDDDD>
##$VPLIST= <PPPPPPPPPPPPPPP>
##$VTLIST= <TTTTTTTTTTTTTTT>
##$WBST= 1024
##$WBSW= 4
##$XGAIN= (0..3)
0 0 0 0
##$XL= 0
##$YL= 0
##$YMAX_a= 574059
##$YMIN_a= -571189
##$ZGOPTNS= <>
##$ZL1= 120
##$ZL2= 120
##$ZL3= 120
##$ZL4= 120
##$ABSF1= 14.98509
##$ABSF2= -5.573092
##$ABSG= 5
##$ABSL= 3
##$ALPHA= 0
##$AQORDER= 0
##$ASSFAC= 0
##$ASSFACI= 0
##$ASSFACX= 0
##$ASSWID= 0
##$AUNMP= <proc_prof1d_extract_pilot.lims>
##$AXLEFT= 0
##$AXNAME= <>
##$AXNUC= <1H>
##$AXRIGHT= 0
##$AXTYPE= 0
##$AXUNIT= <>
##$AZFE= 0.1
##$AZFW= 0.1
##$BCFW= 0
##$BC_mod= 0
##$BYTORDP= 0
##$COROFFS= 0
##$CY= 15
##$DATMOD= 1
##$DC= 0
##$DFILT= <>
##$DTYPP= 0
##$F1P= 0
##$F2P= 0
##$FCOR= 0.5
##$FTSIZE= 32768
##$FT_mod= 6
##$GAMMA= 0
##$GB= 0
##$INTBC= 1
##$INTSCL= 1
##$ISEN= 128
##$LB= 0
##$LEV0= 0
##$LPBIN= 0
##$MAXI= 10000
##$MC2= 0
##$MEAN= 0
##$ME_mod= 0
##$MI= 0
##$NCOEF= 0
##$NC_proc= -8
##$NLEV= 6
##$NOISF1= 0
##$NOISF2= 0
##$NSP= 0
##$NTH_PI= 0
##$NZP= 0
##$OFFSET= 14.98509
##$PC= 1
##$PHC0= 67.02209
##$PHC1= 0
##$PH_mod= 1
##$PKNL= yes
##$PPARMOD= 0
##$PPDIAG= 0
##$PPIPTYP= 0
##$PPMPNUM= 2147483647
##$PPRESOL= 1
##$PSCAL= 4
##$PSIGN= 0
##$PYNMP= <proc.py>
##$REVERSE= no
##$SF= 400.02
##$SI= 32768
##$SIGF1= 0
##$SIGF2= 0
##$SINO= 400
##$SIOLD= 32768
##$SPECTYP= <>
##$SREGLST= <1H.CDCl3>
##$SSB= 0
##$STSI= 32768
##$STSR= 0
##$SW_p= 8223.68421052631
##$SYMM= 0
##$S_DEV= 0
##$TDeff= 65536
##$TDoff= 0
##$TI= <>
##$TILT= no
##$TM1= 0
##$TM2= 0
##$TOPLEV= 0
##$USERP1= <user>
##$USERP2= <user>
##$USERP3= <user>
##$USERP4= <user>
##$USERP5= <user>
##$WDW= 1
##$XDIM= 32768
##$YMAX_p= 467017400
##$YMIN_p= -652569
##$CURPLOT= <Network HP LaserJet P1505>
##$CURPRIN= <$Network HP LaserJet P1505>
##$DFORMAT= <normdp>
##$LAYOUT= <+/1D_H.xwp>
##$LFORMAT= <normlp>
##$PFORMAT= <normpl>
##$SURQMSG= 1
$$ End of Bruker specific parameters
$$ ---------------------------------
##NTUPLES= NMR SPECTRUM
##VAR_NAME=  FREQUENCY,     SPECTRUM/REAL,   SPECTRUM/IMAG
##SYMBOL=    X,             R,               I
##VAR_TYPE=  INDEPENDENT,   DEPENDENT,       DEPENDENT
##VAR_FORM=  AFFN,          ASDF,            ASDF
##VAR_DIM=   32768,         32768,           32768
##UNITS=     HZ,            ARBITRARY UNITS, ARBITRARY UNITS
##FACTOR=    0.250966925370066, 1,           1
##FIRST=     8223.43324360094, -33574,       -137399
##LAST=      0,             -25010,          -46327
##MIN=       0,             -652569,         0
##MAX=       8223.43324360094, 467017400,    0
$$ Real data points
##PAGE= N=1
##DATA TABLE= (X++(R..R)), XYDATA
$$ [...]
19541A87680a06150j0431B52666d7755j96563A92893a82927J0232A68440B264
19530B5085B136K9087b03013k6557i5001I6277e2060r4241A62699p312O5250a87955
19517b53595j03075a43856A46795Q2803F9983c24898J61153d3618j03960f5484
19506A41995b42798O0069n4647J08608A91310H8962a21888A29600c28683J42731
19496a85952b905k8017h130A41273m4271A0958L6534R4476K26148a68040M8214
19485a19826l4263N2499A13260a86129j66411H8368B5296M7340b18599H7357L2099
19474A19456O455b29133A56372D6626a49318I3750A6911b8067o6769j67839b1246
19462b19861B55581a03563l40717d0246o730a486C157e8623K783G4470b78065
$$ y = [187680, -106150, -116581, 252666, -47755, -244318, 192893, -182927, -172695, 168440, 2264, 25085, 2136, 31223, -203013, -229570, -95001, 96277, -52060, -146301, 162699, 155387, 220637, -187955, -253595, -356670, -143856, 146795, 229598, 69983, -324898, -163745, -43618, -147578, -65484, 141995, -242798, -182729, -237376, -128768, 191310, 88962, -121888, 129600, -328683, -185952, -2905, -30922, -8130, 141273, 97002, 10958, 47492, 141968, 368116, -168040, -119826, -154089, -101590, 113260, -186129, -352540, 88368, 25296, 72636, -218599, 87357, 119456, 125911, -229133, 156372, 46626, -149318, 93750, 16911, -28067, -94836, -262675, -21246, -219861, 255581, -103563, -444280, -40246, -46976, -1486, 3157, -58623, -55840, 74470, -278065]
19450B2050a40389k63576a27544C7163a51125I5930b02625e3297B4996K0482A4543
19438a17691r4201F0277L59330A62869i5894A26157d7057j46325n226A20899a42778
19426C26031a1772n8287m7323r8932R5a02240M411j7906j10744G5820f8796k47309
19414c16105A11538E0937O586M3187L0779o3559a09309k52265C24812e8760K1585
19403c7175l27053q9538b25425A62097J05673i2811A82247c02335C0447a20593
19392a91259B65674f1893K4636l2091k8312c7219j8955j23957C3628e4316A66971
19380b56973A59110p524e6898j64750K8447K4623C9836M6240e8469l2636j13828
19369b04933f3247k87643a6126j01781l3308H3877J22234D6300B1444a74441B68932
$$ y = [22050, -140389, -403965, -127544, 37163, -151125, 95930, -202625, -53297, 24996, 45478, 14543, -117691, -211892, 60277, 419607, 162869, -95894, 126157, -47057, -193382, -198608, 120899, -142778, 326031, -11772, -70059, -117382, -216314, -216219, -102240, -97829, -115735, -226479, 75820, -68796, -316105, 111538, 50937, 57523, 100710, 131489, 67930, -109309, -361574, 324812, -58760, -37175, -364228, -453766, -225425, 162097, 267770, -92811, 182247, -302335, 30447, -120593, -191259, 265674, -61893, -37257, -69348, -97660, -37219, -56174, -180131, 33628, -54316, 166971, -256973, 159110, 151586, -56898, -221648, -193201, -168578, 39836, 86076, -58469, -91105, -204933, -63247, -350890, -16126, -117907, -151215, 83877, 206111, 46300, 21444, -174441, 268932]
19357d0924k64521J51894e7692l6752r2902M1990B50478c83928a53418d9754j49691
19346a99445A6477a15959q3707B86843g6433K9018o4197A97311q8092C7878J00025
19335A37903a83542I5366h0179A52837A6748b38327B04744f0225k77812Q8590
19325b49447n665G2515o150L393h0999B10847a45969J3079m9105G7257a02441
19313f3770q7879H3963a08619H4227K9903a80312Q9099L4770l19206B02995d4484
19301a30697H964M2323d23280f5121A0727c3462l29314a26241G126J74709a81787
19289b4132p3632k21814q3687d8858A39565a60216j44052B9390M1223a72094N5308
19278a16786j66648m9377A36170a71863C8169a46231j5613A34543i8917H4121
$$ y = [-40924, -305445, -153551, -57692, -94444, -187346, -145356, 250478, -383928, -153418, -49754, -199445, 16477, -115959, -199666, 286843, -76433, -47415, -111612, 197311, 109219, 37878, 137903, -183542, 95366, -80179, 152837, 16748, -238327, 204744, -60225, -338037, -249447, -255112, 72515, 66365, 69758, -80999, 210847, -145969, -132890, -181995, 77257, -102441, -63770, -151649, 83963, -108619, 84227, 114130, -180312, -91213, -56443, -375649, 202995, -44484, -130697, 8964, 51287, -423280, -65121, 10727, -33462, -362776, -126241, 7126, 181835, -181787, -24132, -97764, -319578, -403265, -48858, 139565, -160216, -304268, 29390, 70613, -172094, -116786, -283434, -332811, 136170, -171863, 38169, -146231, -161844, 134543, -98917, 84121]
19267b48668J07741B466c2042l9661k06325R7191C1245a83229B18126a96132b6080
19255b292l18381M6239F44J30707i310j60721P5590j33592N9942A4419K03537
19244B17956B9536b72066j79474d9034k02737A2519a62189Q0624C9258O1040J821
19233A02119D1939K9745a17834A76138f5161l8122L5188j07991l09527B58165
19222b60218A45474c13231a0522G5635a27271A71683L2046e6623r8685b1668I6982
19210d2920n1904o688n7399E0827a29589j33055J23694j35427d8365j64832B6994
19198a22279A85494p4138M3901a4851j90331A30401N6235h2831l0265e1478A00496
19186a13150l79108a86702A77717a09836n7687A06978d23132a91284e7110g285
$$ y = [-248668, -140927, 2466, -32042, -71703, -278028, -180837, 31245, -183229, 218126, -196132, -26080, -2292, -320673, -274434, 644, 131351, -9310, -170031, -94441, -228033, -168091, 14419, 217956, 29536, -272066, -451540, -49034, -251771, 12519, -162189, -81565, 39258, 100298, 102119, 41939, 71684, -117834, 176138, -65161, -103283, -68095, -176086, -485613, 258165, -260218, 145474, -313231, -10522, 75635, -127271, 171683, 203729, -56623, -155308, -21668, 96982, -42920, -94824, -101512, -158911, 50827, -129589, -262644, -138950, -274377, -48365, -213197, 26994, -122279, 185494, 111356, 155257, -14851, -205182, 130401, 186636, -82831, -113096, -51478, 100496, -113150, -492258, -186702, 177717, -109836, -167523, 106978, -423132, -191284, -57110, -7285]
19175E7114a93899a5213o1295m9573d9236A81600a71818A15642b4881n9817c7436
19163i9588J6209A14260a28587A50615L0362P9509B1492P1349N7952a10684C6508
19151b3610A65735d639j33594I4527i3206B16896C9307J11109o7560k8660a89415
19139c9789B1529p787R0067e0460m7272j20695j26566a38143D2808d22012P3542
19128c48470e2149B41077h2388B62596d18930H0453L4007a70486m378k802e0925
19116c0543k89534J57077C46531j70600i1931k8472n6118I7515b52486J17722
19106a34764M7495E899a02644K542l17348a2271j87432a8546H2090h8571k02895
19095b91466j3325j71341A77339j6455K993b32733A4640h2734b5024n4979A48233
$$ y = [57114, -193899, -15213, -76508, -126081, -49236, 181600, -171818, 115642, -24881, -84698, -37436, -99588, -83379, 114260, -128587, 150615, 180977, 260486, 21492, 92841, 150793, -110684, 36508, -23610, 165735, -4639, -138233, 94527, -93206, 216896, 39307, 150416, 82856, 54196, -189415, -39789, 21529, 13742, 103809, -50460, -97732, -218427, -344993, -138143, 42808, -422012, -348470, -52149, 241077, -82388, 262596, -418930, 80453, 114460, -170486, -174864, -177666, -50925, -30543, -320077, -163000, 346531, 175931, -91931, -120403, -176521, 97515, -252486, -134764, -87269, 5899, -102644, -100102, -417450, -12271, -199703, -18546, 82090, -88571, -291466, -304791, -476132, 177339, 160884, 163877, -232733, 14640, -82734, -25024, -80003, 148233]
19083B24778H0610e1717C4482a00289C0028J07391J20092a4532I0948b30589A28313
19071D7443J79539a1925k43224A16942j5304C7185k749a8366j72874A4032L9387
19060E3419a73358q0483E9907R623c84695B12269h8001B59305a16422M291I4086
19048b0863o8338B4632b5070k06020g0423K1616j14883b1856l04259i9258j29801
19037b29059h6762j4759M5565B1854P0783e03053B58795o0958n1915D2163a10107
19025A92523C9032F3M9088c9633j2920J9105E54N3216L064J83273A07302C9254
19012c93152Q1008M5967c9073o2000J707B26599j07350b64498N5598e7748A8113
19000A8367g4785B6042J75472f518B46204c1710q2660J3332B00624c7111k99679
$$ y = [224778, 80610, -51717, 34482, -100289, 30028, 137419, 257511, -14532, 90948, -230589, 128313, 47443, 226982, -11925, -255149, 116942, 101638, 37185, 34436, -18366, -191240, 14032, 53419, -173358, -253841, 59907, 69530, -384695, 212269, -88001, 259305, -116422, -112131, 94086, -20863, -89201, 24632, -25070, -231090, -70423, -48807, -163690, -21856, -326115, -99258, -229059, -86762, -101521, -55956, 21854, 92637, -503053, 258795, 197837, 145922, 42163, -110107, 192523, 39032, 63, 49151, -39633, -52553, -33448, 554, 53770, 56834, 240107, 107302, 39254, -393152, -312144, -266177, -39073, -101073, -99366, 226599, 119249, -264498, -208900, -57748, 18113, 18367, -74785, 26042, 201514, -6518, 246204, -31710, -114370, -101038, 200624, -37111, -336790]
18989c36790a61009j14923J09031A7530b79552A50108a58589b864p7752r4058
18979a74674h4231D7110c73858i8956B39741A00884N9349d06701a11766C83517
18968C4905R671L025h8286B64856a89771P3105j88647B6000f8070A1277K2278
18957C3555f9793E46297A71802f220q1354a2273k8548k13636N6614B9322L8421
18946F7743J44005I8118a55129C1866M2903h8631G3723K43216f826I2038B5584
18934b40327B44170b32780Q143M6404h8562j95152h9347A73882a59165B68224
18923A27855b7124k2141G0903b62505B07929d53265b8474r115C957K5329g6426
18911a04473k02578M9579J04455A27281g9824G1924a02765l87200L1446d2516
$$ y = [-336790, -161009, -275932, -166901, 17530, -279552, 150108, -158589, -2864, -80616, -174674, -84231, 47110, -373858, -98956, 239741, 100884, 160233, -406701, -111766, 383517, 34905, 44576, 47601, -88286, 264856, -189771, -116666, -305313, 26000, -68070, 11277, 33555, -69793, 546297, 171802, -6220, -87574, -12273, -40821, -254457, -197843, 29322, 67743, 211748, 98118, -155129, 31866, 74769, -88631, 73723, 316939, -6826, 92038, 25584, -240327, 244170, -232780, -224637, -178233, -88562, -283714, -89347, 173882, -159165, 268224, 127855, -27124, -49265, 70903, -262505, 207929, -453265, -28474, -37589, 3957, 29286, -76426, -104473, -307051, -257472, -153017, 127281, -79824, 71924, -102765, -489965, -458519, -42516]
18900c7873r5609j9038K5168d7556n0868B6000J66261j4195b24641K7037k5261
18889b22865i9797B67733c66481D4475e5804o274A4106b60926i3895d5658A07537
18877a42315k42109F9576A9472q706J53436a5975m12881J74753b5177C3021b58075
18865b17934R5786b160o45788A96012A5084b66277F9635e49296K63067J21121
18855a65108g9078C18354d38432a27729A38342a5939B38150I3099j5067j05k572
18844G5355d0738k4460l27544h8296p6834m4882A16304a1848p2853l5948D2015
18832A58462b39463a5294p9005d543k60937D3859g9630o0859b7977j63396B6398
18820e0106r9188c0551A87709J1852k4233R1784F910f0209D1425L911N8240K6630
$$ y = [-37873, -133482, -152520, -127352, -47556, -98424, 26000, 192261, 178066, -224641, -197604, -222865, -99797, 267733, -366481, 44475, -55804, -62078, 14106, -260926, -93895, -45658, 107537, -142315, -384424, 69576, 19472, 10766, 164202, -15975, -428856, -254103, -25177, 33021, -258075, -217934, -122148, -2160, -647948, 196012, 15084, -266277, 69635, -549296, -286229, -165108, -79078, 318354, -438432, -127729, 138342, -15939, 238150, 93099, 78032, 77927, 75355, -40738, -65198, -392742, -88296, -165130, -210012, 116304, -11848, -84701, -120649, 42015, 158462, -239463, -15294, -94299, -4543, -265480, 43859, -79630, -140489, -27977, -191373, 26398, -50106, -149294, -30551, 187709, 199561, 175328, 267112, 6910, -60209, 41425, 45336, 103576, 130206]
18808A30206O279F488K41911h7160A21938c3498A16302a50238a9796A53084M3387
18797A96471L2583f1268q1525B3037d72011C2630a22611K2331j81417A88198i1420
18785A68901a65237j14526J39452C86981a26798A35804f3236E8004a27901c446
18774B21551n7803c10952a8364D4724Q1344a62743j2020A26124E0453j3504B103
18762A21590a70457F398e4051A03461a21961j20681E3017f4923k3723A01522g7203
18750a96011k51047K03312q4306a26434k0502j69054R5821h2872F0850J01947
18740A62797n0020b6648A07309J03744b11707e7041k70887i6346B14079A03133
18729E4971a30410a3218A93263N6286c39091A53519J3996h4785B7624h3238j06175
$$ y = [130206, 136485, 6488, 248399, -87160, 121938, -33498, 116302, -150238, -19796, 153084, 196471, 229054, -61268, -142793, 23037, -472011, 32630, -122611, -100280, -281697, 188198, -91420, 168901, -165237, -279763, -140311, 386981, -126798, 135804, -63236, 58004, -127901, -3446, 221551, 163748, -310952, -18364, 44724, 126068, -162743, -174763, 126124, 50453, 36949, 2103, 121590, -170457, 6398, -54051, 103461, -121961, -242642, 53017, -64923, -88646, 101522, -77203, -196011, -447058, -243746, -328052, -126434, -146936, -315990, -220169, -82872, 60850, 162797, 112777, -26648, 107309, 211053, -211707, -57041, -327928, -96346, 214079, 103133, 54971, -130410, -13218, 193263, 249549, -339091, 153519, 167515, -84785, 27624, -83238, -189413]
18718a89413b4920B93975C2145e02635C2910a44315I2748l2936b49717l38750
18708e88467b04725E5003b82584N5116G1644g1007A20217c05461g3395C98766
18697B833L12842a08976m8584C28205a98183j30795C030a90889R1021M5470m7675
18686a02073K4390a9663A51322c04383J16559I9440b79156f0721k51866D39809
18675f7618H5807P3192c41319A80927J07080b8968q067d716A85545c89627I9140
18663a6908j44534k93082c4723k2112j0100j2114K6065n8808k62782g588q7868
18652i5456K9551b6604l1062j6783c1963n6814L2100B0226J9717K9100b60309
18640B7181J35762a50222F3456J34728a83491D4588K20607D0608M0810J628N456
$$ y = [-189413, -24920, 293975, 32145, -502635, 32910, -144315, 92748, 59812, -249717, -588467, -204725, 55003, -282584, -227468, 71644, -71007, 120217, -305461, -73395, 398766, 2833, 315675, -108976, -157560, 328205, -198183, -328978, 3030, -190889, -99868, -54398, -102073, -77683, -19663, 151322, -304383, -187824, 99440, -279156, -60721, -312587, 439809, -67618, 85807, 158999, -341319, 180927, 288007, -28968, -37035, -4716, 185545, -389627, 99140, -16908, -161442, -454524, -34723, -56835, -66935, -79049, -52984, -111792, -374574, -7588, -95456, -65905, -26604, -57666, -74449, -31963, -88777, -56677, 20226, 39943, 69043, -260309, 27181, 162943, -150222, 63456, 198184, -183491, 44588, 265195, 40608, 81418, 83046, 88502]
18629H8502a94621g9590C912K30295r1830E0447J94499b47762j9940F8495a2005
18617H8532a40111A78658b41310b0307j69201l2999q06B1560K81949b49799A66421
18605a13817p6757c3723f768A3909J51956p3029a42188G4147a31102j50080j01477
18594c82659J02219J14418B4802c3514j53419A31463a10334k52942A04788a95670
18583B0984a4469A8138F69a3083k60769R5793A09187b49365A58794a5427e100
18571A10726g3305r8719j8326h4002F8202g1535A37595l9492a21073m9100B69590
18559G3241c30034D4815a35888J0033A5300a24022A9805M0303c33372g9431B30229
18547d1805E3227f886q0676k25235h5198q4507C3175b05708b1431j29935j43481
$$ y = [88502, -194621, -79590, 3912, 234207, 142377, 50447, 244946, -247762, -267702, 68495, -12005, 88532, -140111, 178658, -241310, -20307, -189508, -222507, -223313, 21560, 303509, -249799, 166421, -113817, -190574, -33723, -6768, 13909, 165865, 92836, -142188, 74147, -131102, -281182, -382659, -280440, -166022, 24802, -33514, -186933, 131463, -110334, -363276, 104788, -195670, 20984, -14469, 18138, 669, -13083, -273852, -178059, 109187, -249365, 158794, -15427, -5100, 110726, -73305, -172024, -190350, -84002, 68202, -71535, 137595, 98103, -121073, -170173, 269590, 73241, -330034, 44815, -135888, -125855, 15300, -124022, 19805, 60108, -333372, -79431, 230229, -41805, 53227, -6886, -87562, -312797, -85198, -169705, 33175, -205708, -21431, -151366, -294847]
18536b94847A75123a79881K5032j25459A19167i5880q7409g4372p2682c5612A35045
18524H5458N8212d0770n28366b78725a18071k89283J06395k1229E910K0075K688
18513B8673a85481N2810A91959d21217a04497k38139J61813D2905f2755l43260
18503d06015E8552J99678D9749h6152L3303B05704C0246J80024b72381A73130
18492f2694j56854h5378F992h1383C7003c7497k86172R5392A17226P4582a59289
18480i4272p6122j04256Q4213A75162n8576K01181a48581O1085g049A22051c05749
18468c83546E9827J71507a24239c3153k76330e0408n2535a9465A20924e6731B81044
18456D07796B6868a95173L9698O8298j57539A32033b0370m5385A84381A6036J34054
$$ y = [-294847, 175123, -179881, -154849, -280308, 119167, -95880, -183289, -74372, -147054, -35612, 135045, 85458, 143670, -40770, -569136, -278725, -118071, -407354, -300959, -322188, 5910, 25985, 28673, -185481, -132671, 191959, -421217, -104497, -342636, -180823, 42905, -62755, -406015, 58552, 258230, 49749, -86152, -52849, 205704, 30246, 210270, -272381, 173130, -62694, -219548, -85378, 6992, -81383, 37003, -37497, -323669, -228277, 117226, 191808, -159289, -94272, -170394, -274650, -190437, 175162, 116586, 317767, -148581, -87496, -7049, 122051, -305749, -383546, 59827, 231334, -124239, -33153, -309483, -50408, -102943, -19465, 120924, -56731, 281044, 407796, 26868, -195173, -155475, -87177, -244716, 132033, -20370, -65755, 184381, 16036, 150090]
18445A50090f7720A84786C8902b3516p9242l16556J39554B052a54370L623A37457
18433A9569c9207A13241j0694a06221j63113Q2715A22907A2467F069P2495J2924
18422I1488a97173r3686B9941A1959b28949i1450I054c4621D5335O6227a94443
18410A33197a41011A1967b25101K9378A73455a02325b2294j76238M2421c096o7994
18399g1090A85465a24896k06568a17882j59945A45169b1914A43811c31978A15974
18388b07056j10968d5896k64979I1526a00434F3696J26254i989B33913b3928A6208
18376A06757b44032C53516a21437N3534D308J06963f8933a3994j04349E4240J72425
18365B26665J3022I0186P5434C4397J29799f3720B71342a63456j7515F1710J19498
$$ y = [150090, -67720, 184786, 38902, -23516, -102758, -419314, -279760, 2052, -154370, -150747, 137457, 19569, -39207, 113241, 102547, -106221, -269334, -186619, 122907, 12467, 6069, 78564, 91488, -197173, -290859, 29941, 11959, -228949, -91450, 9054, -34621, 45335, 111562, -194443, 133197, -141011, 11967, -225101, -195723, 173455, -102325, -22294, -198532, -156111, -3096, -71090, 185465, -124896, -331464, -117882, -277827, 145169, -21914, 143811, -331978, 115974, -207056, -318024, -45896, -310875, 91526, -100434, 63696, 189950, -9989, 233913, -23928, 16208, 106757, -244032, 353516, -121437, -67903, 4308, 111271, -68933, -13994, -118343, 54240, 226665, 239687, 90186, 165620, 34397, 164196, -63720, 271342, -163456, -180971, 61710, 181208]
18354A81208e4023E2452b43160j27466c1311l1161g499l52048A27032l2781a37782
18342c03701j58425D5478M7099M6374D685M5406J1840c33054B46163k3922g7270
18330a82130k5104k7965a06322C08063d8356B87957A6518c2015k08747A06977
18319d8165J0291j3041j93734B44344i7605b0442l16689E4852A2236J22802a64626
18307C9491a37190b5816r2325B9940J77346a85724d7746j21862C1041P9140h7266
18295A52473o0690N2153A8356K91006B2709a7010r0831A2279Q4667P7676B8452
18283a86213D9957a71554A1776L2699K9078N1878a7383B0303Q5686c82921k12303
18272e95224a22048B8373i1059j4712A35241h5724M2038l26173h0446j5202n9603
$$ y = [181208, -54023, 52452, -243160, -370626, -31311, -62472, -7499, -359547, 127032, 94251, -137782, -303701, -462126, 45478, 92577, 138951, 4685, 50091, 61931, -333054, 246163, 222241, -77270, -182130, -207234, -235199, -106322, 308063, -48356, 287957, 16518, -32015, -240762, 106977, -48165, -37874, -50915, -244649, 244344, -97605, -20442, -337131, 54852, 12236, 135038, -164626, 39491, -137190, -25816, -118141, 29940, 207286, -185724, -47746, -169608, 31041, 110181, -87266, 152473, 91783, 143936, 18356, 309362, 22709, -17010, -107841, 12279, 96946, 174622, 28452, -186213, 49957, -171554, 11776, 44475, 73553, 125431, -17383, 20303, 105989, -382921, -595224, -122048, 28373, -91059, -105771, 135241, -85724, -43686, -369859, -80446, -95648, -155251]
18261a55251c2992C92974c52339a14713c369k08606A15702J36999B0349b39754
18250a0013j19075k0678f3704j44767I3928e99048A16919g6816n2526K1422B28700
18238B10678d0159A57401b79954J34650j63576Q0908g4107l07001A15386C7528
18227C7320p600O0591a79196Q3111k1341g352j30388N4225A20971m2811l4509
18216D3651N7065a69547A44528b34656c0013F7226P2350b07799M1369d6199j82891
18205b29090J12073F9829C1798a58001G1786b33065B46825p0769b32272B63565
18194b52106D0109a61407B51064Q3692c69740Q0766R1553M6961C0118b7358A72418
18182b63986A40740N2928a4309j86216q322F6141J9631b623B33390a01095J8516
$$ y = [-155251, -32992, 392974, -352339, -114713, -3369, -211975, 115702, 252701, 20349, -239754, -10013, -129088, -149766, -63704, -208471, 93928, -599048, 116919, -76816, -129342, -107920, 228700, 210678, -40159, 157401, -279954, -145304, -308880, -227972, -74107, -381108, 115386, 37528, 37320, 29720, 90311, -179196, -96085, -117426, -7352, -137740, -83515, 120971, 78160, 43651, 100716, -169547, 144528, -234656, -30013, 67226, 139576, -207799, -166430, -46199, -229090, -117017, 69829, 31798, -158001, 71786, -233065, 246825, 176056, -232272, 263565, -252106, 40109, -161407, 251064, 334756, -369740, -288974, -197421, -150460, 30118, -27358, 172418, -263986, 140740, 193668, -14309, -200525, -208847, 66141, 85772, -2623, 233390, -101095, -82579]
18171h2579j36183j72919B03657B0262J02183a95075B25531a26217A68899l9120
18161A29779a98444B85648E9815d2554A84697c53047f4187j3561A21435b44955
18150G0030K8909a87593c0224j46153A67349a05609E5696b4470G4137J57944E5066
18138i3738o8619m3323R7733o4409j08207B45055C531a71959B19739b11510C4298
18126f0769B0952b1485k5853j62068h5606A45624h2955k22525A16249k1048m7173
18115D8028b61273C552a78766N8924B1264e824A40636E679a27429G6239a77021
18103i2554p7813G9799a56114A81532k0744a24209q0528A83111M4419b57376A97793
18091A28051b08118E6249a96547A8735Q6087a01447q2059E3374a33k26150e5167
$$ y = [-82579, -218762, -391681, 203657, 20262, 122445, -195075, 225531, -126217, 168899, 129779, -198444, 285648, 59815, -42554, 184697, -353047, -64187, -77748, 121435, -244955, 70030, 98939, -187593, -30224, -176377, 167349, -105609, 55696, -24470, 74137, 232081, 55066, -93738, -162357, -205680, -107947, -172356, -280563, 245055, 3531, -171959, 219739, -211510, 34298, -60769, 20952, -21485, -47338, -209406, -85606, 145624, -82955, -305480, 116249, 95201, 48028, -261273, 3552, -178766, -119842, 21264, -5824, 140636, 5679, -127429, 76239, -177021, -92554, -170367, 79799, -156114, 181532, 160788, -124209, -204737, 183111, 227530, -257376, 197793, 128051, -208118, 56249, -196547, 18735, 104822, -101447, -183506, 53374, -133, -226283, -55167]
18079I0839R5526B8097O2137f4833k74800A90262d70469G9681n35B8769K16351
18068B45120q0012c09535B18549G7604a26678k43862C458a20689D8847a59283
18057E8043J38048a3430k44891G8353a06466A20456f24176A02320h9063a2937
18046C0238a63646N9262j78377J30272d497j04224A67993P5191a95623A75971
18035a23418H2291b4629k76962B20313B3051L4171d74389K30606k14909a22449
18024A89765e8365r665l05986A24427L6876b84270J7241A01963b40922e5277e268
18012A63042J3320m8280E4496a14142H2237K72400b70275D2101J21981a1569C486
18000C20841j59031M0596c5378q2827B95926I5199P2668L2387i0756B99569b55481
$$ y = [90839, 186365, 28097, 90234, -64833, -339633, 190262, -470469, 79681, 79146, 28769, 245120, 165108, -309535, 218549, 77604, -126678, -370540, 3458, -120689, 48847, -159283, 58043, 196091, -13430, -258321, 78353, -106466, 120456, -624176, 102320, -89063, -12937, 30238, -163646, -104384, -282761, -152489, -4497, -108721, 167993, 243184, -195623, 175971, -123418, 82291, -24629, -301591, 220313, 23051, 57222, -474389, -243783, -458692, -122449, 189765, -58365, -68030, -374016, 124427, 161303, -284270, -267029, 101963, -240922, -55277, -5268, 163042, 176362, 128082, 54496, -114142, 82237, 354637, -270275, 42101, 164082, -11569, 3486, 320841, 161810, 202406, -35378, -118205, 295926, 95199, 167867, 200254, -90756, 299569, -255481]
17988a0579k17216H0688j4394O6358A523b77803f0192j46935P2637c2505E8707
17976a25473j28342d1291j55781A69176i9534o379G1217b8955j48840I0029J81141
17965B71170A4850i8079M6660F9562d0000A84005b56719j1788A64001c93328C37898
17953H4584L2045e033j69463G6657c31F5810J90148g3644j47336A00465j0005
17942I0460a40105c5891n4072J2258C8723j0386J37475b5598A13980M9864O6725
17931B30569C1079R0897b86332f6008A53030L3532p6979M8228i8971j37502a10660
17919c2079B6209N5726l8235J7488a83934B07174k3712f0696j6164k08868P9213
17908b06515A72463a67237j26852a03017A14366C0680K18761I2993C8291N8188
$$ y = [-10579, -227795, 80688, 66294, 132652, 1523, -277803, -60192, -207127, -134490, -32505, 58707, -125473, -253815, -41291, -197072, 169176, -99534, -105913, 71217, -28955, -177795, 90029, 271170, 14850, -98079, -51419, 69562, -40000, 184005, -256719, -268507, 164001, -393328, 337898, 84584, 116629, -5033, -174496, 76657, -331, 65810, 255958, -73644, -220980, 100465, 90460, -140105, -35891, -89963, -77705, 38723, 28337, 165812, -25598, 113980, 163844, 230569, 31079, 121976, -286332, -66008, 153030, 186562, 109583, 157811, -98971, -236473, -110660, -32079, 26209, 81935, 43700, 61188, -183934, 207174, 183462, -60696, -76860, -285728, -206515, 172463, -167237, -294089, -103017, 114366, 30680, 249441, 92993, 38291, 96479]
17898I6479a35334A69159e888o6647G8140b47155e1296j51274J01069d3255A56547
17886B3759h3999F9844f2455E9962M5595k659g4159n9001j89135F0847g6835B93022
17873b61643J30273N4192a6603m048D13809A38950J3085a27463B00319A1936J8758
17862C0694L41382C4128a18356I0440L6123J8380J11060j04668m6657c80083a29443
17850c4631p4933C33222e6504B20838H0632J51541q2067a0561H0432a90233B60913
17838e1928C10921j49560a19342A17137a79338A71479a66595B31217a30446A40164
17827C0669J31844g0914k952L3925r8639O2440I4432Q1200a62731M0615A4282
17815f9630o2215j95789A22229B0467a61026M7695c7822j79684A43077c17590
$$ y = [96479, -135334, 169159, -5888, -72535, 78140, -247155, -51296, -202570, -101501, -43255, 156547, 23759, -83999, 69844, -62455, 59962, 105557, 102898, -74159, -133160, -322295, 60847, -76835, 293022, -261643, -131370, -77178, -16603, -20651, 413809, 138950, 152035, -127463, 200319, 11936, 30694, 372076, 34128, -118356, 90440, 126563, 144943, 256003, 151335, 104678, -380083, -129443, -34631, -109564, 333222, -56504, 220838, 80632, 232173, 150106, -10561, 80432, -190233, 260913, -51928, 310921, 161361, -119342, 117137, -179338, 171479, -166595, 231217, -130446, 140164, 30669, 162513, -70914, -73866, -39941, -138580, -76140, 94432, 175632, -162731, -122116, 14282, -69630, -131845, -327634, 122229, 20467, -161026, -113331, -37822, -217506, 143077, -317590]
17804h3292k42224H4186R2923O0072m8292b2834o4300m5175a6200j98219B56138
17792a09218j78765H2558a34191N656f1603n162a1129j26381Q142k52053J00041
17781b81380C4974M5974b29001A59141d4206B3069d8177J462B04974a33908N9079
17770g4829B83734a62426r0266H1008J3019a41632A45436k0234g2213B50051A2947
17758a22403B384Q2664L807J27434i5106r8270f8274C17936A12023m6648a24082
17746D8605J03730a42744j43542p867B68396M4855j38956K03979c18670R6212
17736b22458A05763b20428B59941b6058j01125D3717e2625B46491E0663b55045
17725E1096A9433d98798C6647c7222k41118p404J7597g6142m23021B01523e3114
$$ y = [-83292, -325516, 84186, 177109, 237181, 188889, -22834, -87134, -132309, -16200, -214419, 256138, -109218, -287983, 82558, -134191, -128535, -61603, -66765, -11129, -137510, -129368, -381421, -281380, 34974, 80948, -229001, 159141, -44206, 23069, -48177, -46715, 204974, -133908, -74829, 283734, -162426, -252692, 81008, 94027, -141632, 145436, 125202, -72213, 250051, 12947, -122403, 2384, 85048, 88855, 216289, -95106, -193376, -68274, 317936, 112023, 65375, -124082, 48605, 152335, -142744, -286286, -294153, 268396, 313251, 174295, 378274, -318670, -222458, 105763, -220428, 259941, -26058, -127183, 43717, -52625, 246491, 50663, -255045, 51096, 19433, -498798, 36647, -37222, -278340, -285744, -268147, -76142, -499163, 201523, -53114]
17713D7067b9203a445I3749f6838G1384b15781A79688b41007B71473J00889b76531
17701a39274A09210A1650K16251G1519d8912A36652l6420f2436A1467c0181l8656
17690f8837j16510B7124a48104b4222q6517m2280p0752H2760J65296j421j7394
17679B29241E1723J45143q7049n3509K15301F0759f3330E3660j0104b17951c7492
17667A07277a01408E5265g9344E9983B1576a06953l0618D5703g8741A76734c7028
17655D7228k2745a1908j29804O2693A06857j6009a20235N4784B7074Q0156o264
17644A00966a38519o1361d3436B40563b11663c9099j80802A51421d4914q4A9470
17632a2984H0335m894J31982Q8249j13033B0170K45177H3821A1995c8590H0000
$$ y = [47067, -29203, -1445, 93749, -66838, 71384, -215781, 179688, -241007, 271473, 372362, -276531, -139274, 109210, 11650, 227901, 71519, -48912, 136652, 100232, -62436, 11467, -30181, -68837, -185347, 27124, -148104, -24222, -110739, -153019, -223771, 82760, 248056, 246635, 229241, 51723, 196866, 109817, 56308, 271609, 60759, -63330, 53660, 43556, -217951, -37492, 107277, -101408, 55265, -79344, 59983, 21576, -106953, -137571, 45703, -78741, 176734, -37028, 47228, 24483, -11908, -141712, -79019, 106857, 90848, -120235, -65451, 27074, 107230, 100966, -138519, -199880, -43436, 240563, -211663, -39099, -219901, 151421, -44914, -44998, 19470, -12984, 80335, 75441, 207423, 295672, 182639, 20170, 265347, 83821, 11995, -38590, 80000]
17620A50181l5252J14076b54911B73924F7068j7586J32971J090e3777B34685n5719
17609A78966J49986g1288D8417J07936b08212A29588N5353O098E0431h139l68865
17598c77004B25943a54808A1744M7731N3978i4124k6383E7273A8606J17224I110
17586B79622d5429F766L28041a0429j72355B14021p0013g8745a2657k09898b4410
17574B86618a29970d9104B71458D5428f89B45442e3084I6147a61139g6103C74163
17562a36298A48631i8980L7744A65854p5385K2970K15819A61028J42267a04032
17551b03270A65551c435A04974J77695b1403B68010A8401R3307M9626j5989J4208
17540A59553o3734a26495A54127o5546b31224Q8295A99415M1870i8317A45900
$$ y = [150181, 114929, 229005, -254911, 273924, 67068, 49482, 182453, 183543, -53777, 234685, 178966, 328952, -71288, 48417, 156353, -208212, 129588, 184941, 191039, 50431, -8139, -377004, 225943, -154808, 11744, 59475, 113453, -94124, -120507, 57273, 18606, 135830, 9110, 279622, -45429, 6766, 334807, -10429, -182784, 214021, 144008, -78745, -12657, -222555, -24410, 286618, -129970, -49104, 271458, 45428, -689, 245442, -53084, 96147, -161139, -76103, 374163, -136298, 148631, -98980, -61236, 165854, 90469, 113439, 329258, 161028, 303295, -104032, -203270, 165551, -3435, 104974, 282669, -21403, 268010, 18401, 111708, 161334, 145345, 159553, 95819, -126495, 154127, 88581, -231224, -142929, 199415, 241285, -98317, 145900]
17529D2434K88380c9286F919K52389B6459K45357p2194J99383a54994G8251L28838
17518D07089e3488A46930G187e9221A23874i583I4531c92704F64337A006J87275
17507A88281J97804q4527b25531O0765B79378h5313C5086K4115K29467a64513
17496a15380A14436L3747O5655H8922J4288a87866A39664F5103J86863R3574j10012
17485B35528P9228A0006R4630K35219d4319A23532J90967p503d9721A50495J17548
17474B68043e4138G4508B9061K59277d0697B18079r7612k021R0426K8581J96717
17463D34170I7905O3719M61M6094J18002D7050K48520E0343c1511j2585A14138
17451A94358M32034j7000j92618A29150O3745a58174C42699D6090g1966B76351
$$ y = [42434, 330814, -39286, 6919, 259308, 26459, 271816, 199622, 399005, -154994, 78251, 407089, -53488, 146930, 7187, -59221, 123874, -9583, 94531, -392704, 664337, 1006, 188281, 386085, 301558, -225531, -164766, 279378, -85313, 35086, 59201, 288668, -164513, -115380, 114436, 148183, 213838, 88922, 103210, -187866, 139664, 65103, 251966, 345540, 235528, 314756, 10006, 104636, 339855, -44319, 123532, 314499, 306996, -49721, 150495, 268043, -54138, 74508, 29061, 288338, -40697, 218079, 120467, 118446, 208872, 237453, 434170, 97905, 161624, 162085, 208179, 326181, 47050, 295570, 50343, -31511, -44096, 114138, 194358, 626392, 609392, 416774, 129150, 192895, -158174, 342699, 46090, -71966, 276351]
17440B49076n481n8579c10B77095M602Q7231A65359a67691C0030L36893p917A28625
17427B11833A6678N5639M9758E3363Q8666j8142J70708N9381M3729A40100J74604
17416C14704J72034k37004j3502J40319J82793B00396J24038G576L91424j70140
17406B28860n1096M5747a42459A7069Q6935N2516R0627F9772Q2679L4289N7188
17395B43928G1614K321L10407r4887d12B13439b76700A67824J766M9843n4816
17384A64617g027j92749O3218D01414A87768m7215o5951J54398H0504c3173B50160
17372G8608P4402o4089c556A64876L1285J48047n4538J6592j24566F5867K84910
17361C50777j08790K20723A42731K43568F2627A3562K31508j03060C8220J30141
$$ y = [249076, 243595, 185016, -310, 277095, 281697, 368928, 165359, -167691, 30030, 366923, 359006, 128625, 211833, 16678, 72317, 122075, 53363, 142029, 123887, 294595, 353976, 397705, 140100, 314704, 486738, 249734, 236232, 376551, 559344, 200396, 324434, 7576, 399000, 228860, 177764, 223511, -142459, 17069, 104004, 156520, 247147, 69772, 152451, 186740, 243928, 71614, 73935, 384342, 289455, -412, 213439, -276700, 167824, 169590, 219433, 164617, -7027, -199776, -136558, 401414, 187768, 140553, 74602, 229000, 80504, -33173, 250160, 78608, 153010, 88921, -3556, 164876, 196161, 344208, 289670, 306262, 181696, 65867, 350777, 241987, 462710, 142731, 386299, 62627, 13562, 245070, 142010, 38220, 168361]
17351A68361a91715B50136F9395J87247K5475n1460k2255J49312G5277k9922L86907
17340D32262A13133m3745d6058D22713H2265L18331E0776L7575b23975C08897
17329A34006J55382A30252C8972J9198A4691b5857l91B74267I9829K4662b7672
17317A52556M93054A56485D0472K95600E6711L27024r4329C2286L11290l0040
17307C13536p9963J20266j69741o6313J31608o2247n5820K92080H7721Q1179B4063
17295a8218B95022q8245H8039K4760M58503a73158A94780Q0051J7334A30398J57314
17284B87712J24541A35169a98313B38236c0792l1426A89220L9878A12962K7904
17274A40866J61541I308N16164H9873J09522I1007J29700p4651J87487r5124O7232
$$ y = [168361, -191715, 250136, 69395, 256642, 282117, 230657, 208402, 357714, 75277, 45355, 432262, 113133, 69388, -46058, 422713, 82265, 400596, 50776, 88351, -223975, 308897, 134006, 289388, 130252, 38972, 58170, 14691, -25857, -26248, 274267, 99829, 124491, -27672, 152556, 645610, 156485, 40472, 336072, 56711, 383735, 289406, 32286, 343576, 313536, 233573, 353839, 184098, 117785, 249393, 187146, 131326, 423406, 87721, 168900, 24063, -18218, 295022, 206777, 88039, 112799, 571302, -173158, 194780, 274831, 292165, 130398, 287712, 412253, 135169, -198313, 238236, -30792, -62218, 189220, 229098, 112962, 140866, 302407, 9308, 525472, 89873, 199395, 91007, 220707, 146056, 333543, 238419, 305651]
17263C05651m8754K10783b4263B97299A41928D9598P2316M3277L62710B29577
17252C27208E5992M62622k03086j40572F6677K85172H6318m664K84294e3744C33012
17240C18884K44173B40153B78K94800I5405N34617B61149A30095r011K78098j07973
17229B91209p1796J75803j20880A13359L63201r2682J09625j46703p0689b2075
17218B46664J21863O0841b2834B9011O348K5429K28674N5047D4809K67149A38872
17206B61393k4361C4024K21134F3200L00060j21283g86D35160j08988k696p0851
17195B52625F2508J05502J3009L1648P3914j1117K31122A49495J93045J36277
17185D78817q6209D4050a62803D73348B00085J37759A60688C6372L18493j74462
$$ y = [305651, 256897, 467680, -24263, 297299, 141928, 49598, 121914, 165191, 527901, 229577, 327208, 55992, 518614, 315528, 174956, 66677, 351849, 86318, 81654, 365948, -53744, 333012, 318884, 563057, 240153, 278, 295078, 95405, 630022, 261149, 130095, 121084, 399182, 291209, 219413, 395216, 274336, 113359, 476560, 383878, 493503, 346800, 276111, -22075, 246664, 368527, 429368, -22834, 29011, 35359, 60788, 289462, 344509, 44809, 311958, 138872, 261393, 237032, 34024, 255158, 63200, 363260, 241977, -786, 435160, 326172, 323476, 252625, 62508, 168010, 181019, 212667, 286581, 275464, 506586, 149495, 342540, 478817, 392608, 44050, -162803, 473348, 200085, 337844, 160688, 36372, 354865, 180403]
17175A80403J09398M3543n5159K33873B03099K12323j77895l1242P7327D4686
17164C54670M6318J61251A30555Q4122K06113o6843K09121q6697k05586J3728
17154B84513K07388J25251l05074K3273m4180J2839J33483o6555H1629J62543
17144B44172l0303K0756m4519R4109j21902M9775L44749B76458L00051l3462j18781
17133D24266k8393M4389A80369K90371A8796L39429K59180B68660M48905D4402
17122E14781k51737N9440k9645L83123A88463J00451L9635N26965B21771L58793
17112E80564k32523J32522N130k37173L80867o3042B48958K33291j62244K85891
17102F05896J55248A34046L15484q2560j36074K45991J12011J56117l50462K41016
$$ y = [180403, 289801, 333344, 278185, 512058, 203099, 415422, 237527, 206285, 283612, 44686, 354670, 400988, 562239, 130555, 214677, 420790, 353947, 563068, 476371, 270785, 284513, 491901, 617152, 312078, 335351, 291171, 304010, 437493, 370938, 81629, 244172, 213869, 234625, 190106, 284215, 162313, 212088, 556837, 276458, 576509, 543047, 424266, 395873, 440262, 180369, 470740, 18796, 358225, 617405, 268660, 717565, 44402, 514781, 263044, 322484, 292839, 675962, 188463, 288914, 328549, 855514, 221771, 580564, 348041, 480563, 485693, 248520, 629387, 566345, 248958, 482249, 320005, 605896, 761144, 134046, 449530, 366970, 230896, 476887, 588898, 745015, 394553, 635569]
17092F35569k76902K19633n7666J02360P0546k5971k04546J03521M8340r6472
17082E18412Q9933P1112q8697A96564L94995j86770J36202j02032q1075o8641
17072B89243J90429r4301J89684j31956Q353K88871j10641l3213L75573r0568
17062H81474j8824r7488k74343A90201K29971K42873q7681O3145o6090j96876
17052C75543K03084L87355k88869O5623K1468J01681C84423N4367n3944K37620
17042F22466k3647m52P3403j8050J46443J64956l75875J13790j28810J81666L1503
17031G87393j26029K53100q3966K0773m3296k37357K32570r2863q5319j73845
17021D51161L07606k52179L39742j39945j39157J80715k71639J65825Q3533K36194
$$ y = [635569, 358667, 578300, 520634, 622994, 693540, 667569, 463023, 566544, 614884, 518412, 608345, 679457, 590760, 196564, 591559, 404789, 540991, 438959, 357884, 289243, 479672, 385371, 575055, 443099, 451452, 740323, 629682, 596469, 972042, 881474, 862650, 765162, 490819, 190201, 420172, 663045, 575364, 638509, 572419, 375543, 578627, 965982, 677113, 742736, 764204, 865885, 384423, 438790, 384846, 622466, 598819, 598367, 671770, 653720, 800163, 965119, 589244, 703034, 574224, 755890, 787393, 661364, 914464, 830498, 851271, 807975, 570618, 803188, 710325, 625006, 451161, 758767, 506588, 846330, 706385, 567228, 747943, 476304, 642129, 725662, 961856]
17011I61856m07646L74444p0548q4165M14941l42533J92540l17615J96781k3371
17001H94684l8731J76196k9111M8016R738j70291o3631J66559N2969k23051j65473
16990F57874M24190o4121K26012k58243l2070J0700j64835J42334L9420K12480
16980A193741j67076j24999K1040L51853k57979q4193M7079J95353l76523J94256
16970I92552K24388m77393L35421J87279K25501j98269q446K1241k73147L916
16960A033043o2390J92592p1187o7559K48076K01455j48449k05402L14293m23835
16950A010637M6828K98956o1101j69965N2138K18861K02235m5914j09616M311
16940A447370L60840l29670O472n0500J8124J78379n0616n9757Q4069l8912k64141
$$ y = [961856, 554210, 928654, 858106, 773941, 1188882, 846349, 1038889, 721274, 918055, 894684, 855953, 1032149, 1003038, 1051054, 1060792, 890501, 826870, 993429, 1046398, 823347, 657874, 1082064, 1017943, 1243955, 985712, 953642, 964342, 799507, 941841, 981261, 1193741, 1026665, 901666, 922706, 1274559, 1016580, 932387, 979466, 1174819, 798296, 992552, 1216940, 739547, 1074968, 1262247, 1487748, 1289479, 1281033, 1302274, 1029127, 1033043, 970653, 1163245, 1092058, 1024499, 1272575, 1474030, 1325581, 1120179, 1434472, 1010637, 1057465, 1356421, 1295320, 1125355, 1177493, 1396354, 1598589, 1552675, 1443059, 1447370, 1808210, 1478540, 1485012, 1434512, 1452636, 1631015, 1580399, 1520642, 1604711, 1565799, 1301658]
16929A301658L45095k7023J02913j08613o1739m2453M56867j95133j71869J65299
16919A765002o6877K57323j16854K94536j72834k91355K81892k54529K22239k2655
16909A895888K0662R2936j09996J84066Q4915k59001J40922P9896k19716L45474
16899B256046j33366J38858J71870j63518p8348K5228j62101K74350k44507N82248
16889B666760k85804j59705L74827j1742k68964l51457O99558j73265K15872L08993
16879C015073l45836P5180j26000J34027P1082J34123m3195j12785K89130l0812
16869C059987k12049J38111K8460L47620K7451k16879p8694M21232j37810k6606
16859C350823M0162M42753j62618K01311k98579m5115L68464p7256K16170j16132
$$ y = [1301658, 1646753, 1619730, 1722643, 1614030, 1552291, 1509838, 1966705, 1771572, 1599703, 1765002, 1698125, 1955448, 1838594, 2133130, 1960296, 1668941, 1950833, 1696304, 1918543, 1895888, 1916550, 2009486, 1899490, 2083556, 2168471, 1909470, 2050392, 2130288, 1910572, 2256046, 2122680, 2261538, 2433408, 2269890, 2191542, 2216770, 2054669, 2329019, 2084512, 2666760, 2380956, 2221251, 2596078, 2584336, 2315372, 1963915, 2663473, 2490208, 2706080, 3015073, 2669237, 2744417, 2618417, 2752444, 2823526, 2957649, 2914454, 2801669, 3090799, 3059987, 2847938, 2986049, 3014509, 3362129, 3389580, 3172701, 3094007, 3515239, 3377429, 3350823, 3390985, 3833738, 3671120, 3872431, 3573852, 3528737, 3897201, 3819945, 4036115, 3919983]
16849C919983K84977j78277K16712j06972L08682k89534K9536M32359P7225q8334
16839D606357L38555k12425M14406P9052K67433k20864j30761O85085k61062j7596
16829E548180J43940k02953K74003J52546L259J8778K88358K25471l2814J92809
16819F611577L71232M07916N1151J5394l22663K31652L44929L53537k57385L03450
16809H110790j324L33891K09201L08762L0358M55122J23940L06252M576L08254
16799A0189822L53411L69082J26590K21060R0686Q14825J20196K70500o5464P61595
16789A3252303L51673P5796J29113P54605N75578K88255J68687P37196O15572
16780A6948778K93490P89589K18635P52371N58340O20145O09385Q15946O05577
$$ y = [3919983, 4204960, 4026683, 4243395, 4136423, 4445105, 4155571, 4185107, 4617466, 4694691, 4606357, 4944912, 4732487, 5146893, 5225945, 5493378, 5272514, 5141753, 5826838, 5565776, 5548180, 5692120, 5489167, 5763170, 5915716, 5918975, 5937753, 6226111, 6451582, 6418768, 6611577, 6982809, 7390725, 7441876, 7457270, 7134607, 7366259, 7711188, 8064725, 7807340, 8110790, 8109466, 8443357, 8652558, 8961320, 8991678, 9446800, 9570740, 9876992, 9881568, 10189822, 10543233, 10912315, 11038905, 11259965, 11350651, 12165476, 12285672, 12556172, 12490708, 13252303, 13603976, 13679772, 13808885, 14563490, 15139068, 15427323, 15596010, 16333206, 16948778, 17242268, 18031857, 18250492, 19002863, 19561203, 20181348, 20790733, 21606679, 22212256]
16771B2212256Q82629O29191Q22986J117834Q83743Q16963J157698Q31700J460083
16762C0815083Q38526J651544J139626J561319J488964J400646J951792J833361
16754D2680861K044648J996203J974646K477911K508746K496581K889246K816992
16746F1885834L440597L126185L836813L783318L492153M529473M705794N005212
16738I3805379M674317N397392N691337N513236N859514O177440O247488O014444
16730A39380547O541278O243973N775358N535088N353572M232766M227918L059895
16722A80350395K391084J319494J76354m12027j712418k534046l387516m613866
16714A71577454m775431n106654n915657n829712o765625o446468o043666o267217
$$ y = [22212256, 23094885, 23724076, 24547062, 25664896, 26548639, 27365602, 28523300, 29355000, 30815083, 31653609, 33305153, 34444779, 36006098, 37495062, 38895708, 40847500, 42680861, 44725509, 46721712, 48696358, 51174269, 53683015, 56179596, 59068842, 61885834, 65326431, 68452616, 72289429, 76072747, 79564900, 84094373, 88800167, 93805379, 98479696, 103877088, 109568425, 115081661, 120941175, 127118615, 133366103, 139380547, 145921825, 152165798, 157941156, 163476244, 168829816, 173062582, 177290500, 180350395, 182741479, 184060973, 184237327, 183825300, 182112882, 179578836, 176191320, 171577454, 166802023, 161695369, 155779712, 149950000, 143184375, 136737907, 130694241, 124427024]
16706A24427024o338353n962727n675207n436871n297133n099858m861381m650940
16698H1104554l933644l840337l643626l711964l475621l152945k965262k360144
16690E4021011k734179k319926k210808k516214j758519k029480j681924j507053
16682C7262908j703763j421262j773197j166439j370503j369127q60458r36120
16674B6662039j129780q81416r45829q62651j019357j082909J8728r82080o64498
16665A9112247o14128l63616j231849j9456o23351p82256j22608n73509o1049
16656A4720425o69414o43367k73864m42423R4743o50180o6160j059641L51097
16647A1361216o92466p2492l0794n07927m09058J39198l09958k46787m68067j68937
$$ y = [124427024, 118088671, 112125944, 106450737, 101013866, 95716733, 90616875, 85755494, 81104554, 77170910, 73330573, 69686947, 65974983, 62499362, 59346417, 56381155, 54021011, 51286832, 48966906, 46756098, 44239884, 42481365, 40451885, 38769961, 37262908, 35559145, 34137883, 32364686, 31198247, 29827744, 28458617, 27598159, 26662039, 25532259, 24650843, 23705014, 22842363, 21823006, 20740097, 20758825, 19776745, 19112247, 18498119, 18134503, 16902654, 16883198, 16259847, 15477591, 15354983, 14781474, 14720425, 14051011, 13407644, 13133780, 12691357, 12786100, 12135920, 12069760, 11010119, 11361216, 10668750, 10596258, 10565464, 10057537, 9648479, 9787677, 9477719, 9230932, 8762865, 8593928]
16637H593928j8927l30650l12530J9671l90658j81005j36461N8142m66659j22123
16627F712728l04840o293j31344M04499p39737j89286O2548j68878j33792j6467
16617E489138O4287l34761m1215m32090n0303J52584j0154k0615k28875k43030
16607D344966L9941J25351j39551k80622o8560l5782j45024K1841P1028j86713
16597C746875N0872k58202K4414n3065q8105j15180M08939n07405K95160k50418
16587C253885j87286Q5352j2390k11797J1387r5355K7255j34328R9767P9680j15701
16576B800469o7818o4419J675R3938k95730L823L7462N7767j79870j85188K86574
16565B488683M35k91420K22323l21502J00449l2345J57313q6108j25451p9694
$$ y = [8593928, 8575001, 8244351, 7931821, 7951492, 7560834, 7379829, 7243368, 7301510, 6834851, 6712728, 6407888, 6401595, 6270251, 6674750, 5935013, 5745727, 5808275, 5639397, 5505605, 5489138, 5553425, 5218664, 5177449, 4745359, 4695056, 4847640, 4837486, 4816871, 4587996, 4344966, 4384907, 4510258, 4370707, 4090085, 4021525, 3985743, 3840719, 3862560, 3933588, 3746875, 3797747, 3539545, 3563959, 3510894, 3422789, 3307609, 3716548, 3209143, 3504303, 3253885, 3066599, 3151951, 3139561, 2927764, 2939151, 2843796, 2871051, 2736723, 2836490, 2916170, 2800469, 2732651, 2668232, 2669907, 2763845, 2468115, 2471938, 2509400, 2567167, 2387297, 2202109, 2488683, 2489118, 2197698, 2420021, 2098519, 2198968, 2166623, 2323936, 2237828, 2112377, 2032683]
16555B032683k41292J01015j72897J33989q7096L6842J41612m9814J9871k20703
16545A694210L5924k53595N27591l04765l11315K95461m2257K8689M5639P461
16535A723043k95021R0180m1016n1416J65375p9102K50199j66946P5151j65372
16525A505075k74161J57920l4046p3261K73758j48431p8023o20528N54768J88550
16515A451621k21581O7182m7516N8050o3214M7087j92463j864j32566J52830M0564
16504A158130k522j61811p631j4942j68221O7045P9543O2884L43641m24229O0001
16493I91888k41872M04181j04699j50462k02160L49171K56651n70638J06992K78339
16483A117391k73679k02008p339N18450l4669l14382j77450Q6023L6526J87715
$$ y = [2032683, 1791391, 1892406, 1719509, 1853498, 1766402, 1803244, 1944856, 1895042, 1914913, 1694210, 1730134, 1476539, 2004130, 1699365, 1388050, 1683511, 1641254, 1669943, 1715582, 1723043, 1428022, 1518202, 1477186, 1425770, 1591145, 1512043, 1762242, 1595296, 1670447, 1505075, 1230914, 1388834, 1354788, 1281527, 1555285, 1406854, 1328831, 708303, 1263071, 1451621, 1230040, 1297222, 1249706, 1307756, 1244542, 1291629, 1099166, 1097302, 964736, 1117566, 1158130, 1155608, 993797, 986166, 971224, 803003, 870048, 949591, 1012475, 1356116, 931887, 991888, 750016, 1154197, 1049498, 899036, 696876, 1046047, 1302698, 732060, 839052, 1117391, 843712, 641704, 634365, 1152815, 1118146, 803764, 626314, 712337, 748863, 936578]
16473I36578j51540M2396q8553P7661o5143l8955J12097q7248l50536O96243n14957
16462E68043L69793j11780j67915m3450J23221j18462k347J18003Q3601j07415
16452G11292J34715k73396M4571K12578j77812J72518K69219E25041k48774L96895
16442F73162n6149R9785l26477o419L32206k60877j9275K31432j70878J60640
16432F57150j59850K87417C84928j5760K72161o7391n2410K37467q0140J98289
16422H77144l32025L22110l71130J68591P0818k49711O4968B47990J11678N2507
16412D12175J08174j15273K25273k15578J32490A29083M95584A75858K90361j8401
16402D47818J08448L63804C31532K81527q3095N4716j41743j7611p006q8396j39241
$$ y = [936578, 785038, 827434, 738881, 816542, 751399, 712444, 824541, 737293, 386757, 1083000, 568043, 937836, 826056, 658141, 614691, 737912, 619450, 617103, 735106, 818707, 711292, 846007, 572611, 617182, 829760, 651948, 824466, 1093685, 525041, 276267, 673162, 617013, 716798, 390321, 383902, 716108, 455231, 435956, 667388, 496510, 657150, 497300, 784717, 384928, 369168, 641329, 573938, 521528, 758995, 678855, 877144, 545119, 867229, 496099, 664690, 735508, 485797, 550765, 247990, 359668, 412175, 520349, 405076, 630349, 414771, 547261, 129083, 624667, 175858, 466219, 447818, 556266, 920070, 331532, 613059, 529964, 584680, 442937, 425326, 418320, 329924, 190683]
16391A90683J52014p0400K55870p0050j22541o0673J36116Q5784j26510J5966
16381C86259H7016K73599A68856J35156L0416J55920J50775k60665J45467j57763
16371C68162A44896C9888K95095R3843K4122B25982J78126q6191j17507r4721
16361A05689Q8406K62487J01077l6673A68676o8313J78111O0885R0798j24306
16351C05851C1526K84307q8184p0686E0519J46266K63545B02781A4818M05184
16341D20002J4954j31853G1818A6174J63530J62383I1711J32601P2107L0341h48
16329D07434q3471G709N0904j300R5934Q9685D5274a26222A41436M1721l844n0867
16317A28446b14672C40695a66286D03183j37415J65249j99215J72311j47550I5823
$$ y = [190683, 342697, 272297, 528167, 458117, 335576, 274903, 411019, 496803, 370293, 386259, 87016, 360615, 168856, 304012, 334428, 490348, 641123, 380458, 525925, 368162, 144896, 39888, 334983, 428826, 452948, 225982, 404108, 317917, 200410, 105689, 194095, 456582, 557659, 520986, 168676, 100363, 278474, 339359, 430157, 305851, 31526, 315833, 227649, 156963, 50519, 196785, 460330, 202781, 14818, 420002, 434956, 303103, 71818, 16174, 179704, 342087, 91711, 224312, 296419, 326760, -848, 407434, 323963, 7709, 58613, 57313, 153247, 242932, 45274, -126222, 141436, 183157, 179313, 128446, -214672, 340695, -166286, 403183, 265768, 431017, 231802, 404113, 256563, 95823]
16306B06173C7739K41425J3346j07177F1730o79J69301m9084L00353B15540J95513
16295D11053j95479a6087B16755J15312A18386R0809J90601A45078J17397J1703
16285B74178A21354Q0625J23932o5049P0497j63672J27113r6870l7680K15830
16275C76080A11673J36017K0030A23274N3061G2513K05868n6847Q6775h0373D20202
16263B55735b3606A20592J16373E7412p085O5584b35463A01968K5554I179J90860
16252B00039l9240k0150E3700L49658j28750a18192A44154J05070A21798K43682
16242C65480M0689A66270J14605G1997b11558A00363l5843J26949a39534j43225
16232b82759C23172d446B37662C9377a73426B49116P1683G5407M7020b6644H8331
$$ y = [206173, 37739, 279164, 292510, 185333, 61730, 61051, 230352, 181268, 481621, 215540, 411053, 215574, -16087, 216755, 332067, 118386, 209195, 399796, 145078, 262475, 274178, 121354, 201979, 325911, 260862, 331359, 167687, 294800, 197930, 160250, 376080, 111673, 247690, 267720, 123274, 176335, 72513, 278381, 221534, 308309, -80373, 420202, 255735, -23606, 120592, 236965, 57412, 50327, 115911, -235463, 101968, 127522, 9179, 200039, 160799, 140649, 53700, 403358, 274608, -118192, 144154, 249224, 121798, 365480, 406169, 166270, 280875, 71997, -211558, 100363, 64520, 191469, -139534, -282759, 323172, -4446, 237662, 39377, -173426, 249116, 320799, 75407, 122427, -26644, 88331]
16220F7000c4499G3610j5884a6075E6152M23097j34926f6324k8326A72194J35316
16209C07510e4526F6388J15082a21204A05157J71841j408a52293E15359A87108
16198b13848A25837d19627A36316P8945H3369P4147l5364E5874R8736K68944A60536
16186h7168O741D6360K61317p9263a5353A0491L4693J78762a95208h9787E6446
16174d8490D0234a23527M9980A2843J65041J8820a7060B04395a33300c476A06808
16162A84883F1140Q0723N7299e615j80478D6411c3048E1879Q6998c5655k70325
16151c05980A87458C3885G770b68672j72120A08780J13049a85499O3037A2384
16140B4692P6650b72988E0953P8176b50616E7930P486C2143h4201p9403C6453
$$ y = [67000, -34499, 73610, 57726, -16075, 56152, 479249, 344323, -66324, -94650, 172194, 307510, -54526, 66388, 181470, -121204, 105157, 276998, 275590, -152293, 515359, 187108, -213848, 125837, -419627, 136316, 215261, 83369, 157516, 122152, 55874, 154610, 423554, 160536, -87168, -80427, 46360, 307677, 228414, -15353, 10491, 45184, 223946, -195208, -89787, 56446, -48490, 40234, -123527, -73547, 12843, 177884, 196704, -17060, 204395, -133300, -3476, 106808, 184883, 61140, 141863, 199162, -5615, -186093, 46411, -33048, 51879, 138877, -35655, -305980, 187458, 33885, 7770, -268672, -440792, 108780, 221829, -185499, -122462, 12384, 24692, 101342, -272988, 50953, 129129, -250616, 57930, 65416, 32143, -84201, -163604, 36453]
16128B70312a5519r8564A07707J10872H7749k0868J82880O9081c71304c5176j74150
16117b09326i1034k66906A00799B8118M07532a47701E9164a73878a4633A62843
16106a09420G1144g8154B8342a44749A37907M36000a72602I4151g5064l3851C12116
16094i5766g684A5212C132f2577K4483q4005A29011h2921L0094D12658P2376c0679
16081b21842I2053h2860a162j62366A87269b41164B17651c2594j9937J9946A26105
16069c9604j3993A4346K00506h1952A0282c6545k29983H6787J50447B8022i4081
16057D7827a01573k71899B15735n4709a54854k57203a86596e7013k534k9158C26561
16045A72123c66230D09993f1146B08944A3805b03294i1079j05338c2472p2966
$$ y = [270312, -15519, -114083, 107707, 218579, 87749, 66881, 249761, 318842, -371304, -35176, -209326, -91034, -357940, 100799, 28118, 435650, -147701, 59164, -173878, -14633, 162843, -109420, 71144, -78154, 28342, -144749, 137907, 573907, -172602, 94151, -75064, -108915, 312116, -95766, -7684, 15212, 3132, -62577, -38094, -122099, 129011, -82921, -52827, 412658, 485034, -30679, -221842, 92053, -82860, -1162, -163528, 187269, -241164, 217651, -32594, -52531, -32585, 126105, -39604, -53597, 14346, 214852, -81952, 10282, -36545, -266528, 86787, 237234, 28022, -94081, 47827, -101573, -373472, 215735, 161026, -154854, -412057, -186596, -57013, -59547, -88705, 326561, 172123, -366230, 409993, -61146, 208944, 13805, -203294, -91079, -196417, -32472, -105438]
16035a05438A25056i955l02413j0738B61111H5386c94042E2160B3821J85401b98581
16023G120J69965g2475F279L261J15667K9569m6803j8942k3065p584L2363J88790
16011B79535c69044J2777G5047b35840a13707D1207a54368o5479a2597o4741A1155
15999B39318F0134Q1626B3815a05714d3970B11344E8737d4836F2120N981b75007
15987B50223f580q1129A33069Q1192a91150B45495K05055r0492G7539a06960b4936
15975B9028c1036l5582r8853A14453d3022j7419j3036C57111D4327c217A76321
15963A14291J0337B0012a36817L4597A40390a00672A8843J5829a32508j27411
15953b59919J09635C5002J84509b60317A22195c8785J6428j46493j51158B81424
$$ y = [-105438, 125056, -9955, -312368, -323106, 261111, 85386, -394042, 52160, 23821, 209222, -298581, 7120, 177085, -72475, 6279, 9540, 125207, 154776, 107973, 89031, 65966, 58382, 90745, 279535, -369044, -356267, 75047, -235840, -113707, 41207, -154368, -219847, -12597, -77338, 11155, 239318, 60134, 141760, 23815, -105714, -43970, 211344, 58737, -44836, 62120, 68101, -275007, 250223, -6580, -87709, 133069, 214261, -191150, 245495, 450550, 360058, 77539, -106960, -24936, 29028, -31036, -66618, -165471, 114453, -43022, -60441, -73477, 357111, 44327, -3217, 176321, 114291, 124628, 20012, -136817, -102220, 140390, -100672, 18843, 34672, -132508, -259919, -150284, 35002, 219511, -260317, 122195, -38785, -22357, -168850, -320008, 281424]
15942A01294g2891j84436B61246a69309P3185j12068D0706R6097g7846B32488
15931f1756D265J91415f8300j17620A19253h6741D836a5791A15771h0842H0047
15919a448r8068F3529J8515A203c53395B76429c28456J47828d2910j07503j62195
15908c12608C36183a41562A65858c39175J50949f0271R344k13607i4300L2737
15898f1563j34894c7649j79547A55399a06635F4240d30520g6992g239I6462a53641
15886B16232b51076g6190p6882a8507C14685r3666a1849k4132q8100j75959a09856
15874d48801A12012n2323e522k67478c9034E9702K21j0872a21302j8428j9863
15863a59593j67915J51960c8657q1430B08568H738B831a49379d6350j36746n7616
$$ y = [101294, -72891, -257327, 261246, -169309, -96124, -208192, 40706, 136803, -77846, 232488, -61756, 4265, 195680, -68300, -185920, 119253, -86741, 4836, -15791, 115771, -80842, 80047, -1448, -99516, 63529, 82044, 1203, -353395, 276429, -328456, -180628, -42910, -150413, -312608, 336183, -141562, 165858, -339175, -188226, -60271, -50927, -264534, -94300, -61563, -196457, -37649, -217196, 155399, -106635, 64240, -430520, -76992, -7239, 96462, -153641, 216232, -251076, -76190, -153072, -18507, 314685, 221019, -11849, -35981, -124081, -300040, -109856, -448801, 112012, 59689, -5522, -273000, -39034, 59702, 59923, 49051, -121302, -139730, -159593, -327508, -175548, -38657, -120087, 208568, 8738, 2831, -149379, -46350, -183096, -240712]
15852b40712L5371B60032g9069F6907N6080q13b32518j13990P0000a16940k02574
15841c19514Q9554A45347D557a55536G7282b18352B6628J72054o1965J21632I106
15829A16426B8665J573a50316A82085i0890p491k33066A02964b4448A77524h3127
15817b44088C8161N1897Q0919a34033L2244p238j21490K0139p3068e7583b6978
15805C313Q2503a26763B84019a07786A7991i9069a9216l58069F5479K28957b31418
15793i2967L7783Q806A350K33181K382a86383M7085k15525M8469g0343L3938E2797
15780b8105f787k73619B44411a74448N8725j34416A05673c1776A80297k0218F6163
15768b36973A39831c49464J65079k40376i5676j55581B45197a46193C05082r1252
$$ y = [-240712, -205341, 260032, -79069, 66907, 122987, 122174, -232518, -346508, -276508, -116940, -319514, -229960, 145347, 4557, -155536, 77282, -218352, 26628, 198682, 136717, 258349, 9106, 116426, 28665, 30238, -150316, 182085, -90890, -98381, -331447, 102964, -24448, 177524, -83127, -244088, 38161, 90058, 170977, -134033, -101789, -109027, -230517, -210378, -283446, -57583, -26978, 3313, 85816, -126763, 284019, -107786, 17991, -99069, -19216, -377285, 65479, 294436, -231418, -92967, -55184, -46378, 1350, 234531, 236913, -186383, -139298, -354823, -306354, -70343, -36405, 52797, -28105, -6787, -280406, 244411, -174448, -115723, -250139, 105673, -31776, 180297, 160079, 66163, -236973, 139831, -349464, -184385, -424761, -95676, -251257, 245197, -146193, 305082, 213830]
15758B13830a64155m5481i8938f124r8213A12675L30011a67421d0131m6319j05071
15747a91521B18836a06309B71700P2406A1439O3392h4702j45576E4681c17440
15736a246I5494b15220A11615J28055a97199l0320E1384c12748J11368j91667
15726c93047f4818k7671a6265n4866K9987B9689f8557H157b01144C6636P1656
15715A08292a76077D2914J48436c01428J14025O3778a6551k97331j91544A08188
15704E7570N6577b03881A31163d10169b03209G8534C6747Q3281l1118l4068a15881
15692A25198F0464K0709K09028e3701K875H2J35614b23288j25626A08052C9939
15680c31706M8095J16254B58631a66222m4245A14889J07264H3809i2490B32138
$$ y = [213830, -164155, -209636, -98938, -6124, -104337, 112675, 442686, -167421, -40131, -86450, -191521, 218836, -106309, 271700, 344106, 11439, 74831, -84702, -230278, 54681, -317440, -1246, 95494, -215220, 111615, 239670, -197199, -227519, 51384, -312748, -201380, -393047, -64818, -92489, -16265, -71131, -41144, 29689, -68557, 8157, -201144, 36636, 108292, -176077, 42914, 191350, -301428, -187403, -123625, -16551, -313882, -505426, 108188, 57570, 114147, -203881, 131163, -410169, -203209, 78534, 36747, 120028, 88910, 54842, -115881, 125198, 60464, 81173, 290201, -53701, -50826, 82, 135696, -223288, -348914, 108052, 39939, -331706, -283611, -167357, 258631, -166222, -210467, 114889, 222153, 83809, -92490, 232138]
15669f7630k447A70184j7685c31236C9299A4592Q9502e45052B63565B9339a21329
15657b23247H1068d5337D3577h5512B01481b04796f4404j4397l61813J27310B24408
15645b198j83496j98108J57013h470G4358O348a5017G6566B8702b20906N7670
15634a63236q2426N8276l4077Q4487M4878A15071n1735i0883A8922P7387K81534
15623C77843d9838j5385L819j63297A57182n2891a12293A01234c83191d7164k61103
15612c08267J08144a1579j49709j4817n5607R4419E9233a1577I9584B4609J08092
15601A32701C6591b61840D03899j52711b08007A08927a11333j84925G5018a23496
15590I6027A5084J40583p3463P9149n6200J8069j5768A5128a06643C21090a4181
$$ y = [-67630, -70077, 170184, 152499, -331236, 39299, 14592, 104094, -545052, 263565, 29339, -121329, -223247, 81068, -45337, 43577, -85512, 201481, -204796, -64404, -78801, -440614, -313304, 224408, -2198, -185694, -383802, -226789, -8470, 74358, 80706, -15017, 76566, 28702, -220906, -163236, -245662, -187386, -221463, -136976, -92098, 115071, 63336, -90883, 18922, 96309, 377843, -49838, -65223, -61404, -224701, 157182, 104291, -112293, 101234, -383191, -47164, -308267, -200123, -11579, -161288, -176105, -231712, -137293, 59233, -11577, 99584, 24609, 132701, 36591, -261840, 403899, 251188, -208007, 108927, -111333, -296258, 75018, -123496, 96027, 15084, 155667, 82204, 161353, 105153, 123222, 107454, 15128, -106643, 321090, -14181]
15578A7893J59455b09246A7752a47951A22963O1298i0802k16218B3638K00616
15568B24254G3763K30997b40228G997M09a39372I0830l3121a6446j32764j11109
15557b60319a1066A6739a5457m9217J2327B64710a16240D3079N7385J34048a35472
15545a6562F6853f5494a2743k14441B6855a16605H9100A3453L044a21497m8609
15534a70106r5371r891A52755a37038A35977b02199d9661j79283B16906c2834
15523f1914H8524Q0791e67890A23454c233j8030B18575a21552A98541h300o9871
15512g8171h839j97507A11473J34708A09217O1957a83701B33360a91058E9696
15501g206p0179m3486m3251e103j8266C5093K9133a3471k13084a215k42824C9796
$$ y = [17893, 177348, -209246, 17752, -147951, 122963, 184261, -90802, -307020, 23638, 224254, 73763, 304760, -240228, 7997, 8406, -139372, 90830, 57709, -16446, -149210, -260319, -11066, 16739, -15457, -64674, -52347, 264710, -116240, 43079, 100464, 234512, -135472, -16562, 66853, -65494, -12743, -227184, 26855, -116605, 89100, 13453, 16497, -121497, -170106, -265477, -275368, 152755, -137038, 135977, -202199, -49661, -228944, 216906, -32834, -61914, 88524, 169315, -567890, 123454, -3233, -21263, 218575, -121552, 198541, -8300, -78171, -8839, -206346, 111473, 246181, 109217, 171174, -183701, 233360, -191058, 59696, -7206, -77385, -120871, -164122, -5103, -23369, 35093, 64226, -13471, -226555, -1215, -244039, 39796]
15488A5565i8321J0839j8616A23808c2733m64934B9065N8095a30005A44688f9050
15476e4627n5636k1807a8737l7517A7753L46966G4727K2558a41747L6855K9930
15465g4962D6911b78026B01263h6829j8779k0138M8460B3542a14245a1841l29361
15454c41202B08724D0974G132d32080C27809a57933A20668L31434a3418J176G5663
15442A34231g0110j04152A21859c2123j13172H5161a7360j51943A63273a41106
15431B20575k281d42452a99087k1703n5329I367R5172J61993A07301a05947m9070
15420a55017A18980e7888K2338C04511A25553e0820A83742a71198A88799C3590
15409b48806e3647A16922i9611E36807A19381b35862a06697c9882A63620D6869
$$ y = [15565, -98321, -87482, -106098, 123808, -32733, -497667, 29065, 87160, -130005, 144688, -69050, -54627, -110263, -132070, -18737, -56254, 17753, 364719, 74727, 97285, -141747, -104892, -74962, 46911, -278026, 201263, -86829, -105608, -125746, -77286, 23542, -114245, -11841, -341202, 208724, 40974, 7132, -432080, 327809, -157933, 120668, 452102, -13418, -12242, 75663, 134231, -70110, -174262, 121859, -32123, -145295, 85161, -17360, -169303, 163273, -141106, 220575, 218294, -442452, -199087, -220790, -276119, 9367, 104539, 266532, 107301, -105947, -155017, 118980, -57888, -35550, 304511, 125553, -50820, 183742, -171198, 188799, 33590, -248806, -53647, 116922, -99611, 536807, 119381, -235862, -106697, -39882, 163620, 46869]
15398F1554M2998C1176b19353Q901N1922A46442J9338a4650C88885b0955j62963
15387a83918c225j4341q0260f367A65185F4956J63025C7522L2765J50044d4193
15375B45352a7181k55934c7183G8966K17886b7379q689C7496a0388i66C8293L1804
15363G0097J82153l1651H8656J33227i3023p4999K3744C41636B6246J39795i4861
15351a01929A37289e1212A64136J1670b2787B8388Q2654A2207a52933C7982c6590
15339b37234B85538e7051E5986R1877C9164J8183P3105i0359B8103c641l61365
15328c65006B81968b9126O054j25975G0458i6931A93967a83198m6895f9379G7034
15316g1705B94193G1572N8988d082k6799k3328J7185o8314A59410l0586b15708
$$ y = [61554, 104552, 31176, -219353, -210452, -158530, 146442, 165780, -14650, 388885, -20955, -183918, -3225, -17566, -97826, -6367, 165185, 64956, 227981, 37522, 70287, 220331, -44193, 245352, -17181, -273115, -37183, 78966, 296852, -27379, -36068, 37496, -10388, -966, 38293, 70097, 252250, 220599, 88656, 221883, -93023, -168022, -144278, 341636, 26246, 166041, -94861, -101929, 137289, -51212, 164136, 175806, -22787, 28388, 111042, 12207, -152933, 37982, -36590, -237234, 285538, -57051, 55986, 147863, 39164, 57347, 130452, -90359, 28103, -3641, -365006, 281968, -29126, -23072, -149047, 70458, -96931, 193967, -183198, -230093, -69379, 77034, -71705, 294193, 71572, 130560, -4082, -30881, -54209, -37024, -105338, 159410, 128824, -215708]
15304b84099a770q5678J3977l0233b2841k57633J35249C7385O5928d1266B58360
15292A00845b88438B27438g2736H878J16443A7953c6318I6182f2423a8710B36397
15280d4302i836k36137F990b42243O9986A00714J43150j16763a50776c7520B69017
15268H4968m0926J14271a4133k61382a6003O823B1622a32606a9793j19177A67063
15256e9653F2885b43917D0970J94229N6489l4562h1167D32288Q6548Q40403P06428
15245B065667r85900O57432j60802E60070B8140K51272d9304A64594K19779j59445
15235B24928l2626I1712a66398P2190d3300k919B69959c2225n9419E3486J18170
15224A71656a5646r4428A53048L98197B56193n1616o3177l5019b8990A69790b3194
$$ y = [-284099, -1770, -87448, -73471, -103704, -22841, -280474, -145225, 37385, 103313, -41266, 258360, 100845, -288438, 227438, -72736, 8878, 125321, 17953, -36318, 96182, -62423, -18710, 236397, -44302, -9836, -245973, 6990, -242243, -172257, 100714, 243864, 127101, -150776, -37520, 269017, 84968, 44042, 158313, -14133, -275515, -16003, -9180, 21622, -132606, -19793, -138970, 167063, -59653, 62885, -243917, 40970, 235199, 291688, 257126, -81167, 432288, 518836, 1359239, 2065667, 1079767, 1737199, 1576397, 560070, 28140, 279412, -49304, 164594, 384373, 224928, 192302, 91712, -166398, -94208, -43300, -46219, 269959, -32225, -91644, 53486, 171656, -15646, -110074, 153048, 551245, 256193, 204577, 141400, 106381, -28990, 169790, -23194]
15212I4329d1756I5564K44334C188J00813B9363K34617J3119b9923B99997A9130
15200F2145L95850b813n4012C33530b2336B80470I4261f2419A4848J30491m5662
15189I9677J38122I6899b82685A3793b17443A15682a43693C00797a12162A12159
15178F8342J37387J22775e2002C541M525M65517a34270l8583l1602B56342G111
15166g8384r8458e4154C1191K73390b7902j8962o6861K5449B10071d7856B47898
15154d319A82975g023B60883a8621B62013A230K34939G6508a03468E5669k7075
15143B8594J00557a1963C95097g945A32019a53371I9080h627A84475F3901R3907
15132A57808e5929I4315P5871M63360A85813A4818P5230K5566J12150J11710E2756
$$ y = [94329, -41756, 95564, 339898, 3188, 104001, 29363, 263980, 277099, -29923, 299997, 19130, 62145, 457995, -2813, -56825, 333530, -22336, 280470, 94261, -62419, 14848, 145339, 99677, 237799, 96899, -282685, 13793, -217443, 115682, -143693, 300797, -112162, 112159, 68342, 205729, 328504, -52002, 3541, 8066, 473583, -134270, -172853, -204455, 256342, 7111, -78384, -176842, -54154, 31191, 304581, -27902, -46864, -113725, -88276, 210071, -47856, 247898, -4319, 182975, -7023, 260883, -18621, 262013, 1230, 236169, 76508, -103468, 55669, 28594, 129151, -11963, 395097, -7945, 132019, -153371, 99080, -8627, 184475, 63901, 157808, -55929, 94315, 170186, 633546, 185813, 14818, 90048, 115614, 227764, 339474, 52756]
15120c9791B61024j04995b1021j32205d2443B35686I0854J68362A3921b05663
15109E9818r760J31336J94889j87324K748F6693a95509f7249C75899K007E9383
15097B5871h7368A94227Q2192J74346d8695A10577f382A04324a56922A45433o0443
15086H4990M83785l5601C8059J65350J29837A09140d2841J5927D0760K44051h7580
15074c4587C3842h1650A41549P8682A1013J76353a09331B87604c6960B84864b15417
15062a06499L7959B84589G0637P3432l9602O5731Q1578L6136A25168b27887B47274
15050B95662l0806m3970J45692J92416j52622l5463J74250j23360j85861l4565
15040B01373h437C65956J39771j24619n5539c8811C14890C6333Q9463K63289A43317
$$ y = [-39791, 261024, 156029, -21021, -153226, -42443, 235686, 90854, 259216, 13921, -205663, 59818, 50058, 181394, 376283, 188959, 191707, 66693, -195509, -67249, 375899, 377906, 59383, 25871, -87368, 194227, 276419, 450765, -48695, 110577, -6382, 104324, -156922, 145433, 84990, 568775, 533174, 38059, 203409, 333246, 109140, -42841, -26914, 40760, 284811, -87580, -34587, 33842, -81650, 141549, 220231, 11013, 187366, -109331, 287604, -36960, 284864, -215417, -106499, -68540, 284589, 70637, 144069, 104467, 170198, 251776, 287912, 125168, -227887, 247274, 295662, 264856, 220886, 366578, 558994, 406372, 370909, 545159, 421799, 235938, 201373, -8437, 365956, 505727, 381108, 325569, -38811, 314890, 36333, 125796, 389085, 143317]
15028D47762j06725e5271A00992L16284A70587K24125A31278J30709J50845m5063
15018C67769A03564J87156a3135A85047n3474O0478J39379f4843E03509A79646
15007E53280B57548J87190k19031K9759H054M24983k05995K28859j80784m5316
14997B29801K0774a7574I8496M3032Q6825p5307Q3063K13687k09557M42054C03507
14985C22253A49565L4717K83558K3608A96854k6873J65174I2310K84630j74123
14975B02817r7779Q6228J66953j68859J17423l3933j23439J99448G7338b8429
14964D1869J16958O3344C1106P2319J42646N3154R9571j98008c7210E18695j53013
14953C65682r1771a44672B12452A00094J59236M7347n2960G0491J82047b7395
$$ y = [447762, 341037, -55271, 100992, 417276, 170587, 394712, 131278, 261987, 412832, 367769, 103564, 290720, -13135, 185047, 131573, 192051, 331430, -64843, 503509, 179646, 553280, 257548, 444738, 225707, 255466, 8054, 433037, 227042, 455901, 275117, 229801, 250575, -17574, 98496, 141528, 228353, 153046, 236109, 449796, 240239, 682293, 303507, 322253, 149565, 184282, 467840, 491448, 196854, 169981, 335155, 92310, 376940, 202817, 105038, 191266, 358219, 189360, 306783, 272850, 149411, 348859, 77338, -28429, 41869, 158827, 222171, 31106, 103425, 246071, 299225, 398796, 200788, -37210, 518695, 365682, 273911, -144672, 212452, 100094, 259330, 306677, 253717, 70491, 252538, -27395]
14942A85031K38919n9803j07953K0673j6151Q5835L29660B21955p921J57322A73626
14930A83553k3364K0480o855K52839q3314n8863J27937A91321K77549A69032K49113
14919D18145B04327K70795J01540r8984A71066J53790K62932A97242J36769m6462
14909B87549J7808J40774B10002r0469C3995N02569Q6061A34053L96217A78972
14898H27228l24254L4991j15652J19042A86366M6680K66971J47499I0649n268
14888H5381L59221k0379j01614J2883K77241B52627P5606J79291A65035J44460
14878C09495L25605B24514J53526R7121A90001M68901B98436J66250J77594p3636
14868E68644j85825A27759A008J19579L82272j03433O4899J02811J35677j74949
$$ y = [185031, 423950, 364147, 256194, 276867, 260716, 346551, 676211, 221955, 214034, 371356, 173626, 183553, 160189, 180669, 173814, 426653, 343339, 284476, 412413, 191321, 468870, 169032, 418145, 204327, 475122, 576662, 477678, 171066, 324856, 587788, 197242, 334011, 287549, 305357, 446131, 210002, 119533, 33995, 536564, 622625, 134053, 530270, 178972, 827228, 502974, 537965, 422313, 541355, 186366, 233046, 500017, 647516, 90649, 85381, 444602, 424223, 322609, 335492, 612733, 252627, 328233, 507524, 165035, 309495, 635100, 224514, 378040, 475161, 190001, 658902, 298436, 464686, 642280, 568644, 382819, 127759, 1008, 120587, 502859, 399426, 464325, 567136, 702813, 527864]
14858E27864L6708k13086J98626A51012J84925L13779k52274O166K16799p5159
14848E45248B72102j22126N00239k20744j2891k8085J20110Q0622k04871M32639
14838H16995k97774j23046J8843j9614J75175J16804B31352L54216j58331J34750
14828E61987j66387r5324O2802J65671j75209J92339N3376k08347K80412k99496
14818C71824L64961k00675k07748Q4444K58718j85671j93414M12183j04380J71112
14808G71354l1964j44637P8621k94550L38453J95669D02809K08224k27136J52577
14798E36474j66742J42448o0649K75391k49891l5631P5107j25348L05205o2547
14788F33817j74220Q0019l9367P51L1516J94408k5304n029J08298l12693Q0540
$$ y = [527864, 564572, 351486, 550112, 151012, 335937, 649716, 397442, 403608, 620407, 545248, 272102, 149976, 650215, 429471, 416580, 388495, 508605, 589227, 384356, 816995, 519221, 396175, 415018, 395404, 570579, 687383, 231352, 585568, 427237, 561987, 395600, 300276, 363078, 528749, 353540, 545879, 599255, 390908, 671320, 371824, 736785, 536110, 328362, 412806, 671524, 485853, 292439, 704622, 600242, 771354, 739390, 594753, 673374, 378824, 717277, 912946, 402809, 611033, 383897, 536474, 369732, 512180, 451531, 726922, 477031, 441400, 516507, 391159, 696364, 633817, 459597, 539616, 500249, 501000, 532516, 726924, 701620, 696591, 804889, 492196, 572736]
14777E72736n2873K61094l03036J55022J44843k41277K82393k32250K40223j34082
14767F92793k0132q057N3190j24980L09465j83510n204L13746D47169L57896J83
14756H05248j87460O5836K02699l99490L86860j28138m8331N7520K9167J73247
14746I57158D77240J86191K78972O204L6123l02982P89263n97876l24258m7625
14736E01252n067L60293R3699Q7409k50094k52641J36718K31780j42388P7536
14726H38497o9943l4522l3390L06483j47736J01532j59672R8409J26704q023K08413
14715A226752L1316r1744k53671k21869M4131Q8759K4R2919j01574K6451O3595
14704I05089l37366K77056m162j15446J62042M73081m66246n5545J38909k89172
$$ y = [572736, 519863, 780957, 477921, 632943, 777786, 536509, 818902, 586652, 826875, 692793, 672661, 664604, 717794, 592814, 902279, 718769, 713565, 1027311, 447169, 805065, 805248, 617788, 683624, 886323, 486833, 873693, 745555, 697224, 754744, 783911, 957158, 477240, 663431, 942403, 948607, 984730, 681748, 1471011, 873135, 548877, 501252, 496185, 856478, 950177, 1037586, 787492, 534851, 671569, 903349, 760961, 838497, 768554, 734032, 700642, 1007125, 859389, 960921, 801249, 899658, 1026362, 1018339, 1226752, 1258068, 1166324, 912653, 690784, 734915, 823674, 823698, 916617, 815043, 841494, 905089, 567723, 844779, 840617, 725171, 887213, 1360294, 894048, 838503, 977412, 688240]
14694F88240J55751K2326k22855L51825j37450J23237m2738m9486K63102k17542
14684I34410M1504k7378l0386N5647O9242l3724L47671m25232m5374K36941j08806
14673A014515j20288L10503k26729L86562j57590j25179N0950J24656J81594l46619
14663A092375j92496K42801N9562J63980l17908o420J13469o1849l8319J73304
14653A228499j08691N0114j12507L27942J35463n94986M52292P8952n8634M371
14643A402815j06919q4204J97851k8916o8317J07885J0832J50814j03129l6210
14633A442502J63816l1072k22496P2871j47250J30365J09651K13614l61743L08265
14623A678523j49737k12045L23242J32061n17034L91907k00228K65473l5392L8331
$$ y = [688240, 843991, 866317, 643462, 995287, 857837, 981074, 938336, 888850, 1151952, 934410, 975914, 948536, 918150, 973797, 1043039, 1009315, 1356986, 931754, 886380, 1123321, 1014515, 894227, 1204730, 978001, 1364563, 1206973, 1081794, 1132744, 1257400, 1438994, 1092375, 899879, 1142680, 1202242, 1366222, 1048314, 1041894, 1155363, 1093514, 1055195, 1228499, 1119808, 1169922, 1057415, 1385357, 1520820, 925834, 1378126, 1457078, 1398444, 1402815, 1295896, 1211692, 1409543, 1380627, 1312310, 1420195, 1431027, 1581841, 1478712, 1442502, 1606318, 1575246, 1352750, 1425621, 1278371, 1408736, 1518387, 1732001, 1370258, 1678523, 1528786, 1316741, 1639983, 1772044, 1255010, 1646917, 1446689, 1712162, 1676770, 1715101]
14613A715101o6589k18356K01608J68666j41373J76792l2550k22932J01364M41014
14603B122745k3253l85282Q5662k96680M31337J77431l65615K8509M1670J43631
14593A960155R6034l06410P0216Q8451L88471k07646k94619K0539J25453R3162
14583B033806L7040J4562K43475k81687j75224J55810K81585l49791M33881k69362
14573B124095J4050L01716k65908N17705k75175O7616K80684q01092N47598j08571
14563B402718M23164l34062M20093l52112J78081J53614K66811K05095k08077
14554C155325M75127J50076O80300N17811O25264K144357L959950Q662870J9775609
14545D0146689J6904442B1874709A0108532l265555l272839j255372k72753J45534
$$ y = [1715101, 1648512, 1430156, 1631764, 1800430, 1659057, 1835849, 1803299, 1580367, 1681731, 2122745, 2099492, 1714210, 1799872, 1503192, 1934529, 2111960, 1746345, 1774854, 1816524, 1960155, 2056189, 1749779, 1819995, 1908446, 2296917, 2089271, 1794652, 1815191, 1940644, 2033806, 2070846, 2085408, 2328883, 2047196, 1871972, 2027782, 2309367, 1959576, 2393457, 2124095, 2138145, 2439861, 2173953, 2691658, 2416483, 2484099, 2764783, 1963691, 2511289, 2402718, 2825882, 2491820, 2911913, 2559801, 2737882, 2891496, 3158307, 3363402, 3155325, 3630452, 3780528, 4460828, 4978639, 5603903, 7748260, 11708210, 20371080, 40146689, 57051131, 21874709, 10108532, 6842977, 3570138, 2314766, 2042013, 2187547]
14537B187547j17105K22898J13243m922j6465O961k15925J82652k56662N49066
14527B651288l55803J62693K45964j10756k86625L22094R9021o748O2221J99179
14517B982528J40808j34944k34445M62217k89964J02652k9870J40039k51600L28654
14507C216075K1144J93134j46060K82088k66852P9804k35334O14177m58641K27044
14497C526579j52159J71609k94919K72088m1141J32161n9529N27404j95827J71221
14487D057487N216M5402J54088l2362q7850J18826J83578o0656m3289n0994K4360
14476D313806O36122m32037K7956k56623N40158l66251K09342J88666N7377j00607
14466D817909N6935J98472j14044K14995n6305j62521Q3151N13522l09921M3777
$$ y = [2187547, 2070442, 2293340, 2406583, 2401661, 2385196, 2392157, 2176232, 2358884, 2102222, 2651288, 2295485, 2458178, 2704142, 2593386, 2306761, 2628855, 2727876, 2721128, 2783349, 2982528, 3123336, 2988392, 2753947, 3216164, 2926200, 3028852, 2998982, 3139021, 2887421, 3216075, 3237219, 3430353, 3284293, 3566381, 3299529, 3379333, 3143999, 3758176, 3299535, 3526579, 3374420, 3546029, 3251110, 3523198, 3482057, 3614218, 3554689, 4082093, 3886266, 4057487, 4062703, 4108105, 4262193, 4229831, 4141981, 4260807, 4444385, 4383729, 4340440, 4289446, 4313806, 4949928, 4517891, 4545847, 4289224, 4829382, 4463131, 4672473, 4861139, 4918516, 4817909, 4874844, 5073316, 4959272, 5174267, 5117962, 4955441, 5038592, 5552114, 5242193, 5285970]
14456E285970n3528O30396n80255O32090N3795p9872L8766P9385J14209j04516
14446F016440L65154p7979J62217K20392J54010n02153L01286J20039J72491L8750
14436F970647P7531M57N6481K08900j24928L94048k27381K01887L86246K2188
14426G966076J6977j32428O49334J01617M8570j85509P2176N63932j84551p5467
14416H840727O41757j23720J86276K30881k07561J0369N13110k55208L16530J09551
14406A0262712N36194j09513K53953M78273J12776J79898n5928j38927M04114
14397A1923552J25333K50767J66077N29397P7592q8060N98346J64902K44768P4189
14387A4066863O97832k26347M75464J88286J46807L62862L28302J84374N02167
$$ y = [5285970, 5232442, 5862838, 5282583, 5914673, 5968468, 5888596, 5927362, 6006747, 6120956, 6016440, 6381594, 6303615, 6465832, 6686224, 6840234, 6338081, 6639367, 6759406, 6931897, 6970647, 7048178, 7048635, 7105116, 7314016, 7189088, 7583136, 7355755, 7557642, 7943888, 7966076, 7983053, 7850625, 8499959, 8601576, 8650146, 8464637, 8536813, 9100745, 8916194, 8840727, 9482484, 9358764, 9545040, 9775921, 9568360, 9578729, 10091839, 9836631, 10153161, 10262712, 10798906, 10689393, 10943346, 11421619, 11534395, 11714293, 11658365, 11519438, 11923552, 12048885, 12299652, 12465729, 12995126, 13072718, 12984658, 13583004, 13747906, 13992674, 14066863, 14764695, 14538348, 15013812, 15202098, 15348905, 15711767, 16040069, 16224443, 16726610]
14378A6726610l0675M34571N42608J62631R3651N65095M45172M14849L38755M37835
14368B0131102M12444N10964M99979J50108O63715K32808M69664N25774P06441
14359B4302999J75265Q00138N53776P29219M34640N80353Q55941K58755P66003
14350B9457089P05667Q09971R11030P81752P20682P34180J146196Q51113R66841
14341C7084521Q85052Q78188Q57047J454847J163265J060192J577507J260265
14333D6220884J097931J566777J237501J610621J800557J627877J808893J734819
14325E8705860K066214J863578K333194J966459K501856K059172K545756K782453
14317G6824542K726647K900842L204559L277752L281244L610803L675857M334805
$$ y = [16726610, 16695935, 17130506, 17673114, 17835745, 17929396, 18494491, 18939663, 19354512, 19693267, 20131102, 20543546, 21054510, 21554489, 21704597, 22368312, 22601120, 23070784, 23596558, 24302999, 24478264, 25278402, 25832178, 26561397, 26996037, 27576390, 28432331, 28691086, 29457089, 30162756, 30972727, 31883757, 32665509, 33386191, 34120371, 35266567, 36117680, 37084521, 37969573, 38847761, 39704808, 41159655, 42322920, 43383112, 44960619, 46220884, 47318815, 48885592, 50123093, 51733714, 53534271, 55162148, 56971041, 58705860, 60772074, 62635652, 64968846, 66935305, 69437161, 71496333, 74042089, 76824542, 79551189, 82452031, 85656590, 88934342, 92215586, 95826389, 99502246, 103837051]
14309A03837051M195988M509329M514814M973166N583479N484897N869191O405018
14301A45372933O393011P161670P612407Q015030Q381599Q895157R217165R949253
14293B10998225J0526643J0963895J1371259J2181663J2612647J3075907J3638660
14286B95368899J3969631J4478846J4764180J4839611J4924597J4671629J4369891
14279C97387284J4113789J2910024J2038735J0653094R203599O830304L880571
14272D67017400k42975j114320m16357K53192l978143n258714o759336q945052
14264D40555695j0536656j1781327j2696309j3776842j4862450j5085484j4822084
14257C46994543j5170845j4810957j4324189j3990263j2339952j2739650j2538858
$$ y = [103837051, 108033039, 112542368, 117057182, 122030348, 127613827, 133098724, 138967915, 145372933, 151765944, 158927614, 166540021, 174555051, 182936650, 191831807, 201048972, 210998225, 221524868, 232488763, 243860022, 256041685, 268654332, 281730239, 295368899, 309338530, 323817376, 338581556, 353421167, 368345764, 383017393, 397387284, 411501073, 424411097, 436449832, 447102926, 456306525, 463136829, 467017400, 466774425, 465660105, 465243748, 465496940, 461518797, 456260083, 449500747, 440555695, 430019039, 418237712, 405541403, 391764561, 376902111, 361816627, 346994543, 331823698, 317012741, 302688552, 288698289, 276358337, 263618687, 251079829]
14250B51079829j1991943j1510534j0611116j0250471r637429r217206q356413
14243A79504717q185226p693949p483442o895537o462716n669240n997514n472304
14235A25644789n397754n254393m744740m253355l387928m028935m123371l382869
14227I1071444l655870l293496l277328k673126l061712k352208k479533k167552
14219F8110619k480973k354913j994923k067350j528396j878635j223551j845194
14211E2736684j839920j660063j467439j338160l79283j258899j629338j306809
14203D1856773j315157j224716r06115l84771j249066j116332n12869j290328
14195C3857419p78602o65901j023179l76942r30886q03944j013266n25207p21097
$$ y = [251079829, 239087886, 227577352, 216966236, 206715765, 197078336, 187861130, 179504717, 171319491, 163625542, 156142100, 149246563, 142783847, 137114607, 131117093, 125644789, 120247035, 114992642, 110247902, 105994547, 102606619, 98577684, 94454313, 91071444, 87415574, 84122078, 80844750, 78171624, 75109912, 72757704, 70278171, 68110619, 65629646, 63274733, 61279810, 59212460, 57684064, 55805429, 54581878, 52736684, 50896764, 49236701, 47769262, 46431102, 46051819, 44792920, 43163582, 41856773, 40541616, 39316900, 38410785, 38026014, 36776948, 35660616, 35147747, 33857419, 33078817, 32412916, 31389737, 31012795, 30081909, 29277965, 28264699, 27739492, 27018395]
14186B7018395n56160k46876q51233o54208k77923q50102m76279k16335l72583
14177B2516696k65343j044696j38176p08735m81444K10674m04817m87003o01253
14168A8595903k28541l15566k29140l65220m86313Q2183n47851m09747k41369
14159A5854339j61415j37536n61691m01988k1700l06463l49653l3931l13113m43086
14149A3123763K94413m34692j08193j36584m72590j83681J46982n60477j30923
14140A1538018m7856l50434j31432k4844n12414N84222n85827J73342l53351j15042
14130A0174382k54546k54436R0128l32785j1828j85089j72280J5240l15718L78113
14120I131181n10164r4392j49736J11868k56224j77979o3623L8374n02060j5039
$$ y = [27018395, 26462235, 26215359, 25364126, 24709918, 24431995, 23581893, 23105614, 22889279, 22516696, 22251353, 21206657, 21068481, 20359746, 19878302, 20088976, 19684159, 19197156, 18595903, 18367362, 18051796, 17822656, 17457436, 16971123, 17053306, 16505455, 16095708, 15854339, 15692924, 15555388, 14993697, 14591709, 14570009, 14263546, 13913893, 13879962, 13566849, 13123763, 13418176, 12983484, 12875291, 12738707, 12266117, 12082436, 12229418, 11668941, 11538018, 11490162, 11139728, 11008296, 10983452, 10471038, 11055260, 10469433, 10642775, 10289424, 10174382, 9919836, 9665400, 9755528, 9422743, 9410915, 9225826, 9053546, 9068786, 8753068, 9131181, 8621017, 8526625, 8376889, 8488757, 8232533, 8054554, 7990931, 8029305, 7527245, 7512206]
14110G512206K04639j3771j89059q5991k65314j4206k99840L44549l30173J83132
14100G046172j00189m55383J43614j80613l24422K95678k08278q2749j05464j49079
14090E879287J55879k18445l09286L75923k16517K83017o53817L08172q8512J94388
14080E710089l28490K27484p7989k66894J62339n91068r8850J49921j7865m8913
14070D819764j92708K92265m2803j9766k14412k02479K82507j55450k21954K36056
14060D581020k18615J38302k23318K49757k17256O671L05894j90897n38851J94394
14050D087101k02314o4058R7606N9920j16371j52253k33169K37800j81262L1725
14040C564725m4376j52531K97841P4633j64933l11628L30577j54586J13272o9885
$$ y = [7512206, 7716845, 7703074, 7514015, 7428024, 7162710, 7148504, 6848664, 7193213, 6863040, 7046172, 6945983, 6490600, 6634214, 6453601, 6129179, 6424857, 6216579, 6133830, 6028366, 5879287, 6035166, 5816721, 5507435, 5883358, 5666841, 5949858, 5296041, 5604213, 5515701, 5710089, 5381599, 5609083, 5531094, 5264200, 5426539, 4835471, 4736621, 4886542, 4868677, 4819764, 4627056, 4919321, 4876518, 4856752, 4642340, 4439861, 4722368, 4566918, 4344964, 4581020, 4362405, 4500707, 4277389, 4527146, 4309890, 4316561, 4622455, 4431558, 3892707, 4087101, 3884787, 3820729, 3918335, 3978255, 3861884, 3709631, 3476462, 3714262, 3533000, 3564725, 3520349, 3367818, 3665659, 3740292, 3575359, 3263731, 3594308, 3439722, 3552994, 3483109]
14030C483109l16185K65295r6829j29599O8687L9492k77696P7660r3892l31887
14020B688155o7280K51142J68660j22298M8602J613m0707m58987K94942j80917
14010B582925K49508j63526k73733J05094o6050J82932k62783j95940L82392l29266
14000B211553J10409r4899K54090k87533q6656k23650K45493j37006M99615l11373
13990B180043L51488P83075K656852O586035J7076638K9861834k9091024A4452815
13981H770358k752177r48569o27493n42269n08687l4461l12648j97107M51845
13972C298792m17188l13881K32143k25347O8976J42290l03630l6090K61221k25865
13962B481421q0589j89103J86585k6484J05672k27102J53888j19553q7463p3627
$$ y = [3483109, 3166924, 3432219, 3335390, 3205791, 3274478, 3313970, 3036274, 3113934, 3020042, 2688155, 2620875, 2872017, 3040677, 2918379, 2966981, 2968594, 2927887, 2468900, 2763842, 2582925, 2832433, 2668907, 2395174, 2500268, 2434218, 2617150, 2354367, 2158427, 2540819, 2211553, 2321962, 2227063, 2481153, 2193620, 2106964, 1883314, 2128807, 1991801, 2491416, 2180043, 2531531, 3314606, 5971458, 12557493, 29634131, 59495965, 30404941, 14452815, 8770358, 6018181, 5069612, 4442119, 3899850, 3391163, 3356702, 3044054, 2846947, 3298792, 2881604, 2567723, 2799866, 2574519, 2643495, 2785785, 2482155, 2446065, 2707286, 2481421, 2400832, 2211729, 2398314, 2371830, 2477502, 2250400, 2404288, 2284735, 2197272, 2123645]
13952B123645J74150n60051O51406l3093o7273R464n58298M89742n41522L11935
13942B000105J82024J09895o9109q5670j99602J77108j9085j51803N1085k24592
13932A770356J52642m8615j47920J43383k56753M24098n15841L02777J55248Q5761
13922B065136m74402k73495P0692M6068O34153p10242K79080J21221k36772L89414
13912A910853m40115Q3103j19480j23795K46025K61769l17900p24M17740k44877
13902A672599k79180J64810K73991m58294P4018j11912K6341K05241q1069K69198
13892A755743n00931M0063K10577J1332k29866p1077L00972J79931m58872P2261
13882A310133L77411l37740O6083J49503k01009L8087P6557p07146O49046k27261
$$ y = [2123645, 2297795, 1737744, 2389150, 2356057, 2288784, 2298248, 1739950, 2229692, 1688170, 2000105, 2182129, 2292024, 2222915, 2137245, 1937643, 2114751, 2095666, 1943863, 1994948, 1770356, 1922998, 1874383, 1726463, 1869846, 1613093, 2037191, 1521350, 1824127, 1979375, 2065136, 1590734, 1317239, 1387931, 1433999, 2068152, 1357910, 1636990, 1758211, 1521439, 1910853, 1470738, 1553841, 1434361, 1310566, 1556591, 1818360, 1500460, 1499736, 1917476, 1672599, 1393419, 1558229, 1832220, 1373926, 1447944, 1336032, 1362373, 1567614, 1486545, 1755743, 1254812, 1294875, 1505452, 1516784, 1286918, 1215841, 1516813, 1696744, 1237872, 1310133, 1687544, 1349804, 1415887, 1565390, 1364381, 1402468, 1479025, 771879, 1420925, 1193664]
13872A193664M5342J10245l23051R8199M22125j00330l34409m2900P2121J79441
13862A320447k07934L31274j40607k41275j7920M48580k18340o90j91511k38663
13852H43361O12757l50404k0467k77131J37457M1042N3521K58660m33555L33669
13842A198910K670n4613j23751k21822M13936k27342L31685m63699K99662J9350
13832A174986p1227Q3145l37799K67319m1892J73155j23755k23238R3901j04441
13822H90154R5945j2514J604k1899p8402k54546M51552Q6838k93152L02671m17823
13811G50428K32835J20919Q6188j59428j58786K04786k26393L20937j37126N4884
13801A089244J18344m16010J528K29601j89762N1377k44072M06713j96248J2966
$$ y = [1193664, 1239006, 1349251, 1026200, 1124399, 1546524, 1446194, 1111785, 1068885, 1141006, 1320447, 1112513, 1443787, 1303180, 1061905, 1043985, 1492565, 1274225, 1273535, 1082024, 843361, 1456118, 1105714, 1085247, 808116, 945573, 986615, 1040136, 1298796, 865241, 1198910, 1201580, 1146967, 1023216, 801394, 1215330, 987988, 1319673, 855974, 1155636, 1174986, 1103759, 1186904, 849105, 1116424, 1074532, 1247687, 1123932, 900694, 994595, 890154, 986099, 973585, 975189, 953290, 874888, 620342, 1071894, 1158732, 865580, 1168251, 750428, 983263, 1104182, 1190370, 1030942, 872156, 1076942, 850549, 1171486, 1034360, 1089244, 1207588, 791578, 793106, 1022707, 832945, 884322, 640250, 1046963, 850715, 863681]
13791H63681R3376k79848K69535j02547j82095J14243Q6127o5523Q4981j50958
13781G30972M48649m36504P44M2284q8122j03656K57735J7172L6763l96137M76014
13770I85914k26995J21184q354j73886k0185K83833j67547l3957k62096Q8651
13760E86562L78839j18078R0300L3315k02989O9227j13613l47244J93640J1063
13750E81022Q1910k2372K24630j85390M1213C43511O05229C34616M05551J5837
13740G56004J08006m26941K37631l8327n4772K87730j73282K08534m45456Q4975
13730E44102K35650k53336r998J38248N3449B44647O26795k87836m0731N24069
13720A066944E01093J41848J03508j42104N962n3774k11950M34161L00047m35534
$$ y = [863681, 957057, 677209, 946744, 844197, 662102, 776345, 862472, 796949, 881930, 730972, 1179621, 743117, 743861, 786145, 698023, 594367, 852102, 869274, 906037, 509900, 985914, 758919, 880103, 871749, 697863, 677678, 961511, 793964, 760007, 497911, 586562, 965401, 847323, 937623, 970938, 767949, 837176, 723563, 376319, 569959, 581022, 662932, 640560, 865190, 679800, 721013, 343511, 948740, 334616, 740167, 756004, 864010, 437069, 674700, 636373, 581601, 869331, 696049, 904583, 459127, 544102, 779752, 526416, 516418, 654666, 708115, 244647, 871442, 583606, 542875, 1066944, 501093, 642941, 746449, 604345, 610307, 556533, 344583, 778744, 1078791, 643257]
13710F43257B72400M84364k9760j11154j36707L75456k23392q4176o8197p6088
13700D02746J46151q6407K36226o7934P7424k03197Q8188L0384n2222J3392J93652
13689G78403j07034j95102K70938j09591N820B10630K06376L08473j4141j56519
13679E54819M69210o9632l71000K62242k69851J76015A99478n7728L39388n2135
13669D29003j98577K25969J04301B54140K76594j56888j04869J61944R6884P5484
13659F03289k34024K00229k01787O4230k13269L24915m9571B40126J00160A57848
13648B14639K4599F5145K99985J52432k11229A51172N57916C36500L03968J19018
13638G59486l25087l4782J5790K92115k80558n8372M07788A35262J87793K79902
$$ y = [643257, 272400, 756764, 727004, 615850, 479143, 854599, 631207, 547031, 478834, 402746, 548897, 462490, 698716, 630782, 708206, 505009, 593197, 623581, 571359, 584751, 778403, 671369, 476267, 747205, 637614, 643434, 210630, 417006, 725479, 711338, 554819, 1024029, 954397, 583397, 845639, 575788, 751803, 199478, 141750, 481138, 429003, 230426, 456395, 560696, 254140, 530734, 373846, 268977, 430921, 527805, 603289, 369265, 569494, 367707, 431937, 218668, 543583, 494012, 240126, 340286, 157848, 214639, 239238, 65145, 365130, 517562, 306333, 151172, 709088, 336500, 640468, 759486, 434399, 399617, 415407, 707522, 426964, 368592, 776380, 135262, 323055, 602957]
13628F02957r3774D1912N01112j52191K7216M40099k88910k02279J99612B35282
13617C25442K02347K6917A28066K35214j4968K0040M35400l69610J65107J05037
13607G04286B74567K85032B33516K75084n5051r1515J14395K14129B78418A07230
13596F44276k18140j14534A18646N28509B84362A24531L99921j36749L60193C31882
13585B54103J82513o9963M08446o8786l22374Q1669j70703M24442B37603K61299
13575D98902j38785J84642K2828k32980j18453K76498A55249K98856k3060A81816
13564C16075A13204P8057R0878K42654C3473N44425k39792E6964M23710K7171
13554E07845j52777j09736L11931B56777K25224A33050J23379J21604C2704J61894
$$ y = [602957, 509183, 41912, 543024, 390833, 418049, 858148, 569238, 366959, 566571, 235282, 325442, 527789, 554706, 128066, 363280, 348312, 368352, 803752, 434142, 599249, 704286, 274567, 559599, 233516, 508600, 453549, 362034, 476429, 690558, 278418, 107230, 644276, 426136, 311602, 118646, 647155, 284362, 124531, 524452, 387703, 747896, 331882, 254103, 436616, 366653, 775099, 706313, 383939, 465608, 294905, 719347, 237603, 498902, 360117, 544759, 567587, 334607, 216154, 492652, 155249, 454105, 431045, 181816, 316075, 113204, 191261, 282139, 524793, 33473, 577898, 338106, 56964, 480674, 507845, 355068, 245332, 557263, 256777, 482001, 133050, 256429, 378033, 32704, 194598]
13544A94598J58286p6561k6084D6373L77763j3174J06994k44054L6697l1410J3056
13533B92245R3061j75089M90517B01482J43658j23957L28043J0078q3320j27088
13523C48896C6292R1719L00488A78473K25948A35735J92004Q1004A52892Q9275
13513B42167p933g459F11264A14847J62743M57694A92053M07808j79764A59082
13502B88086J33198B06295O8221p2010L82975A83794L32137n6701j1622A17042
13491C99680r9774B2533J6052L51591K03550k68696n8258r9533m6896N7261N7845
13480B35449A3907O3952A7433K60513P2446K28855k75477j47251p6476L92936
13470D72979A90822L1342r8192n561J47518J4502H5659b261q2310I9053K57530
$$ y = [194598, 352884, 276323, 250239, 46373, 424136, 410962, 517956, 273902, 310599, 279189, 292245, 385306, 210217, 700734, 201482, 345140, 221183, 549226, 559304, 475984, 348896, 36292, 128011, 428499, 178473, 404421, 135735, 327739, 408743, 152892, 242167, 234234, -7459, 611264, 114847, 277590, 735284, 192053, 599861, 420097, 159082, 288086, 421284, 206295, 274516, 202506, 585481, 183794, 515931, 459230, 447608, 117042, 399680, 299906, 22533, 38585, 390176, 593726, 325030, 266772, 167239, 120343, 177604, 235449, 13907, 77859, 17433, 277946, 350392, 579247, 303770, 156519, 80043, 472979, 190822, 222164, 123972, 118411, 265929, 280431, 85659, -2261, -84571, 99053, 356583]
13459C56583B2555L72167a28242B33061A01085K37957H2444N4911J87938q6988
13449B38305N0052j20223b9295A45254F0439K03797e7769G7708J0740C5888j7193
13438A8695M37640o3600k653D7082J43363a0134E9845K69427J13880E8438L3415
13427I1853O063L5974P4083K03313j30700C8172a97986D8066R6571R9336K41690
13416D85663B2816J58058L71157b9005C50334a13094B46538B1779a1718A96005
13405B33539A04616N1255c5895F8438J28350J6419a42927B38127p485J75647j10040
13394B96249A23690L7408k9220K48919A69882b6885A58629K47868j16395K13565
13384E03667k36849H0407K4758R709K64562E3076f6041A92712L08947A34636K73535
$$ y = [356583, 22555, 394722, -128242, 233061, 101085, 339042, 82444, 137355, 325293, 238305, 288357, 168134, -29295, 145254, 60439, 264236, -57769, 77708, 88448, 35888, 18695, 456335, 392735, 390082, 47082, 190445, -10134, 59845, 329272, 443152, 58438, 91853, 97916, 133890, 207973, 411286, 280586, 38172, -197986, 48066, 144637, 243973, 485663, 22816, 180874, 552031, -29005, 350334, -113094, 246538, 21779, -11718, 196005, 233539, 104616, 155871, -35895, 68438, 196788, 213207, -142927, 238127, 230642, 406289, 296249, 123690, 161098, 131878, 380797, 169882, -26885, 158629, 406497, 290102, 503667, 266818, 80407, 105165, 114874, 379436, 53076, -66041, 192712, 501659, 134636, 408171]
13373D08171j12092p6120L0763k3415Q9919J01210D1260L45778F0780J48263m1984
13362A67059J06016f7139A97356K10881M1277A37114j0750D2084L69473A36865
13351C30558o0204j6934A25436L23254B02364J14734A55477L35822j32354m261
13341C54684J09366k26272a65374C08803A50640J81244F8946K6246K80541H6490
13330B03748j8098j9622N5883p1852K00544J9489O152k2213k6681j05643K2494
13319B44201j20157a4722B52462K13059j42106c7994A72073J62360j6766j25271
13309A92396A5350J03663M4234R7841p2554J4414R1173A22774M2029a09454A72158
13297C09401K1974j18902c8597C26096b22621c1135C52425c1900C5407c9370B34615
$$ y = [408171, 296079, 219959, 250722, 227307, 317226, 418436, 41260, 387038, 60780, 209043, 167059, 273075, -67139, 197356, 408237, 449514, 137114, 126364, 42084, 411557, 136865, 330558, 270354, 253420, 125436, 448690, 202364, 317098, 155477, 491299, 358945, 354684, 464050, 237778, -165374, 308803, 150640, 331884, 68946, 95192, 375733, 86490, 203748, 185650, 166028, 221911, 150059, 350603, 370092, 376244, 354031, 327350, 221707, 244201, 124044, -14722, 252462, 465521, 323415, -37994, 172073, 334433, 317667, 192396, 15350, 119013, 163247, 261088, 188534, 202948, 294121, 122774, 164803, -109454, 172158, 309401, 331375, 212473, -38597, 326096, -222621, -31135, 352425, -31900, 35407, -39370, 234615]
13285C30801G0825L72684A69581k2578F5386d0620B38267r3033k1346M3832R2444
13274B60164J20207j32746E6844o885J69743K09090f7464K4253B57565A22443
13263E0528Q1942J18537a8920I0608J27954J63515I3416b07551B48777a70307
13252d5480a0069C76066b01011D12041j25985A9032J76879q8358j0024K26080
13242C23609l9184J25977B03250m5451N3949O7223A35705J36345B1119d9035C59111
13230A72366a48056A52361R1976e2284j866j26668p3784i8951E4280l594J28955
13219A79641n0438B8501a80903q7820A81072O1622J00965m1488N036F1426A7574
13207B29900b6230A31008a98019d4217r2447I2976J99835J41699A535J57692l7152
$$ y = [330801, 70825, 443509, 169581, 147003, 65386, -40620, 238267, 145234, 123888, 167720, 260164, 380371, 247625, 56844, 49959, 219702, 428792, -67464, -43211, 257565, 122443, 50528, 132470, 251007, -18920, 90608, 218562, 382077, 93416, -207551, 248777, -170307, -45480, -10069, 376066, -201011, 412041, 286056, 19032, 195911, 107553, 97529, 323609, 284425, 410402, 203250, 157799, 211748, 278971, 135705, 272050, 21119, -49035, 359111, 172366, -148056, 152361, 244337, -52284, -54150, -180818, -254602, -98951, 54280, 50686, 179641, 129203, 28501, -180903, -268723, 181072, 242694, 343659, 302171, 307207, 61426, 17574, 229900, -26230, 131008, -198019, -44217, -136664, 92976, 292811, 434510, 1535, 159227, 122075]
13196A22075N3000n2179L11128G5152L3691K08790H7242L09593A84909D1510O3806
13185A05316g1338H1032b08199B47881B8617J02786c09820D64452F2988J50968
13175B13956a81390F9444b5021A44716m0460k3149J65839E5418N7385i0343L1436
13164e8907B6889K42513A13743J64355J46684f7470i828B8936K73757A15373K6361
13153A41734K03268J33394a5771j39125C15557P8036A31683L54111A96768L3807
13143B30575c94666i4950B39903o8806o4776K68285q8587J23796A40906J99098
13133C40004D5882K7515O6628O4713r3880b3814o5176I5416k6557a16828E26768
13121A00576b2004F442e9609F8409J6138O9393H186f1441B86114A27581Q640Q9994
$$ y = [122075, 175075, 122896, 434024, 75152, 108843, 317633, 87242, 396835, 184909, 41510, 105316, -71338, 81032, -208199, 247881, 28617, 131403, -309820, 464452, 62988, 213956, -181390, 69444, -25021, 144716, 104256, 81107, 246946, 55418, 112803, -90343, -58907, 26889, 269402, 113743, 278098, 424782, -67470, -9828, 28936, 302693, 115373, 141734, 345002, 478396, -15771, -154896, 315557, 393593, 131683, 485794, 196768, 230575, -394666, -94950, 239903, 171097, 106321, 374606, 286019, 409815, 140906, 340004, 45882, 73397, 140025, 204738, 110858, -23814, -88990, 95416, 68859, -116828, 526768, 100576, -22004, 6442, -59609, 68409, 84547, 153940, 8186, -61441, 286114, 127581, 136221, 226215]
13109B26215q6891J80792c4112l5510j30677A22825K53606A56810l6175N8704
13099A79339h9099A3159M338e040D9521K50425a33430a1055j96824A91159q1061
13088A10098B9103g6622A41215J50998o7417J6504l5057E3496P8397B6565M6387
13077G2952a75670J7965D7451l092L9573a81547B5804K13330f5247G0141e105
13065C34217e1445k95242a24644G6875K13292C6806K38815o8032l4272G427L97844
13054D05271j62545j5829a75731I2911M01995i4703r0248A47381C6938R3593Q5160
13043B15691a41907F5854a53800n0665A53882J96523D3205c3426C28279a8960
13032B37280j16266h8881A09965B2857d2438A2983P7731J24475J32925I1178K15174
$$ y = [226215, 139324, 320116, -34112, -69622, -200299, 122825, 376431, 156810, 120635, 179339, -89099, 13159, 17497, -5040, 49521, 299946, -133430, -11055, -207879, 191159, 110098, 29103, -76622, 141215, 292213, 224796, 241300, 206243, 53496, 131893, 26565, 72952, -175670, -157705, 47451, 44359, 83932, -181547, 25804, 239134, -65247, 70141, -5105, 334217, -51445, -346687, -124644, 76875, 290167, 36806, 275621, 207589, 173317, 7427, 405271, 242726, 226897, -175731, 92911, 494906, -94703, -184951, 147381, 36938, 130531, 215691, -141907, 65854, -153800, -204465, 153882, 350405, 43205, -33426, 328279, -18960, 237280, 121014, -88881, 109965, 22857, -42438, 12983, 90714, 215189, 348114, 91178, 306352]
13021C06352J7363h592m8972c515E10570j76015e6974A62538a49716B947K16563
13010B19510J3768R252b011I0945B9286d5915I416L136e5825j44091D8164J34854
12998A83018K47158o1721A43785k9393b1326D2936K10880b95060J32677A24028
12987A86807a87910E9396c72487I6430J7033L2625L86405A01997a4885E344J66436
12976A71780A4211L4354b17793B04778b76055C4089r644K36195j11975E0989L9951
12965I0940b7572j08791A20864D6773R8665a04699A92127b48048A03774e4960
12954f2438B25372M0738r4508E4968j6125h4982q3350E6127P0853b2774A68447
12942B92903h0092G1357e4314A16395a9144j58588B20922b27577A74899a26104
$$ y = [306352, 323715, -8592, -57564, -3515, 510570, 334555, -56974, 162538, -149716, 2947, 219510, 233278, 242530, -2011, 90945, 29286, -45915, 9416, 12552, -55825, -199916, 48164, 183018, 430176, 368455, 143785, 114392, -21326, 42936, 253816, -295060, -162383, 124028, 186807, -187910, 59396, -372487, 96430, 113463, 146088, 532493, 101997, -14885, 5344, 171780, 14211, 48565, -217793, 204778, -276055, 34089, 24445, 260640, 148665, 50989, 90940, -27572, -136363, 120864, 46773, 145438, -104699, 192127, -248048, 103774, -54960, -62438, 225372, 266110, 171602, 54968, 38843, -84982, -168332, 56127, 126980, -22774, 168447, 292903, -80092, 71357, -54314, 116395, -19144, -177732, 220922, -227577, 174899, -126104]
12931B63902l0569a20632d8486B26654a06781G7988k550c3476B31377o570b4274
12919A12722a21554B7613J10914n0900a06184K1805A38460a9050H4236J0381J16738
12908B11355J6387H7699J26915F2667J53802c45706L5687A47799f9595E0422J74182
12897B24604L1428A08571J15282b16915I2712J40657a42238N6983b4527F7726
12886C09551I5510a63434L8124A20455N2262J36495A05332B6503K45219a74745
12875A74199F3375M9614k9320m0718O6639f8570m9894j3978A13869C0710K07131
12864B37841a72376h4984I8818l0523a70403A66818a84921A71247a030C17380
12853a2A31515E7846a98550f041C33051F2537e2604D47299a21959k6811e4461
$$ y = [263902, 233333, -120632, -48486, 226654, -106781, 77988, 75438, -33476, 231377, 224807, -24274, 112722, -121554, 27613, 138527, 87627, -106184, -84379, 138460, -19050, 84236, 94617, 211355, 227742, 87699, 214614, 62667, 216469, -345706, -310019, 147799, -69595, 50422, 224604, 256032, 108571, 223853, -216915, 92712, 233369, -142238, -85255, -24527, 67726, 309551, 95510, -163434, -125310, 120455, 172717, 309212, 105332, 26503, 271722, -174745, 174199, 63375, 112989, 83669, 42951, 109590, -68570, -118464, -132442, 113869, 30710, 237841, -172376, -84984, 98818, 68295, -170403, 166818, -184921, 171247, -1030, 317380, -12, 131515, 57846, -198550, -6041, 333051, 62537, -52604, 447299, -121959, -148770, -54461]
12841A61546Q2911C2895N8647l4655b82088D00747A25492J40103i689B27434E1243
12829a2050l73557B38990K61174B34602I8321k7528b59898a4544A61440B0396
12818b17468E0252K06614m7500A00519h5857k9369R513G1457f332A19873r94J87310
12806C06189F5245h749j85038m4230B03978r1846b51104a2843l95822a90378B52166
12794C64692a13631A65669a67606A18399h9698G0302a79344A1208J43786A9068
12783a94947j61250E703f50701A12253i0854m2806m9730N2987I4059a56434B39210
12771A85990k0004a67647I0246a12762B28313D7217Q8248c02374E7029L17137
12761C74166j82919R3492b11475L9035j996A10371d6851j44964A73670E5659e9400
$$ y = [161546, 244457, 32895, 91542, 56887, -282088, 400747, 125492, 265595, -9689, 227434, 51243, -12050, -385607, 238990, 500164, 234602, 98321, 70793, -259898, -14544, 161440, 20396, -217468, 50252, 256866, 209366, 100519, -85857, -115226, -105713, 71457, -6332, 119873, 118879, 306189, 65245, -8749, -193787, -238017, 203978, 112132, -251104, -12843, -408665, -190378, 252166, 364692, -113631, 165669, -167606, 118399, -89698, 70302, -179344, 11208, 154994, 19068, -194947, -356197, 5703, -650701, 112253, -90854, -133660, -183390, -130403, 94059, -156434, 239210, 185990, 165986, -167647, 90246, -112762, 228313, 47217, 135465, -302374, 57029, 374166, 191247, 284739, -211475, -172440, -174436, 110371, -46851, -191815, 173670, 55659, -59400]
12749h5043L9211m15694a22566B54313a41174D8144J53973B9220M14511A3696
12738b7486q3930b1897j3700B30185c7941D55011a53803A09877N6133D3610b818
12726A54537G3460c92454B4915O38b27349A79211d9849E8914a22234N9027H2062
12714B6903a04336I4619i3783I4930d3715G4420J03721J84630j2389q4146p4005
12703A92231l5681L162L03978I1614A7917a22656b4750C30958a13959A59290j7840
12692A41450b22787c0929A14993c2303A15401b08370I9835b24527A31862C2387
12681B32158A1905L49921j77518p1876L99117j44837A49163a5838l1808B43614
12670F1436a77480C4386K59726C1402L20363E9103J0246J5372C4814J48328a6901
$$ y = [-85043, -45832, -461526, -122566, 254313, -141174, 48144, 202117, 29220, 443731, 13696, -27486, -111416, -21897, -35597, 230185, -37941, 455011, -153803, 109877, 166010, 43610, -2818, 154537, 73460, -392454, 24915, 25553, -227349, 179211, -49849, 58914, -122234, -63207, 82062, 26903, -104336, 94619, -93783, 94930, -43715, 74420, 178141, 362771, 350382, 266236, 192231, 156550, 159712, 463690, 91614, 17917, -122656, -24750, 330958, -113959, 159290, 141450, -222787, -30929, 114993, -32303, 115401, -208370, 99835, -224527, 131862, 32387, 232158, 11905, 361826, 184308, 112432, 511549, 366712, 149163, -15838, -47646, 243614, 61436, -177480, 34386, 294112, 31402, 351765, 59103, 69349, 84721, 34814, 183142, -16901]
12658B58744K5148Q7999D7011K70339I6102J748g0821D8139K6201k2359K86806
12647C38787i7482A37737k1499a46372K2640F6023h0629H9433a68428J0353C20789
12635A29071B8917L61266I6546a3741A1071K04859E9876J91439r8178R9701J59372
12624D12210A66011F7883c7301l9092B35051I0396Q4131c3899A2815M9571a05819
12612b29907B97384e00358A04322b65067I6319a2986m6607B46978A5005J676a58986
12600A64064k4599J9966A6652J0659e0054D16303b04862B8081K6891c9366C51390
12588F1412a53249b3089D7708a57962c7602A01374A7904J50775l0512a59113e3470
12576g69j86039A33902J96587j59676i6740C23541o4104b70277f6008n765B55016
$$ y = [258744, 283892, 371891, 47011, 317350, 96102, 97850, -70821, 48139, 74340, 51981, 338787, -97482, 137737, 116238, -146372, -123732, 66023, -80629, 89433, -168428, -158075, 320789, 129071, 28917, 390183, 96546, -13741, 11071, 215930, 59876, 251315, 153137, 252838, 412210, 166011, 67883, -37301, -76393, 235051, 90396, 174527, -33899, 12815, 62386, -105819, -229907, 297384, -500358, 104322, -265067, 96319, -12986, -59593, 246978, 15005, 16681, -158986, 164064, 139465, 159431, 16652, 27311, -50054, 416303, -204862, 28081, 54972, -39366, 351390, 61412, -153249, -23089, 47708, -157962, -37602, 101374, 17904, 168679, 138167, -159113, -53470, -769, -186808, 133902, 330489, 170813, -96740, 323541, 259437, -270277, -66008, -71773, 255016]
12564B95501A23666k1739l3121a55326B09526a78127k36772A05602J73350R3437
12554C72389A08249J37897C1788b62229f0466A5632J79209m2948L9142E2554O0936
12543A13490J80000e9069c143B11279a83541P3227J2841A1093a44913c3243H5562
12531A61197m947b2854J0724E49827a74208O4798B10864K40029B8351K51995o7877
12520B12469a34255G942N9354c14812a02702b2069A70678i43A23701n5268N0713
12509A19146b81010Q9262O0482C48623f5692j82822A18804D5842K40768c37721
12498E1516L9071D4155L09492j21261b10320E024J0575K45560a72163A25265F081
12486b14120B5025a61478L4360I5742J937k8197R2160D0175A9591c8992D0850
$$ y = [295501, 123666, 101927, 68806, -155326, 209526, -178127, -414899, 105602, 278952, 372389, 108249, 246146, 31788, -262229, -60466, 15632, 194841, 151893, 191035, 52554, 113490, 293490, -59069, -3143, 211279, -183541, -110314, -97473, 11093, -144913, -33243, 85562, 161197, 156250, -22854, -12130, 549827, -174208, -109410, 210864, 450893, 28351, 280346, 212469, -134255, 7942, 67296, -314812, -102702, -22069, 170678, -943, 123701, 68433, 119146, -281010, -191748, -131266, 348623, -65692, -248514, 118804, 45842, 286610, -337721, 51516, 90587, 44155, 353647, 232386, -210320, 5024, 15599, 261159, -172163, 125265, 6081, -214120, 25025, -161478, -127118, 95742, 97679, 69482, 161642, 40175, 19591, -38992, 40850]
12474C55635H4783K1698c58169a16026r6150f4128a7954r870I6897A3508a67922
12462a41720B52643f0026H618a26452b8616E03280b55958B966a11573D4498g4624
12450a70841f6000E3211d47067f7735I1083b91774h0206I3460h0334A52842b32227
12438a18728B0803K99148A09860P3169e4343m6913C02609j5133f8068n0256j78101
12427b96425a36064o0938G2890a47714J9872M5495G2204a19746C0024a60181A69687
12415a97684B89354J42325F8362b105F353g8171j72767a4948q8124p1979B42402
12403G6461c0462n4699p2807P7506k7179C82969A86725J87686D2100a12579m8615
12392a61194B5530M5694Q8783D8680N6899a17687A9894f8504K5059j42624L4579
$$ y = [355635, 84783, 106481, -358169, -116026, -212176, -64128, -17954, -27824, 96897, 13508, -167922, -141720, 252643, -60026, 8618, -126452, -28616, 503280, -255958, 2966, -111573, 44498, -74624, -170841, -66000, 53211, -447067, -67735, 91083, -291774, -80206, 93460, -80334, 152842, -232227, -118728, 20803, 319951, 109860, 183029, -54343, -101256, 302609, 287476, -68068, -118324, -296425, -136064, -197002, 72890, -147714, -127842, -82347, 72204, -119746, 30024, -160181, 169687, -197684, 289354, 431679, 68362, -2105, 6353, -78171, -250938, -14948, -103072, -175051, 242402, 76461, -30462, -85161, -157968, -80462, -107641, 382969, 186725, 374411, 42100, -112579, -161194, 25530, 71224, 160007, 48680, 105579, -117687, 19894, -68504, -43445, -186069, -151490]
12381a51490I4290a48683C35826I4468b6688C719N6378a14923p32j88732a15254
12369A45680b9104a4220B8206M7006b71942C69882i8751j87041A04790m8207c65218
12357E5991J03613b12109A03708h942E9893J50503b52750a07083C3071a09276
12346d96786a5023A16045K00860a18693A81066F2731f5221Q42j06930C60300F6412
12334d28423I3922i2760j61474G2743J3768a7560I1280A1245a33214n8706a7632
12322b30284E5208J26752g7080k20938A7987J66350G7245d17434a43930C24483
12311a5200G3829b94864a45483A32447J55784f3973F8527d3691k2643B06466c3192
12299A41358J38821q5216A5503P6745B8306a28282C7651K5335J40172h6868I1011
$$ y = [-151490, 94290, -148683, 335826, 94468, -26688, 3719, 60097, -114923, -115655, -304387, -115254, 145680, -29104, -14220, 28206, 75212, -271942, 369882, -98751, -285792, 104790, 56583, -365218, 55991, 159604, -212109, 103708, -8942, 59893, 210396, -252750, -107083, 33071, -109276, -496786, -15023, 116045, 316905, -118693, 181066, 62731, -65221, -64379, -171309, 360300, 66412, -428423, 93922, -92760, -254234, 72743, 86511, -17560, 91280, 11245, -133214, -191920, -17632, -230284, 55208, 181960, -77080, -298018, 17987, 184337, 77245, -417434, -143930, 324483, -15200, 73829, -294864, -145483, 132447, 288231, -63973, 68527, -43691, -66334, 206466, -33192, 141358, 280179, 194963, 15503, 92248, 28306, -128282, 37651, 62986, 203158, -86868, 91011]
12287G5344d0832I1941a74829D96626j89187I0665A5400a1159j09172I0502B8729
12275B21419M124H2015J45852B4745K48551q5076d7010H98J34233J19654f0644
12263A85957h0958G3804L35690h0601b6991A86356d6319B24475K62888h1963I0380
12251B28636G1075a78952A76589b8438p3555A17970K70001J91267A57731P5849
12241B33580q2918M242h1666c7694a1133q2605A33533C2818E828J4199J54738
12230A74765J88894c189m9337B92858A26317C2029P8683J36816M0197n0425Q0362
12219C17662b5182D78052j5842p4346k8341j34528o9310o825c3832I2782c4928
12207b17631H8908C9302a44890D21810j34497n0072n9565K19758R6533a34088
$$ y = [75344, -40832, 91941, -174829, 496626, 307439, 90665, 15400, -11159, -120331, 90502, 28729, 221419, 225543, 82015, 227867, 24745, 273296, 188220, -47010, 898, 135131, 254785, -60644, 185957, -80958, 73804, 409494, -80601, -26991, 186356, -46319, 224475, 487363, -81963, 90380, 228636, 71075, -178952, 176589, -28438, -101993, 117970, 387971, 579238, 157731, 233580, 150662, 154904, -81666, -37694, -11133, -93738, 133533, 32818, 5828, 20027, 174765, 363659, -3189, -52526, 292858, 126317, 32029, 110712, 247528, 287725, 237300, 317662, -25182, 478052, 462210, 387864, 359523, 224995, 155685, 148860, -33832, 92782, -34928, -217631, 88908, 39302, -144890, 421810, 287313, 237241, 177676, 397434, 493967, -134088]
12196A57888K11921n676g1997l4820D79723A65724D7391K4511a16231A57604q181
12185A49423l7652R0859K17807q3690K2724d69081h143k83345D05758J07525j81012
12174C32271e8992D23317B03436r9647l9120J48163j9242d3581D5902b6004C03674
12162C40772F3620j279i1657B11682O1496f6221j97113J08904B64373D2709e9260
12150b4568B30748J8605K44899E2490K14626n9814a49801A88176F3087k455a20579
12138E7914d9685A22917C9147a50369c1858j16302B74130j31434J1373E9590K66843
12127C26433q9496F3905J11286e2528C50520R5524G6390b8274j21132j3312f2605
12115b43946a20127A66853F2599N6074f3754j23985K9948l7691j03183B78644
$$ y = [157888, 369809, 364133, -71997, -106817, 479723, 165724, 47391, 71902, -116231, 157604, 149423, 111771, 202630, 420437, 336747, 359471, -469081, -8143, -291488, 405758, 513283, 332271, -58992, 423317, 203436, 103789, 64669, 212832, 193590, -43581, 45902, -26004, 303674, 340772, 63620, 62341, -91657, 211682, 273178, -66221, -263334, -154430, 264373, 42709, -59260, -24568, 230748, 249353, 494252, 52490, 267116, 207302, -149801, 188176, 63087, 60632, -120579, 57914, -49685, 122917, 39147, -150369, -31858, -148160, 274130, 142696, 154069, 59590, 326433, 236937, 63905, 175191, -52528, 350520, 446044, 76390, -28274, -149406, -162718, -62605, -243946, -120127, 166853, 62599, 118673, -63754, -187739, -157791, -195482, -298665, 278644]
12104H6707O1354a93797C5468J11801d0330k75720A36437D5815b58105h9011B0746
12092b57549b7942A06614Q1232b03012C9533M5649k8088a70740M9412j64509A54763
12080e3527o7645e9161A64239K14990a22817j52925A21182J38038f4473o603F71437
12068A127432J149125G43230l27783A44985a25772B14079e837A22782J74290j31758
12058A65314l3223E5341k2845J38344i3587L3020E6998N2644a40019k96847g5059
12046B8795m739Q9542f626j71173A67755o4270d1636k15401f7380F8672P362B3819
12033c75683A34869a70706j12349a24002I0303K16063j02231b74285P7633m700
12023b01352A0572J96843b99127b979m8902B42880M3813q075a63635A46322M9778
$$ y = [86707, 148061, -193797, 35468, 147269, -40330, -316050, 136437, 45815, -258105, -89011, 20746, -257549, -27942, 106614, 187846, -203012, 39533, 85182, 57094, -170740, -121328, -285837, 154763, -53527, -121172, -59161, 164239, 379229, -122817, -275742, 121182, 259220, -64473, -71076, 671437, 1127432, 2276557, 743230, 415447, 144985, -125772, 214079, -5837, 122782, 297072, 165314, 132091, 55341, 32496, 170840, -93587, -60567, 56998, 109642, -140019, -436866, -75059, 28795, 24056, 113598, -6626, -177799, 167755, 103485, -41636, -257037, -67380, 68672, 76034, 23819, -375683, 134869, -170706, -283055, -124002, 90303, 306366, 204135, -274285, -196652, -201352, 10572, 207415, -299127, -2979, -51881, 242880, 286693, 278618, -163635, 146322, 196100]
12012A96100b2216P842B31623b4336M09C7490g8000j78619B9626b23242A13299
12000b36587J09843A71534a35523I5325i1660j60611d6030j20139A58461a90722
11989B12152H3438L3410a86756Q3856M1626B22297k1519C9887h5987l5249l9629
11978a60865H0744J4370a48831I8372c71097Q5909M6054G0598R8347l8029e4986
11966b6426C04381a11060p4896K6890j27329A17572O2072l1605R9345c80007G8193
11954g8081A86454F3028J69143a54872A99900n389a11068k183e189A31643i1159
11942D18585A91568R4447H9404a43134B61701A19405A1348a67062b6335j37294
11932a63629A23181o0094d39536J90916B10061b4454D9444d3582j73517A75672
$$ y = [196100, -22216, -14374, 231623, -24336, -23927, 37490, -78000, -256619, 29626, -223242, 113299, -236587, -126744, 171534, -135523, 95325, -91660, -252271, -46030, -166169, 158461, -190722, 212152, 83438, 116848, -186756, -102900, -61274, 222297, 200778, 39887, -85987, -121236, -160865, 80744, 95114, -148831, 98372, -371097, -285188, -239134, 70598, 168945, 130916, -54986, -26426, 304381, -111060, -185956, -159066, -286395, 117572, 179644, 148039, 247384, -380007, 78193, -78081, 186454, 63028, 232171, -154872, 199900, 194511, -111068, -113251, -5189, 131643, -91159, 418585, 191568, 286015, 89404, -143134, 261701, 119405, 11348, -167062, -26335, -163629, 123181, 63087, -439536, -248620, 210061, -24454, 49444, -43582, -217099, 175672]
11921E05K10921b794j93002D8586b78879A95274b89071c3752A70438a98617R1274
11910a07343k25332B67421B3449e3432A36134k7110A26c9363F3744a11556D9355
11898A90836c21722D3823J22808A7719J02422c9152A54271K8708r320b07209A10772
11886F0686i9874k21891a18036A1132J35340i3223K0218A14748b16672k8118d9317
11874A5057a33426A17074m6310m248a64133k50120D1964c00938m0999a20495e0353
11862B64031b05715k6418E3334d2321m7386o255I7231g3801B21147b68611B4445
11850d05467D4825J38364q4628a22851j71742A19434M3029b94426a11869C9711
11839b0669j29013B96994a28014k0000B7781a83505A78303b69052A37111J03178
$$ y = [505, 211426, -2794, -195796, 48586, -278879, 195274, -289071, -33752, 170438, -198617, -107343, -332675, 267421, 23449, -53432, 136134, 109024, 126, -39363, 63744, -111556, 49355, 190836, -321722, 43823, 166631, 17719, 120141, -39152, 154271, 182979, 173659, -207209, 110772, 60686, -99874, -321765, -118036, 11132, 146472, -93223, -73005, 114748, -216672, -244790, -49317, 15057, -133426, 117074, 70764, 66516, -164133, -414253, 41964, -300938, -341937, -120495, -50353, 264031, -205715, -232133, 53334, -42321, -89707, -95962, 97231, -73801, 221147, -268611, 24445, -405467, 44825, 183189, 98561, -122851, -294593, 119434, 162463, -294426, -111869, 39711, -20669, -149682, 296994, -128014, -148014, 27781, -183505, 178303, -269052, 137111, 240289]
11829B40289b43531A435c75384L5305A66436n2930m7954d3203j50838L2123q955
11818a70873F850J58812b85876A74018K45618a84350H9269a72760c6726k1639
11808e8365D0956J21234C5783b25590f1043k02503F7732b89216B24760a49742
11797g8494a7639l9217k26406J31810g905j622r2580p5618k96827G5941L59862
11786D35803g5266I9330a9646A3857b14420B772l52M7155a58079A79997D6823
11774C43078I2721l3198b91485A54754b98422A06456a32888b2118B10707F7203
11763A56322a1894l50777J47139h5592H0479k1495K40996a35812A26533L17193
11753D43726A12130J05190P5409j5084i2701H4027d5432j7025k1197j17441D7935
$$ y = [240289, -243531, 1435, -375384, -340079, 166436, 113506, 65552, -43203, -194041, -161918, -170873, 6850, 165662, -285876, 174018, 419636, -184350, 89269, -172760, -36726, -58365, 40956, 162190, 35783, -225590, -61043, -263546, 67732, -289216, 224760, -149742, -78494, -17639, -56856, -283262, -151452, -7905, -9527, -102107, -177725, -474552, 75941, 435803, -75266, 99330, -19646, 13857, -214420, 2772, 2420, 49575, -158079, 179997, 46823, 343078, 92721, 59523, -291485, 154754, -298422, 106456, -132888, -22118, 210707, 67203, 156322, -11894, -362671, -215532, -85592, 80479, 58984, 299980, -135812, 126533, 443726, 112130, 217320, 292729, 277645, -92701, 84027, -45432, -62457, -83654, -201095, 47935]
11741C13509a47553I7190k7583L4926b98250e5856o5403B43386b61786a18797
11730D35468q3828d800B5764a22121q6699R4174B74906b32415j17538b1283A77509
11718b32834G7528h7644A60250C4373J24471c07006D7801j1065c15o6213C08650
11706a95495f231C45127c96627A2644J70752m8918a27818C014J41521b28675p2199
11695c00874G1281K723J55876N8960F5330a6357l23995B46612f1316a9304D7825
11683C2809J91500D9435N7884J53052b0675p692j89892J03057f566D0781R2054
11672A32835n8120K03024H6985P4515l9235C6094b49243A52705d0770A31402a16738
11660A21344M4456H2534K20051R5419B7168n761N1923J47295b8830B54993q1148
$$ y = [313509, -147553, 97190, 69607, 104533, -298250, -55856, -121259, 243386, -261786, -118797, 435468, 351640, -4800, 25764, -122121, -208820, -114646, 274906, -232415, -349953, -21283, 177509, -232834, 77528, -87644, 160250, 34373, 158844, -307006, 47801, 36736, -315, -66528, 308650, -195495, -6231, 345127, -396627, 12644, 183396, 134478, -127818, 3014, 144535, -228675, -300874, 71281, 74004, 229880, 288840, 65330, -16357, -340352, 246612, -61316, -19304, 47825, 32809, 224309, 49435, 107319, 260371, -20675, -28367, -218259, -115202, -6566, 40781, 132835, 74715, 277739, 86985, 161500, 122265, 36094, -249243, 152705, -40770, 131402, -116738, 121344, 165800, 82534, 302585, 398004, 27168, 21407, 73330, 220625, -28830, 254993, 173845]
11649A73845N8294C7438J52579n0982K66940A66609M6089p9054K2623K5688P6458
11638B58413a79180a1925H6567b29027A88766b01248O1548p2555b5018m912j9442
11627d9372H3361J5343A1876J50897a16383l7226A01545g9971B85799a06870A23701
11615b61296b0785F8897a63083M2083E623J31515n7754A8098a48549b1119j06179
11604a27298M3212k3854C17482A49922o5359a04731c2907r5811B39938K1958p1160
11593A90736E1136b3818E0858a55098A69679F6430A5220K88962p7575I4106J49572
11582B43678c9230G8272J3945J17423g7479C94676j93731r0408l9979J05832C1201
11570A6753K12255L6373G1300q521a52969B1049K66434a84995b8234J0810G3892
$$ y = [173845, 232139, 37438, 190017, 139035, 405975, 166609, 212698, 133644, 156267, 181955, 258413, -179180, -11925, 86567, -229027, 188766, -201248, -139700, -212255, -25018, -29930, -49372, 83361, 98704, 11876, 162773, -116383, -153609, 101545, -79971, 285799, -106870, 123701, -261296, -20785, 68897, -163083, -121000, 5623, 137138, 79384, 18098, -148549, -21119, -127298, -84086, -107940, 317482, 149922, 84563, -104731, -32907, -128718, 239938, 261896, 190736, 51136, -23818, 50858, -155098, 169679, 66430, 15220, 304182, 226607, 94106, 243678, -39230, 78272, 92217, 209640, -77479, 394676, 200945, 110537, 70558, 176390, 31201, 16753, 229008, 265381, 71300, 62779, -152969, 21049, 287483, -184995, -28234, -17424, 73892]
11558g3429A10824J01163f6596A91696a5091A14717m627K0594c08344B59145b9416
11546A52136P6276c9250A31033a36875B29133J39559j15106n2938b23290C52395
11535A13262K0083C4910K65460k4247P5460p3709A12165B078L4849K05248A04246
11523i7671C41978A5316K39646O5362d6877G9905J85856J37006A70947K74806
11513D45753a97967g6191p0384H1333L4718M34238a49359A23722C5392J09927
11503A45319N3302J13505b1991A62826E0686K78799I2950J7185O3062p4295K57319
11492C56221j49386N8877j22319O4673j2385c55578G1430a86956A66036Q2702
11482B48738A10238K63097j31056A12481J75621J32936j34576H494J31760L24101
$$ y = [-73429, 110824, 211987, -66596, 191696, -15091, 114717, 110090, 130684, -308344, 259145, -29416, 152136, 228412, -39250, 131033, -136875, 229133, 368692, 253586, 200648, -223290, 352395, 113262, 133345, 34910, 300370, 276123, 351583, 277874, 112165, 2078, 36927, 242175, 104246, -97671, 341978, 15316, 254962, 320324, -46877, 79905, 265761, 402767, 170947, 445753, -197967, -76191, -146575, 81333, 116051, 550289, -149359, 123722, 35392, 145319, 198621, 312126, -21991, 162826, 50686, 329485, 92950, 110135, 173197, 98902, 356221, 206835, 265712, 143393, 208066, 195681, -355578, 71430, -186956, 166036, 248738, 110238, 373335, 242279, 112481, 288102, 421038, 286462, 8494, 140254, 464355]
11472D64355a97660L1349p7124C12038A31133b72920A09723b01483D08692a9657
11461F6738L89100A99169d1097B108R2829j6233k8796a37444C0224a16248B15113
11449B8127J10933a6784D32306e2145D80923b5718I4968Q8230H9150M534a0670
11437c92024A6412J73165C4022a82484g3093G7535K35344b05195B49875K4147
11427B74022H3533m374b07280H1022K46943b5718A16256J80345c9237j12943g3364
11415b37974B58735j17407C6605b31063j12891J53114G1895a68395I0484K53913
11405C44397o6847C193J81437Q3503C826b0389C3877h7245A93737P2306f7248
11393i7943p1092A53921m5443D012a69210B22735H926b74340D0093J48998E9750
$$ y = [464355, -197660, -166311, -243435, 312038, 131133, -272920, 109723, -201483, 408692, -19657, 66738, 455838, 199169, -41097, 2108, 94937, 78704, 49908, -137444, 30224, -116248, 215113, 28127, 139060, -16784, 432306, -52145, 480923, -25718, 94968, 183198, 89150, 93684, -10670, -392024, 16412, 189577, 34022, -182484, -73093, 77535, 312879, -205195, 249875, 274022, 83533, 79159, -207280, 81022, 327965, -25718, 116256, 296601, -39237, -152180, -73364, -237974, 258735, 141328, 36605, -231063, -343954, -190840, 71895, -168395, 90484, 344397, 277550, 3193, 184630, 268133, 3826, -20389, 33877, -87245, 193737, 266043, -67248, -97943, -169035, 153921, 108478, 4012, -169210, 222735, 8926, -274340, 40093, 189091, 59750]
11381A03334K03150C0265L26136o0648F1500e9984A29006K1114J66448A04497
11370g5166I4764i8076D7637K44162i9494k8556j08157B26724A0794P3865a46932
11358d8196A75331b4424B62704b38576i3958A6873a53451D4091J78407e1058E3788
11346d48398f8364F1251d27284h3116a6839E6291f6137e556C4683h2720I9009
11334A74939o7400D818J00313K99459c44190A36310N7086d6091A42865c39170
11323c2866p0559A77435b14555J00363C17677a3858j04683C49835b20680N1738
11313a68942n4275Q8443k6084p8421c2354n6943c4031r1801m3358r4932A16537
11301A1920c04142a34223j10605C7732b04270c5539j18973G601J00884b56688
$$ y = [103334, 306484, 30265, 356401, 295753, 61500, -59984, 129006, 150120, 316568, 104497, -75166, 94764, -98076, 47637, 291799, -99494, -128050, -236207, 226724, 10794, 84659, -146932, -48196, 175331, -24424, 262704, -238576, -93958, 16873, -153451, 44091, 222498, -51058, 53788, -448398, -68364, 61251, -427284, -83116, -16839, 56291, -66137, -5556, 34683, -82720, 99009, 174939, 107539, 4818, 105131, 404590, -344190, 136310, 193396, -46091, 142865, -339170, -32866, -103425, 177435, -214555, -114192, 317677, -13858, -118541, 349835, -220680, -168942, -223217, -134774, -160858, -239279, -32354, -89297, -34031, -125832, -169190, -264122, 116537, 11920, -304142, -134223, -244828, 37732, -204270, -35539, -154512, 7601, 108485, -256688]
11290e1248A20616E6799O5796a68417G4723d08886A41657b75224N4391o2665D9399
11278c9124j73052b9771j53981j0493G9778J61630j04544L2822G9176b38514J15843
11267a22671E5496B0446R2965d8874l4662A51467B9223J2177K05907F0861e6546
11255a17807B88190f431A60370a91693E583h3501q2485Q1425k06524f7331p8050
11244a45381k487p3087H8295a42508A41783a51476L941K7506p2817E4314b08263
11232b7258D1762c70631a60141j38652B72057b01205B9553a94330A54706a38183
11221d0257F4600K6237C009e2507A47428a81131d8363A54199i2466j23061I2469
11209E9800J41505h9039B67774a28040B39867p0617m5180E3771M8971b17790f1044
$$ y = [-51248, 120616, 56799, 122595, -168417, 74723, -408886, 141657, -275224, -220833, -283498, 49399, -39124, -212176, -29771, -183752, -194245, 79778, 241408, 136864, 169686, 79176, -238514, -122671, 55496, 20446, 113411, -48874, -83536, 151467, 29223, 41400, 247307, 60861, -56546, -117807, 288190, -6431, 160370, -191693, 5583, -83501, -165986, -84561, -291085, -67331, -145381, -147868, -220955, 88295, -142508, 141783, -151476, -147535, -120029, -192846, 54314, -208263, -27258, 41762, -370631, -160141, -298793, 272057, -201205, 29553, -194330, 154706, -138183, -40257, 64600, 90837, 3009, -52507, 147428, -181131, -48363, 154199, -92466, -215527, 92469, 59800, 201305, -89039, 267774, -128040, 239867, 169250, 124070, 53771, 102742, -217790, -61044]
11197h665A87526g0462A52232D6903b59208a00775A73043a8842G69d03221h1798
11185F412a69979M2176A76319c48640a44154k84767a77466P1337j55966K5581
11175b36514N3551A55164C4116b1231l1556p2468M4689j26752h2676j16147A24908
11163A93093b0769m1485A39186j7750E7719h4431l2813j62222A47979a96086m8101
11152b44187k3133g3020A21975L9040m3723e237B15964C1533J2681A6942L9639
11141E6581f17q4990l3080A9511M522Q2390O6848K5359n6245C8729J11772e9283
11128g991A42906K17204d514m9611A36640J13381D0020J64112f0858k00892C8752
11116b67083A68643p1213K5078C5J87015m672F687J7391a2810H4506L27522F2595
$$ y = [-8665, 187526, -70462, 152232, 46903, -259208, -100775, 173043, -18842, 769, -403221, -81798, 6412, -169979, -127803, 176319, -348640, -144154, -428921, -177466, -106129, -262095, -236514, -182963, 155164, 34116, -21231, -52787, -125255, -80566, -207318, -82676, -198823, 124908, 193093, -20769, -62254, 139186, 121436, 57719, -84431, -117244, -279466, 147979, -196086, -244187, -267320, -73020, 121975, 161015, 117292, -5237, 215964, 31533, 44214, 16942, 56581, -617, -85607, -118687, 19511, 24033, 106423, 173271, 198630, 142385, 38729, 150501, -59283, -7991, 142906, 360110, -4514, -54125, 136640, 250021, 40020, 204132, -60858, -261750, 38752, -267083, 168643, 97430, 122508, 35, 187050, 182378, 6687, 24078, -12810, 84506, 412028, 62595]
11103D25412B6762Q2078J2506J4782a60452D93718B31904C5874J33984e0441C42011
11091B12606E9934K66998C2837O2148K51435j68731O8744I9616K38118A25329
11080A98924J12945O51r2472F7677b2754B69045P2660K8423K14729A69472M5709
11069B15181J62144J40098j60125j52334K10188J20840P920r0128j1010L59545
11059H02319q2805j64220q6202J06153R9278J30995j49055k64113Q4171M16637
11049H93158m3926l03062J86407P2426J56021j82958j16315p4479N27463j98936
11039I15799j78378J571p5065K01390J30652j98945p0987L0290p501C60993P32945
11028A093938D45152J52335L05442k75117J46998k71725K19629K12169n9191l28277
$$ y = [425412, 26762, 108840, 121346, 136128, -160452, 493718, 231904, 35874, 169858, -50441, 342011, 212606, 59934, 326932, 32837, 94985, 346420, 177689, 246433, 99616, 337734, 125329, 198924, 311869, 312520, 220048, 67677, -22754, 269045, 341705, 370128, 584857, 169472, 215181, 377325, 517423, 357298, 204964, 415152, 535992, 543912, 453784, 442774, 802319, 719514, 555294, 469092, 575245, 674523, 805518, 656463, 392350, 476521, 893158, 849232, 546170, 732577, 805003, 961024, 778066, 661751, 587272, 1114735, 915799, 737421, 738992, 663927, 865317, 995969, 797024, 726037, 756327, 748826, 360993, 1093938, 445152, 597487, 902929, 627812, 774810, 503085, 722714, 934883, 875692, 547415]
11018E47415J79085L49530k19928j81714R9935k86249M48538k80488M49100l20400
11008G84824o3695n6985p1724J28214k51854J80858P2776j36014M09803k78930
10998G17273L30350l29697Q4743J80065j44723l39985J04818j90282N21618K8397
10988I62577j54810J75221L01799k34776j56744j3045J57853k33653K99848J87507
10978A291777K81878j43711j5640N15973J17248M2323O97032J59519K61331k05801
10968C001929K22923J02605l75533l24690M3258k58170k68140L6823m22771K10142
10958A968376K17788l41636R2300K13982n2180j99221j24984m29892L29152n20610
10948A153075k05552l88493O6645B81654o0045L80561B1923K71213F8444M5179
$$ y = [547415, 726500, 1076030, 856102, 674388, 774323, 488074, 936612, 656124, 1105224, 784824, 721129, 664144, 592420, 720634, 468780, 649638, 722414, 586400, 996203, 717273, 1047623, 717926, 802669, 982734, 838011, 498026, 602844, 412562, 934180, 962577, 807767, 982988, 1284787, 1050011, 893267, 880222, 1038075, 804422, 1104270, 1291777, 1573655, 1429944, 1414304, 1930277, 2047525, 2089848, 2786880, 2946399, 3207730, 3001929, 3224852, 3327457, 2951924, 2627234, 2670492, 2412322, 2144182, 2181005, 1758234, 1968376, 2186164, 1844528, 1936828, 2150810, 2098630, 1899409, 1774425, 1344533, 1673685, 1153075, 947523, 559030, 625675, 281654, 221609, 602170, 21923, 293136, 68444, 113623]
10938A13623K54456H9700J82745O3748I9171j0558J40786l0761k6385p8650a31266
10926H1342C616R4954P6553h7284m7440A13136N7383q2154o911c7355m5572k6727
10914a09654G724L53965j70204d8346C8045a78866E5701b46466C90521D6670e5991
10902G5419a6763B15049g4708j17251r0251A3427J04730a79131G1538d2782j19314
10891a62096H0494D472J92759b51028n7105a13580A11305K7306b04190A26173
10880g3527D5005a51233O5690o1052A20584P4639b96941a16712B49180E4474a60637
10868f51982b50423c7425C51438g2256F8509g8301A78335o5079a14352B2117h9105
10856A12706c12486A4129a64400k4031A48552d93352B00722e16205A15949b77897
$$ y = [113623, 368079, 89700, 272445, 336193, 99171, 88613, 229399, 198638, 172253, 93603, -131266, 81342, 3616, 98570, 175123, -87284, -134724, 113136, 170519, 88365, 81454, -37355, -82927, -109654, 7724, 361689, 191485, -48346, 38045, -178866, 55701, -246466, 390521, 46670, -55991, 75419, -16763, 215049, -74708, -191959, -282210, 13427, 118157, -179131, 71538, -42782, -162096, 80494, 4472, 197231, -251028, -308133, -113580, 111305, 138611, -204190, 126173, -73527, 45005, -151233, -85543, -146595, 120584, 195223, -296941, -116712, 249180, 54474, -160637, -651982, -250423, -37425, 351438, -72256, 68509, -78301, 178335, 113256, -114352, 22117, -89105, 112706, -312486, 14129, -164400, -188431, 148552, -493352, 200722, -516205, 115949, -277897]
10845b09985D9970F908c57987C24428r8113I5356C3324a96645q43h4128A50565
10833B18507B2842j0169K75903a33983A72365j3272F489P7705d735G1133C5033
10821H6656l9492N5420a41566M6230j78762A99988h2378n1969j34886a19266f448
10809A04871c10287B24711i1741j53165A62864a57020A50217n8724J69555B7910
10798d56290K02517B3522i1649L466j17384q1535E82598d0299A98865c15022B5000
10786c2950r8736C2544a23294C17559i3171m2464c7459J3935j95746C62150j31789
10775B30361a4064j29114b249F084J81082A0500P5023c1328F1469a30404B56719
10763b05590C2894J10421b04057B8527J54141a46242b2862j40822k348K4660N9166
$$ y = [-209985, 49970, 6908, -357987, 324428, 226315, 95356, 33324, -196645, -197488, -84128, 150565, 218507, 22842, 12673, 288576, -133983, 172365, 159093, 6489, 84194, -4735, 71133, 35033, 86656, 47164, 102584, -141566, -95336, -274098, 199988, -82378, -134347, -269233, -119266, -6448, 104871, -310287, 224711, -91741, -244906, 162864, -157020, 150217, 91493, 261048, 27910, -456290, -253773, 23522, -91649, -88183, -205567, -287102, 582598, -40299, 198865, -315022, 25000, -32950, -131686, 32544, -123294, 317559, -93171, -135635, -37459, -23524, -219270, 362150, 230361, -14064, -143178, -2249, 6084, 187166, 10500, 85523, -31328, 61469, -130404, 256719, -205590, 32894, 143315, -204057, 28527, 182668, -146242, -22862, -163684, -166032, -141372, -82206]
10752h2206A6599a41288L7888M4173A57212C1376b85077D5256O5493K8915a51235
10740d32304H9791K03616A22530c19053c3779j34199I2120j7141L17271A9881
10729B45955a80940n0862A63791i1291E6246i0387j0B7586b9444p3777J5854C09345
10716d02920g3264l7436o3279Q4893O356A51170B3382b2618C3296a93859D1716
10704E57935a28094r6804e1191q603I0886J3119K8021h589A41953a29628L7259
10693i2369j59579d4598j43084H2827B5054J29375a15961C85022F7342M6859J32519
10682B46720i4290B06746a61686j30583n6317I8958d27231B36960o2745a53972
10671B24732a58162d0678k29555A96888d16120k7196a23724C71106B2861a6260
$$ y = [-82206, 16599, -141288, -103400, -59227, 157212, 31376, -285077, 45256, 110749, 139664, -151235, -432304, 89791, 293407, 122530, -319053, -33779, -167978, 92120, 74979, 392250, 19881, 245955, -180940, -231802, 163791, -91291, 56246, -90387, -90397, 27586, -29444, -103221, -87367, 309345, -402920, -73264, -110700, -173979, -89086, -82730, 151170, 23382, -22618, 33296, -193859, 41716, 557935, -128094, -224898, -51191, -59794, 90886, 104005, 132026, -8589, 141953, -129628, -92369, -251948, -44598, -187682, 82827, 25054, 154429, -115961, 385022, 67342, 114201, 246720, -94290, 206746, -161686, -292269, -348586, 98958, -427231, 236960, 174215, -153972, 224732, -158162, -40678, -270233, 196888, -416120, -443316, -123724, 371106, 22861, -16260]
10660A50775Q6594b13070i4573j3355k48543J36115K2920m533i7463M0537N763
10649e1163C5796L13097b08466l492a9765A08746j9272a15322L1036D9942N4381
10638A04323d00811J93552A23706E6591c1800H8058L2042a86295A86666g8445
10627B83409a9541k47198q2558A95101a32963a6044C2024K4192N6364g500l8506
10616d6006o739r5818a4906q2161B58032g7061A91507a71190d8747A23779b23175
10604a17028B2852g0044b8266l6775q0499j17407O8296N1324K3733G210a11708
10592C350M3553h6035B1816J900a82677Q7542C9631j7952a79210e5709K022j63504
10580b17191D19594b80613a10384n1258N5247J2033j17773F0542A1893c74104
$$ y = [150775, 237369, -213070, -94573, -107928, -356471, -220356, -197436, -201969, -97463, -56926, -51163, 35796, 348893, -208466, -211958, -19765, 108746, 89474, -115322, -84286, 49942, 104323, -400811, -207259, 123706, 56591, -31800, 88058, 120100, -186295, 186666, -78445, 283409, -19541, -266739, -349297, 195101, -132963, -16044, 32024, 56216, 112580, -7500, -46006, -52745, -148563, -14906, -97067, 258032, -77061, 191507, -171190, -48747, 123779, -223175, -117028, 22852, -70044, -28266, -65041, -145540, -262947, -194651, -143327, -119594, 7210, -111708, 3350, 46903, -86035, 21816, 23716, -182677, -95135, 39631, 21679, -179210, -55709, -53687, -217191, 419594, -280613, -110384, -161642, -106395, -94362, -212135, 60542, 11893, -374104]
10569b03683q7146a07472D3406c0745I5677J84458c07255L6815e3280F5231g2782
10557a27972A0263a9772j4052j32798K4386k9796D8410c56272B90880a53211p0294
10546b23505c8738A82187B1333a24868A17279g854l6705j97108b415B03482M4552
10535B48034d1349A13382c01766Q6698A24728i7941p0676B8668J60144E6330b26550
10523a5729l37288A9953i5223A86585c0342B2333a34749j08774j0907C2272c8511
10511A4216l922b48811e5433p834A26447b7974j82841B77428j7207J5829B1401
10499c10362B88956G8211a66810a3554l04450a16489K2007o4012L4053r3702A50995
10487C7346m069J56801h6716A02397l6835K7248N2673J49424K25182B15567M13329
$$ y = [-203683, -290829, -107472, 43406, -30745, 95677, 280135, -307255, -270440, -53280, 65231, -72782, -127972, 10263, -19772, -33824, -166622, -142236, -172032, 48410, -356272, 290880, -153211, -223505, -38738, 182187, 21333, -124868, 117279, -7854, -44559, -241667, -2415, 203482, 248034, -41349, 113382, -301766, -215068, 124728, -97941, -168617, 28668, 188812, 56330, -226550, -15729, -353017, 19953, -95223, 186585, -30342, 22333, -134749, -243523, -254430, 32272, -38511, 14216, 10294, -248811, -55433, -63267, 126447, -27974, -210815, 277428, 260221, 276050, 21401, -310362, 288956, 78211, -166810, -13554, -318004, -116489, -94482, -158494, -124441, -218143, 150995, 37346, 33277, 190078, -86716, 102397, 65562, 92810, 145483, 294907, 520089, 215567, 628896]
10476F28896j35447k01997a6954C3858K73180m7702d039F3705h24l89868A26443
10464B18375f0520n527k3683A62882a37929D5731b26116A60822i5331D6617c04193
10452b28317A57915e0282j92086l297i3928a6753A10424l8188J10747M3623E81
10440B02536d0603B93533a49381d2448B30041a46299B23762H4331k2736Q7434
10430A49029m4987a8225A80953b87111D4433K43064g9153m8258f3197b5038l6963
10419f2001O075A73190a26121L5502j80896b7924A54125A1926R5697J07821k9214
10408A86230E9537J68930m6654o1973a91005A61610n2063K73494I7982g3141A06352
10396a09770d9364b541A13728a03363o6695D12516i1004A12554K62145j09187
$$ y = [628896, 493449, 291452, -16954, 33858, 307038, 259336, -4039, 63705, -824, -390692, 126443, 218375, -60520, -66047, -89730, 162882, -137929, 45731, -226116, 160822, -95331, 46617, -304193, -228317, 157915, -50282, -242368, -245665, -93928, -16753, 110424, 72236, 182983, 226606, 581, 202536, -40603, 293533, -149381, -42448, 230041, -146299, 223762, 84331, 61595, 149029, 104042, -18225, 180953, -287111, 44433, 287497, -79153, -127411, -63197, -25038, -62001, -55926, 173190, -126121, -90619, -271515, -27924, 154125, 11926, 107623, 215444, 186230, 59537, 228467, 181813, 119840, -191005, 161610, 109547, 383041, 97982, -73141, 106352, -109770, -49364, -2541, 113728, -103363, -170058, 412516, -91004, 112554, 374699, 265512]
10386B65512a32413A09867a92710A41034b85239B12037G7315j6747J88919J9087
10376B68574o6373J6646M3780A31177K5874F6087K98659r7021K39940B14677J00140
10365C14817L24060j19807k49179K49188A88296B2111L86225A07434J90616a69857
10354D16971A03652L34200j07350J4680J40346P2291J05200M8557l38947l3062
10344C39567l18L61874B87194J00943A5864J32511J30754K38061j02356j32171
10334B82663a89163j66347C7357L31756c1809F8014J46499p8377o1799N08513
10324E82850F8373J85269K47258B32864k1263Q5991K48315A82780J63434A27018
10313b59511B99147A9468Q6676J47465J25828f5538E322c5874H4014A1446E72
$$ y = [265512, -132413, 109867, -192710, 141034, -285239, 212037, 77315, 60568, 249487, 268574, 202201, 218847, 262627, 131177, 157051, 66087, 364746, 267725, 507665, 214677, 314817, 638877, 519070, 269891, 519079, 188296, 22111, 408336, 107434, 298050, -169857, 416971, 103652, 437852, 330502, 345182, 485528, 557819, 663019, 711576, 372629, 339567, 339249, 701123, 287194, 388137, 15864, 148375, 279129, 517190, 414834, 282663, -189163, -355510, 37357, 369113, -31809, 68014, 214513, 136136, 74337, 582850, 68373, 253642, 500900, 232864, 211601, 297592, 545907, 182780, 346214, 127018, -259511, 299147, 19468, 106144, 253609, 379437, -65538, 5322, -35874, 84014, 11446, 572]
10301G2630k9460J6736b2897G5791a92450o1974R8298N1925b0082A99751b44882
10289c7043A69413a76489O1708A30337a97893M2628N5552A30473J15586G4255
10278b70856B34879a47902j24284O6508R9536d0188k702d478A20438l2025j114
10267H7299g9638A67144k4245J41157b02646i3241L3090j29263D4501J76437k6441
10256A94497J79892D6869L73289j63802f7261j5179A93056E8500M4810C0067L1890
10245F1957a46290k9910A58651a62468k3529A0686Q1224b44249j29906f4405m6894
10234a11299B89477h7219A36769D83a95680I865K020c13528A16149a0113A5621
10222a11440r9208A63677E9003F784J74122h7649K6656j3304i733m4053F9768
$$ y = [72630, 43170, 59906, -22897, 75791, -192450, -254424, -156126, -104201, -20082, 199751, -244882, -37043, 169413, -176489, -114781, 130337, -197893, -155265, -99713, 130473, 246059, 74255, -270856, 234879, -147902, -272186, -205678, -106142, -40188, -42890, -4478, 120438, 88413, 87299, -79638, 167144, 142899, 284056, -202646, -93241, -60151, -189414, 44501, 220938, 194497, 374389, 46869, 420158, 256356, -67261, -82440, 193056, 58500, 103310, 30067, 61957, -146290, -176200, 158651, -162468, -185997, 10686, 91910, -244249, -374155, -64405, -111299, 289477, -87219, 136769, 483, -195680, 9865, 11885, -313528, 116149, -10113, 15621, -111440, -210648, 163677, 59003, 6784, 180906, -87649, -60993, -74297, -9733, -53786, 69768]
10210c80508A22762l398a04745m0984D60194i1104h847m440m5967B50179b443
10198b02348G3342a83942C07588A38222E0003a20338k07684a303k58624a29265
10187A31821a21173a1184j90595C13863A02709Q9701a87859A2965a40104j5736
10177a55840k20538A83445H2959C1051a38629C5907c3634l02853C36030a61806
10166b56081M0611A60200j2425d1001E8616Q5903a9994G3903K65072j36088n640
10155A97247B9144b04542A35144a72682o0694l2553e0676C9410O2970c28138A07290
10143C9852J35283a08449A82873k5524c19047R0990Q1566F6198c51451h8779H3765
10131a906j66122q1890J21283K61B07627b07992J6485d9929k39626g4060A45271
$$ y = [-380508, 122762, 119364, -104745, -145729, 460194, -91104, -8847, -13287, -59254, 250179, -2443, -202348, 73342, -183942, 307588, 138222, 50003, -120338, -328022, -1303, -259927, -129265, 131821, -121173, -11184, -201779, 313863, 102709, 192410, -187859, 12965, -140104, -155840, -376378, 183445, 82959, 31051, -138629, 35907, -33634, -336487, 336030, -161806, -256081, -215470, 160200, 147775, -41001, 58616, 144519, -19994, 73903, 338975, 202887, 197247, 29144, -204542, 135144, -172682, -233376, -265929, -50676, 39410, 102380, -328138, 107290, 39852, 175135, -108449, 182873, 157349, -319047, -228057, -146491, 66198, -351451, -88779, 83765, -1906, -168028, -249918, -128635, -128374, 207627, -207992, -191507, -49929, -289555, -74060, 145271]
10119C9859c54544a41276d8363A28139n5158A2298K0768O6312a09145A29027k625
10108A26402f0338N843E914d91930A27598K02988a55571B5625O2717c4565o2612
10097i7177J3542j8246j27818E6862d8278j87195O0791A80862E9903b33753a8836
10085C7480p409b63626j7365D3685a43109A11281e70087a26400N7200k00591q1730
10074c51521m5745D1521A3513d6877p9080j96220A78953b40534m2231a31534A68478
10062G9030a619A58422B2969c0007l22475J06162a14556j80203b1374k74147h3906
10050d7083B50940J18333E1829O7954b78833O4948j96916J49924h9920i690l8951
10039d8641b06k34415e3340j45771B25635a47179k5984j11236a38074c8695k86707
$$ y = [39859, -354544, -141276, -48363, 128139, 72981, 12298, 33066, 99378, -109145, 129027, 126402, -60338, -54495, 5914, -491930, 127598, 330586, -155571, 25625, 88342, -34565, -97177, -83635, -101881, -229699, 56862, -48278, -235473, -174682, 180862, 59903, -233753, -18836, 37480, 30071, -263626, -280991, 43685, -143109, 111281, -570087, -126400, -69200, -269791, -351521, -397266, 41521, 13513, -46877, -125957, -322177, 178953, -240534, -282765, -131534, 168478, 79030, -1619, 158422, 22969, -30007, -352482, -246320, -114556, -294759, -21374, -295521, -83906, -47083, 250940, 369273, 51829, 119783, -278833, -213885, -410801, -260877, -89920, -9690, -48641, -206, -234621, -53340, -199111, 225635, -147179, -173163, -284399, -138074, -38695, -325402]
10028c25402C32326A03031a67863g0229o3812I5999a91827f1475n179j23539J6728
10017a73465k7186j31829H5167j8496b4047l22909B05328b37310H3764B0395g5268
10005a15569B53745F3348h6395j41019f2341r2848j31342b2409l01523M6017F7867
9993a98007B0146g154A42447o0726f3964r315j53085J05997L8665H3347a54219
9981b1484k24061B79498F123J64117b23983Q6614m7994b907q2182p3093a0732
9969C9534M9690a88096O4476N1414J2482o8756M5853k76664B22433b90417a32973
9957A42754g1025H3583c54686H5096b07743f591l3637A18415g3730k00637C15102
9945a53001L1657M9751j58775j93347a83106A49520a30179k201A39276a05299
$$ y = [-325402, 332326, 103031, -167863, -70229, -134041, 95999, -191827, -61475, -66654, -190193, -173465, -200651, -332480, 85167, 66671, -24047, -346956, 205328, -237310, 83764, 20395, -75268, -115569, 253745, 63348, -86395, -227414, -62341, -155189, -286531, -22409, -323932, -277915, 67867, -198007, 20146, -7154, 142447, 81721, -63964, -73279, -226364, -120367, -81702, 83347, -154219, -21484, -245545, 279498, 6123, 170240, -223983, -137369, -185363, -2907, -85089, -158182, -10732, 39534, 89224, -188096, -123620, -72206, -59724, -128480, -82627, -359291, 222433, -290417, -132973, 142754, -71025, 83583, -354686, 85096, -207743, -6591, -40228, 118415, -73730, -274367, 315102, -153001, -121344, -71593, -230368, -423715, -183106, 149520, -130179, -132380, 139276, -105299]
9934C8942b46542G6242l5362d43848E3379O2553d705l82898B8052b02980A78926
9922A72896a02884K038k7255A93187E4539l719J00963b49662c4100A34044d1228
9910i7969C7977c73239a8780m6009n0567c2121B45327r8198b52080C20058A24321
9898B4692f6780A69223a90935R1107D4701A8601f0040A96076K9208a11484F6538
9886f9100f845o5531B52776a23872e6883bG5384J2828a49577F6811f4966l8553
9874a03519A19669C3876e6992B00259G8291b35815o9787a13966j61156E4033a4766
9862a221A6586p170b11447A83376p3405g1365A90095a04496j02353j22775F9610
9850E6595g4924B056a42692d0197B66676j31284d17151C3590q527a06023A51533
$$ y = [38942, -246542, 76242, 40880, -443848, 53379, 115932, -4705, -387603, 28052, -202980, 178926, 172896, -102884, -100846, -128101, 193187, 54539, 50820, 151783, -249662, -34100, 134044, -41228, -97969, 37977, -373239, -18780, -64789, -115356, -32121, 245327, 147129, -252080, 320058, 124321, 24692, -66780, 169223, -190935, -99828, 44701, 18601, -60040, 196076, 225284, -111484, 66538, -69100, -6845, -72376, 252776, -123872, -56883, -2, 75384, 88212, -149577, 66811, -64966, -103519, 119669, 33876, -56992, 200259, 78291, -235815, -305602, -113966, -275122, 54033, -14766, -1221, 16586, 9416, -211447, 183376, 109971, -71365, 190095, -104496, -206849, -329624, 69610, 56595, -74924, 2056, -142692, -40197, 266676, 135392, -417151, 33590, 25063, -106023, 151533]
9838a80091J1573l6086m3797P424K8119d818C1768a74175h5715M0025i808A27056
9825A6352e7530l7019B3901J80828D2637e3475G0214N0898c4285q8321A9098J5890
9813C4988b51639a3171l38982M5117B02100a31614A89156c18959c8197q5951A29080
9801c1537B20142m3219F4682j4768A3427a98565A6102b01422C7730Q2522m8315
9790G1937k9683a24229f0145k9020C3964A845J93531a12467o944J1946L9762B22430
9777e22973G0552a05215k14853C5876b28752L9028f636H53K19551b62141c0523
9765b04818o2974J21587j61513e604A43064h6047C00594j07197M5583a39282B45838
9753a9793j91568C3350i6394A17713a42602E0906b10247O6924b6990N426p2789
$$ y = [-180091, -168518, -204604, -248401, -240977, -212858, -4818, 31768, -174175, -85715, -45690, -9808, 127056, 16352, -57530, -94549, 23901, 204729, 42637, -53475, 70214, 121112, -34285, -122606, 19098, 34988, -251639, -13171, -352153, -307036, 202100, -131614, 189156, -318959, -38197, -124148, 129080, -31537, 220142, 176923, 64682, 49914, 13427, -198565, 16102, -201422, 37730, 120252, 71937, 42254, -124229, -60145, -89165, 33964, 1845, 195376, -112467, -119411, -107465, -67703, 222430, -522973, 70552, -105215, -320068, 35876, -228752, -189724, -6636, 853, 220404, -262141, -30523, -204818, -267792, -146205, -307718, -5604, 143064, -86047, 300594, 193397, 238980, -139282, 245838, -19793, -211361, 33350, -96394, 117713, -142602, 50906, -210247, -143323, -26990, -21564, -94353]
9742i4353D7945J24802b19285G8374b21372L8507C1199c19647j33347A07212A5570
9730b64224j38754a28499j8623k6333O8604k19721e9354B15644R6039b18029h8054
9718a12391o6958p1805c591C19251b76245A21724f6459j09175G4780b39788f6770
9706c91593J2947N2465A38146C3316a78004B0254b25202J12450G7201g6300A13764
9694b35750p5249H4849l5421a45010B07994B9984h194j56827C1214K168c04001
9682F9765B0982b6554k94964a02182J3642j01952A36191a51583A61750n6296a64858
9670A83738G1413b17211A75185a45831B19759a26324c1514J0664p6059j3927B36487
9658a23325A82781q7763J03022d09573G0661b4342j10012r3462L5269h0689A01899
$$ y = [-94353, 47945, 172747, -219285, 78374, -221372, -182865, 31199, -319647, -452994, 107212, 15570, -264224, -402978, -128499, -147122, -173455, -104851, -324572, -59354, 215644, 311683, -218029, -88054, -112391, -179349, -251154, -3591, 319251, -276245, 121724, -66459, -175634, 74780, -239788, -66770, -391593, -378646, -326181, 138146, 33316, -178004, 20254, -225202, -112752, 77201, -76300, 113764, -235750, -310999, 84849, 49428, -145010, 207994, 29984, -8194, -165021, 31214, 33382, -304001, 69765, 20982, -26554, -321518, -102182, -88540, -190492, 136191, -151583, 161750, 105454, -164858, 183738, 71413, -217211, 175185, -145831, 219759, -126324, -31514, -20850, -96909, -110836, 236487, -123325, 182781, 95018, 198040, -409573, 70661, -24342, -134354, -227816, -192547, -80689, 101899]
9646i1962o543K8533l09130I636a60728P7219l9446j98965h5128H032h0458A41002
9633A90082c36457O2710A61002c4552j04153k62790a19163K9771M3546r2379m9706
9622a87931A83759a09568b8695k66241G7093d4266B7143a3830k18787o2599I9220
9610a27164D5465b35938a3436j25069k92566A53950N2817c65205H2936a71815
9599C79750A9753d50595B91723c04900A35388a97449h095q8506r5251a4294G6985
9587b89977a29181d7713H8495b03937r7800a05947j74272A08911a2440k26279
9577b38719J7416m0186C7456a6417j32209l7688A7354q8h7519I5076L9095A0431
9564i6643K7215m3830A3010c6865o7575q9728a93r2948G9288i2344C32166a28997
$$ y = [-91962, -98505, -69972, -379102, 9636, -160728, -83509, -122955, -321920, -85128, 8032, -80458, 141002, 190082, -336457, -273747, 161002, -34552, -138705, -401495, -119163, -89392, -45846, -138225, -187931, 183759, -109568, -28695, -294936, 77093, -44266, 27143, -13830, -232617, -295216, 99220, -127164, 45465, -235938, -13436, -138505, -431071, 153950, 206767, -365205, 82936, -171815, 379750, 19753, -450595, 291723, -304900, 135388, -197449, -8095, -96601, -191852, -14294, 76985, -289977, -129181, -47713, 88495, -203937, -301737, -105947, -280219, 108911, -12440, -238719, -221303, -261489, 37456, -16417, -148626, -186314, 17354, 17266, -87519, 95076, 134171, 10431, -96643, -69428, -113258, 13010, -36865, -104440, -194168, -193, -93141, 79288, -92344, 332166, -128997]
9551b59201O8789g5930c0063r8768n6691P7491B46783c8485C8158d7404q4256
9540a31660B94006F869J67513L0708H487a24424C1179b04069B2236K20596b60122
9528e5407k10173q5744G7267a74750e4962J8783A18268J26240n3424d51755i1310
9516C9149c22227a59121p0977Q1004A4633e56849a86576A20709h1506A0628b70937
9504A4020c23134F8773a64293J2434Q086a8791k60912C55008f2908j95711E0346
9492D5443a55083B25785B65a40402d8484j39122A94512a24051N3202C1083b61365
9480A77820b30810a07771j91689a33037j49191H7775a02687j97882J32405F2464
9469d5963n324J6616B01794D5122g8391A72280C5522a96251D7005K3674A4285
$$ y = [-259201, -190412, -75930, -30063, -128831, -185522, -108031, 246783, -38485, 38158, -47404, -131660, 294006, 6869, 174382, 205090, 8487, -124424, 31179, -204069, 22236, 242832, -260122, -55407, -265580, -351324, 77267, -174750, -54962, -36179, 118268, 244508, 191084, -451755, -91310, 39149, -322227, -159121, -230098, -149094, 14633, -556849, -186576, 120709, -81506, 10628, -270937, 14020, -323134, 68773, -164293, -151859, -143773, -18791, -279703, 355008, -62908, -258619, 50346, 45443, -155083, 225785, 265, -140402, -48484, -187606, 194512, -124051, -70849, 31083, -261365, 177820, -230810, -107771, -299460, -133037, -282228, 87775, -102687, -300569, -168164, 62464, -45963, -51287, -34671, 201794, 45122, -78391, 172280, 35522, -196251, 47005, 70679, 14285]
9457H3281a3172q631a0579m7131B39891a63671A08558a88191I9778h4797c9193
9445C26385a9233A93406q1803m4657h1430j88300Q2417E3779d7278O167l41390
9434c82501a37120G3401b73865A33456B9039L3296B3316l722d9391r1363B94385
9422a23356e866o0682A83649j5957c6036J3496j09359A18512j5242c92744a05826
9410a22848A3778D384a20582k87104C6422P1159A2832b26099A277R9225g0641
9398C114d4013k8537B07488a8164D1223c50538J75126j06602a19383B11776f7698
9386b36264B2275a13827j35434P8537O1545j48507j55714e9501j91215Q8228O8308
9375i4180J1808n4737k5167m555f0785j83447j5568D0315e1387j5410l18441a0386
$$ y = [83281, -13172, -21803, -10579, -57710, 239891, -163671, 108558, -188191, 99778, -84797, -39193, 326385, -19233, 193406, 111603, 66946, -81430, -269730, -187313, 53779, -47278, -41111, -382501, -137120, 73401, -273865, 133456, 29039, 62335, 23316, 19594, -49391, -140754, 294385, -123356, -5866, -66548, 183649, 167692, -36036, -22540, -131899, 118512, 103270, -392744, -105826, -122848, 13778, 4384, -120582, -407686, 36422, 107581, 12832, -226099, 1277, 100502, -70641, 3114, -44013, -72550, 207488, -18164, 41223, -350538, -175412, -282014, -119383, 211776, -67698, -236264, 22275, -113827, -249261, -170724, -109179, -257686, -413400, -59501, -250716, -162488, -94180, -82372, -137109, -162276, -166831, -60785, -244232, -259800, 40315, -51387, -66797, -385238, -10386]
9362B8359N2211N6862c4922k53501J15795A80881q9447J8094a23982j91476B93243
9350A25423a24478A43148F5346b30738K2082e8314b1358A82257o0056c24258I0092
9338a01263j8373c3492k94354M9793r5513M6568J06826f8116E3070F101b02240
9326a68480g5876C1530a56288k41464g5832q808A7691J4275J38513b71514g7170
9314b30974A15026a76311A73631e100l16242J43318o7840j4729e1656j1981j13890
9303a77527A23044c7062G7733a67895f8103A65997c32119e9068m4829k25523E3337
9291d1184k64476b3563l3046C43136g8190D16782G5778b26134h9156q8257e8741
9279g8589k44820F5293P0733i2877q2416o2358l9024q0692A20902P0086F599J21372
$$ y = [28359, 80570, 137432, -34922, -288423, -172628, 180881, 91434, 109528, -123982, -315458, 293243, 125423, -124478, 143148, 65346, -230738, -208656, -58314, -21358, 182257, 122201, -324258, 90092, -101263, -119636, -33492, -327846, -278053, -373566, -326998, -220172, -68116, 53070, 6101, -202240, -168480, -75876, 31530, -156288, -397752, -75832, -84640, 17691, 31966, 170479, -271514, -77170, -230974, 115026, -176311, 173631, -5100, -321342, -178024, -245864, -260593, -51656, -63637, -177527, 123044, -37062, 77733, -167895, -68103, 165997, -332119, -59068, -103897, -329420, 53337, -41184, -305660, -23563, -56609, 343136, -78190, 416782, 75778, -226134, -89156, -177413, -58741, -78589, -323409, 65293, 136026, -92877, -175293, -237651, -276675, -357367, 120902, 190988, 6599, 127971]
9267A27971c12978J26386H8946d18099B0375b82771j33315A00119K0529b69118
9256G636b03564K2773b2100C23021F5345d08268f0598A52304m9988g1013C15091
9244a77735A04340c1476G3710e099A22501a26997A54097J04624c2902A05400b94821
9232H7130a23423K4496J7761A7926a9932o2799B8881P6909J01415g8854K1418
9221e7436m8848k16868a48018b9744A63287b61011c9028j03458J4654j96885F8618
9209h3943H3196k1350b88844c1280k13986j00309a4471q4626A40948c7716D9084
9197h1366o336J7478j7825k27178J25718Q8808k94387a17903j26009P2815a9104
9185c6143A76924a57657G4949c1582k95169c2959a2035B2685b34635H6151O0236
$$ y = [127971, -312978, -186592, 88946, -418099, 20375, -282771, -416086, 100119, 120648, -269118, 7636, -203564, -180791, -22100, 323021, 65345, -408268, -60598, 152304, 102316, -71013, 315091, -177735, 104340, -31476, 73710, -5099, 122501, -126997, 154097, 258721, -32902, 105400, -294821, 87130, -123423, -98927, -81166, 17926, -19932, -82731, 28881, 105790, 207205, -78854, -57436, -106284, -323152, -148018, -29744, 163287, -261011, -39028, -142486, -127832, -324717, 68618, -83943, 83196, 61846, -288844, -31280, -245266, -345575, -14471, -99097, 140948, -37716, 49084, -81366, -87702, -70224, -88049, -315227, -189509, -100701, -395088, -117903, -243912, -171097, -19104, -36143, 176924, -157657, 74949, -31582, -326751, -32959, -12035, 22685, -234635, 86151, 146387]
9174A46387O605e9700a0881A33487b2838E7635K7282R543k0563c0081F4997J9749
9162H4746K16245e17610a9026j73825d9020r8609E5258M7369f9734B19665F4179
9150I3038g8829k7293A5714P7848b85991g6194A83406I0840K4193a17069d6183
9138a11842A42526P565d9384q1166j23933a23034J5200D7123e05378C2524a47649
9126g8330A03584A1142f48585f3068C7856a93212m8551P9447B87758C0409P0226
9115A00635k5632C5069b3225j86974A16896c24552J31558O6583j01527o5419A13259
9103c44731d6726k21942D6488b52096A09485J30733e9647C7686b05264g7566K7224
9092e0342A3923c7826A43895o677i5303L2415O380p9643n3711N3291r6898I0041
$$ y = [146387, 152992, -59700, -10881, 133487, -22838, 57635, 84917, 94460, 73897, -30081, 64997, 84746, 300991, -517610, -19026, -192851, -49020, -147629, 55258, 102627, -69734, 219665, 64179, 93038, -78829, -106122, 15714, 93562, -285991, -76194, 183406, 90840, 115033, -117069, -46183, -111842, 142526, 150091, -49384, -130550, -254483, -123034, -107834, 47123, -505378, 32524, -147649, -78330, 103584, 11142, -648585, -63068, 37856, -193212, -241763, -162316, 287758, 30409, 100635, 75003, 35069, -23225, -210199, 116896, -324552, -192994, -126411, -227938, -293357, 113259, -344731, -46726, -268668, 46488, -252096, 109485, 240218, -59647, 37686, -205264, -77566, -50342, 13923, -37826, 143895, 137218, -95303, -62888, -56508, -136151, -189862, -136571, -233469, 90041]
9079a66035o5104A9682c70447F210a70807g8108k17039C14098a75766A37104J56247
9068B93351C3957K7068J0904N4835f4079k9267j33200M6418A60939E7239O72a48182
9055a3719k00232j7067I5864m4709a10671j32807G1543J09558o6312C5443F494
9043a31959N4315A97509J9795i5795Q946A94410q1107a83136P7926k07312A2070
9031C5286d3403E9606M2041a19646j33666b1358B50683r2547b5292l9994j10001
9020a75287G924P1957J10712D0629a80975O5366k98106a27364a8260A14729d1410
9008A27186n0869a25065B10117H4246a50855M9338A06216K66028b98738D0415
8997b68549J29365j69422F4830A1654b32276B47227a73824b3746D3735a20771
$$ y = [-166035, -231139, 19682, -370447, 6210, -170807, -78108, -295147, 314098, -175766, 137104, 293351, 33957, 61025, 71929, 126764, -64079, -93346, -226546, -180128, 160939, 57239, 57911, -148182, -13719, -213951, -231018, 95864, 51155, -110671, -243478, 71543, 181101, 114789, 35443, 6494, -131959, -77644, 197509, 217304, -95795, -86849, 194410, 113303, -183136, -105210, -312522, 12070, 35286, -43403, 59606, 101647, -119646, -253312, -21358, 250683, 158136, -25292, -65286, -175287, 7924, 79881, 190593, 40629, -180975, -115609, -413715, -127364, -18260, 114729, -41410, 127186, 76317, -125065, 210117, 84246, -150855, -101517, 106216, 372244, -298738, 40415, -268549, -139184, -308606, 64830, 11654, -232276, 247227, -173824, -23746, 43735, -120771]
8986E9008a63810l03123B567a82492H8991c16967J31732Q7119G7538g1913j63197
8975b35110L1382D7400i115k76655B10033d0248l13109e7006A10296I529a40048
8963a26465A12029a54447f6601j2718K9253j43966H9950a81097D3385Q1076a84752
8951a37516j6540o1313H7032b49332A67599A8614a14129j59810j4139A66666b8879
8939d4780A28980J94007A6214c0892J2899j15442A28945e7179Q781j67590m3168
8928b59156J18997l7869L083E31631B51828N88365J239715O010420q61873A744568
8917D93377G8142K74151j50157a21052D9096J53117b06621g8707k73853I0987
8906A62549l6291a86222A22389b08289h1735A66492e6658a1799C4914M2060A6846
$$ y = [59008, -163810, -466933, 2567, -182492, 88991, -316967, -185235, -98116, 77538, -71913, -235110, -203728, 47400, -9115, -285770, 210033, -40248, -353357, -57006, 110296, 9529, -140048, -126465, 112029, -154447, -66601, -79319, -50066, -194032, 89950, -181097, 43385, 124461, -184752, -137516, -154056, -215369, 87032, -249332, 167599, 18614, -114129, -273939, -288078, 166666, -28879, -44780, 128980, 322987, 16214, -30892, -17993, -133435, 128945, -57179, -48398, -215988, -259156, -140159, -178028, -174945, 531631, 251828, 840193, 2079908, 8090328, 7228455, 1744568, 493377, 78142, 352293, 202136, -121052, 49096, 202213, -206621, -78707, -352560, 90987, 162549, 126258, -186222, 122389, -208289, -81735, 166492, -56658, -11799, 34914, 76974, 16846]
8894i0366H0830J25113a24772d4684E9805a13276j26845h9412r9234A11755a39308
8882C2678i4758o9662f7156J1441C56296b27365A16825J3670d8922A05176d4599
8870C41412j35770A00236a65692H4866l5079b20110F950J32481n7764M4773b64954
8858a00360l49225J82798B06665a66032j44179p5068J47253a7349B00433c36829
$$ y = [-90366, 80830, 205943, -124772, -44684, 59805, -113276, -240121, -89412, -188646, 111755, -139308, 32678, -94758, -164420, -67156, -55715, 356296, -227365, 116825, 130495, -48922, 105176, -44599, 341412, 205642, 100236, -165692, 84866, 49787, -220110, 6950, 139431, 81667, 126440, -264954, -100360, -449585, -266787, 206665, -166032, -310211, -385279, -238026, -17349, 200433, -336829]
$$ [...]
##END NTUPLES=NMR SPECTRUM
##END=
