
##TITLE=UV1281_M1_1242-1388_50_7534447_KqYNpUImUc
##JCAMPDX= 6.0         $$ Bruker NMR JCAMP-DX V2.0
##DATA TYPE= NMR SPECTRUM
##DATA CLASS= NTUPLES
##ORIGIN= BRUKER
##OWNER= Administrator
$$ 1.72 TOPSPIN		Version 2.1
$$ 2013-02-22 04:04:20.866 -0500  Administrator@X
$$ Compression mode = diff/dup
##.OBSERVE FREQUENCY= 400.02188249412
##.OBSERVE NUCLEUS= ^1H
##.ACQUISITION MODE= SIMULTANEOUS (DQD)
##.ACQUISITION SCHEME= undefined
##.AVERAGES= 64
##.DIGITISER RES= 22
##SPECTROMETER/DATA SYSTEM= spect
##.PULSE SEQUENCE= noesygpps1d.comp
##.SOLVENT NAME= COFFEE_meoh
##.SHIFT REFERENCE= INTERNAL, COFFEE_meoh, 1, 14.9615
##AUDIT TRAIL= $$ (NUMBER, WHEN, WHO, WHERE, PROCESS, VERSION, WHAT)
$$ ##TITLE= Audit trail, TOPSPIN		Version 2.1
$$ ##JCAMPDX= 5.01
$$ ##ORIGIN= Bruker BioSpin GmbH
$$ ##OWNER= Administrator
$$ $$ E:\/data/COFFEE/nmr/UV1281_M1_1242-1388_50_7534447_KqYNpUImUc/12/pdata/1/auditp.txt
$$ ##AUDIT TRAIL=  $$ (NUMBER, WHEN, WHO, WHERE, PROCESS, VERSION, WHAT)
(   1,<2013-02-22 04:04:14.929 -0500>,<Administrator>,<X>,<go>,<TOPSPIN 2.1>,
      <created by zg
	started at 2013-02-22 03:52:44.955 -0500,
	POWCHK enabled, PULCHK disabled,
       configuration hash MD5:
       86 BA 57 50 F2 9D 5C 9B 26 00 A9 28 5F 66 2E 89
       data hash MD5: 64K
       86 AD 6D C4 A6 BE 20 D6 2D CF B8 F3 4A 48 D7 D3>)
(   2,<2013-02-22 04:04:18.069 -0500>,<Administrator>,<X>,<proc1d>,<TOPSPIN 2.1>,
      <Start of raw data processing
       efp LB = 0.3 FT_mod = 6 PKNL = 1 PHC0 = 0 PHC1 = 0 SI = 128K 
       data hash MD5: 128K
       B6 98 35 D2 0F DD 70 92 62 26 AE 1F 5B 61 69 6D>)
(   3,<2013-02-22 04:04:19.210 -0500>,<Administrator>,<X>,<proc1d>,<TOPSPIN 2.1>,
      <pk PHC0 = 250.1697 PHC1 = 0 
       data hash MD5: 128K
       A0 BF 7A 81 9A F8 A9 3D 9A 78 06 08 AA BD 1C 0F>)
(   4,<2013-02-22 04:04:19.882 -0500>,<Administrator>,<X>,<proc1d>,<TOPSPIN 2.1>,
      <abs ABSG = 1 
       data hash MD5: 128K
       43 BC 03 14 17 BC CD 0F DB BB 89 6A BF C9 B2 1D>)
(   5,<2013-02-22 04:04:20.054 -0500>,<Administrator>,<X>,<proc1d>,<TOPSPIN 2.1>,
      <abs ABSG = 2 
       data hash MD5: 128K
       E3 04 46 D0 DC 59 E9 D2 FA C8 DE 95 A6 6A 90 38>)
(   6,<2013-02-22 04:04:20.210 -0500>,<Administrator>,<X>,<proc1d>,<TOPSPIN 2.1>,
      <abs ABSG = 3 
       data hash MD5: 128K
       89 23 56 1A A2 A9 BD D6 F7 56 51 AE 21 A3 6B F6>)
(   7,<2013-02-22 04:04:20.382 -0500>,<Administrator>,<X>,<proc1d>,<TOPSPIN 2.1>,
      <abs ABSG = 4 
       data hash MD5: 128K
       47 7A E7 98 6A 1D 46 88 D2 AB 92 95 BF 83 FD DD>)
(   8,<2013-02-22 04:04:20.554 -0500>,<Administrator>,<X>,<proc1d>,<TOPSPIN 2.1>,
      <abs ABSG = 5 
       data hash MD5: 128K
       1A 69 00 19 F2 9C E0 49 20 EF 40 2D 93 02 EA BE>)
$$ ##END=
$$ 
$$ $$ hash MD5
$$ $$ 91 DB 7D 19 BF 69 88 42 C3 A2 9E DA 0A E3 92 74
##$RELAX= 
##$RELAX= 
##$RELAX= 
##$RELAX= 
##$RELAX= 
##$RELAX= 
##$RELAX= 
##$RELAX= 
$$ Bruker specific parameters
$$ --------------------------
##$DU= <E:\>
##$EXPNO= 12
$$ [...]
150 150 150 150 150 150 150 150
##$TP07= 0
##$TPNAME0= <>
##$TPNAME1= <>
##$TPNAME2= <>
##$TPNAME3= <>
##$TPNAME4= <>
##$TPNAME5= <>
##$TPNAME6= <>
##$TPNAME7= <>
##$TPOAL= (0..7)
0.5 0.5 0.5 0.5 0.5 0.5 0.5 0.5
##$TPOFFS= (0..7)
0 0 0 0 0 0 0 0
##$TUNHIN= 0
##$TUNHOUT= 0
##$TUNXOUT= 0
##$USERA1= <user>
##$USERA2= <user>
##$USERA3= <user>
##$USERA4= <user>
##$USERA5= <user>
##$V9= 5
##$VALIST= <valist>
##$VCLIST= <CCCCCCCCCCCCCCC>
##$VD= 0
##$VDLIST= <DDDDDDDDDDDDDDD>
##$VPLIST= <PPPPPPPPPPPPPPP>
##$VTLIST= <TTTTTTTTTTTTTTT>
##$WBST= 1024
##$WBSW= 4
##$XGAIN= (0..3)
0 0 0 0
##$XL= 0
##$YL= 0
##$YMAX_a= 6332020
##$YMIN_a= -11908088
##$ZGOPTNS= <>
##$ZL1= 120
##$ZL2= 120
##$ZL3= 120
##$ZL4= 120
##$ABSF1= 14.9615
##$ABSF2= -5.596682
##$ABSG= 5
##$ABSL= 3
##$ALPHA= 0
##$AQORDER= 0
##$ASSFAC= 0
##$ASSFACI= 0
##$ASSFACX= 0
##$ASSWID= 0
##$AUNMP= <proc_prof1d_extract.lims>
##$AXLEFT= 0
##$AXNAME= <>
##$AXNUC= <1H>
##$AXRIGHT= 0
##$AXTYPE= 0
##$AXUNIT= <>
##$AZFE= 0.1
##$AZFW= 0.1
##$BCFW= 0
##$BC_mod= 0
##$BYTORDP= 0
##$COROFFS= 0
##$CY= 15
##$DATMOD= 1
##$DC= 0
##$DFILT= <>
##$DTYPP= 0
##$F1P= 0
##$F2P= 0
##$FCOR= 0.5
##$FTSIZE= 131072
##$FT_mod= 6
##$GAMMA= 0
##$GB= 0
##$INTBC= 1
##$INTSCL= 1
##$ISEN= 128
##$LB= 0.3
##$LEV0= 0
##$LPBIN= 0
##$MAXI= 10000
##$MC2= 0
##$MEAN= 0
##$ME_mod= 0
##$MI= 0
##$NCOEF= 0
##$NC_proc= -2
##$NLEV= 6
##$NOISF1= 0
##$NOISF2= 0
##$NSP= 0
##$NTH_PI= 0
##$NZP= 0
##$OFFSET= 14.9615
##$PC= 1
##$PHC0= 250.1697
##$PHC1= 0
##$PH_mod= 1
##$PKNL= yes
##$PPARMOD= 0
##$PPDIAG= 0
##$PPIPTYP= 0
##$PPMPNUM= 2147483647
##$PPRESOL= 1
##$PSCAL= 4
##$PSIGN= 0
##$PYNMP= <proc.py>
##$REVERSE= no
##$SF= 400.020009436745
##$SI= 131072
##$SIGF1= 0
##$SIGF2= 0
##$SINO= 400
##$SIOLD= 131072
##$SPECTYP= <>
##$SREGLST= <1H.CDCl3>
##$SSB= 0
##$STSI= 131072
##$STSR= 0
##$SW_p= 8223.68421052631
##$SYMM= 0
##$S_DEV= 0
##$TDeff= 65536
##$TDoff= 0
##$TI= <>
##$TILT= no
##$TM1= 0
##$TM2= 0
##$TOPLEV= 0
##$USERP1= <user>
##$USERP2= <user>
##$USERP3= <user>
##$USERP4= <user>
##$USERP5= <user>
##$WDW= 1
##$XDIM= 131072
##$YMAX_p= 463320775
##$YMIN_p= -12342
##$CURPLOT= <Network HP LaserJet P1505>
##$CURPRIN= <$Network HP LaserJet P1505>
##$DFORMAT= <normdp>
##$LAYOUT= <+/1D_H.xwp>
##$LFORMAT= <normlp>
##$PFORMAT= <normpl>
##$SURQMSG= 1
$$ End of Bruker specific parameters
$$ ---------------------------------
##NTUPLES= NMR SPECTRUM
##VAR_NAME=  FREQUENCY,     SPECTRUM/REAL,   SPECTRUM/IMAG
##SYMBOL=    X,             R,               I
##VAR_TYPE=  INDEPENDENT,   DEPENDENT,       DEPENDENT
##VAR_FORM=  AFFN,          ASDF,            ASDF
##VAR_DIM=   131072,        131072,          131072
##UNITS=     HZ,            ARBITRARY UNITS, ARBITRARY UNITS
##FACTOR=    0.0627417313425164, 1,          1
##FIRST=     8223.62146879497, 121,          -65669
##LAST=      0,             2583,            -66168
##MIN=       0,             -12342,          0
##MAX=       8223.62146879497, 463320775,    0
$$ Real data points
##PAGE= N=1
##DATA TABLE= (X++(R..R)), XYDATA
$$ [...]
63833A193260n6506n5577n3935n1742m9147m6398m3928m2000m0264l8075l5259
63822F80429l2200k9162k6126k3289k1116j9550j7829j5472j3010j1273j0385
63811D61017r905r563r333r093q730q361p938o994n349l825l491m281n049m993
63797C64112m409l952l855m074m609n296n694n546n020m368l629k913k590k818
63783C05339l121k803j751n81j5k38q23j143r17m07p6j32m51q13j025r42o64o31
63765B88806j168j887j993j292n34n08j111j589j438q03j26K32J47k41n49m57
63749B75489l4L17L19J76L81J106J921K186J802J355J445K072K817L344L489L137
63733C01322K455K052K409L136L355K861K332K262K356K274K418L345M778N785
$$ plain form
63833 1193260 1136754 1081177 1027242 975500 926353 879955 836027 794027 753763 715688 680429
63822 680429 648229 619067 592941 569652 548536 528986 511157 495685 482675 471402 461017
63811 461017 451112 441549 432216 423123 414393 406032 398094 391100 385751 381926 378435 374154 369105 364112
63797 364112 359703 355751 351896 347822 343213 337917 332223 326677 321657 317289 313660 310747 308157 305339
63783 305339 302218 299415 297664 297083 297068 296830 296007 294864 293947 293540 293464 293332 292881 292068 291043 290101 289437 288806
63765 288806 287638 285751 283758 282466 281932 281424 280313 278724 277286 276483 276357 276589 276736 276495 275946 275489
63749 275489 275455 275772 276091 276267 276648 277754 279675 281861 283663 285018 286463 288535 291352 294696 298185 301322
63733 301322 303777 305829 308238 311374 314729 317590 319922 322184 324540 326814 329232 332577 337355 343140
63719C43140N911N577N419N593N775N571M788L504J956L51j146k298k877l002
63705C78262l083l314l407l092k543k056j578r29k35L10R00J808K805L363L434
63690C70645L435L482L166K241J001k03j285k067k148j535q85o95o32j40O39J124
63674C76143J182J136J123J067J205J924K922L282K618J592J014R23R44R83J083
63659C99141R85L77o39j768k974m224n118n286n046n005n102m694l633k508j760
63644C52746j215p25n13n03K3J458L063L778L560L256L330L458L356L288L631
63629C81991M333N092N702O070O168O131O220O573P143P900Q882J0047J1262J2540
63615D86054J4055J5896J7933J9969K1828K3354K4547K5741K7375K9486L1574
$$ plain form
63719 343140 349051 354628 360047 365640 371415 376986 381774 385278 387234 387585 386439 384141 381264 378262
63705 378262 375179 371865 368458 365366 362823 360767 359189 358260 358025 358335 359235 361043 363848 367211 370645
63690 370645 374080 377562 380728 382969 383970 383767 382482 380415 378267 376732 375847 375152 374520 374380 375019 376143
63674 376143 377325 378461 379584 380651 381856 383780 386702 389984 392602 394194 395208 396131 397075 398058 399141
63659 399141 400126 400503 399864 398096 395122 390898 385780 380494 375448 370443 365341 360647 357014 354506 352746
63644 352746 351531 350806 350293 349790 349813 351271 354334 358112 361672 364928 368258 371716 375072 378360 381991
63629 381991 386324 391416 397118 403188 409356 415487 421707 428280 435423 443323 452205 462252 473514 486054
63615 486054 500109 516005 533938 553907 575735 599089 623636 649377 676752 706238 737812
63604G37812L2988L3264L2104K9258K4611J8376J1192M040k057o548r515j1263
63592H94262j1857j1224r675q020p165p701r722j2784j6117j9104k1573k3459
63580G35861k4434k4246k3180k1760k0065j7859j5280j2849j0725q510n940l270
63568E47743q05J409L207M177M287M159M357M728M878M898N195N865O713P761
63554F08572R259J1300J3740J6481J9519K2735K5936K9132L2651L7021M2595M8826
63542I17767N3598N3745M7060L4113J7956K187j0657j9359k3700k4214k1980j8192
63530A008324j3873r867o872n332n434p223j0620j5260k0439k5340k9313l2040
63518H26711l3467l3671l2784l1153k9329k7704k6081k3943k1197j8431j6262
$$ plain form
63604 737812 770800 804064 836168 865426 890037 908413 919605 923645 921588 915040 905525 894262
63592 894262 882405 871181 861506 853486 846321 838620 828898 816114 799997 780893 759320 735861
63580 735861 711427 687181 664001 642241 622176 604317 589037 576188 565463 556953 551013 547743
63568 547743 546938 548347 551554 555731 560018 564177 568534 573262 578140 583038 588233 594098 600811 608572
63554 608572 617831 629131 642871 659352 678871 701606 727542 756674 789325 826346 868941 917767
63542 917767 971365 1025110 1072170 1106283 1124239 1126426 1115769 1096410 1072710 1048496 1026516 1008324
63530 1008324 994451 984584 977712 972380 966946 959723 949103 933843 913404 888064 858751 826711
63518 826711 793244 759573 726789 695636 666307 638603 612522 588579 567382 548951 532689
63507E32689j4691j3332j1987j0740r650q641p695o897o338n990n650m976l855
63494D22247k746k335k671k999k686j982j480j206p33J6O69J067J479K104K756
63479D11500L205L488L748M053M476N070N628N709N062L928K823K027J381N10
63465D62608p56k218l603m871n946o293n279l237j542j170j575j601j063o57m96
63450D22301K09J839L592M531M747M976N562O394P516R115J1014J2813J4537J6712
63436E25858J9671K3204K7116L1760L7464M3376M7149M6215L9653K8912J6779
63425H87157N714k928q556j0880r999o588j661L960R977J6389K3012K9090L3578
63412I68265L5893L6255L4951L1472K4949J5636N519l020q877j2360j4064j4224
$$ plain form
63507 532689 517998 504666 492679 481939 472289 463648 455953 449056 442718 436728 431078 426102 422247
63494 422247 419501 417166 414495 411496 408810 406828 405348 404142 403409 403425 404094 405161 406640 408744 411500
63479 411500 414705 418193 421941 425994 430470 435540 441168 446877 451939 455867 458690 460717 462098 462608
63465 462608 461852 459634 456031 451160 445214 438921 433642 430405 428863 427693 426118 424517 423454 422797 422301
63450 422301 422510 424349 427941 432472 437219 442195 447757 454151 461667 470782 481796 494609 509146 525858
63436 525858 545529 568733 595849 627609 665073 708449 755598 801813 841466 870378 887157
63425 887157 892871 889943 881387 870507 860508 853920 852259 856219 866196 882585 905597 934687 968265
63412 968265 1004158 1040413 1075364 1106836 1131785 1147421 1152940 1149920 1141043 1128683 1114619 1100395
63400A100395j3092j1347r904r526j0733j3723j8181k3283k8117l1970l4392l5291
63388H60836l5107l4494l3571l1800k8948k5792k3319k1398j8942j5495j1958
63377E80012r411p722n908l558j247L93J498K704M395O406Q304R834J1167J2691
63363F09558J4552J6524J8424K0443K2867K5652K8572L1526L4402L6861L8644
63352H98025L9914M0667M0048L6897L1046K3503J5365P250j87o068r991j2285
63340A104184j3224j2733j1205r905r915j1197j3280j6191k0015k4115k7618l0328
63328I04458l2366l3269l2420l0066k7042k3551j9177j4014q714l380K379P768
63316F90606J0223P355p12j1344k1198k7819l0290k9302k6610k3862k1639j9600
$$ plain form
63400 1100395 1087303 1075956 1066052 1056526 1045793 1032070 1013889 990606 962489 930519 896127 860836
63388 860836 825729 791235 757664 725864 696916 671124 647805 626407 607465 591970 580012
63377 580012 570601 562879 556971 553413 552166 552559 554057 556761 561156 567562 575866 585700 596867 609558
63363 609558 624110 640634 659058 679501 702368 728020 756592 788118 822520 859381 898025
63352 898025 937939 978606 1018654 1055551 1086597 1110100 1125465 1132715 1132528 1126460 1116469 1104184
63340 1104184 1090960 1078227 1067022 1057117 1047202 1036005 1022725 1006534 986519 962404 934786 904458
63328 904458 872092 838823 806403 776337 749295 725744 706567 692553 683839 680459 682838 690606
63316 690606 700829 708184 707472 696128 674930 647111 616821 587519 560909 537047 515408 495808
63304D95808j7210j4256j1006q213o613o149n832m736l025j690j418j992k722
63291D10946l164l243k991k472k039k272l311m287m023k488j059q57j364j303
63277C76073n57k35q94j664j497n22L55O91P72R66J306J610J658J372R57Q12J102
63260C82305J620K090K437K675K880L286M018M708M779M265L884M071M489M794
63246D32301N306O351P438P711P117O519O734P894R678J1675J3418J4590J5339
63233E52071J6248J7831K0082K2483K4381K5443K5947K6430K7040K7420K7359
63222H12735K7212K7307K7316K6623K5296K4130K3770K4174K4973K5884K6606
63211A096026K6719K5970K4472K2378J9487J5420J0114L906k827r873j6942k3487
$$ plain form
63304 495808 478598 464342 453336 445123 438510 432361 426529 421793 418768 417078 415660 413668 410946
63291 410946 407782 404539 401548 399076 397037 394765 391454 387167 383144 380656 379597 378740 377376 376073
63277 376073 375516 375281 374387 372723 371226 370704 371059 371750 372522 373488 374794 376404 378062 379434 380391 381203 382305
63260 382305 383925 386015 388452 391127 394007 397293 401311 406019 410798 415063 418947 423018 427507 432301
63246 432301 437607 443958 451396 459107 466224 472743 479477 487371 497049 508724 522142 536732 552071
63233 552071 568319 586150 606232 628715 653096 678539 704486 730916 757956 785376 812735
63222 812735 839947 867254 894570 921193 946489 970619 994389 1018563 1043536 1069420 1096026
63211 1096026 1122745 1148715 1173187 1195565 1215052 1230472 1240586 1244492 1241665 1231792 1214850 1191363
63199A191363k9016l3450l6869l8936l9005l7014l3923l0910k8243k5369k1905
63188H36723j8061j4097r896n374p95L525P541J1238J4357J6770J8888K1240K3730
63175I05789K5596K6212K5734K4885K4278K3972K3659K3161K2652K2268K1695
63164A169901K0380J8128J5234J2005Q390M237n10n904j2050j8791k5528l1512
63152A153980l6242l9515m1360m2049m1911m0984l9092l6374l3434l0711k7950
63141G44358k4642k0850j7351j4951j3756j3096j2113j0494q709p328o233m822
63129E90013k951j227k18J90M31O25O79P46J190K194L533M674N041M460L484K946
63113F15810L053L246L014K472J967J613J482J709K056J869R11j77o80o46n01
$$ plain form
63199 1191363 1162347 1128897 1092028 1053092 1014087 977073 943150 912240 883997 858628 836723
63188 836723 818662 804565 794669 789295 788500 792025 799566 810804 825161 841931 860819 882059 905789
63175 905789 931385 957597 983331 1008216 1032494 1056466 1080125 1103286 1125938 1148206 1169901
63164 1169901 1190281 1208409 1223643 1235648 1244038 1248275 1247765 1241861 1229811 1211020 1185492 1153980
63152 1153980 1117738 1078223 1036863 994814 952903 911919 872827 836453 803019 772308 744358
63141 744358 719716 698866 681515 666564 652808 639712 627599 617105 608396 601068 594835 590013
63129 590013 587062 585835 585617 585807 586238 586863 587542 588288 589478 591672 595205 599879 604920 609380 612864 615810
63113 615810 618863 622109 625123 627595 629562 631175 632657 634366 636422 638291 639202 639025 638345 637699 637198
63098F37198l40k20n57j456j995j207M48J512J462J258J767K546K657J956J085
63083F46114N69M09L52K02k0l6M20J226K017K663L296L873M222M620N746P672
63067F83345R392R895R498R566J0941J3101J5000J6298J7492J9084K1052K3179
63055H57843K5532K8316L1487L4775L8057M1401M4802M8190N1677N5380N8917
63044A316377O1584O3298O4768O6357O7250O6442O4158O1604N9483N7593N5859
63033B004773N4875N4960N5392N5124N3973N2479N0688M7593M2000L3657K3320
63022B528834J1775p99j4468k8750m2617n5169o5937p4513q0430q3636q4649q3866
63010A925775q1118p6228o9664o2138n3887m4884l5500k6391j7796r456j207O776
$$ plain form
63098 637198 636858 636638 636081 634625 632630 631423 631871 633383 634845 636103 637870 640416 643073 645029 646114
63083 646114 646683 647092 647444 647646 647626 647590 648010 649236 651253 653916 657212 661085 665307 669927 675673 683345
63067 683345 692737 702632 712130 721696 732637 745738 760738 777036 794528 813612 834664 857843
63055 857843 883375 911691 943178 977953 1016010 1057411 1102213 1150403 1202080 1257460 1316377
63044 1316377 1377961 1441259 1506027 1572384 1639634 1706076 1770234 1831838 1891321 1948914 2004773
63033 2004773 2059648 2114608 2170000 2225124 2279097 2331576 2382264 2429857 2471857 2505514 2528834
63022 2528834 2540609 2539810 2525342 2496592 2453975 2398806 2332869 2258356 2177926 2094290 2009641 1925775
63010 1925775 1844657 1768429 1698765 1636627 1582740 1537856 1502356 1475965 1458169 1448713 1447506 1454282
62998A454282J4227K0826K6171L0179L3449L6684L9743M1873M2800M3103M3438
62987A826775M3915M4315M4422M4032M3071M1729M0031L7273L2519K5694J7605
62976B241381Q779j108j2372k4536l6696m8180n8475o7039p3591p8295q1198q1861
62964A686809p9965p6109p1619o7549o4055o0602n6601n1979m7269m3107l9646
62953A028308l6572l3620l0801k8217k5968k4249k3173k2458k1677k0722j9706
62942G41145j8433j6587j4433j2733j1791j1117j0261r373q689q047p251o445
62930F05985n803n284m961n026n178m654l317k059j545j207l25N03K0j702l066
62915E62381k936j935j409j802k520k942k951k645k086j386q03n76p19j095j539
$$ plain form
62998 1454282 1468509 1489335 1515506 1545685 1579134 1615818 1655561 1697434 1740234 1783337 1826775
62987 1826775 1870690 1915005 1959427 2003459 2046530 2088259 2128290 2165563 2198082 2223776 2241381
62976 2241381 2250160 2249052 2236680 2212144 2175448 2127268 2068793 2001754 1928163 1849868 1768670 1686809
62964 1686809 1606844 1530735 1459116 1391567 1327512 1266910 1210309 1158330 1111061 1067954 1028308
62953 1028308 991736 958116 927315 899098 873130 848881 825708 803250 781573 760851 741145
62942 741145 722712 706125 691692 678959 667168 656051 645790 636417 627728 619681 612430 605985
62930 605985 600182 594898 589937 584911 579733 575079 571762 569703 568158 566951 566626 567129 567149 565447 562381
62915 562381 559445 557510 556101 554299 551779 548837 545886 543241 541155 539769 538966 538390 537671 536576 535037
62900E35037j887j895j423p31m09p00j111j021n66m83j099j884k172j860j258
62885E16538o28r1L05O98J270J878K078J748J315J169J185J047P30M37K97L02
62869E30278K71j82j292k629l427l547l550l571k944j414K5K69l94p49k85M45
62853E07304Q80J010R63P40M80L93L86K20O0K75P28Q20L29l33p70j039j273j347
62835E09826j178r38p94o42l22R5L40J76l53p42l66P69J810K034J830K125L009
62818E16679L611L432L031L082L354L201K653K397K796L430L729L735M008M834
62804E63972N775O170O044O164P097Q487R583J0164J0537J0833J0917J0977J1599
62791F78319J3047J4933J6844J8906K1454K4513K7845L1301L4865L8592M2708
$$ plain form
62900 535037 533150 531255 529832 529101 528692 527992 526881 525860 525294 524811 523712 521828 519656 517796 516538
62885 516538 515910 515819 516124 516822 518092 519970 522048 523796 525111 526280 527465 528512 529242 529679 529976 530278
62869 530278 530549 530367 529075 526446 523019 519472 515922 512351 509407 507993 508018 508287 507893 507144 506859 507304
62853 507304 508184 509194 510157 510897 511377 511770 512156 512376 512436 512711 513439 514259 514588 514255 513485 512446 511173 509826
62835 509826 508648 507710 506916 506274 505952 506047 506387 506563 506210 505468 505102 505871 507681 509715 511545 513670 516679
62818 516679 520290 523722 526753 529835 533189 536390 539043 541440 544236 547666 551395 555130 559138 563972
62804 563972 569747 575917 581961 588125 595222 603709 613292 623456 633993 644826 655743 666720 678319
62791 678319 691366 706299 723143 742049 763503 788016 815861 847162 882027 920619 963327
62780I63327M7575N3266N9268O4953P0213P5438Q0903Q6402R1531R6053R9863
62769A788792J02636J03649J02061R7404Q9776P9562O7017N2136L4971J6086l304
62758B530786k1846l8881n4637o9279q1932r1227r6874j00058j01876j02082r9936
62747A672158r5789r0927q6039q0837p5130o9341o3669n7672n1197m5142m0510
62736I15905l7116l3869l0190k6500k3324k0554j7810j5133j2885j1141r539p854
62724F69990o361n430m889m160l004j722n63O37K013L279M254N376P210R606J1903
62709F88139J3824J5607J7387J9160K1365K4696K9037L3249L6483L9158M2204
62698I80309M5845M9728N3931N9049O5250P1828P7870Q3057Q7478R0958R2803
$$ plain form
62780 963327 1010902 1064168 1123436 1188389 1258602 1334040 1414943 1501345 1592876 1688929 1788792
62769 1788792 1891428 1995077 2097138 2194542 2284318 2363880 2430897 2483033 2518004 2534090 2530786
62758 2530786 2508940 2470059 2415422 2346143 2264211 2172984 2076110 1976052 1874176 1772094 1672158
62747 1672158 1576369 1485442 1399403 1318566 1243436 1174095 1110426 1052754 1001557 956415 915905
62736 915905 878789 844920 814730 788230 764906 744352 726542 711409 698524 687383 677844 669990
62724 669990 663629 658199 653310 649150 646146 644424 643861 644498 646511 649790 654044 659420 666630 676236 688139
62709 688139 701963 717570 734957 754117 775482 800178 829215 862464 898947 938105 980309
62698 980309 1026154 1075882 1129813 1188862 1254112 1325940 1403810 1486867 1574345 1665303 1758106
62687A758106R2301Q9298Q4055P6577O6379N3168L7613K1020M255j2670k9828
62676B240274m6508o1426p3546q2595q8802r2453r3722r2899r0598q7445q3529
62665A346751p8467p2290o5878o0083n4798m9469m4273l9938l6455l2939k8916
62654G83245k4945k1631j8923j6769j5610j5542j5696j5246j4417j3736j2885
62643E97845j1245r167p570o535n372l976k995k521j737k67J108J586J297O72
62629E51123l92j952l308l744l559l586l861l696k873j949j296n98L88J263J596
62614E23556J694K286L563M898N469M982L838K828K595L220M303N418O487P762
62600E82899R549J1962J4759J7417J9588K1542K3960K7149L0770L4483L8440M2748
$$ plain form
62687 1758106 1850407 1939705 2023760 2100337 2166716 2219884 2257497 2278517 2282772 2270102 2240274
62676 2240274 2193766 2132340 2058794 1976199 1887397 1794944 1701222 1608323 1517725 1430280 1346751
62665 1346751 1268284 1195994 1130116 1070033 1015235 965766 921493 881555 845100 812161 783245
62654 783245 758300 736669 717746 700977 685367 669825 654129 638883 624466 610730 597845
62643 597845 586600 577433 569863 563328 557956 553980 550985 548464 546727 546460 547568 549154 550451 551123
62629 551123 550731 548779 545471 541727 538168 534582 530721 527025 524152 522203 520907 520309 520697 521960 523556
62614 523556 525250 527536 531099 535997 541466 546448 550286 553114 555709 558929 563232 568650 575137 582899
62600 582899 592448 604410 619169 636586 656174 677716 701676 728825 759595 794078 832518 875266
62588H75266M6779M9600N1062N1828N2154N1246M8181M3077L6819K9899K2048
62577A357959J2928K811p543j7331k5994l3330l9397m4164m7274m8439m8097m7215
62565A014914m6341m5134m3067m0307l7486l4853l2061k8772k5077k1324j7884
62554F42608j5191j3586j2781j1840j0128q148o867o366n749m546l434l119l158
62541E37695k652j682j101j085r30m34l63j095j736j370l60L84R06J884L233M215
62525E35509M783N691P116Q337R108J0355J2846J5991J8644K0607K2604K5138
62513F96729K8066L1115L4243L7569M1244M5348M9540N3085N5459N6678N6734
62502A185810N5141N1447M5958L9363L1954K3745J5193P125Ro145j1123j4414
$$ plain form
62588 875266 922045 971645 1022707 1074535 1126689 1177935 1226116 1269193 1306012 1335911 1357959
62577 1357959 1370887 1373698 1366155 1348824 1322830 1289500 1250103 1205939 1158665 1110226 1062129 1014914
62565 1014914 968573 923439 880372 840065 802579 767726 735665 706893 681816 660492 642608
62554 642608 627417 613831 601050 589210 579082 570934 564067 557701 551952 547406 543972 540853 537695
62541 537695 535043 533361 532260 531175 530245 529811 529448 528353 526617 525247 524887 525271 526177 528061 531294 535509
62525 535509 540292 545983 553099 561436 570544 580899 593745 609736 628380 648987 671591 696729
62513 696729 724795 755910 790153 827722 868966 914314 963854 1016939 1072398 1129076 1185810
62502 1185810 1240951 1292398 1338356 1377719 1409673 1433418 1448611 1455736 1455745 1449600 1438477 1424063
62490A424063j5883j5994j5139j3255j0367o981l562O4M332Q953J2611J3622J0960
62477A393424N072k093q236j2393j5602j9805k6081l3935m1937m8620n3016n4922
62465A081856n4925n3938n2493n0538m7862m4477m0472l5811l0662k5738k1853
62454F23087j9026j6430j3453j0516q492p528o885n886m507k900j017R99K505
62441E29951L082L240L846M901N571N430N005M827M644L977K919J765K85j880
62427E77563m249n744o028n970o478p447q196q419q224p582o415n130m437m517
62413D88727m778m602m050l575l356l167k793k343k132k288k483k117r30O12J718
62398D52443K094K138K296K590K874L251L889M588M895M608L959L338L033L200
$$ plain form
62490 1424063 1408180 1392186 1377047 1363792 1353425 1346444 1342882 1342946 1347278 1356231 1368842 1382464 1393424
62477 1393424 1398496 1396403 1388167 1375774 1360172 1340367 1314286 1280351 1238414 1189794 1136778 1081856
62465 1081856 1026931 972993 920500 869962 822100 777623 737151 701340 670678 644940 623087
62454 623087 604061 587631 574178 563662 555170 547642 540757 534871 530364 527464 526447 527446 529951
62441 529951 533033 536273 540119 545020 550591 556021 561026 565853 570497 574474 577393 579158 579443 577563
62427 577563 573314 567570 561542 555572 549094 541647 533451 525032 516808 509226 502811 497681 493244 488727
62413 488727 483949 479347 475297 471722 468366 465199 462406 460063 457931 455643 453160 451043 450113 450725 452443
62398 452443 454537 456675 458971 461561 464435 467686 471575 476163 481058 485666 489625 492963 495996 499196
62384D99196L857M754N458N733N813O180O982P753P899P439O999O936O829O217
62370E88045N497N535O418P348P884Q604J0217J2615J5256J7957K0875K4138K7943
62357G58332L2543L7617M2186M5804M9336N3675N8137O1010O1414N9612N5693
62346A315359M9290M0814L1737K3162J5037P224L49n102r778j4771k0370k6156
62334A406795l1779l6958m1070m3469m4168m3685m2484m0907l9309l7740l5747
62323I69479l2972k9824k7112k5323k4479k4331k4245k3357k1530j9762j8965
62312F97579j8698j7813j6051j4119j2375j0498q484o944o068n175l796k400j612
62299E73546j168m08O63J411J549J513J849K585L275L489L222K953L167L739L922
$$ plain form
62384 499196 503053 507807 513265 518998 524811 530991 537973 545726 553625 561064 568063 574999 581828 588045
62370 588045 593542 599077 605495 612843 620727 629331 639548 652163 667419 685376 706251 730389 758332
62357 758332 790875 828492 870678 916482 965818 1019493 1077630 1138640 1200054 1259666 1315359
62346 1315359 1364649 1405463 1437200 1460362 1475399 1482623 1482972 1477870 1468092 1453321 1432951 1406795
62334 1406795 1375016 1338058 1296988 1253519 1209351 1165666 1123182 1082275 1042966 1005226 969479
62323 969479 936507 906683 879571 854248 829769 805438 781193 757836 736306 716544 697579
62312 697579 678881 661068 645017 630898 618523 608025 599541 592597 586529 581354 577558 575158 573546
62299 573546 572378 571970 572633 574044 575593 577106 578955 581540 584815 588304 591526 594479 597646 601385 605307
62284F05307L130J634K65m42o24o54o05k69L53Q56Q40M82M08R89J945K822L589
62267F20026M525N724P101Q753J0954J3761J6928K0247K3716K7357L1215L5503
62255H25810M0369M5495N0279N4537N8509O2034O4166O3902O0944N5411M7347
62244A428803L7101K5926J5474O520j409r076j6694k4095l1239l8137m4450m9551
62232A299173n2978n4724n5086n4379n2728n0010m6075m1177l6055l1418k7369
62221G97174k3474j9420j5410j1935r328p542o219m893l331j727m11O58J845L234
62207F99221M402N090N729O928Q572R839J0034R067P278N238L672K998K830K387
62193G83285J561J018J116J271P84j91r52j092n75O49K485M356N647O371O896
$$ plain form
62284 605307 608437 610071 610336 609894 609270 608616 608011 607742 608095 608951 609791 610273 610681 611670 613615 616437 620026
62267 620026 624551 630275 637376 646129 657083 670844 687772 708019 731735 759092 790307 825810
62255 825810 866179 911674 961953 1016490 1074999 1137033 1201199 1265101 1326045 1381456 1428803
62244 1428803 1465904 1491830 1507304 1513824 1512415 1503339 1486645 1462550 1431311 1393174 1348724 1299173
62232 1299173 1246195 1191471 1136385 1082006 1029278 979268 933193 892016 855961 824543 797174
62221 797174 773700 754280 738870 726935 717607 710065 703846 698953 695622 693895 693484 694142 695987 699221
62207 699221 703623 708713 714442 721370 729942 739781 749815 758882 766160 771398 775070 778068 780898 783285
62193 783285 784846 785864 786980 788251 789035 788844 787892 786800 786225 786874 789359 793715 799362 805733 812629
62178H12629P086O344M542K313L36j116j824j372L59K965O073R787J4183J8799
62164H81104K3102K7166L1400L5769L9803M3146M5527M6183M4124L9249L2614
62153A289187K5270J7413R180J614m067q084j2039j7128k2989k8492l2913l6003
62141A180949l7621l7906l7351l6140l3835l0249k6204k2714j9807j6893j4010
62130H68219j1709r867p679m975k564r67K99J802L413M915O568Q426R844J0365
62116H76090J0542J1141J2002J2492J2628J2907J3179J2560J0479P176L218r03
62104I93511m655p518r174r341p650m297o93J343J184j60j286j609j258l83J078
62089I49092L039N002O219O400O172O579P839R024R316R185R844J1717J4117J6169
$$ plain form
62178 812629 819715 826059 830601 832914 833250 832134 830310 828938 829297 832262 838335 848122 862305 881104
62164 881104 904206 931372 962772 998541 1038344 1081490 1127017 1173200 1217324 1256573 1289187
62153 1289187 1314457 1331870 1341050 1342664 1338597 1330513 1318474 1301346 1278357 1249865 1216952 1180949
62141 1180949 1143328 1105422 1068071 1031931 998096 967847 941643 918929 899122 882229 868219
62130 868219 856510 846643 838964 833989 831425 830458 830757 832559 835972 840887 847455 855881 865725 876090
62116 876090 886632 897773 909775 922267 934895 947802 960981 973541 984020 991196 994414 993511
62104 993511 988856 981338 972164 962823 955173 950876 950183 951526 952710 952550 951264 949655 948397 948014 949092
62089 949092 952131 957133 963352 969752 975924 982503 990342 999366 1008682 1017867 1027711 1039428 1053545 1069714
62075A069714J7521J8311J9041K0416K2633K4802K5617K4668K2676K0560J8794
62064A304753J7546J6801J6317J6036J6499J8161K0346K1550K0929J8862J5988
62053A503788J2532Q728N183K306n0k150m106o425j0146j5884k2979k9982l5768
62040A405047l9987m2873m4985m6779m8097m8337m7315m5607m3792m1746l9075
62029I16454l5863l2538k9239k5840k2565k0041j8588j7666j6354j4352j2384
62018F71024j1333j1155j0961j0260r561r494r880j0121j0034r595q351n979l180
62005E51120j124K7J079K416L645M613N720O929P502P089O190N212L968K546J541
61990F08473R33k77k536m816o017o483p224q380r408j0115j0538j0340r347q168
$$ plain form
62075 1069714 1087235 1105546 1124587 1145003 1167636 1192438 1218055 1242723 1265399 1285959 1304753
62064 1304753 1322299 1339100 1355417 1371453 1387952 1406113 1426459 1448009 1468938 1487800 1503788
62053 1503788 1516320 1525048 1530231 1532537 1532487 1530337 1526231 1519806 1509660 1493776 1470797 1440815 1405047
62040 1405047 1365060 1322187 1277202 1230423 1182326 1133989 1086674 1041067 997275 955529 916454
62029 916454 880591 848053 818814 792974 770409 750368 731780 714114 697760 683408 671024
62018 671024 659691 648536 637575 627315 617754 608260 598380 588259 578225 568630 560279 554300 551120
62005 551120 549996 550023 551102 553518 557163 561776 567496 574425 581927 589016 595206 600418 604386 606932 608473
61990 608473 609406 609129 606593 601777 595760 589277 582053 573673 564265 554150 543612 533272 523925 515757
61976E15757p325o282m461k626j942k005j298M03J618J474R88J442K613L440L628
61961E05424L620L580L299K944L064L806M621M912M666M305M183M394M955N903
61947E63676P017P722P637P216P458Q805J0793J2888J5121J7529J9596K0855K1667
61934G27980K2592K3329K3057K1781K0432J9588J8857J7740J6269J4476J1962
61923I38063Q588N113K469O13j363m015o853q920r690r269p964n898l037N82M689
61908I03108Q752J2118J4406J5922J7466J9353K0661J9996J7078J3112R309N569
61896A076850J028m471j0045j4724j8185k0578k2098k2849k2844k2108k0881j9632
61884H79463j8645j7756j6754j5818j5316j5231j5166j4830j4299j3806j3465
$$ plain form
61976 515757 508432 502150 497689 495063 493121 491116 489818 490221 491839 493313 494301 495743 498356 501796 505424
61961 505424 509044 512624 515923 518867 521931 525737 530358 535270 539936 544241 548424 552818 557773 563676
61947 563676 570693 578415 586052 593268 600726 609531 620324 633212 648333 665862 685458 706313 727980
61934 727980 750572 773901 796958 818739 839171 858759 877616 895356 911625 926101 938063
61923 938063 946651 951764 954233 954846 953483 949468 942615 933695 924005 914736 906772 900874 897837 898419 903108
61908 903108 911860 923978 938384 954306 971772 991125 1011786 1031782 1048860 1061972 1071281 1076850
61896 1076850 1077878 1073407 1063362 1048638 1030453 1009875 987777 964928 942084 919976 899095 879463
61884 879463 860818 843062 826308 810490 795174 779943 764777 749947 735648 721842 708377
61873G08377j3080j2169j0390q099o166m968l941k410n58Q98J694K289L331N156
61859F59964P708J0479J2840J4701J6647J9126K1834K4335K6836K9780L2969L5767
61847I12986L7991L9934M1611M2540M2253M0606L7649L3678K9142K4121J8156
61836A300667J1139L994k152p084j1117j3964j4961j4185j2351r630n591l59N131
61823A229537J0183J4686J8223J9834J9102J6640J3069Q204J737n878j3656k0788
61811A310893k6831l1674l5539l8564m0342m0405l9212l7842l6621l4874l2276
61800I16713k9456k6849k4030k0763j7833j5954j4599j2821j0700r026p994p100
61788G19588o191n645n532n337m646l658k897k785l470m673n703n908n246m263
$$ plain form
61873 708377 695297 683128 672738 664639 658473 653505 649564 647154 646596 647494 649188 651477 654808 659964
61859 659964 667672 678151 690991 705692 722339 741465 763299 787634 814470 844250 877219 912986
61847 912986 950977 990911 1032522 1075062 1117315 1157921 1195570 1229248 1258390 1282511 1300667
61836 1300667 1311806 1315800 1313648 1306564 1295447 1281483 1266522 1252337 1239986 1230356 1224765 1224406 1229537
61823 1229537 1239720 1254406 1272629 1292463 1311565 1328205 1341274 1349478 1351215 1345337 1331681 1310893
61811 1310893 1284062 1252388 1216849 1178285 1137943 1097538 1058326 1020484 983863 948989 916713
61800 916713 887257 860408 836378 815615 797782 781828 767229 754408 743708 734682 726688 719588
61788 719588 713397 707752 702220 696883 692237 688579 685682 682897 679427 674754 669051 663143 657897 653634
61774F53634l616l586l864l803l079k150j655j495j055l24n0m57o68J26J514K519
61758F31991K813K714K458K153K093K393K550J985Q95m7o25j162j858k581l210
61743F42562l794m319m655m590l838k378r43n67j278j925j818j718k411l069k218
61728F03041M7K160L200L682M114M149L534K887K835L172L423L703M368N218N588
61713F55121N042L688K022O52j07n51j274k448l735m910o076p107p442o737n426
61698F20712m327l947m250m778m918m401l686l538m116m867n339n558n467m800
61684E56720l768l225l590m170m162l799l809m173m280m047l965m039l625k541
61670E03527j530j201j169p56p6K23k7l43m18m68o59p08l25J89K03l97r76q52
$$ plain form
61774 653634 650018 646432 642568 638765 635686 633536 631881 630386 629331 629007 628957 628500 627832 627958 629472 631991
61758 631991 634804 637518 639976 642129 644222 646615 649165 651150 652045 651998 651373 650211 648353 645772 642562
61743 642562 638768 634449 629794 625204 621366 618988 618045 617478 616200 614275 612457 610739 608328 605259 603041
61728 603041 603088 605248 608448 612130 616244 620393 623927 626814 629649 632821 636244 639947 644315 649533 655121
61713 655121 660163 663851 665873 666525 666418 665867 664593 662145 658410 653500 647424 640317 632875 626138 620712
61698 620712 616385 612438 608188 603410 598492 594091 590405 586867 582751 577884 572545 566987 561520 556720
61684 556720 552952 549727 546137 541967 537805 534006 530197 526024 521744 517697 513732 509693 506068 503527
61670 503527 501997 500796 499627 498871 498795 499018 498991 498648 498230 497762 497103 496395 496070 496259 496462 496065 495089 494237
61652D94237r6O30R05R92J301J771K082K303K805L513L775L279K639K620L082
61637E25838L216K635J574K40j311k634l116l006l351m470n268m785l693l329
61623D98540l817m167l927l520l027j932l17Q31R41N83L56K1p21j460j939k849
61607D73596m779o919p846p334o393n748n255m756m485m433m195l738l577l825
61593D00313l783k930j832j478j990k531k423j897j644j872k095j791j083n89
61579C72375o57j045j377j591j718j555j002m51m24q73j209j047n58q4K29M02
61563C59415N01N81O08M49J20p1J34N28P04O08N67P78J050J075P12J58q1L72J159
61544C69367J413Q86M56R90K110K732K513J976J494J056J040K088L926N216N065
$$ plain form
61652 494237 494141 494771 495676 496668 497969 499740 501822 504125 506930 510443 514218 517497 520136 522756 525838
61637 525838 529054 531689 533263 533503 532192 529558 526442 523436 520085 515615 510347 505562 501869 498540
61623 498540 494723 490556 486629 483109 480082 478150 477833 478664 479605 480188 480544 480565 479844 478384 476445 473596
61607 473596 468817 461898 454052 446718 440325 434577 429322 424566 420081 415648 411453 407715 404138 400313
61593 400313 396530 393600 391768 390290 388300 385769 383346 381449 379805 377933 375838 374047 372964 372375
61579 372375 371718 370673 369296 367705 365987 364432 363430 362979 362555 361682 360473 359426 358868 358784 359013 359415
61563 359415 359916 360497 361105 361554 361674 361603 361737 362265 362969 363577 364144 364922 365972 367047 367759 367917 367836 368208 369367
61544 369367 370780 371666 372122 373112 375222 377954 380467 382443 383937 384993 386033 388121 392047 397263 402328
61529D02328L998L020K331J482K62j130k454l503m035l988l603l083k495k033
61515C87097j936j930j384l22L55P3n40n92j91r2m50p22o47n72p50r16p10j50
61497C75621L75L55m04j391j620p26M95J044R61J050J577J954J700J026L92J1
61481C82420m7K53P01R52R85J082J324J495J556J716J884J607P90j7l79n38q25
61464C94959r54m62M00Q56N79K0k73k21m4J22L16O72J305K094K545K158J041r7
61446D05016o55o84n67m01K1P90J685K495L222L903M417M627M629M595M497M171
61430D41761L634L179L041L202L507L755L622K870J862J520K367L726M326L686
61416D86058K435J321M64k34n62m49m71j273k581l394l265k819k832l274l591
$$ plain form
61529 402328 406326 409346 411677 413159 413421 412291 409837 406334 402299 398311 394708 391625 389130 387097
61515 387097 385161 383231 381847 381525 381880 381953 381413 380821 380630 380538 380088 379366 378719 378147 377397 376481 375771 375621
61497 375621 375996 376351 375947 374556 372936 372210 372705 373749 374710 375760 377337 379291 380991 382017 382409 382420
61481 382420 382373 382626 383327 384279 385264 386346 387670 389165 390721 392437 394321 395928 396718 396701 396322 395784 394959
61464 394959 394005 393543 393943 394799 395378 395398 395125 394904 394860 394982 395298 395970 397275 399369 401914 404072 405113 405016
61446 405016 404361 403677 403110 402709 402730 403520 405205 407700 410922 414825 419242 423869 428498 433093 437590 441761
61430 441761 445395 448574 451615 454817 458324 462079 465701 468571 470433 471953 474320 478046 482372 486058
61416 486058 488493 489814 490278 490044 489482 489033 488562 487289 484708 481314 478049 475230 472398 469124 465533
61401D65533l535l309l051k655k076j444q01n5P01J061P18o5o18n14K5M01L20
61384D50636Q6K14P54J227J237R70Q49R47J038J157J625K380K781K385J648J396
61368D71330J785K243K342K204J946J331L48k97K22J824L529M525M851N021N384
61353E08588O043P051Q341R669J0864J2061J3325J4132J3679J1792R282P178N836
61340F37841M914M001K986K039J439J344J447J095j9j415k437l164m209n638o590
61325F33634o270m898l441k627k492k593k409j652m92O12J452K211K997L553L718
61310F21303L861M494N653P055Q647J0602J2812J4894J6536J7465J7176J5293
61298G55791J2226Q853N473J724k283n492p078p561q107r014r653r638r295q809
$$ plain form
61401 465533 461998 458689 455638 452983 450907 449463 448662 448607 449308 450369 451087 451022 450404 449890 449915 450316 450636
61384 450636 450722 450936 451690 452917 454154 455124 455973 456920 457958 459115 460740 463120 465901 468286 469934 471330
61368 471330 473115 475358 477700 479904 481850 483181 483529 483232 483454 485278 488807 493332 498183 503204 508588
61353 508588 514631 521682 530023 539692 550556 562617 575942 590074 603753 615545 624827 632005 637841
61340 637841 642755 646756 649742 651781 653220 654564 656011 657106 657087 655672 653235 650071 645862 640224 633634
61325 633634 627364 622466 619025 616398 613906 611313 608904 607252 606760 607372 608824 611035 614032 617585 621303
61310 621303 625164 629658 635311 642366 651013 661615 674427 689321 705857 723322 740498 755791
61298 755791 768017 776870 782343 784067 781784 776292 769214 761653 753546 744532 734879 725241 715946 707137
61284G07137p770o022m396l892m339m546l821k751k147j762o82J211K841L204
61270F72265K536J994K446L819N328O044N587M670M739O613R545J2044J3427J4164
61256G65221J4796J5213J5012J3916J1667Q141L869k7k850m903o740q378r539
61243H15398j0233j0491j0059q928p833p410p127n922l838k132j612j744j687
61230G36382j380j072n33O43K377M324O320P966Q382P207N562M955N329N296M382
61215G96140L784M442N520N768N428N548N978N494L861K360J943K106K183K657
61201H53212M236O420Q132R387J1242J4137J7309J9963K2194K4343K6159K6977
61189A043711K6308K3961K0093J5460J1172P776M883K064l42j816k674l767n319
$$ plain form
61284 707137 699367 693345 688949 685057 680718 676172 672351 669600 667453 665691 665009 666220 669061 672265
61270 672265 674801 676795 679241 683060 688388 694432 700019 704689 709428 716041 725586 737630 751057 765221
61256 765221 780017 795230 810242 824158 835825 843966 847835 847808 844958 840055 833315 824937 815398
61243 815398 805165 794674 784615 775687 767854 760444 753317 747395 743557 741425 739813 738069 736382
61230 736382 735002 733930 733397 734040 736417 740741 747061 755027 763409 770616 776178 781133 786462 791758 796140
61215 796140 799924 804366 809886 815654 821082 826630 832608 838102 841963 844323 846266 848372 850555 853212
61201 853212 857448 863868 872000 881387 892629 906766 924075 944038 966232 990575 1016734 1043711
61189 1043711 1070019 1093980 1114073 1129533 1140705 1148481 1153364 1155428 1155086 1153270 1150596 1146829 1141510
61176A141510o872q355j0396j3217j5913j7414j7815j8069j8604j8984j8964j9160
61164I57747k0187k1629k2429k2099k1082j9957j8848j7718j6606j5283j3075
61153G48834r635n678k444l80J138K757M337N441O011O056N030K241k027o400
61139G55281r595j1287j1672j0714q429n508k918q00J579M584P567R818J1610
61126G29516J3665J5975J7897J9343K0963K3027K4874K5897K6505K7543K9198
61115I74403L0958L2362L3165L2967L1414K8870K6324K4421K2924K1279J9328
61104A278415J7159J4616J1319P190K629j906o354j0994j5992k1081k5750k9630
61092A219621l2621l4739l6013l6559l6537l5924l4563l2453k9846k7019k4230
$$ plain form
61176 1141510 1134638 1126283 1115887 1102670 1086757 1069343 1051528 1033459 1014855 995871 976907 957747
61164 957747 937560 915931 893502 871403 850321 830364 811516 793798 777192 761909 748834
61153 748834 739199 733521 731077 730697 731835 734592 738929 744370 750381 756437 761467 763708 761681 755281
61139 755281 745686 734399 722727 712013 703584 698076 695158 694358 695937 700521 708088 717906 729516
61126 729516 743181 759156 777053 796396 817359 840386 865260 891157 917662 945205 974403
61115 974403 1005361 1037723 1070888 1103855 1135269 1164139 1190463 1214884 1237808 1259087 1278415
61104 1278415 1295574 1310190 1321509 1328699 1331328 1329422 1323068 1312074 1296082 1275001 1249251 1219621
61092 1219621 1187000 1152261 1116248 1079689 1043152 1007228 972665 940212 910366 883347 859117
61081H59117k1918k0565k0036j9425j7906j5516j2883j0497q613p429o832o145
61069F91352m827l202j997j264m60N08J182J552K282L606M817N368N808O955Q650
61054G20330J0088J1048J2020J3279J4576J5803J7273J9145K1100K2856K4522
61043I02040K6159K7392K7805K7566K7205K6951K6642K6220K5896K5769K5633
61032A195278K5344K5032K4787K4424K3846K3412K3552K4282K5432K7184K9727
61021A472300L2548L4654L5717L6402L7483L9158M1511M5050N0470N8243O8616
61010A952152Q1400R5535J09514J22802J36485J52514J73014K00582K38004K86938
61000C548940L47634M20280N05529O03576P15174Q45329J004249J203059J450239
$$ plain form
61081 859117 837199 816634 796598 777173 759267 743751 730868 720371 711758 704329 697497 691352
61069 691352 686525 683323 681326 680062 679602 680110 681292 682844 685126 688732 693549 698917 704725 711680 720330
61054 720330 730418 741466 753486 766765 781341 797144 814417 833562 854662 877518 902040
61043 902040 928199 955591 983396 1010962 1038167 1065118 1091760 1117980 1143876 1169645 1195278
61032 1195278 1220622 1245654 1270441 1294865 1318711 1342123 1365675 1389957 1415389 1442573 1472300
61021 1472300 1504848 1539502 1575219 1611621 1649104 1688262 1729773 1774823 1825293 1883536 1952152
61010 1952152 2033552 2129087 2238601 2361403 2497888 2650402 2823416 3023998 3262002 3548940
61000 3548940 3896574 4316854 4822383 5425959 6141133 6986462 7990711 9193770 10644009
60991A0644009J750123K090417K412331K593257K488234K027616J294446N01106
60983B5801539j25215m51774m65788k34965J24828M51786N59631L16074k67894
60974B5708222j026415j730274k209241k412515k384734k206811j953986j681426
60966A0102820j422481j191191r89666q16696o71123n50560m51194l69877l04800
60957C335232k54033k14741j84095j59844j40146j23794j10437r9605q9890q0069
60947A878578p0536o2361n5438m8970m3535m0889m1459m3451m4847m5082m4387
60936A337623m2769m0335l7642l4976l1951k8367k4852k2209k0506j9199j7749
60925A017068j5893j3794j1949j0568r031o628l743j535l59N50J759K963L932
$$ plain form
60991 10644009 12394132 14484549 16896880 19490137 21978371 24005987 25300433 25801539
60983 25801539 25676324 25224550 24758762 24523797 24648625 25100411 25660042 25976116 25708222
60974 25708222 24681807 22951533 20742292 18329777 15945043 13738232 11784246 10102820
60966 10102820 8680339 7489148 6499482 5682786 5011663 4461103 4009909 3640032 3335232
60957 3335232 3081199 2866458 2682363 2522519 2382373 2258579 2148142 2048537 1958647 1878578
60947 1878578 1808042 1745681 1690243 1641273 1597738 1556849 1515390 1471939 1427092 1382010 1337623
60936 1337623 1294854 1254519 1216877 1181901 1149950 1121583 1096731 1074522 1054016 1034817 1017068
60925 1017068 1001175 987381 975432 964864 955833 949205 945462 943927 943568 944118 945877 948840 952772
60912I52772N116O758Q306R373J0434J1914J3252J3734J3675J3924J4489J4528
60900A088275J3572J2064J0687R769R356R340R338Q862P727O227M792L640K693
60887A196342J828J111O94M19k59j625l195m307n100o335q183r893j0877j1568
60873A139052j2801j4695j6515j7412j7113j6168j5510j5482j5361j4354j2970
60862I70671j2507j3078j3245j2068j0532j0037j0367j0201r158q094p631p553
60850H46200p726q503r809j0797j0825j0213r478q502p106n988o245p973j0045
60837G32990j1478j2448j3594j4780j5149j4280j2666j0924r143p298n767m840
60825F00623m091k908j530p94q32p65J01J381K232K321J813R14m0m27Q8R79J297
$$ plain form
60912 952772 957888 964646 972952 982325 992759 1004673 1017925 1031659 1045334 1059258 1073747 1088275
60900 1088275 1101847 1113911 1124598 1134367 1143723 1153063 1162401 1171263 1178990 1185217 1190009 1193649 1196342
60887 1196342 1198170 1199281 1199975 1200394 1200135 1198510 1195315 1191008 1185908 1179573 1171390 1161497 1150620 1139052
60873 1139052 1126251 1111556 1095041 1077629 1060516 1044348 1028838 1013356 997995 983641 970671
60862 970671 958164 945086 931841 919773 909241 899204 888837 878636 869478 861384 853753 846200
60850 846200 838474 829971 820162 809365 798540 788327 778849 770347 763241 757253 751008 743035 732990
60837 732990 721512 709064 695470 680690 665541 651261 638595 627671 618528 611230 605463 600623
60825 600623 596532 593624 592094 591300 590468 589703 589804 591185 593417 595738 597551 598465 598425 597998 598086 599065 600362
60808F00362P03k36p46o26l26m15r05j179p79j73k68j142j874j907j834k320k840
60791E83495k340r38Ln26k127l707m645m974m959m876m989n380n786n801n296
60776E27154m614m386m951n898o271n480l959k734k334k398k240j617p68L7P99
60761D80340J607K317K616K440K177K248K644L083L490L936M165L748K868K384
60747E20063K765L408L430K806K208J956J766J416R77L33r21k767m407n081n052
60732E22900n274o108o735o205m801l856m171n044n292m829m535m702m527l473
60718D53348k310k127k710k816j867o74k92q02j480j782j750j650j514j147n23
60703D29904L6J46j15k54k8K29J82M5K31O33P93O75P54J290J923K234K279K379
$$ plain form
60808 600362 601065 600829 600083 599457 599131 598716 597811 596632 595853 595680 595412 594270 592396 590489 588655 586335 583495
60791 583495 581155 580217 580220 579694 577567 573860 569215 564241 559282 554406 549417 544037 538251 532450 527154
60776 527154 522540 518154 513203 507305 501034 495554 491595 488861 486527 484129 481889 480272 479504 479541 480340
60761 480340 481947 484264 486880 489320 491497 493745 496389 499472 502962 506898 511063 514811 517679 520063
60747 520063 522828 526236 529666 532472 534680 536636 538402 539818 540795 541128 540207 537440 533033 527952 522900
60732 522900 517626 511518 504783 498578 493777 489921 485750 480706 475414 470585 466050 461348 456821 453348
60718 453348 451038 448911 446201 443385 441518 440844 440552 439750 438270 436488 434738 433088 431574 430427 429904
60703 429904 429940 430086 429971 429717 429689 429918 430100 430145 430376 431009 431802 432477 433231 434521 436444 438678 440957 443336
60685D43336K656L035L471L891M086L935L697L823M457N249N705N683N500N585
60671E04109N982O252N934N100M281L809L439K765J843J058M88k69j400k441k825
60656E38125k728k918l699m406m170k885j220Q2O50M71j74q23j257j780k759l940
60640E06569m595m412l888l652l752l752l374k733k091j586j218r53q26q72r98
60625D67867j032r23p82n87j50M57O71O8r33j421j038k91K22M56P07J112J495
60608D65898J537J081M28J80N22Q55N63j39n53n04l70k87j03Kk67n33o8R69J627
60589D70838J753K312L730M963M948M063L326K939K468J729O76q92k571l020j588
60574D95674L79J031M78M36J629L013L671M043M851N901O660P278Q348J0089J2212
$$ plain form
60685 443336 445992 449027 452498 456389 460475 464410 468107 471930 476387 481636 487341 493024 498524 504109
60671 504109 510091 516343 522277 527377 531658 535467 538906 541671 543514 544572 545060 544791 543391 540950 538125
60656 538125 535397 532479 528780 524374 520204 517319 516099 516181 516831 517302 517128 516305 515048 513268 510509 506569
60640 506569 501974 497562 493674 490022 486270 482518 479144 476411 474320 472734 471516 470563 469737 468865 467867
60625 467867 466835 465912 465130 464543 464393 464850 465521 465589 464656 463235 462197 461906 462128 462584 463291 464403 465898
60608 465898 467435 468516 468944 469124 469646 470501 471064 470925 470372 469868 469498 469211 469108 469110 468843 468310 468242 469211 470838
60589 470838 472591 474903 478633 483596 488544 492607 495933 498872 501340 503069 503745 502853 500282 497262 495674
60574 495674 496053 497084 497562 497998 499627 502640 506311 510354 515205 521106 527766 535044 543392 553481 565693
60559E65693J4257J5793J6484J6169J4678J1762P587L110n53l129m975o150o369
60546F44357n857n315m919m139k733j141L96K285M744P209R118J0713J2609J4980
60532F82307J7638K0437K3057K4781K4990K3646K0948J6874J1468N370m95n575
60520H65446r651j2352j3249j2486j0984r792r276q972q253p081n959n044l764
60507G48583j661O32J991K289K510L354M475N469O789R147J2581J6744K1606K7172
60493H61681L2893L8105M2913M7941N3158N7521N9890N9862N7700N3894M8836
60482A414394M2522L4428K4030J1578j829j5013k7277l8236m7511n4795n9975
60471A282316o2957o3639o2253n9525n6102n1900m6443m0016l3966k9536k6607
$$ plain form
60559 565693 579950 595743 612227 628396 643074 654836 662423 665533 664980 661851 656876 650726 644357
60546 644357 638500 633185 628266 624127 621394 620253 620649 622934 627678 634887 644005 654718 667327 682307
60532 682307 699945 720382 743439 768220 793210 816856 837804 854678 866146 871516 871021 865446
60520 865446 855795 843443 830194 817708 806724 796932 787656 778684 770431 763350 757391 752347 748583
60507 748583 746922 747554 749545 751834 754344 757698 762173 767642 774431 783578 796159 812903 834509 861681
60493 861681 894574 932679 975592 1023533 1076691 1134212 1194102 1253964 1311664 1365558 1414394
60482 1414394 1456916 1491344 1515374 1526952 1525123 1510110 1482833 1444597 1397086 1342291 1282316
60471 1282316 1219359 1155720 1093467 1033942 977840 925940 879497 839481 805515 775979 749372
60460G49372k4086k1356j8747j6537j4321j1907j0118r816j0424j0407r220p857
60448E84576p218o843n860m458l556l423l442l131k630k150j664j296j442k146
60434E35317k777k747k179j549r02O5J249K021J978J415P83P5q78j819k194j848
60418E26010j152m42K34P58Q35M82K20M40R10J202J307J435J496J238P75M86N23
60401E36757P52J084J465J661J486J157J024J080J161J453K189K954L011K390
60387E59624J912K016K290K376K626L331L997L979L412K906K631K359K131K198
60373E97788K427K359J952J735K034K501K631K408K147J972J689J178O10K06l2
60358F23605j92j47L94J422K493L255L928M917O085O773O662O337O806Q593J1323
$$ plain form
60460 749372 725286 703930 685183 668646 654325 642418 632300 622484 612060 601653 592433 584576
60448 584576 577358 570515 564655 560197 556641 553218 549776 546645 544015 541865 540201 538905 537463 535317
60434 535317 532540 529793 527614 526065 525163 525228 526477 528498 530476 531891 532674 532749 531871 530052 527858 526010
60418 526010 524858 524416 524650 525408 526243 526725 526945 527385 528295 529497 530804 532239 533735 534973 535748 536234 536757
60401 536757 537509 538593 540058 541719 543205 544362 545386 546466 547627 549080 551269 554223 557234 559624
60387 559624 561536 563552 565842 568218 570844 574175 578172 582151 585563 588469 591100 593459 595590 597788
60373 597788 600215 602574 604526 606261 608295 610796 613427 615835 617982 619954 621643 622821 623431 623637 623605
60358 623605 623413 623266 623660 625082 627575 630830 634758 639675 645760 652533 659195 665532 672338 680931 692254
60343F92254J3948J5298J4764J2660R877P023L978L84l602p230r772j1110j1656
60330G26816j1794j1509j0682r574q709q216p656o702n638m849m216l430k688
60317F31153k451k652k703k289j599p97K63J565K710L385L755M279N367P232R737
60302F56955J2402J4900J7514K0820K4910K9173L2598L3914L1896K6383J8812
60291I20277J0911K873o229j6106k4554k9528l0998l0261k8262k5382k2184j9335
60279G01222j6988j4833j2639j0432q346o685n792n576n551n481n529n551m935
60266E92884l599k299j519p05O54J926K133J328K92n84j294j462o76O06J446J610
60250E90741J475J019q3j384j820j235p08j039j690j747j215p43n41k70K45P13
$$ plain form
60343 692254 706202 721500 736264 748924 758801 765824 769802 770186 766584 759354 749582 738472 726816
60330 726816 715022 703513 692831 683257 674548 666332 658676 651974 646336 641487 637271 633841 631153
60317 631153 628702 626050 623347 621058 619459 618662 618925 620490 623200 626585 630340 634619 639986 647218 656955
60302 656955 669357 684257 701771 722591 747501 776674 809272 843186 875082 901465 920277
60291 920277 931188 934061 927832 911726 887172 857644 826646 796385 768123 742741 720557 701222
60279 701222 684234 669401 656762 646330 637984 631299 625507 619931 614380 608899 603370 597819 592884
60266 592884 589285 586986 585467 584762 585416 587342 589475 590803 591095 590511 589217 587755 587079 587685 589131 590741
60250 590741 592216 593235 593152 591768 589948 588713 588005 586966 585276 583529 582314 581571 581030 580760 581005 581718
60234E81718Q68R02J235J896K328K059J539J793L089M483N087N260N807O532O525
60219F31121N708N054N118N322N091M833N255O280P231P769Q089Q375Q475Q078
60205G21799P094N937N375N810O663O857N933M355K703J085m74j684k419l077
60191G65957m040n019n367m894m069l436l196l277l570l963m276m235l653k762
60177G10200k207k424l032l182k586j834j505j433j130o01k83l16k79K41J093
60162F90722J685J574Q75J61l9L17Q15J060J030R86J118J343J441J350J325J705
60146G07468K480L227L609L766M011M347M590M819N317N973O317O238O315P020
60132G75497P958Q296P860P263O907O302M710K261o8j561k494l511m563m939m284
$$ plain form
60234 581718 582586 583488 584723 586619 588947 591006 592545 594338 597427 601910 606997 612257 618064 624596 631121
60219 631121 636829 641883 647001 652323 657414 662247 667502 673782 681013 688782 696871 705246 713721 721799
60205 721799 728893 734830 740205 746015 752678 759535 765468 769823 772526 773611 773137 771453 769034 765957
60191 765957 761917 756898 751531 746637 742568 739132 735936 732659 729089 725126 720850 716615 712962 710200
60177 710200 707993 705569 702537 699355 696769 694935 693430 691997 690867 690266 689983 689667 689388 689629 690722
60162 690722 692407 693981 694856 695017 694978 695295 696110 697170 698200 699186 700304 701647 703088 704438 705763 707468
60146 707468 709948 713175 716784 720550 724561 728908 733498 738317 743634 749607 755924 762162 768477 775497
60132 775497 783455 791751 799611 806874 813781 820083 824793 827054 826986 825425 822931 819420 814857 809918 805634
60117H05634l117k106j275l63L56J22j279k966l718l176k152j750k322l354m219
60102G74315m777n130n066m214k702j158K2R83J798K105J836J765K749M529N993
60087G73048O512O457O382O354O264O226O231N822M531K557O83n17j265k378m470
60072H22437p255r680j0898j1098j1208j1770j2389j2328j1385j0018q783p884
60060F97741p188o472n620m661l744l083k837k891k803k133r49J54O34N81N81
60045F57310J185K481M084N375N903N701N134M378L326J990P04l25j381k814m472
60030F88579n828o550o713o575o418o493o905p550q254q778q763q043p096o594
60016E88019o359n417l536j928j645j971j425nQ03K30p76j004m48J94N90P84P59
$$ plain form
60117 805634 802517 800411 799136 798773 799129 799251 797972 795006 791288 788112 785960 784210 781888 778534 774315
60102 774315 769538 764408 759342 755128 752426 751268 751290 752273 754071 756176 758012 759777 762526 767055 773048
60087 773048 779560 786017 792399 798753 805017 811243 817474 823296 827827 830384 831067 830550 829285 826907 822437
60072 822437 815182 805502 794604 783506 772298 760528 748139 735811 724426 714408 705625 697741
60060 697741 690553 684081 678461 673800 670056 666973 664136 661245 658442 656309 655360 655514 656148 656729 657310
60045 657310 658495 660976 665060 670435 676338 682039 687173 691551 694877 696867 697571 697246 695865 693051 688579
60030 688579 682751 676201 669488 662913 656495 650002 643097 635547 627293 618515 609752 601709 594613 588019
60016 588019 581660 576243 572707 570779 569134 567163 565738 565733 566536 566766 565990 564986 564538 564732 565322 566106 566865
59999E66865O20P66J340J887K013J984K259K758L157L581M387N361N782N339M476
59984F12575L706L009K146J205M82Kn31j291k179l125m209n272n694m995l583
59969E92246k397j788j210j99R03J565J946K584L532M369M980N672O502O998O727
59954F32430N740M396L044K021J590J654J685J174J16r27j328j078r46j666k969
59939F44936l838l901l940m593n222m839l622k633k242j890j317r87j067r45k55
59924F03645M74O78O85J202K307L463M276M770N133N522O064O782P663Q782J0129
59909F71575J1260J1490J0585Q950P071N116L215J605L36q40k034k986l465l543
59895G18335l312k655j565l65O36J435K114K575K747K767K799K868L016L322L661
$$ plain form
59999 566865 567485 568251 569591 571478 573491 575475 577734 580492 583649 587230 591617 596978 602760 608099 612575
59984 612575 616281 619290 621436 622641 623123 623125 622594 621303 619124 615999 611790 606518 600824 595829 592246
59969 592246 589849 588061 586851 586652 587555 589120 591066 593650 597182 601551 606531 612203 618705 625703 632430
59954 632430 638170 642566 645610 647631 649221 650875 652560 653734 653850 652923 651595 650517 649571 647905 644936
59939 644936 641098 637197 633257 628664 623442 618603 614981 612348 610106 608216 606899 605912 604845 603900 603645
59924 603645 604119 604797 605482 606684 608991 612454 616730 621500 626633 632155 638219 645001 652664 661446 671575
59909 671575 682835 694325 704910 713860 720931 726047 729262 730867 731203 730363 728329 725343 721878 718335
59895 718335 715023 712368 710803 710438 711074 712509 714623 717198 719945 722712 725511 728379 731395 734717 738378
59880G38378L765L677L865M597N451N658M884L478K069R99R3j011k287l282l792
59865G66542m264n172o243o811o748o487o219n739n079m621m447m168l541k726
59851F94277j748l06J683L762N427O527P103P290P491Q198R472J0973J2346J3077
59837G85572J2177Q974M397N82j128j124l47Q53K341L564L974L338J244k801q122
59822H13494j2602j4602j4600j4169j3901j3226j1815j0046q312o713n357m244
59810F83907k963j233L81J020P66N96J043J570J454P25k7m36o41j039j896l104
59794F80123m225m850m880m509m073l937m233m651m712m332l862l532l255k967
59780F22105k745k462j857j099p61r73j161q80l88l1L47R71J622K021K298K597
$$ plain form
59880 738378 742143 745820 749685 754282 759733 765391 770275 773753 775822 776821 776914 775903 773616 770334 766542
59865 766542 762278 757106 750863 744052 737304 730817 724598 718859 713780 709159 704712 700544 697003 694277
59851 694277 692529 692223 693906 697668 703095 709622 716725 724015 731506 739704 749176 760149 772495 785572
59837 785572 797749 806723 811120 811702 810574 809450 809103 809956 812297 815861 819835 823173 824417 821616 813494
59822 813494 800892 786290 771690 757521 743620 730394 718579 708533 700221 693508 688151 683907
59810 683907 680944 679711 680092 681112 681878 682474 683517 685087 686541 687266 687239 686803 686162 685123 683227 680123
59794 680123 675898 671048 666168 661659 657586 653649 649416 644765 640053 635721 631859 628327 625072 622105
59780 622105 619360 616898 615041 613942 613181 612208 611047 610167 609779 609748 610095 611066 612688 614709 617007 619604
59764F19604K754K769L106L955M719M869M820N302O159O571O243N731N665O219
59750F88486P214Q240Q769Q607Q127P744P300O421N220M240L761L486K880J630
59736G72125L4j079j111n20l40p91j078p56m39o82j001o84R0P16J116J459J496
59719G68555R87L78K49M65N47M30K34j64o42n25M29J416J860K491L986N278M775
59702G90749K844J488J661K437K865L024K982K301J219R67K148L722M311L665
59688H26383K208J70k030l340l090k127j971l013m215m593m349m360m998n841
59674G84834o356o547o725o938o958o796o698o523n753m388l233k906l044l034
59660G08935k860k639j901k70J576K610K796K901L135L018K450J966J868J864
$$ plain form
59764 619604 622358 625127 628233 632188 636907 641776 646596 651898 658057 664628 670871 676602 682267 688486
59750 688486 695700 703940 712709 721316 729443 737187 744487 750908 756128 760368 764129 767615 770495 772125
59736 772125 772159 771080 769969 769449 769109 768318 767240 766484 766045 765363 764362 763678 763768 764484 765600 767059 768555
59719 768555 769542 769920 770169 770634 771181 771611 771845 771681 771039 770514 770943 772359 774219 776710 780696 785974 790749
59702 790749 793593 795081 796742 799179 802044 805068 808050 810351 811570 812537 814685 818407 822718 826383
59688 826383 828591 828761 826731 823391 820301 818174 816203 813190 808975 804382 800033 795673 790675 784834
59674 784834 778478 771931 765206 758268 751310 744514 737816 731293 725540 721152 717919 715013 711969 708935
59660 708935 706075 703436 701535 701265 702841 705451 708247 711148 714283 717301 719751 721717 723585 725449
59646G25449J594Q23p64l186n648p125p487p393p257o960o374n366l648j427K17
59631F65448N49M01R49J688J107q60k649l467m133n175n711m988l702k861k436
59616F34160j940j419j090p60l43j68k64m6P34J532J968K394K946K928J914O32
59600F43178j8j41l16n38m70k59l29p22j152j410j278n62M06Q51N42J23J39L84
59582F38428N93R01J129N13j120k677l098k694k417k465k421k262k297k484k574
59567F15055k665k882k834k071q18K57Q11R18P56O07P19Q47M18l65l91Q60K368
59550F11590K900K607K445K609K632K611L278M844O630P909Q541Q813R223J0374
59536F87006J2737J6476K1449K6708K9886K8161K0845J0586J320m555o686n687
$$ plain form
59646 725449 727043 727866 727102 723916 718268 711143 703656 696263 689006 682046 675672 670306 666658 665231 665448
59631 665448 665997 666398 667347 669035 670142 669282 666633 663166 659033 653858 648147 643159 639457 636596 634160
59616 634160 632220 630801 629711 628951 628608 628440 628176 628130 628864 630396 632364 634758 637704 640632 642546 643178
59600 643178 643160 643019 642703 642165 641695 641436 641107 640385 639233 637823 636545 635983 636389 637240 637782 637905 638044 638428
59582 638428 639021 639922 641051 641564 640444 637767 634669 631975 629558 627093 624672 622410 620113 617629 615055
59567 615055 612390 609508 606674 604603 603785 604042 604853 605771 606527 607134 607853 608700 609118 608753 608362 609222 611590
59550 611590 614490 617097 619542 622151 624783 627394 630672 635516 642146 650055 658596 667409 676632 687006
59536 687006 699743 716219 737668 764376 794262 822423 843268 853854 855174 850619 843933 838246
59524H38246k825o6J123J043Q68P46j69k046m077n930q273j1419j4406j5983j5893
59509G60939j4897j3925j3408j3051j2152j0495q784p768p113n848l788j860r50
59496F46900j023j428j457o17R94K477K847K140J310J001R67P71M76M59R68K051
59480F58836L550N087O340P348Q279R035R465R846J0613J1634J2153J1532R700
59467G73418P069M338K248J076M65J21L57J473K984M259N627P939J1053J3734
59453H36161J5109J5427J5085J3869J1665R213P540O964P002O930O127M141Q10
59440I56043l685q838j3773j7350j8848j8572j7326j5397j2593r277o558n141
59428H08685m625m219l580k546o90K216N593Q516J0709J2624J4574J6222J7051
$$ plain form
59524 838246 835421 835355 836478 837521 838389 839135 838966 836920 832843 826913 818640 807221 792815 776832 760939
59509 760939 746042 732117 718709 705658 693506 683011 674227 666459 659346 653498 649710 647850 646900
59496 646900 645877 644449 642992 642375 643369 645846 648693 650833 652143 653144 654111 654882 655358 655817 656785 658836
59480 658836 662386 667473 673813 681161 689440 698475 707940 717786 728399 740033 752186 763718 773418
59467 773418 780487 784825 787073 788149 788614 788735 789092 790565 793549 797808 803435 811374 822427 836161
59453 836161 851270 866697 881782 895651 907316 916529 924069 931033 938035 944965 951092 955233 956043
59440 956043 952358 943520 929747 912397 893549 874977 857651 842254 829661 820384 813826 808685
59428 808685 804060 799841 796261 793715 793025 795241 800834 809350 820059 832683 847257 863479 880530
59415H80530J7038J6669J6373J6208J6293J7273J9685K2460K2499J6747N054r235
59403A057594k1495k8486k9405k5526j9201j2362n264K919J1633J7547J6622P841
59391I72417n497j8216k6685l0121k9589k6605k2440j7974j3687r787o440l803
59379G61573j866l95Q85K116L242L991L967L090J978J569K172L232M199N203O435
59364H01391P442P689P533P726Q177Q155P744P947R008R846R809J0002J1786J4717
59350I28972J7119J8374J9339K0632K1643K1654K0966K0321J9707J8256J5160
59339A142143J0395M732p66n362r012j2135j5096j7910k0318k1956k2567k2268
59327A009880k1527k0723j9720j8123j5929j3714j2139j1277j0538r287p583o158
$$ plain form
59415 880530 897568 914237 930610 946818 963111 980384 1000069 1022529 1045028 1061775 1066829 1057594
59403 1057594 1036099 1007613 978208 952682 933481 921119 915855 918774 930407 947954 964576 972417
59391 972417 966920 948704 922019 891898 862309 835704 813264 795290 781603 771816 765376 761573
59379 761573 759707 759312 760197 762313 765555 769546 773513 776603 778581 780150 782322 785554 789753 794956 801391
59364 801391 808833 816522 824055 831781 839958 848113 855857 863804 872812 882658 892467 902469 914255 928972
59350 928972 946091 964465 983804 1004436 1026079 1047733 1068699 1089020 1108727 1126983 1142143
59339 1142143 1152538 1157270 1156504 1151142 1142130 1129995 1114899 1096989 1076671 1054715 1032148 1009880
59327 1009880 988353 967630 947910 929787 913858 900144 888005 876728 866190 856903 849320 843162
59315H43162n547n466n310m991m851m929m952m892m896m605l420j628m81p12j642
59300G84840k078j568l22J361L154M758O450Q969J2393J5621J7323J6748J3412
59287H81061P072j125q468j2772j4170j4030j2861j0364o836l118N42M358P897
59274H17186J0343J1762J3089J4746J6228J6992J6842J5530J3020J0063P577N407
59262I68785K698n37l357n473p690j0421j2849j4098j4360j4284j3957j3093j1687
59249H49677j0025q299o596m943l244j433L27J915L563N446P160Q229Q888R629
59235H60294J0094R383P463N316L522J599r36l642n770p112p988q736r591j0571
59221H43325j1271j1119r985q246o359m722l659l005k007l66R73R45k0n43k86
$$ plain form
59315 843162 837615 832149 826839 821848 816997 812068 807116 802224 797328 792723 789303 787675 787194 786482 784840
59300 784840 782762 781194 780872 782233 785387 790145 796595 805564 817957 833578 850901 867649 881061
59287 881061 888133 887008 878540 865768 851598 837568 824707 814343 807507 804389 804931 809289 817186
59274 817186 827529 839291 852380 867126 883354 900346 917188 932718 945738 955801 963378 968785
59262 968785 971483 970946 967589 962116 954426 944005 931156 917058 902698 888414 874457 861364 849677
59249 849677 839652 831353 824757 819814 816570 815137 815464 817379 820942 826388 833548 841777 850665 860294
59235 860294 870388 879771 887234 892550 896072 897671 896735 893093 887323 880211 872223 863487 853896 843325
59221 843325 832054 820935 810950 802704 796345 791623 787964 784959 782952 782586 783559 784504 784484 783941 783655
59206G83655j57o75j320j763k394l291l839l834l825l940l454k139q94l91m0R17
59190G52616K160K918L070K919K558K168K300L107L906M120M045M135M256M243
59176G98521M495N220N816N814N806O587P958R280J0661J2460J4015J4129J2703
59163I13465J0892R475P973N649K644l05k835n311q184j1202j3445j4328j4456
59150H80032j4920j5764j5897j4785j3383j2815j2778j2137j0659r293q831r002
59138G29768q938q046o442m884m141m140l950k916j509o33m09j70O25J952L503
59123F89670M885N727O068O554P770R482J1056J2403J3943J5656J6888J7285J7341
59110H34728J7589J7673J6758J4763J2651J1305J0537R509P912O165M546K740
$$ plain form
59206 783655 783498 782823 781503 779740 777346 774055 770216 766382 762557 758617 755163 753024 752130 751739 751699 752616
59190 752616 754776 757694 760764 763683 766241 768409 770709 773816 777722 781842 785887 790022 794278 798521
59176 798521 803016 808236 814052 819866 825672 832259 840217 849497 860158 872618 886633 900762 913465
59163 913465 924357 933832 941805 947454 950098 949793 946958 941647 933463 922261 908816 894488 880032
59150 880032 865112 849348 833451 818666 805283 792468 779690 767553 756894 747601 738770 729768
59138 729768 720830 712784 706342 701458 697317 693177 689227 686311 684802 684169 683760 683590 684215 686167 689670
59123 689670 694555 700282 706350 712904 720674 730156 741212 753615 767558 783214 800102 817387 834728
59110 834728 852317 869990 886748 901511 914162 925467 936004 945513 953425 959590 964136 966876
59098I66876N38j672l534n293p127q378q225o916n482m407l376k271j565j592
59084I07576k244l462n276p286q799r639j0145j0393j0215r965j0219j0593r972
59071G99368q211o497n603m962m017l399l836m822n192m553l403k396k079k699
59057G37699l732m198l898l614l693l438k488j682j634j535n27O61Q18K61K36
59042G09236P59N94n49j365q24M32J074P40K16M03J437K686L597M466O053Q347
59026G37302J0393J1716J3153J5546J8206J9649J9428J8230J6483J3887J0319
59015I04312O285K299j418m508o473p195p004o150m624k586m91J249K487L269
59001H79452L843M605N766P189Q610R760J0061Q892O474L962K187Q14p72k444
$$ plain form
59098 966876 967414 965742 962208 956915 949788 941410 933185 926269 920787 916380 913004 910733 909168 907576
59084 907576 905332 901870 896594 889308 880509 870870 860725 850332 840117 830152 819933 809340 799368
59071 799368 791157 784660 779057 774095 770078 766679 762843 758021 752829 748276 744873 742477 740398 737699
59057 737699 733967 729769 725871 722257 718564 715126 712638 710956 709322 707787 707260 707921 708739 709000 709236
59042 709236 709995 710589 710040 708675 707851 708283 709357 710097 710313 710716 712153 714839 718436 722902 728955 737302
59026 737302 747695 759411 772564 788110 806316 825965 845393 863623 880106 893993 904312
59015 904312 910597 912896 911478 906970 900497 893302 886298 880148 875524 872938 872447 873696 876183 879452
59001 879452 883295 887900 893666 900855 909465 919225 929286 938178 944652 948614 950801 951615 950843 948399
58987I48399l838n237p055q841r755r709r219q373o785m474j980K86K217L708
58973H79344M867O262Q255J0364J1948J3245J4880J6648J7740J8061J8286J8614
58961A038514J8401J7221J5377J3111J0121O162J594l035p476j1656j5457j8823
58949A064054k1675k3695k4519k4245k3368k2200k0598j8326j5391j2077q809
58938H49151n878l193o09J416K058J370N96O72R32J15j871m042n817p346q518
58923H19036q769p992o854n929n189m514m042l783l395k599j533m90L94J181K067
58908G67589L265M747O162P213P980Q770R899J1735J4442J7492J9883K1227K2150
58895I22554K3283K4408K4967K4822K4129K3173K2793K4105K7039K9847L0859
$$ plain form
58987 948399 944561 939324 932269 923428 913673 903964 894745 886372 879587 875113 873133 873419 875636 879344
58973 879344 884211 890473 898728 909092 921040 934285 949165 965813 983553 1001614 1019900 1038514
58961 1038514 1056915 1074136 1089513 1102624 1112745 1118907 1120501 1117466 1109990 1098334 1082877 1064054
58949 1064054 1042379 1018684 994165 969920 946552 924352 903754 885428 870037 857960 849151
58938 849151 843273 840080 839471 840887 842945 844315 844911 845583 846515 846630 844759 840717 834900 827554 819036
58923 819036 810267 802275 795421 789492 784303 779789 775747 771964 768569 765970 764437 763947 764341 765522 767589
58908 767589 770854 775601 781763 788976 796956 805726 815625 827360 841802 859294 879177 900404 922554
58895 922554 945837 970245 995212 1020034 1044163 1067336 1090129 1114234 1141273 1171120 1201979
58884A201979L0028K7964K4494J9306J3306P865L037k176q056j3846j9011k3526
58872A261364k6948k8496k8204k7002k5463k3368k0521j7245j4019j1284r551
58861A029263q977r021r163r613j0595j1462j1483j1024j0896j0903j0314r291
58849I06521q594q212p750p812r319j1537j2524j1773j0788j0695j0837j0300
58837G86380r343q579p943p136o146m882l244j927j911k780k829j475j63r9m12
58822G27511L42J925K911K861K664L033L677L949L552K570J317K57k33j09K89
58807G56516L80j99j081j390r13o14j368k630l241l125l101l346l346l289m078
58792G25175n655o659o151m632k892j010J078K975M390N466O177O196N691N299
$$ plain form
58884 1201979 1232007 1259971 1284465 1303771 1317077 1324942 1327979 1325803 1317747 1303901 1284890 1261364
58872 1261364 1234416 1205920 1177716 1150714 1125251 1101883 1081362 1064117 1050098 1038814 1029263
58861 1029263 1020286 1011265 1002102 992489 981894 970432 958949 947925 937029 926126 915812 906521
58849 906521 897927 889715 881965 874153 864834 853297 840773 829000 818212 807517 796680 786380
58837 786380 777037 768458 760515 753379 747233 742351 739107 737180 735269 732489 729660 728185 728022 727923 727511
58822 727511 727853 729778 732689 735550 738214 741247 744924 748873 752425 754995 756312 756569 756336 756227 756516
58807 756516 756896 756697 755616 754226 753313 752699 751331 748701 745460 742335 739234 735888 732542 729253 725175
58792 725175 719520 712861 706710 702078 699186 698176 699254 702229 706619 712085 718262 724458 730149 735448
58778G35448N046M347L357L135L942M541L784J865n49l249n812p197o982o157
58764G35519n711n299m164k632j562r80k50P78J734K465K951K836J828M20m89
58749G27444n48l2P78J774K802L723M616N628O801Q145R550J0595J0902J0802
58735H02980J1073J1901J2728J3227J3681J4160J4098J3101J1477R542P170M453
58723I39591K204J173J268J924K751L496L875L959M268N117O198O923O810N482
58709I95039K899k76l181n691q269j0889j2998j4689j6878j9994k3233k5476k6253
58696H30111k5633k3962k1960k0251j8570j6205j3285j0742q941p469o412o470
58684F50211p440p941p257o257n757n254m013k393j073N3J269K203K543K905M033
$$ plain form
58778 735448 740494 744841 748198 751333 755275 759816 763600 765465 764916 761667 755855 748658 741676 735519
58764 735519 729808 724509 720345 717713 716151 715171 714921 715699 717433 719898 722849 725685 727513 727933 727444
58749 727444 726896 726864 727642 729416 732218 735941 740557 746185 752986 761131 770681 781276 792178 802980
58735 802980 814053 825954 838682 851909 865590 879750 893848 906949 918426 927968 935138 939591
58723 939591 941795 942968 944236 946160 948911 952407 956282 960241 964509 969626 975824 982747 989557 995039
58709 995039 997938 997662 994481 988790 980521 969632 956634 941945 925067 905073 881840 856364 830111
58696 830111 804478 780516 758556 738305 719735 703530 690245 679503 670562 663093 656681 650211
58684 650211 642771 634830 627573 621316 615559 610305 606292 603899 602826 602879 604148 606351 608894 611799 615832
58669F15832N704P264Q743J0675J3202J5921J8266J9551J9140J6913J3221Q307
58657G72739K462l242p454r995j1882j3610j4523j4196j3153j1766r712p206n425
58644F53037m885m538l389j934j074o59q0O25J217J955K873L175K280P98k86p48
58628F48367q03n06r5j8l0P91K515L969M557N200O598P973Q581R163J0527J1812
58612G18601J1669J0278Q753P243N086K358r3j831l054l927m562n181n616n254
58598G34470m150l413l685m145l802k850j853n79J343L468N320P276R743J2284
58584G49427J4460J6563J8555J9432J8667J7200J5849J4020J1197Q436O818N708
58572I16332M171L086L964O547R485J2601J6613K1130K4992K8266L1951L5727
$$ plain form
58669 615832 621536 628800 637543 648218 661420 677341 695607 715158 734298 751211 764432 772739
58657 772739 775201 771959 764505 754510 742628 729018 714495 700299 687146 675380 665668 658462 653037
58644 653037 648152 643614 640225 638291 637217 636558 636478 637103 638320 640275 643148 646323 648603 649401 649115 648367
58628 648367 647564 647058 646963 646945 646915 647706 650221 654190 658747 663947 670545 678518 687099 696262 706789 718601
58612 718601 730270 740548 749301 756544 761630 763988 763895 762064 759010 755083 750521 745340 739724 734470
58598 734470 730320 726907 723222 719077 715275 712425 710572 709993 711336 714804 720124 727400 737143 749427
58584 749427 763887 780450 799005 818437 837104 854304 870153 884173 895370 903806 910624 916332
58572 916332 920503 923589 927553 934100 943585 956186 972799 993929 1018921 1047187 1079138 1114865
58560A114865L7760L6901L3715K9175K3599J7017R656K078m554q783j0337j0791
58548A270301j1780j3152j3807j3712j3857j4813j6483j8776k1401k3570k4845
58537A084105k5770k6672k6720k5210k2904k0859j8842j6131j3030j0234p555
58526H70178m729k557j722j335k03J272K005K185K609K927K356J421J148J111
58512H76666J27j647l066l976n061o169o531o250n932n301l899k584k568l456
58498H20353l920l867m134m543m179l143k247j290M55K534L928M950O645Q767
58484H20309J0299J1552J3662J6383J8460J9897K1636K3234K3009K0536J6891
58473A015868J2456O633j39o141j0487j3739j6249j7624j7899j7547j6231j3228
$$ plain form
58560 1114865 1152625 1189526 1223241 1252416 1276015 1293032 1302688 1304766 1300212 1291429 1281092 1270301
58548 1270301 1258521 1245369 1231562 1217850 1203993 1189180 1172697 1153921 1132520 1108950 1084105
58537 1084105 1058335 1031663 1004943 979733 956829 935970 917128 900997 887967 877733 870178
58526 870178 865449 862892 861170 859835 859632 860904 862909 865094 867703 870630 872986 874407 875555 876666
58512 876666 876793 875146 872080 868104 863043 856874 850343 844093 838161 832860 828961 826377 823809 820353
58498 820353 816433 812566 808432 803889 799710 796567 794320 793030 793485 796019 799947 804897 811542 820309
58484 820309 830608 842160 855822 872205 890665 910562 932198 955432 978441 998977 1015868
58473 1015868 1028324 1034957 1034818 1028677 1018190 1004451 988202 970578 952679 935132 918901 905673
58461I05673r122n454k622L10L795P293J0389J2918J4316J4180J3113J1574Q688
58448I85051L805j636n723q608j1355j3306j3088j1348r848q505o097l218j535
58435H94589n99J436M171N343M816M909O441P802Q448J0036J3137J5812J6568
58422I92909J6070J4974J2656R154N951L724J426j554m418o814r422j2062j3434
58409A009160j3500j3836j4980j5586j4822j3431j1795r244o019l585k351j109
58397H88902O22J914K535L498M946N755N636N403M817K719l17k125k235k368l213
58382I16489l450k650k240k726k773j881j244j062K29L048N652P088Q496J0475
58368I33451J1860J2219J2880J4404J5485J5488J5581J6418J7011J6810J6347
$$ plain form
58461 905673 896551 891097 888475 888785 892580 899873 910262 923180 937496 951676 964789 976363 985051
58448 985051 988856 987220 981497 972889 961534 948228 935140 923792 913944 905439 899342 896124 894589
58435 894589 893990 895426 899597 904940 909756 914665 921106 928908 937356 947392 960529 976341 992909
58422 992909 1008979 1023953 1036609 1045763 1051714 1055438 1056864 1055310 1050892 1044078 1034656 1022594 1009160
58409 1009160 995660 981824 966844 951258 936436 923005 911210 901966 895947 892362 890011 888902
58397 888902 889524 891438 893973 897471 902417 908172 913808 919211 924028 926747 926430 924305 922070 919702 916489
58382 916489 913039 910389 908149 905423 902650 900769 899525 898463 898692 901740 907392 914480 922976 933451
58368 933451 945311 957530 970410 984814 1000299 1015787 1031368 1047786 1064797 1081607 1097954
58357A097954J5242J2304Q253N499M465L094P12q19o60l65o50j17J640K967L407
58342A152926M735P502R868J1150J3115J6308J8680J9325K0057K1572K1657J9087
58330A335982J5886J3688J1284P762M697L083J367j365l322l173k252j714n70
58317A381353J585L109L419M334O526Q063Q171Q928J1313J3247J3501J3842J5356
58304A492747J6323J5860J5718J6502J6138J4216J3589J5344J6509J5280J4091
58293A662317J4784J5274J4020J3327J5051J7223J8087J9279K1840K3470K2958
58282A857630K2921K4924K6431K5879K6070K8959L1878L2650L3515L6174L7935
58271B184966L7042L6749L9715M3170M4259M5298M9029N3444N6081N8645O2550
$$ plain form
58357 1097954 1113196 1125500 1133753 1139252 1143717 1146811 1147523 1146704 1146044 1145679 1145029 1144912 1146552 1149519 1152926
58342 1152926 1157661 1165163 1175031 1186181 1199296 1215604 1234284 1253609 1273666 1295238 1316895 1335982
58330 1335982 1351868 1365556 1376840 1384602 1389299 1392382 1393749 1392384 1389062 1385889 1383637 1381923 1381353
58317 1381353 1382938 1386047 1389466 1393800 1400326 1408389 1416560 1425488 1436801 1450048 1463549 1477391 1492747
58304 1492747 1509070 1524930 1540648 1557150 1573288 1587504 1601093 1616437 1632946 1648226 1662317
58293 1662317 1677101 1692375 1706395 1719722 1734773 1751996 1770083 1789362 1811202 1834672 1857630
58282 1857630 1880551 1905475 1931906 1957785 1983855 2012814 2044692 2077342 2110857 2147031 2184966
58271 2184966 2222008 2258757 2298472 2341642 2385901 2431199 2480228 2533672 2589753 2648398 2710948
58260B710948O4678O2631N9371N7819N5861N1676M8726N0019N2659N3513N5042
58249C322943N9940O5454O8828P2835P9927Q6628Q9849R3044R9817J07331J12467
58238D259063J18289J27683J37088J43500J51044J63178J75447J83648J92013
58229E650953K05158K19393K30575K42880K60772K80221K97382L17734L46569
58220H051637L78880M09246M42953M86194N34503N82637O36490P02885P77575
58211A3003000Q56305R47096J058122J185089J325301J491893J698897J946310
58203B3512013K237136K594749L046274L606541M297678N163027O237055P521755
58195E8216228R016642J0749041J2757617J5092554J7871444K1292299K5552423
$$ plain form
58260 2710948 2775626 2838257 2897628 2955447 3011308 3062984 3111710 3161729 3214388 3267901 3322943
58249 3322943 3382883 3448337 3517165 3590000 3669927 3756555 3846404 3939448 4039265 4146596 4259063
58238 4259063 4377352 4505035 4642123 4785623 4936667 5099845 5275292 5458940 5650953
58229 5650953 5856111 6075504 6306079 6548959 6809731 7089952 7387334 7705068 8051637
58220 8051637 8430517 8839763 9282716 9768910 10303413 10886050 11522540 12225425 13003000
58211 13003000 13859305 14806401 15864523 17049612 18374913 19866806 21565703 23512013
58203 23512013 25749149 28343898 31390172 34996713 39294391 44457418 50694473 58216228
58195 58216228 67232870 77981911 90739528 105832082 123703526 144995825 170548248
58188A70548248L0790826L7034119M3812781M9412444N0644535M4179898K9004136
58181D55426987P893788j3728527l0765192m0773247m4117073m2602304l8185198
58174B53149234l2504124k6878295k2257034j9061135j7135625j5938972j4886570
58167A04487479j3641338j2177254j0631401r132955p752568o532008n493173
58160C9126782m624683l897044l292118k800138k399432k062810j777981j542701
58152A6729875j346662j176235j030440r14500q22600p42660o72846o18035n74621
58143H831276n33255m92662m57278m24956l89800l53736l23089k96745k68911
58134E290844k40584k17462j99568j83167j69990j64236j63028j59521j53244
$$ plain form
58188 170548248 201339074 238373193 282185974 331598418 382242953 426422851 455426987
58181 455426987 463320775 449592248 418827056 378053809 333936736 291334432 253149234
58174 253149234 220645110 193766815 171509781 152448646 135313021 119374049 104487479
58167 104487479 90846141 78668887 68037486 58904531 51151963 44619955 39126782
58160 39126782 34502099 30605055 27312937 24512799 22113367 20050557 18272576 16729875
58152 16729875 15383213 14206978 13176538 12262038 11439438 10696778 10023932 9405897 8831276
58143 8831276 8298021 7805359 7348081 6923125 6533325 6179589 5856500 5559755 5290844
58134 5290844 5050260 4832798 4633230 4450063 4280073 4115837 3952809 3793288 3640044
58125C640044j48329j44091j36469j26552j18871j13085j05554r7113r1429q7526
58115B471025q1631p4484o9519o5921o0729n5602n4132n4530n2323m8333m6701
58104A807120m6960m5346m2397m1797m2980m2018l8941l7324l7330l5777l2464
58093A363786l0169k8940k6445k3277k2059k1896j9554j5545j3300j2963j1737
58082A137901r875j0552j3963j6982j8630k0669k2977k3440k2361k2113k2507
58071I33832k1216j8599j7324j7465j6583j4485j3196j2556j0520p682o710p301
58059G70195o444l897k717l986n501o112p123q743r276q451p906p871p006n665
58045F79497n679o712o500m998m544n709o574o461o724p566p580o780o684p156
$$ plain form
58125 3640044 3491715 3347624 3211155 3084603 2965732 2852647 2747093 2649980 2558551 2471025
58115 2471025 2389394 2314910 2245391 2179470 2118741 2063139 2009007 1954477 1902154 1853821 1807120
58104 1807120 1760160 1714814 1672417 1630620 1587640 1545622 1506681 1469357 1432027 1396250 1363786
58093 1363786 1333617 1304677 1278232 1254955 1232896 1211000 1191446 1175901 1162601 1149638 1137901
58082 1137901 1128026 1117474 1103511 1086529 1067899 1047230 1024253 1000813 978452 956339 933832
58071 933832 912616 894017 876693 859228 842645 828160 814964 802408 791888 784206 777496 770195
58059 770195 763751 759854 757137 753151 747650 741538 734415 725672 716396 707945 700039 692168 685162 679497
58045 679497 673818 667106 660606 655608 651064 645355 638781 632320 625596 618030 610450 603670 596986 589830
58031E89830o588n397n743p563q468p876p654q279q014o573n911o603o799n656
58017D92706m547m078l051j310n55j363k177k064j819j701q23N92J099P86J343
58002D73038K916L709L274L282M342M944M443M221M916N230M432L535L002J773
57988E27057m69k445l543m654n960o336n693n537o355o806o348o179o691o451
57974D53590m858l506l590m006l336j946r61o97j021j783k252j617n70p18k039
57959D20690k695j747k05R44J812K342K013J266J275J905J818Q59L32O93J171
57944D32473J867L683N886O470N574N889Q635J1707J2948J2927J3203J4019J4971
57931E50252J6037J6780J6209J4380J2418J0405P217L058k48k259m663q127j0934
$$ plain form
58031 589830 583242 577845 572102 564539 556071 548195 540541 532262 524248 517675 511764 505161 498362 492706
58017 492706 488159 484081 481030 479720 479165 477802 475625 473561 471742 470041 469218 469810 470909 471695 473038
58002 473038 475954 479663 482937 486219 490561 495505 499948 504169 509085 514315 518747 522282 525284 527057
57988 527057 526588 524143 520600 515946 509986 503650 497957 492420 486065 479259 472911 466732 460041 453590
57974 453590 448732 445226 441636 437630 434294 432348 431387 430690 429669 427886 425634 424017 423447 422729 420690
57959 420690 417995 416248 416043 416987 418799 421141 423154 424420 425695 427600 429418 430277 430609 431302 432473
57944 432473 434340 438023 443909 450379 455953 461842 470477 482184 495132 508059 521262 535281 550252
57931 550252 566289 583069 599278 613658 626076 636481 643698 646756 646508 644249 639586 631459 620525
57918F20525j2078j3035j4872j6073j5188j3447j2656j2391j1321r754q757q074
57906D72879o824n249m125l443l064l526m830n620m994l897l353k695j036P43
57892D20966J271R02R92J806K708L671N066O499P238P356P323P016O149N061M088
57877D88112K819R00j136k696m083n711p153p825p886p670p047o120n645n870
57863D22989n876m861l298j973q73J90Q46J009J466K642L696L847L665L990M424
57848D31883M152L456L224L343K800J086j267l355m511m602m253m264m600m477
57834D18615l733l183l263l322k754j831r13J56J268J790J681J897K928L983M247
57819D17566L968L596K983K145J782K173K569K452K403K941L543L631L477L250
$$ plain form
57918 620525 608447 595412 580540 564467 549279 535832 523176 510785 499464 489710 480953 472879
57906 472879 466055 460806 456681 453238 450174 446648 441818 436198 431204 427307 423954 421259 420223 420966
57892 420966 422237 423139 424131 425937 428645 432316 437382 443881 451119 458475 465798 472814 478963 484024 488112
57877 488112 490931 491831 490695 487999 483916 478205 471052 463227 455341 447671 440624 434504 428859 422989
57863 422989 417113 412252 408954 406981 406108 406298 407144 408153 409619 412261 415957 419804 423469 427459 431883
57848 431883 436035 439491 442715 446058 448858 449944 448677 445322 440811 436209 431956 427692 423092 418615
57834 418615 414882 411699 408436 405114 402360 400529 399616 399772 401040 402830 404511 406408 409336 413319 417566
57819 417566 421534 425130 428113 430258 432040 434213 436782 439234 441637 444578 448121 451752 455229 458479
57805D58479K237o7k965n498p453q695q671p459o232n704n156l873k496j891j892
57790C92664k100k812m002m507l474j729m73L65J321K037K046J977K538L182L192
57775C90225L246M345N817O105N161M483M867N518N331M066K228N90k91p33j706
57760D39252l462m981n396n109m779m229l232k461k441k494j905j293j505j997
57746C93968j675p65l44n76p95r35j406j936j868j423j387j805k159k556l496
57731C70842m700n325n187m719l938k593j157n13p13r78q49n69m50o53j308k138
57715C35052k407j965j729k344l070k995k552k682l152l084k602k540k919l100
57701B97911l099l376l622l185k413k253k635k643k096j564r85K03J593J993J247
$$ plain form
57805 458479 460716 460649 457684 452186 444733 436038 427367 419908 413676 407972 402816 398943 396447 394556 392664
57790 392664 390564 387752 383750 379243 375769 374040 373567 373932 375253 377290 379336 381313 383851 387033 390225
57775 390225 393471 397816 403633 409738 414899 419382 424249 429767 435098 439164 441392 441982 441691 440958 439252
57760 439252 435790 430809 425413 420304 415525 411296 408064 405603 403162 400668 398763 397470 395965 393968
57746 393968 392293 391528 391184 390608 389813 388878 387472 385536 383668 382245 380858 379053 376894 374338 370842
57731 370842 366142 360817 355630 350911 346973 344380 343223 342710 341997 341019 340170 339601 339151 338498 337190 335052
57715 335052 332645 330680 328951 326607 323537 320542 317990 315308 312156 309072 306470 303930 301011 297911
57701 297911 294812 291436 287814 284629 282216 279963 277328 274685 272589 271025 270040 270243 271836 273829 275076
57686B75076M97L99M17J88K95J267K800M446O170P988R878J2169J5236J8768K2250
57671C77844K6115L1364L8090M5565N3958O4676P8438R3475J05577J08956R7745
57660A121803O9125K6738j9641n9136q5237r7300r8341r2236q2157p0334n8462
57649E54822m7882l9160l1877k5451k0044j6090j3300j0904q730p257o624o343
57637C21160o007n589n050m333l691l389l142k448j364l30N49J326J585Q20o42
57622B89455j949k743l243l468l257k843k573k265j641j169j506k336k742k519
57608B55201k105j508m20P54J239J184J446K080K279J838J422J193M78q30j754
57593B62497j572p82l45p32j929l474m308l614k043j244j889l060l659l467k693
$$ plain form
57686 275076 275573 275972 276389 276577 276872 278139 280939 285385 291555 299543 309421 321590 336826 355594 377844
57671 377844 403959 435323 473413 518978 572936 637612 716050 809525 915102 1024058 1121803
57660 1121803 1190928 1217666 1198025 1138889 1053652 956352 858011 765775 683618 613284 554822
57649 554822 506940 467780 435903 410452 390408 374318 361018 350114 341384 334127 327503 321160
57637 321160 315153 309564 304514 300181 296490 293101 289959 287511 286147 285817 286366 287692 289277 290097 289455
57622 289455 287506 284763 281520 278052 274795 271952 269379 267114 265473 264304 262798 260462 257720 255201
57608 255201 253096 251588 251168 251922 253161 254345 255791 257871 260150 261988 263410 264603 265081 264251 262497
57593 262497 260925 260143 259798 259066 257137 253663 249355 245741 243698 242454 240565 237505 233846 230379 227686
57578B27686j591p98j006j899k384k092j726j763j916k123k846l918m254l346
57564A96024k053j392j387j573j677j371l48Q80J242O24J51M28O68K33j31M78
57548A90796J603K156J948J591J465J614K086K654K677J924J049P05P57Q31Q97
57533B14753P35l19k291m004m499m340m649n429n834n569m964m071k774j550j068
57518A64127j087n83Q83K731M218N102N456N442N415N631N837N562M870M309M131
57503B22044L994L515K742J995J452J016L94o47j946k922l076k461j546p63k56
57488B23535NJ09Q9j04m98r39j163j041o33r8L25L88J40o9j70o68j871l033k991
57469B11313j581J02R28P00r7q99j352j427j330j014j1J699L037K826J355J1m74
$$ plain form
57578 227686 226095 225297 224291 222392 220008 217916 216190 214427 212511 210388 207542 203624 199370 196024
57564 196024 193971 192579 191192 189619 187942 186571 186223 187103 188345 188969 189120 189548 190216 190449 190318 190796
57548 190796 192399 194555 196503 198094 199559 201173 203259 205913 208590 210514 211563 212268 213025 213856 214753
57533 214753 215488 215169 212878 208874 204375 200035 195386 189957 184123 178554 173590 169519 166745 165195 164127
57518 164127 163040 162457 163340 166071 170289 175391 180847 186289 191704 197335 203172 208734 213604 217913 222044
57503 222044 226038 229553 232295 234290 235742 236758 237152 236505 234559 231637 228561 226100 224554 223791 223535
57488 223535 223540 223649 223738 223634 223136 222197 221034 219993 219360 219262 219587 219975 220115 220046 219876 219208 217337 214304 211313
57469 211313 209732 209834 210762 211462 211365 210466 209114 207687 206357 205343 205332 207031 210068 212894 214249 214260 213786
57452B13786n21n43m00j75l52q88j066o43k17j12J12O40R18P40P85J421J864J313
57434B16662J68o58r32r07o03k4M10M58N39J020J523J561J359J330J258O96k23
57417B23637j006j488j718j563j032n68n17o59p22q61j127j025k58N79O79L2p98
57400B11585j469j861j771j191n31n2M66J062J221P63L69N85R56R13Q12J143J419
57383B14419R49K76N87J954L257L768L721L357K479J157j8o24p72o57l36k7lj59
57365B33328j61k6o5k78l03L2N74J133J481J288N90J46O71J793K356J858J002
57348B45419P67J395K341K899K786K259J696J038k8j265j857j424n87p6J42L77
57332B55882M38J6o43j095j344j536j474j086q04p79l40R03J997J796O80k5L5
$$ plain form
57452 213786 213265 212722 212322 212147 211795 210907 209841 209198 208981 208869 208981 209621 210539 211279 212064 213485 215349 216662
57434 216662 216830 216172 215240 214333 213730 213706 214116 214574 215113 216133 217656 219217 220576 221906 223164 223860 223637
57417 223637 222631 221143 219425 217862 216830 216262 215745 215086 214364 213503 212376 211351 211093 211672 212351 212383 211585
57400 211585 210116 208255 206484 205293 204762 204710 205176 206238 207459 208222 208591 209176 210132 211045 211857 213000 214419
57383 214419 215368 215644 216231 218185 221442 225210 228931 232288 234767 235924 235906 235282 234510 233853 233517 233490 233487 233328
57365 233328 233167 233141 233076 232798 232495 232527 233101 234234 235715 237003 237593 237739 238410 240203 242559 244417 245419
57348 245419 246186 247581 249922 252821 255607 257866 259562 260600 260572 259307 257450 256026 255439 255363 255505 255882
57332 255882 256320 256336 255693 254598 253254 251718 250244 249158 248354 247575 247235 248138 250135 251931 252611 252586 252621
57315B52621J40P5L42Q29O46l70j220j232q75o99m32K66R84J158R24Q27J132J766
57297B56882K476K802K390J529Q98O49L15k45n27k53J58L23M30O49O95M16K32
57280B69819N21J053J498J910K292K220J589J291K357M591O720P834Q022P724
57266C19441P095O242N505N131M965M773M640M669M459L413J751O87J145K513
57252C76429L281K855K094J925K178K175J827J578J589J667J700J726J669J550
57238D04243J652K058K320K119J908K238K791K886K680K951L736M125L554K503
57224D41764J728J533J996L104M328M797M303L624L485L706L716L435L253L512
57210D88284M310N396O125N961N233M920N379N903N848N595N800O244O160N460
$$ plain form
57315 252621 252761 252836 253178 254007 254653 254283 253063 251831 250956 250257 249825 250091 251075 252233 253157 253984 255116 256882
57297 256882 259358 262160 264550 266079 266977 267626 267941 267696 267169 266916 267074 267397 267827 268476 269171 269587 269819
57280 269819 270340 271393 272891 274801 277093 279313 280902 282193 284550 289141 295861 303695 311717 319441
57266 319441 326536 332778 338283 343414 348379 353152 357792 362461 366920 370333 372084 372771 373916 376429
57252 376429 379710 382565 384659 386584 388762 390937 392764 394342 395931 397598 399298 401024 402693 404243
57238 404243 405895 407953 410273 412392 414300 416538 419329 422215 424895 427846 431582 435707 439261 441764
57224 441764 443492 445025 447021 450125 454453 459250 463553 467177 470662 474368 478084 481519 484772 488284
57210 488284 492594 497990 504115 510076 515309 520229 525608 531511 537359 542954 548754 554998 561158 566618
57196E66618M906N060N688O292O749P195P613P773P575P228P107P388P960Q637
57182F63789R410J0330J1218J1745J1782J1535J1320J1374J1831J2601J3259J3370
57170H03564J2987J2634J2699J3120J3687J4308J4865J4945J4098J2346J0448
57159I49701R591J0708J3765J7680K1033K3071K4047K4710K5556K6472K7001K6916
57147A200251K6604K6739K7622K8977L0425L1873L3334L4729L6061L7495L9064
57136A553174M0568M2036M3857M6116M8209M9647N0890N2773N5294N7628N9292
57125B099484O0646O2197O4043O6228O9124P3188P8595Q5275R3073J01713J11019
57114B964585J21316J33462J48230J65767J85795K08218K33407K61987K94651
$$ plain form
57196 566618 571524 576584 582272 588564 595313 602508 610121 617894 625469 632697 639804 647192 655152 663789
57182 663789 673199 683529 694747 706492 718274 729809 741129 752503 764334 776935 790194 803564
57170 803564 816551 829185 841884 855004 868691 882999 897864 912809 926907 939253 949701
57159 949701 959292 970000 983765 1001445 1022478 1045549 1069596 1094306 1119862 1146334 1173335 1200251
57147 1200251 1226855 1253594 1281216 1310193 1340618 1372491 1405825 1440554 1476615 1514110 1553174
57136 1553174 1593742 1635778 1679635 1725751 1773960 1823607 1874497 1927270 1982564 2040192 2099484
57125 2099484 2160130 2222327 2286370 2352598 2421722 2494910 2573505 2658780 2751853 2853566 2964585
57114 2964585 3085901 3219363 3367593 3533360 3719155 3927373 4160780 4422767 4717418
57105D717418L32349L76677M29936M95000N75281O74863P98355R50680J137368
57096A0487927J364645J637644J957201K318392K712482L129680L559987L993248
57088C1161206M419729M828723N203992N520988N749419N854667N792472N508425
57080G4039621M959359M147288L129882J989728P92681m21079j612094k722698
57072H4302688l690180m473983n064915n471337n702614n765467n670467n438220
57064D3025505n099222m688009m236411l770718l312759k880277k484739k130329
57056A4423041j817221j545686j316371j127580r73901q47536p40528o46646n62673
57047D844899m88082m23011l66660l17843k76227k42006k14577j92257j73265
$$ plain form
57105 4717418 5049767 5426444 5856380 6351380 6926661 7601524 8399879 9350559 10487927
57096 10487927 11852572 13490216 15447417 17765809 20478291 23607971 27167958 31161206
57088 31161206 35580935 40409658 45613650 51134638 56884057 62738724 68531196 74039621
57080 74039621 78998980 83146268 86276150 88265878 89058559 88637480 87025386 84302688
57072 84302688 80612508 76138525 71073610 65602273 59899659 54134192 48463725 43025505
57064 43025505 37926283 33238274 29001863 25231145 21918386 19038109 16553370 14423041
57056 14423041 12605820 11060134 9743763 8616183 7642282 6794746 6054218 5407572 4844899
57047 4844899 4356817 3933806 3567146 3249303 2973076 2731070 2516493 2324236 2150971
57038B150971j56485j41403j27690j14891j02508r0529p9663p0567o2893n5547
57028A148795m7768l9362l0282k0739j1462k757O545J8235L2928M9813O6995Q0045
57016A250986Q1071O2999K6642j8028n8879q8825j06359j12434j09354j00942
57006H26877r0789q0272o9485n9325n1108m4834l9494l4661l0452k6475k2191
56995B77791j8007j4650j1876q936o028l976k730j342P92L600P008J0970J5090
56982B47706J8876K1818K2492J8686R827j346j0944j7334k1218k3102k2592j9982
56970B22887j6673j3638j0730p696m793k135M85L001N225P540J0558J4129J7670
56957B25830K1351K5696K9826L1180K7425J8200N227q410j9446k6048k8720k9021
$$ plain form
57038 2150971 1994486 1853083 1725393 1610502 1507994 1417465 1337802 1267235 1204342 1148795
57028 1148795 1101027 1061665 1031383 1010644 999182 996425 1002970 1021205 1054133 1103946 1170941 1250986
57016 1250986 1332057 1395056 1421698 1403670 1344791 1255966 1149607 1037173 927819 826877
57006 826877 736088 655816 586331 527006 475898 431064 391570 356909 326457 299982 277791
56995 277791 259784 245134 233258 224322 218294 214318 211588 210246 211038 214638 221646 232616 247706
56982 247706 266582 288400 310892 329578 339405 338059 327115 309781 288563 265461 242869 222887
56970 222887 206214 192576 181846 174150 169357 167222 167707 170708 175933 183473 194031 208160 225830
56957 225830 247181 272877 302703 333883 361308 379508 384735 376325 356879 330831 302111 273090
56945B73090k7668k4566k0223j5790j1758p794l828k74K956O527J0647J4965J9583
56932B15867K5171L1852L8664M3978M5573M0719K7951R288j0369k6567l7432m2884
56920C61811m3430m0341l5737l1317k7382k3455j9367j5388j1967r567q339p734
56908H7787o961n813m528l060j379j94k87j088j075K30J786K772L589M682N593
56893H2054N926O359P839J0343J3063J5456J7617J9948K2688K5307K6219K3714
56881B76533J7435Q646q43r521j6139j9909k0960j9961j7247j3029q277m284j133
56868A71311K339O743J1353J5435J9417K4174K9973L6697M4420N3012O1243O6375
56856E42492O4608N2815L1263M787j9736l7620m7823n1244m9249m3774l6942k9650
$$ plain form
56945 273090 245422 220856 200633 184843 173085 165291 161463 161189 164145 170672 181319 196284 215867
56932 215867 241038 272890 311554 355532 401105 441824 469775 479063 468694 442127 404695 361811
56920 361811 318381 278040 242303 210986 183604 160149 140782 125394 113427 103860 95521 87787
56908 87787 80826 75013 70485 67425 66046 65852 65565 64477 63402 63632 65418 68190 71779 76461 82054
56893 82054 87980 94339 102178 112521 125584 141040 158657 178605 201293 226600 252819 276533
56881 276533 293968 302614 301771 292250 276111 256202 235242 215281 198034 185005 176728 172444 171311
56868 171311 173650 180393 191746 207181 226598 250772 280745 317442 361862 414874 476117 542492
56856 542492 607100 659915 691178 695965 676229 638609 590786 539542 490293 446519 409577 379927
56844C79927k1569j2803m329L561J1696K0405K8886L6931M5864N6890O9811Q3924
56832F99194R8133J08602J08126R0582N6470J3241k9316o3437q5076r4051r3218
56821H09250q6310p6017o4097n2216m1462l1482k1427j1540k752N039J3062K2106
56809D62154L1998M2674N4581O7156P7270P9703O9678M6033J2874k1939n0773
56798H71409o9519p7834p7591p1714o3402n4849m6395l7519k8466k0324j3697
56787C10099q158k955K323P825J3639J9798K6335L3076L8864M1169L7118K5517
56775E44650Q116j0911k7060l7735m3002m4250m2530l8596l3846k9829k6677k3282
56763A95048j9322j5868j3515j1298q426n836m822n068n238m896m534m310l883
$$ plain form
56844 379927 358358 345555 341226 344787 356483 376888 405774 442705 488569 545459 615270 699194
56832 699194 797327 905929 1014055 1104637 1161107 1174348 1145032 1081595 996519 902468 809250
56821 809250 722940 646923 582826 530610 489148 457666 436239 424699 421947 426986 440048 462154
56809 462154 494152 536826 591407 658563 735833 815536 885214 931247 944121 922182 871409
56798 871409 801890 724056 646465 574751 511349 456500 410105 372586 344120 323796 310099
56787 310099 301941 298986 301309 309134 322773 342571 368906 401982 440846 482015 519133 544650
56775 544650 552766 541855 514795 477060 434058 389808 347278 308682 274836 245007 218330 195048
56763 195048 175726 159858 146343 135045 126619 120783 115961 110893 105655 100759 96225 91915 88032
56750H8032l280k786k214j232j50M45N76N69K95l95r48p44j37N3k04l57l80o09
56732G6534p42j70Q22J186N95j27j56M72J176J457J226J013J600K967L985L772
56716I5610K890K467K620K639K283J881J466Q59L38K91M17K13k8K95R26J142R59
56699A17268Q94Q16K95j74K50J108J031r6q68n32L3j3j58M05J465K303K625K426
56681A29078J610M39l74m45j94j87n74j309k277l011l002k486k171k102j640o93
56665A10662M5L43Q25J693K141J712J261J702K614L007K886L111L985M943N494
56650A46424N728N832N708N219M476L723L087K488J813J233J158J715K377K417
56636A93398J645L95r95k224k829k509j686j194j447k311l569m925n742n611n092
$$ plain form
56750 88032 84752 81966 79752 78520 78370 78815 79391 79960 80255 79860 78912 78168 78031 78084 77880 77523 77143 76534
56732 76534 75792 75622 76444 77630 78225 78098 77942 78414 79590 81047 82273 83286 84886 87853 91838 95610
56716 95610 98500 100967 103587 106226 108509 110390 111856 112715 113053 113344 113761 113974 113946 114241 115167 116309 117268
56699 117268 118162 118978 119273 119099 119349 120457 121488 121392 120524 119992 120025 120012 119854 120259 121724 124027 126652 129078
56681 129078 130688 131127 130753 130308 130114 129927 129353 128044 125767 122756 119754 117268 115097 112995 111355 110662
56665 110662 110707 111050 111875 113568 115709 117421 118682 120384 122998 126005 128891 132002 135987 140930 146424
56650 146424 152152 157984 163692 168911 173387 177110 180197 182685 184498 185731 186889 188604 190981 193398
56636 193398 195043 195438 194443 192219 189390 186881 185195 184001 182554 180243 176674 171749 166007 160396 155304
56621A55304n109n595n594m769l871l506l288k644j714r51m34j9K31J87o2k70
56605A17896k26J64O61P22J72l35j22M59M91j36o41n83k59J88J015K030K418J827
56587A25741Q96L53K66M42Q70J393J589J359J080J002J009J058J305J666J949
56572A41978K369L190L867L546K483J976K651L764M528M990N333N414N525O548
56558A98162Q710J1064J2808J4178J5347J5453J3609J0265O793M215K821K413
56546C15838K278J616N17k0M17Q87L52r96k278l110l639m067m706n829o990p237
56530B83033o572o304p244q440q549p595o487n498m351l152k226j450p19n71j402
56515B12473k508k896k668k580k637k250j518j194j403j444r87o17r25j722k333
$$ plain form
56621 155304 150195 144600 139006 134237 130366 126860 123572 120928 119214 118263 117829 117810 118041 118228 118166 117896
56605 117896 117670 117834 118495 119217 119389 119054 118932 119391 119882 119746 119105 118522 118263 118451 119466 121496 123914 125741
56587 125741 126637 126990 127256 127698 128568 129961 131550 132909 133989 134991 136000 137058 138363 140029 141978
56572 141978 144347 147537 151404 154950 157433 159409 162060 165824 170352 175342 180675 186089 191614 198162
56558 198162 206872 217936 230744 244922 260269 275722 289331 299596 306389 310604 313425 315838
56546 315838 318116 319732 320249 320229 320646 321533 321885 320889 318611 315501 311862 307795 303089 297260 290270 283033
56530 283033 276461 270157 262913 254473 245924 238329 231842 226344 221993 218841 216615 215165 214446 213875 212473
56515 212473 209965 207069 204401 201821 199184 196934 195416 194222 192819 191375 190388 189771 188846 187124 184791
56500A84791k269j552p14m58r48j654k092k335k479k150j143n8L25N7k57l63m23
56483A66278m33k42N5K68M61O49N30m8o64r04r38r84o92L05J547K188K001J412
56465A70789Q52N83P89J206J090J66p82r09m39j62k30k44j45j83k65r9K61O43
56447A72921J212J996K404J992J290J080J179Q89L20K52Q58J519J857J984J818
56432A93571J052p5q53r68p40m70k22j92n17p67l10P14J427J295O21ok17J12Q23
56413A94278J424J507J173P09J66l31l05L85R63O02m17j070r32l90K29Q63J250
56396B00104J077N90L60M23L30j2k10k7M32J088J863K441K591K595K762K854K548
56379B21809K167K168K241J766R29M49L34j13j054j741j586q56j37L29O08Q35
$$ plain form
56500 184791 182522 180970 180256 179798 178850 177196 175104 172769 170290 168140 166997 166939 167264 167321 167064 166701 166278
56483 166278 165845 165603 165658 165926 166387 167036 167566 167518 166854 165950 165012 164028 163336 163641 165188 167376 169377 170789
56465 170789 171641 172224 173013 174219 175309 175475 174693 173784 173345 173183 172953 172709 172564 172381 172116 172017 172278 172921
56447 172921 174133 176129 178533 180525 181815 182895 184074 184963 185283 185535 186393 187912 189769 191753 193571
56432 193571 194623 194548 193695 192727 191987 191517 191295 191103 190586 189819 189509 190223 191650 192945 193566 193560 193343 193455 194278
56413 194278 195702 197209 198382 199091 199257 198926 198621 199006 199969 200571 200154 199084 198152 197762 197991 198854 200104
56396 200104 201181 201771 202131 202554 202884 202872 202662 202635 203067 204155 206018 208459 211050 213645 216407 219261 221809
56379 221809 223976 226144 228385 230151 231080 231529 231863 231750 230696 228955 227369 226513 226376 226705 227313 228148
56363B28148J103J327J339J288J528J873J587N81j38Q6M68M5o91n92L07R73J065
56346B40297J076J142R63Q00J190J792J708J010P08J151J633J735J854K209K421
56331B61689K364K420K728K981L106L200K883J716L47J5Q14J514J419J141J283
56316B89620J461J158N94K02L8J25O42J391J773J633J468J628J960K388L123M085
56300C13289M858N392N995O480O136M779L113J926J488J816K767L759M166M100
56286C70064M199M670N120N291N226M894M404M375N203O261O725O886P533Q434
56272D49285Q657Q226Q064Q410Q657Q751R351J0494J1587J2799J4960J7836K0039
56259E97116K1170K2540K5302K9111L3166L7337M1750M6439N1869N8664O6371
$$ plain form
56363 228148 229251 230578 231917 233205 234733 236606 238193 238774 238636 238722 239190 239235 238544 237952 238259 239232 240297
56346 240297 241373 242515 243478 244278 245468 247260 248968 249978 250686 251837 253470 255205 257059 259268 261689
56331 261689 264053 266473 269201 272182 275288 278488 281371 283087 283434 283449 284263 285777 287196 288337 289620
56316 289620 291081 292239 292833 293035 293073 293198 293840 295231 297004 298637 300105 301733 303693 306081 309204 313289
56300 313289 318147 323539 329534 336014 342150 346929 350042 351968 353456 355272 358039 361798 365964 370064
56286 370064 374263 378933 384053 389344 394570 399464 403868 408243 413446 419707 426432 433318 440851 449285
56272 449285 457942 466168 474232 482642 491299 500050 509401 519895 531482 544281 559241 577077 597116
56259 597116 618286 640826 666128 695239 728405 765742 807492 853931 905800 964464 1030835
56248A030835P3722Q0472Q7670R5674J03262J09337J14197J18323J21156J21858
56238B056506J20257J16259J09231R8731Q5077O8705M9844K9177P938j3032l3351
56227B695342n1980o7309p8838q7632r4683r9891j03071j04598j04519j02309
56217A800512r8192r3525q9238q4872p9797p4283o8818o3409n8138n3451m9377
56206I87412m5402m1372l7619l4030l0288k7009k5126k4011k2007j9056j6830
56195F64662j5763j4135j1070q313p658q345q435p396n919m459l309l011l416
56182E63433l391k409j412j156j007l31K31L3k49K53J246K054K669L067K738J854
56166E67623J649K647L746M033M149M904N923O715P652Q823R409R358J0072J2193
$$ plain form
56248 1030835 1104557 1185029 1272699 1368373 1471635 1580972 1695169 1813492 1934648 2056506
56238 2056506 2176763 2293022 2402253 2500984 2586061 2654766 2704610 2733787 2741725 2728693 2695342
56227 2695342 2643362 2576053 2497215 2409583 2314900 2215009 2111938 2007340 1902821 1800512
56217 1800512 1702320 1608795 1519557 1434685 1354888 1280605 1211787 1148378 1090240 1036789 987412
56206 987412 942010 900638 863019 828989 798701 771692 746566 722555 700548 681492 664662
56195 664662 648899 634764 623694 615381 607723 599378 590943 583547 577628 573169 569860 566849 563433
56182 563433 560042 557633 556221 555065 554058 553727 553958 553991 553742 553995 555241 557295 559964 563031 565769 567623
56166 567623 569272 571919 575665 579698 583847 588751 594674 601389 609041 617864 627273 636631 646703 658896
56152F58896J4288J5086J5502J6942J9097K1084K3311K6538L0231L3609L7239
56141I11823M2094M8105N5025O3581P4350Q6694J00112J15188J31561J46192J55247
56130A929972J56727J50173J35704J15328R3865P6214O4242N7254N3757N0955
56120B884191M4401L1080J2603o342k2015l2859l8554m0339m1712m6692n7314
56109B686448p3481r3859j15356j33164j43506j45971j42144j33190j20174j05138
56099A480465q9939p5077o1023m9240m0304l2729k5427j9609j6368j4173j1084
56088A045492p764n850m869l334j554p82o21J33J118J313J358K694N121P316Q880
56073A048651J0056J0532J0435J1148J3319J5429J6203J6639J7795J8519J7658
$$ plain form
56152 658896 673184 688270 703772 720714 739811 760895 784206 810744 840975 874584 911823
56141 911823 953917 1002022 1057047 1120628 1194978 1281672 1381784 1496972 1628533 1774725 1929972
56130 1929972 2086699 2236872 2372576 2487904 2581769 2657983 2722225 2779479 2833236 2884191
56120 2884191 2928592 2959672 2972275 2965933 2943918 2911059 2872505 2832166 2790454 2743762 2686448
56109 2686448 2612967 2519108 2403752 2270588 2127082 1981111 1838967 1705777 1585603 1480465
56099 1480465 1390526 1315449 1254426 1205186 1164882 1132153 1106726 1087117 1070749 1056576 1045492
56088 1045492 1037728 1031878 1027009 1023675 1022121 1021339 1020718 1020851 1021969 1023282 1024640 1027334 1032455 1039771 1048651
56073 1048651 1058707 1069239 1079674 1090822 1104141 1119570 1135773 1152412 1170207 1188726 1206384
56062A206384J6369J5819J4758J2056R412Q663Q530P190N867O531Q125Q644R007
56049A337355J1122J3899J4990J4887J5654J7070J7748J8375K0200K1954K2043
56038A525297K1951K3650K5675K5889K5975K8584L2076L2994L2038L2537L4535
56027A841201L5568L5893L7730M0525M2134M3469M6693N0037N0023M7750M7422
56016B318445M9548N1281N2526N5796O0656O4160O6338O9655P3699P6116P7954
56005C016174Q2204Q7982R2041R5048J00149J06483J10752J14133J20788J30407
55995D056161J39204J47168J57185J68115J76376J83341J93399K05914K17084
55986E643947K28400K44561K64368K82769L00723L23606L51187L79157M09262
$$ plain form
56062 1206384 1222753 1238572 1253330 1265386 1274798 1283461 1291991 1299181 1305048 1311579 1319704 1328348 1337355
56049 1337355 1348477 1362376 1377366 1392253 1407907 1424977 1442725 1461100 1481300 1503254 1525297
56038 1525297 1547248 1570898 1596573 1622462 1648437 1677021 1709097 1742091 1774129 1806666 1841201
56027 1841201 1876769 1912662 1950392 1990917 2033051 2076520 2123213 2173250 2223273 2271023 2318445
56016 2318445 2367993 2419274 2471800 2527596 2588252 2652412 2718750 2788405 2862104 2938220 3016174
56005 3016174 3098378 3186360 3278401 3373449 3473598 3580081 3690833 3804966 3925754 4056161
55995 4056161 4195365 4342533 4499718 4667833 4844209 5027550 5220949 5426863 5643947
55986 5643947 5872347 6116908 6381276 6664045 6964768 7288374 7639561 8018718 8427980
55977H427980M47388M92816N40283N91331O52238P22443P97283Q80435R80727
55968A4532924J098777J230846J383689J570885J797593K065579K390502K797513
55960B8868308L304947L932085M716335N698353O894626Q307847R956057J1869757
55952H3548315J4086038J6691564J9856512K3784023K8646350L4548596M1265830
55945B62427228M7564354N0695113M7163982L4925375J5375282o836722k6271071
55938D25043541l9412836m5639237m6333446m3476832l8789600l3488511k8305606
55931A49597473k3594408j9487272j6017948j3157115j0824271q929123p401562
55924E0185774o178255n190111m381018l720083l182998k738524k362729k048578
$$ plain form
55977 8427980 8875368 9368184 9908467 10499798 11152036 11874479 12671762 13552197 14532924
55968 14532924 15631701 16862547 18246236 19817121 21614714 23680293 26070795 28868308
55960 28868308 32173255 36105340 40821675 46520028 53414654 61722501 71678558 83548315
55952 83548315 97634353 114325917 134182429 157966452 186612802 221161398 262427228
55945 262427228 309991582 360686695 407850677 442776052 458151334 451314612 425043541
55938 425043541 385630705 339991468 293658022 250181190 211391590 177903079 149597473
55931 149597473 126003065 106515793 90497845 77340730 66516459 57587336 50185774
55924 50185774 44007519 38817408 34436390 30716307 27533309 24794785 22432056 20383478
55916B0383478j790498j573412j384800j223525j088827r72804q70203p83492
55908A0695917p12100o47838n86490n33023m90102m51835m13966l80148l52917
55899F127498l27946l02291k79479k61511k44055k24358k06150j92275j79725
55890C909708j66171j54288j45639j37037j26804j18102j12429j06266r7673q9919
55880B655380q4963p9506p1145o2593n6281n0456m4224m0902m2643m6712n0463
55869B025492n5090o1162o5428o5652o4013o2445n9083n2697m6171m2077l8925
55858A412749l5069l2342l2324l2828l1559k9845k9427k8938k6773k4430k3758
55847A085456k3779k3125k2923k4303k5659k5148k3559k2280k0837j8754j7364
$$ plain form
55916 20383478 18592980 17019568 15634768 14411243 13322416 12349612 11479409 10695917
55908 10695917 9983817 9335979 8749489 8216466 7726364 7274529 6860563 6480415 6127498
55899 6127498 5799552 5497261 5217782 4956271 4712216 4487858 4281708 4089433 3909708
55890 3909708 3743537 3589249 3443610 3306573 3179769 3061667 2949238 2842972 2745299 2655380
55880 2655380 2570417 2490911 2419766 2357173 2300892 2250436 2206212 2165310 2122667 2075955 2025492
55869 2025492 1970402 1909240 1843812 1778160 1714147 1651702 1592619 1539922 1493751 1451674 1412749
55858 1412749 1377680 1345338 1313014 1280186 1248627 1218782 1189355 1160417 1133644 1109214 1085456
55847 1085456 1061677 1038552 1015629 991326 965667 940519 916960 894680 873843 855089 837725
55836H37725j7433j7368j5978j4646j4688j4928j3968j2501j1422r951p630n822
55824F81390n395n184m505m775o801q904r561r545r668q924o732m609l625k583
55810E90579n29J219J545J663K922M707O337Q593J1442J2706J1168Q747P351N838
55796F74288K336k489o937j1020j5309j8766k0095j9870j9250j7981j5582j2952
55784E16373j0871q442m839j222Q60J406Q95r53l686n312m786l500k576o67L558
55769D76238Q737J2864J5988J8515J8543J3739M768n373j4364k0994k4108k3585
55757D80968k1269j8812j5677j1161o935n171n455n935o427p849r600j0177r760
55744C46740r720j0060r606q318p153o028m138j947p79o21l22J86j27j330k278
$$ plain form
55836 837725 820292 802924 786946 772300 757612 742684 728716 716215 704793 694842 687212 681390
55824 681390 675995 670811 666306 661531 654730 645826 636265 626720 617052 608128 601396 596787 593162 590579
55810 590579 590050 591269 592814 594477 597399 602106 608443 617036 628478 641184 652352 661099 668450 674288
55796 674288 676624 674135 667198 656178 640869 622103 602008 582138 562888 544907 529325 516373
55784 516373 505502 497060 492221 490999 491859 493265 494160 493207 489521 484209 479423 475923 473347 472680 476238
55769 476238 484975 497839 513827 532342 550885 564624 569392 564019 549655 528661 504553 480968
55757 480968 459699 440887 425210 414049 407114 401943 396488 390553 384126 376277 366677 356500 346740
55744 346740 337020 326960 317354 309036 301883 295855 291717 289770 288991 288370 288048 288234 288107 286777 284499
55729B84499k428k292k185k037k289l444m863n407n083m749m492l751k698k023
55715B36758j613q09K75J030J643K731M012M752N159N906O586O095M401K467N91
55700B79984j662m035n539o032o401p050p358o855n900m937l956k884j760n17
55686B15098Q11J809K219K528L350M490N318N652N675N407M946M677M549L719
55672B70248J805k44j344j698k033k215j726r27n11k15O61J841K378K178K061
55657B70259K434K955L293L377L032K234J454R91L44j054k981n019p252r540j0842
55642B53685j0394r001p989p513o919o195n764n390m595l748l484l446k877k039
55628A74331j735j836j569j035j010j467j647j447j474j837k118k379k913l200
$$ plain form
55729 284499 282071 279779 277594 275557 273268 269824 264961 259554 254471 249722 245230 241479 238781 236758
55715 236758 235145 234336 234611 235641 237284 240015 244027 248779 253938 259844 266430 272525 276926 279393 279984
55700 279984 278322 274287 268748 262716 256315 249265 241907 235052 229152 224215 220259 217375 215615 215098
55686 215098 215909 217718 219937 222465 225815 230305 235623 241275 246950 252357 257303 261980 266529 270248
55672 270248 272053 271809 270465 268767 266734 264519 262793 261866 261355 261140 261801 263642 266020 268198 270259
55657 270259 272693 275648 278941 282318 285350 287584 289038 290029 290373 289319 286338 281319 274067 264527 253685
55642 253685 243291 234290 226301 218788 211869 205674 199910 194520 189925 186177 182693 179247 176370 174331
55628 174331 172596 170760 169191 168156 167146 165679 164032 162585 161111 159274 157156 154777 151864 148664
55614A48664k414r66j72l66o28m49l13n07n80l44l25q30j454j794j888j817j597
55597A32220j506j704j635o80O97J352J002L75r0o47j293j485j018l32K59Q37
55581A26352J264J121M53j77m51m85l01J82O32O02L36N07J094J311P89J19R2Q63
55563A34303J966K614K206J066M33J032J929J623K7j491j891j389p02k10m5j58
55547A41313k29j6K75M30P74J615K480K614K035J387R43N52K33J25N3r3P5P31
55529A55297J221R59M19J92k66j737l539m191l500k656k367k367k594l381m287
55514A27203m212l062j977j630j461r69m85k92k1N20Q97Q93R38J227J257P56L39
55497A19921P09J739K682K853J996M98p05j000q67j201j978k395k150j736j507
$$ plain form
55614 148664 146250 145284 145112 144746 144118 143669 143356 142849 142269 141925 141600 140770 139316 137522 135634 133817 132220
55597 132220 130714 129010 127375 126695 127392 128744 129746 130121 130031 129384 128091 126606 125588 125256 125515 126352
55581 126352 127616 128737 129190 129013 128562 128077 127776 127958 128590 129192 129528 130035 131129 132440 133229 133348 133440 134303
55563 134303 136269 138883 141089 142155 142588 143620 145549 147172 147199 145708 143817 142428 141726 141516 141471 141313
55547 141313 141084 141068 141343 141773 142547 144162 146642 149256 151291 152678 153621 154173 154406 154531 154584 154491 154566 155297
55529 155297 156518 157477 157896 158088 157822 156085 152546 148355 144855 142199 139832 137465 134871 131490 127203
55514 127203 122991 119929 117952 116322 114861 113892 113407 113115 113094 113614 114511 115404 116342 117569 118826 119582 119921
55497 119921 120630 122369 125051 127904 129900 130398 129693 128693 127826 126625 124647 122252 120102 118366 116859
55482A16859j392j413j582j360k56J054J318M81l23n30o69r75p85J25Q74P31J20
55465A12277k39l10l86m51m45n20o31n00k28k37m36j82N72J027P36K52J73K88
55447A10760J50k11n80r57j222r47K5J177J786J516N04o94j270q95j79Q6k8M4
55429A09065K36Nn91r29r12r71j000l52R73K135K559K335J571L72n64m77K63N99
55411A14317M31O21J356J846J768J542J121Qj262j342k48L34m65j540j839j912
55395A14736k453k865k444j707j369j148o64m28p59q53j38N05J20o61o38M9L89
55378I9672K05P3J05L8M3L41M43j33q78j015p16n95m75J82J107J603J755K161
55360A03916K753K910K502J850R84j17q38n75J47K44l60p47m88j51k80p56j214
$$ plain form
55482 116859 115467 114054 112472 111112 110856 111910 113228 113709 113386 112856 112187 111212 110427 110552 111426 112157 112277
55465 112277 112038 111728 111342 110891 110446 109926 109295 108795 108567 108330 107894 107712 108284 109311 110047 110299 110472 110760
55447 110760 110910 110699 110119 109162 107940 106993 107018 108195 109981 111497 112001 111307 110037 109142 108963 109049 109021 109065
55429 109065 109301 109306 108715 107786 106874 105903 104903 104551 105524 107659 110218 112553 114124 114496 113932 113455 113718 114317
55411 114317 114748 115369 116725 118571 120339 121881 123002 123010 121748 120406 120158 120492 120027 118487 116648 114736
55395 114736 112283 109418 106974 105267 103898 102750 102086 101658 100899 100046 99908 100413 100533 99872 99234 99283 99672
55378 99672 99877 99950 100055 100093 100136 100477 100920 100787 99909 98894 98178 97583 97108 97290 98397 100000 101755 103916
55360 103916 106669 109579 112081 113931 114915 114798 113960 113385 113532 113776 113416 112669 112181 112030 111750 110994 109780
55343A09780j361r65j19M65J87n33p23j11O89J129J191R57M27k33p25r71j040
55326A08044r59q64r91j134o72L77R05K15o92l74Q95J469P21j80j35L91L66k29
55308A07153n42k04K41J82k47m38k27j51o56j280j236o41l94p25p14K03J166J157
55290A02647O49R37K108K836K233R32R0N1L41M79L49J2m36q32q78l57N00J023
55272A12684Q30M10N13J022J117N85J36J40rp85j567j473n65M46J105J193M66
55255A16248p59j318n02P98J143M89O4M80R67O06m79j394j426o11K83L52n18j432
55237A12991j509q97l76l12m65n54m62p4N66J112J309J306J220P25l87j602k092
55220A10499j585m62O65J186P68j56o38l41R5J70K22N27N15j82p60l36N92Q59
$$ plain form
55343 109780 108419 107454 107335 107800 107987 107454 106731 106620 107309 108438 109629 110586 111013 110780 110055 109084 108044
55326 108044 107085 106221 105230 104096 103424 103801 104706 104921 104229 103855 104750 106219 106940 106760 106625 107016 107382 107153
55308 107153 106611 106407 106648 106830 106583 106145 105918 105767 105111 103831 102595 101954 101560 100835 100121 100324 101490 102647
55290 102647 103296 104233 106341 109177 111410 112342 112432 112483 112824 113303 113652 113664 113228 112396 111518 111161 111661 112684
55272 112684 113514 113924 114437 115459 116576 117161 117297 117437 117428 116643 115076 113603 113038 113484 114589 115782 116248
55255 116248 115489 114171 113669 114467 115610 116099 116163 116643 117610 118216 117737 116343 114917 114306 114589 114941 114423 112991
55237 112991 111482 110585 110209 109897 109432 108878 108416 108342 108908 110020 111329 112635 113855 114580 114193 112591 110499
55220 110499 108914 108452 109117 110303 111071 110915 110277 109936 110031 110201 110423 110950 111465 111283 110523 110187 110779 111638
55202A11638M40L01P71J167R69L72k60o53m87K13P01L73k91m92m49q74j472j196
55184A10771pR38R53N48L09J76P8K77O47N76r6p41r11q26p24m61r7l6k80k14M87
55163A11367J376J924K074J863J230N03L56Q81J257Q56P8k98j56K5q6l84o20o40
55145A21606m91m53p60j249j447j133n41l3K26L08M40P40Q84L84n80j099o90l2
55127A16080M4k15q8L39M31J98K04M49M80M76J052J913J905P59l48l60L66Q00
55109A24485N02k50r11r80m33K8k17o30j15J218K021J657J025R29Q19n8j162j331
55091A26597l70Q44J474J278M46m92q65m99Q2L67M31M78M08K19K94P72J107P93
55073A33364J71j01m9k62r18j514j542j053m85j78k8L61J073J535J075r8j015
$$ plain form
55202 111638 112078 112379 113150 114317 115286 115658 115398 114745 114258 114471 115172 115545 115254 114762 114313 113439 111967 110771
55184 110771 110764 111702 112655 113203 113512 113688 113766 114043 114690 115266 115170 114429 113518 112692 111968 111507 111410 111374 111094 110880 111367
55163 111367 112743 114667 116741 118604 119834 120337 120693 121574 122831 123687 123765 123467 123311 123336 123250 122866 122246 121606
55145 121606 121115 120662 119902 118653 117206 116073 115532 115499 115725 116033 116473 117213 118097 118481 117901 116802 116112 116080
55127 116080 116124 115909 115821 116160 116591 116789 116993 117442 117922 118398 119450 121363 123268 124027 123679 123319 123685 124485
55109 124485 124987 124737 123826 122846 122413 122441 122224 121594 121479 122697 124718 126375 127400 128329 129148 129090 127928 126597
55091 126597 126227 127071 128545 129823 130269 129777 128912 128413 128495 128862 129293 129771 130179 130398 130692 131464 132571 133364
55073 133364 133535 133434 133385 133123 132205 130691 129149 128096 127611 127433 127405 127766 128839 130374 131449 131351 130336
55056A30336j127q96j032j523j750j239j52P87Q57J20m96k80L04L59k9rM61L88
55038A25079o54j694j703q47N2O15Q17N93J08j37q1l06q98q83M08K037K493J595
55020A26594M25k70o44q65o90q4N43R10J148J374J450J292R93O19K49K19Q77J952
55002A36092K560K086Q41k69o52m77l20m98q04q71o50l44m7K85N49N26K71J58
54984A38436M08Q59J174J150P45J86k8L63Q87Q28J82l14k02K13N02O18N75K47
54966A46829k75n58m33j60J11N65J126J259P67K38K61O85J048J231J275J074P01
54949A55744N49O63M03o09j682j854j138l23J36L06J54m48j108j087j93R86J851
54932A52350K353K684K898L050L341L926M703N449O095O768P557Q285Q616Q451
$$ plain form
55056 130336 129209 128313 127281 125758 124008 122769 122617 123404 124261 124381 123885 123605 123909 124268 124239 124230 124691 125079
55038 125079 124425 122731 121028 120181 120233 120848 121665 122258 122366 122229 122148 121842 120944 120061 120469 122506 124999 126594
55020 126594 127019 126749 126105 125240 124550 124466 125009 125919 127067 128441 129891 131183 132176 132795 133044 133263 134140 136092
55002 136092 138652 140738 141579 141310 140658 140181 139861 139363 138559 137688 137038 136694 136647 136932 137481 138007 138278 138436
54984 138436 138844 139703 140877 142027 142772 142958 142930 143293 144180 145008 145190 144876 144674 144887 145389 146007 146582 146829
54966 146829 146554 145996 145563 145403 145514 146079 147205 148464 149231 149469 149730 150415 151463 152694 153969 155043 155744
54949 155744 156293 156956 157359 156750 155068 153214 152076 151753 151889 152195 152349 151901 150793 149706 149513 150499 152350
54932 152350 154703 157387 160285 163335 166676 170602 175305 180754 186849 193617 201174 209459 218075 226526
54918B26526Q073P594O458L985M35k983n339o765p795q523q755q563q203p651
54904A88494o748n552m321l260k527k191j979j390m31J03m48j588k046j119P01
54889A55698K358L189L221K883K607K642L187M414O191P959R165R762R990R741
54875B33007Q617O597M142J625r31l394n405o780p683q214q266p920p505p142
54861A90748o663o019n357m646l735k797k184j855j517j276j427j656j328n89
54847A49699j89k09m3K09l54j746k607k150j271r12n26O93K043K135Q65n83j355
54830A43699j491j303j053j037j132o97M52J470J562J071O69J76p85j668j612
54815A38321p92k3M90R82J204Q82O48J240K052J852Q03K96P84J200Q14K86L88
$$ plain form
54918 226526 234599 242193 248651 252636 253071 250088 244749 237984 230189 221666 212911 204348 196145 188494
54904 188494 181746 176194 171873 168613 166086 163895 161916 160526 160095 160198 159750 158162 156116 154997 155698
54889 155698 158056 161245 164466 167349 169956 172598 175785 180199 186390 194349 203514 213276 223266 233007
54875 233007 241624 248221 252363 253988 253057 249663 244258 237478 229795 221581 213315 205395 197890 190748
54861 190748 184085 178066 172709 168063 164328 161531 159347 157492 155975 154699 153272 151616 150288 149699
54847 149699 149510 149301 149258 149467 149113 147367 144760 142610 141339 140427 139901 140594 142637 144772 145637 145054 143699
54830 143699 142208 140905 139852 138815 137683 136986 137438 138908 140470 141541 142210 142386 141601 139933 138321
54815 138321 137529 137506 137996 138978 140182 141064 141712 142952 145004 146856 147659 147955 148739 149939 150753 151039 151427
54798A51427Q37R99Q30N36L6o55j095r82o26m70m91l61N7O07J002J085J043J277
54780A55056J807K132K004J866K083K265K095K261L550N420O613O989P585Q874
54766B10600J0113J0643J0613J0153Q779O202K900m74l658o408q232q867q573
54753B33791p747o703n919n833o199o224n510m384l291k448k046k094k108j570
54739A71715p72m04l68J05J157K030K284K289K305K080J713J964L115M431N267
54724A98911N968P034Q072Q298P566O310M779K857M37k373n177p306q247q221
54710B18908p900p562o953o045n133m163k782j252n16r10j641j872j665j445j314
54695A67755j300j605k091k153j602j021q35p33m83n39j140j540r80L7L46k92
$$ plain form
54798 151427 152264 153263 154093 154629 154665 154010 152915 151933 151307 150837 150346 149985 150042 150649 151651 152736 153779 155056
54780 155056 156863 158995 160999 162865 164948 167213 169308 171569 175119 180539 187152 194141 201726 210600
54766 210600 220713 231356 241969 252122 260901 267103 270003 269529 265871 259463 251231 242364 233791
54753 233791 226044 219341 213422 207589 201390 195166 189656 185272 181981 179533 177487 175393 173285 171715
54739 171715 170943 170539 170171 170276 171433 173463 175747 178036 180341 182421 184134 186098 189213 193644 198911
54724 198911 204879 211913 219985 228283 235849 242159 246938 249795 250232 247859 242682 235376 227129 218908
54710 218908 211008 203446 196493 190448 185315 181152 178370 177118 176602 175692 174051 172179 170514 169069 167755
54695 167755 166455 164850 162759 160606 159004 157983 157148 156415 155932 155393 154253 152713 151733 151770 152116 151824
54679A51824r08n81N61J515J361J98p66n04M74O86k70j209j184p06n23k56O61
54662A50373J573J341N1j151j646j692j473q88k18N6Q0M19R61R37J84n52p13n67
54644A47075m47r7P43J658J974J552Q01R4m67q19p77k30N81J052P20j49o64k04
54626A52396Q87J715J735J135M36J4r4j06k08l09k84l93j023j934k258j600o14
54609A49495j02k5J21L68L65J02o3j2J22L98R57J536J626J172N86R7l97q51r77
54590A54518p21l79r3K87P30P92K02o32j049q59m45k05j28l9j1l30r45j199m66
54571A49028R49J906J634N56k32r9P05J511J809J524R78N31K12j64n08m90j64
54554A59686j12o46j236j152l66N42J098J133N98l17j035j047m25M61J486K586
$$ plain form
54679 151824 150916 150335 150896 152411 153772 153970 153204 152700 153174 153860 153590 152381 151197 150491 149968 149712 150373
54662 150373 151946 153287 153338 152187 150541 148849 147376 146488 146270 146326 146406 146825 147786 148723 148907 148355 147642 147075
54644 147075 146628 146531 147274 148932 150906 152458 153259 153353 152886 152067 151290 151060 151641 152693 153413 153264 152600 152396
54626 152396 153283 154998 156733 157868 158304 158318 158224 158118 157910 157601 157317 156924 155901 153967 151709 150109 149495
54609 149495 149393 149368 149489 149857 150222 150324 150261 150249 150371 150769 151726 153262 154888 156060 156646 156743 156346 155495 154518
54590 154518 153797 153418 153325 153612 154342 155134 155336 154704 153655 152796 152351 152146 152018 151979 151968 151638 150693 149494 149028
54571 149028 149977 151883 153517 154073 153841 153742 154447 155958 157767 159291 160269 160800 161012 160848 160340 159850 159686
54554 159686 159574 158928 157692 156540 156174 156716 157814 158947 159545 159228 158193 157146 156721 157182 158668 161254
54538A61254L270K936J723M81j49k25n0L02Q60J454J707J274J87q69j007k02L85
54521A73331k97j702k231j225K63Q48L36m48p50m15K53O61K69q07j663j513n54
54504A64356L47O57N14K17j47n31q37j119j484j689j303m15J98R1j46K44R36R70
54486A60859L36J67J012J908J774R47M55L90Q2m61n27o4J01k83l25O14J840K311
54468A71136K002J575J298R76O12M19L26Q5k59m52m65m69n36o01n82l08K86P78
54450A75821N29l08o48J45J329J730J175K28r65k549l929l931k263j00J120J020
54434A68404K91j58J01Q14J343J301Q65M01K3k25j23L15N98M52M47J191K164K245
54416A80449J297L68J77L08J65j54l84p27j305j569r46K14R87J028Q10P77P69
$$ plain form
54538 161254 164524 167460 169183 169664 169515 169290 169240 169542 170402 171856 173563 174837 175024 174155 173148 172946 173331
54521 173331 173034 171332 169101 167876 168139 168987 169323 168875 168125 167710 167963 168624 168893 168086 166423 164910 164356
54504 164356 164703 165360 165874 166091 165944 165413 164576 163457 161973 160284 158981 158566 158764 158855 158709 158953 159889 160859
54486 160859 161195 161362 162374 164282 166056 167003 167458 167848 167930 167469 166942 166878 166979 166696 166371 166985 168825 171136
54468 171136 173138 174713 176011 176987 177599 178018 178344 178429 178170 177718 177253 176784 176248 175647 175065 174757 175043 175821
54450 175821 176350 176042 175394 175539 176868 178598 179773 180001 179036 176487 172558 168627 166364 166264 167384 168404
54434 168404 168695 168537 168638 169452 170795 172096 172961 173362 173385 173160 173037 173352 173950 174402 174849 176040 178204 180449
54416 180449 181746 182114 182291 182599 182764 182610 182226 181499 180194 178625 177679 177893 178880 179908 180718 181495 182264
54399A82264M23k08o63n71m2M65O19N19N33Q34J196J220P13n3m60p1Q00J246P54
54380A89518j36n37l91m12q99j236q73k17k5k54j47N40J065P30n9k78L64J064
54362A87817J042N13L14Q06J575K028J944J474R59P44R33J256J366J214R15M71
54346B05371pq6M79J227J538J573J902K345K142J311P54P00J91j274k717l076
54330B12373k680k354j954r99j51n65k026l074k917k147j455q19j66J79R6j2R3
54313A91422J28j01l52m16m37m94l83m9J98Q4l05p04q21m57K23O01L10k12m14
54294A87821n40j065j590j269k84K62K9j23L44Q13P41O40J131J825J920J359O44
54277A92658l9p88j439j635j327p41k13j37o65j142n48J045K186J853Q53O22J189
$$ plain form
54399 182264 182687 182479 181816 181245 181203 181668 182287 182806 183339 184173 185369 186589 187302 187249 186789 186718 187518 188764 189518
54380 189518 189382 188845 188454 188042 187143 185907 185034 184817 184792 184538 184391 184931 185996 186726 186667 186389 186753 187817
54362 187817 188859 189372 189686 190492 192067 194095 196039 197513 198472 199216 200149 201405 202771 203985 204900 205371
54346 205371 205364 205278 205757 206984 208522 210095 211997 214342 216484 217795 218549 219249 219440 218166 215449 212373
54330 212373 209693 207339 205385 204386 204235 203670 201644 198570 195653 193506 192051 191232 191066 191245 191341 191329 191422
54313 191422 191550 191449 191097 190681 190244 189750 189367 189318 189516 189600 189295 188591 187770 187313 187536 188137 188447 188235 187821
54294 187821 187281 186216 184626 183357 183073 183335 183364 183241 183585 184398 185139 185779 186910 188735 190655 192014 192658
54277 192658 192619 191831 190392 188757 187430 186689 186476 186339 185674 184532 183984 185029 187215 189068 189921 190543 191732
54260A91732J396Q22L25N92J129J111N19l2j89j42j41j24J37O11R04O36r3p59
54242A98434j018j019j037j074r55o19j34L47N89M47J47J17L68M14n0p02j082
54225A93173j140j005o14L9N73O20L60K08K11J40Q2L66Q92J020K74j030k033k060
54207A90076j217k82Ll01m65k8O41R23P27M08K35K99O96J290J519R51K5l12K00
54188A95388Q73J040P71M14m4p07j228j093l82J93Q3n25j014r52l17N85J293J398
54170A95776Q59R5l83m39l03k47m14q75j536j969j732r59l24k29l64k60M9K48
54152A86993L00L71L96J79j83m13m49l78o7O30J341J430Q63L30L76P68R16N68
54134A93971m0m43k45N41J347J531J036L13l15q20j034o39K20Q44P73L16J35M73
$$ plain form
54260 191732 193128 193950 194275 194867 195996 197107 197626 197594 197405 197263 197122 196998 197135 197746 198650 199286 199193 198434
54242 198434 197416 196397 195360 194286 193331 192712 192578 192925 193514 193961 194108 194225 194593 195007 194957 194255 193173
54225 193173 192033 191028 190414 190453 191026 191646 192006 192214 192425 192565 192647 193013 193905 194925 195199 194169 192136 190076
54207 190076 188859 188577 188580 188279 187814 187786 188427 189350 190077 190485 190720 191019 191715 193005 194524 195475 195500 195188 195388
54188 195388 196261 197301 198072 198486 198442 197735 196507 195414 195032 195225 195308 194783 193769 192817 192500 193085 194378 195776
54170 195776 196635 196730 196347 195908 195605 195358 194944 194069 192533 190564 188832 187873 187549 187320 186956 186696 186745 186993
54152 186993 187293 187664 188060 188239 188056 187643 187194 186816 186749 187379 188720 190150 191013 191343 191719 192487 193403 193971
54134 193971 193931 193488 193243 193784 195131 196662 197698 198011 197696 196876 195842 195203 195423 196267 197040 197356 197491 197964
54116A97964J011J205P53m7l94J69J131J609J471J254J089N80j93m92j26R0l87
54099B06687r48q96o92j122j837j683m04R74J449J019K97k19k82J23P14J134J323
54082B05637J474J688J908K145K395K397J819P97l1j24M60J162J467J398J520
54067B26112K338L669M807N419N906O751P854Q860R823J1112J2839J4586J5587
54054C35663J4846J1565N908p30o621j0814j3176j3722j2562j0367q180o544n175
54041B80091l672k161j062m36J32J049K205L071L339L405L959N079O055O272N915
54026C13241N527N189M621L837L202K807K313J486O47K65L83N49L07l75j186j866
54010C40947k445l021l492l729l902m290m828n186n270n299n333n218m975m761
$$ plain form
54116 197964 198975 200180 200933 200886 200492 200661 201792 203401 204872 206126 207215 207795 207602 207110 206984 207074 206687
54099 206687 205739 204843 204151 203029 201192 199509 199105 200079 201528 202547 202844 202625 202343 202466 203180 204314 205637
54082 205637 207111 208799 210707 212852 215247 217644 219463 220260 220229 220105 220565 221727 223194 224592 226112
54067 226112 228450 232119 236926 242345 248251 255002 262856 271716 281539 292651 305490 320076 335663
54054 335663 350509 362074 367982 367252 360631 349817 336641 322919 310357 299990 291810 285266 280091
54041 280091 276419 274258 273196 272760 272892 273941 276146 279217 282556 285961 289920 294999 301054 307326 313241
54026 313241 318768 323957 328578 332415 335617 338424 340737 342223 342870 343135 343518 344067 344374 343999 342813 340947
54010 340947 338502 335481 331989 328260 324358 320068 315240 310054 304784 299485 294152 288934 283959 279198
53996B79198m356l297j828r50j177j812j973j786j896k308k399j902j100k67N07
53981B52654J029J147J094J199J393J439J516K003K828L598M217M839N239M957
53967B89152M000K806J482l02k496m374n334n503n335m987m382l603k875k293
53953B55956j722j038l70o0j98k96K72J348K070K030J923K498L495M190M575N100
53937B79773N639N651N344N561O401O859O255N176M619M768N073M972M209K931
53923C53231J851J838K918M121M557M324M043M050M437N322O595P779Q679R815
53909D23560J1623J3579J4769J5172J5600J6502J7513J8302J9084J9866J9761
53898F05331J7579J2933O367j337r478j7053k2658k5217k4867k2851k0599j8850
$$ plain form
53996 279198 274842 271545 269717 268767 267590 265778 263805 262019 260123 257815 255416 253514 252414 252147 252654
53981 252654 253683 254830 255924 257123 258516 259955 261471 263474 266302 269900 274117 278956 284195 289152
53967 289152 293152 295958 297440 297138 294642 290268 284934 279431 274096 269109 264727 261124 258249 255956
53953 255956 254234 253196 252826 252766 252568 252272 252544 253892 255962 257992 259915 262413 265908 270098 274673 279773
53937 279773 285412 291063 296407 301968 308369 315228 321483 326659 331278 336046 341119 346091 350300 353231
53923 353231 355082 356920 359838 363959 368516 372840 376883 380933 385370 390692 397287 405066 413745 423560
53909 423560 435183 448762 463531 478703 494303 510805 528318 546620 565704 585570 605331
53898 605331 622910 635843 642210 640873 631395 614342 591684 566467 541600 518749 498150 479300
53886D79300j7539j6281j4862j3444j2373j1720j1075r990q577p452o927o592
53874C42468n917n029m513m536m628m373l943l732l689l470l112l193m046n108
53860B83179n401m662l606k888k354j691j314j819k682k507q47R19J174r8j570
53845B53833k337k526k437j885p54M11P90J84p32j060n54J79L95K0l76m12k72
53828B42467k57k96j26K74P10R73R27O04L45M76Q15Q54N86N88J095J550J465J111
53810B54161R93J120J344J840K634L205L185L065L520M376M987N203N284N179
53796C00096M759M492M958N832O219N919N535N356M997M192L148K050R40J21n3
53781C58561Q5k35j110j828k011k157k812l827m747n377n718n740n455m933m218
$$ plain form
53886 479300 461761 445480 430618 417174 404801 393081 382006 372016 363439 355987 349060 342468
53874 342468 336551 331522 327009 322473 317845 313472 309529 305797 302108 298638 295526 292333 288287 283179
53860 283179 277778 273116 269510 266622 264268 262577 261263 259444 256762 254255 253408 254327 255501 255403 253833
53845 253833 251496 248970 246533 244648 243894 244305 245095 245279 244547 243487 242933 243112 243507 243527 243151 242739 242467
53828 242467 242210 241914 241788 242062 242772 243745 244672 245276 245621 246097 246912 247766 248352 248940 250035 251585 253050 254161
53810 254161 255154 256274 257618 259458 262092 265297 268482 271547 275067 279443 284430 289633 294917 300096
53796 300096 304855 309347 314305 320137 326356 332275 337810 343166 348163 352355 355503 357553 358493 358614 358561
53781 358561 358646 358411 357301 355473 353462 351305 348493 344666 339919 334542 328824 323084 317629 312696 308478
53766C08478l505l249l571l842l453k824k840l433l636l086k499k422k427j971
53752B65720j243p83p46r35j146j206j062r45j081j238j029n38n7N56J484K126
53736B57877J583M2j350j953k092k003j470p03m22o70n97J52Q94J162J428K037
53720B53915K430K105J471J105R36P24O27O78N86N00J049K159K787K525K354L037
53704B78988L837L757L038K418J860J174J024J991L318L845L714L860M321M309
53690C21454L723L253L129K850K155J321N68n6l23r7J97J54O9L49O70M95O5p9
53672C39897o1k51l53K7L81k4q22j117j042j399k045k054j390r23p41kJ234J609
53654C30924M82r46j304p48k46r2L2K00K32J63J56J88J95J91J70J56L93R69J396
$$ plain form
53766 308478 304973 301724 298153 294311 290858 288034 285194 281761 278125 275039 272540 270118 267691 265720
53752 265720 264477 263694 262948 262013 260867 259661 258599 257654 256573 255335 254306 253768 253711 254267 255751 257877
53736 257877 259460 259502 258152 256199 254107 252104 250634 249931 249509 248839 248242 248394 249288 250450 251878 253915
53720 253915 256345 258450 259921 261026 261962 262686 263313 263991 264577 265077 266126 268285 271072 273597 275951 278988
53704 278988 282825 286582 289620 292038 293898 295072 296096 298087 301405 305250 308964 312824 317145 321454
53690 321454 325177 328430 331559 334409 336564 337885 338453 338397 338074 337977 338174 338328 338397 338746 339416 339911 339976 339897
53672 339897 339836 339585 339232 339259 339640 339616 338794 337677 336635 335236 333191 331137 329747 328824 328083 328081 329315 330924
53654 330924 331406 330460 329156 328408 328162 328070 328102 328302 328534 328697 328853 329041 329236 329427 329597 329753 330146 331115 332511
53635C32511J205P70P97J108R62M55M13Q50P94N3k25O93J983K570K578K626K700
53618C52843K654K905L597L826K813J298O77J208K075K889L870M786M967M484
53604C94892M297M884N529N417M714M163M064M152M105L830L330K677K106J898
53590D50058K049K192J966J541J507K146K994L438L483L508L436K829J837J210
53576D84194J098O07r16k820m025m457m844n446n810n674n331n022m663m214l771
53561D28906l220k343j399r74j059r23j40P23R51P42Q41J404J818J663J274J124
53545D29388J143J004P74Q42J243J486J178O14M99J208K480L781M755N336N598
53530D61329N651N674N931O615P618Q503Q894Q898R001R494J0196J0856J1563
$$ plain form
53635 332511 333716 334486 335283 336391 337353 337808 338221 339071 339865 339918 339693 340386 342369 344939 347517 350143 352843
53618 352843 355497 358402 361999 365825 368638 369936 370613 371821 373896 376785 380655 385441 390408 394892
53604 394892 399189 404073 409602 415019 419733 423896 427960 432112 436217 440047 443377 446054 448160 450058
53590 450058 452107 454299 456265 457806 459313 461459 464453 467891 471374 474882 478318 481147 482984 484194
53576 484194 485292 485899 484983 482163 478138 473681 468837 463391 457581 451907 446576 441554 436891 432677 428906
53561 428906 425686 423343 421944 420970 419911 418988 418848 419571 420522 421264 422105 423509 425327 426990 428264 429388
53545 429388 430531 431535 432309 433151 434394 435880 437058 437672 438171 439379 441859 445640 450395 455731 461329
53530 461329 466980 472654 478585 485200 492818 501321 510215 519113 528114 537608 547804 558660 570223
53517E70223J2506J3467J3941J3821J3721J4427J6073J7978J9337K0036K0660
53506G46190K1702K2998K4092K4907K5644K6168K6127K5720K5680K6210K6532
53495A021970K5917K4635K3434K2596K2117K2226K2951K3523K3142K2202K1837
53484A276550K2308K2671K2167K1084K0059J9337J9021J9247J9744J9834J9326
53473A501348J8848J8914J9132J8777J7663J6027J3916J1248Q210N177K388q3
53461A651565k322m737p754j1068j3644j4904j5410j5934j6314j5977j5262j5396
53449A502843j7069j9709k2241k4021k4865k4711k3694k2323k1227k0736k0721
53438A261526k0783k0529j9785j8650j7302j5712j3674j1133q433o161m689l864
$$ plain form
53517 570223 582729 596196 610137 623958 637679 652106 668179 686157 705494 725530 746190
53506 746190 767892 790890 814982 839889 865533 891701 917828 943548 969228 995438 1021970
53495 1021970 1047887 1072522 1095956 1118552 1140669 1162895 1185846 1209369 1232511 1254713 1276550
53484 1276550 1298858 1321529 1343696 1364780 1384839 1404176 1423197 1442444 1462188 1482022 1501348
53473 1501348 1520196 1539110 1558242 1577019 1594682 1610709 1624625 1635873 1644083 1649260 1651648 1651565
53461 1651565 1649243 1644506 1636752 1625684 1612040 1597136 1581726 1565792 1549478 1533501 1518239 1502843
53449 1502843 1485774 1466065 1443824 1419803 1394938 1370227 1346533 1324210 1302983 1282247 1261526
53438 1261526 1240743 1220214 1200429 1181779 1164477 1148765 1135091 1123958 1115525 1109364 1104675 1100811
53426A100811l182k289j269l51N18J621L108M912P005R402J1851J3799J4940J5618
53412A176494J6542J8170K0351K2438K3675K3799K3388K3450K4551K6439K8527
53401A427824L0478L2214L3748L5261L7188L9878M3193M6577M9545N2037N4295
53390A882238N6459N8275N9288N9453N9397N9860O0873O1838O2315O2315O1813
53379B544124O0493N8264N5620N3125N0762M8167M5294M2454L9673L6465L2415
53368C066856K7798K3311J9217J4989R985M279j628p864j5332k4410l3940m2137
53356C041124m8240n2737n6157n8480n9762o0478o0901o0733n9775n8447n7164
53345B408250n5643n3306n0240m7319m5433m4859m5228m5903m6489m6957m7238
$$ plain form
53426 1100811 1097629 1095340 1094071 1093720 1094238 1095859 1098967 1103879 1110884 1120286 1132137 1145936 1160876 1176494
53412 1176494 1193036 1211206 1231557 1253995 1277670 1301469 1324857 1348307 1372858 1399297 1427824
53401 1427824 1458302 1490516 1524264 1559525 1596713 1636591 1679784 1726361 1775906 1827943 1882238
53390 1882238 1938697 1996972 2056260 2115713 2175110 2234970 2295843 2357681 2419996 2482311 2544124
53379 2544124 2604617 2662881 2718501 2771626 2822388 2870555 2915849 2958303 2997976 3034441 3066856
53368 3066856 3094654 3117965 3137182 3152171 3162156 3166435 3164807 3156943 3141611 3117201 3083261 3041124
53356 3041124 2992884 2940147 2883990 2825510 2765748 2705270 2644369 2583636 2523861 2465414 2408250
53345 2408250 2352607 2299301 2249061 2201742 2156309 2111450 2066222 2020319 1973830 1926873 1879635
53334A879635m6803m5103m2375l9465l6737l3785l0440k7324k4928k2759k0053
53323A509863j6964j4420j3045j2782j3348j4443j5578j6311j6656j6813j6602
53312A342901j5610j3931j2200j0841r655q345p001n848m794l530j991m73P26
53299A249408J735L012M812O833Q633J0279J2269J4705J7021J8783K0365K2390
53287A390245K4751K6728K7973K8913L0019L1082L1426L0655K8988K6998K5148
53276A702926K3643K2447K1342J9881J7553J4218J0367O722L538N57k455n370
53264A835369q023j0551j3240j6134j9009k1619k3916k6090k8291l0284l1560
53253A606652l2057l2470l3398l4414l4554l3683l2629l1911l1150k9909k8433
$$ plain form
53334 1879635 1832832 1787729 1745354 1705889 1669152 1635367 1604927 1577603 1552675 1529916 1509863
53323 1509863 1492899 1478479 1465434 1452652 1439304 1424861 1409283 1392972 1376316 1359503 1342901
53312 1342901 1327291 1313360 1301160 1290319 1280664 1272319 1265318 1259470 1254676 1251146 1249155 1248682 1249408
53299 1249408 1251143 1254155 1258967 1265800 1274433 1284712 1296981 1311686 1328707 1347490 1367855 1390245
53287 1390245 1414996 1441724 1469697 1498610 1528629 1559711 1591137 1621792 1650780 1677778 1702926
53276 1702926 1726569 1749016 1770358 1790239 1807792 1822010 1832377 1839099 1842637 1843194 1840739 1835369
53264 1835369 1827346 1816795 1803555 1787421 1768412 1746793 1722877 1696787 1668496 1638212 1606652
53253 1606652 1574595 1542125 1508727 1474313 1439759 1406076 1373447 1341536 1310386 1280477 1252044
53242A252044k7134k6045k5234k5092k5685k6371k6647k6796k7117k7097k6130
53231I62696k4630k3509k2816k1765k0030j8118j6454j4827j2955j0991r302q165
53219G59134p877q594r913j0981j1304j1204j1405j2353j3892j5374j6084j5857
53207F14296j5242j4827j4477j3608j2079j0498r562r379r471r259q573p808p514
53194D71999p734q002q093q379r114r721r346p952o388n449n279n550n796n600
53180C69596m886m026l408l002k576k122j705j175m76K1n3m57o58o26p99j357
53164C42291k015k462k577k368k105k305l048l547l012j716n82L2L92M20k51j289
53148C15858j670j075l74m26j072j660j923j895j519q37j21M51R27J164P89j20
$$ plain form
53242 1252044 1224910 1198865 1173631 1148539 1122854 1096483 1069836 1043040 1015923 988826 962696
53231 962696 938066 914557 891741 869976 849946 831828 815374 800547 787592 776601 767299 759134
53219 759134 751257 742663 732750 721769 710465 699261 687856 675503 661611 646237 630153 614296
53207 614296 599054 584227 569750 556142 544063 533565 524003 514624 505153 495894 487321 479513 471999
53194 471999 464265 456263 448170 439791 430677 420956 411610 403658 397270 391821 386542 380992 375196 369596
53180 369596 364710 360684 357276 354274 351698 349576 347871 346696 346220 346241 346188 345731 345073 344447 343648 342291
53164 342291 340276 337814 335237 332869 330764 328459 325411 321864 318852 317136 316554 316586 316978 317398 317147 315858
53148 315858 314188 313113 312739 312313 311241 309581 307658 305763 304244 303407 303286 303737 304664 305828 306617 306497
53132C06497q42q31l34P0J45l3l24m07P6R06J256O58l33p79l29O99J732K211J901
53113C11939J274J164J653J844J092j06r05j232j428j339o62J16R8p48j511j612
53097C09637j465j665k155k473k325j696p57K9J35m49j083j180q36n80p16j023
53081B91398j046n05M04J121J268J135J335J936K264J785Q69L03K90L95L63M11
53065C03726N65L31n36j356j251m39q9p88j689j665p82j51m53j140j211l84O85
53048B93373J199J019O39M97M26L1n76q03m42n9k50q36j178j051p33m30p9L31
53030B91078O45Q17R33R01N06j61o47o11j90J67J04l32p00n24J41P25Q92R43J190
53011B95877J363J100P11P68J125J102N95K80N15P62M25k72n65lJ169K169K177
$$ plain form
53132 306497 305655 304824 304490 304560 304705 304672 304348 303941 304017 304923 306179 306837 306504 305725 305396 306095 307827 310038 311939
53113 311939 313213 314377 316030 317874 318966 318860 317955 316723 315295 313956 313294 313410 313508 312760 311249 309637
53097 309637 308172 306507 304352 301879 299554 297858 297101 297130 297265 296816 295733 294553 293717 293137 292421 291398
53081 291398 290352 289847 290251 291372 292640 293775 295110 297046 299310 301095 301964 302267 302557 302952 303315 303726
53065 303726 304291 304622 304086 302730 301479 301040 300951 300163 298474 296809 296027 295876 295423 294283 293072 292688 293373
53048 293373 294572 295591 296230 296727 297153 297184 296608 295805 295363 295304 295054 294218 293040 291989 291256 290826 290747 291078
53030 291078 291723 292540 293473 294374 294880 294719 294072 293461 293271 293438 293542 293210 292510 291986 292127 292852 293744 294687 295877
53011 295877 297240 298340 299051 299819 300944 302046 302641 302921 303436 304198 304623 304351 303786 303783 304952 307121 309298
52994C09298J032m38j159r09k64L50R54J371J159M66J97Q77J896K342K148J938
52978C21258K077K340K245J478K02p95p30K20J004J013P33Q27J184J411J623K089
52962C38179K461K223J615J397J712J888J446P04J83p8l52p34j094j415j872k551
52946C43712l156l222k712k208k217k432k074r93Q4M73K32k27o91r92q41k20L43
52929C22859L39j21o21j020j373j548j321p40j31J57j27r29j722j886j441j005
52913C09370q49n77L6N56O66P96J332J767J381L61m83p68o47k43K35J59q43j978
52895C10271j976p54M91Q81Q24J163J980K627K519J647N74p4k98p64j818k805
52879C14488k865k148j443r29j75O91R13M32J97P22J233Q96J50L6O91J311J375
$$ plain form
52994 309298 310330 309892 308733 307824 307560 307910 308864 310235 311394 311860 312057 312934 314830 317172 319320 321258
52978 321258 323335 325675 327920 329398 329600 328805 328075 328295 329299 330312 331045 331872 333056 334467 336090 338179
52962 338179 340640 342863 344478 345875 347587 349475 350921 351625 351808 351730 351378 350644 349550 348135 346263 343712
52946 343712 340556 337334 334622 332414 330197 327765 325691 324698 324782 325255 325487 325260 324569 323577 322736 322516 322859
52929 322859 323198 323077 322456 321436 320063 318515 317194 316454 316323 316480 316353 315424 313702 311816 310375 309370
52913 309370 308521 307944 307980 308536 309202 309998 311330 313097 314478 314839 314356 313588 312941 312698 312933 313092 312249 310271
52895 310271 308295 307541 308032 308913 309737 310900 312880 315507 318026 319673 320247 320173 319875 319111 317293 314488
52879 314488 311623 309475 308032 307103 306928 307619 308532 308964 309161 309883 311116 312012 312162 312198 312889 314200 315575
52862C15575J141J062J258J666K199K646K668K023P68p02j782k135k139k538l441
52847C18269m060l819l324l610m568m882l710j788m72j17l0K47L12l09j318j988
52831B84833k025j625q93K15J410K051J855J278R57R99J018O56l6o13n72Q5P00
52814B90293O88L86O09J389J908J932K426M081N860N959L868P29k121m127n214
52799C08666n445n084m444l485k144r05m85q45j209j130r52j077j391j556j382
52784B77132p21L61J277J351Q42Q07J673K577K586J915J403J237R29L11j76k02
52768B93302m4j70o45j040r57n05k66o46j349j662j283n73k1K41K94J81m8k21
52750B84588j65J32M73N32J18l71r0J208K519K637J697R72J081J329J024N25M71
$$ plain form
52862 315575 316716 317778 319036 320702 322901 325547 328215 330238 331006 330304 328522 326387 324248 321710 318269
52847 318269 314209 310390 307066 303456 298888 294006 290296 288508 288036 287919 287889 288136 288448 288139 286821 284833
52831 284833 282808 281183 280290 280505 281915 283966 285821 287099 288056 289055 290073 290729 290693 290080 289508 289593 290293
52814 290293 290981 291367 291976 293365 295273 297205 299631 303712 309572 315531 319399 320128 318007 313880 308666
52799 308666 303221 298137 293693 290208 288064 287159 286674 285829 284620 283490 282538 281461 280070 278514 277132
52784 277132 276411 276772 278049 279400 280242 281049 282722 285299 287885 289800 291203 292440 293369 293680 293504 293302
52768 293302 293258 293088 292443 291403 290446 289941 289675 289029 287680 286018 284735 284162 284141 284382 284676 284857 284809 284588
52750 284588 284423 284555 285028 285560 285678 285307 285217 286425 288944 291581 293278 294250 295331 296660 297684 298209 298680
52733B98680P14P73P52J062J578J830J824J963K227K112J426O00J47J83N12Q33
52717C17216Q37L88k66o89p62p56r37j291j605j643j286o42r5n1n88j348j756
52700C04726j450n97K52P40J012J235J095L29m68l46O04J107M04o21o33M37J577
52683C09403K104K150J926J399P01K23J06J11N5K3M8k5k64n35o67n38l3P62J397
52664C18346J377O27n27j639k238j958r96j56L9QM19J129J509J562J886K556K876
52647C24820K421J525N24p22k185l219l276k578j619n20P14J688J956J618J131
52632C22278P97Q40J597L088M569N124M630L759L042K368J410P4j479k957m049
52617C45091m621m829m817m428l482k237j220n98j05L80O32N13K73J65P1k19n62
$$ plain form
52733 298680 299394 300167 300919 301981 303559 305389 307213 309176 311403 313515 314941 315541 315688 315871 316383 317216
52717 317216 318053 318441 318175 317486 316724 315968 315031 313740 312135 310492 309206 308564 308469 308418 307830 306482 304726
52700 304726 303276 302679 302931 303671 304683 305918 307013 307342 306874 306528 307132 308239 308643 308022 307389 307826 309403
52683 309403 311507 313657 315583 316982 317683 317906 318012 318123 318178 318201 318249 318224 317960 317425 316758 316220 316187 316949 318346
52664 318346 319723 320350 319823 318184 315946 313988 312992 312836 312875 312883 313302 314431 315940 317502 319388 321944 324820
52647 324820 327241 328766 329290 328568 326383 323164 319888 317310 315691 315171 315885 317573 319529 321147 322278
52632 322278 323075 323915 325512 328600 333169 338293 342923 346682 349724 352092 353502 353576 352097 349140 345091
52617 345091 340470 335641 330824 326396 322914 320677 319457 318859 318754 319134 319766 320279 320552 320717 320788 320569 320007
52600C20007n81j55M15P84Q70Q05O43L35k7j58J06M63M18n1l63l8P11J286J409
52581C26879J216R00N81M59O42Q59P43M75O20J197J406O44n43r97l45N08L26j142
52563C34428k879l523k690j334p00r85j330j128p08n88n48q7O08Q34M17o0j37
52546C19590J8R9J69L92O05M87p3r27j803k315k157j445o67j47K39O62J021J202
52528C14950J340J509J386P04j79n92l78J9K90O45J297J969K222K131K253K915
52512C32481L745M083L701K988K430K111J843J571J376J081K04j455l386m704
52498C48069m963m462l807l310k875k321j700j195q13l70J17K65j75q35j087q65
52482C19673o84p75o77J04J307K167K211J651J078R68J377J966K412K759L129
$$ plain form
52600 320007 319426 319271 319686 320470 321340 322145 322788 323123 323096 322938 323044 323507 323925 323874 323511 323473 324184 325470 326879
52581 326879 328095 328995 329576 330035 330677 331536 332279 332754 333374 334571 335977 336621 336078 335081 334736 335244 335570 334428
52563 334428 331549 328026 325336 324002 323302 322317 320987 319859 319151 318563 318015 317928 318536 319370 319787 319727 319590
52546 319590 319608 319707 319876 320268 320873 321360 321287 320360 318557 316242 314085 312640 311973 311826 312065 312727 313748 314950
52528 314950 316290 317799 319185 319889 319710 319118 318740 318759 319049 319694 320991 322960 325182 327313 329566 332481
52512 332481 336226 340309 344010 346998 349428 351539 353382 354953 356329 357410 357614 356159 352773 348069
52498 348069 343106 338644 334837 331527 328652 326331 324631 323436 322623 322253 322370 322635 322460 321625 320538 319673
52482 319673 318989 318214 317537 317641 318948 321115 323326 324977 326055 327023 328400 330366 332778 335537 338666
52467C38666L194K469J184L35N44J463K518L588M379L967J837r67k793l307l509
52452C53568l920l881k983k099k294l328m002l655k721j936j535j307j009o17
52438C18281k91j58j84k98n33q52r65n92R5O01O65M20P1j73RP02J275Q70l97j301
52418C17245r39K08J009J071R27J170J868K646K969K516J751J810L337N555P092
52403C50235P689Q492J0457J3067J4859J4784J2666Q712L342k472p332j0272j1350
52390D12877j1191j0195q542o718n420m776m162l109j974j335j066n72K91J067
52376C55175J465J695K011K412K887L486M055M284M143L910L622K958J850P58
52362C94711R7j95l27l02j51k14o82j192j178m94N77J712K594K861K382J566J071
$$ plain form
52467 338666 341860 344329 345513 345848 346392 347855 350373 353961 358340 362307 364144 363177 360384 357077 353568
52452 353568 349648 345767 342784 340685 338391 335063 331061 327406 324685 322749 321214 319907 318898 318281
52438 318281 317990 317832 317648 317350 316817 315965 315000 314408 314503 315104 315769 316189 316260 316087 316096 316798 318073 318943 318546 317245
52418 317245 316306 316514 317523 318594 319521 320691 322559 325205 328174 330690 332441 334251 337588 343143 350235
52403 350235 357924 366416 376873 389940 404799 419583 432249 440961 444303 441831 434499 424227 412877
52390 412877 401686 391491 382949 376231 370811 366035 361873 358764 356790 355455 354389 353817 354108 355175
52376 355175 356640 358335 360346 362758 365645 369131 373186 377470 381613 385523 389145 392103 393953 394711
52362 394711 394808 394613 394286 393984 393833 393619 392937 391745 390567 390073 390650 392362 394956 397817 400199 401765 402836
52345D02836J196J707K141K165J749J208R99J312J971K707L413M107M894N928
52331D38333P110P901P861P460P745R014J0379J0977J1050J1364J2054J2638J2898
52318E66784J3047J3174J3082J2695J2226J2014J2466J3902J6069J8025J9020
52307G22504J9357J9909K0948K2011K2796K3537K4371K4941K4920K4509K4112
52296I73915K3777K3166K1862J9615J6543J3211J0380Q429P156O071M813L260
52284A132198J499j86j482k275k721l076l512m054m546m752m598m270l975l710
52270A090540l365k884k220j291j44J069K362L924N593O695O826O616P182Q872
52256A129775J1009J2879J4526J6383J8521K0479K1654K1701K0634J8728J6361
$$ plain form
52345 402836 404032 405739 407880 410045 411794 413002 414001 415313 417284 419991 423404 427511 432405 438333
52331 438333 445443 453344 461205 468665 476410 485424 495803 506780 517830 529194 541248 553886 566784
52318 566784 579831 593005 606087 618782 631008 643022 655488 669390 685459 703484 722504
52307 722504 741861 761770 782718 804729 827525 851062 875433 900374 925294 949803 973915
52296 973915 997692 1020858 1042720 1062335 1078878 1092089 1102469 1110898 1118054 1124125 1128938 1132198
52284 1132198 1133697 1133511 1132029 1129754 1127033 1123957 1120445 1116391 1111845 1107093 1102495 1098225 1094250 1090540
52270 1090540 1087175 1084291 1082071 1080780 1080636 1081705 1084067 1087991 1093584 1100279 1107105 1113721 1120903 1129775
52256 1129775 1140784 1153663 1168189 1184572 1203093 1223572 1245226 1266927 1287561 1306289 1322650
52245A322650J3913J1767J0170Q962P671O093M544L347K335J183m8j096k080l338
52231A386073m766n868o497p057p827q604r142r486r638r398q841q594r075r741
52217A271539r598q449p132o447o223n699m516k975j475q4J229K347L159L795
52203A229471M386M738M622M326M534N566O983Q107Q704R016R323R697R951R720
52189A329144Q743P209N650M433L464K447J145o03k817n089o735p442p545p521
52175A324483p456p216o825o441o201o244o575o807o436n536m748m329l805k769
52161A243095j520l95Q30K274L268L044J862O95Pm34p84q82p04m44j18M05J024
52144A251223J584K248L134L796L630K662J423J92j043k079k631k816k869k579
$$ plain form
52245 1322650 1336563 1348330 1358500 1367462 1375133 1381226 1385770 1389117 1391452 1392635 1392587 1391491 1389411 1386073
52231 1386073 1381307 1375439 1368942 1361885 1354058 1345454 1336312 1326826 1317188 1307790 1298949 1290355 1281280 1271539
52217 1271539 1261941 1253492 1246360 1239913 1233690 1227991 1223475 1220500 1219025 1218941 1220170 1222517 1225676 1229471
52203 1229471 1233857 1238595 1243217 1247543 1252077 1257643 1264626 1272733 1281437 1290453 1299776 1309473 1319424 1329144
52189 1329144 1337887 1345096 1350746 1355179 1358643 1361090 1362235 1361632 1358815 1353726 1346991 1339549 1332004 1324483
52175 1324483 1317027 1309811 1302986 1296545 1290344 1284100 1277525 1270718 1264282 1258746 1253998 1249669 1245864 1243095
52161 1243095 1241575 1241180 1242010 1244284 1247552 1250596 1252458 1253153 1253160 1252726 1251942 1251060 1250356 1249912 1249794 1250199 1251223
52144 1251223 1252807 1255055 1258189 1261985 1265615 1268277 1269700 1269892 1268849 1266770 1264139 1261323 1258454 1255875
52130A255875j648l50Q98K371M514O918Q776J0257J2190J4406J5693J5681J5527
52117A361108J6204J7236J7706J7596J7393J7267J7306J7893J9096K0225K0768
52106A559798K1177K2105K3401K4492K5330K6223K7119K7680K7727K7012K4956
$$ plain form
52130 1255875 1254227 1253877 1254775 1257146 1261660 1268578 1277354 1287611 1299801 1314207 1329900 1345581 1361108
52117 1361108 1377312 1394548 1412254 1429850 1447243 1464510 1481816 1499709 1518805 1539030 1559798
52106 1559798 1580975 1603080 1626481 1650973 1676303 1702526 1729645 1757325 1785052 1812064 1837020
$$ [...]
##END NTUPLES=NMR SPECTRUM
##END=
