
##TITLE=UV1283_M1_1242-1388_90_7534359_6izRPBe8Zb
##JCAMPDX= 6.0         $$ Bruker NMR JCAMP-DX V2.0
##DATA TYPE= NMR SPECTRUM
##DATA CLASS= NTUPLES
##ORIGIN= BRUKER
##OWNER= Administrator
$$ 1.72 TOPSPIN		Version 2.1
$$ 2013-02-22 04:27:39.218 -0500  Administrator@X
$$ Compression mode = diff/dup
##.OBSERVE FREQUENCY= 400.02188249412
##.OBSERVE NUCLEUS= ^1H
##.ACQUISITION MODE= SIMULTANEOUS (DQD)
##.ACQUISITION SCHEME= undefined
##.AVERAGES= 8
##.DIGITISER RES= 22
##SPECTROMETER/DATA SYSTEM= spect
##.PULSE SEQUENCE= zg30
##.SOLVENT NAME= COFFEE_meoh
##.SHIFT REFERENCE= INTERNAL, COFFEE_meoh, 1, 14.98509
##AUDIT TRAIL= $$ (NUMBER, WHEN, WHO, WHERE, PROCESS, VERSION, WHAT)
$$ ##TITLE= Audit trail, TOPSPIN		Version 2.1
$$ ##JCAMPDX= 5.01
$$ ##ORIGIN= Bruker BioSpin GmbH
$$ ##OWNER= Administrator
$$ $$ E:\/data/COFFEE/nmr/UV1283_M1_1242-1388_90_7534359_6izRPBe8Zb/10/pdata/1/auditp.txt
$$ ##AUDIT TRAIL=  $$ (NUMBER, WHEN, WHO, WHERE, PROCESS, VERSION, WHAT)
(   1,<2013-02-22 04:27:30.552 -0500>,<Administrator>,<X>,<go>,<TOPSPIN 2.1>,
      <created by zg
	started at 2013-02-22 04:26:25.385 -0500,
	POWCHK enabled, PULCHK disabled,
       configuration hash MD5:
       86 BA 57 50 F2 9D 5C 9B 26 00 A9 28 5F 66 2E 89
       data hash MD5: 64K
       F7 A2 47 6C 98 4D A0 86 8F 20 15 2C 95 BF B3 4E>)
(   2,<2013-02-22 04:27:33.755 -0500>,<Administrator>,<X>,<proc1d>,<TOPSPIN 2.1>,
      <Start of raw data processing
       efp LB = 0 FT_mod = 6 PKNL = 1 PHC0 = 0 PHC1 = 0 SI = 32K 
       data hash MD5: 32K
       1B CC FB 9B C3 EC 1A 4E AB 00 1F BA C3 71 75 1E>)
(   3,<2013-02-22 04:27:34.255 -0500>,<Administrator>,<X>,<proc1d>,<TOPSPIN 2.1>,
      <pk PHC0 = 68.88428 PHC1 = 0 
       data hash MD5: 32K
       17 29 D4 DC DA 3A 92 90 C6 0B 94 6E 68 5F 48 D4>)
(   4,<2013-02-22 04:27:34.489 -0500>,<Administrator>,<X>,<proc1d>,<TOPSPIN 2.1>,
      <abs ABSG = 1 
       data hash MD5: 32K
       38 FF A4 7C 27 72 DA 0E 73 B5 15 29 68 17 35 B0>)
(   5,<2013-02-22 04:27:34.646 -0500>,<Administrator>,<X>,<proc1d>,<TOPSPIN 2.1>,
      <abs ABSG = 2 
       data hash MD5: 32K
       EB B2 D3 BA 8E 22 25 95 61 38 61 80 5A B9 93 0A>)
(   6,<2013-02-22 04:27:34.802 -0500>,<Administrator>,<X>,<proc1d>,<TOPSPIN 2.1>,
      <abs ABSG = 3 
       data hash MD5: 32K
       67 AD 14 E7 F2 30 A9 7D 1D 2F E0 0E 60 51 0C 81>)
(   7,<2013-02-22 04:27:34.943 -0500>,<Administrator>,<X>,<proc1d>,<TOPSPIN 2.1>,
      <abs ABSG = 4 
       data hash MD5: 32K
       EC 7C 54 B9 F7 81 D2 FE 81 07 53 38 47 A5 45 47>)
(   8,<2013-02-22 04:27:35.146 -0500>,<Administrator>,<X>,<proc1d>,<TOPSPIN 2.1>,
      <abs ABSG = 5 
       data hash MD5: 32K
       66 F5 2C F7 94 2B 82 47 42 31 DC 78 E7 40 AA 18>)
$$ ##END=
$$ 
$$ $$ hash MD5
$$ $$ 97 D0 E6 1A 24 CA 67 A3 57 CF 86 1B 3E D4 81 A2
##$RELAX= 
##$RELAX= 
##$RELAX= 
##$RELAX= 
##$RELAX= 
##$RELAX= 
##$RELAX= 
$$ Bruker specific parameters
$$ --------------------------
##$DU= <E:\>
##$EXPNO= 10
$$ [...]
##$TP= (0..7)
150 150 150 150 150 150 150 150
##$TP07= 0
##$TPNAME0= <>
##$TPNAME1= <>
##$TPNAME2= <>
##$TPNAME3= <>
##$TPNAME4= <>
##$TPNAME5= <>
##$TPNAME6= <>
##$TPNAME7= <>
##$TPOAL= (0..7)
0.5 0.5 0.5 0.5 0.5 0.5 0.5 0.5
##$TPOFFS= (0..7)
0 0 0 0 0 0 0 0
##$TUNHIN= 0
##$TUNHOUT= 0
##$TUNXOUT= 0
##$USERA1= <user>
##$USERA2= <user>
##$USERA3= <user>
##$USERA4= <user>
##$USERA5= <user>
##$V9= 5
##$VALIST= <valist>
##$VCLIST= <CCCCCCCCCCCCCCC>
##$VD= 0
##$VDLIST= <DDDDDDDDDDDDDDD>
##$VPLIST= <PPPPPPPPPPPPPPP>
##$VTLIST= <TTTTTTTTTTTTTTT>
##$WBST= 1024
##$WBSW= 4
##$XGAIN= (0..3)
0 0 0 0
##$XL= 0
##$YL= 0
##$YMAX_a= 570927
##$YMIN_a= -568384
##$ZGOPTNS= <>
##$ZL1= 120
##$ZL2= 120
##$ZL3= 120
##$ZL4= 120
##$ABSF1= 14.98509
##$ABSF2= -5.573092
##$ABSG= 5
##$ABSL= 3
##$ALPHA= 0
##$AQORDER= 0
##$ASSFAC= 0
##$ASSFACI= 0
##$ASSFACX= 0
##$ASSWID= 0
##$AUNMP= <proc_prof1d_extract_pilot.lims>
##$AXLEFT= 0
##$AXNAME= <>
##$AXNUC= <1H>
##$AXRIGHT= 0
##$AXTYPE= 0
##$AXUNIT= <>
##$AZFE= 0.1
##$AZFW= 0.1
##$BCFW= 0
##$BC_mod= 0
##$BYTORDP= 0
##$COROFFS= 0
##$CY= 15
##$DATMOD= 1
##$DC= 0
##$DFILT= <>
##$DTYPP= 0
##$F1P= 0
##$F2P= 0
##$FCOR= 0.5
##$FTSIZE= 32768
##$FT_mod= 6
##$GAMMA= 0
##$GB= 0
##$INTBC= 1
##$INTSCL= 1
##$ISEN= 128
##$LB= 0
##$LEV0= 0
##$LPBIN= 0
##$MAXI= 10000
##$MC2= 0
##$MEAN= 0
##$ME_mod= 0
##$MI= 0
##$NCOEF= 0
##$NC_proc= -8
##$NLEV= 6
##$NOISF1= 0
##$NOISF2= 0
##$NSP= 0
##$NTH_PI= 0
##$NZP= 0
##$OFFSET= 14.98509
##$PC= 1
##$PHC0= 68.88428
##$PHC1= 0
##$PH_mod= 1
##$PKNL= yes
##$PPARMOD= 0
##$PPDIAG= 0
##$PPIPTYP= 0
##$PPMPNUM= 2147483647
##$PPRESOL= 1
##$PSCAL= 4
##$PSIGN= 0
##$PYNMP= <proc.py>
##$REVERSE= no
##$SF= 400.02
##$SI= 32768
##$SIGF1= 0
##$SIGF2= 0
##$SINO= 400
##$SIOLD= 32768
##$SPECTYP= <>
##$SREGLST= <1H.CDCl3>
##$SSB= 0
##$STSI= 32768
##$STSR= 0
##$SW_p= 8223.68421052631
##$SYMM= 0
##$S_DEV= 0
##$TDeff= 65536
##$TDoff= 0
##$TI= <>
##$TILT= no
##$TM1= 0
##$TM2= 0
##$TOPLEV= 0
##$USERP1= <user>
##$USERP2= <user>
##$USERP3= <user>
##$USERP4= <user>
##$USERP5= <user>
##$WDW= 1
##$XDIM= 32768
##$YMAX_p= 466084600
##$YMIN_p= -739709
##$CURPLOT= <Network HP LaserJet P1505>
##$CURPRIN= <$Network HP LaserJet P1505>
##$DFORMAT= <normdp>
##$LAYOUT= <+/1D_H.xwp>
##$LFORMAT= <normlp>
##$PFORMAT= <normpl>
##$SURQMSG= 1
$$ End of Bruker specific parameters
$$ ---------------------------------
##NTUPLES= NMR SPECTRUM
##VAR_NAME=  FREQUENCY,     SPECTRUM/REAL,   SPECTRUM/IMAG
##SYMBOL=    X,             R,               I
##VAR_TYPE=  INDEPENDENT,   DEPENDENT,       DEPENDENT
##VAR_FORM=  AFFN,          ASDF,            ASDF
##VAR_DIM=   32768,         32768,           32768
##UNITS=     HZ,            ARBITRARY UNITS, ARBITRARY UNITS
##FACTOR=    0.250966925370066, 1,           1
##FIRST=     8223.43324360094, -31973,       -63738
##LAST=      0,             -22264,          -5382
##MIN=       0,             -739709,         0
##MAX=       8223.43324360094, 466084600,    0
$$ Real data points
##PAGE= N=1
##DATA TABLE= (X++(R..R)), XYDATA
$$ [...]
19558a42373K7560N864H0223l8873a21479A69153g8026r6599p3261B97309c08644
19546B30292b38398d6632g56C3075c19235p7773C99181E6389H772J59981K4956
19535A93709b06230C0298d42p7449E9034b5514o48136b38783F710a95317g4485
19523g7398A09497d54646b15324a110A38644K5044J22520f5196k6202A4273J48164
19512A62437b20265C01099e3691B76316H7132b80947d4669C3965a04071j80738
19502b84809m4294a11980B72708I775b73896I2496h3592k49515J15169j74549
19492c92487J95596R2758p3388h5136L0456j28424I1968J20983h1596l3647j8420
19481a33663J5949j0769q0988a2411k53153c2335a6131j03396q1653G0475J5369
$$ plain form
19558 -142373 -114813 -108949 80223 41350 -121479 169153 -78026 -174625 -247886 297309 -308644
19546 230292 -238398 -46632 -756 33075 -319235 -397008 399181 56389 8772 168753 193709
19535 193709 -206230 30298 -442 -77891 59034 -25514 -673650 -238783 6710 -195317 -74485
19523 -77398 109497 -454646 -215324 -1110 138644 163688 286208 -65196 -91398 14273 162437
19512 162437 -220265 301099 -53691 276316 87132 -280947 -44669 33965 -104071 -284809
19502 -284809 -329103 -111980 272708 9775 -273896 92496 -83592 -333107 -217938 -392487
19492 -392487 -196891 -104133 -177521 -85136 -54680 -183104 91968 212951 -81596 -115243 -133663
19481 -133663 -117714 -128483 -209471 -12411 -265564 -32335 -16131 -119527 -201180 70475 85844
19470H5844J5357c95537J45749j33911a25944A57110c6062A20862j1786a08722
19459C05579d58068C76856i8945A07518f8200p458A76740M5304r5924b9899B001
19447E2031g3838A9173a53936A43044b8678A90621G4924e55839a98582N9351k76570
19436d15801A26737b49186e7569B93482c71956a33981N9580B39868J545E0396
19425B15685a17315j59137J12608k01956e5569n48658A83739b3742A46236c19850
19414C4974d15468a83701E8337R854i4643r1513b4688j57588j37380J50206K3258
19403a46192m9899A67676C7423R1169J56908A22966C1660K4841a92272e0734a0819
19391f9568D7623J0a03874k58077a39651d2302l14824a3431A16632J8902b08176
$$ plain form
19470 85844 101201 -395537 -249788 -383699 -125944 157110 -36062 120862 109076 -108722
19459 305579 -458068 376856 -98945 107518 -68200 -75658 176740 222044 126120 -29899 2001
19447 52031 -73838 19173 -153936 143044 -28678 190621 74924 -555839 -198582 -139231 -415801
19436 -415801 126737 -249186 -57569 293482 -371956 -133981 -74401 239868 241413 50396
19425 215685 -117315 -276452 -163844 -365800 -55569 -604227 183739 -23742 146236 -319850
19414 34974 -415468 -183701 58337 68191 -94643 -186156 -24688 -182276 -319656 -169450 -146192
19403 -146192 -196091 167676 37423 128592 285500 122966 31660 56501 -192272 -50734 -10819
19391 -69568 47623 47633 -103874 -361951 -139651 -42302 -357126 -13431 116632 135534 -208176
19379a07192g386A5180a75000l49229L7295a00892j11777I7481b23010g9483H3456
19367c12459a24924c6938k7965j19375f6406A30229D8829h4355j35822M5646B86946
19355g9515A11276h5147H1332a36975j59528J20062c3526r7111H2565c76665E1208
19343A1892c73331g6256B81666c7733m1487j33037o5353e3584A45305b24065F5439
19331C60270A67607a77743A10168f8684q0218j57263J22917d9872C3975c73749
19320a20287j7211B7298M5295a96359e0809k48559a16550r4072A04585h5915r9018
19309a84933d3989k80171J47484B9493g3517k49613J14134B51432k123f1300k24944
19298b86244A30771h1152B90391c09926a40798B35427h3622k25388B07414m6568
$$ plain form
19379 -107192 -7386 15180 -175000 -524229 -486934 -100892 -212669 97481 -223010 -79483 83456
19367 -312459 -124924 -36938 -64903 -184278 -66406 130229 48829 -84355 -220177 -174531 286946
19355 -79515 111276 -85147 81332 -136975 -296503 -176441 -33526 -130637 82565 -376665 51208
19343 11892 -373331 -76256 281666 -37733 -79220 -212257 -277610 -53584 145305 -224065 65439
19331 360270 167607 -177743 110168 -68684 -148902 -306165 -183248 -49872 33975 -373749
19320 -120287 -137498 27298 72593 -196359 -50809 -299368 -116550 -210622 104585 -85915 -184933
19309 -184933 -43989 -324160 -176676 29493 -73517 -323130 -208996 251432 249309 -61300 -286244
19298 -286244 130771 -81152 290391 -309926 -140798 235427 -83622 -309010 207414 160846
19288A60846a93493B63770h6975j28125A00377L54977a49892e3017B9267a08388
19277a23769p0242b2773M940G6255g089A84686c575E0958b56625C09795o5328
19266B44467c9850B74747a36040O0883A27281i186H1908K1449c38288a19235A38392
19254b2784A6408a99426R2402G7201a24759q0083l4737P6363r431j5871f000A25251
19241a85543j2380l0162i4953I33a99535C4315L0713a88321f6148A01925R3848
19230A95773b71911f8026c3657r0067k70A5069L48845A76585f4278p0927A3328
19218a02261a8181B44970b14834h0051k27438k5526b1825r6118d5979p2201G5029
19206i7932L9288n4594l2030k16774J08108i406q0838j48623A06185b08144J5501
$$ plain form
19288 160846 -193493 263770 -86975 -215100 100377 455354 -149892 -53017 29267 -108388
19277 -123769 -194011 -22773 -17833 76255 -7089 184686 -3575 50958 -256625 309795 244467
19266 244467 -39850 274747 -136040 -75157 127281 -9186 81908 103357 -338288 -119235 138392
19254 -22784 16408 -199426 -107024 77201 -124759 -204842 -239579 -163216 -172647 -188518 -6000 125251
19241 -185543 -197923 -228085 -94953 933 -199535 34315 65028 -188321 -66148 101925 195773
19230 195773 -271911 -68026 -33657 -123724 -123994 15069 363914 176585 -64278 -135205 13328
19218 -102261 -18181 244970 -214834 -80051 -307489 -333015 -21825 -117943 -45979 -118180 75029
19206 -97932 -58644 -113238 -145268 -362042 -253934 -9406 -90244 -238867 106185 -208144 -192643
19195a92643C29458A09823a51686n1557i3506B98422j46069J05546j15811C6308
19184c3833A39201b61248N6763A79304c02339c0156j49211j26660C4921e7839
19173C6434L0801b47754G9952a98201g2283b5424j41044L2810I923a21815H8186
19161A70300M0210b25080O3649j849O7760J854A39141k8007h9505k87755a04437
19149h2351k43196B3773b32849B06054e1328j12600M6709B7947K7006M0316J37247
19138B32516F5608e78222g8339l9943j05822a5766q0465E03090b67760D4873K43123
19127B87996G3624b14679q8192a22531j49350E000Q3779i581l8883l2520n0466
19116a31450A00247O7199L2510c28717d0207m247D9303R5664a02192L4093A07008
$$ plain form
19195 -192643 329458 109823 -151686 -203243 -93506 298422 152353 257899 142088 36308
19184 -33833 139201 -261248 -204485 179304 -302339 -30156 -179367 -306027 34921 -57839
19173 36434 67235 -247754 79952 -198201 -72283 -25424 -166468 -133658 9923 -121815 88186
19161 170300 210510 -225080 -161431 -163280 -95520 -93666 139141 111134 -89505 -377260 -104437
19149 -82351 -325547 23773 -232849 206054 -51328 -163928 -117219 27947 54953 95269 232516
19138 232516 65608 -578222 -78339 -118282 -224104 -15766 -96231 503090 -267760 44873 287996
19127 287996 73624 -214679 -302871 -122531 -271881 5000 88779 -9581 -48464 -80984 -131450
19116 -131450 100247 167446 199956 -328717 -40207 -44454 49303 144967 -102192 -68099 107008
19104B05327b23094R8566l721H6900h909C6670J77082p3385d8758j97816A03316
19092d7221A28129a43244m0708B96864b84965C6136d0693k66555B55914i4859
19081c7912G4435b57750H9992P5477C6064c9548J0150e352o7350n2699A02386
19069b02847C5800c5596k29293f3112B76099n4112a37831A9830k22J73814b84677
19057h5799k76640a23408m7313P2999B68197E0497b21330F0908a67193k5154o4999
19046b57346F3071b88880C93124a17061j75737a27333G2441g2774o6253j295j991
19035a42313d5187j99791j879A80221J94066d9535p8782B00951M3793j14531N3425
19024A83638Q2675a44767O9540D0894a71472A42162i6706p0716E0398K1033b55331
$$ plain form
19104 205327 -223094 -124528 -128249 86900 -8909 36670 213752 140367 -48758 -246574 103316
19092 -47221 128129 -143244 -183952 296864 -284965 36136 -40693 -307248 255914 -94859
19081 -37912 74435 -257750 89992 165469 36064 -39548 -29398 -5352 -72702 -125401 102386
19069 -202847 35800 -35596 -264889 -63112 276099 221987 -137831 19830 19608 193422 -284677
19057 -85799 -362439 -123408 -170721 -97722 268197 50497 -221330 60908 -167193 -192347 -257346
19046 -257346 63071 -288880 393124 -117061 -292798 -127333 72441 -72774 -139027 -140322 -142313
19035 -142313 -45187 -244978 -246857 180221 374287 -49535 -128317 200951 244744 130213 183638
19024 183638 266313 -144767 -75227 40894 -171472 142162 -96706 -167422 50398 71431 -255331
19012b12790j18188J47205N9091A37406c11858N914P2995c9147l1116L4843A19715
19000d13224J96927e6619H5949A0289a64196A17065a20744j04790B65647c7517
18989b86963j34985I9726b06199i2350q2914K4675e773A40484C0018a1693C56740
18977d1246j08769D5527a44146b7551k60151I989e8651A70586g3778k90636i80
18965b08013A98104f092l562A88972b72312Q5619B59383D4827A2419b0797n5107
18954g5904B50899c26414A1408a43848K9426A1049h2163m5445H4877J0889J89359
18943B85125I7238a38661j2105a0499C2859j4318h4109A7928Q9959b59604b0105
18931a67388D7189J17386J50287D731J00685l1297d15779J26737a19293d6409
$$ plain form
19012 -212790 -330978 -183773 -124682 137406 -311858 -305944 -232949 -39147 -70263 -35420 119715
19000 -413224 -216297 -56619 85949 10289 -164196 117065 -120744 -225534 265647 -37517
18989 -286963 -421948 99726 -206199 -92350 -175264 -150589 -5773 140484 30018 -11693 356740
18977 -41246 -150015 45527 -144146 -27551 -287702 9989 -58651 170586 -73778 -364414 -980
18965 -208013 198104 -6092 -9654 188972 -272312 -186693 259383 44827 12419 -20797 -75904
18954 -75904 250899 -326414 11408 -143848 -114422 11049 -82163 -127608 84877 95766 285125
18943 285125 97238 -138661 -150766 -10499 32859 18541 -84109 17928 107887 -259604 -20105
18931 -167388 47189 164575 314862 4731 105416 74119 -415779 -289042 -119293 -46409
18920h0237l72345a10698l932A6522D303d90686A5584a80926B71232A1877P2904
18909H4781d8404A00034C4032j3792J46773C9003d9099j10454d5379B78478A25865
18897I009a51591r8494B62035g9684A53453c74269B18563a39845M8930d081j03008
18886a07089b4636B44494a91916m6542B657J24178a78918l4257O176A79461b16532
18874G1217b66017f085l87802g2770n44583E7088f4145j66409a6770D9962i6034
18862H8092K1407b318q0159n0579e0971k14519L7607O5417N2389K0616G2721L03964
18850C76685A10781L15269g6468A63648k4576Q6853a88900L7389l5511c2021D3084
18838b43213I9354J37094c3367q5641A2312a37725A76649d1478n2387E6578b36511
$$ plain form
18920 -80237 -452582 -110698 -114630 16522 4303 -490686 15584 -180926 271232 11877 84781
18909 84781 -48404 100034 34032 20240 167013 39003 -49099 -159553 -45379 278478 125865
18897 9009 -151591 -250085 262035 -79684 153453 -374269 218563 -139845 -90915 -4081 -107089
18886 -107089 -24636 244494 -191916 -238458 2657 126835 -178918 -213175 -206999 179461 -216532
18874 71217 -266017 -6085 -393887 -72770 -617353 57088 -64145 -230554 -16770 49962 -96034
18862 88092 109499 -2318 -82477 -133056 -50971 -265490 -227883 -162466 -110077 -89461 72721 376685
18850 376685 110781 426050 -76468 163648 139072 225925 -188900 -151511 -187022 -32021 43084
18838 -243213 99354 236448 -33367 -119008 12312 -137725 176649 -41478 -93865 56578 -236511
18826e7554D9949c1315A29499i4858k75463B17857E5410J04615R9628I2423a23876
18814D25970a25055b0023E52121B22064g7297E51355a19940A73043m3168l4135
18804I5740b35194e7804b8743r9357m7626p27G8104L8437J70386a88391A18859
18792a22180B24622d433j30842j8051E5473a21850C51369a73304A8157D821N6608
18781F1429c03096P7724P7267A44600B1936H307c36879f1669G6518a7486E2483
18769A55729k4528a14836j9143l7395l7769B95784h1409j5511n9000j0936O39
18758a66217r4678h1486A35220a82978A56047a03189q8010M9420a9944j1613j1229
18747d2786j51961g9993K6690k2666A76546c0997A6923K88798a11474C43439a85389
$$ plain form
18826 -57554 49949 -31315 129499 -94858 -370321 217857 55410 160025 259653 92423 -123876
18814 425970 -125055 -20023 552121 222064 -77297 551355 -119940 173043 129875 95740
18804 95740 -235194 -57804 -28743 -128100 -175726 -176453 78104 116541 286927 -188391 118859
18792 -122180 224622 -4433 -135275 -153326 55473 -121850 351369 -173304 18157 4821 61429
18781 61429 -303096 -225372 -148105 144600 21936 8307 -336879 -61669 76518 -17486 52483
18769 155729 131201 -114836 -133979 -171374 -209143 295784 -81409 -96920 -155920 -166856 -166217
18758 -166217 -260895 -81486 135220 -182978 156047 -103189 -191199 -141779 -19944 -31557 -42786
18747 -42786 -194747 -79993 -53303 -75969 176546 -30997 16923 305721 -111474 343439 -185389
18735a64859H6901c7239o19360a1286j511A4245b86206G1693d6013A19332a91406
18723a36678A10429a03331I5367c9040C9184b25458J0695i702A26877b44467E7951
18711c38525k0076F5669G603h5015c4107F9920J41127E5659j9935J87254a58348
18699a20525j25887A20230e8555a9386A63487c71143c7924j43237A37775m3575
18689I4200B2835b4138B28948F9414d9559o613F7616B8985a33086l5707B7456
18677a29604A50244b84714O0771A2359P1276a6421k2322a8379k9276F101i7887
18665B01751b15976j41752d110j64j21782b9208p3771l14450a48975e5641B05749
18653d77896A09757c41470a30482E4015b79542g7304F7314c00187c0749k92858
$$ plain form
18735 -164859 86901 -37239 -656599 -11286 -12797 14245 -286206 71693 -46013 119332 -191406
18723 -136678 110429 -103331 95367 -39040 39184 -225458 -214763 -9702 126877 -244467 57951
18711 -338525 -358601 65669 7603 -85015 -34107 69920 211047 55659 35724 222978 -158348
18699 -120525 -246412 120230 -58555 -19386 163487 -371143 -37924 -181161 137775 94200
18689 94200 22835 -24138 228948 69414 -49559 -56172 67616 28985 -133086 -168793 27456
18677 -129604 150244 -284714 -223943 12359 83635 -16421 -38743 -18379 -47655 6101 -97887
18665 201751 -215976 -357728 -4110 -4274 -126056 -29208 -102979 -417429 -148975 -55641 205749
18653 -477896 109757 -341470 -130482 54015 -279542 -77304 67314 -300187 -30749 -323607
18643c23607R8894m3492C45080a94962I7391a34038f3245A27882b25623k02566
18633d28189K07116k8377N571J14856C16433A4779b71383c3771r6674A62764h816
18621c79468A8009R6810d40589K19558c7003B15403a47195l11880i0515j51445
18611b41960D07971a65849A6352b06448A06843n566d5311c3A5042a07715C29143
18599a98330b4111p5054M8512B58525B7457b4878R906k76485Q489D3307R8193
18588A41500n7006c13227B49121h3683L9589H2203b54344h3650A38152b06853
18577A14319e6902o7960F1300a44918H6190e5761k49323A8517Q5573C3231b9752
18565b71679B2725n980g8358A07874c35267A17469a60921g7078j73612P8032j97514
$$ plain form
18643 -323607 -224713 -268205 345080 -194962 97391 -134038 -63245 127882 -225623 -428189
18633 -428189 -221073 -249450 -243879 -129023 316433 14779 -271383 -33771 -130445 162764 -8816
18621 -379468 18009 114819 -440589 -221031 -37003 215403 -147195 -459075 -90515 -241960
18611 -241960 407971 -165849 16352 -206448 106843 101277 -45311 -33 15042 -107715 329143
18599 -198330 -24111 -99165 -50653 258525 27457 -24878 -14972 -291457 -282968 43307 141500
18588 141500 84494 -313227 249121 -83683 -44094 82203 -254344 -83650 138152 -206853
18577 114319 -56902 -124862 61300 -144918 86190 -55761 -305084 18517 104090 33231 -29752
18565 -271679 22725 16745 -78358 107874 -335267 117469 -160921 -77078 -250690 -172658 -370172
18554c70172a05791A11204O7291G1028J74511o8292c47747g6999m9406C5288K97119
18543C32407d55414A85114f3467C72369b24756C457f9679n5912B29964R3578E6047
18531B96530d1858j88684O8171P1562h810A24088E7116J92855j09352D5215J35490
18520A80705F5090d16337c6201a4762I8183i3656A29686h0084k78857a1123A44973
18508b12969D2241a95588c755A88816a09551k40678A2476j670a10957P336F5498
18496a92366R0435c7567A99578f6739j22880A78216c98667D5280A4810b41304
18485D107b47761H7960N8188a62422C0686c3962B76083k9774O4342b23586H5775
18473a1315k37424h6601k08208a07278l79197C8099g2840j39212E4009f7445A26323
$$ plain form
18554 -370172 -105791 111204 178495 71028 245539 177247 -347747 -76999 -126405 35288 332407
18543 332407 -455414 185114 -63467 372369 -224756 3457 -69679 -125591 229964 323542 56047
18531 296530 -41858 -230542 -162371 -90809 -8810 124088 57116 249971 140619 45215 180705
18520 180705 65090 -416337 -36201 -14762 98183 -93656 129686 -80084 -358941 -11123 144973
18508 -212969 42241 -195588 -3755 188816 -109551 -350229 12476 10806 -110957 -103621 65498
18496 -192366 -101931 -37567 199578 -66739 -189619 178216 -398667 45280 14810 -241304
18485 4107 -247761 87960 146148 -162422 30686 -33962 276083 246309 310651 -223586 85775
18473 -11315 -248739 -86601 -294809 -107278 -486475 38099 -72840 -212052 54009 -67445 126323
18461A28994b85272a31238j47819g0256A30543F2896a99755f5273D2671b95852
18450B25527k1920a47919O0900j32493o5248A96533a61345a809k95577C890c0265
18438B39606c8802j62827B45468b26576G2106f0341q6791c2859j62724I1717m1440
18427E0277g8524G7186a57656q1772i4844l4049d0908r8250m2120A95944b52224
18415d98189b0376j7062a4373p2000j90900A96260I7295J43832N1050A11231g1957
18403A52446g6602c1006F5874i4918B10590h3190B99b07442B60108C3409a35528
18391c86555E979g8668a1924G1142B7033c80357a71058B56499a07910G9722a11016
18379a2425C21316b29646r4463e8968A23367i5198L4181G5354J58895i5626d3568
$$ plain form
18461 128994 -285272 -131238 -279057 -70256 130543 62896 -199755 -65273 42671 -295852
18450 225527 203607 -147919 -87019 -219512 -284760 196533 -161345 -1809 -297386 3890 -30265
18438 239606 -38802 -201629 245468 -226576 72106 -60341 -147132 -32859 -195583 91717 50277
18427 50277 -78524 77186 -157656 -239428 -94844 -128893 -40908 -139158 -181278 195944 -252224
18415 -498189 -20376 -37438 -14373 -86373 -277273 196260 97295 241127 292177 111231 -71957
18403 152446 -76602 -31006 65874 -94918 210590 -83190 299 -207442 260108 33409 -135528
18391 -386555 5979 -78668 -11924 71142 27033 -380357 -171058 256499 -107910 79722 -111016
18379 -12425 321316 -229646 -324109 -58968 123367 -95198 -61017 75354 234249 -95626 -43568
18367B49422G9296d3512B70774E3151K59496H0269e813A41676F5794g9789J2069
18356f7720E1282J47177g39709A17422P0152a88338F3147a6003j49461I2077b8297
18344c68310B40030f2867j37383J6520l2534A92922i5101H2569c21745A98473
18333a18602k73877J60794h1341k5674F8901a62542j59821D36060C0638c25869
18322h6067A56999F9763b96892M6305B8407N6121d5523D0020a6401E6037a58874
18310A35147F4848f2441k40564A2416c2168A75889J4248c66022F6662b43302i5979
18298c2713k2900p0072B44141F8256f4517l07003a21393c7979B31213c6684C09076
18286b10494h2690m5690D02789e8652p0059q1861C42594H3485b48584i9743m5512
$$ plain form
18367 249422 79296 -43512 270774 53151 312647 80269 -5813 141676 65794 -79789 -67720
18356 -67720 51282 198459 -739709 117422 187574 -188338 63147 -16003 -165464 92077 -28297
18344 -368310 240030 -62867 -200250 -183730 -216264 192922 -95101 82569 -321745 198473
18333 -118602 -392479 -231685 -81341 -107015 68901 -162542 -322363 436060 30638 -325869
18322 -86067 156999 69763 -296892 -250587 28407 84528 -45523 40020 -16401 56037 -158874
18310 135147 64848 -62441 -303005 12416 -32168 175889 190137 -366022 66662 -243302 -95979
18298 -32713 -55613 -125685 244141 68256 -64517 -371520 -121393 -37979 231213 -36684 309076
18286 -210494 -82690 -128380 402789 -58652 -128711 -210572 342594 83485 -248584 -99743 -145255
18275a45255i665n0015B37452C4390a70468A50929J27074c37821J38720h2280
18264f6676B94146a0654F1598K09244A5780J9747A7606J98661A2900M52973H6548
18252G776J88594g6954B21659b53090d4355k20482Q2598B7472b33673k81588C07414
18240d26791i0107q4523G0843J59446c67360d9371k69120C08939a02066h64q5134
18229h5998B26188A5177a53007E1932N1303L7814b8567D4106a13746k2109A4284
18217B05736h7293A31651b93275P1172h1280m11741g555k20848P8990k6312b660
18205a15626k3341e9266K225o0424C36842j56691b56337A86861g4114n0090A17297
18193e6762j37668g473n8396D9584i6034B70112c11058C0134a05085B52137b75167
$$ plain form
18275 -145255 -9665 -59680 237452 34390 -170468 150929 278003 -337821 -199101 -82280
18264 -66676 294146 -10654 61598 270842 15780 35527 17606 216267 12900 465873 86548
18252 7776 196370 -76954 221659 -253090 -44355 -264837 -182239 27472 -233673 -515261 307414
18240 -426791 -90107 -174630 70843 230289 -367360 -49371 -318491 308939 -102066 -864 -85998
18229 -85998 226188 15177 -153007 51932 103235 141049 -28567 44106 -113746 -135855 14284
18217 205736 -87293 131651 -293275 -222103 -81280 -493021 -7555 -228403 -149413 -175725 -2660
18205 -115626 -138967 -59266 -57041 -117465 336842 180151 -256337 186861 -74114 -124204 117297
18193 -56762 -194430 -7473 -65869 49584 -96034 270112 -311058 30134 -105085 252137 -275167
18181a08287B70748a40824k69090N1182a59272l03804i7932J6559A06324b7280
18170a33799B18139h8492k61294a34556a3343r465j38689n9113l8750J2767G0493
18158a41716c2428A36067b36536a3778H8947a22008L6219j74335a26876o5185
18148a92061f6440B61275F7422a92733a936k73000n501l0402E410K17564G934
18136G2139l0102f9774A7309p478e07731a26583b1799j89468d3006C0497i9842
18124b51681O7658P9373N381A58933b79827E6797b62567D900J58945a7021k23610
18113b40631E9007g0238D7895e5765k7829G5144J89824K17353h2685A02413N4082
18102A56495a39893H5385B8921Q5353D1765b44451J9884g3444C864J17013l9041
$$ plain form
18181 -108287 270748 -140824 -409914 -358732 -159272 -463076 -97932 -81373 106324 -27280
18170 -133799 218139 -88492 -349786 -134556 -13343 -22808 -161497 -220610 -259360 -246593 70493
18158 -141716 -32428 136067 -236536 -13778 88947 -122008 -85789 -260124 -126876 -192061
18148 -192061 -66440 261275 67422 -192733 -1936 -274936 -280437 -310839 5410 222974 7934
18136 72139 42037 -69774 17309 9831 -507731 -126583 -21799 -211267 -43006 30497 -99842
18124 -251681 -184023 -104650 -99269 158933 -279827 56797 -262567 4900 163845 -17021 -240631
18113 -240631 59007 -70238 47895 -55765 -83594 75144 264968 482321 -82685 102413 156495
18102 156495 -139893 85385 28921 114274 41765 -244451 -224567 -73444 3864 120877 81836
18091H1836a54856l6921G9414F880g8928L4235a7013B43593b1625k17230A06183
18079I5079C6766c1206k0874O073k97658A19534H816J0043Q949c3832m8868A87039
18066a47773j20304I3662J21999c6895C51381c42169B59410b42617d5884B58343
18055f3787j04938A51824b17759B67205k5171j02960C8237d9698j2468F483J15540
18044A22023K2993D0513a78906H8796C2892c06746A19749J16166E7392a9374A24293
18032I4021b99598G0493a61607A03716c55384a50989f7001H2840L066c0278B6689
18020b11369B232J10523a63177c3908j23042p6809I6079a94530A08828l6713O1332
18009A33447e4512J9646H1701b81564c4735A1566a93043D4009J6688c8279k64021
$$ plain form
18091 81836 -154856 -191777 79414 6880 -78928 -44693 -17013 243593 -21625 -238855 106183
18079 95079 36766 -31206 -52080 -46007 -343665 119534 8816 18859 27808 -33832 -82700 187039
18066 -147773 -268077 93662 215661 -36895 351381 -342169 259410 -242617 -45884 258343
18055 -63787 -168725 151824 -217759 267205 242034 139074 38237 -49698 -62166 6483 122023
18044 122023 145016 40513 -178906 88796 32892 -306746 119749 235915 57392 -19374 124293
18032 94021 -299598 70493 -161607 103716 -355384 -150989 -67001 82840 85906 -30278 26689
18020 -211369 2232 112755 -163177 -33908 -156950 -233759 96079 -194530 108828 72115 133447
18009 133447 -54512 -34866 81701 -281564 -34735 11566 -193043 44009 60697 -38279 -302300
17998c02300A17552a89669P8827C12313d5682J8837n9218M1543A26158l2983Q8423
17987A81598a8373k95014a03348A35074k0501l1445a55116P5457G6568p945J51587
17976B20210C4343j604a62609N4302Q748q9590b4929A42539J4842O0213b79096
17964a59365g5888o3656A36946n1652J2277D1004b9618j80334A56475b7721r3296
17953a21017G1134i8256A27502m1598P3576Q0888K51468d9776j77424H7202a82886
17941a0450H2988K083E42L0483d7923B9477n000a51468j35590E6559Q0182D6659
17928g0852k209B58531i2286k47441B38651m3010A9729b78070a16764C8119L754
17917D1873d2129k99034H0185b00469A81334b95907A99525a37237B4041L08746
$$ plain form
17998 -302300 117552 -189669 -110842 312313 -45682 -26845 -86063 -44520 126158 93175 181598
17987 181598 -18373 -313387 -103348 135074 114573 83128 -155116 -79659 76568 68623 220210
17976 220210 34343 32739 -162609 -108307 -99559 -189149 -24929 142539 157381 217594 -279096
17964 -159365 -75888 -139544 136946 85294 97571 41004 -29618 -209952 156475 -27721 -121017
17953 -121017 71134 -98256 127502 85904 159480 240368 491836 -49776 -227200 87202 -182886
17941 -10450 82988 85071 542 31025 -47923 29477 24477 -151468 -287058 56559 136741 46659
17928 -70852 -73061 258531 -92286 -339727 238651 195641 19729 -278070 -116764 38119 41873
17917 41873 -42129 -341163 80185 -200469 181334 -295907 199525 -137237 24041 332787
17907C32787c3778j71911E7847g5880A8968a31807j74304J00453j07522Q1260
17897b31920A81368F9766e3912k9840A97408J3991d8598H4690O346g6870l3664
17886a10534c0995J0439p1803j04683k94187D825M9385K33532A7656K48121a4705
17874a03444B28437b5302k00487N2621b5806p7477C55061A25304d5279B76357
17863a14016A37701c09329f3926A57729J42324r0647C9031J11054g4781b401k73997
17852b76398A14887i096j47420H9976l1296b0369k1767k21370G3708a21951n506
17841a27457A77556A9404J27082a23296B4698b98051r9002N3851a00567B18998
17830a32435C47164g9552m5180p9705A92924a20444o9166H4467B8788a5175k98197
$$ plain form
17907 332787 -33778 -205689 57847 -75880 18968 -131807 -306111 -205658 -313180 -231920
17897 -231920 181368 69766 -53912 -83752 197408 211399 -48598 84690 91036 -76870 -110534
17886 -110534 -30995 -20556 -92359 -197042 -491229 4825 54210 287742 17656 265777 -14705
17874 -103444 228437 -25302 -225789 -173168 -25806 -103283 355061 125304 -45279 276357
17863 -114016 137701 -309329 -63926 157729 300053 209406 39031 150085 -74781 -2401 -276398
17852 -276398 114887 -9096 -156516 89976 58680 -20369 -42136 -263506 73708 -121951 -127457
17841 -127457 177556 19404 146486 -123296 24698 -298051 -397053 -343202 -100567 218998
17830 -132435 347164 -79552 -124732 -204437 192924 -120444 -189610 84467 28788 -15175 -313372
17819c13372d0497j04240p4769b6381j74235O7762o3835I4133a35688A02383g4365
17807B63272b65834j73810B09906a42918k5969g5704l6938A59701a23426C7978
17796A59820c13194A16861O2016g5614n2759k21872B57992G7561i2196o6220j17295
17785b75711H8178g1576j27569P0890N8593I101b8281e545B0909g7460B0555a17919
17772B55926j17993a76082D0924J15716i5191A78605a38350A02025Q7932a34696
17761B96159b55593g285E8401b66450A87589b10554E0098k710h5843j9833l2969
17750a38645I0727q441A7380Q1073l889b73245I8872a8069D47849g8877A5466
17738B40199c81875d6252k78833i0616A28874J13761B8329M9843b804A7181J48801
$$ plain form
17819 -313372 -40497 -144737 -219506 -26381 -200616 -132854 -196689 94133 -135688 102383 -74365
17807 263272 -265834 -439644 209906 -142918 -168887 -75704 -112642 159701 -123426 37978
17796 159820 -313194 116861 178877 -75614 -128373 -350245 257992 77561 -92196 -158416 -275711
17785 -275711 88178 -71576 -199145 -128255 -69662 9101 -28281 -5545 20909 -77460 20555 -117919
17772 255926 137933 -176082 40924 156640 -95191 178605 -138350 102025 189957 -134696
17761 296159 -255593 -7285 58401 -266450 187589 -210554 50098 47388 -85843 -105676 -138645
17750 -138645 90727 82286 17380 98453 94564 -273245 98872 -18069 447849 -78877 15466
17738 240199 -381875 -46252 -325085 -90616 128874 242635 28329 78172 -2804 17181 165982
17727A65982J04805j1867K9443A32429e2146C8811J10537A0000R7292l4603H2
17715C39794d14197g8566G5324j7446a80922k01109B49437h0731B2455b70919
17704B0787L44466b53191Q3215B91510C5499J73747K1330j11051G098a08084C84284
17692a57097c4091G4416a3881j87103D286J51287i3440A01334J21925c6809B89866
17680A66420d6095A9394e9143A43790b55590A18360D7309i8574B48694a04076
17669d1591j37916A60254l8318J7516B6436c7932n2059A25297L0381c22415c5995
17657a90672J46A36044b6658j39052j18486K8209A8990J92923n4985p612o8776
17646H0540a53138r577A32860f3603j09699A25279N738F2406c01477h4340B95241
$$ plain form
17727 165982 270787 258920 288363 132429 -52146 38811 149348 10000 107292 72689 82
17715 339794 -414197 -78566 75324 57878 -180922 -382031 249437 -80731 22455 -270919
17704 20787 365253 -253191 -169976 291510 35499 209246 230576 119525 7098 -108084 384284
17692 -157097 -34091 74416 -13881 -200984 4286 155573 -93440 101334 223259 -36809 289866
17680 166420 -46095 19394 -59143 143790 -255590 118360 47309 -98574 248694 -104076
17669 -41591 -179507 160254 121936 139452 26436 -37932 -89991 125297 155678 -322415 -35995
17657 -190672 -190526 136044 -26658 -165710 -284196 -255987 18990 211913 156928 149316 80540
17646 80540 -153138 -162715 132860 -63603 -173302 125279 131017 62406 -301477 -84340 295241
17634b34937C23063J70626B41977a62357A40337C4572J55686b63234A55980e5471
17623A24252a53847f1853B3836a98286d9359C7835L01025F6036O1594a78764F3568
17611B91772q7124q9195a14020A66811J1903O3370I2664l599D0444J73202a54545
17599d843m06765A98566k2071K0808I1811b06744a2374D5236O4367K31507b71568
17587d9123i309D73a43202A536M3548c2809j82051a5141j70954I5046f0581G8499
17574G6667P4549A1062a69018B39165H5017M3449a94903f7356B53649C6161e6444
17562A4361L09035a27151A52246l1322d033B967h0502j0629C1247M27691A29261
17550c42512B76909b1202c579j55221F3627L0741h8892E7654J9226b62508H9397
$$ plain form
17634 -234937 323063 493689 241977 -162357 140337 34572 190258 -263234 155980 -55471
17623 124252 -153847 -61853 23836 -198286 -49359 37835 338860 66036 127630 -178764 63568
17611 291772 204648 115453 -114020 166811 178714 242084 92664 89065 40444 213646 -154545
17599 -4843 -411608 198566 176495 197303 91811 -206744 -12374 45236 109603 341110 -271568
17587 -49123 -9309 473 -143202 1536 45084 -32809 -214860 -15141 -186095 95046 -60581 78499
17574 76667 151216 11062 -169018 239165 85017 128466 -194903 -67356 253649 36161 -56444
17562 14361 323396 -127151 152246 120924 -4033 2967 -80502 -91131 31247 458938 129261
17550 -342512 276909 -21202 -3579 -158800 63627 94368 -88892 57654 76880 -262508 89397
17538E3741J50866M9903j6925o7275d9667o636B30810I085K19904m0804a4590
17526A52534R946a55328a6244j5965o3887B27682M4551f9826A72180j0453J12234
17515B73961I5947k3756j9385c7852A49646L15747g213j67083d7491A16437g713
17503A59694p2782D0730L8073h6237H9476C7350A1021J71142C7618M79581h4545
17491A48224a93475I4160L5251b57226C11553P0720j23498a88827c0645A53568
17480A51215Q5991K48201c341B20310o06P0230o4917m1027J16274J12983A04233
17468A46155a054A66495B3350b7220B09568d6404E9919J2140e0747i44I3442C0243
17455D82332B00308m1135a15295A66717R1161J59360k9407i1510A28336K46582
$$ plain form
17538 53741 204607 254510 237585 170310 -49667 -56303 230810 9085 228989 188185 -14590
17526 152534 162480 -155328 -16244 -32209 -96096 227682 272233 -69826 172180 161727 273961
17515 273961 95947 72191 52806 -37852 149646 465393 -7213 -174296 -47491 116437 -7713
17503 159694 86912 40730 78803 -86237 89476 37350 11021 182163 37618 517199 -84545
17491 148224 -193475 94160 129411 -257226 311553 382273 258775 -188827 -30645 153568
17480 151215 237206 485407 -3341 220310 219704 289934 225017 183990 300264 413247 104233
17468 146155 -1054 166495 23350 -27220 209568 -46404 59919 72059 -50747 -944 93442 30243
17455 482332 200308 159173 -115295 166717 257878 417238 387831 -91510 128336 374918
17445C74918j64111j3383n1042K18753j28073A03741J74250A21054a26550B47072
17434B48252k505q1029J97746j60732j5025J17299o0787K0226j12953M0706J74387
17423C65585A82252r0510N8763b45863B78796b06005A52988P1671J02363m2168
17413B84854j1848p3004n3449a7650A18887J74149A05496l1573K65285A17309
17402C2953J08686J39206C8408J6624K42014o8582B3050Q7706J72228a9148A56703
17390C61286A17583K3436i883E9999P878K23369a96535N1731C4424d398C03662
17378F8868k1822J91993B6168L93741j06172p1779b06843A19397e1855A34441
17367i1902G140K10588q7972J00831J45401J9602D2225a66240A81579K43111j45590
$$ plain form
17445 374918 210807 197424 146382 365135 237062 103741 277991 121054 -126550 247072
17434 248252 245747 164718 362464 201732 186707 304006 243219 263445 150492 191198 365585
17423 365585 182252 91742 150505 -245863 278796 -206005 152988 224659 327022 284854
17413 284854 273006 200002 146553 -17650 118887 293036 105496 73923 339208 117309
17402 32953 141639 280845 38408 55032 297046 228464 23050 110756 282984 -19148 156703
17390 361286 117583 141019 -9883 59999 67877 291246 -196535 -144804 34424 -4398 303662
17378 68868 47046 239039 26168 419909 313737 241958 -206843 119397 -51855 134441
17367 -91902 7140 217728 129756 230587 375988 395590 42225 -166240 181579 424690 279100
17356B79100G8263n906N5345a5990A97947f4509B45318l638f404C97975r2559
17345C05416G4262N6961J77296j45497R8836R2577R9937b83736J18867C01133
17334B32674b03947E5136b9290D48518g1153C21660A04957K17116m3173p1352
17324B07548L4221A01390m1826R3636D8308J77537J5678G5122R9172G2027d711
17312A72272n7531m859b30794A66937a72725A86101B7681K42441A22837J25334
17302B48171A15379L4071N8643j2233b5141C80574j69232m4583J9397J68374j37955
17291B16575N7666J71493n7115j38038g8106B4112K81571A4038L3695M21417B12788
17279D3000Q9747j676L1913J20673j24548M6046A3029N64690A52597m0283M72940
$$ plain form
17356 279100 78263 72357 127702 -15990 197947 -64509 245318 241680 -6404 397975 305416
17345 305416 74262 131223 308519 163022 261858 354435 454372 -283736 -164869 301133
17334 232674 -203947 55136 -29290 448518 -71153 321660 104957 322073 278900 207548
17324 207548 241769 101390 59564 153200 48308 225845 241523 75122 174294 72027 -4711
17312 172272 114741 109882 -230794 166937 -172725 186101 27681 270122 122837 248171
17302 248171 115379 149450 208093 195860 -25141 380574 211342 166759 186156 354530 216575
17291 216575 274241 445734 388619 250581 -78106 24112 305683 14038 47733 469150 212788
17279 43000 132747 131071 162984 283657 159109 205155 13029 577719 152597 112314 585254
17268E85254B68734a60244B78565J12461A67361L15469A51562J67707A16939r718
17258A07221L12778I9887j6472M913J79446c01988C97J53414K49285a92012j84115
17247c76127C07528j36499J27857k8087r2445o6414K05641J35537l3668A12889
17236D37886j13908o4163p4997H0125d5066C73909j70877J94459n5597j44399
17226A97495E9509M166L25744n6611q7272k1665L00489f3343A29572L41114j50111
17215C20575R1070B2208O81057C30495R2941A92662J20071C0734K39933J84267
17205D54934J05364k23955K14606k46441J34286a1552B07426K37780A86363L7382
17195B23745R1559K4315g5245F6091b8281A86615j9245J55541a82271E03955B10287
$$ plain form
17268 585254 268734 -160244 278565 391026 167361 482830 151562 319269 116939 107221
17258 107221 419999 99887 83415 88328 267774 -301988 397 153811 403096 -192012 -376127
17247 -376127 307528 171029 298886 270799 178354 111940 317581 453118 419450 112889
17236 437886 323978 259815 184818 80125 -45066 373909 203032 397491 341894 197495
17226 197495 59509 63675 389419 332808 245536 223871 524360 -63343 129572 470686 320575
17215 320575 411645 22208 703265 330495 423436 192662 312733 30734 270667 454934
17205 454934 560298 336343 550949 304508 438794 -11552 207426 445206 186363 223745
17195 223745 315304 339619 -75245 66091 -28281 186615 167370 322911 -182271 503955 210287
17183C7440L34178j73510N8537A28166J90624A26757L22080j72758J14445l3221
17173C57303r5841J33401A46287K54043j11581A29406n4719K41478r4696K46487
17163D67956j62507q2026L42852A90076K15806J41814j09889B12915J09146J09169
17153D31230J0358p8964K23396k4167j73415A90910L79660o4705R6463A04021
17142D02134J61446k00842C6373L36532r4865R357J08260j05433A00002M04085
17132E04087k32811J89437M7420A92615K01217A21634K4996M16563k26151K10152
17122E47194k1119J23280j58205j27628J12630k23873M25546B88124L30517C02499
17111D17233r0825J98118M3804N8848C10558L45826j40931K557K73473k62083
$$ plain form
17183 37440 371618 198108 256645 128166 318790 126757 448837 276079 390524 357303
17173 357303 261462 394863 146287 400330 288749 129406 74687 316165 221469 467956
17163 467956 305449 223423 566275 190076 405882 547696 437807 212915 322061 431230
17153 431230 441588 362624 586020 561853 388438 190910 570570 505865 602328 104021
17142 402134 563580 362738 36373 372905 278040 287397 395657 290224 100002 504087
17132 504087 271276 460713 508133 192615 393832 121634 146630 563193 337042 547194
17122 547194 526075 649355 491150 363522 476152 252279 677825 288124 618641 302499
17111 417233 326408 524526 568330 627178 310558 656384 515453 518010 791483 529400
17101E29400n2167J839J95219o7113A07005L03700R1419j44001L48514k37009
17091D69628K04870j01599j76027J25160A83740L53204n188J08243j13237K21084
17081G47846G1629L14278L06509j21952o5835K63444C66158J49434k5918k0296
17071D69378J16129K47553j85491k37133l4820J00365J19721l0665K12669k73502
17061E04204J49240k21834j36964K2446J00229L65049k37276J33510m6804O0539
17051F92339q1094p9292L26413m25391j04971L74091k19747k11885K53861k5990
17041D98334j0605L21052r5425l07268M01604j45371M1786L1829k09589L57480
17031H83827m37661K59326M0749l8400K5374Q5386j91352K64401q8150p6372k08635
$$ plain form
17101 529400 477233 479072 674291 607178 107005 410705 502124 358123 706637 469628
17091 469628 674498 572899 396872 522032 183740 536944 531756 639999 526762 747846
17081 747846 71629 385907 692416 570464 504629 768073 366158 515592 489674 469378
17071 469378 585507 833060 647569 410436 375616 475981 595702 565037 777706 504204
17061 504204 653444 431610 294646 317092 417321 782370 545094 678604 631800 692339
17051 692339 611245 531953 858366 432975 328004 702095 482348 270463 524324 498334
17041 498334 487729 808781 713356 406088 807692 662321 704107 735936 526347 883827
17031 883827 446166 705492 746241 707841 733215 818601 627249 891650 803500 727128 518493
17020E18493L79390J04061j24135q0505B55583M05291J88348j472k605l8796q990
17009G97359k92405O19625m33896L15779R0980k7142M9849m05891j27065L4829
16999F22022L66237J64107D10350N01554j62535J91328J55565j72869P4855k03851
16989G94397K55942k14084J6747K40330n0124j58982J2568l8958R1529R9682k97259
16978G51788N61624k62673N6504J74654r8357j0842J82029K54162m62107J01180
16968A247962k08196m8425J18544j8327K56232k69731L9558K04196P7445j29853
16958A269405j42904L27892k57356J13337J5835p9411J05920J96487k81221n6610
16948A211374J98441K52327n69174K11031M9923J17235k78407p092J65586J99001
$$ plain form
17020 518493 897883 1001944 877809 797304 255583 660874 849222 847750 845145 806349 797359
17009 797359 504954 1124579 690683 1006462 1097442 1070300 1120149 714258 587193 622022
16999 622022 988259 1152366 410350 911904 749369 940697 1096262 923393 998248 794397
16989 794397 1050339 836255 853002 1093332 1043208 884226 896794 857836 949365 1049047 751788
16978 751788 1313412 1050739 1107243 1281897 1183540 1172698 1354727 1608889 1146782 1247962
16968 1247962 1039766 991341 1109885 1091558 1347790 1078059 1117617 1321813 1399258 1269405
16958 1269405 1126501 1454393 1197037 1310374 1326209 1246798 1352718 1549205 1267984 1211374
16948 1211374 1409815 1662142 1092968 1303999 1353922 1471157 1192750 1185658 1351244 1550245
16938A550245j36679m0398J50384J65152J9232j72831L7139L1483j51048J19116
16928A571795L6616N20194p26812K53374j61173M84702k14790L40173l71249M8322
16918A781152N03j72188L40247R8431k68527L03148J49030o22568J12380M9700
16908A771308L4471J13719j74046L84580M9211q6641J73387k84755K40806j06324
16898B115716J61247j02694L8115J20325k77962P20549n98792q992K31543r3948
16888B305107K30617n36539M65482K84837j7595K3538k16714k42711K29599K19647
16878B745268R8608k16592J42998L6363j44922p5342L92073J80807K6176r695
16868C175742M3217l0443Q5413j75059K80840O815p9996j4317J060j72038N43976
$$ plain form
16938 1550245 1413566 1373168 1523552 1688704 1707936 1535105 1572244 1603727 1452679 1571795
16928 1571795 1608411 2128605 1401793 1655167 1493994 1978696 1763906 2104079 1732830 1781152
16918 1781152 1781655 1609467 1949714 2048145 1779618 2082766 2231796 1609228 1721608 1771308
16908 1771308 1805779 1919498 1745452 2130032 2179243 2092602 2265989 1981234 2222040 2115716
16898 2115716 2276963 2174269 2212384 2332709 2054747 2775296 2176504 2167512 2399055 2305107
16888 2305107 2535724 1999185 2464667 2749504 2731909 2755447 2538733 2296022 2525621 2745268
16878 2745268 2843876 2627284 2770282 2806645 2661723 2586381 2978454 3159261 3185437 3175742
16868 3175742 3218959 3188516 3273929 3098870 3379710 3386525 3306529 3292212 3293272 3121234 3665210
16857C665210K2375j14163j6042m8098K26200K66176k83872K95705J69232j93659
16847C989064J13884P3573J17881O5250K65251l08457J1670M56699P9323k99472
16837D564666r7204M68825L5953p2279n6361N64799j38554r917K82452p4130L89804
16826E858054o19928M55005J21781J48178N79022k99209L98415j48398L36919
16817F829839J57803l03535N64062m4741l105M79743J79717j29568N33899q5138
16807H178976K43473j92531N18784L47355J50504Q4992l048O07911k65017P49373
16797A0420772j35066O72699N5590L3253M89926O8785K62412P08636j57521P81445
16787A3200931M84367J57520K55369M01719O43829Q7082M97176N33339J12967
$$ plain form
16857 3665210 3687585 3573422 3557380 3509282 3735482 4001658 3717786 4013491 4182723 3989064
16847 3989064 4102948 4176521 4294402 4359652 4624903 4316446 4328116 4784815 4864138 4564666
16837 4564666 4467462 4936287 4972240 4899961 4843600 5408399 5269845 5259928 5542380 5468250 5858054
16826 5858054 5238126 5693131 5814912 5963090 6542112 6242903 6641318 6492920 6829839
16817 6829839 6987642 6684107 7248169 7203428 7200323 7680066 7859783 7730215 8264114 8178976
16807 8178976 8422449 8229918 8748702 9096057 9246561 9331553 9328505 9936416 9671399 10420772
16797 10420772 10285706 10958405 11013995 11047248 11537174 11605959 11868371 12577007 12419486 13200931
16787 13200931 13685298 13842818 14098187 14499906 15143735 15230817 15727993 16261332 16374299
16778A6374299R74377L38570M42415Q71631K11024R19878L06422P75941Q74900
16769B2089457O36981Q08844Q58574J103970J005598O64754J047123R86031J009966
16760C0211298J091118J758864J267710J375692J124717K075185J496633J340817
16752D1742034K008841K004071K154404K411973K342522K176699K873250K830804
16744F0544598K998693L419458L052047L707785L819438M014691M413735M425723
16736I0396168M750393N017536N257936N549736O120746N630314O222487N959946
16728A34905262O158007O395275N929806N184535N607734M784277M301171L429032
16720A76695099K892206J932108R48402K9881p93574k086594k834376l731448
$$ plain form
16778 16374299 17348676 17687246 18129661 19001292 19212316 20132194 20438616 21214557 22089457
16769 22089457 22726438 23535282 24393856 25497826 26503424 27168178 28215301 29201332 30211298
16760 30211298 31302416 33061280 34328990 35704682 36829399 38904584 40401217 41742034
16752 41742034 43750875 45754946 47909350 50321323 52663845 54840544 57713794 60544598
16744 60544598 63543291 66962749 70014796 73722581 77542019 81556710 85970445 90396168
16736 90396168 95146561 100164097 105422033 110971769 117092515 122722829 128945316 134905262
16728 134905262 141063269 147458544 153388350 158572885 164180619 168964896 173266067 176695099
16720 176695099 179587305 181519413 182467815 182497696 181704122 179617528 176783152 173051704
16712A73051704m242395n055740n326153o029889n509874o603998o091223o409180
16704A27783252o314418n826803n888711n849955n170962n082232m720279m596652
16696H4333240m975662l931147l687217l644120l517597k950051l531973k447346
16688E5648127k903218k202713k520819k356580k311081j715238j998863j560821
16680C8078794j520722j793565j511362j205383j080278j609743j082860j059368
16672B7215513j001487q29019j315304p69961o74543j249237k67348p79853n64784
16663A9763977r58755k91286r33967n12606k73743q32331j00909q47751n07187
16654A4505442n2145q43015m96698l51569k54858m31191q5645m83992l37800K4997
$$ plain form
16712 173051704 168809309 163753569 158427416 152397527 146887653 140283655 134192432 127783252
16704 127783252 121468834 115642031 109753320 103903365 98732403 93650171 88929892 84333240
16696 84333240 79357578 75426431 71739214 68095094 64577497 61627446 58095473 55648127
16688 55648127 52744909 50542196 48021377 45664797 43353716 41638478 39639615 38078794
16680 38078794 36558072 34764507 33253145 32047762 30967484 29357741 28274881 27215513
16672 27215513 26214026 25385007 24069703 23299742 22625199 21375962 21108614 20328761 19763977
16663 19763977 18805222 18513936 17579969 17067363 16793620 15961289 15860380 15012629 14505442
16654 14505442 14453297 13610282 13113584 12762015 12507157 12075966 11990321 11506329 11168529 11193526
16644A1193526p69094j0718k09050l29773k10296k00791m95827r4074J20309n56848
16634H437364j71010j73517j78406l75916j37081K12902m73429k41206j4067j99781
16624F685853k7326l20282q8630o9155n1851j99212l9008k26063R5400k42904
16614E516822K96581m35532k75191j9416k2480k07512j35881k7096L714l299P0829
16603D761539k92924J12321m70736k12359K33464j79808k19076L85918k13050
16594C905289j85971p2883j9629k7903k25820O0247j05433k7974l9921K42828
16584C502830m62112L97062j41220j55355J14076n57514o9681J55810J87554l20451
16574B650999p1305k02810K96230k22460K79841l12303L23662m21059j58539L72117
$$ plain form
16644 11193526 10424432 10413714 10204664 9874891 9664595 9463804 8967977 8873903 8994212 8437364
16634 8437364 8266354 8092837 7914431 7538515 7401434 7614336 7140907 6899701 6885634 6685853
16624 6685853 6658527 6338245 6249615 6180460 6128609 5929397 5890389 5664326 5759726 5516822
16614 5516822 5813403 5377871 5102680 5083264 5060784 4853272 4717391 4690295 4694009 4690710 4761539
16603 4761539 4468615 4580936 4110200 3897841 4131305 3951497 3732421 4118339 3905289
16594 3905289 3719318 3646435 3626806 3598903 3373083 3433330 3327897 3299923 3260002 3502830
16584 3502830 3040718 3437780 3296560 3141205 3255281 2697767 2628086 2783896 2971450 2650999
16574 2650999 2579694 2376884 2673114 2450654 2730495 2418192 2741854 2320795 2162256 2534373
16564B534373l25967r4004k16883N52115k96660l77429L51264j39627K86547p445
16554B266284l49618K3081L30276l05640J10081l01863L182j9679q4046O9630
16544A741688m587k17251M19422k28008m5771j22853J33242j62273p0366J80654
16534A623897J511J24804k43227p6495j1281K57265P3687l58673J12515m45424
16524A058579K84425J30466K9870l70859J43784k51018J36268J15456j53271K9003
16514A152703j86344J03720J18954k22572K78395r2386j00249L96752k00466k70414
16504I78093L96748k63501l13092K09409K14478k00177n6197l8102j46759O6906
16494H47806K98200O1743k27334k63521J76059o4617K28700j47528n524r17J30054
$$ plain form
16564 2534373 2208406 2114402 1897519 2449634 2152974 1775545 2126809 1987182 2273729 2266284
16554 2266284 1916666 1939747 2270023 1964383 2074464 1772601 1775783 1756104 1672058 1741688
16544 1741688 1737101 1519850 1939272 1711264 1665493 1542640 1675882 1513609 1443243 1623897
16534 1623897 1625408 1750212 1506985 1430490 1419209 1676474 1750161 1391488 1504003 1058579
16524 1058579 1343004 1473470 1503340 1132481 1276265 1025247 1161515 1276971 1123700 1152703
16514 1152703 966359 1070079 1189033 966461 1244856 1152470 1052221 1448973 1248507 978093
16504 978093 1374841 1111340 798248 1007657 1222135 1021958 965761 927659 780900 847806
16494 847806 1146006 1207749 980415 716894 892953 828336 1057036 909508 903984 903067 1033121
16483A033121n2754k22187J24681P8368J17924j71121k06942N0458K71869k40853
16473G82564l2788J66317k18231J43052j30716k0947K48113K27975n07991K07289
16463H64637C82530K86930O07n847K52745m51230L71802k15916K5003j54477L39362
16452H31509n1165j4321n869j72310o1886K1126P9553j84420M38565C61565L49088
16441G10653k20528L1001j00750M84479m00612N9955J63758n3403j56957J72465
16431F90061C26015L78087j72390A76611L14557L0028k4287r9654J9533l9344
16421C77444j02649K32368N6042J15820k77188p8648M5284J09365j2797j95972
16411B69069K69945j24840K46597j24439p8457J63396k26196j48060K60472r3591
$$ plain form
16483 1033121 980367 758180 882861 961229 1079153 908032 701090 751548 1023417 782564
16473 782564 749776 916093 697862 840914 710198 689251 937364 1165339 657348 864637
16463 864637 382530 669460 670067 664220 916965 465735 837537 621621 646624 492147 831509
16452 831509 780344 766023 760154 587844 525958 547084 626637 442217 880782 361565 710653
16441 710653 490125 521126 420376 904855 504243 564198 727956 674553 517596 690061
16431 690061 326015 704102 531712 176611 491168 521196 496909 397255 416788 377444
16421 377444 274795 507163 563205 679025 401837 323189 368473 477838 465041 269069
16411 269069 539014 414174 660771 536332 457875 621271 395075 247015 507487 413896
16401D13896J1426j09214K18950J53849C14697K02271J40476B76539M602L40635
16391F21776g5484D33023r7196j16987K51868j41761P9381r158F7617N24035A92277
16379D81785B22136J11383J00878l3606n5197j0749K4448K80776B78671J92195
16369D70866p3788N9044j22922l0886G2006J14061J77228n2015J65543A90808
16358E1661Q1852L75630o6031j05237g8731E7474L59102m7598l3262J741p2066
16347B65391M4107K31321E8202a0294B16297N3620A30230P5802J03490A1033M5711
16336E6744J86969M2833K5172O1716a56989C07104k8443J3728j2456J10424G8092
16324F2849J14316K54094e7267A77891O2692K04364A79276J0108J51748M320a21724
$$ plain form
16401 413896 425322 316108 535058 688907 314697 516968 657444 276539 281141 621776
16391 621776 -75484 433023 335827 218840 470708 328947 408328 399170 67617 591652 192277
16379 481785 222136 333519 434397 400791 345594 334845 359293 640069 278671 470866
16369 470866 397078 456122 333200 302314 72006 186067 363295 311280 476823 190808
16358 51661 133513 509143 443112 337875 -78731 57474 416576 368978 335716 337457 265391
16347 265391 309498 540819 58202 -10294 216297 269917 130230 206032 309522 11033 56744
16336 56744 243713 286546 311718 373434 -156989 307104 278661 292389 279933 390357 78092
16324 62849 177165 431259 -57267 177891 240583 444947 179276 189384 341132 345452 -121724
16312b61848D86788A70085H1319J03095J90345l6739o8596I772L00913g037F03566
16300B24307e9744C79773b1535B77107Q8114l1762j57900O0630F9696B9987J78968
16289B08955J67753J07688B7839a2528A48732l9043R9381A02551C5409N9455K3701
16278A18565P8588E4526A5273N3305J36156J28648m6761p721N3531A39446g9573
16266B99437A29941Q3463C9681K68703a43364b5747C34668o0671j14760n7867
16256A01370k6530g9583L7408E48697B09891O2632m3208A7888L07108K2h1784
16244g980A5667b60858a02805D68991A58584J01378A16506a42500A34185G271
16233G1771e3471k5532D27714j08958g5612B79644A33848e9384A33869n219J38125
$$ plain form
16312 -261848 486788 170085 81319 184414 374759 338020 269424 9772 310685 -7037 603566
16300 224307 -59744 379773 -21535 277107 365221 333459 175559 236189 69696 29987 208955
16289 208955 376708 484396 27839 -12528 148732 109689 209070 102551 35409 94864 118565
16278 118565 197153 54526 15273 68578 204734 333382 286621 278900 332431 139446 -79573
16266 299437 129941 213404 39681 308384 -143364 -25747 334668 273997 159237 101370
16256 101370 74840 -79583 -42175 548697 209891 272523 229315 17888 324996 325018 -81784
16244 -7980 15667 -260858 -102805 468991 158584 259962 116506 -142500 134185 7271
16233 71771 -53471 -79003 427714 318756 -75612 279644 133848 -59384 133869 128650 266775
16222B66775j14072a01967m376C55931j00663j0318m7739h3413B6186a18425K6144
16211i2281m5293e7606A17138a78154C53535g5366C00381A6023J41770a69586
16200B01513J64817F4908M618J66948a92695P9521D81850A30446L6784F2243N4435
16189A16678K9406E8025K99777j78688a86948l9080C05115C7732P5830b0443j88029
16178b08472B77348b619B21126g3124B89388A8838a30068B01214a9054j97382
16168b16436C5728p546L855L989R3139a37239B97957a35836A86829a78517c6679
16156b86954R6518B75421A08687C5783J73035O2932a1039k19728R3866O5665l6861
16145a08097A74568f7399I6935b51999I6641O1219o7765i335C2012J61888K2756
$$ plain form
16222 266775 152703 -101967 -106343 355931 255268 244950 197211 -83413 26186 -118425 -92281
16211 -92281 -137574 -57606 117138 -178154 353535 -75366 300381 16023 157793 -169586
16200 201513 366330 64908 69526 236474 -192695 -113174 481850 130446 167230 62243 116678
16189 116678 146084 58025 357802 179114 -186948 -226028 305115 37732 113562 -20443 -208472
16178 -208472 277348 -2619 221126 -73124 289388 18838 -130068 201214 -19054 -216436
16168 -216436 35728 28182 32037 36026 129165 -137239 297957 -135836 186829 -178517 -36679
16156 -286954 -190436 275421 108687 35783 208818 271750 -11039 -230767 -136901 -71236 -108097
16145 -108097 174568 -67399 96935 -251999 96641 157860 90095 -9335 32012 193900 216656
16134B16656m4738h250G3745o936N702a91962A56059B1992b24622B01731b8608
16122b13475O1866l29875B18854a68299l7940a4584A33994F3101R342c53551i0622
16110I8147a66923f7510C5667d5110H0705a77500C6084K48752g2993A19083H503
16098D7655a20170C4830d8615k34169E5451J09146a52009O8818e039I5693a57122
16086d1981r2749A12685a09809M9889C4777J4017f3701C7697c64991A31844b17599
16074b60198C707c4677A50293b20861b7570k8983A68848R2430r0876a42558n6305
16063a98863B67786j29238f5252C30943n7486a79925G3841a53041E3987b2823
16052b04784B39980m1325e6102B78314c6382j01798e9844D3832J18172a43116
$$ plain form
16134 216656 171918 -8250 73745 66809 72511 -191962 156059 21992 -224622 201731 -28608
16122 -213475 -151609 -481484 218854 -168299 -206239 -14584 133994 63101 72443 -353551 -90622
16110 98147 -166923 -67510 35667 -45110 80705 -177500 36084 284836 -72993 119083 8503
16098 47655 -120170 34830 -48615 -282784 55451 164597 -152009 -83191 -5039 95693 -157122
16086 -41981 -134730 112685 -109809 -59920 34777 48794 -63701 37697 -364991 131844 -217599
16074 -260198 3707 -34677 150293 -220861 -27570 -56553 168848 261278 170402 -142558 -198863
16063 -198863 267786 138548 -65252 330943 273457 -179925 73841 -153041 53987 -22823
16052 -204784 239980 198655 -56102 278314 -36382 -138180 -59844 43832 162004 -143116
16041A77046C8939b78973Q9310O8284A20902M2071A6740p662J29548d49911a37460
16029h5498j27075b4471B28613a32712A38973a9128L0F285O6303M103c18523B59742
16016A77046K1597o5424E1705a3432q2885c7247B47723b04973A45336d7584D1374
16004e59399h0696F3054O112D887a58076G262i7912k68149B98478f8993l4433
15993a03426G6930J46167e4348j78955H668a07900E4699A3348J00753J41113J74289
15982D29503R487O1869I3057K41977d8360A45027J4052a15668l1474A8441g6672
15970a99266j12305J45339A74989f3198J8938r0609B02806r4485K54094j56469
15960B05946O9335E7477a42647q7920j66994J04541d1691A35997o6093a21821
$$ plain form
16041 177046 38939 -278973 -189663 -121379 120902 162973 16740 9078 138626 -449911 -137460
16029 -85498 -212573 -24471 228613 -132712 138973 -19128 -19098 6285 72588 76691 -318523 259742
16016 177046 198643 133219 51705 -13432 -96317 -37247 247723 -204973 145336 -47584 41374
16004 -559399 -80696 63054 69166 4887 -158076 7262 -97912 -366061 298478 -68993 -103426
15993 -103426 76930 223097 -54348 -233303 8668 -107900 54699 13348 114101 255214 429503
15982 429503 438990 500859 93057 335034 -48360 145027 159079 -115668 -147142 18441 -76672
15970 -199266 -311571 -166232 174989 -63198 -44260 -134869 202806 108321 362415 205946
15960 205946 275281 57477 -142647 -230567 -397561 -293020 -41691 135997 69904 -121821
15949h7375o5140A59610q81a6475j82953a4417n920j35322h855o4706n4328a0270
15936h4726A01169D4641b61612h4596a9597G2744a96212j2923A93449M7132g8135
15924D77013a11031d642A60087g1922o9513j88025l5911J64321c3079D3479J57476
15913B00955b58253j82181J96275Q527R3378D7769a85931e0477r0540A3008O8227
15902H1235k374L1215E4109i2031j05476m6316A82561b36658m633j86864b3977
15890f9586H115O8688O180a03708M5371B40419A02411B8761K586P7399L3917a2974
15877d7922B6941K93221a05654o7407j10589N1054B40115O0176b96153g3052B64615
15865c6952A6466F895K83351A32391a01124o9751f9805C5677b1481n7587A29008
$$ plain form
15949 -87375 -152515 159610 158729 -16475 -199428 -14417 -20337 -155659 -8855 -73561 -127889 -10270
15936 -84726 101169 44641 -261612 -84596 -19597 72744 -196212 -209135 193449 240581 -78135
15924 477013 -111031 -4642 160087 -71922 -141435 -329460 -365371 -201050 -33079 43479 200955
15913 200955 -258253 -440434 -244159 -235632 -142254 47769 -185931 -50477 -141017 13008 81235
15902 81235 78861 110076 54109 -92031 -197507 -243823 182561 -236658 -241291 -428155 -23977
15890 -69586 8115 76803 82983 -103708 -58337 240419 102411 28761 31347 108746 142663 -12974
15877 -47922 26941 320162 -105654 -173061 -283650 -232596 240115 300291 -296153 -73052 264615
15865 -36952 16466 6895 290246 132391 -101124 -170875 -69805 35677 -21481 -79068 129008
15853d2174k4610l8722A20950c3798C02795I3343a3562n9013G7143a83301p2137
15842b55438b168F1942b44603A57217f7442G1917C0184K64554E5482L42315a14886
15830B07J34934b42005c7529J580A57368e0259j22614e5911a094m7162l5672C40641
15817A31411o2397b41977k1882C23692D0079b34445L2404e6885E8837P4232K460
15806A35529A1072N5675j3670a84339M8940O3752l9527H5451a00290b2634k00819
15795b23453J0088A85575D9005c2018A16465L395b954n2954C2169a12611A8596
15783G16J06602A4127a25088j0160D057a53059d7320A90871b18380A95985O8989
15772B64974a43533M8693L3095l7585o860L311B68485b01888P5409M2413A91388
$$ plain form
15853 -42174 -66784 -105506 120950 -33798 302795 93343 -13562 -72575 77143 -183301 -255438
15842 -255438 -2168 61942 -244603 157217 -67442 71917 30184 294738 55482 397797 -114886
15830 207 135141 -242005 -37529 -35949 157368 -50259 -172873 -55911 -1094 -48256 -83928 340641
15817 131411 69014 -241977 -263859 323692 40079 -234445 -202041 -56885 58837 133069 135529
15806 135529 11072 66747 53077 -184339 -135399 -71647 -111174 85451 -100290 -22634 -223453
15795 -223453 -213365 185575 49005 -32018 116465 119860 -2954 -55908 32169 -112611 18596
15783 716 107318 14127 -125088 -135248 4057 -153059 -47320 190871 -218380 195985 264974
15772 264974 -143533 -94840 -61745 -99330 -106190 -102879 268485 -201888 -126479 -84066 191388
15760a26545B59617r0200a23942m7428c2310B4341i0899d1290p6357b3620A72076
15748B12545h3769O105j86325A71234b83439A22958O4251g2187A84468b53510
15737a01352L0859A1559b6145G2931H574c9616k59183C8443c27530D72950d4605
15725a88046k2352A45679f3049j94630l6921A3029J2505a84604B6402K3068N4493
15714A03963J05371g1297F9185a07440F3457a91012o5762g2156j61018A21194
15703c11742E5823f4559D4277E370L65871A26848h6200L9335A31369E0252J13191
15692A63443J6500k3878c0439k11259P5945A28757e3993C00384a63195A78719
15681A40486E7584a41374j19184c926G1981O8847C4419d46640C11981f7751k8743
$$ plain form
15760 -126545 259617 169417 -123942 -171370 -32310 24341 -90899 -41290 -117647 -23620 172076
15748 212545 -83769 -77664 -263989 171234 -283439 122958 187209 -72187 184468 -253510
15737 -101352 -70493 11559 -26145 72931 8574 -39616 -298799 38443 -327530 472950 -44605
15725 -188046 -210398 145679 -63049 -257679 -294600 13029 25534 -184604 26402 49470 103963
15714 103963 209334 -71297 69185 -107440 63457 -191012 -256774 -72156 -233174 121194
15703 -311742 55823 -64559 44277 5370 371241 126848 -86200 -46865 131369 50252 163443
15692 163443 179943 156065 -30439 -241698 -165753 128757 -53993 300384 -163195 178719
15681 140486 57584 -141374 -260558 -3926 71981 140828 34419 -446640 311981 -67751 -96494
15670i6494q6434c1226A21270m1197b0378B9097J00906M7932A3231b84035I359
15658A25679i2745j56104b3628j30941A2126a51456g836j98519a3530l37228B74954
15646B29494n1798J51742C853J22907a47098G7486K26176b7913j81130D0057j6407
15635B3650J0386h8975o4455o1972Q9810D8982a20307B36633H0605b63402D6767
15623e5539j2766B35278b37138e430D5959b49840A29752a7669l78837D3056b55077
15611a94622D306c10101i4364K2672j14677b7293C29766b30994b659B1758r572
15600A2186a81966j33446P5758A28942b73647C6057c80856c4675A68327a56187
15589e0566j56493h5294a9871A9747i0527q1535E5640h5004h546C5531e9238B1122
$$ plain form
15670 -96494 -182928 -31226 121270 80073 -20378 29097 130003 177935 13231 -284035 9359
15658 125679 -92745 -248849 -23628 -154569 12126 -151456 -7836 -206355 -13530 -350758 274954
15646 229494 177696 329438 3853 126760 -147098 77486 303662 -27913 -209043 40057 23650
15635 23650 34036 -88975 -153430 -215402 -125592 48982 -120307 236633 80605 -263402 46767
15623 -55539 -68305 235278 -237138 -5430 45959 -249840 129752 -17669 -396506 43056 -255077
15611 -194622 4306 -310101 -94364 -71692 -186369 -27293 329766 -230994 -2659 21758 12186
15600 12186 -181966 -315412 -239654 128942 -273647 36057 -380856 -34675 168327 -156187
15589 -50566 -207059 -85294 -19871 19747 -90527 -172062 55640 -85004 -8546 35531 -59238 21122
15576d43804a1479L370H4796f9025A37541c00122F4098i6323I1506j008k6031
15565F4467i5276B77598q1441b78379C17325C5862i0194K6393B37364d2431A96146
15553A39055c79978E6486J35946o7340c1135l6704A55666f3864k29239b9045j67616
15542a96661j64214A1484J68320e1948K0721D40313I7529h257A87991f3574E1859
15530f2260K9243E01719a84060p4601J16067D39237A99244f1445A10055m8767
15520F1288M4742J19503a12191A0553b60035C8865d6322H4640J75232b00587G8834
15508a00261j84345E0070a6050G7562k5525a42489a4363A36710f8731D7073j2590
15497C4483K1706J16724f1594A66805i8426g670k0093D7493K25356c73404B71863
$$ plain form
15576 -443804 -11479 -8109 84796 -69025 137541 -300122 64098 -96323 91506 90498 64467
15565 64467 -95276 277598 196157 -278379 317325 35862 -90194 -63801 237364 -42431 196146
15553 139055 -379978 56486 192432 125092 -31135 -67839 155666 -63864 -293103 -29045 -196661
15542 -196661 -360875 11484 179804 -51948 -31227 440313 97529 -8257 187991 -63574 51859
15530 -62260 -33017 501719 -184060 -258661 -142594 439237 199244 -61445 110055 61288
15520 61288 106030 225533 -112191 10553 -260035 38865 -46322 84640 259872 -200587 78834
15508 -100261 -284606 50070 -16050 77562 52037 -142489 -14363 136710 -68731 47073 34483
15497 34483 56189 172913 -61594 166805 -98426 -7670 -27763 47493 272849 -373404 271863
15485h7578n8582D2728b03095B93894e9942B54609O9793j52573H4354h3153I7041
15473C3854J86352C7039J22469J21420a05803e0623j49976r5310D6936P8191N4818
15462A79945a17348j26335B0992a73413A78569f3076A83652a32634k5645A63017
15451D6501R0775H155a47333D7443a84931c5981B16588h008A67073e3766j59426
15440b13192j32414J07308C05967A4535h123p1004b011H8072A5994i791j93757
15429b03548A10414C9698h543j21267e3789a025A78915L859D8955g822j96528
15418b04350M6939i242k52937e04k7088j69825c137k2187j55701I5433b6954A07509
15405F1508K31091B5148Q0402b09601k7016C8437a8329j13207B47795c5888j32247
$$ plain form
15485 -87578 -146160 42728 -203095 293894 -59942 254609 324402 171829 84354 -83153 97041
15473 33854 220206 37039 159508 280928 -105803 -50623 -200599 -295909 46936 125127 179945
15462 179945 -117348 -243683 20992 -173413 178569 -63076 183652 -132634 -158279 163017
15451 46501 137276 8155 -147333 47443 -184931 -35981 216588 -8008 167073 -53766 -213192
15440 -213192 -345606 -238298 305967 14535 -8123 -79127 -2011 88072 15994 -9791 -203548
15429 -203548 110414 39698 -8543 -129810 -53789 -1025 178915 182774 48955 -7822 -204350
15418 -204350 -157411 -9242 -262179 -504 -27592 -197417 -3137 -25324 -181025 95433 -26954 107509
15405 61508 292599 25148 105550 -209601 -236617 38437 -18329 -131536 247795 -35888 -168135
15394a68135A28977e0695l962A57958a69051A78005e4998r4223B38532a03941
15383A87463i0457n0482A97565r1481c00179B04575c2327j06092d6513A72967
15372c34010A94436l5950a18142A86998D3609c92613D78112a93892A51386m6837
15362A04549A9142a29431a8110o2465A76157B9072b26946G8437d36897A30046
15351B647a95836j74904a11954k27958c3523i212l7158B74788h8183C582L2452
15340C6034a36939A37273a23657B5425e1725B17647i5622A65717d0445q7431H6512
15328A01542J83505G5661P1695m3360D0377q06J39985n1982b59091J0538l9508
15317b88061E4569c32551B39137C2086N4522b17011A89777a13849B76932a41399
$$ plain form
15394 -168135 128977 -50695 -54657 157958 -169051 178005 -54998 -149221 238532 -103941
15383 187463 -90457 -140939 197565 106084 -300179 204575 -32327 -138419 -46513 172967
15372 -334010 194436 158486 -118142 186998 43609 -392613 478112 -193892 151386 104549
15362 104549 19142 -129431 -18110 -80575 176157 29072 -226946 78437 -436897 130046
15351 2647 -195836 -370740 -111954 -339912 -33523 -9212 -46370 274788 -88183 3582 36034
15340 36034 -136939 137273 -123657 25425 -51725 217647 -95622 165717 -40445 -127876 86512
15328 101542 285047 75661 147356 103996 40377 39571 179556 127574 -259091 -248553 -288061
15317 -288061 54569 -332551 239137 32086 86608 -217011 189777 -113849 276932 -141399
15306G7278h6542b3544A0683P6520O3477i921B87004i4395L9802B52766c2551
15294B33950a52321B62552l8428q9844H562f2485o8977F7775b46047b1005q6106
15283a07111B2544d0656A00866A0961b08522b5088D20535D5052J27855N7425K02058
15272D32390e0685E2203L52797j48063p0843f5050b9884p2507j6899B57100g5857
15260H2758Q0105g3118J8283A42883j8290J18906q3722f7498C73696A04959K56660
15249C61619A54796L79930Q56224O8249m0774K59116p83997m23162j66546g5140
15238a04462a010j42487F345J59556H1782a55412g0926a4029k09774A75057O0112
15227B35169q5928J96764a39852L1678j5377A38023Q546Q4159b14505A77375C557
$$ plain form
15306 77278 -86542 -23544 10683 87203 150680 -9921 287004 -94395 -54593 252766 -32551
15294 233950 -152321 262552 224124 134280 8562 -62485 -131462 67775 -246047 -21005 -107111
15283 -107111 22544 -40656 100866 10961 -208522 -25088 420535 45052 172907 230332 432390
15272 432390 -50685 52203 405000 256937 186094 -65050 -29884 -102391 -119290 257100 -75857
15260 82758 162863 -73118 -54835 142883 124593 243499 159777 -67498 373696 104959 361619
15249 361619 154796 534726 1390950 1459199 1418425 1677541 893544 470382 303836 -75140
15238 -104462 -1010 -143497 6345 165901 81782 -155412 -70926 -14029 -223803 175057 235169
15227 235169 149241 346005 -139852 -108174 -123551 138023 146569 230728 -214505 177375 3557
15215E9872g366B37474A535L04893A11423a32372l51226a07920m5437C13403J08502
15204D21905j80600B0307L71172j27596o2575R8579b071B675J20504N1870o8784
15193A06265a44793a9521B9994i0823j48684C56358B8995J21372F4271i8362B0905
15181h5145B52124l1507b2555C91763j35993F2038J62252C3946J60023A5453L475
15170A8928J05071M01102k25744A39552B8225P5965L24125A35037b53154C318
15159C60959I3949P544L25328a99585C19502e7260K2552B31620G118J94594b08000
15147F390K23200f7867A01649e4416H868J97185K03414c16653C64701j55872a26545
15135a16056C03992a5687C0053K35937J08060j50970K8148j24919k3505J47220
$$ plain form
15215 59872 -7366 237474 1535 306428 111423 -132372 -483598 -107920 -153357 313403 421905
15204 421905 241305 20307 391479 263883 201308 299887 -2071 2675 123179 175049 106265
15193 106265 -144793 -19521 29994 -90823 -239507 356358 28995 150367 64271 -98362 20905
15181 -85145 252124 220617 -22555 391763 255770 62038 224290 33946 193969 15453 18928
15170 18928 123999 525101 299357 139552 28225 104190 428315 135037 -253154 3318
15159 360959 93949 101493 426821 -199585 319502 -57260 -34708 231620 7118 201712 -208000
15147 6390 229590 -67867 101649 -54416 8868 206053 409467 -316653 364701 208829 -126545
15135 -116056 303992 -15687 30053 265990 374050 223080 251228 126309 102804 250024
15125B50024c3855H235O5501Q548m0838Q571a9165C99409A60350a96586A84488
15113D96551a09015F4569b10080B36562a4536C1493J35806M8258P323a72284A44858
15101B32645F4592J2042L1988i133I5898Q3865l881J44211a69393B49865b93834
15089C16490H4124a8632A57714K72174A29305N3183J44039a85352B99405C8075
15078A00209N1802p3654A0764J81768J24676E5881k1705L70110E298J26668G121
15066A72933F5187a397p606B1467Q9480c63801g1844B04642M6068i1157C04118
15054E5312L76785j10252A40048J0087j0121M26367k40518h122D3995F341J06823
15043A13164L17272A15845M07193A5466P0051h7555A85199K7687G2311K30827
$$ plain form
15125 250024 -33855 8235 73736 82284 41446 50017 -19165 399409 160350 -196586 184488
15113 496551 -109015 64569 -210080 236562 -14536 31493 167299 215557 222880 -172284 144858
15101 232645 64592 76634 108622 -9133 95898 179763 175882 320093 -169393 249865 -293834
15089 316490 84124 -18632 157714 429888 129305 182488 326527 -185352 299405 38075
15078 100209 152011 78357 10764 192532 317208 55881 34176 404286 5298 131966 7121
15066 172933 65187 -1397 -9003 21467 110947 -363801 -71844 204642 250710 -91157 304118
15054 55312 432097 321845 140048 150135 140014 566381 325863 -8122 43995 6341 113164
15043 113164 430436 115845 523038 15466 85517 -87555 185199 212886 72311 303138
15033C03138K3678I0811a17888A24840K45101E8052A163K51700a15504B27680
15022A13086K10331d6647B22834J12791o4119O7507m1759b9387C2451A1982M22379
15011D34361J1019a75305B14236a74943A71435Q6368l2884e7129A11917l3523
15001G8394K83947f098G6051a16332F1933J57094m5336g5564H4628n510K37400
14990C16518J70415j54594A48972Q2894a31477C00170F2644J53072e203B31211
14979C42361M1108P9735o7840A42289A1683K27133K22031m209M6348A02060M00738
14968E02798B07255L13005k24122J27851L0866k16038J49917A43294M12670F0646
14957b2357D35487l7191A3618L26551O876j37855O9733J38642r0676A03552K81625
$$ plain form
15033 303138 326816 90811 -117888 124840 369941 58052 1163 252863 -115504 227680
15022 113086 323417 -46647 222834 335625 271506 339013 297254 -29387 32451 11982 434361
15011 434361 445380 -175305 214236 -174943 171435 257803 224919 -57129 111917 78394
15001 78394 362341 -6098 76051 -116332 61933 219027 173691 -75564 84628 79118 316518
14990 316518 486933 332339 148972 231866 -131477 300170 62644 215716 -5203 231211
14979 342361 383469 463204 395364 142289 11683 238816 460847 456638 502986 102060 502798
14968 502798 207255 520260 296138 423989 454855 238817 388734 143294 555964 60646
14957 -22357 435487 398296 13618 340169 347045 209190 278923 417565 326889 103552 385177
14946C85177j32435p0380L58598k56034b1483C64889j34809K71323d9967D05927
14935C99036Q6554m0364Q566p3764B4258K36570J02470A25761K28439K69207d3151
14923A96740L30405j51685M3532j61038J78627j09752p9312J52342j72235N02136
14913G29760B10926J45260J15266K10326B94961J96862J53746B24735L11652j17015
14903D19372j94359L73903k98909P349b4286A57208K59653K11974j37356k15757
14893B75722K56847A00807J95149q6484f840A99639J30906n9161c1050A93309
14882A10808L5232L53000J00837k10645A59881K26011J03952k39942R5384K52366
14872E97652k13632n4087J22572K21139l15681N2453R4181n8830J23027q952r6206
$$ plain form
14946 385177 252742 182362 540960 284926 -21483 364889 230080 501403 -49967 405927
14935 399036 485590 445226 453792 380028 24258 260828 363298 125761 354200 623407 -43151
14923 196740 527145 375460 418992 257954 436581 326829 247517 399859 227624 729760
14913 729760 210926 356186 471452 681778 294961 491823 645569 224735 536387 419372
14903 419372 225013 598916 300007 307356 -24286 157208 416861 628835 491479 275722
14893 275722 532569 100807 295956 209472 -6840 199639 330545 271384 -31050 193309
14882 110808 146040 499040 599877 389232 159881 385892 489844 249902 345286 597652
14872 597652 384020 329933 452505 673644 357963 410416 504597 445767 568794 559842 463636
14861D63636j20606P1966O9805j2025q7822L12280C19588m8119K41014j66516
14851C45967J53274k43410J43110j42116N34301C65337J58236J22031B64063G4528
14840E74194j52824J41939J68754j38094J22797n0279j37416n3256O7230B12934
14829C90561L21996k15189J07043K3095k62876M5880n6800K88347j98247Q3691
14819E27501j07652J55125K07087B69946J49883J26943M8333P92K48635l47507
14809D97025K54431C25281K31407P5871q6325j10266K66855k19825L32276l82861
14799D32413K99696k84303P5397o2617j10722K43203k91832N75710C45056N19938
14789H64994C31589N03930k08901B21725O38042j02799K91351m56801o7985m2805
$$ plain form
14861 463636 343030 414996 484801 472776 384954 697234 319588 271469 512483 345967
14851 345967 499241 255831 398941 256825 791126 365337 523573 645604 264063 74528
14840 574194 421370 563309 732063 593969 716766 666487 529071 475815 543045 212934
14829 390561 712557 497368 604411 627506 364630 410510 353710 642057 443810 527501
14819 527501 419849 574974 782061 269946 419829 546772 595105 595897 844532 497025
14809 497025 751456 325281 556688 632559 546234 435968 702823 482998 815274 432413
14799 432413 732109 447806 523203 460586 349864 593067 301235 876945 345056 864994
14789 864994 331589 835519 626618 221725 859767 756968 1048319 591518 523533 480728
14779D80728j50943N01791J0861j45866j9308J9147P1315j82339M8514q1723j59965
14768C92212L37488m8768B67712N19454B87992O40262D04068A59827K98081M54558
14758I12466k56236n8943J93373j6467r9470j081K83361j69323k76497J42012
14748F53195k93360L82320q4499j2341J63271j02733L31628j59098k36710K97933
14738I39606m8871m41444N34711k59769o0713N5676K48458l39023J49214m7307
14728G30538k31554M25975j23115J95791l46313J23918J4063J49506k1817n7239
14718H59753k15741L31228k02689J08588q1812J35736j96982M7834n2312K24514
14708I58117m40553L57422Q9596j50220k22707j28672M03570K03208r5098J20194
$$ plain form
14779 480728 329785 831576 842437 696571 677263 696410 767725 585386 633900 552177 392212
14768 392212 729700 680932 267712 787166 287992 928254 404068 159827 457908 912466
14758 912466 656230 597287 790660 774193 674723 673642 957003 787680 511183 653195
14748 653195 359835 742155 657656 645315 808586 705853 1037481 878383 641673 939606
14738 939606 890735 449291 984002 724233 663520 719196 967654 628631 777845 730538
14728 730538 498984 924959 801844 997635 651322 775240 789303 938809 916992 859753
14718 859753 644012 975240 772551 881139 799327 935063 738081 785915 733603 958117
14708 958117 517564 874986 964582 814362 591655 462983 866553 1069761 974663 1094857
14698A094857l27245J35798L2474J97186j62004j29071J24463k8299J3131j96072
14688G55218Q6844j74613K91427M00063j46576k41679j05156m1264K27181L3099
14678A084544M4410m06850N60052m6702R7704m27636J57086J36662j91552K1552
14668A029270J06487J16240l23961J64217k64411M72120q5539K64832m67026K00555
14658A212784j11480K53215k39464M5913p2383J97538J01916J8878j85580j68018
14648A053319o4257Q0289K57914J04742J71514n10723L18479k49859J03701L09989
14638A575108m14055L29014j13046Q0097K22200k58552m5031k50197J69906J59164
14628A454608R8689k1115P1873m65608M14312M5481j57894J75388O2206j20033
$$ plain form
14698 1094857 767612 903410 935884 1133070 971066 841995 966458 938159 951290 755218
14688 755218 842062 667449 958876 1358939 1212363 970684 865528 824264 1051445 1084544
14678 1084544 1128954 722104 1282156 1235454 1333158 905522 1062608 1199270 1007718 1029270
14668 1029270 1135757 1251997 928036 1092253 827842 1299962 1214423 1479255 1012229 1212784
14658 1212784 1101304 1354519 1115055 1160968 1088585 1286123 1388039 1406917 1221337 1053319
14648 1053319 989062 1069351 1327265 1432007 1603521 1092798 1411277 1161418 1265119 1575108
14638 1575108 1161053 1490067 1377021 1457118 1679318 1420766 1375735 1125538 1295444 1454608
14628 1454608 1553297 1532182 1604055 1138447 1552759 1598240 1440346 1615734 1677940 1557907
14618A557907k2149M3550J67089n05230N64961Q6702j43841l90371K33557J30057
14608A722232J12454r32j70682J95321K7736k8351l7892k57152j6241L24325p5476
14597A795342j02706J35632J32603n21773M69954J12807l05869L75699K40595
14588B332284j98441k29191j03893K89169m0966m405j81337K03665j24513M03065
14578B345437l34798M6520J65554K17097j11677Q2410o6239J9976k65826L21731
14568B420185p5768l6352L55582n7360m5928j4085K14671n5440O39707n60393
14558B784819R9030L0954M44886n8072N12513K59354K45338N10550O23570J680287
14548G133229M737350R726804J9281311J0649066B5436113A1215405E313148k039420
$$ plain form
14618 1557907 1535758 1579308 1746397 1241167 1806128 1892830 1748989 1358618 1592175 1722232
14608 1722232 1834686 1833754 1663072 1858393 1886129 1857778 1819886 1562734 1546493 1870818 1795342
14597 1795342 1692636 1828268 1960871 1439098 1909052 2021859 1715990 2091689 2332284
14588 2332284 2133843 1904652 1800759 2089928 2048962 2044557 1863220 2066885 1942372 2345437
14578 2345437 2010639 2057159 2222713 2439810 2328133 2410543 2344304 2364280 2098454 2420185
14568 2420185 2344417 2308065 2663647 2606287 2560359 2546274 2760945 2705505 3345212 2784819
14558 2784819 2883849 2914803 3359689 3301617 3814130 4073484 4318822 4829372 5452942 7133229
14548 7133229 11870579 21597383 40878694 51527760 25436113 11215405 5313148 3273728
14540C273728p91686m15251L05447p2595m30609L58942l16883k8151N57718J37808
14530B578468r8811j67640J83251j84735J41277j52054J43639q6591L99476L4744
14520B791024l5091J0737k16079J60707j27037L43281l65866O58236l29296j25443
14510B765173M27605m46250K50659K13266k26465J64136K91953j71500J52919
14501C421496N710j53047j12093L01393n5205K55743j82742j97621L07865J67892
14491C759391P9882k47389K4507K84567J59351l43143L64264o4593K3196L08854
14481D348887m88405L12519P0840k346J5941j11569M16349J27374l51196M52805
14471D791199j18118K61931N1126l25222R4663L27821o3195J09495j9293N7654
$$ plain form
14540 3273728 2482042 2066791 2372238 2299643 1869034 2227976 1911093 1882942 2440660 2578468
14530 2578468 2479657 2312017 2495268 2310533 2451810 2299756 2443395 2356804 2756280 2791024
14520 2791024 2755933 2766670 2550591 2711298 2584261 2927542 2561676 3219912 2890616 2765173
14510 2765173 3192778 2746528 2997187 3210453 2983988 3148124 3440077 3268577 3421496
14501 3421496 3427206 3274159 3162066 3463459 3408254 3663997 3481255 3283634 3591499 3759391
14491 3759391 3839273 3591884 3616391 3900958 4060309 3717166 4081430 4016837 4040033 4348887
14481 4348887 3860482 4173001 4243841 4241495 4257436 4145867 4562216 4689590 4338394 4791199
14471 4791199 4673081 4935012 4986138 4660916 4755579 5083400 5020205 5129700 5110407 5168061
14461E168061J31815l18225P14655l59869m9417K41175j80493K50229J36514K28251
14451E962696k38989L30244j11264O0634L46477o6131k03203K74532l11744J135
14441F044387M10292K37079m7932j1732L00486r781j73366N22284L09907l39734
14431G241890O6884L51943k42786K80341L1853M62044J12650j99331j33925L70279
14421H341842M05067j63769K94589L00211l15221N11255k03315J99182N4441J58618
14411I582900K02378J54919J84113j29720K53036J55623K49764j54196N10206
14402A1009023J71298O2227J83999L96013j68234L58202K7203J79738L03069J08923
14392A2631461L90782J61934O321L09288J24985O75705O81L47015K99601R9418
$$ plain form
14461 5168061 5299876 4981651 5696306 5336437 5287020 5528195 5347702 5597931 5734445 5962696
14451 5962696 5723707 6053951 5942687 6003321 6349798 6283667 6080464 6354996 6043252 6044387
14441 6044387 6454679 6691758 6643826 6632094 6932580 6922799 6749433 7271717 7581624 7241890
14431 7241890 7308774 7660717 7417931 7698272 7730125 8192169 8304819 8105488 7971563 8341842
14421 8341842 8746909 8583140 8877729 9177940 8862719 9373974 9170659 9369841 9424282 9582900
14411 9582900 9785278 9940197 10124310 9994590 10247626 10403249 10653013 10498817 11009023
14402 11009023 11180321 11242548 11426547 11822560 11654326 12012528 12039731 12219469 12522538 12631461
14392 12631461 13022243 13184177 13190498 13499786 13624771 14300476 14301157 14648172 14947773 15047191
14382A5047191L82999N1481M85510L29896M6214M43609L16530Q46903k25466M08185
14372A8133052K96256L17936K71511M86331M56576M37294K28354P45299L99552
14363B1772161M35560O41275L16468R10018K35638P13497J96426O39223N63847
14354B6424113M99840Q11373P18429O67736R79432L72082Q40436P79198O94829
14345C2787468J043975P75968J013337J181344M37255J488839Q37556J328963
14337D0894705O96993J312881J445167J276426J088516J601132J450375J187071
14329E0953266J755420J858437J525842J513041K139091K096453K173650K028252
14321F6043452K384867K423574K102351K766755L106446K964155K949801K727720
$$ plain form
14382 15047191 15430190 15481671 15967181 16297077 16343291 16786900 17103430 17950333 17724867 18133052
14372 18133052 18429308 18747244 19018755 19505086 19961662 20398956 20627310 21372609 21772161
14363 21772161 22207721 22848996 23165464 24075482 24311120 25024617 25221043 25860266 26424113
14354 26424113 26923953 27735326 28453755 29121491 30100923 30473005 31313441 32092639 32787468
14345 32787468 33831443 34607411 35620748 36802092 37239347 38728186 39565742 40894705
14337 40894705 41591698 42904579 44349746 45626172 46714688 48315820 49766195 50953266
14329 50953266 52708686 54567123 56092965 57606006 59745097 61841550 64015200 66043452
14321 66043452 68428319 70851893 72954244 75720999 78827445 81791600 84741401 87469121
14313H7469121L761343L765971L700726M116915M186764M321096M846891M968232
14305A21137059N439020N105004O167104O230658O441146P089777P284791Q149270
14297A73043829P922329Q727558R325993R579342J0108734J1150894J1188047
14290B41046726J2386978J2305866J3054337J3378369J3602237J4325579J4488321
14283C34588413J4796829J4870966J4742911J4463583J3965048J3022300J2458061
14276D32908111J0930809R500918P339032M551758Q53972j933793k222815j467710
14268D60460282j158739l972121n585418q067576j0734768j2351630j3565303
14261D05024727j3952414j4729095j5037386j4807924j4930529j4686104j4437123
$$ plain form
14313 87469121 91230464 94996435 98697161 102814076 107000840 111321936 116168827 121137059
14305 121137059 126576079 131681083 137848187 144078845 150519991 157609768 164894559 173043829
14297 173043829 180966158 189693716 199019709 208599051 218707785 229858679 241046726
14290 241046726 253433704 265739570 278793907 292172276 305774513 320100092 334588413
14283 334588413 349385242 364256208 378999119 393462702 407427750 420450050 432908111
14276 432908111 443838920 453339838 460678870 465230628 466084600 464150807 461927992 460460282
14268 460460282 459301543 455329422 449744004 441676428 430941660 418590030 405024727
14261 405024727 391072313 376343218 361305832 346497908 331567379 316881275 302444152
14254C02444152j3738989j2793298j2768813j2311265j2151481j1299025j0957509
14247B16423772j0523547r508700q851598q447331p983121q016988p349868p223786
14239A48518833o589145n501127n665950n707821n549870n030651m426988m375580
14231A05671701l856823l992469l993322l641302l424624l098294l036209k982739
14223G7645919k535388k920761k327269k068665k291570k342401j722315k203189
14215E9234361k089222j561069j101658j654765j810692k062939j222641j117307
14207D6614068j151101q32614j942105j136874j153526j102856p62783q99370
14199C7632839r75399j334080o81467o15929j237580q23398j80882j157487j142732
$$ plain form
14254 302444152 288705163 275911865 263143052 250831787 238680306 227381281 216423772
14247 216423772 205900225 196391525 187539927 179092596 171109475 163092487 155742619 148518833
14239 148518833 141929688 136428561 130762611 125054790 119504920 114474269 110047281 105671701
14231 105671701 101814878 97822409 93829087 90187785 86763161 83664867 80628658 77645919
14223 77645919 75110531 72189770 69862501 67793836 65502266 63159865 61437550 59234361
14215 59234361 57145139 55584070 54482412 52827647 51016955 48954016 47731375 46614068
14207 46614068 45462967 44630353 42688248 41551374 40397848 39294992 38532209 37632839
14199 37632839 36657440 35323360 34641893 34025964 32788384 31964986 31784104 30626617 29483885
14190B9483885k25017m98956j013974q13035k11620j006713j09065o02806o39668
14181B4363031p51630k15701n90569p81493K4999p54001k92222k62969p74619
14172A9964826j58757m64568l59608l00561k62816m13772k44901l25353m70270
14163A6964220j33188m84051j54815k45135k85227j24342l64651n09088O3340
14154A4727063n72057K46847m02256k92103m26829j38012j2850k29158m76838
14145A2423807J35720j00099m82443J78436n08747n21023L37150l57840m802o62092
14135A0438067K86391k49671l54544J22307m94704L25008o03692K8527N9268j5572
14125I541385l76989J04155k82288l7296j1673l80292j1232j92492k27243j43430
$$ plain form
14190 29483885 29258868 28759912 27745938 26932903 26721283 25714570 25605505 25002699 24363031
14181 24363031 23611401 23395700 22805131 22023638 22048637 21294636 21002414 20739445 19964826
14172 19964826 19806069 19341501 18981893 18681332 18418516 18004744 17759843 17434490 16964220
14163 16964220 16831032 16346981 16192166 15947031 15661804 15537462 15172811 14663723 14727063
14154 14727063 14155006 14401853 13999597 13707494 13280665 13142653 13129803 12900645 12423807
14145 12423807 12559527 12459428 11976985 12155421 11646674 11125651 11462801 11104961 11100159 10438067
14135 10438067 10724458 10474787 10120243 10242550 9747846 10072854 9469162 9497689 9556957 9541385
14125 9541385 9164396 9268551 8986263 8948967 8937294 8557002 8545770 8353278 8126035 7982605
14115G982605J21654p5849r6472l03765J85778l80318m6931O0604k09072k08423
14105G029811J30701Q9153k86561K15769l07321k49318L41501l25858n6303j85104
14095F396470J69325l66804j76054P8067q1937O887k97296k53175O74574o36388
14085E513669K16808J44433m85143K50389l11053o9747K90480l02443r8700J26827
14075E275520k2900j03826j66124K86681l78921l08784M81267j43848l6908p410
14065D874747k02918m79367M14376o0585q1240L59821m56961l4413J39593p1353
14055D401700l90977M9245L41600J26341m60920P1712k07667J38190k68481L43306
14045D144049j43733j63398P2755k86417j05503k13239k90105L37530K90596j96089
$$ plain form
14115 7982605 8104259 8028410 7931938 7628173 7813951 7433633 7386702 7447306 7238234 7029811
14105 7029811 7160512 7249665 6963104 7178873 6871552 6622234 6963735 6637877 6581574 6396470
14095 6396470 6565795 6198991 6022937 6101004 6019067 6025954 5728658 5475483 6150057 5513669
14085 5513669 5730477 5874910 5389767 5640156 5329103 5259356 5549836 5247393 5148693 5275520
14075 5275520 5252620 5148794 4982670 5269351 4890430 4581646 5062913 4919065 4882157 4874747
14065 4874747 4671829 4192462 4606838 4546253 4465013 4824834 4367873 4333460 4473053 4401700
14055 4401700 4010723 4059968 4401568 4527909 4066989 4138701 3931034 4069224 3800743 4144049
14045 4144049 4000316 3836918 3909673 3623256 3517753 3304514 3014409 3351939 3642535 3446446
14035C446446J7630M5950j7638l3085J1468j36851m8017j12834L79725l32257
14025C220537j29598O6189k08450J86940j74339o3530K8962J63476q8244k93736
14015B708207L17238j42471j48265l86880M94795j91442k73104J81638Q4481j57333
14005B486864O9028j94112j07720J60897M31394q03192n0499K84046K15370J53768
13995B645844o71013L45650r403J22860m97944M38286L54958K659089P647138
13986A3035465J8491283K0541991j9301167A5338110o484407k704222r77421p33602
13978D438458p20573k13046m6445q2765n20567J08622q933J40324m64051J750
13968B632774N3303J04019j66353j89703p9826j1477L9953r1655M1901k1553p3454
$$ plain form
14035 3446446 3464076 3510026 3492388 3459303 3470771 3333920 3285903 3173069 3552794 3220537
14025 3220537 3090939 3157128 2948678 3135618 2961279 2897749 2926711 3090187 3001943 2708207
14015 2708207 3025445 2882974 2734709 2347829 2842624 2651182 2378078 2559716 2644197 2486864
14005 2486864 2555892 2361780 2254060 2414957 2846351 2043159 1992660 2276706 2492076 2645844
13995 2645844 1974831 2320481 2311078 2433938 1935994 2374280 2729238 5388327 13035465
13986 13035465 31526748 52068739 32767572 15338110 8853703 6149481 5172060 4438458
13978 4438458 3717885 3504839 3458394 3375629 2855062 2963684 2954751 3095075 2631024 2632774
13968 2632774 2686077 2790096 2623743 2434040 2354214 2342737 2382690 2291035 2332936 2311383 2237929
13957B237929L0464Q5399J33248M458n67765K83151J39398J4218J54354k99332
13947B215522k14911K10582j40253l5459L9427l32900J53302L42882k97037L91139
13937B332294k36011k30995j43240J53295j93284K64155J06460k49127J41312
13928A944859o6296q8680J23092k52548J8769k28994P71167k43498j37367j79100
13918A661404P919R772L64304j84654j71774K26180m81640M2344J9363P837L17821
13907A818876m4099j72285P2183l49326K56948j16054J99985M5358l88714K60554
13897A583426l15901L33321k43043L4127K43742l48426J64270k7376K6793Q5482
13887A536415j36186n9217k9140K27218R2920j66747j84221p7085J78307K467
$$ plain form
13957 2237929 2268393 2353792 2487040 2491498 1923733 2206884 2346282 2360500 2514854 2215522
13947 2215522 2000611 2211193 2070940 2035481 2074908 1742008 1895310 2238192 1941155 2332294
13937 2332294 2096283 1865288 1722048 1875343 1682059 1946214 2052674 1803547 1944859
13928 1944859 1878563 1789883 1912975 1660427 1679196 1450202 2221369 1977871 1840504 1661404
13918 1661404 1669323 1679095 2043399 1858745 1686971 1913151 1431511 1473855 1493218 1501055 1818876
13907 1818876 1774777 1602492 1674675 1325349 1582297 1466243 1666228 1711586 1322872 1583426
13897 1583426 1267525 1600846 1357803 1391930 1635672 1287246 1451516 1424140 1450933 1536415
13887 1536415 1400229 1341012 1311872 1539090 1632010 1465263 1281042 1203957 1382264 1384731
13877A384731K00434l86630O9466j5264l3862R1006O5372j752J96382J0874l40421
13866A240336K2849k28249M89465m04863n1528L4265l3522J29700k50313l1730
13856I16410M5248N25829l39084k16590K37707k40585K71069m8751L534k33111
13846I21676J70537M9748M93918l72998k95051o3022L29010k29895J40492N187
13836A149602K02852k5014l47214k10731K27887J85100l20900L06921m51351K33945
13826I51097K06652j14388J84334k65564j62296k3977o7304j0227J03704K69985
13816A072016j44359Q2259j9114J58124K355l12990J77007J48456m57889K24621
13806I30486P757J24504r2808j42138K69503J09147l67715J78482j99276Q9572
$$ plain form
13877 1384731 1585165 1198535 1268001 1252737 1218875 1309881 1375253 1373501 1569883 1580757 1240336
13866 1240336 1263185 1034936 1524401 1119538 1068010 1102275 1068753 1198453 948140 916410
13856 916410 961658 1487487 1148403 931813 1169520 928935 1200004 1151253 1154787 921676
13846 921676 1092213 1141961 1635879 1262881 967830 904808 1233818 1003923 1144415 1149602
13836 1149602 1352454 1327440 980226 769495 997382 1182482 861582 1168503 717152 951097
13826 951097 1157749 1043361 1227695 962131 799835 775858 708554 698327 802031 1072016
13816 1072016 927657 1009916 990802 1148926 1151281 838291 1015298 1163754 705865 930486
13806 930486 938243 1062747 969939 827801 1097304 1206451 838736 1017218 817942 907514
13796I07514K9473J88399l28986J92220k76604o8756K98314K5010K9047J9318
13786A014949M5801o8591j90922k31143K24290M47017E70984M15481k39776K10186
13776I56875j59722n8010p3960O3315K15355k13508k9671K73420k94312J50952
13766H30734j21103o3546q3650N1145K26818j62913l044L22870l91925M1501R0222
13755G37109K92800k01949J49980k30518L1412L9584j70319o4105M42070j95520
13745H30544R1436l52521L35958J3098D18035N44837k74664J14015k20651J98777
13735G80349R8297l19698Q9758J64432k95812M16378l85022l2250K07828M817
13725G29077j64333l1388Q8337J36021L8590j3788j29975J64718l12219J72087
$$ plain form
13796 907514 936987 1125386 796400 988620 712016 643260 941574 966584 995631 1014949
13786 1014949 1060750 992159 801237 570094 794384 1241401 570984 986465 746689 956875
13776 956875 797153 739143 665183 728498 943853 730345 700674 974094 679782 830734
13766 830734 709631 646085 562435 613580 840398 677485 674441 997311 605386 646887 737109
13755 737109 1029909 827960 977940 747422 778834 818418 648099 583994 1026064 830544
13745 830544 921980 569459 905417 918515 418035 962872 688208 802223 581572 780349
13735 780349 878646 558948 648706 813138 517326 933704 548682 516432 724260 729077
13725 729077 564744 533356 621693 757714 796304 782516 652541 817259 505040 677127
13715F77127K41529C65625M79649l32182o9120J59045j85992j42645N63243l46744
13705D90879K48414j39769J56636k58967J02522n1887J93919l03124M0227K13636
13695F92486j30537K27918j85408j72696m0417J43481j29769L38014k72281J25317
13685E96108k5864J09343j85634K1698J32018j20629q4454P8233L6954j25922
13675D31851M1975l0061j39802K13097r7549l2472m4628L1273M3547L63201j76792
13664F03640j12410k44061J27420K07186q8295j14224J56978J46408J61465k25601
13654F18506B99025L7003K00484m9852B27474J58754j29167K94335q695L6886
13644E79587K0720j27271o7879Q058J08620k57992N86719D13847K98389k88654
$$ plain form
13715 677127 918656 365625 845274 513092 443972 603017 417025 274380 837623 490879
13705 490879 739293 599524 756160 497193 599715 547828 741747 438623 478850 692486
13695 692486 561949 789867 604459 431763 391346 534827 405058 743072 470791 596108
13685 596108 570244 679587 493953 515651 647669 527040 442586 520819 557773 431851
13675 431851 473826 443765 303963 517060 419511 387039 342411 373684 417231 780432 603640
13664 603640 491230 247169 374589 581775 493480 379256 536234 682642 844107 618506
13654 618506 299025 336028 536512 486660 227474 386228 257061 551396 542701 579587
13644 579587 600307 473036 405157 413215 521835 263843 850562 413847 712236 423582
13634D23582r5071j25110N7449P2675K49308A93149L02806q7550r6571J68868
13624D80702L1958J1182A03647K64605l5837Q4653K65978l11730J6606J47283
13614E35205k12793J50049j44082R9357p7329J31710A69392N14196B79258l6753
13604B42505K76181m7483j09216L19175C28052j16565J27129J98771l5976k03891
13594B97520J56987j10420L11116B21317L68565j68932p8422A71040N20618B94953
13583C75182k1757J0342k901L25020j0674k62384Q155R3257p9591L47869l57587
13572D24931A74424J6420K00531O632l8457J86773k24040L33961B32156J81298
13562D13454J66575H4030L44767r7269J32904m7426O8299r3699j86847E4263N46712
$$ plain form
13634 423582 328511 203401 260850 333525 582833 193149 495955 408405 311834 480702
13624 480702 512660 523842 103647 368252 332415 417068 683046 371316 387922 535205
13614 535205 322412 472461 328379 427736 350407 482117 169392 683588 279258 242505
13604 242505 518686 471203 361987 681162 328052 211487 338616 537387 501411 297520
13594 297520 454507 344087 655203 221317 589882 420950 342528 171040 691658 294953
13583 375182 353425 363767 360866 685886 675212 412828 420983 514240 434649 782518 424931
13572 424931 174424 190844 391375 398007 359550 546323 322283 656244 232156 413454
13562 413454 580029 84030 428797 331528 464432 417006 485305 391606 204759 54263 600975
13551F00975B46432L19539k24167J91307k26375P084l3708J14708j9521k904j02080
13540B70315M134d6118E31194B53684J88534A43664J48866k8121A06197N23772
13530F29969F5391k89R4506Q9683j13624B7074J83255J97385K36373l15993M1108
13519C69202O5821j10286J36445A45437K54317j45404N8758m5218j0884K14286
13509D71292A61657N6811L06153B17716J95851K58686B26514e4752H999Q7847
13499I6846R93J9650K20873j39342J77552J64510a0873C57830j16595R4643m8975
13488B86903I2965J81393A33832J66750A46209J06754J63698P3093j96359p6378
13478B17017K0520K35181l3078M469j38526K8727r1407J45500C2524M10701B8516
$$ plain form
13551 600975 246432 565971 341804 533111 306736 313820 280112 394820 375299 372395 270315
13540 270315 274449 -46118 531194 253684 442218 143664 292530 264409 106197 629969
13530 629969 65391 65102 159608 249291 135667 27074 210329 407714 644087 328094 369202
13519 369202 435023 324737 461182 145437 399754 254350 313108 267890 257006 471292
13509 471292 161657 218468 524621 217716 413567 672253 226514 -54752 8999 96846
13499 96846 97839 117489 338362 199020 376572 541082 -10873 357830 241235 335878 286903
13488 286903 92965 274358 133832 300582 146209 252963 416661 489754 293395 217017
13478 217017 237537 472718 439640 444109 305583 334310 242903 388403 32524 443225 28516
13466B881L17406d4714E07564k22247L4205A17979M55499I0320a50629C02393
13455B76673f8844B91179M7272C4368J82714R2435p3493p4918P2852J16979o7208
13444B83729J0125I5205J91655J80712i4375C58981A06179K03107K43226B05564
13433B76962N2924A13249K11643L9096o5151l6932F2481M5069e57B07869B9660
13421D35990F7778J22878Q1297q7509K18169j93775P8266K05318j04599A92500
13410A18007J21824j1680k3598c9700C91638M7918I9630L0340c2793C96828A68805
13398f1275B61358l6913L7412J48173p5714j26530J62920g5107D24078j68665
13388B55413H6094J22444n4776K45865A04806K67764L1663B6201a20211C1235
$$ plain form
13466 2881 320287 -44714 507564 285317 319522 117979 573478 90320 -150629 302393
13455 276673 -68844 291179 338451 34368 217082 309517 236024 161106 233958 350937 283729
13444 283729 293854 95205 286860 467572 -94375 358981 106179 309286 552512 205564
13433 276962 329886 113249 324892 363988 298837 261905 62481 107550 -557 207869 29660
13421 435990 67778 190656 271953 184444 402613 208838 287104 492422 387823 192500
13410 118007 239831 228151 204553 -39700 391638 439556 99630 129970 -32793 396828 168805
13398 -61275 261358 224445 261857 410030 334316 207786 370706 -75107 424078 255413
13388 255413 86094 208538 153762 399627 104806 372570 404233 26201 -120211 31235
13377b7804A16172l3221M02577k38732G3975K77860j55850O9030K78246E0624
13366G09407G4806K90417A42979J56353K72859B64630r046J50141K8051K6666
13356D60442k05193K40063A41048K29645j25676h2265C98158m0562j66212c4824
13345C67129J37487j31515j07357o9681R9594k6957k4165J10930J07460G5124
13334C72397K2592A10032M2289K01879j23368o662F6689B4185R2142L01166m9764
13323C67729I4548J83783J72469j08234a50203B18402j06410J34454m549K29445
13313D71342l5951h2121A32032J29917A7730J01434J43397G791L13541c3796C82771
13301A24909j587G371K20307f6883B95186e7126A53375J8229N4520I813P5668
$$ plain form
13377 -27804 116172 82951 485528 246796 73975 351835 195985 265015 543261 50624
13366 709407 74806 365223 142979 299332 572191 264630 255584 405725 433776 460442
13356 460442 255249 495312 141048 370693 245017 -82265 398158 357596 191384 -34824
13345 367129 504616 373101 265744 196063 295657 268700 244535 355465 462925 75124
13334 372397 394989 110032 152321 354200 230832 224170 66689 24185 116327 417493 367729
13323 367729 94548 278331 450800 342566 -150203 218402 111992 246446 241897 471342
13313 471342 435391 -82121 132032 261949 17730 119164 262561 7791 321332 -33796 382771
13301 124909 123322 7371 227678 -66883 295186 -57126 153375 171604 226124 9813 85481
13290H5481Q1833E9598L18378E027L19466C4119c4494I1876a3266C1347J78729
13279B10076L08019d2551D20115j34484j33839K01303D3234O3370a9141A63106
13268A020N611L90152D7003a93204G4289K03255A09329a26608e4527A81634k6244
13257A55390J85079A20697J04548m3651L9087n9716L97637A73958J34259j3309
13247B94908j103L48046B30229r4257K61242I8461h9847C23767A31193K2727E3289
13235D639J68039K1945J26096I0529A1919J42804a47659B36023h672A88281H2638
13223h4399B54154a66536b26A73488L0818J4486J76630j94248b58710B32251m7360
13212A84891q4559L9029a60984B81595p6670a38374B23806b15012B1579b62749
$$ plain form
13290 85481 167314 59598 377976 5027 324493 34119 -34494 91876 -13266 31347 210076
13279 210076 518095 -42551 420115 285631 151792 353095 43234 106604 -19141 163106
13268 1020 6631 396783 47003 -193204 74289 277544 109329 -126608 -54527 181634 155390
13257 155390 340469 120697 225245 181594 220681 160965 558602 173958 308217 294908
13247 294908 293805 641851 230229 135972 397214 98461 -89847 323767 131193 153920 53289
13235 4639 172678 194623 320719 90529 11919 154723 -147659 236023 -8672 188281 82638
13223 -84399 254154 -166536 -226 173488 204306 218792 395422 201174 -258710 232251 184891
13212 184891 100332 139361 -160984 281595 204925 -138374 223806 -215012 21579 -262749
13201B56940E6482J35243o9623L1009H094d12377A57249K88912A87591R0066A22321
13189G3311J37975b14958F5217k6752J55346L6879d97235A60195B2359P2341J45424
13178B40124L07979k54464l0748C6J30020N2803J64949I0627C1310J83156p9026
13167A35440R1730g8431E51122B61929N008P9843E6106d2140A71231a53073A96421
13155A8091K75563j31466J03323a41861B91788a66248F2626M2852m3611L7398
13145I9265c8719h644k2014A1198J01178i2111A97587r5287k6144a36437C78407
13133A37356K07847f6153D66013a84913H4280K46115B2077b20243H2029j0426
13123G1603N394R3940O5810l2582j605O0002c7551A72273d0326C59464e5179l25343
$$ plain form
13201 256940 56482 191725 122102 153111 8094 -412377 157249 446161 187591 277657 122321
13189 73311 211286 -214958 65217 38465 193811 230690 -497235 160195 22359 94700 240124
13178 240124 548103 293639 262891 36 130056 182859 347808 90627 31310 214466 135440
13167 135440 227170 -78431 551122 261929 266937 346780 56106 -42140 171231 -153073 196421
13155 18091 293654 162188 265511 -141861 291788 -166248 62626 105478 61867 99265
13145 99265 -38719 -8644 -30658 11198 112376 -92111 197587 102300 76156 -136437 378407
13133 137356 345203 -66153 466013 -184913 84280 330395 22077 -220243 82029 71603
13123 71603 76997 170937 236747 204165 202560 262562 -37551 172273 -40326 359464 -55179 -380522
13111c80522A67483f6549F4987Q6451M942J29259b4624A86036d9518A28307b87705
13099D20334D9074L5825e1023J5750B82859a30312A31885J13380A01605e8056
13088D27206b986D14118j20111j27533K46982i8665D764J45924J1030l7953J93336
13077C17101o7982F9574a7015A72836o6278K66540b213l4458D0483e4103A63508
13065B26171b1501C58061a08968q0330G3088O4244d3387C26101r1365j6940Q6327
13054C04123m0631j12752Q1744r6368K17247N1882C7012J25369J6154K4313q7041
13043A15807b9430A0931e2819E3930b17799C41734j23970o5274J53167j35782
13033A69875C2976N4824L36509I0695B9374a41054D34056m0736A6777a71386D5385
$$ plain form
13111 -380522 167483 -66549 64987 151438 156380 285639 -24624 186036 -49518 128307 -287705
13099 420334 49074 84899 -51023 -35273 282859 -130312 131885 245265 101605 -58056
13088 427206 -2986 414118 294007 166474 413456 -98665 4764 150688 161718 123765 317101
13077 317101 249119 69574 -17015 172836 106558 373098 -2213 -36671 40483 -54103 163508
13065 226171 -21501 358061 -108968 -189298 73088 137332 -43387 326101 234736 217796 304123
13054 304123 263492 150740 232484 136116 353363 405245 37012 162381 178535 202848 115807
13043 115807 -29430 10931 -52819 53930 -217799 341734 217764 152490 305657 169875
13033 169875 32976 87800 424309 90695 29374 -141054 434056 393320 16777 -171386 45385
13021d6058B79518B3997M087a67664D08367A96275H7579N0953L27545A74179L06175
13010D80354n4405q8898H0727J21287M093K95117B749J7003a00083D03033a42138
12998D525J33320k7493d6479A56900j6769O6040C0960L00121e6795B49267P1881
12987C21148G6755K12936J27014e5522h006A50988a41542A69234b2058k940k42020
12976b67018M0937A93475I3648M9614J74192a2484k95471D027a58929B9188b55687
12964i4756A67126G9341J45335D1779R1896n7083a37404I7105a93125g4223A10293
12952b0866B05156I0042e3611F6128n780a30689k5555B08415h4092E9621K47011
12941C06632M1865E4936h1195L5981C27864c1795A70756J4048a20881k04274A5278
$$ plain form
13021 -46058 279518 23997 28084 -167664 408367 196275 87579 138532 466077 174179 480354
13010 480354 425949 337051 80727 202014 206107 501224 2749 19752 -100083 403033 -142138
12998 4525 137845 110352 -46479 156900 140131 206171 30960 331081 -56795 249267 321148
12987 321148 76755 289691 416705 -55522 -8006 150988 -141542 169234 -22058 -24998 -267018
12976 -267018 -226081 193475 93648 143262 317454 -12484 -307955 4027 -158929 29188 -255687
12964 -94756 167126 79341 224676 41779 133675 76592 -137404 97105 -193125 -74223 110293
12952 -20866 205156 90042 -53611 66128 60348 -130689 -156244 208415 -84092 59621 306632
12941 306632 348497 54936 -81195 -45214 327864 -31795 170756 184804 -120881 -325155 15278
12929A16805a65503a4415k6124r801j15111j1798K3774A57089J15705j20292J46617
12918B99119b29556D4830K08355A0145J68552k6268b3089B37753a20801A41380
12907B1360c3014m9918A66615l5363b66375B90128J7708E3905R8180o0075f4854
12895C81338j88555l6245d6843A78913a42118D6142L86916b01020B47330j02647
12885A44683B6736J6215i7293E4795p439e6889C2600a84254I6804L48013b45785
12873a0921B02072d1637A65956l2028f5924j37275N9853b7613C22502G5234b18836
12861F6868e4412A27355K65892j82954K9765m2985C3026J04023R6236q9372G656
12849B43129a57732b4682j28431C61452G1441Q1980J11690k4780C9919Q1159A6339
$$ plain form
12929 116805 -165503 -14415 -40539 -50340 -165451 -177249 -153475 157089 272794 152502 299119
12918 299119 -229556 44830 253185 10145 178697 152429 -23089 237753 -120801 141380
12907 21360 -33014 -82932 166615 131252 -266375 290128 307836 53905 152085 92010 -64854
12895 381338 192783 156538 -46843 178913 -142118 46142 433058 -201020 247330 144683
12885 144683 26736 42951 -97293 54795 47356 -56889 32600 -184254 96804 444817 -245785
12873 -10921 202072 -41637 165956 133928 -65924 -203199 -143346 -27613 322502 75234 -218836
12861 66868 -54412 127355 393247 210293 240058 197073 33026 137049 233285 143913 7656
12849 243129 -157732 -24682 -153113 361452 71441 153421 265111 240331 39919 121078 16339
12837C94454C2847b9630A04305b265A02340i2327M3966m511K6106j98578Q6001
12826a39343M6381D43304A98491c21335i1061j21135a01067B05295E6616a36735
12815B68529f2164j51022B4088J06078J68029o0112j9554q6018d19436J6214A24007
12803a3540A39082e7320o1997c1203C9578h810j3931r390A49198O4037p2905a30204
12790b60200b952E5069c0241B13673a34548j88503J31004M4744b512C00362a942
12778e8417j08320B78212J9057B0962K46245G0501d00100D1284f2515H381c15239
12766a56760F5174a71015B4723J11524d3123A52252D5602A1695J37585b4730n8446
12755h3176C1124Q3285J23508o736b16858B00239B0682J77607B6050J0334M3087
$$ plain form
12837 394454 32847 -29630 104305 -2265 102340 -92327 -48361 -52872 -26766 -225344 -139343
12826 -139343 -92962 443304 198491 -321335 -91061 -212196 -101067 205295 56616 -136735
12815 268529 -62164 -213186 24088 130166 298195 238083 218529 132511 -419436 -403222 124007
12803 -13540 139082 -57320 -119317 -31203 39578 -8810 -22741 -32131 149198 213235 140330 -130204
12790 -260200 -2952 55069 -30241 213673 -134548 -323051 -192047 -147303 -2512 300362 -1942
12778 -58417 -166737 278212 297269 20962 267207 70501 -400100 41284 -62515 8381 -315239
12766 -156760 65174 -171015 24723 136247 -43123 152252 45602 11695 149280 -24730 -83176
12755 -83176 31124 114409 237917 231181 -216858 200239 20682 198289 26050 36384 79471
12744G9471L9472E1514a8486C1145J74975p5079K6547l628d0518k57780A20750
12732B58366l943k7170p6298L00207a2088G9921g332B8950b4416A77374A8671
12720a17515B7806f3362p2538B46288j12156b8206A36825f3200B45402I4943J55444
12709B50387K43311j61446A38546j0117m9143J76162L8831J79604A71631a31717
12698A41850a53611d7022D9844L10652B525J56606g0272A00174L2303L0331f5274
12686a07241c9083D4316J41096M38543a11668C7877M7573J00126C3479L41530
12676C75009J02430b73061h2993D5312L22094i5275B23423D5823a24117M3685
12666h0432B95981b48231C15935I3908d7990A25443m3637l0382J73209J3030a85603
$$ plain form
12744 79471 118943 51514 -18486 31145 206120 131041 157588 153960 -40518 -298298 120750
12732 258366 254423 227253 150955 451162 -12088 79921 -7332 28950 -24416 177374 18671
12720 -117515 27806 -63362 -135900 246288 134132 -28206 136825 -63200 245402 94943 250387
12709 250387 493698 332252 138546 128429 79286 255448 294279 473883 171631 -131717
12698 141850 -153611 -47022 49844 360496 2525 159131 -70272 100174 132477 162808 -65274
12686 -107241 -39083 44316 185412 623955 -111668 37877 85450 185576 33479 375009
12676 375009 477439 -273061 -82993 45312 367406 -95275 223423 45823 -124117 -80432
12666 -80432 295981 -248231 315935 93908 -47990 125443 81806 51424 224633 237663 -185603
12654B47624e16266d0034a206q6013A15791L55416D2158f2518A26180d0684p0782
12643a11466d9960B26796a26912n9705A76149J29598A12470k4571a09561B3828
12632b1986A24267J10459a67441D22068d4151A45468L46200I6351N567J46307
12622B48225F5941J45956r5584K74937G9833a47906D09331f9720D68578b4442
12611C983h7261O386L2225G9969b7890B20223d2842B85501m5159a67053B35222
12599a35479d4343j59837i4600c1108E3359d6382o3546A20934K34180j33834B8503
12587b1964C12984j32161f68A43752n794F2351a56492A90427O0027g3681E6189
12575A35294f2379B29624E1826a9389j16940A09452q426O5673O6242Q3872i588
$$ plain form
12654 247624 -516266 -40034 -1206 -87219 115791 471207 42158 -62518 126180 -40684 -111466
12643 -111466 -49960 226796 -126912 -186617 176149 305747 112470 87899 -109561 23828
12632 -21986 124267 234726 -167441 422068 -44151 145468 491668 96351 101918 248225
12622 248225 65941 211897 116313 391250 79833 -147906 409331 -69720 468578 -24442
12611 3983 -87261 -80875 -48650 79969 -27890 220223 -42842 285501 240342 -167053 235222
12599 -135479 -44343 -204180 -94600 -31108 53359 -46382 -109928 120934 355114 221280 28503
12587 -21964 312984 180823 -668 143752 137958 62351 -156492 190427 250454 -73681 56189
12575 135294 -62379 229624 51826 -19389 -136329 109452 101026 166699 232941 316813 -9588
12563f0023C67504H6798l2596J7917L28356d29570A82761D2545O6137C6302J99855
12552B36157h0246j03641c5813k10598m9819j10553b0793r1637c8331o2132E3063
12540f1625m6862j28763B1782M3170Q9647A6225J60774K36278A05796j9269M31757
12529E18284g4878j11448P2774B34074a88196A9977d25452a82148b2857A08510
12518F7388K71854b11334f7687L318A14444L8958B3495M55695f365K019k09335
12507b13681B09566K2376a3349G3224J49447i1030c444B84930N2358a02739E2894
12495c73000A25731J785h5625k33237N2312H9879d3557A05222h8581c0908B01902
12483A51342a66107A81943G1691C5353R391P7711a18743L990C17717j40390j7984
$$ plain form
12563 -60023 367504 86798 54202 72119 400475 -429570 182761 42545 108682 36302 236157
12552 236157 -80246 -183887 -35813 -246411 -296230 -406783 -20793 -112430 -38331 -100463 53063
12540 -61625 -108487 -237250 21782 64952 154599 16225 176999 413277 105796 86527 518284
12529 518284 -74878 -186326 -113552 234074 -188196 19977 -425452 -182148 -22857 108510
12518 67388 339242 -211334 -67687 -64369 114444 153402 23495 479190 -6365 -4346 -213681
12507 -213681 209566 231942 -13349 73224 222671 -91030 -3444 284930 337288 -102739 52894
12495 -373000 125731 127516 -85625 -318862 -266550 89879 -43557 105222 -88581 -30908 201902
12483 151342 -166107 181943 71691 35353 44744 122455 -118743 -114753 317717 177327 159343
12472A59343E5552K81100r4904A1801f2994k15215B04003p9476n3291a43734M2205
12461a01529k97810c9007A62803i2338B32781j02518m8229a29319B84149A29548
12450A55546a08157D2337J48365G8261M5647a16361a2293k44611J10047e6764
12439E4217K64196F810d7593D6152P1097b36008B19163q5841I199J88786c3532
12427H8321a0035D9124a144j81955j4979B2685J62043D1571e888H9801a23301
12415A8349K6044J18000m4704J936f0496C97491p2133a40671e9748J6242k44514
12404b88020D04424H3873a2682A62020d88703h4769b3849C03227a8631d014A30943
12392H9602a83706L0205O121O4431j30443a2216G9307N5868b3232k13929f697
$$ plain form
12472 159343 55552 336652 241748 11801 -62994 -278209 204003 124527 71236 -143734 -101529
12461 -101529 -399339 -39007 162803 -92338 232781 130263 82034 -129319 284149 129548
12450 155546 -108157 42337 190702 78261 123908 -116361 -12293 -256904 -146857 -56764
12439 54217 318413 6810 -47593 46152 117249 -236008 219163 133322 9199 197985 -33532
12427 88321 -10035 49124 -1144 -183099 -198078 22685 184728 41571 -5888 89801 -123301
12415 18349 44393 162393 117689 119625 -60496 397491 325358 -140671 -59748 -43506 -288020
12404 -288020 404424 83873 -12682 162020 -488703 -84769 -23849 303227 -18631 -4014 130943
12392 89602 -183706 -153501 -147380 -82949 -213392 -12216 79307 135175 -23232 -237161 -6697
12380b79572C8485J22673b9841p1378A47442b8276n576c791A35221k0640d9415
12368g0294C54465f3211A31397A56O4960R6778d9231k31842e4863H7444a03186
12356b89776A25383L5925a31029A29816n089d0250A26044b59494B5513J0414J04271
12345A40198a17987I3177c05589E5705r345i7131A92739G6424n707a69889e70
12333A47750b80130I5212a34378k152C39996a22095j26458C17610c42477a63088
12322E2002b96187C18743A25322a24495B01584B3588c54308a14040B76070j11322
12312A64748d3531l3916C15359A48040a4881C09273h4336o2531e0008E7038e3432
12300c68201C19740E2770j4282J79625K4720j21136a4674H0853l8700G594O185
$$ plain form
12380 -279572 38485 161158 -29841 -101219 147442 -28276 -33852 -3791 135221 114581 -49415
12368 -70294 354465 -63211 131397 156 65116 161894 -49231 -281073 -54863 87444 -103186
12356 -289776 125383 161308 -131029 129816 124727 -40250 126044 -259494 25513 35927 140198
12345 140198 -117987 93177 -305589 55705 46360 -97131 192739 76424 70717 -169889 -570
12333 147750 -280130 95212 -134378 -136530 339996 -122095 -248553 317610 -342477 -163088
12322 52002 -296187 318743 125322 -124495 201584 23588 -354308 -114040 276070 164748
12312 164748 -43531 -77447 315359 148040 -14881 309273 -84336 -146867 -50008 57038 -53432
12300 -368201 319740 52770 38488 218113 242833 121697 -14674 80853 42153 7594 13779
12289A3779i7929m9494H6271K95833a96991A0910K39491a71638A61712K37883
12279C99595k5033H0871A6415P1903Q9330n4549J73562a25100B74378E8515K47221
12268C05736A45043b31900A14506E3732Q4775J89656h913A08273J45767a5353
12257i3330j91343d0973A60348g0406I1542J06540i9070J5350A28031J57860C7011
12245B5809J10333Q5957j09020a25677B33243j9485n8832J420e451A88032q3350
12234A04682a30462B07916L5817j8774K2450I3064O1492B1400J05216K36621A51928
12222F539K27038k960Q7611A30738j9224e8039C8666A6846J50768a96525B57134
12210A12511O5196a5753E6678L1131L05651o8623D288L26596J14006A79952R5711
$$ plain form
12289 13779 -97929 -147423 86271 382104 -196991 10910 250401 -171638 161712 399595
12279 399595 374562 80871 16415 88318 177648 123099 296661 -125100 274378 58515 305736
12268 305736 145043 -231900 114506 53732 138507 328163 -8913 108273 254040 -15353
12257 -93330 -284673 -40973 160348 -70406 91542 198082 -99070 -83720 128031 285891 37011
12245 25809 136142 222099 113079 -125677 233243 213758 154926 156346 -5451 188032 104682
12234 104682 -130462 207916 243733 224959 247409 93064 154556 21400 126616 363237 151928
12222 6539 233577 230617 318228 130738 111514 -58039 38666 16846 167614 -196525 257134
12210 112511 177707 -15753 56678 87809 393460 324837 4288 330884 444890 179952 275663
12199B75663J03897A20803A479L69998D395L09622A10148J86109p1411K0182B4107
12187e9069E6464J40740R5243A44301Q5256c464j34196A98499n7548E32K99416
12176B99948j11360c3758B23424j9390G2076C4191K81970O7184c1976E0433b472
12164I2309L144D2051O720b17308N7533C91247A65642a233B32547c8372j55978
12153a94350A59303L1066q8453N774J99551E6779N2246j5014e2840k62561A41812
12141a94545i181A99036p7804F096O5546p790J66724E9321J36729c53967C37601
12129C56971E8954D8b60978A22398J75036K00699B45152l6366b04057C42654a97726
12117b8139j31087b2022B7531b22326a03755B71456I6521B6891b27464M6339P5920
$$ plain form
12199 275663 379560 120803 1479 371477 4395 314017 110148 296257 224846 245028 24107
12187 -59069 56464 197204 292447 144301 229557 -3464 -137660 198499 140951 532 299948
12176 299948 188588 -33758 223424 204034 72076 34191 316161 383345 -31976 50433 -2472
12164 92309 95453 42051 48771 -217308 -159775 391247 165642 -1233 232547 -38372 -194350
12153 -194350 159303 190369 101916 107690 307241 56779 109025 94011 -52840 -315401 141812
12141 -194545 -9181 199036 121232 6096 71642 63852 230576 59321 196050 -353967 337601
12129 356971 58954 48 -260978 122398 297434 498133 245152 208786 -204057 342654 -197726
12117 -28139 -159226 -22022 27531 -222326 -103755 271456 96521 26891 -227464 -181125 -105205
12106a05205E8778b80822A5418P1424J43939q2102J23678b12817j0931H0863J99788
12095B80651h4973A81976d7017k3656B40663j01914g9464A12364B6701J55809
12085A82510c4217D6682a30743A29758B4027N3104a46252F18394J088428L45534
12075B052356G42454a87596A65543F6053f7324C6992i6338H730h0593j84516E0916
12063b03203o2055C56629r1458d5646E6342J66292d6907A17472A1382h4027n7499
12052a41526M339H8295b8400D8890e4506H784J06842a12888k0726A46299b41813
12040E8298c440B71815j34693F4090c9143C0612M5430a57134a0926B7271N1881
12029G9152B830R6925K5852J68295g7071C9663Q8669k4167n805a53659a3404o5990
$$ plain form
12106 -105205 58778 -280822 15418 86842 230781 148679 272357 -212817 -223748 80863 280651
12095 280651 -84973 181976 -47017 -70673 240663 138749 -79464 112364 26701 182510
12085 182510 -34217 46682 -130743 129758 24027 77131 -146252 618394 1706822 2052356
12075 2052356 742454 -187596 165543 66053 -67324 36992 -96338 8730 -80593 -265109 50916
12063 -203203 -265258 356629 265171 -45646 56342 222634 -46907 117472 11382 -84027 -141526
12052 -141526 -137187 88295 -28400 48890 -54506 8784 115626 -112888 -133614 146299 -241813
12040 58298 -3440 271815 137122 64090 -39143 30612 76042 -157134 -10926 27271 79152
12029 79152 2830 99755 125607 293902 -77071 39663 128332 104165 98360 -153659 -13404 -79394
12017g9394A52672L25390a88915a7941k76026A68768g5143p9199I8602l419a12856
12005B05051D4221K5521d553r0587a7188n0993J6989K5590j68253G5287j2356
11994F2931a68695E6766a82506N6690c8466k3179J6833l54322I234d4860b708
11982a60075O1486G6479A2704i8628a4073q925j21533C60351F348b22633A21702
11970B67463e6958C9204m30j437J55516b36174I901P8100J0527B298J72653b8500
11957e1931a4859k11239g9321l3100m2007M4257m3045F0058d1832E1364e2323
11945g1973A01653j4166b03004R0102A86405b15072j5588b2157B36643b17656
11934A23608k3314g3027a8582C3646J16287E0801J63269a11837D19021D348a45522
$$ plain form
12017 -79394 152672 478062 -188915 -17941 -293967 168768 -75143 -154342 98602 95183 -112856
12005 205051 44221 69742 -4553 -95140 -17188 -68181 -51192 -25602 -193855 75287 62931
11994 62931 -168695 56766 -182506 -125816 -38466 -61645 -44812 -399134 9234 -44860 -2708
11982 -160075 -98589 76479 12704 -98628 -14073 -22998 -144531 360351 6348 -222633 121702
11970 267463 -56958 39204 38774 37337 192853 -236174 9901 88001 98528 2298 174951 -28500
11957 -51931 -14859 -226098 -79321 -112421 -154428 -110171 -153216 60058 -41832 51364 -52323
11945 -71973 101653 87487 -203004 -112902 186405 -215072 -230660 -22157 236643 -217656
11934 123608 100294 -73027 -18582 33646 149933 50801 214070 -111837 419021 4348 -145522
11922a63008A91287g3123c1231q2752a9822j36438b3769B3404R4404k3551B3063
11910A9130J20017a8983j46178r329O6154q0354A13996a7275j86345G0216a9774
11898c1211B2158K04188A7693b4474A65609c1843H1949L60686c4248j62338A59696
11886c690B38563a02499A2758e3329j71292a9504B58703a32286A14055A255c2940
11874a35261N8488b5250H0168K82963b09905A32605B1908a26160K1830l03937
11864d08267J89158l6804A96787b36603k00119c4733F1751c8339A06482k6261
11854H0221f7719G6363J27922D3005e6888m4697A29358b52943a15617A11603n0047
11843F1556a72475A36202D1440e8377J2470a6252r7255K4157r5045L4935l6754
$$ plain form
11922 -163008 191287 -73123 -31231 -113983 -19822 -156260 -23769 23404 117808 94257 23063
11910 19130 139147 -18983 -165161 -174490 -108336 -188690 113996 -17275 -203620 70216 -19774
11898 -31211 22158 226346 17693 -24474 165609 -31843 81949 442635 -34248 -196586 159696
11886 -3690 238563 -102499 12758 -53329 -224621 -19504 258703 -132286 114055 1255 -32940
11874 -135261 -76773 -25250 80168 363131 -209905 132605 21908 -126160 -104330 -408267
11864 -408267 -219109 -255913 196787 -236603 -436722 -34733 61751 -38339 106482 80221
11854 80221 -67719 76363 204285 43005 -56888 -101585 129358 -252943 -115617 111603 61556
11843 61556 -172475 136202 41440 -58377 -45907 -16252 -113507 -89350 -184395 -149460 -186214
11832a86214j823A53510K90082k20040f5224B42727N3496j38762a14689j22778
11822b37467P05D1750A8345o790M064L8404P1158c1196k59535h1660j67891A65539
11809d49742C29288H4291K5206l9145J20465A5407Q787b776A05895J2934b08366
11797h2010F494b89130A83793a77869B16894j02586b15267g0478j34540n9139
11787b64157H4610Q336a24023l7201P6496B7206a3248k14380K8568m936C8870
11775a76660k29783J55829j6075C03173j08231C9221J67555a68278M0720E5687
11764G7181G593a1022C4350K24907j16925a73679C69917A17356a141k67051A69827
11752B15808b25072A01624J07423F3876a98249C5867N0025c3527p3818e1651j48471
$$ plain form
11832 -186214 -188037 153510 443592 223552 -65224 242727 296223 157461 -114689 -237467
11822 -237467 -236762 41750 18345 11555 15619 54023 125181 -31196 -290731 -81660 -249551 165539
11809 -449742 329288 84291 109497 70352 190817 15407 24194 -2776 105895 118829 -208366
11797 -82010 6494 -289130 183793 -177869 216894 114308 -215267 -70478 -205018 -264157
11787 -264157 84610 92946 -124023 -161224 -84728 27206 -13248 -227628 -199060 -203996 38870
11775 -176660 -406443 -250614 -266689 303173 194942 39221 206776 -168278 -127558 55687
11764 77181 7593 -11022 34350 259257 142332 -173679 369917 117356 -1141 -268192 169827
11752 215808 -225072 101624 209047 63876 -198249 35867 85892 -33527 -107345 -51651 -200122
11741b00122M0938O7550D9563c8474H364K02635a46827B4084b67081c8716B75422
11729a02022d0916C36037p8659A16706B9366L96862B10346d6052l08855b6121
11718A09690N0479c0606B13941a11960A96289A3a22203A33978g9938B46737a67949
11706A85558Q6517a6695l528B004b19047I7097N4614g6499G7595L968C1678a43124
11693c9702q0221I1637B9037P349Q7263C9989N12175A2533Q5540K859C7507a38231
11680C59168b00533E5149R9402F6338J85668a9051G9984J9422K53338r7774f8630
11668D58731G1991R9290q2638n165k5844a85149A068K69215b57616A61814e4561
11656A82931a18721b6251C12398C708a17409k9015H2407d307B46499f3279p919
$$ plain form
11741 -200122 -159184 -91634 49563 -38474 8364 210999 -146827 24084 -267081 -38716 275422
11729 -102022 -40916 336037 257378 116706 29366 426228 210346 -46052 -354907 -26121
11718 109690 160169 -30606 213941 -111960 196289 13 -122203 133978 -79938 246737 -167949
11706 185558 272075 -16695 -20223 2004 -219047 97097 151711 -76499 77595 81563 31678 -143124
11693 -39702 -119923 91637 29037 36386 123649 39989 552164 12533 98073 100932 37507 -138231
11680 359168 -200533 55149 154551 66338 252006 -19051 79984 99406 352744 254970 -68630
11668 458731 71991 171281 88643 83478 57634 -185149 1068 270283 -257616 161814 -54561
11656 182931 -118721 -26251 312398 3708 -117409 -146424 82407 -4307 246499 -63279 -71198
11645g1198J4480I2076c53783A1580M1417d02441B24537j05687K59205j87518
11635A90537D4971c15353i4914k0534A553b75332A11803J39996j16024a6883A36123
11623a80707B40055q9418k4995a10585A60971A6350N691N1972R9622n7865c10182
11611c41467H4037b77300J23383A17034b35456A07724B3030a18254A98694D0999
11600A281J24196K5085f0177l98969a33812I3936D5470K36676g9675I2288K63508
11589C55796a14912B3378J00553K85780A75340K61963q0287m5111h5599B70120
11578A74355a5630C75377b13886D4793O6311B3679g1467b9177A09905j4739f7189
11566D4280a06088J3162B22252b6113B31884b393A14387m4158K39829i7582D3221
$$ plain form
11645 -71198 -56718 92076 -353783 11580 52997 -402441 224537 118850 378055 190537
11635 190537 44971 -315353 -94914 -115448 1553 -275332 111803 251799 135775 -16883 136123
11623 -180707 240055 150637 125642 -110585 160971 16350 22041 74013 173635 115770 -310182
11611 -341467 84037 -277300 -153917 117034 -235456 107724 23030 -118254 198694 40999
11600 1281 125477 150562 -60177 -459146 -133812 93936 45470 282146 -79675 92288 355796
11589 355796 -114912 23378 123931 409711 175340 437303 357016 311905 -85599 270120
11578 174355 -15630 375377 -213886 44793 111104 23679 -71467 -29177 109905 95166 -67189
11566 44280 -106088 -92926 222252 -26113 231884 -2393 114387 70229 310058 -97582 43221
11554a81672p0794Q0607c116m3122a4907B88085a30196k7878A32359K82871e5197
11542A40321K4209F7166J73916d646B31412C9513J3169K3718j2572O3349K58648
11531C85825b31792f8395B93426A7163c9576j01493J1551I668h1487A66327G2086
11519A91904L48876A37424b66259a7734D86378a20169p0547B9560J47143J18252
11509B94955H5038K6796J05391b20404B25696I2690N443J19026j03023K4429a510
11497B1432b66312A42595P7850a4791k643E6588J83874p8101K34665j65504J07790
11486C39312L2826B7981L4065M165J05366J34674o3329a83079B04522B8186J57448
11475A85634L26876A06188K05830G8884J34275J85880A22051a41288I7319p783
$$ plain form
11554 -181672 -252466 -171859 -3116 -46238 -14907 288085 -130196 -158074 132359 415230 -55197
11542 140321 164530 67166 241082 -4646 231412 39513 52682 76400 63828 127177 385825
11531 385825 -231792 -68395 293426 17163 -39576 -141069 -129518 9668 -81487 166327 72086
11519 191904 540780 137424 -266259 -17734 486378 -120169 -190716 29560 176703 294955
11509 294955 85038 111834 217225 -220404 225696 92690 98133 217159 114136 138565 -1510
11497 21432 -266312 142595 220445 -14791 -17434 56588 240462 162361 397026 231522 339312
11486 339312 372138 27981 62046 66211 171577 306251 242922 -183079 204522 28186 185634
11475 185634 512510 106188 312018 78884 213159 399039 122051 -141288 97319 89536
11465H9536a52614i760l3148B83608M7522I7502l0118M6368a64305A45423E6079
11453A0280J11590B630a45940j18931D9258A8402L9044b00627C7819O9514a37853
11441B27196p4149i953n4260C55842h3078k64921C61290J25640e9187A11375m7244
11430F4131L64107c3389H48e8959b4627A42855i7266B09889a32972A26331C1586
11418a56820P1463q8399B32933A6624R5779b33969a5049H1486J37399a47370B64178
11406B69807A24875c34391a10439E1339M7216a22879G9948J42192a34748j89664
11396c24412f9065B48046a24783F3612c7799J1903j9760n7807A55988d65r7550
11385i8015M1314L082h965n4549D63145a32104A25793b62618B34641d5426B81418
$$ plain form
11465 89536 -152614 -9760 -42908 283608 331130 97502 67384 113752 -164305 145423 56079
11453 10280 121870 2630 -145940 -264871 49258 18402 57446 -200627 37819 107333 -137853
11441 227196 153047 -9953 -64213 355842 -83078 -347999 361290 486930 -59187 111375 64131
11430 64131 428238 -33389 848 -58959 -24627 142855 -97266 209889 -132972 126331 31586
11418 -156820 -85357 -173756 232933 16624 112403 -233969 -15049 81486 218885 -147370 264178
11406 269807 124875 -334391 -110439 51339 98555 -122879 79948 222140 -134748 -324412
11396 -324412 -69065 248046 -124783 63612 -37799 -25896 -45656 -103463 155988 -465 -98015
11385 -98015 -56701 -53619 -8965 -63514 463145 -132104 125793 -262618 234641 -45426 281418
11373a3844B18208J03402Q8784A47574b51553E1386b9807j11428A78013B4829
11362h6967n2313B33873C4013J39391a00401b7733j4585A05000h8000o6636D3074
11350b35689D0173L58482h2924k19255C15944a45686q9051A12081a42325O8233
11340g4092A41961e384n8362j4632k00972A57623a44877b2995r2597B37276e1022
11328B31090a49841A13285A9134a97808B08858J11251a12179A99226a08899C70076
11317a568A53110J21578d5053R16j11160O2342M4773j03551A09966f0098C80652
11305a92703K2321B1965a4207A55800o1964a04329L802q6733l3038j58603a03465
11293b93569a7192k93661C23467c95685J02129A52306a53171j3295B17618c7108
$$ plain form
11373 -13844 218208 321610 410394 147574 -251553 51386 -29807 -141235 178013 24829
11362 -86967 -139280 233873 34013 173404 -100401 -27733 -42318 105000 -88000 -154636 43074
11350 -235689 40173 398655 -82924 -302179 315944 -145686 -234737 112081 -142325 -74092
11340 -74092 141961 -5384 -63746 -78378 -279350 157623 -144877 -22995 -115592 237276 -51022
11328 231090 -149841 113285 19134 -197808 208858 320109 -112179 199226 -108899 370076
11317 -1568 153110 274688 -45053 -44137 -155297 -92955 -48182 -151733 109966 -60098 380652
11305 -192703 -170382 21965 -14207 155800 93836 -104329 -100527 -187260 -220298 -378901 -103465
11293 -293569 -17192 -310853 323467 -395685 -293556 152306 -153171 -166466 217618 -37108
11282b32311A71947o7172b48721g7717E0454b0669l49968O5735M7608f672p8275
11271h4947K6977A35594Q4719a58945n4511P6041k64231a28334O2972H5711a44283
11259E6911h5422A42409e458A39040i8742j72422F7026a21532j29316H0371a98049
11247a29900e2093n4611e1442A29016k5809c69143J51463F3780B6012a89608A34204
11235A18210a92272A78566b37657M6907Q3159k26285J24644O4382B27773Q1107
11225C08880b7979o9124A51740i5853A90144a17192J352A57109a01052d3474j7098
11214f0572j7688J0961j35179E3346c74129D1812b77060e8843A37516e118r9468
11203a04586D55158a33699l07553f8275p2718k11194p0669K10315p4889a23709
$$ plain form
11282 -232311 171947 104775 -248721 -77717 50454 -20669 -370637 -304902 -257294 -6672 -84947
11271 -84947 -57970 135594 220313 -158945 -213456 -137415 -401646 -128334 -65362 85711 -144283
11259 56911 -85422 142409 -5458 139040 -98742 -271164 67026 -121532 -250848 80371 -198049
11247 -129900 -52093 -106704 -51442 129016 103207 -369143 -217680 63780 26012 -189608 134204
11235 118210 -192272 178566 -237657 -190750 -107591 -333876 -209232 -144850 227773 308880
11225 308880 -27979 -97103 151740 -95853 190144 -117192 -115840 157109 -101052 -43474 -60572
11214 -60572 -78260 -67299 -202478 53346 -374129 41812 -277060 -58843 137516 -5118 -104586
11203 -104586 455158 -133699 -441252 -68275 -140993 -352187 -422856 -212541 -287430 -123709
11192F3389J16825G8986a4532p7814B33551a55979Q006e2533j6347I8288d1017
11180G2238J16140a0235A68359b11270D4761g6929A3114a50487L0229A60413J02497
11169B62910f479A52963b5595D4152h7921k31256I5454k3179a12749B9842J07296
11158A37138k3829C0990L39667a65354d0748J7460p6001A47571d41852I9418R2799
11147A92217i0489D2661a53035N4321D7110F731h1822a3320H6881J01903A3631
11135c32834A47307a69082O0845B07911J25295I9338a7687B1086P1831L54655
11125D47572b6681D969J14773h9488J2697C40120c87969J59496I0341q22l3380
11114E6139J17923O2651b9195B28806r9147b3592k16697A81462J74572a09618
$$ plain form
11192 63389 180214 78986 -14532 -92346 233551 -155979 -147973 -52533 -68880 98288 -41017
11180 72238 188378 -10235 168359 -211270 44761 -76929 13114 -150487 -120258 160413 262910
11169 262910 -6479 152963 -25595 44152 -87921 -319177 95454 72275 -112749 29842 137138
11158 137138 113309 30990 370657 -165354 -40748 -23288 -99289 147571 -441852 99418 192217
11147 192217 -90489 42661 -153035 -98714 47110 6731 -81822 -13320 86881 188784 13631
11135 -332834 147307 -169082 -108237 207911 333206 99338 -17687 21086 92917 447572
11125 447572 -26681 4969 119742 -89488 -76791 340120 -387969 -228473 90341 89519 56139
11114 56139 174062 236713 -29195 228806 129659 -23592 -240289 181462 356034 -109618
11103A70198J22648j2458j39832D738N0736J22949J09978E6527K74229a65857
11092B75664F6740a5023B44735P8171A24615b13346A81128J23680A08438J88493
11082B96931A32447J12389J77770A16173L11067a4891A05102J84623j06521R3032
11072B76236K23736B49954j16794J15347R9422l878j52091J57001J48420r0967
11062D06414j3092k9071n9135K47806L08090C52881L95039j80225J52850j54029
11052E66516L42329k28279K81189k16837R7958J74930m79001K7149O7296J05541
11042G38791m9819K79284j05514M8683k42953k67150J22436O0138K6102p9366
11032E30632J44253J25603J62037B92638K21082j41657K77363L75678k80563L61913
$$ plain form
11103 170198 292846 280388 140556 4738 55474 178423 288401 56527 330756 -165857
11092 275664 66740 -15023 244735 322906 124615 -213346 181128 304808 108438 296931
11082 296931 132447 244836 422606 116173 427240 -14891 105102 289725 183204 276236
11072 276236 499972 249954 133160 248507 347929 344051 191960 348961 497381 406414
11062 406414 393322 364251 305116 552922 861012 352881 747920 567695 720545 566516
11052 566516 908845 680566 961755 744918 842876 1017806 538805 565954 633250 738791
11042 738791 688972 968256 862742 911425 668472 401322 523758 583896 609998 530632
11032 530632 674885 800488 962525 292638 513720 372063 649426 1025104 744541 1106454
11022A106454m44905l1645P6880C25943L60936o3963j86159J20229M0001l7466
11012E59521k13766L379m8848L47152M6824j16509k448J47080R9915j37737q0531
11001F04032K00378j18606J56215j04135k47515J76981l4189O8472p2863R2340
10991G21110l2033C28701K42738L6180M20736j32841L52102m00512J28505j70257
10981H05352N31103m58153N62133j93879M93943k11897l104K43969J98511Q49097
10971B817075J3200K76601n75566N19250m02786l55934N9052n45558r9875J36903
10961A842362L9077j29025M0108R5784j68679J97625q6111l1271M825k96750j99637
10950A308308p1612k94191K03590k39137m24738M4565j26396A03905M60864B80515
$$ plain form
11022 1106454 661549 629904 706784 325943 686879 622916 436757 556986 596987 559521
11012 559521 345755 349134 300286 647438 694262 577753 575305 722385 822300 684563 604032
11001 604032 804410 685804 842019 737884 490369 667350 633161 701633 628770 721110
10991 721110 689077 328701 571439 607619 1028355 895514 1247616 847104 975609 805352
10981 805352 1336455 878302 1440435 1246556 1740499 1528602 1525498 1769467 1967978 2817075
10971 2817075 2830275 3106876 2531310 3050560 2647774 2291840 2350892 1805334 1705459 1842362
10961 1842362 1881439 1752414 1792522 1888306 1719627 1917252 1831141 1799870 1804695 1507945 1308308
10950 1308308 1236696 942505 1146095 906958 482220 526785 400389 103905 564769 280515
10939A24395M85472l04462a6078A94247j9240G787a41216D22791A74806N1701
10929B26507c7932p8762G5721h3270g990B14508r8904K0154b29119B25141B408
10917a9555n505l9882j42579A48516O7999i7863n7164A02218a08753c6076G6531
10905C0251J59308i5737H908a35310C75858g8799B29814b39267J05840J4184D1384
10893f8572d031A70198O0553j06874a0681A25797g6893D2375L6197k313K6165
10882A02424a98210h3852p4600A1084h3587K4187D3862Q9226a13550C2245D295
10870h3181j8261A63345n2534J47807b09065A25061L7087a20144B0283d409j34682
10859a39091a8249l1364M769B52958e71922K67612d0348n0174I7156J21257H585
$$ plain form
10939 124395 609867 305405 -16078 194247 175007 7787 -141216 422791 174806 226507
10929 226507 -37932 -116694 75721 -83270 -7990 214508 115604 135758 -229119 225141 2408
10917 -19555 -25060 -64942 -207521 148516 216515 -97863 -155027 102218 -108753 -36076 76531
10905 30251 189559 -95737 8908 -135310 375858 -78799 229814 -239267 -133427 -119243 41384
10893 -68572 -4031 170198 230751 123877 -10681 125797 -76893 42375 78572 76259 102424
10882 102424 -198210 -83852 -158452 11084 -83587 -59400 43862 133088 -113550 32245 4295
10870 -83181 -101442 163345 110811 258618 -209065 125061 162148 -120144 20283 -4409 -139091
10859 -139091 -18249 -49613 -44844 252958 -571922 -304310 -40348 -90522 97156 218413 8585
10847f8689A7012b55770B82023b18647K6878b7730A75235p5239a1747j35139O9156
10836g7730a8085A97403o1038c40632C06090b53356a3860A10938J67014D6914
10825a7589A46169p0961J59748a15206m4602D4777a39936I297d1626n3105O441
10814h8290B65456c37922A0486K16381a063G0765i4461F8955c67234a71985f1331
10802a085B1521c1480d029p7885G056J77710h8516h274m278j21350j74071N2424
10790b55549a13096F3196K27126a15458j4590A27712a74875A40876b6757E0423
10779A21543i5341j94520a5734j15162j734J069D0178f784p4711r3762K0250A67101
10766A24128a40704A41385a19677j96882J20871r6349b6241A74245h9845F5918
$$ plain form
10847 -68689 17012 -255770 282023 -218647 -191769 -27730 175235 99996 -11747 -146886 -77730
10836 -77730 -18085 197403 136365 -340632 306090 -253356 -13860 110938 277952 46914
10825 -17589 146169 75208 234956 -115206 -159808 44777 -139936 9297 -41626 -94731 -88290
10814 -88290 265456 -337922 10486 226867 -1063 70765 -94461 68955 -367234 -171985 -61331
10802 -1085 21521 -31480 -4029 -81914 7056 184766 -88516 -8274 -12552 -133902 -307973 -255549
10790 -255549 -113096 63196 290322 -115458 -130048 127712 -174875 140876 -26757 50423
10779 121543 -95341 -289861 -15734 -130896 -132630 -131561 40178 -6784 -81495 -175257 -155007 167101
10766 124128 -140704 141385 -119677 -316559 -195688 -292037 -26241 174245 -89845 65918
10755c30109B804b2561A33074B0327e2513k69837e8606k1383j07098e4623A36808
10743d6215j12394I4978G401O3143M9542L0733D5140b06028c4409k41076I8613
10731E6525a42258A59349a92982D5246J47962b40318Q6550J9376D5991a63287
10720B3697a35828j69264J31157p5869G1605j5600a85603g3180D2572a12458l3370
10709a45828A04003f2018A44091F9947c03646e9467j86427A92706n5352c3461
10698B5517M0490j454K68491A20485M397b90159F8025B6873L63281i1468B0235
10686H9085d66706F3660a2161C0813a4021F2719c36282F6619J18837F226i1035
10674c20193J11639A32481a43772o3212h3314j00270A10521g1763C01651b97560
$$ plain form
10755 -330109 2804 -22561 133074 20327 -52513 -322350 -58606 -79989 -187087 -54623 136808
10743 -46215 -158609 94978 7401 70544 120086 150819 45140 -206028 -34409 -275485 98613
10731 56525 -142258 159349 -192982 45246 193208 -240318 -153768 -134392 45991 -163287
10720 23697 -135828 -305092 -173935 -249804 71605 56005 -185603 -73180 42572 -112458 -145828
10709 -145828 104003 -62018 144091 69947 -303646 -59467 -245894 192706 137354 -33461
10698 25517 66007 64553 333044 120485 124882 -290159 68025 26873 390154 -91468 20235
10686 89085 -466706 63660 -12161 30813 -14021 62719 -336282 66619 185456 6226 -91035
10674 -320193 -208554 132481 -143772 -206984 -83314 -183584 110521 -71763 301651 -297560
10663i2138C794N0453L4450J17591i8283n6841b626F5600a82021e3007H4094b901
10650a07528o1976k5345l1055h6505k0700c3518E741J7292Q959P8918b89363J6116
10638b73247e4784k53534a45325h897A28227f553a699A22556a5000l23948O9675
10627b69273A82604J7841a51808C13562i2995A99145b00212l17644A16902a06904
10616e3953A62397b82048A13101j7778A6727L06691b51735P2768I3175l5186d6036
10604a29240A65c2356B80225a28054q7442A7746b0501j545B20789b63375k81217
10593e44592c6355H6094J92556a65028L2732D28335B0066d7615l02203a29566
10582b691A17997J6156j4914d6358B4172G717b57188B74490q3908E008b79939
$$ plain form
10663 -92138 3794 54247 88697 206288 -98283 -155124 -2626 65600 -182021 -53007 84094 -2901
10650 -107528 -169504 -194849 -225904 -86505 -107205 -33518 5741 23033 31992 110910 -289363 -273247
10638 -273247 -54784 -308318 -145325 -8897 128227 -6553 -1699 122556 -15000 -338948 -269273
10627 -269273 182604 200445 -151808 313562 -92995 199145 -200212 -517856 116902 -106904
10616 -53953 162397 -282048 113101 95323 16727 323418 -251735 -178967 93175 57989 -46036
10604 -129240 165 -32356 280225 -128054 -215496 17746 -20501 -22046 220789 -263375 -544592
10593 -544592 -36355 86094 278650 -165028 -132296 428335 20066 -47615 -349818 -129566
10582 -2691 117997 134153 119239 -46358 24172 7717 -257188 274490 190582 5008 -279939
10570a41436j31095f15A93147c7326P635k24631h633H6985a05816k9898d4882
10558e3638B78494a10712c4258I4346b6667j56375F1202d3907A2198K08554b15876
10546b38048B2326L08602c7915A14759B0929b95738A31248f3945q4711a0923r4766
10535a05689p3400I2445b40335E2185a952j68763L4999B4922R0638N5477m8715
10524A22322c20286n4445a30228c7297a7192j86278B21549I5855R7430j7076o5777
10513A10432O3394D2841J02643b37031p232k3884A07884a97159e4249R449A69638
10501I7081L3690f668k0821H7381J47047a2974l3412j34367j89679d3602D8830
10489A31281C496f4810I1359E52a16720B04750a96461F8841L01372J84394j97665
$$ plain form
10570 -141436 -272531 -615 193147 -37326 -29691 -254322 -8633 86985 -105816 -135714 -44882
10558 -53638 278494 -110712 -34258 94346 -26667 -183042 61202 -43907 12198 220752 -215876
10546 -238048 22326 330928 -37915 114759 20929 -295738 131248 -63945 -148656 -10923 -105689
10535 -105689 -179089 92445 -240335 52185 -1952 -170715 -135716 24922 115560 171037 122322
10524 122322 -320286 -374731 -130228 -37297 -17192 -203470 221549 95855 193285 176209 110432
10513 110432 173826 42841 145484 -237031 -244263 -268147 107884 -197159 -54249 -44800 169638
10501 97081 130771 -6668 -27489 87381 234428 -12974 -46386 -180753 -370432 -43602 48830
10489 131281 3496 -64810 91359 552 -116720 204750 -196461 68841 370213 554607 356942
10478C56942J13024j8016j89819J5818K9671F3537c48667a19396d9241M316E7464
10466f410k83679R5476M8940N4420A5509O5374h4849b9072j11100M5305o1973
10455a56840F5045a83396K3409K2953C7139a97956O1962q226L1974A57225E6833
10443b73358b1653j94663a5545p6966L4604A6618e1224A29295C7583e995l34884
10432c40879A81047a16148j16082A64822g7871A94123D2197Q2397L3649E2213
10421A73794K7257f934m0932A83020D9527f15j2804A79438a77676B4819b79719
10409A02256Q2315c33480h936m147n4072C700c1150K808C7069f3818h072A4090
10396D2740c5075D2564K22204I4594a11833I9452I084K62161a83074A40977m8560
$$ plain form
10478 356942 469966 451950 262131 277949 307620 63537 -348667 -119396 -49241 -44925 57464
10466 -6410 -290089 -194613 -145673 -91253 15509 80883 -84849 -29072 -140172 -94867 -156840
10455 -156840 65045 -183396 -159987 -137034 37139 -197956 -135994 -144220 -112246 157225 56833
10443 -273358 -21653 -216316 -15545 -92511 -57907 16618 -51224 129295 37583 -5995 -340879
10432 -340879 181047 -116148 -232230 164822 -77871 194123 42197 124594 158243 52213
10421 173794 201051 -6934 -47866 183020 49527 -615 -13419 179438 -177676 24819 -279719
10409 102256 184571 -333480 -8936 -13083 -67155 3700 -31150 -28342 37069 -63818 -8072 14090
10396 42740 -35075 42564 264768 94594 -111833 99452 9084 271245 -183074 140977 92417
10385I2417O8638i2004c7233D45562H2242A5385P5307K53082D95K8830O53798
10374F83123C2638J00505J64501j11739a18261A20196k8498M56724j61711o4064
10364C22647J51474A04453K32048b6846C79930l2341j27708M93r1726R6003J13725
10353C38376h2709D08117A92969M97406l38184J91354B61147K70327O1751j09926
10343D83299B31236L67851P2777k05886c5441A97654K7489f9693A64201h4437
10332B20776q0660J5352l2997j880p933c40138A35144J60729J68892r2872j18048
10321B53845m2222J40593h8574B11740J28491n8111j21760R1374j05495b10334
10310D6286a29224E8056K80719A29596c3034l3332B6760N0973a57062l20H646
$$ plain form
10385 92417 161055 -92004 -37233 445562 82242 15385 90692 343774 495 29325 683123
10374 683123 32638 133143 297644 185905 -118261 120196 91698 548422 386711 322647
10364 322647 474121 104453 336501 -26846 379930 347589 219881 220374 128648 224651 338376
10353 338376 -82709 408117 192969 690375 352191 543545 261147 531474 593225 483299
10343 483299 231236 599087 671864 465978 -35441 197654 225143 -69693 164201 -84437
10332 220776 140116 155468 122471 120591 112658 -340138 135144 295873 464765 371893 253845
10321 253845 211623 352216 -88574 211740 340231 282120 160360 251734 146239 -210334
10310 46286 -129224 58056 338775 129596 -33034 -66366 26760 77733 -157062 -157382 8646
10298b32623I731b2721C14122j47292g7235F5843h663l40786h6937j45975A65785
10286B42205b44615M484c1172h084k82843K8861A43558f2611k280l3721a1518
10274b6533j70829E2104J1282a35682L9020A7737f7287A72654C3092n864P2216
10263I9444K70888a15034c2948D0421R0593J44360J67902m8478J49349k07457
10253C36690J521j19819H739a10802N2773j01867E3967a24515b636l8780j34621
10242a76037B93417a17868d6109A22168e2245l33415J29539N4670G5798R9551
10232A75349R421o3484a15525j08539e6854j29691n6162f6713E9206a13642I7322
10220A01092B49M19401B6710b21679g3335k3102B23413a02150L8970j76j43410
$$ plain form
10298 -232623 9731 -22721 314122 166830 -77235 65843 -8663 -349449 -86937 -232912 165785
10286 242205 -244615 -240131 -31172 -8084 -290927 -262066 143558 -62611 -64891 -98612 -11518
10274 -26533 -197362 52104 63386 -135682 -96662 17737 -67287 172654 33092 27228 99444
10263 99444 370332 -115034 -32948 40421 131014 275374 443276 394798 544147 336690
10253 336690 338211 218392 8739 -110802 -58029 -159896 53967 -124515 -2636 -41416 -176037
10242 -176037 293417 -117868 -46109 122168 -52245 -385660 -256121 -201451 75798 175349
10232 175349 184770 121286 -115525 -224064 -56854 -186545 -242707 -66713 59206 -113642 97322
10220 101092 249 419650 26710 -221679 -73335 -96437 223413 -102150 -63180 -63356 -206766
10209b06766Q8800j61710a14883k73217B13757l5878a78982a4650q2105j23167
10199b19922b0930j27425b7546j50308L3930p1492r3740a16956j21039a01135
10188b14090N2945A06903J28996G8550e183r5682k9928p145C0045a07688A12410
10176B9384c910m1617m16346K19224A7825f8745D1098h270B25517H0055l5440
10165D4615b01429C8580J35397a46269A38606n5554K482b2791l33636a3200l3017
10154d6217k86075a07928C0081a94415g1828j80677c8757m08930B33390b9185
10143a65056G8771b22281B8545L5861e9393r9019j00590b2072m1961m30273A95154
10131a03132A41880a49812e9599l61950a89069g9435j81681R7474k61606B51102
$$ plain form
10209 -206766 -117966 -279676 -114883 -388100 213757 177879 -178982 -14650 -96755 -219922
10199 -219922 -20930 -148355 -27546 -177854 -143924 -215416 -309156 -116956 -237995 -101135
10188 -214090 -161145 106903 235899 78550 -5183 -100865 -130793 -137938 30045 -107688 112410
10176 29384 -3910 -45527 -461873 -242649 17825 -68745 41098 -8270 225517 80055 44615
10165 44615 -201429 38580 173977 -146269 138606 83052 85534 -22791 -356427 -13200 -46217
10154 -46217 -332292 -107928 30081 -194415 -71828 -252505 -38757 -447687 233390 -29185
10143 -165056 78771 -222281 28545 64406 -59393 -158412 -259002 -22072 -64033 -494306 195154
10131 -103132 141880 -149812 -59599 -421549 -189069 -79435 -261116 -163642 -425248 251102
10120a3192j2328k1349B61358b70043e1620b765A63789n1155n1866J31510a22137
10108F2263g9998g261A84603c05679a30157n5831l29536a62736C47519A05815
10097a25494C45231c67182R0447H8775L3684c1455B09866A5704L156a47694A27852
10085A1086f9163j47000f4716j92961B6243a57181E3775b7139p4845q6511Q0839
10074a07656j4871j7817d3153j61261A77224H7383b21384A91959c20941B78751
10063b12351J3005R8453A41993J4794d7779B50974a59812N5444c6619r0499j41159
10052b68277J02728q7425B74600r8680a33838A40485c14273a22441m4246B1870
10041C8286M6723d2675A48056a21213I522O2254b73696E04J61835B0342b6344
$$ plain form
10120 -13192 -25520 -46869 261358 -270043 -51620 -2765 163789 112634 60768 192278 -122137
10108 62263 -79998 -7261 184603 -305679 -130157 -185988 -515524 -162736 347519 105815
10097 -125494 345231 -367182 -276735 88775 122459 -31455 209866 15704 18860 -147694 127852
10085 11086 -69163 -216163 -64716 -257677 26243 -157181 53775 -27139 -101984 -188495 -107656
10074 -107656 -122527 -140344 -43153 -204414 177224 87383 -221384 191959 -320941 278751
10063 -212351 -199346 -100893 141993 156787 -47779 250974 -159812 -104368 -36619 -127118 -268277
10052 -268277 -165549 -252974 274600 175920 -133838 140485 -314273 -122441 -166687 21870
10041 38286 85009 -42675 148056 -121213 9522 71776 -273696 504 162339 20342 -26344
10029a07047e0985p3856n5846l1575Q6996L0214k38706h5521k8787j09207M4424
10018a79091M7849K6096A02328b13070A13459C0799Q3466j177K1117c66707a73834
10006b0118m5302q9126L242D431d05931a47925B853d4764j53716I2943b42480
9994C0982C581b13284d9901j45037i0818R262D08047E595i5329j41510B27513
9982a64680L1278K1151C749a77531d1403k61761e549k15985A7176J84979c9837
9970a14763K6281j09139K5287A15670a66834F0951A4831b00145A94639e6901J033
9959e5868n2685b9023H0061K42300b76693a0823j35911A36124a19493n0020B41076
9947a80055A08918P719O7726c45922B75627G2283a1714j76316N6113k4644N8767
$$ plain form
10029 -107047 -50985 -124841 -180687 -212262 -125266 -95052 -333758 -85521 -114308 -223515 -179091
10018 -179091 -131242 -105146 102328 -213070 113459 30799 114265 113088 134205 -366707 -173834
10006 -20118 -65420 -154546 -151304 4431 -405931 -147925 2853 -44764 -198480 92943 -242480
9994 30982 3581 -213284 -49901 -194938 -90818 -81556 408047 5595 -95329 -236839 227513
9982 -164680 -133402 -112251 3749 -177531 -41403 -303164 -5549 -221534 17176 202155 -39837
9970 -114763 -88482 -197621 -172334 115670 -166834 60951 14831 -200145 194639 -56901 -55868
9959 -55868 -108553 -29023 80061 322361 -276693 -10823 -146734 136124 -119493 -169513 241076
9947 -180055 108918 116637 184363 -345922 275627 72283 -11714 -188030 -131917 -156561 -97794
9936i7794n298a7621j85602p9739Q6468g2312D1425a6673A16736L4948a748A2552
9923e6454j43743d9120j03973B8927a49856A8011h9650k31522o0179D3176d5865
9911A44437a24091A18354k5010J15872m9900K4516b53396g6483B2471J6571d7898
9899c1137B47666b69116f1002A61412a35390A04133a33869j53351J18772L1213
9889a37235j57389k8940D4052b05944A23804b45341c1190j50913A87761a91096
9878A83789A4199c8629A5644K9976J19887a96143F42K07891a0518j78784e9551
9866d367F0889a83577L4704A20606l2122a31539e2434E3319J32241e1145H4203
9854d1668o4010J7154R083C24882d06825J06562C6720g9194D5177c49233b4308
$$ plain form
9936 -97794 -103092 -17621 -203223 -282962 -196494 -72312 41425 -16673 116736 151684 -1748 12552
9923 -56454 -200197 -49120 -153093 28927 -149856 18011 -89650 -321172 -381351 43176 -45865
9911 144437 -124091 118354 93344 209216 159316 183832 -253396 -76483 22471 39042 -47898
9899 -31137 247666 -269116 -61002 161412 -135390 104133 -133869 -287220 -168448 -137235
9889 -137235 -294624 -323564 44052 -205944 123804 -245341 -31190 -182103 187761 -191096
9878 183789 14199 -38629 15644 45620 165507 -196143 642 208533 -10518 -189302 -59551
9866 -4367 60889 -183577 -148873 120606 88484 -131539 -52434 53319 185560 -51145 84203
9854 -41668 -105678 -88524 -79441 324882 -406825 -300263 36720 -79194 45177 -349233 -24308
9842B49388C4884L26227r6555i4532k5900j42675j12603J54917g943I944h9426
9830A3644J10073a53512d1034k11688E2934B1002P2685a86979G2336E884R8667
9819A04551f6219K3063k34727R1645n1715e0698j06827I5372h509l59875A83317
9807A43635h849j78177I8551b84847a07823B10561c00503e0460p0874k5638A51778
9795a7423j6522F848O1742a33713l16084b14971C4040a06834H9127m2998j2627
9784C3502L13960g9293A21492c59775H6289a90009K4434j50643Q8877r4653a52798
9772A37954a90899B12936b05175d9536a7304j01893C427K558J93904c02621B6889
9760A71343f058A57705b69006B28434b2658j08556K6771I2889L1825a01757D9265
$$ plain form
9842 249388 34884 361111 264556 -94532 -120432 -263107 -375710 -220793 -7943 9944 -89426
9830 13644 123717 -153512 -41034 -252722 52934 21002 93687 -186979 72336 5884 104551
9819 104551 -66219 -43156 -277883 -186238 -237953 -50698 -157525 95372 -8509 -368384 183317
9807 143635 -8849 -187026 98551 -284847 -107823 210561 -300503 -50460 -121334 -146972 151778
9795 -17423 -33945 6848 68590 -133713 -449797 -214971 34040 -106834 89127 46129 33502
9784 33502 347462 -79293 121492 -359775 86289 -190009 -165575 -316218 -227341 -321994 -152798
9772 137954 -190899 212936 -205175 -49536 -17304 -119197 3427 5985 199889 -302621 26889
9760 171343 -6058 157705 -269006 228434 -22658 -131214 -104443 92889 124714 -101757 49265
9748A17216D2651O1124L2351D5908a78598j92198b8451A35498h8299K5135j75065
9737b38229J18195C6243g5382r5892k06022A67623n3340d1056C6012j4765c30487
9725H2243c03334i4582k09977O9835H8249b58142B24213H2072b95531f1950j5548
9714g7498H8069b95599h7881A18860a00927n5848H1966M0690n7789a28554d3937
9702G0515b3719q6356A40574o2714j3936d7576p9403k14329F0357e0950o1898
9691a12848I5873J91717l3234C5463a51323k4390B1069c9856n0361l88255b9233
9679e7681R662E3330a39011D2601N7555a43987A80113f0405A09517c0172j97935
9668b28107J01674j8408O1157j65427j04263a22709l96541B92290i9040l80423
$$ plain form
9748 117216 42651 103775 136126 45908 -178598 -370796 -28451 135498 -88299 -63164 -238229
9737 -238229 -120034 36243 -75382 -171274 -377296 167623 114283 -41056 36012 21247 -330487
9725 82243 -303334 -94582 -304559 -234724 88249 -258142 224213 82072 -295531 -61950 -77498
9714 -77498 88069 -295599 -87881 118860 -100927 -156775 81966 122656 64867 -128554 -43937
9702 70515 -23719 -110075 140574 77860 63924 -47576 -126979 -341308 60357 -50950 -112848
9691 -112848 95873 287590 254356 35463 -151323 -175713 21069 -39856 -90217 -478472 -29233
9679 -57681 -48019 53330 -139011 42601 100156 -143987 180113 -60405 109517 -30172 -228107
9668 -228107 -126433 -144841 -83684 -249111 -353374 -122709 -519250 292290 -99040 -479463
9658d79463a02967I3612b14115k89103A80647a93552P3375e2606F2562a68816
9647b47047b7846k93892e7554j74823g2195a1904k26757A78038h1672q371r1849
9636a81892c2643k71800E7170d20109a6009k85156J40274e6261k05878A98904
9625B64845a76480A21137M9858i3511j17029H247a81270C5296a7064k43934B01255
9613A54448h7850C95414I6088c14025A8644d2357o0458n2648M5924C24302G095
9601f5277D0193K60918i4747E7002k7127g2817H816N9831b63736j67773D877L36297
9589C41174b90912H3137l1766R0519b15786A685a84637A4120Q3600J57172i1080
9577b15113C0127c45895E5271C732O9265b67057I8389C6769f5559j76838b5413
$$ plain form
9658 -479463 -102967 93612 -214115 -503218 180647 -193552 -120177 -52606 62562 -168816
9647 -247047 -27846 -321738 -57554 -232377 -72195 -11904 -238661 178038 -81672 -90043 -181892
9636 -181892 -32643 -304443 57170 -420109 -16009 -301165 -160891 -56261 -262139 198904
9625 264845 -176480 121137 170995 -93511 -210540 8247 -181270 35296 -17064 -260998 201255
9613 154448 -87850 395414 96088 -314025 18644 -42357 -102815 -155463 -109539 324302 7095
9601 -65277 40193 301111 -94747 57002 29875 -72817 8816 68647 -263736 -431509 4877 341174
9589 341174 -290912 83137 51371 141890 -215786 1685 -184637 14120 97720 254892 -91080
9577 -215113 30127 -345895 55271 3732 72997 -267057 98389 36769 -65559 -242397 -25413
9565b8785R136m7651r1134f9783l82j74643B02110a76346N835l94610f8884j3481
9553h2365c4654j85852d0390j11329A18474J3306b30340B69517a85190j38832
9543c24022J22361F1328c06705E0440a32859A77647E0748c30414N0556r4905F0655
9531B18951j08973N5018a81083f8558E2760a17046A919O6480c25886A53187a09564
9519f6370q9476A14439f6792d871A93669a03112B54563D2213c03246N8888a14279
9507b2015j88488e7824k48949O8549G3057J18720g5171C1404d3874B30633q5050
9496A45583b64065A5344J97789D6243d0016A49723F4911P2870J24123A5782P9829
9485I5611P7799c97180B1138a05473d5560C35842a91601D3685a70674j44220I07
$$ plain form
9565 -28785 -19649 -67300 -158434 -69783 -70165 -244808 202110 -176346 -170511 -565121 -68884 -82365
9553 -82365 -34654 -220506 -40390 -151719 118474 131780 -230340 269517 -185190 -324022
9543 -324022 -201661 61328 -306705 50440 -132859 177647 50748 -330414 -279858 -374763 60655
9531 218951 109978 164996 -181083 -68558 52760 -117046 1919 68399 -325886 153187 -109564
9519 -66370 -155846 114439 -66792 -4871 193669 -103112 254563 42213 -303246 -244358 -114279
9507 -22015 -210503 -57824 -306773 -238224 73057 191777 -75171 31404 -43874 230633 145583
9496 145583 -264065 15344 213133 46243 -40016 149723 64911 137781 261904 15782 95611
9485 95611 173410 -397180 21138 -105473 -45560 335842 -191601 43685 -170674 -314894 907
9473a0893q509j08697b1758p2404n7942A61060c20351i6839k26949a02399k29675
9462c32074f9790G122b9314m0708E5072a93580h0052j79503D8431b48160D4352
9450b25786e4636A23646a77429f5592J6508k14503R1371g8892m14950d5750F9074
9438e6623k10811G6697e4108A2329a71721A39549b9763j2739k01898A9824b69925
9426b1987p8578D1952O2266b10409d991q7979l1161B08869b50503D04136c664
9414g8642j82397J675A45557b23391C0559b6197A16464B8910c8818j71807l769
9403b14394C932a34232H7511a83706O0441G7684b35145A28527L9089c12841D7506
9391c25739O2504h2872j5044c5178F6105L0095e6746E287J6015a32395a1547m10507
$$ plain form
9473 -10893 -19402 -128099 -21758 -94162 -152104 161060 -320351 -96839 -323788 -102399 -332074
9462 -332074 -69790 7122 -29314 -70022 55072 -193580 -80052 -259555 48431 -248160 44352
9450 -225786 -54636 123646 -177429 -65592 -49084 -263587 -172216 -78892 -493842 -45750 69074
9438 -56623 -267434 76697 -54108 12329 -171721 139549 -29763 -42502 -244400 19824 -269925
9426 -21987 -100565 41952 104218 -210409 -4991 -92970 -124131 208869 -250503 404136 -3664
9414 -78642 -261039 -259364 145557 -223391 30559 -26197 116464 28910 -38818 -210625 -214394
9403 -214394 3932 -134232 87511 -183706 -123265 77684 -235145 128527 167616 -312841 47506
9391 -325739 -263235 -82872 -97916 -35178 66105 96200 -56746 5287 21302 -132395 -11547 -422054
9379d22054A48100b0641A28403d60919g2780A45431b54098j49414a38707c3415
9368a70400j83344a40481b2079B34791a62167o6816A09912a06622k8376L7824
9358i7174m5533A65336m5159b59016E8273Q6802J9269A2202J82306H0783R9532
9347A80315d364A58351k0127a33895j96340A6638Q123M6809a31740J1426A5001
9335a3519E5004f4380c0421H757R3294h4567j00336B2174a22529k6283j1513A47520
9322B16001A0804a02831G8682c41664c6653o5233C81724c20753G1807d36064a9803
9310a44285A64724a86842D5485J47755b05860b4266j26362j06843P6046H9231
9299g8712B3715a91534n6272d0074l1587l75035f811l20710e2401k63129B1362
$$ plain form
9379 -422054 148100 -20641 128403 -460919 -72780 145431 -254098 -403512 -138707 -33415
9368 -170400 -353744 -140481 -22079 234791 -162167 -228983 109912 -106622 -134998 -97174
9358 -97174 -142707 165336 120177 -259016 58273 145075 164344 12202 194508 80783 180315
9347 180315 -4364 158351 138224 -133895 -330235 16638 24761 71570 -131740 -120314 15001
9335 -13519 55004 -64380 -30421 8757 102051 -84567 -184903 22174 -122529 -148812 -160325 147520
9322 216001 10804 -102831 78682 -341664 -36653 -101886 381724 -320753 71807 -436064 -19803
9310 -144285 164724 -186842 45485 193240 -205860 -24266 -150628 -257471 -181425 89231
9299 -78712 23715 -191534 -247806 -40074 -71661 -446696 -6811 -327521 -52401 -315530 21362
9287a00697k4049p0295B43577b3599o615j57639K5791j60704a17115G5345c44861
9275c86961A84500b798m12923J68045J9535F6284a70883E9747h4921C00292G2707
9263i6801M7432K1378l24632b2416k3058A360c40504a8696k39728C3714b63689
9251A0341J56566M9033a13451b08k48507A39352a28847I0611a58397e7578k39666
9240b97244J37811J9909B51748p0685b68288L2586a522p0075B7505c5946k14760
9229b50706a12010m3537B77083a67192B32467D8178A205c603B7026b53469J17456
9218a36013A86572b8549A65499a08604C5226a11343b9315H7073l7008b98664j48851
9207d47515a11331k78472J35605l997C7464f1393A54504a12719k19115k7936a37208
$$ plain form
9287 -100697 -124746 -195041 243577 -23599 -30214 -187853 -162062 -322766 -117115 75345 -344861
9275 -386961 184500 -2798 -415721 -247676 -228141 66284 -170883 59747 -84921 300292 72707
9263 -96801 -49369 -27991 -352623 -22416 -45474 1360 -340504 -18696 -258424 33714 -263689
9251 10341 166907 215940 -113451 -208 -248715 139352 -128847 90611 -158397 -57578 -297244
9240 -297244 -159433 -139524 251748 181063 -268288 -235702 -1522 -71597 27505 -35946 -250706
9229 -250706 -112010 -155547 277083 -167192 232467 48178 1205 -3603 27026 -253469 -136013
9218 -136013 186572 -28549 165499 -108604 35226 -111343 -29315 87073 50065 -298664 -447515
9207 -447515 -111331 -389803 -254198 -258195 37464 -61393 154504 -112719 -331834 -359770 -137208
9195b90486C1662a28390A2525a44571C0868b00238F0362J29734d0937l80805J69496
9184b52246a7271k6279l29939h8377F6850i977j82454A29118E919K76194G0629
9172C18304J805g5958A14724c88609d4645j01164A82653a504k6953k29587B61871
9160a38933A82259b4698j25663K0798j0943B88754B9764b7090E3212c7753j83451
9149b21204R7309n3117Q3411M6618l14822e5799G9661l4377B1703R08d0671o3440
9137a04111E7699a19838K1140A6480l183c22646b6774A1225c156H1038b3433B9318
9124e8071H0815a13753h611A80582B527J19754a79780A72210J0077b98418A31229
9112h6116k19744O7944c8627r5252l6979F5052b22938a9336k3319A76973a50833
$$ plain form
9195 -290486 31662 -128390 12525 -144571 30868 -200238 60362 190096 -40937 -421742 -252246
9184 -252246 -17271 -43550 -373489 -88377 66850 -9977 -192431 129118 5919 282113 70629
9172 318304 320109 -75958 114724 -388609 -44645 -145809 182653 -1504 -28457 -258044 261871
9160 -138933 182259 -24698 -150361 -129563 -140506 288754 29764 -27090 53212 -37753 -221204
9149 -221204 -123895 -177012 -93601 -46983 -361805 -55799 79661 45284 21703 22611 -40671 -104111
9137 -104111 57699 -119838 -98698 16480 13297 -322646 -26774 11225 -3156 81038 -23433 29318
9124 -58071 80815 -113753 -8611 180582 2527 122281 -179780 172210 182287 -298418 131229
9112 -86116 -305860 -237916 -38627 -133879 -170858 65052 -222938 -19336 -42655 176973 -150833
9100c66599a44965r4130J18916c8843n5694L5924G941e6468l04357e5171e259
9088a02384k5392q6628A87652e08574a9282j57431A93732I1112b09127C3646a11223
9076f0195j54112h1835Q362A41599a06665M4378m11781J67587I255b5880G5860
9064C5744a47926K184G4296g8311L8670g622I8778b02827L1541k94312A78360
9052a72304a5210A18146E0241J15678a45124H1497b53971a01658a8227o1515G3182
9040b25091r165Q5336C8563J9123K93497a69105q9178A03026D5003K28690a64082
9028a2045a013C6425e01274C9389J2974b72487A01383a72451O0252n16043B04883
9016a36277A16612g0412J2690j73741e0634p1392n3707M3698e1058l09158E8833
$$ plain form
9100 -366599 -144965 -239095 -120179 -38843 -94537 -58613 7941 -56468 -360825 -55171 -5259
9088 -102384 -127776 -214404 187652 -508574 -19282 -176713 193732 91112 -209127 33646 -111223
9076 -60195 -214307 -81835 -73473 141599 -106665 -62287 -474068 -306481 9255 -25880 75860
9064 35744 -147926 -145742 74296 -78311 -39641 -7622 98778 -202827 -171286 -465598 178360
9052 -172304 -15210 118146 50241 165919 -145124 81497 -253971 -101658 -18227 -79742 73182
9040 -225091 -234256 -148920 38563 57686 351183 -169105 -258283 103026 45003 273693 -164082
9028 -12045 -1013 36425 -501274 39389 52363 -272487 101383 -172451 -112199 -628242 204883
9016 -136277 116612 -70412 -57722 -231463 -50634 -122026 -175733 -132035 -51058 -360216 58833
9004A79952p3612Q6181B0400a94941A18091K641b28293G2554a45191b8539A84328
8992i3933a7890B37765b64251C5061P0060B0823K72752A06013d7144H9238B6401
8980f1272k9036j40999d4133G605b08024d5810a4299D5867d7544B64700C5209
8968a97438A73946g81k66762j07281J75573M1026D571c6528k76972h6018j23373
8957b09391L3349n6878j07806B34645g8472j8210k71403A25167A7590R307b07350
8945A54459k909a01600d0832A85255G9662c24953A20630d74506h0259A18659a04874
8933A24451l7099b57433G9847a67543A8434b02846O5085A25296n091J61708Q17544
8922A099457J813925M988914L196224C076081G63891B99688q6135K045a76500
$$ plain form
9004 179952 106340 192521 20400 -194941 118091 120732 -228293 72554 -145191 -28539 184328
8992 -93933 -17890 237765 -264251 35061 105121 20823 293575 106013 -47144 89238 26401
8980 -61272 -90308 -231307 -44133 7605 -208024 -45810 -14299 45867 -47544 264700 35209
8968 -197438 173946 -781 -267543 -374824 -199251 -158225 4571 -36528 -313500 -86018 -209391
8957 -209391 -176042 -232920 -340726 234645 -78472 -96682 -368085 125167 17590 26897 -207350
8945 154459 151550 -101600 -40832 185255 79662 -324953 120630 -474506 -80259 118659 -104874
8933 124451 87352 -257433 79847 -167543 18434 -202846 -137761 125296 120205 281913 1099457
8922 1099457 2913382 7902296 11098520 3076081 763891 299688 213553 215598 -176500
8912A21044L9468e3038a520A13660k5164m041K5503K20223g5653m2462l7444c4206
8899a50813A8914J66794a38848l74930B88237j41142a52353b0630j24047j01085
8889b45762c5945A77134j8340a11019E2507K8837C2524c0296k03942J11155p8676
8878b01759h7464l7396M804k01344b0225j28867j46926H2459b08278c5937n26185
8867e62122A47270b77952P5093j44524a03356b5987j75963h0885C1489b60998
$$ plain form
8912 121044 160512 -53038 -1520 113660 88496 84455 109958 330181 -75653 -118115 -155559 -34206
8899 -150813 18914 185708 -138848 -513778 288237 147095 -152353 -20630 -144677 -245762
8889 -245762 -35945 177134 158794 -111019 52507 81344 32524 -30296 -234238 -123083 -201759
8878 -201759 -87464 -124860 -120056 -321400 -20225 -149092 -296018 82459 -208278 -35937 -562122
8867 -562122 147270 -277952 -202859 -347383 -103356 -25987 -201950 -80885 31489 -260998
$$ [...]
##END NTUPLES=NMR SPECTRUM
##END=
