##TITLE=Analysis number 330294
Compound Code btb 06561
Book Reference a    lab3
Project Code adrs
Chemist Name stores
##JCAMPDX= 6.0         $$ Bruker NMR JCAMP-DX V2.0
##DATA TYPE= NMR SPECTRUM
##DATA CLASS= NTUPLES
##ORIGIN= Bruker BioSpin GmbH
##OWNER= nmr
$$ XWIN-NMR		Version 3.5
$$ Wed Nov 14 11:03:21 2007 GMT Standard Time (UT+0h)  MAYBRIDGE\nmr@NMR_250MHZ
##.OBSERVE FREQUENCY= 250.131544655141
##.OBSERVE NUCLEUS= ^1H
##.ACQUISITION MODE= SIMULTANEOUS (DQD)
##.ACQUISITION SCHEME= undefined
##.AVERAGES= 16
##.DIGITISER RES= 18
##SPECTROMETER/DATA SYSTEM= dpx250
##.PULSE SEQUENCE= zg30
##.SOLVENT NAME= Acetone
##.SHIFT REFERENCE= (INTERNAL, Acetone, 0, 16.522)
##AUDIT TRAIL= $$ (NUMBER, WHEN, WHO, WHERE, WHAT)
$$ ##TITLE= Audit trail, XWIN-NMR		Version 3.5
$$ ##JCAMPDX= 5.01
$$ ##ORIGIN= Bruker BioSpin GmbH
$$ ##OWNER= nmr
$$ C:\u/data/dgb/nmr/ADRS/660/pdata/1/auditp.txt
$$ ##AUDIT TRAIL=  $$ (NUMBER, WHEN, WHO, WHERE, WHAT)
(   1,<2007-11-14 11:02:52.05 +000>,<MAYBRIDGE\nmr>,<NMR_250MHZ>,
      <created by zg, POWCHK disabled, PULCHK disabled
       configuration hash MD5:
       76 6E 9A 78 1E 09 19 81 EC 84 63 8F B0 6A 59 2D
       data hash MD5: 64K
       52 C9 C6 C9 4D EB D8 D0 40 52 3C 83 67 4A 27 E2>)
(   2,<2007-11-14 11:03:08.69 +000>,<MAYBRIDGE\nmr>,<NMR_250MHZ>,
      <Start of raw data processing
       ef LB = 0.3 FT_mod = 6 PKNL = 1 SI = 32K 
       data hash MD5: 32K
       F5 09 58 8A 90 3C 14 02 17 65 46 48 1C 1C 7C 9D>)
(   3,<2007-11-14 11:03:10.33 +000>,<MAYBRIDGE\nmr>,<NMR_250MHZ>,
      <apk 
       data hash MD5: 32K
       3F C7 2C F9 A0 BE E5 01 77 CD AC FE 21 8E D6 75>)
(   4,<2007-11-14 11:03:11.29 +000>,<MAYBRIDGE\nmr>,<NMR_250MHZ>,
      <abs ABSG = 5 
       data hash MD5: 32K
       66 6A 52 9D 5E 59 02 F1 93 DE 19 D6 35 3B BD 21>)
$$ ##END=
$$ 
$$ hash MD5
$$ 70 81 05 32 FF 94 60 DC 2A 76 67 B7 D4 6B 9A 05
##$RELAX= 
##$RELAX= 
##$RELAX= 
##$RELAX= 
##$RELAX= 
##$RELAX= 
##$RELAX= 
$$ Bruker specific parameters
$$ --------------------------
##$DU= <C:\u>
##$EXPNO= 660
##$NAME= <ADRS>
##$PROCNO= 1
##$TYPE= <nmr>
##$USER= <dgb>
##$AMP= (0..31)
100 100 100 100 100 100 100 100 100 100 100 100 100 100 100 100 100 100 
100 100 100 100 100 100 100 100 100 100 100 100 100 100 
##$AQSEQ= 0
##$AQ_mod= 3
##$AUNM= <au_zg>
##$AUTOPOS= <12 >
##$BF1= 250.13
##$BF2= 250.13
##$BF3= 250.13
##$BF4= 250.13
##$BF5= 500.13
##$BF6= 500.13
##$BF7= 500.13
##$BF8= 500.13
##$BYTORDA= 1
##$CFDGTYP= 0
##$CFRGTYP= 5
##$CHEMSTR= <none>
##$CNST= (0..31)
1 1 145 1 1 1 1 1 1 1 1 1 1 1 1 1 1 1 1 1 1 1 1 1 1 1 1 1 1 1 1 1 
##$CPDPRG= <>
##$CPDPRG1= <>
##$CPDPRG2= <>
##$CPDPRG3= <>
##$CPDPRG4= <mlev>
##$CPDPRG5= <mlev>
##$CPDPRG6= <mlev>
##$CPDPRG7= <mlev>
##$CPDPRG8= <mlev>
##$CPDPRGB= <>
##$CPDPRGT= <>
##$D= (0..31)
0 1 0 0 0 0 0 0 0 0.06 0 0 0 0 0 0 0.0002 0 0 0 0 0 0 0 0 0 0 0 0 0 0 
0 
##$DATE= 1195038170
##$DBL= (0..7)
120 120 120 120 120 120 120 120 
##$DBP= (0..7)
150 150 150 150 150 150 150 150 
##$DBP07= 0
##$DBPNAM0= <>
##$DBPNAM1= <>
$$ [...]
##$SUBNAM7= <"">
##$SUBNAM8= <"">
##$SUBNAM9= <"">
##$SW= 20.6930455092707
##$SWIBOX= (0..15)
0 0 3 0 0 0 0 0 0 0 0 0 0 0 0 0 
##$SW_h= 5175.983436853
##$TD= 65536
##$TD0= 1
##$TE= 295.16
##$TE2= 300
##$TE3= 300
##$TEG= 300
##$TL= (0..7)
0 120 120 120 120 120 120 120 
##$TP= (0..7)
150 150 150 150 150 150 150 150 
##$TP07= 0
##$TPNAME0= <>
##$TPNAME1= <>
##$TPNAME2= <>
##$TPNAME3= <>
##$TPNAME4= <>
##$TPNAME5= <>
##$TPNAME6= <>
##$TPNAME7= <>
##$TPOAL= (0..7)
0.5 0.5 0.5 0.5 0.5 0.5 0.5 0.5 
##$TPOFFS= (0..7)
0 0 0 0 0 0 0 0 
##$TUNHIN= 0
##$TUNHOUT= 0
##$TUNXOUT= 0
##$USERA1= <user>
##$USERA2= <user>
##$USERA3= <user>
##$USERA4= <user>
##$USERA5= <user>
##$V9= 5
##$VALIST= <valist>
##$VCLIST= <CCCCCCCCCCCCCCC>
##$VD= 0
##$VDLIST= <DDDDDDDDDDDDDDD>
##$VPLIST= <PPPPPPPPPPPPPPP>
##$VTLIST= <TTTTTTTTTTTTTTT>
##$WBST= 1024
##$WBSW= 4
##$XGAIN= (0..3)
0 0 0 0 
##$XL= 0
##$YL= 0
##$YMAX_a= 254208
##$YMIN_a= -343095
##$ZGOPTNS= <>
##$ZL1= 120
##$ZL2= 120
##$ZL3= 120
##$ZL4= 120
##$ABSF1= 16.522
##$ABSF2= -4.171173
##$ABSG= 5
##$ABSL= 3
##$ALPHA= 0
##$AQORDER= 0
##$ASSFAC= 0
##$ASSFACI= 0
##$ASSFACX= 0
##$ASSWID= 0
##$AUNMP= <proc_1d>
##$AZFE= 0.1
##$AZFW= 0.1
##$BCFW= 0
##$BC_mod= 0
##$BYTORDP= 0
##$COROFFS= 0
##$CY= 12.5
##$DATMOD= 1
##$DC= 0
##$DFILT= <>
##$DTYPP= 0
##$F1P= 14.0000005364418
##$F2P= -0.99999901652339
##$FCOR= 0.5
##$FTSIZE= 32768
##$FT_mod= 6
##$GAMMA= 0
##$GB= 0
##$INTBC= 1
##$INTSCL= 1
##$ISEN= 128
##$LB= 0.3
##$LEV0= 0
##$LPBIN= 0
##$MAXI= 10000
##$MC2= 0
##$MEAN= 0
##$ME_mod= 0
##$MI= 0
##$NCOEF= 0
##$NC_proc= -3
##$NLEV= 6
##$NOISF1= 0
##$NOISF2= 0
##$NSP= 0
##$NTH_PI= 0
##$NZP= 0
##$OFFSET= 16.522
##$PC= 1
##$PHC0= 170.0973
##$PHC1= 3.499325
##$PH_mod= 1
##$PKNL= yes
##$PPARMOD= 0
##$PSCAL= 4
##$PSIGN= 0
##$REVERSE= no
##$SF= 250.13
##$SI= 32768
##$SIGF1= 0
##$SIGF2= 0
##$SINO= 400
##$SIOLD= 32768
##$SREGLST= <1H.Acetone>
##$SSB= 0
##$STSI= 32768
##$STSR= 0
##$SW_p= 5175.98343685301
##$SYMM= 0
##$S_DEV= 0
##$TDeff= 65536
##$TDoff= 0
##$TI= <Analysis number 999999
Compound Code 99
Book Reference 9
Project Code 9>
##$TILT= no
##$TM1= 0
##$TM2= 0
##$TOPLEV= 0
##$USERP1= <user>
##$USERP2= <user>
##$USERP3= <user>
##$USERP4= <user>
##$USERP5= <user>
##$WDW= 1
##$XDIM= 32768
##$YMAX_p= 300238367
##$YMIN_p= -185000
$$ End of Bruker specific parameters
$$ ---------------------------------
##NTUPLES= NMR SPECTRUM
##VAR_NAME=  FREQUENCY,     SPECTRUM/REAL,   SPECTRUM/IMAG
##SYMBOL=    X,             R,               I
##VAR_TYPE=  INDEPENDENT,   DEPENDENT,       DEPENDENT
##VAR_FORM=  AFFN,          ASDF,            ASDF
##VAR_DIM=   32768,         32768,           32768
##UNITS=     HZ,            ARBITRARY UNITS, ARBITRARY UNITS
##FACTOR=    0.157963299565203, 1,           1
##FIRST=     4132.6476996994, 0,             0
##LAST=      -1043.33573715361, 0,           0
##MIN=       -1043.33573715361, -185000,     0
##MAX=       4132.6476996994, 300238367,     0
$$ Real data points
##PAGE= N=1
##DATA TABLE= (X++(R..R)), XYDATA
$$ [...]
23613 35113 20635 -9736 -12053 3865 26821 21151 -623 15932 24085 858 -4905 32612
23601 32612 45566 -5539 -12405 -41986 -34792 -36384 -21700 -37559 -26480 -29227 -6526 -44130
23589 -44130 -34590 4609 64216 76604 42913 -11027 -60087 -52579 -45231 -37654 -43103 -21158 -58055
23576 -58055 -68462 -36718 -11271 39582 31522 5116 -64637 -39691 -23874 -11043 18155 28174
23564 28174 24343 23916 -31989 -87496 -33730 27555 7091 -2669 49388 23495 7610 3483 -19433
23551 -19433 -81595 -95035 -83203 -56202 -49804 -20987 5508 12913 -16182 -49072 -45202 -15799
23539 -15799 -16492 -37605 -71792 -43690 72519 63298 -13914 -18585 -13105 -27269 -78717 -80098 -29724
23526 -29724 12639 32725 7820 -15375 -24217 -16864 94 -4330 -8226 -8121 -17849 -16942 -1169
23513 -1169 -2454 -18232 -13211 6857 -950 12052 -6619 -14775 -40116 -42070 -3450 9373 27260
23500 27260 -784 -14547 5892 4641 7302 -49519 -81865 -116655 -145071 -173598 -120978 -40314
23488 -40314 -32461 -35283 -9447 -51345 -77330 -72251 -66980 -10525 13200 15909 48835 70396 40759
23475 40759 -11674 -7255 2243 17776 62615 42620 33530 -120 675 -20203 -42992 -47893 -44147
23462 -44147 -6110 27363 -14625 24474 79023 112422 69557 44227 45837 78532 81150 19902
23450 19902 17518 53512 42489 55084 50906 25245 2045 -56044 -11459 19036 -20618 -44696
23438 -44696 -2317 5633 41185 59701 37275 -4398 -4468 42250 91460 59208 25397 5597
23426 5597 20670 12113 32977 18960 -17522 -3501 8791 5304 4915 -22258 -18400 -2718 13305
23413 13305 59640 77436 79704 79791 83131 81925 130192 110343 74110 15276 28355 57449 71777
23400 71777 50976 79878 78916 19390 -19024 -13262 19379 8791 -36650 -71170 -64117 -55160 -13762
23387 -13762 41569 90532 40240 42575 51351 52967 37141 2072 -33257 -51016 -27057 -32903
23375 -32903 -24033 18177 12039 18226 39766 1634 -35970 -55736 7602 35066 22320 -14117
23363 -14117 17911 86728 80929 85617 113506 149240 149225 121968 94263 77214 64112 42352 37790
23350 37790 38518 32456 785 -47417 -34547 -12866 1932 -6984 23938 13032 -10261 -21168
23338 -21168 46364 84039 37430 -26464 14207 70562 132854 107856 90270 57418 47263 65996
23326 65996 70093 81061 6199 -33784 -89781 -131373 -121485 -129373 -105985 -112349 -118210 -49644 -50716
23313 -50716 -53039 -36051 2866 524 -31788 -53714 -8777 -15047 -69449 -74581 -66471 -65755 9995
23300 9995 72940 39395 19586 -5386 -40854 -68764 -68318 -6556 36478 68875 48334 66669
23288 66669 82000 69019 34389 -24653 -19748 22269 51769 111160 128258 24011 -42642 -62209
23276 -62209 -61946 -44840 -2340 -8026 -31441 -77491 -56069 6031 -7642 -47337 -58503 2576
23264 2576 51179 48688 27119 43848 35973 37709 30969 28327 16929 88274 52406 32656 51718
23251 51718 3668 -25492 -50267 -50634 -40698 -25423 13963 4655 -7109 1467 17762 510 4429
23238 4429 -8692 -41639 -52219 -41173 8645 23860 27358 63446 87338 94054 106850 70766
23226 70766 20476 1665 6697 7827 -11813 -29930 -42457 -51214 -70454 -72188 -43025 -61994
23214 -61994 -51846 459 12556 17953 -15270 -65400 -42673 -36624 17471 69137 110359 91135
23202 91135 92782 118527 75376 47418 52780 31819 -15411 -96080 -99282 -71607 -24793 27561
23190 27561 51672 41011 45057 55139 74436 56583 21446 -24339 -34370 -9077 21505 31116
23178 31116 -14560 -4147 54632 56094 66005 57887 67594 90565 72476 54614 3593 1464 32939
23165 32939 24795 -15084 -24707 5042 8869 -32029 -27605 -24644 -64155 -65103 26806 51251 39089
23152 39089 30502 23304 -15697 -27747 -44918 -43414 -48825 -23256 -41041 -28584 42328 75022
23140 75022 44676 53627 101782 104761 52507 4766 -3885 -4398 20482 21662 -31103 -59129 -44438
23127 -44438 -72500 -80143 -128774 -136490 -78880 -23851 -6927 52080 49830 43109 32384 -6469
23115 -6469 -28007 -53301 -28687 -19527 24941 -19165 -8923 34214 12696 36351 67109 66955
23103 66955 18284 10769 -19475 -49362 -19661 69886 121665 107659 56589 31723 18510 39714
23091 39714 69802 59408 32356 17069 51207 21357 16554 37556 58667 100376 103739 107173
23079 107173 64840 37514 42381 82235 108264 69306 74010 93456 103085 80482 32097 3595
23067 3595 18462 60346 64686 31770 56752 51495 15704 2055 24911 12962 -53502 -41350
23055 -41350 -19132 -17745 -34664 -47780 -4705 63159 23521 59618 104187 106438 57650 11463
23043 11463 -31655 -15288 35719 45937 -42758 -66574 -52681 -3033 12785 -38015 -14062 -12259
23031 -12259 10890 -15104 -19524 -29799 -11288 -16274 -4041 13966 -1501 18437 50644 40629
23019 40629 -19670 -47189 12633 12939 -12871 2026 -11577 -51456 -17377 18334 -5754 -58934
23007 -58934 -135817 -98443 -25683 16779 24601 13163 7676 -27814 -77990 -10839 -24592 -22744
22995 -22744 14312 57418 111379 156428 117518 91299 69141 34835 2685 -30494 -12415 32287
22983 32287 81714 60507 28814 97950 145488 131394 90037 75217 69486 45669 19362 12800
22971 12800 28886 29532 19477 -18696 -14851 10533 -17780 -29317 -38875 -6490 34553 83350
22959 83350 107021 94457 29706 18500 24211 11840 20414 19708 24063 27445 40605 46839 2143
22946 2143 -36758 -28816 33187 47968 62950 93666 84490 82380 81217 86287 113141 116850 112374
22933 112374 109472 143911 119043 29056 17528 -8976 6881 -18637 -1188 7622 -1031 11518
22921 11518 50204 17862 -8444 -5468 -68759 -55193 -48981 -48248 -37558 -43667 -33669 -17880 13139
22908 13139 27510 34046 46774 56962 56777 20288 18646 65062 75409 32073 -18342 39972
22896 39972 118539 97848 58880 27723 -818 47265 48055 55154 34265 46078 48339 63114
22884 63114 50616 64759 107857 157794 181756 120160 73037 35421 19159 4366 5331 9003
22872 9003 53551 38868 70237 97689 60014 42449 71928 71093 63820 78565 161051 159760 147828
22859 147828 143951 111346 38439 -53681 -48355 18104 1747 -49585 -101854 -45099 -12601 39204
22847 39204 34081 22173 47709 15776 -31070 -6742 29286 24911 52997 53965 49079 36416 5287
22834 5287 -3778 30633 20730 30 -6763 12261 24742 12582 -29626 -14621 6170 43896
22822 43896 85191 75319 24344 15304 34042 49718 60372 63521 64687 71846 63182 73516 84656
22809 84656 103386 80128 117083 113581 116515 153148 118754 94386 47087 -19357 4204 7104
22797 7104 20484 23518 15656 53022 81575 121211 72050 24134 84188 53703 24131 43087
22785 43087 60852 49583 14561 49207 39937 70288 75218 5031 -29336 -32765 1392 34758
22773 34758 56100 22613 50641 73956 44578 19011 39072 58966 59367 19372 14762 50399
22761 50399 103759 108272 24485 17974 70021 68575 43682 39748 67128 101138 141292 177656
22749 177656 202990 156345 139747 120964 80005 105022 111022 111943 141902 163247 191465 201618
22737 201618 191605 167788 147920 151642 112000 73498 155747 172279 124090 77158 52148 47244
22725 47244 73846 119153 145512 135120 130000 160207 161109 115574 151986 159927 126968 102977
22713 102977 79479 61225 15170 73671 102893 60255 75418 117081 167259 222259 220297 223742
22701 223742 172719 189919 223809 197088 131381 118128 96814 69387 105894 116240 134740
22690 134740 122589 99407 105902 155853 181398 178826 134383 100431 116966 129585 200975 232167
22678 232167 220512 225206 185940 157688 181552 214043 214261 229294 193125 234905 264643 249230
22666 249230 194539 116288 106108 118525 186529 202326 209967 221093 240894 245788 292795 257346
22654 257346 162140 122710 137156 157082 205455 205222 162738 209488 188905 164370 203485 230974
22642 230974 230700 194893 161483 159990 205167 218959 188017 163839 244437 298396 219136 175961
22630 175961 206829 207373 212124 213588 251410 267359 257774 246039 268943 288029 228410 187350
22618 187350 212979 235213 178564 196075 203157 234072 247650 230007 228475 264056 319853 324341
22606 324341 330816 366074 405224 406177 395506 351635 334905 342918 366643 376605 348479 350240 349012
22593 349012 375033 344205 317272 307573 309992 275634 318113 399353 399804 401367 417912 426881 411377
22580 411377 397757 431834 422130 349899 300827 326648 400963 421764 445034 445452 369496 347138
22568 347138 359483 381261 350054 366238 408084 403180 399386 436349 471779 496900 515378 483762
22556 483762 470909 494690 493851 475245 514126 490749 478637 479951 502579 487535 460325 475570
22544 475570 478533 536725 552497 472403 468787 513624 501654 514103 575126 551281 505629 502367
22532 502367 576713 625211 584660 536916 546561 573817 558849 611514 660567 670808 664309 625088
22520 625088 642910 706456 772803 732242 732740 682639 641836 636653 663249 726634 729838 724027
22508 724027 758970 773995 772407 779073 753823 780800 820463 804932 793590 833600 837681 781470
22496 781470 793372 833460 890450 908352 938075 934112 918362 911944 952158 931723 954366 1036762
22484 1036762 1034955 997219 1017506 1077818 1125154 1123033 1114591 1160886 1211576 1269707 1256264 1285114
22472 1285114 1321275 1340137 1335149 1336801 1377326 1385092 1355544 1373916 1424241 1498036 1523343 1507109
22460 1507109 1458764 1485442 1525098 1512547 1562482 1658358 1715163 1731112 1733797 1788141 1834373
22449 1834373 1809991 1839346 1941562 2039253 2082370 2082634 2107349 2130786 2123495 2161779 2152003 2186819
22437 2186819 2248977 2285355 2332165 2364012 2404830 2458628 2497556 2561276 2589527 2651412 2679094
22426 2679094 2693747 2745063 2840555 2956240 3013128 3050050 3036449 3048132 3058757 3142421 3193649
22415 3193649 3261013 3292409 3407173 3462998 3488650 3478519 3570527 3661640 3727904 3748779 3833026
22404 3833026 3908752 3937514 3966282 4028449 4080320 4079561 4091666 4179330 4309943 4355204 4379403
22393 4379403 4410311 4434821 4452272 4479985 4505014 4513793 4581605 4647962 4696946 4675038 4683639 4687609
22381 4687609 4759565 4816892 4817460 4829403 4819366 4764522 4767591 4806613 4807353 4785083 4779804 4769878 4710005
22368 4710005 4667159 4663074 4640904 4616541 4651489 4616506 4565749 4472142 4375763 4340692 4284218
22357 4284218 4234195 4153435 4128575 4076343 4072218 4064054 3976751 3928094 3901447 3882639 3834976 3725638
22345 3725638 3666061 3633001 3611902 3635486 3623254 3550870 3421490 3325766 3325628 3297321 3194546
22334 3194546 3122645 3040584 2982248 2969523 2950992 2873226 2813272 2772122 2691187 2662108 2659528
22323 2659528 2616903 2533567 2450757 2359447 2346757 2337102 2318362 2315848 2295376 2286254 2220558 2168846
22311 2168846 2124113 2089157 1984889 1976886 2035930 1993974 1997798 2004359 1890009 1835684 1840121 1819228
22299 1819228 1761986 1665429 1626871 1627173 1594389 1611569 1596922 1590520 1577944 1484448 1444972 1474287
22287 1474287 1492523 1434749 1431535 1462876 1413904 1340251 1293121 1304377 1306081 1234096 1190465 1201930
22275 1201930 1219576 1201496 1171350 1120551 1101209 1078519 1105584 1126162 1048633 983877 982991 978108
22263 978108 944641 958772 984530 973390 941101 921639 888941 885490 857994 858262 878420 842691
22251 842691 814493 770914 755051 749834 783401 786183 784746 773626 772110 731182 704617 670354
22239 670354 655007 694620 698556 718153 713893 694070 705560 693565 690003 691060 709734 637724
22227 637724 593256 606202 634409 637937 609798 544252 509965 531964 584822 574263 501270 468557
22215 468557 506532 570528 574207 570505 575144 547830 521242 483239 500596 483926 481221 481380 490940
22202 490940 472223 509567 506306 480193 463918 482779 505116 474684 494693 454145 404445 423485
22190 423485 459325 495899 480448 493512 472279 436909 445760 426562 412289 442335 453994 407958
22178 407958 397920 405721 382292 374581 397268 394515 347034 345954 373898 372144 363475 393673 407614
22165 407614 407607 381055 304641 264390 203955 222696 270172 330980 366020 365552 383200 372483 362929
22152 362929 371305 340468 324457 346108 367375 370024 323377 282106 260211 268178 250427 223780
22140 223780 243574 253656 187787 177396 221525 228260 205736 173011 209857 233752 255200 243264
22128 243264 264130 249169 237247 245120 240048 220619 161737 159881 175178 148270 158898 228648
22116 228648 261117 273269 211728 203168 204814 188313 184226 177346 194524 251151 227452 214560
22104 214560 182648 197141 170645 142888 157954 181562 197563 196036 219342 220349 220414 186759
22092 186759 174159 159647 102278 93226 41845 73636 140769 196463 206232 160184 162045 172300
22080 172300 205976 189219 174052 144164 154329 146108 211880 244942 234322 226542 195256 152902
22068 152902 128750 109922 117992 139338 122681 134891 163998 140341 196933 193087 185210 169077
22056 169077 190435 196701 202261 172963 138105 104614 106304 111552 116553 139788 111697 118335 116712
22043 116712 52816 79369 129373 143617 156408 141139 132427 107017 33484 -2627 26824 30987
22031 30987 37611 74762 88873 118990 148364 84237 37167 47618 89923 103113 100326 65315
22019 65315 27758 6106 35194 46343 66346 64108 89365 107007 106614 93380 66851 54872
22007 54872 85556 98082 74964 49130 31503 70281 133531 134719 177522 216624 213704 204871
21995 204871 206189 197451 156852 138707 109154 92646 117001 132373 122381 108414 85531 78837
21983 78837 86443 81137 49541 14099 -35194 -56021 -35974 10161 68323 63104 64856 111610
21971 111610 101397 121165 150276 166525 130655 153458 149420 151777 137663 170225 155288 114719
21959 114719 52872 41197 46479 48404 70918 107154 147553 133710 103457 78383 81501 91407
21947 91407 105574 113044 107532 164236 182110 132437 127845 125132 95038 30727 49472 99085
21935 99085 110569 81467 27364 58795 83964 96157 114401 84596 22609 -15746 1662 23606
21923 23606 52871 72980 54358 47939 53406 22845 11455 37036 50361 43867 66764 124768
21911 124768 129144 101234 80076 120765 98205 96652 66116 20308 51566 28993 26501 -20582
21899 -20582 -70332 -67527 -14202 70814 63664 29126 51145 47905 43050 54288 -16353 -3986
21887 -3986 9722 -13701 -4470 -1522 -10180 -44263 19570 45300 45355 45580 101363 96725 132 -26788
21873 -26788 -25978 4034 -15979 -18460 -28578 -22945 35691 42473 -26382 -8610 80837 65020 43679
21860 43679 40998 42524 16633 941 31900 -12203 -48552 -11721 25374 40583 32983 25523
21848 25523 25925 49343 -7285 22028 96738 65847 18375 3999 18735 1992 14198 19392
21836 19392 57769 71394 88074 56487 -23123 -68259 -72794 -16569 53225 37875 -35571 -28002
21824 -28002 13554 17831 -13236 -7360 -27027 -53153 -24051 42415 100140 102458 122765 68082
21812 68082 47231 52771 -7544 -19001 30869 74864 63282 62765 81288 60384 55268 46629 39659
21799 39659 38149 26913 -548 45822 62261 44444 21751 -15220 -18030 10002 -20104 -35312
21787 -35312 -6620 -1076 58016 96223 48471 8579 8734 79642 109926 46306 27130 68820
21775 68820 87338 66375 88396 101421 99381 106254 120258 76727 26495 8790 2657 -24504
21763 -24504 19866 47092 14223 -23848 -975 3201 11337 22158 59380 94127 108683 107081
21751 107081 84963 22532 -44060 -94217 -134974 -95480 -102967 -74564 -24056 2464 32256 27912
21739 27912 1837 -29656 -13110 -3903 17586 7235 41408 14863 -10069 -37993 49103 38915
21727 38915 -30449 -34401 -33750 -39506 3197 3482 46165 77898 148648 110889 21770 2181 -28999
21714 -28999 -20395 -1538 37214 35793 35661 -14869 -41815 -42258 -24275 -12708 -34705 -34550 -22323
21701 -22323 16590 31647 23341 -23056 644 17762 19666 26727 53934 8585 -9501 6114
21689 6114 56623 79297 32181 34560 12948 -51501 -29634 3130 39458 51940 31418 47212
21677 47212 65695 72845 80767 94661 114470 103645 67067 67583 50973 22286 28978 23299 48934
21664 48934 71970 3554 -41077 32105 79201 36197 -9509 -26433 25645 47055 18111 33383
21652 33383 33523 59850 46736 27239 45513 59315 46881 43473 38083 -23948 -33416 -469 4608
21639 4608 2492 -35728 -75482 -98543 -53120 -72305 -97804 -129987 -56635 27806 76850 118860
21627 118860 66619 17644 -17229 -1750 -27597 -67663 -16930 -41868 -69118 -22288 46616
21616 46616 54027 13139 29773 78643 76090 80552 68798 62837 42594 42360 2594 34158 49788
21603 49788 86645 99056 135001 128762 85661 51554 53059 95265 90229 52911 28675 23788
21591 23788 8782 46904 93652 44325 -6934 -19651 -36687 -63147 -74393 -76324 -34126 -1075
21579 -1075 17715 84156 91409 57105 3128 -34941 -49417 -39260 -30833 -31471 -34760 -38056 -54998
21566 -54998 -61934 -9694 -15764 -78321 -95765 -25828 9447 63804 109091 90021 32567 21743
21554 21743 -867 -16413 -20748 -14139 4423 54070 7060 -19219 -15775 21753 -1167 -4640
21542 -4640 -21264 -60173 5274 68417 70022 51822 21814 -160 -5717 39640 101816 135479
21530 135479 76497 41127 12613 -695 23974 -5327 -75824 -61592 -80901 -27447 8666
21519 8666 -2744 -42571 -54245 -42723 -47352 -61571 -37209 -40795 -70604 -78742 -23069 23213
21507 23213 18538 -20181 -45109 -51916 -3789 -44302 -13197 -21605 -16579 -33254 -41187 -29714 -39281
21494 -39281 -19715 -30753 -26856 11432 7992 -2088 16785 21920 -5369 -4613 -23153 -11953 -28066
21481 -28066 -1229 88333 97854 28349 -46225 -4189 59540 67403 55422 -19756 -94559 -121619
21469 -121619 -99650 -89037 -65403 -54140 -13205 -21267 -22095 -14665 -73281 -99254 -64814 -40725
21457 -40725 -576 3298 -31292 -61347 -105439 -87235 -70228 -42923 -49715 -80924 -98749 -85536
21445 -85536 -50805 896 14077 6216 19140 42293 15721 24045 16054 10259 8040 -5518 -7541
21432 -7541 24530 26336 477 15923 81393 46585 30980 34220 63853 29818 -50781 -13829
21420 -13829 22150 10174 7167 -3485 -20621 -27420 -18221 64921 85907 63435 32560 43467
21408 43467 49362 8105 -10274 -29763 14492 50707 48308 64929 58723 85599 75604 49281
21396 49281 25733 -3298 35268 70083 5211 -12250 21502 23392 -12714 -39995 -13701 -9142
21384 -9142 -60954 -38969 8843 1167 40754 58916 45149 59898 45001 27135 25186 -18386
21372 -18386 4514 15167 -40344 -112247 -103814 -55517 -7245 14999 51310 85472 79889 42266
21360 42266 13103 -23851 -32640 -43336 -52874 -42829 -19295 -11225 -17069 -2926 22650 46965
21348 46965 27004 -16577 -66241 -46151 -13060 -21142 -8292 -1868 32127 24005 13110 37285
21336 37285 -26324 -33112 -47029 -84671 -52976 -7918 1915 7726 24584 -15572 -50442 -49433
21324 -49433 -13387 16956 13794 25321 5754 -7280 90669 105933 61876 55967 16151 11175
21312 11175 16157 19268 37667 47687 -16232 -30357 20642 56598 45206 36381 64566 15387
21300 15387 26173 31301 36545 46565 57741 52506 23922 -3214 620 2204 38261 74575 92116
21287 92116 89856 83658 79789 30823 -17098 23520 42633 1155 1081 94217 104490 84392 89348
21274 89348 85135 57365 25243 19342 39760 6800 -9715 -10863 37108 39784 -10494 -20899
21262 -20899 -61778 -75281 -93444 -93168 -62882 -26495 -34828 -23510 16098 20021 -2345 -25729
21250 -25729 -35698 -11759 355 -15433 -31825 -72729 -60964 -53821 -74251 -72930 -16997 -28332
21238 -28332 -55288 -56437 -31710 -49250 -27067 -16933 -47984 -58635 -40949 3810 25526 -18959
21226 -18959 -76415 -125756 -93238 -16463 37215 16074 -12147 -22677 -5724 -20570 -46774 -16595
21214 -16595 43329 60825 44690 -51653 -130770 -83166 5527 65673 43283 -10140 2538 25979
21202 25979 33751 28404 30575 -5662 759 23411 40224 52063 30288 1098 -8970 -21592
21190 -21592 -47054 -83261 -37338 -20834 -30439 7506 39777 24230 2524 -14402 -32302 -11905
21178 -11905 -43078 -77190 -79875 -63335 -33809 -23706 -3404 24921 3222 -871 -64532 -86188
21166 -86188 -66171 -44664 -38793 -53163 -8071 37650 42274 -6510 -53027 -25861 -28309 -38763
21154 -38763 -13304 38726 13208 -60927 -49961 -12820 -56405 -48123 -10217 -57350 -76059 -89789
21142 -89789 -90593 -91957 -116036 -72016 -24447 -47930 -12881 -35178 -37374 16485 7805 -19712 -12115
21129 -12115 -8123 -45623 -72833 -70926 -33611 10137 50673 49104 650 -45348 -24612 -26969
21117 -26969 -54248 -3382 26150 27885 18321 871 -28184 -54485 -85591 -91065 -63102 -38880
21105 -38880 -39054 -56314 -70482 -61220 -34300 430 -14846 -32262 -9571 25950 37119 58163
21093 58163 -1224 591 26879 1905 12986 15725 -24354 -49612 -32218 82 27028 41848
21081 41848 46208 36039 24546 36141 32199 5970 10367 28674 -33657 -36038 -4502 -15193
21069 -15193 -31247 -38166 -12403 -19224 -78382 -143332 -64197 -34243 -71994 -53493 -54606 -36248
21057 -36248 11542 24971 8732 1987 46165 85527 26134 -47910 -27100 -48519 8356 64740
21045 64740 21743 -18464 -16840 -18104 -25134 -2639 20950 7321 -14494 -1374 -13908 -13787 -5498
21032 -5498 -10994 -61881 -6626 17841 -47049 -91688 -90693 -57362 -92598 -82506 -41888 -22201
21020 -22201 -23669 -45529 -57343 -34423 -39743 -65343 -141717 -156156 -138187 -102884 -75411 -57377
21008 -57377 9792 21995 -43305 -23609 -5104 -6842 -1054 9309 33341 26232 42162 52999
20996 52999 7477 -32992 12624 11832 -49130 -108262 -87520 -44834 -37361 -15316 -1976 14642
20984 14642 -13016 -67318 -62306 -105400 -95355 -84704 -64444 -43790 -19465 -49639 -92841 -35224
20972 -35224 1448 -16899 -38591 -14114 -46106 -16144 11346 -21094 -21225 -13790 -58169 -55442
20960 -55442 16531 31665 75253 61137 4028 -4793 -49806 -82425 -35756 -53564 -63968 -21155
20948 -21155 -11855 -17682 -16451 -55996 -38974 -26974 -13532 -42417 -42776 2285 29469 1974 -36491
20935 -36491 -30464 -21150 -29356 -54877 -86805 -30684 -13627 -18736 -53734 -98715 -123873 -91413
20923 -91413 -80294 -106609 -131363 -112439 -14501 -25855 -10253 -25209 -59431 -57916 -43186 -13199
20911 -13199 -46606 -53677 7 36794 32638 -7758 12432 35939 6366 23497 75058 64088
20899 64088 45651 65524 54413 -9040 -29682 -40973 -43349 -17027 11504 -1178 2267 -48403
20887 -48403 -81432 -44475 -9134 3587 -19946 -57471 -56868 -103271 -85918 -41539 -26843 19639
20875 19639 -4544 -73997 -59919 -52810 -40060 -23432 -46441 -34498 -35187 14553 26771 -32557
20863 -32557 -75410 -90788 -93918 -104960 -114692 -140747 -103583 -104421 -91268 -41246 -1712 -19539
20851 -19539 -47450 -46189 -56202 -75737 -23432 7772 310 10476 369 4810 12551 13330 5992
20838 5992 44977 55682 -15585 -73731 -82825 -86975 -96130 -63435 -39339 -26334 -25353 -16106 -1849
20825 -1849 1653 12759 34465 79086 37903 4058 24541 38101 34577 28074 -19159 -6898
20813 -6898 27302 59179 56651 50508 40079 50151 28106 29864 46999 6671 -1705 -46532 -61245
20800 -61245 -3012 28997 17777 31816 7830 -31519 -45983 -15827 -29117 4390 73229 40959
20788 40959 105 -10195 -37609 -57773 -67930 -9946 77073 90606 102250 153637 141937 70595
20776 70595 43513 -13471 -22466 -35595 -28852 -24493 2067 -28499 -35386 -31977 -9967 -18690 42337
20763 42337 68423 14471 11649 -16306 -27678 -46271 -41851 -32291 -19799 -21991 -33488 -57615
20751 -57615 -62994 -60368 -89091 -60187 -14681 33514 42348 -3704 -52701 -66668 11617 30034
20739 30034 -23569 1787 28657 18974 18789 -46722 -77363 -74800 -25516 -4250 52038 64976
20727 64976 59025 60431 50572 -6507 -33778 -59224 -46474 -41015 -39808 -13933 -37475 -55616 -2187
20714 -2187 20647 28021 -16260 -38355 -45994 -38860 -29905 7088 6500 21495 14680 26539 25172
20701 25172 32198 41918 62912 72764 40144 34166 -20437 -35198 -42394 -27154 -50142 -27034 4422
20688 4422 3340 -19895 -24915 -32547 -103340 -94627 -53187 -40420 -16319 -45644 -76128 -116084 -110984
20675 -110984 -39003 1509 21356 36868 19542 -7113 -47890 -57994 -82676 -64460 -40660
20664 -40660 -21923 -54379 -77095 -95752 -88217 -70401 -29385 -19877 -12489 -38695 -38375 -32683 2950
20651 2950 13542 -1905 10276 11765 49771 -5128 -74781 -67196 -43998 -28131 -60639 -93979
20639 -93979 -55938 142 -15906 -10376 36837 -35711 -74499 -41021 -12126 8782 4930 -6536
20627 -6536 -3922 -16476 -8721 36725 24930 -35427 -76185 -20878 58220 89852 5491 -49776
20615 -49776 -88979 -82513 -24333 -17466 -6653 8031 35197 -6886 -35111 -8387 14576 23468
20603 23468 48169 -1144 -57774 -48844 -32961 -17581 -9918 10860 11368 -13427 -48596 21220
20591 21220 78358 44981 54001 114809 49658 -10956 -11925 10287 9614 34623 47731 -6623 -88077
20578 -88077 -124377 -79463 -11645 42136 71443 62829 90904 71663 57063 88785 86201 75269
20566 75269 65222 59154 20142 -26757 -46221 -24164 -3018 -28009 30070 58455 33691 -4386
20554 -4386 7720 24704 23682 13638 -12728 -43810 -41682 -29707 -53137 -67632 -25831 34625
20542 34625 30592 -12221 -485 -4560 32096 57211 -14225 -65109 -63250 -25218 35694 4669
20530 4669 4407 -1280 -20185 35567 2892 -43200 -112449 -91531 -46932 -51509 -84798 -63546 -46537
20517 -46537 -70834 -62801 -107281 -98405 -90018 -109092 -99318 -75523 -42520 -62880 -57357 -48979 -92575
20504 -92575 -114176 -51509 -30450 -76488 -118863 -128267 -137734 -89010 -63827 -89734 -51926 -23346
20492 -23346 -21299 -52732 -80357 -83322 -53882 -39528 -35816 744 24279 1999 -40417 -50152
20480 -50152 -45115 16159 45378 47307 9902 36760 23750 -32271 6715 32308 47141 27856
20468 27856 -7695 69995 101259 134325 161645 165643 128371 127615 139551 136369 106772 71117
20456 71117 43355 20676 -8837 20619 25349 111974 145406 111525 77095 66384 31175 35700
20444 35700 61364 35180 57744 76890 75656 50399 14764 -12084 19462 44493 36745 9097
20432 9097 3038 41779 40577 39449 61975 90980 78736 8086 23842 19471 -5756 34677 33792
20419 33792 16221 12200 43490 27018 -25868 -1946 6404 18407 30100 65278 38240 -26379
20407 -26379 7448 4716 87038 83289 13127 10114 -14280 -85010 -58435 9236 33645 22457
20395 22457 -41554 -89065 -32191 15840 23567 49006 62935 71594 47066 5277 -73157 -56505
20383 -56505 -59594 -16974 14087 -2587 -940 17884 14390 -30580 -44106 -268 -15375 -38000
20371 -38000 -13735 -16470 -35922 -15071 -564 43239 32324 -16564 -39127 -42377 -63167 -99397
20359 -99397 -111248 -69215 -55859 15126 28995 -16057 -4444 -3912 -36160 -43411 -37520 2760
20347 2760 28284 17419 21413 -13678 -7572 24032 -7890 -52120 -77808 -18281 15944 17711
20335 17711 -8024 -13728 24379 64577 100177 76939 17808 -5700 -9763 6277 24448 37088
20323 37088 21142 -271 -51012 -59516 5898 59939 65859 29927 -19654 -17150 1901 4821
20311 4821 -29003 -27759 27323 37131 5996 25396 77686 80928 47201 6968 -4385 53758
20299 53758 84037 39168 -8064 -59998 -99826 -85457 -14099 21380 34310 19060 12082 5917
20287 5917 36093 37875 -17899 -41105 -36135 -38004 -45876 -48213 -104569 -152038 -112701 -32204 -34538
20274 -34538 -69785 -48513 -70139 -77090 -70892 -66133 -16099 10131 5649 -1579 -4654 31964 88459
20261 88459 102696 59117 30593 25306 52439 37849 49549 68782 37120 59709 81358 45748
20249 45748 31234 6278 -39158 -92016 -58795 -27589 -14635 55052 86720 87457 112725 177277
20237 177277 231757 233713 135294 91328 80637 74892 7404 47626 147740 187955 114430 82381
20225 82381 138293 157055 163271 182332 190387 210796 270958 251048 215452 206645 163170 136755
20213 136755 167566 193857 174684 134179 81222 61019 24176 -19639 3742 39773 25679
20202 25679 -16542 26189 102240 103228 73806 65303 37321 3311 11784 33432 39205 20203 34067
20189 34067 51840 57502 9854 -10346 14551 52914 69097 17434 -24672 -3180 27812 115545
20177 115545 173866 164472 155379 144726 150897 139906 122472 118764 113376 180917 270196 282105
20165 282105 251508 239488 253417 229317 250421 269798 286588 220711 215402 193972 132841 77509
20153 77509 24862 21672 -5959 -15784 -42311 20605 52706 74258 88046 57181 60561 54151
20141 54151 44899 48493 35148 65980 61950 61936 70995 68978 48104 72917 61206 80636 44180
20128 44180 15973 -9842 13913 12006 32524 5475 10709 25799 38886 18371 -4608 -17803
20116 -17803 -15728 -9891 -19846 -10456 -4422 33911 37555 19597 -30576 -47151 -11614 17598 38563
20103 38563 15714 -30731 -15169 -28465 5679 7714 750 -15419 -14033 -36312 -18277 21703
20091 21703 -34783 -29625 -20461 -10486 64421 60644 21838 -12030 -15373 17903 26416 -3016 -12185
20078 -12185 2916 10269 16203 -2253 -158 -12887 5814 24944 -51197 -90431 1893 26084
20066 26084 26389 -16377 44460 80316 23829 4124 -28815 -29000 -30374 -19870 5411 -25794 1288
20053 1288 -2801 3185 2861 -10476 -44166 -52054 -47739 -29579 -17937 -43616 -11879 31052 -13774
20040 -13774 -88703 -93382 -69403 -62777 -41684 -32663 276 18272 -1833 37243 58159 -10924
20028 -10924 13494 36943 32847 3455 -92233 -138908 -123178 -131777 -146740 -111512 -64419 -45773
20016 -45773 -76869 -79081 -37969 5962 -24206 -45297 -56350 -52348 -27155 41506 31578 24796
20004 24796 24145 20756 25933 -2016 -11202 -8825 -2581 44944 27791 3823 -37997 -62472 -4395
19991 -4395 18349 -20764 -37333 -12643 13039 10933 -40857 -50954 -67240 -74597 -56756 -54452
19979 -54452 -33415 -49674 -45230 -38234 -3612 65792 106505 99233 65578 60899 41348 88345
19967 88345 23398 -18208 -45697 -7815 2350 23295 42238 33306 14716 17277 3239 6301
19955 6301 5476 -2036 44491 63519 55829 40900 58503 36538 -15463 -41669 -62387 -71181 -35666
19942 -35666 -31121 35554 64767 78947 46972 54253 65360 40577 14684 50668 85618 109658
19930 109658 68375 -23368 -65975 -51915 -32682 -4756 -3910 -19823 5240 8976 -17982 7860
19918 7860 22034 16019 -27400 -75708 -70611 -32982 -7257 22365 4244 4520 61679 67759 58525
19905 58525 4485 22729 34459 17108 47616 55735 23261 -2918 1619 -21116 -21899 -22876 -45180
19892 -45180 -33526 -41185 11319 39455 26711 62631 99179 139945 104656 18678 6011 906
19880 906 7047 21760 90806 82244 85811 68639 17480 8979 25662 16019 68085 71775 52542
19867 52542 52819 -2652 6253 27326 13306 34038 73167 81843 65863 23997 -4164 19917
19855 19917 4635 17577 34871 11430 -7460 -25900 -28936 -12572 -4925 56941 81639 52671
19843 52671 31181 12131 1517 10919 233 -22751 -25171 -18138 34491 27290 -31703 -17387
19831 -17387 67145 112979 76282 22137 47064 74367 37681 18308 41558 65563 76661 109949
19819 109949 124088 108445 101727 43587 32352 17121 -34282 -33295 22734 92933 103394 87750
19807 87750 33851 10746 -51879 -50810 2909 -20556 -54459 -31304 18386 31553 8283 29543
19795 29543 38466 -13449 -46425 -80443 -59621 17802 69434 71693 26533 38107 14022 -14539
19783 -14539 24645 46960 63717 75887 77462 31248 40087 31691 38550 84240 93300 110114 65234
19770 65234 81900 94036 137269 184053 166540 148157 170875 221492 253037 284846 277117 245037
19758 245037 249811 239541 201230 216457 263530 234097 166567 161209 150002 178474 200173 257452
19746 257452 365206 387636 383285 334383 241452 225600 211697 257649 257036 251083 281189 349056
19734 349056 375966 386747 450036 518919 547028 589750 728012 879610 974047 1038834 1108697
19723 1108697 1250451 1434132 1603354 1822924 2390560 3535077 5533727 7459573 7502147
19714 7502147 6259947 5102573 4466441 4253079 4329424 4563778 4855365 5059787 5306226
19705 5306226 5821875 6684439 7919198 10009262 13925052 21720546 37524116 61751362
19697 61751362 76925680 73850863 63562702 55035527 47109624 39969487 35131295 31920984
19689 31920984 29293148 27204882 25989646 26171332 28557075 33202153 35609515 31825016
19681 31825016 25385507 20077631 16747103 14757919 13492970 12545422 11501196 10327235
19673 10327235 9315099 8576937 8024761 7524439 7093047 6689658 6272628 5831881 5489101
19664 5489101 5247011 5112854 5008346 4954021 4980732 5195061 5611594 6359947 7738709 10317506
19654 10317506 15279359 22942328 28683015 27549879 22814454 18868089 16733128 16021659
19646 16021659 16485539 17971451 20481169 25048510 33763760 46279887 61081002 82028586
19638 82028586 103304704 103054520 82459115 61401133 48332343 41328998 37621776 35026843
19630 35026843 32098308 28645265 25121486 21876337 19089647 16789814 14935445 13694695
19622 13694695 13309949 14194728 16257322 16975490 14884797 12007783 9925501 8680056
19614 8680056 7974731 7522479 6991935 6466875 6027002 5611423 5110452 4546096 4013829
19605 4013829 3556209 3190216 2911392 2659862 2459690 2252910 2091930 1930883 1775013
19596 1775013 1641055 1541891 1471649 1377780 1345632 1351502 1319544 1297963 1235060 1108448 982031
19585 982031 922569 928887 906337 888098 846274 746195 697633 724278 676698 647547 601434
19574 601434 525593 446767 424775 413516 413086 384471 380096 354651 336803 357732 373798 378328
19562 378328 400012 366996 392347 384414 340461 250371 217286 237390 273248 289770 314539 290075
19550 290075 241537 247284 271795 296022 333085 246217 206199 249034 269185 243282 238307 223285
19538 223285 248419 272579 256686 264117 291579 321118 395653 536669 717569 839272 859036
19527 859036 776290 697866 610501 526462 500602 483376 418090 340245 331456 386868 417452 400799
19515 400799 386961 416595 384876 317196 231248 177698 169333 192429 164593 156360 167132 178184
19503 178184 196312 187887 157676 137468 97522 19653 48097 84974 116431 198757 197915 150203
19491 150203 107277 88600 130646 170728 191745 202826 210063 288736 345111 359293 354498 352753
19479 352753 313317 293711 267849 260114 306384 392491 516183 597980 710078 852319 844667
19468 844667 764960 634965 494830 409727 416794 392139 322694 268666 226979 264474 248717
19457 248717 244471 231644 170523 137298 162928 169196 183100 175757 170753 155510 143751 131200
19445 131200 141683 148402 163395 163207 109614 55755 54425 70920 42815 -25272 6752 49154
19433 49154 83312 101506 122208 103499 138165 150717 128986 76024 63639 98004 100296 114896
19421 114896 84905 10430 19123 87822 55570 48186 69418 75319 106232 72443 74747 90812
19409 90812 29809 37036 87722 90325 56264 55703 80720 103593 118788 140185 123103 141395
19397 141395 130870 111775 35162 11279 12027 22763 12747 -27885 -8295 17871 19511 -8350
19385 -8350 2153 43793 76436 99357 60179 48699 6450 -29075 -33968 -27499 -26406 -20199 -62428
19372 -62428 -85358 -92659 -32866 35184 84586 133196 82291 77225 116261 185902 193845 155492
19360 155492 110459 80240 75704 104680 130312 109470 71483 66039 78162 59763 13318 54140
19348 54140 73043 119743 197489 184225 104605 40813 20478 42798 87616 125140 110878 93648
19336 93648 86626 123042 118354 96934 114999 96223 61542 65979 131644 113227 104643 80241
19324 80241 77114 152784 187297 142227 153133 163252 134250 85676 111091 110075 48528 -17496
19312 -17496 -12367 21566 56018 73562 85301 159123 119452 74234 72588 84912 127967 151719
19300 151719 120077 84926 66374 53132 69485 67816 115376 139632 102260 56978 59580 83366
19288 83366 113683 109590 110658 157291 165552 98520 77077 94038 83575 41052 80481 91951
19276 91951 147940 168457 143119 156889 178941 196911 131474 117813 158071 187603 188807 182688
19264 182688 159956 148296 190238 211971 155722 142100 184835 222052 217377 257128 235832 206347
19252 206347 211275 197269 251512 270511 273496 268761 298219 303196 340735 449631 470887 538761
19240 538761 603540 639593 741276 953521 1200452 1317870 1372228 1531747 1682486 1822612
19230 1822612 2019780 2324027 2866237 4052016 6429113 9838439 11516673 10228680 8193672
19221 8193672 6802138 6088495 5886821 5985199 6171615 6398430 6754367 7374730 8333148
19212 8333148 9827239 12329071 16692110 25173046 42607430 72686669 98216747 98810001
19204 98810001 85369115 72887228 61291777 51023537 44344429 40192809 36792934
19197 36792934 33775797 31329208 29833044 30229807 33809145 38749221 38341355 32078155
19189 32078155 25202780 20303244 17342611 15580053 14343162 13220757 11964502 10739805
19181 10739805 9670877 8709080 7886328 7282729 6933019 6631202 6227290 5728797 5423454
19172 5423454 5249069 5115930 5049368 5125251 5279182 5547697 6016200 6903916 8485032 11535037
19162 11535037 17240851 24252075 26482526 23046680 18699967 16027286 15021440 15294794
19154 15294794 16496000 18552377 22268946 29297730 38761643 48367428 61822567 79296894
19146 79296894 84951988 71044381 53075218 41081647 34580623 31106826 28848492 26553126
19138 26553126 23742629 20765370 17934233 15474598 13510272 11944658 10766003 10159848
19130 10159848 10262893 11299284 12495781 11854312 9851486 7977138 6777484 6089931
19122 6089931 5749409 5428832 5050092 4645198 4322434 4093338 3817414 3405143 3039344
19113 3039344 2767115 2504524 2321747 2131360 1991082 1885783 1737168 1609931 1522863 1412146
19103 1412146 1303706 1230926 1178815 1137150 1085660 998379 931303 872120 756742 721232 761023
19092 761023 719664 695607 690486 670443 653565 592521 524281 521421 521132 513421 495934 448900
19080 448900 364739 307579 363264 408707 418681 400758 345583 299178 307291 326202 366138 344626
19068 344626 243005 216035 195736 265905 246674 170766 196229 198405 209297 271552 299565
19057 299565 287866 291281 220318 221209 173086 178002 176099 197962 231464 206209 199894 170413 162099
19044 162099 189635 200112 226327 187373 111197 99787 153087 140942 130977 127168 110776 147309
19032 147309 163819 165770 149755 120139 113855 126135 137458 139176 124695 62252 -29276 -29416
19020 -29416 38782 8208 -34092 -16364 -17173 -30201 -67034 -70346 -75433 -67676 20659 104203 154921
19007 154921 183386 133425 100731 109705 118218 49042 9098 -10450 19411 29194 6389 -16644
18995 -16644 80539 72111 72061 70231 102055 148705 125550 104013 43186 11463 16517 42419 40415
18982 40415 44050 63242 39126 14907 48775 125764 151291 106637 61285 58079 81913 76892
18970 76892 63848 31364 36970 39078 28180 45206 58707 6646 2588 16691 -2306 -14069
18958 -14069 -5651 16074 28451 66573 88740 86809 87395 88055 64969 22444 -23001 -80110 -38850
18945 -38850 5424 5405 31492 30635 -11758 12269 22608 26743 34889 70268 116447 92817 58315
18932 58315 -9380 -36592 -40737 9896 84314 76635 30494 -34775 -62484 -55881 -823 26091
18920 26091 5588 -9274 3844 46600 86513 97355 87698 117357 123479 123422 119542 87843 75859
18907 75859 101790 126291 120370 189139 204387 154574 148077 105360 -1775 15835 35861 81738
18895 81738 86019 53442 48830 61230 130148 149974 133901 130350 179273 350013 622157 894645
18883 894645 971310 881021 799182 714865 632961 557748 480659 452159 389271 323574 317245 313162
18871 313162 306567 320661 341062 293920 226370 161499 136543 123727 85986 83314 87819 69567
18859 69567 71013 101553 110327 103476 116351 137229 118027 95587 43255 59692 110419 91165
18847 91165 42364 42438 57292 77980 144414 155945 183545 192689 188353 204604 209449 145928 97972
18834 97972 124377 140539 121046 99452 123735 207032 360276 445779 540172 647280 723693
18823 723693 745285 606172 409835 395365 411315 316352 245483 148858 149506 159254 128974 65214
18811 65214 64806 48335 51703 80799 82814 106681 127518 82975 80469 77966 84982 66505 126240
18798 126240 101934 100553 100905 31193 29892 21402 32578 -347 3177 49297 72953 61037 37819
18785 37819 36827 -8283 5837 -9394 -42090 -2039 18414 89202 105276 60697 61747 21266
18773 21266 20214 15925 54795 59028 12405 4346 53366 68931 45124 -4121 -30667 -12485
18761 -12485 -19678 43113 63042 5281 -23020 -17477 4998 1687 32072 25376 4237 25817
18749 25817 45190 72803 3936 -17310 -18917 -13884 -9186 17646 -1003 -38129 11763 23076
18737 23076 -21991 13870 23161 27823 19779 52769 60300 99798 127301 135932 92755 22881 17733
18724 17733 26636 37648 22860 20258 30098 29146 923 -74282 -96966 -16645 -4466 -56432 -90549
18711 -90549 -78407 -57971 -10328 19253 20522 -27925 -31508 -15840 16464 -36326 -31279 -45697
18699 -45697 -6941 -11577 24857 52608 41670 63038 68612 70647 88939 60018 70226 16319
18687 16319 425 29694 88437 56600 64442 137994 236807 246258 279132 250918 186486 135711
18675 135711 113886 165760 243520 275449 271251 182219 136927 134965 200060 300396 323659 294233
18663 294233 241397 186049 158795 170058 115971 88290 86721 62874 3156 71597 98512 117050
18651 117050 142635 136005 82853 81443 63581 104766 106040 66987 30670 4268 -14963 -10495
18639 -10495 4752 22299 14530 25157 21238 50701 56553 78500 95333 113357 135308 155695
18627 155695 145139 120981 121400 124670 159353 154097 215550 268225 239766 211555 157859 90604
18615 90604 136855 173586 144548 114175 102823 134426 186813 172473 164878 182578 186615 128915
18603 128915 122029 145631 183899 213373 140951 101537 99749 92124 121256 117027 102591 93238
18591 93238 90002 65171 32824 26588 8622 16116 13838 -31357 -51258 -57924 -39303 -10903 20942
18578 20942 56193 26623 12072 33073 32919 -27217 -17839 -5571 8371 17494 53997 18447
18566 18447 95 43389 56121 52099 25647 -39217 -73063 -34469 37416 39641 9287 -10747
18554 -10747 17895 26649 4606 -29425 -7894 11508 -27292 -18542 33446 14756 7066 29691
18542 29691 28753 43233 -27554 -91138 -73957 -63342 -37095 -23886 -64232 -35192 -18883 -13094
18530 -13094 -79798 -60546 -17983 -13654 -39986 -69517 -104110 -60452 -129 46312 15163 24057
18518 24057 45085 65924 73346 20329 -15498 -10295 23905 -15556 -55483 -60263 1440 25390
18506 25390 -6720 -8923 12220 7047 34926 76099 56753 -2440 -98068 -91908 -70297 -88515
18494 -88515 -67788 -35181 198 21526 55137 39079 3862 -25713 -33162 -30221 -6301 36376
18482 36376 41587 64100 71817 31328 -26204 -68314 -58770 -16547 15337 24779 -25904 -27332 969
18469 969 -19617 -40676 -53224 -35941 -26938 -17952 -5463 8431 12166 -33557 -41001 -31709 809
18456 809 -34572 -35968 -10099 25005 -6231 -52810 -70493 -89269 -61455 -49132 -40054 -89968
18444 -89968 -84727 -30331 -22608 -78940 -94198 -58106 -31847 -31328 -23445 12832 4264 18686 -5517
18431 -5517 -5212 7306 -455 32933 24958 -36152 -14396 41523 39828 60012 102436 79163 71915
18418 71915 32463 57606 89945 99735 86728 93631 81902 66581 80028 87474 67534 57095
18406 57095 9073 -12397 -16765 -39590 -32234 -53766 -81114 -58072 -45478 -54256 -30024 -25565
18394 -25565 -2926 28969 35190 1105 -28911 -3394 38115 61395 60988 41516 50141 52739 102325
18381 102325 73743 28754 1957 24420 -5992 1478 58865 81296 74158 39291 -9544 -5801
18369 -5801 -56415 -60831 -10115 -14970 -28279 -17637 30703 9315 -24028 -54061 -84378 -96156
18357 -96156 -56142 -23451 -39076 -83115 -96967 -79760 -71257 -5020 -18536 14083 32715 26250
18345 26250 17732 27819 19009 -36963 -25951 -2382 28181 -6113 -22340 -19617 -44237 -61621
18333 -61621 -73198 -106664 -84617 -24618 12336 28922 -730 -38082 -41532 -65811 -72030 -24327
18321 -24327 8291 -25265 987 32748 40913 20808 -39064 -70727 -19990 -69246 -79645 -49069
18309 -49069 -51004 -45674 -6164 17646 42042 50115 78912 60111 -7867 -14305 -16331 -42612 -38924
18296 -38924 -48703 -50024 -75264 -49576 -16608 -18170 26955 56505 5185 -43454 3028 23474
18284 23474 -6033 42965 95395 50867 -23024 -26823 -2553 -47381 -54309 -41070 -40085 -77136
18272 -77136 -83356 -38106 -72057 -75023 -86648 -22643 -12993 -32192 -65577 -113333 -109912 -44850
18260 -44850 -18610 -25740 -96314 -125604 -75435 -103738 -119708 -71468 -59990 -13476 -5225 -10220
18248 -10220 -37413 -73111 -117436 -58074 -5869 -17105 -28641 8633 -25773 -87915 -76080 -84761
18236 -84761 -46567 -51564 -41286 -39397 -47481 -24846 8569 -8780 -33478 17531 30869 -56494
18224 -56494 -102911 -101825 -24324 -34257 -91037 -79256 -63087 -32728 -40740 -61020 -45920 -40649
18212 -40649 -52643 -79685 -46768 -25976 -48003 -55037 -14286 -13010 -51061 -22529 -29021 -46313
18200 -46313 -61542 -86888 -70345 -14073 59865 32836 -25070 -55964 -86084 -49368 876 18062
18188 18062 -4589 -20010 -25475 -34688 -26365 -34756 -14245 -32533 -83187 -126563 -116166 -79931
18176 -79931 -29499 -32568 -27948 -24310 38225 86400 4942 -37082 -66129 -72676 -67022 -43996 -32086
18163 -32086 7853 -1349 24226 -32455 -43543 -20844 12103 49063 35213 19681 -24028 -31827
18151 -31827 9126 8863 15135 7148 21844 21318 -1290 -56780 -76324 -114135 -81839 -37183 -37078
18138 -37078 -53860 -69785 -73798 4378 -11888 -77656 -119390 -89468 -69303 -31547 -24754 -58342
18126 -58342 -49217 -7408 -22346 1460 -83 28712 28829 12283 49484 33676 48728 32353
18114 32353 -3906 2609 21326 34400 65418 44660 42142 105765 89378 41478 -2682 1540
18102 1540 15902 1440 26697 5869 -28571 -52337 -40402 -17741 -37013 -56093 -17802 23487
18090 23487 52672 7243 -22488 -17118 15889 52836 -13976 -49482 -42666 -26654 -31166 -46159
18078 -46159 -62195 -67590 -92694 -14302 -21395 -41718 -23213 -21154 -34812 -19857 -23868 -8800
18066 -8800 7651 -17167 -27611 -35459 -60018 -85186 -67355 -36459 -20424 -10521 -41579 -69826
18054 -69826 -94699 -95138 -55114 -60835 -47471 27287 7942 -1852 37305 45047 29267 33438 -14491
18041 -14491 -46393 15954 55261 29573 -10296 -49285 -31051 -7845 24380 43723 76545 73008
18029 73008 25439 -17013 -70477 -19863 41411 91832 64865 272 -31262 -29214 -66036 -35540
18017 -35540 -52592 -77531 -52750 -42519 -73533 -65402 37294 28283 16202 2393 -8504 6185
18005 6185 4393 14465 -10607 -18725 -21572 -38080 -50768 -13484 5695 -34794 -38114 6351 -40689
17992 -40689 -93868 -75737 -64693 -49797 -32182 -33918 -7078 25266 -7699 -47485 -2418 29761
17980 29761 32340 50984 32469 54253 59606 41218 16260 6339 -3975 -27240 -35672 11104
17968 11104 51005 51389 60989 55929 7817 5336 23253 42544 59203 45339 -1449 -55447 -54656
17955 -54656 -35651 -46895 -47204 -61377 -32060 -2885 -454 -10458 -48414 -20164 6286 -7748
17943 -7748 -21523 15499 28777 3461 19905 66421 68479 70470 35369 3168 -28615 25236
17931 25236 28273 41736 37248 36445 7773 -18868 12119 -8162 -12321 14075 4638 -12995 -14511
17918 -14511 -45177 -64145 -36176 -25018 -16643 5056 30927 -12461 -11325 -7331 21338 639
17906 639 8843 25223 46319 12093 13156 -37533 -41349 -26443 -11735 -45240 -92336 -124255 -142131
17893 -142131 -132025 -112096 -78996 -71326 -54804 -29162 21039 47328 71778 74927 36081 -21855
17881 -21855 -33720 -5673 46488 45869 28103 30486 36379 -1377 -19611 15906 9059 -22254 -102433
17868 -102433 -101318 -52315 -26063 -38525 -44145 -6714 -25165 -7109 17156 17251 41406 21281
17856 21281 -8961 -20651 -43027 -58213 -116514 -120809 -62090 -1209 -6850 -19085 -24198 3940
17844 3940 -2419 -7374 -25557 -76079 -35898 13417 21494 -15377 -26422 12745 71747 76880 39024
17831 39024 5973 26931 3646 -36613 -56265 -45254 -35515 -68424 -76205 -46124 -31381 -50082
17819 -50082 -40513 -39185 -16781 -46074 -33468 -4741 15013 22925 -53537 -109995 -82592 -101338
17807 -101338 -54641 -26573 -3277 4869 -22718 -66983 -9937 75074 123338 83051 29778 4884
17795 4884 -36779 -3519 25990 59553 51827 -5572 -30262 -5936 11751 -11833 -45044 -42924
17783 -42924 -38451 11417 65227 49665 84564 93411 71748 73088 59853 18643 53200 57437
17771 57437 45284 29387 -28891 -36102 -67231 -11415 22040 2370 5055 -10007 0 -15558
17759 -15558 14224 59965 28502 3937 -44530 -67072 -54545 9380 39311 43875 21208 9993
17747 9993 -25274 -56636 -31561 -21079 -29474 -31315 -61196 -29478 -64996 -33300 37120 67846
17735 67846 59306 14866 -10461 -76131 -75496 -54831 -32033 32836 11634 -33389 15817 25378
17723 25378 -12402 -21907 -25714 -8222 -21058 -45950 -81078 -79767 -69129 -50952 1335 44630
17711 44630 20268 -21952 -9485 26689 34804 19998 14718 -24487 -40851 -52841 -90960 -109562
17699 -109562 -71106 -38906 -58425 -93057 -76365 568 53418 64629 67837 7289 -22917 -16746
17687 -16746 8402 35453 32509 9824 -3390 -19715 -49733 42154 44477 -3395 -55349 -72378
17675 -72378 5140 38907 6088 -41681 -24576 9158 37783 16734 36725 18180 -21670 -64692
17663 -64692 -59580 -36329 11628 23386 -8024 -19867 -68992 -60087 18085 17461 5586 9073 -17
17650 -17 -34570 -81990 -88293 -80608 -137088 -153291 -161300 -130081 -121074 -134990 -125442 -108541 -50967
17637 -50967 9891 63365 32169 -31723 16229 95373 110401 71177 13268 -18279 -8648 -9445
17625 -9445 -24638 11675 20944 48321 59385 52869 29136 49495 6747 -50637 -62067 -52717
17613 -52717 -37708 41250 84648 79316 47538 -14402 -38405 -49907 -76913 -47829 -31712 -16433
17601 -16433 -14383 -6069 -21524 -26246 -15857 -8361 -1878 -15224 1095 -12617 -20192 -51947 -58429
17588 -58429 -59078 -55828 -17630 9254 15392 49576 23355 -15795 -55345 -37994 -44711 -20819 -26836
17575 -26836 -58892 -10904 22581 78223 59027 8586 -658 -3508 16062 21872 64714 36950
17563 36950 -10188 -32565 -37294 8907 -44405 -24442 -14247 53517 100107 73898 16074 -32787
17551 -32787 -9782 -35756 -4882 -5152 -14523 -31844 -3046 -27452 -8982 -53185 -99059 -99722 -55039
17538 -55039 -28618 4163 95427 154753 137052 101968 67785 220 -20904 -43797 -54106 6546
17526 6546 33651 6266 -30153 -28304 -35883 -61499 -19275 20987 33240 -4655 -43357 -27990
17514 -27990 -16741 -37792 -72107 -73472 -96723 -155663 -176791 -111477 -73114 -45648 7051 13984
17502 13984 -11175 -23527 428 38690 28569 39150 55006 52314 -1845 -41252 -54606 -37112
17490 -37112 -58783 -69832 -28678 31056 35296 -17586 -38928 -39257 -66817 -88397 -107572 -132882
17478 -132882 -123602 -85837 -18523 -14726 -12830 -23771 -52775 -90139 -87609 -100947 -102276 -44992
17466 -44992 508 16463 11032 1860 28625 -12034 31428 41773 44633 23268 -11909 -5800
17454 -5800 -5241 -10196 -25462 31349 7277 7083 -1151 9759 12162 16555 65520 78867 55342
17441 55342 -33037 -23214 -56521 23147 47546 24599 43011 36837 515 -21432 -35709 -32187
17429 -32187 25629 23089 23493 22024 22157 179 -5539 60945 86486 65281 53085 73697 77803
17416 77803 84636 77694 74121 57115 40507 -32973 -44001 -25108 13757 -731 5599 -6714
17404 -6714 -38246 -31024 -27033 -52593 -58404 -77006 -107320 -52966 6136 4817 -10808 -3043 -9449
17391 -9449 -1891 -38958 -56013 -29698 -15481 14103 -883 20056 4614 -3642 -2030 150 -15163
17378 -15163 -12560 7925 3427 -43251 18318 25431 -33575 -50989 -37435 -24448 -54555 -97277
17366 -97277 -85748 -29577 -11168 -324 -11670 24164 53529 1040 -13135 25430 50840 44472
17354 44472 15387 59928 44273 -33907 -80855 -85422 -98852 -32217 -35996 -34078 22339 -6312
17342 -6312 -42946 -38657 -31703 -9270 16033 3288 -60645 -65777 -94830 -104483 -104925 -92260 -40956
17329 -40956 9599 27009 -42238 -85180 -84577 -32915 -21117 -17880 15398 2168 6706 24798
17317 24798 28522 31212 48516 60603 36504 -5034 1247 8175 78670 60325 -21737 -37189
17305 -37189 -19407 -15618 -886 -20973 -54757 -29921 -37930 -19574 13182 52762 31580 -17834
17293 -17834 -30311 -9418 -16044 7247 30111 6910 -57 -73190 -98493 -35587 -33400 -13209
17281 -13209 -19074 -48069 -54164 -10018 -15874 -42991 -35813 -21608 -23843 -24135 -33101 -86172 -105997
17268 -105997 -84612 -48413 -4608 -10332 -14943 -70561 -60630 -60072 6438 29015 38624 76276 51012
17255 51012 -22387 -86249 -128376 -104790 -26841 -11772 17665 28453 -2199 7293 55265 51107
17243 51107 22369 11638 -36962 -56133 24678 55133 13652 -15228 -51530 -51230 -48662 -36077
17231 -36077 -8676 23703 -641 22870 68857 26857 -41864 -65407 5100 18980 10034 32654
17219 32654 37876 2343 -24623 -14667 16928 675 37093 80624 124332 112751 22908 -30212
17207 -30212 -30181 4017 42662 21871 26779 3334 32545 25473 -18405 -43184 -25168 -58116 -59248
17194 -59248 3858 25740 40720 15744 23995 20433 55792 58978 33330 10868 -60518 -89462
17182 -89462 -77000 -50985 -15641 -30583 -60170 -131197 -118996 -54465 -25408 2819 -6077 -18855
17170 -18855 -26781 -25246 -21672 4893 57376 63563 69721 105210 64938 6235 -53509 -10760 -28935
17157 -28935 -48976 -48017 -33017 -19763 17558 43714 -14761 -100575 -152767 -160592 -111585 -141144
17145 -141144 -171143 -100283 -87072 -90229 -105560 -128178 -119306 -58111 -50216 -41440 -36859 -45604 -58084
17132 -58084 -83828 -91495 -83540 -59994 -24453 63526 61632 16133 13530 3305 -39373 -59835
17120 -59835 -49037 -71052 -96610 -106848 -92261 -92744 -85937 -37456 -49097 -31712 -90949 -100009
17108 -100009 -5352 30084 7343 -27524 -38323 3920 21495 46494 -29831 -66220 -61143 -64999
17096 -64999 -54800 -97678 -86284 -63487 -139592 -125496 -106216 -89801 -71436 -99527 -63301 -33679
17084 -33679 -28078 -33467 -34997 -29046 -41108 -42107 -59571 -43377 -27682 -126 -7728 -20013 -6080
17071 -6080 944 21049 -26914 -63524 -74862 -55258 -16840 -24947 -10232 -30245 -36586 -3674
17059 -3674 17905 -14954 -40811 -13565 23896 18405 5884 -27028 -88131 -84491 -36832 -20116
17047 -20116 -33721 -23983 -14787 -3109 -20186 -36634 -30230 -19071 -41777 -45917 -37214 -48297 -38662
17034 -38662 -10376 -23635 -89246 -87218 -78471 -82080 -19353 23934 20084 51508 76048 49400
17022 49400 27541 15428 22100 12724 -47419 -116023 -118430 -70387 -23256 -25754 -28562 -15427 -22221
17009 -22221 -24798 22603 23198 -33973 -74417 -109842 -91289 -42854 -7649 23278 6722 -36859
16997 -36859 13088 25847 21160 7341 38056 17261 1945 -27470 -53646 -82260 -61176 -17640
16985 -17640 -16991 -71418 -26600 22444 17365 -8793 -1864 27228 28190 53983 24614 4807 -11388
16972 -11388 4673 27748 30009 33778 33091 -15090 9877 40144 10382 -11995 353 -14091
16960 -14091 -7684 -31801 -45644 -25505 -47408 -39315 -78253 -44419 -8551 -11664 -30704 7842
16948 7842 23051 2659 -27571 -18621 -17307 -50069 -34891 -44751 -67200 -75375 -79826 -72308 -4983
16935 -4983 19302 20641 8195 -690 -20084 -33583 9294 30478 -4677 -33838 -75266 -42301
16923 -42301 1798 -29884 -29441 -39660 -77561 -95452 -45137 -47183 1741 40883 -13912 -11571
16911 -11571 -3618 -47912 -30458 11112 7628 -37864 -66993 -91187 -100173 -115018 -124126 -123101 -76737
16898 -76737 -23155 -46559 -47579 -2110 6182 -34703 -41283 -70901 -86590 -126726 -149202 -132482
16886 -132482 -93599 -58536 -17837 -46337 -79127 -79665 -69545 -97529 -121425 -116349 -120157 -74732
16874 -74732 -32411 -39347 -61353 -61309 -7152 45368 56385 23617 17737 68352 93105 43147 30719
16861 30719 50717 19070 13187 -31783 -43196 -66007 -27813 -32176 -529 -3928 9329 3116
16849 3116 23351 57102 38699 -18281 -31724 3373 82239 86455 36956 6948 22836 19335
16837 19335 -5251 -45479 -33566 18721 25467 7675 -18621 -37323 -28688 -32866 -22963 -27850 -7762
16824 -7762 29152 40484 20186 7781 -17009 2442 8112 -7370 -20198 -15537 -42520 -76707
16812 -76707 -48207 -26150 -37344 -18992 -1712 39513 20793 3496 13039 6198 -3650 24937
16800 24937 32053 -102 -56829 -20677 21655 62651 15666 -5893 -6347 -23752 -11150 2070
16788 2070 16496 9147 -47216 -68264 -27994 17214 61828 59945 53317 10904 12596 21486 6502
16775 6502 -61706 -50892 7806 60344 45877 32766 -40301 -80142 -58784 -32947 -21642 -21960
16763 -21960 -53458 -41640 2189 23414 -9118 -22816 -28671 -13010 -7229 47427 23162 -28814
16751 -28814 -49186 -4202 31897 34143 45985 73107 80087 14447 15818 51757 35715 -40236
16739 -40236 -82940 -35224 -6938 -26842 -59313 -24287 -37260 -65286 -24574 -38416 -95419 -81557
16727 -81557 -83761 -61263 -72141 -66194 -61908 -33937 5547 49687 13703 -82338 -117890 -70352
16715 -70352 -54831 -70679 -60516 21617 40880 21194 23947 17727 11739 92920 118147 70748
16703 70748 32839 -10799 -39511 -70491 -55021 -48162 -85781 -67690 -9310 29081 -12087 -44172
16691 -44172 34595 48071 19315 -42297 -43073 -23916 -5268 12778 -59321 -79944 -63090 -36968
16679 -36968 -24849 -22495 -32701 -25402 22015 30896 39798 19007 10623 7181 10014 -12031 -22414
16666 -22414 5869 -12885 -35191 -39893 -43339 -30233 -8653 -10997 -52 45443 19776 -5135
16654 -5135 10207 10421 -35369 -11815 12580 2937 9169 -98255 -91465 -35672 -18848 -494 34
16641 34 8955 886 18806 38661 -33391 -50616 -60077 -35698 11268 85505 63732 45668 20726
16628 20726 -40571 -39968 -42407 -21611 -45899 -14543 24213 42742 21421 -33193 -60820 -39450
16616 -39450 -26615 -41202 -62689 -70689 -46405 -36038 8459 33919 27746 -60466 -67700 -71111
16604 -71111 -25632 -11723 -13165 -30993 -79231 -129961 -156799 -158866 -116668 -119995 -85349 -45579
16592 -45579 -9999 -11276 -35140 -15952 -24433 -12677 31425 24842 24289 20881 3931 30498 -72008
16579 -72008 -89378 -24341 22453 36848 9515 -59977 -67057 -11355 -99527 -123539 -56361 -6230
16567 -6230 -7464 -22168 -18595 -8530 12678 53342 80381 54068 26555 4360 -9575 17087
16555 17087 18335 46521 12143 -18301 9572 12937 -20995 -2819 22225 11121 -22775 -23219
16543 -23219 -21607 -11018 -15452 -30860 26300 39284 7129 2091 -2241 -35555 -18842 -16616 -13446
16530 -13446 29382 24800 9259 -38629 -64293 -74110 -85829 -62069 -88788 -94126 -58549 -48622
16518 -48622 -32286 -20450 -33800 -47601 -91499 -50242 -15521 -34459 -53465 -14976 5621 -20262
16506 -20262 -49757 -95492 -95104 -39309 10283 -12542 -48662 -48205 -38719 -18076 -35468 -72493 -76745
16493 -76745 -29073 -2939 15330 13097 -2799 -33145 -57828 -36054 -40712 -74817 -102043 -73567
16481 -73567 -73333 -91093 -36535 -12920 -13007 -67029 -116887 -87248 -63576 -92162 -65359 -81814 -34938
16468 -34938 -7143 29226 41156 12842 -52833 -39776 -30503 -46962 -64149 -19678 8593 -3114
16456 -3114 7033 27749 19244 8767 14290 68881 51515 -39563 -91472 -47628 19614 245
16444 245 8928 -19683 -79991 -68687 -30337 4317 -13117 -75755 -63504 2588 -1563 50682
16432 50682 51281 12966 -53172 -75341 -32176 1673 -20572 -58788 -31486 -13053 -7660 -45584
16420 -45584 -35275 -3735 9666 14879 -7484 1378 -40642 -83872 -135881 -175266 -97557 -6238
16408 -6238 47090 26014 -7692 4080 -19075 -51884 -63580 -32469 -11933 -38019 -100951 -78362
16396 -78362 -66148 -93076 -92897 -31690 21745 19447 13667 -3650 -53010 -90141 -65024 41393
16384 41393 60563 42806 14265 9140 18871 3297 -3411 2029 26687 71953 52597 -1278
16372 -1278 3539 -17341 -22017 38086 40207 2776 -21867 -17407 18643 51146 49033 42287 -13457
16359 -13457 -34542 -22213 -45859 -61267 -58107 -59039 -52423 -50425 -62505 -19191 -7550 19259 46536
16346 46536 36667 -24785 -70733 -39669 -43629 -68450 -49747 -60819 -43401 -25878 -50744 -49431
16334 -49431 -11713 -20817 -9829 30822 29814 -10962 -38468 21075 43233 41968 92173 126108
16322 126108 76562 95206 51635 12852 -9809 -20428 19848 64240 86797 59704 41147
16311 41147 26564 52611 35554 18228 34842 32583 18762 61915 30896 51101 78832 31872
16299 31872 9321 -30926 -53684 -56231 13065 29689 12183 389 11705 -50622 -85222 -74257
16287 -74257 -16936 3057 11494 24613 -7443 3770 -4837 12814 22845 -39878 -40472 -65992
16275 -65992 -24106 21698 -13715 -31130 -57592 -38736 -7244 -18926 -27767 -35504 -23650 -12831
16263 -12831 -20190 -35079 -4661 30483 51659 38316 -7618 -69842 -129142 -91693 -45026 -91807
16251 -91807 -71861 -57459 -122886 -147810 -123838 -125395 -118799 -143090 -128288 -95926 -103900 -118954
16239 -118954 -89868 -39494 -33011 -36862 -49896 -54908 -29368 -22824 -38288 -27573 15828 52566
16227 52566 57281 3804 -23662 -55254 -65779 -40089 -40837 -23561 -40348 -40673 -10953 5863 17268
16214 17268 -101 -12449 946 32934 24406 25997 5989 689 -38307 27019 37866 98814
16202 98814 133572 79829 -18975 -41422 8733 46038 41475 111 -44719 -27602 38293 70344
16190 70344 77555 37478 43065 40001 -15054 27157 81568 45162 24541 52764 59292 16211
16178 16211 -5531 49429 90747 39539 3809 10989 -1819 -17833 -9318 4028 -44238 -12397
16166 -12397 -679 -38166 -77957 -68826 -64488 -57436 -54455 -96625 -60434 -61570 -84022 -71004 -34714
16153 -34714 -24851 -36136 -56807 -98959 -97261 -90827 -82303 -62242 -61473 -39427 21139 -1093 -23906
16140 -23906 27155 -27446 -52498 -46023 -52034 -73526 -72802 -59282 -75856 -74026 -36622 -20141 -14919
16127 -14919 12614 38877 18857 -40832 -49417 -56053 -47035 -83340 -63546 -25100 -186 -5418
16115 -5418 -33367 -22286 27949 35452 -28651 -10899 3864 46816 87909 46271 19755 7948
16103 7948 -21982 -35746 -73025 -66662 -90341 -88779 -55064 -42438 -32835 14367 6551 -57323 -125549
16090 -125549 -77550 -22793 5534 892 30588 -48218 -97458 -167357 -149689 -90499 -71389 -35215
16078 -35215 -20041 -67482 -110892 -121377 -49073 10796 27174 35079 37711 21268 14482 921
16066 921 -14745 -774 -46475 -86699 -64618 -46600 -9840 -945 1527 19341 36680 33180 -2821
16053 -2821 -21361 -93029 -68875 -53997 -27038 -47397 -52152 -5368 46688 28745 -37005 -48615
16041 -48615 -82381 -46209 -49324 -48485 -29590 -32876 -67754 -47147 5257 18529 1882 15063
16029 15063 6786 -38229 -102759 -97372 -65777 -62442 -32006 -45488 -44984 -24841 -26742 -24561 -58527
16016 -58527 10711 58540 57835 60446 50850 -17161 -55040 1706 30354 -32807 -67466 -30398
16004 -30398 -33229 -35422 -42930 -36003 43511 111024 65227 36415 38411 5844 -32466 -47825 -40413
15991 -40413 -10231 18763 10240 -31953 -37438 -8457 -34159 -52735 -21427 -34020 -16725 -22493
15979 -22493 -32235 -69098 -87738 -58677 -49405 -11498 15596 -21633 13967 70971 41891 -25741
15967 -25741 -46712 1124 23085 19002 2463 13905 48266 95852 96032 27490 -10456 -3680
15955 -3680 14888 19933 -26747 -54183 -25990 -50721 -48055 -6940 23586 -1361 4289 -34171
15943 -34171 -48538 -8828 -22437 -50121 -44318 -6749 5071 -3508 12386 -47466 -76570 -78491
15931 -78491 -57283 -84743 -95643 -73798 -53245 -15093 -10782 -19326 11283 61484 67686 38945
15919 38945 22417 3183 568 15011 41258 48879 13207 -17242 -62929 -64574 -13653 24418
15907 24418 10669 -30796 -50278 -50760 -33287 -45746 -69963 -71232 -68213 -56353 -10004 3244
15895 3244 -1506 -19735 -8692 70510 64847 46887 21270 27580 47873 44390 33621 11793 60157
15882 60157 73292 59410 46583 -14048 -11772 -25662 -47941 -14573 -9014 -4760 40814 18925
15870 18925 -16134 -9574 -5654 -16596 -6654 30638 30787 -42859 11535 22112 -38216 -81041 -38793
15857 -38793 13269 15018 10877 28831 53014 23204 4808 16587 15635 4168 19066 30985
15845 30985 38350 74588 95360 62892 14645 6471 -3143 -26676 -54641 -53194 -9435 36466
15833 36466 42351 100866 132351 115536 83838 68626 97547 70078 61027 30764 39543 67525
15821 67525 46052 -25255 -52751 -38233 -47658 -43115 -3427 14566 17836 -1220 -5848 -4848 -40212
15808 -40212 -52742 -34607 23844 78961 47775 5595 -123 8722 -10413 25168 76574 77633
15796 77633 74886 72513 56888 68937 57899 49399 63534 91795 123152 98751 77684 83282
15784 83282 82993 97337 93137 79224 95681 51161 24058 32730 15335 1386 -18780 -16812 -2521
15771 -2521 68277 35990 45714 48265 24503 -9074 -15818 19991 11052 46986 62855 22985 29751
15758 29751 84220 128508 63219 44826 -3590 -6475 71273 122620 92351 108958 95126 121784
15746 121784 135791 111358 89369 85071 83259 92184 78976 54305 59318 129236 136681 103122
15734 103122 66270 -18331 -42022 -64769 -83408 -48972 2220 32797 37505 62363 65902 42131
15722 42131 41499 47257 29416 -16247 12121 53652 79684 107653 108548 108442 48225 19803 -3047
15709 -3047 -44488 -50058 -15078 40067 46273 61709 8807 -57870 -88731 -49335 52355 76535
15697 76535 84844 106204 88620 17923 3113 -26784 -34436 34739 21857 -35867 13990 43983
15685 43983 1111 -11547 -2538 28217 -8537 -16445 -3765 7266 29941 72153 29843 7706
15673 7706 19937 30328 86160 38159 5586 41726 107915 79220 42329 41910 36499 58258
15661 58258 55549 50872 32953 18311 -32817 -19110 14470 11591 16339 8140 -57095 -23575 -33254
15648 -33254 -48557 -57902 -53920 -48169 7645 39138 63794 47640 66079 61904 27174 -29778
15636 -29778 -32100 -7591 20138 53376 25063 16131 44433 -19307 -42634 -57360 -22397 28099
15624 28099 27530 7424 8411 -23391 -52679 -64908 -34227 7142 12377 -39625 -42303 39355 107605
15611 107605 127107 134471 88715 62282 39336 45990 7448 -47599 -81188 -50409 -34990 -80414
15599 -80414 -53360 -33964 -67023 -47717 34138 15463 -29782 -1892 -903 -40976 -58171 -59429
15587 -59429 -52785 -17661 49388 14216 -5466 -4297 -49433 -86536 -46234 -13600 10261 30898
15575 30898 -3423 6186 24433 26623 -35863 -27909 -19290 -10732 -4632 -26678 -7640 -3739 17721
15562 17721 18222 70007 106141 96731 99669 39794 6814 -19590 43836 71048 52470 25159
15550 25159 54096 101647 96855 24429 -59174 -63394 -32762 -9101 23217 41202 44610 12046
15538 12046 -27139 -69709 -123373 -94417 -42142 -4198 38477 5773 -14798 -10214 -3551 -4065
15526 -4065 8157 14412 5700 -16770 -67975 -23873 -13236 -12410 -28803 -27025 -33972 -27447 31687
15513 31687 69320 60879 45328 34191 19337 -44787 -119496 -116759 -94343 -111540 -78663 -54707
15501 -54707 -60971 -106021 -91820 -37793 -46358 -83769 -138418 -126834 -83912 -35500 45570 87184
15489 87184 25825 33664 4778 -9561 -1855 31590 25709 -16338 -29314 -10805 16753 42233
15477 42233 37013 38177 18896 -26741 -38598 -32389 -57049 -61847 -13779 -5989 -12064 -16243 -37457
15464 -37457 -53604 -50195 -30635 7815 51412 47950 56099 55510 46410 53746 83777 52892 -7843
15451 -7843 -17498 -15338 -46999 -63518 -17030 -29783 -32177 -59184 -45760 -50331 -54041 -22752 32640
15438 32640 -13792 53562 102816 92770 60270 -19814 -29120 -82347 -85355 -87982 -60230 -56562
15426 -56562 -28830 -27063 -77654 -50257 20590 42137 39853 -8216 -15485 -2818 -291 -70373
15414 -70373 -112294 -93643 -12996 16675 -23764 -10514 -30394 -23545 -22472 -35702 8789 24442
15402 24442 8942 -14170 -59741 -100942 -22316 -7482 6600 -73 -15266 -31758 -15126 11740
15390 11740 14130 -1888 -22295 -76776 -68003 -3539 32683 38581 54093 85609 82265 43987
15378 43987 -20922 -46628 -13494 45856 34544 32593 55811 24848 15549 29779 38091 51308
15366 51308 25637 44231 53917 -43008 -83450 -26992 574 25120 -26965 -58769 -87887 -121555
15354 -121555 -123012 -57129 14705 -4368 -28812 -2848 12024 54356 71550 52584 60377 48001
15342 48001 33942 29675 48826 92366 34462 -30086 -35741 960 -33159 -16749 -24153 -47328
15330 -47328 -57665 -11381 10443 -4013 -17757 17346 -11454 -32816 28860 39335 28038 35814
15318 35814 -2696 -30255 -27370 -16640 -655 33190 76971 97488 106501 -9734 -84933 -73954
15306 -73954 -12823 -21457 -25699 -21269 -53510 -76743 -100186 -84345 -72564 -54130 -10633 -20660
15294 -20660 -5922 -7874 16545 -27303 -63518 -72318 -76913 -50340 -23487 -5459 11635 13868
15282 13868 29770 26454 51201 68983 71549 -1831 -21830 -40219 -46970 -8073 15286 -20604
15270 -20604 -38062 -29214 -20138 -41783 -74908 -73067 -95373 -59319 -42341 -62185 -117007 -109473
15258 -109473 -116943 -136957 -99911 -28237 -31163 -29454 14437 61456 27940 -46579 -74200 -29742
15246 -29742 -7949 -47360 -50125 12489 22287 -17179 -40455 -10905 -11001 -85855 -119926 -92107 -61437
15233 -61437 -27630 -18438 -35095 -70136 -39926 29072 67774 50431 18458 20724 8016 34987
15221 34987 90232 67388 75057 126437 97380 71029 -8529 -65828 -32188 -25258 -50747 -35442
15209 -35442 -40407 -28824 -53449 -57196 -45347 14157 -7464 21901 15246 -15329 -39231 -20234
15197 -20234 24668 35917 -4873 -64205 -94356 -101573 -26317 -27038 -44862 -66262 -87840 -43956
15185 -43956 -70364 -60344 -123230 -118062 -96580 -108977 -91005 -82091 -68439 20670 61211 -3935
15173 -3935 -2410 3288 -1957 -10078 -2054 15937 42613 65541 72866 63027 78664 48526 69659
15160 69659 82828 95578 94421 58854 45675 15688 -42338 -43641 35663 58218 4054 -10063
15148 -10063 36561 30193 31647 10112 20808 4072 -33116 -27767 15595 45202 12145 -33983
15136 -33983 -17841 -5471 17707 63554 41348 7166 8256 21964 33246 21140 69196 60972
15124 60972 6750 -68723 -90376 -80560 -42306 7998 33870 56787 90382 26474 24568 44218
15112 44218 38834 75495 77485 29630 16969 15885 4136 -49405 -55044 -46618 -15972 -29441 3817
15099 3817 50387 2765 -27741 18999 22602 18717 -16054 -40279 -57640 -34847 -41635 -55800
15087 -55800 -20492 -32032 -17296 -47660 -69865 -29614 -28086 -34078 -74838 -54358 -28233 -32279
15075 -32279 -31749 -28998 -5822 7880 7349 15572 41008 60617 47984 27435 74791 44260 42505
15062 42505 66832 83364 30742 -44433 -43212 -34812 -69209 -79968 -77867 -88747 -70599 -55991
15050 -55991 -49074 -58578 -28570 20555 22988 -16334 -44662 -103853 -156990 -165187 -131210 -125657 -83409
15037 -83409 -33673 -56814 -42235 1975 -10416 -54613 -10965 40540 40074 36775 36136 64915 58401
15024 58401 53758 37552 8034 33163 75871 81336 96556 90375 21738 -6323 36469 52814
15012 52814 43639 -7250 -46527 -65402 -40470 -15818 4608 -11458 22206 65639 52400 3021
15000 3021 -26503 -20833 -36766 -72503 -57547 -37711 -32437 -34813 -36345 -42067 -73415 -53675 -14381
14987 -14381 31351 15167 37798 11243 -11579 41056 25327 -35462 -64344 -70235 -56947 -57549
14975 -57549 -49702 -66640 -51313 -60249 -91685 -169860 -185000 -120567 -95526 -91461 -78584 -54827
14963 -54827 -57429 -94007 -94008 -64668 -33500 -8315 -26783 -63151 -77484 -108430 -74626 -29012 1981
14950 1981 8627 3984 8968 7592 51507 78338 46828 -9341 891 11794 -13240 28700 79668
14937 79668 63905 22462 27348 68987 80962 44336 30635 98773 108991 66255 62206 43897
14925 43897 62659 82176 55585 38403 17512 35208 29219 34731 -16302 -77536 -89898 -56842
14913 -56842 -5617 -23630 -62193 -63041 -3010 15065 -12060 -75812 -87302 -67159 -13664 -29083
14901 -29083 -43278 -25838 -26098 -2539 -64398 -87447 -54517 -5717 -14800 -44579 -45395 -32811 -70362
14888 -70362 -39189 -8878 -1025 22997 12839 15588 55768 63796 18196 24193 554 -41180
14876 -41180 -121586 -139799 -105299 -67466 -59098 -82714 -47641 -31063 -33109 -72523 -75703 -18166
14864 -18166 18426 -11077 -15245 -28846 -76512 -57064 -58505 -50823 -65882 -102927 -106400 -82416
14852 -82416 -42679 -11807 -18905 -7084 18192 -44339 -64139 -18600 -3511 -38866 -56794 -61601
14840 -61601 -39205 -45320 -47811 -23753 -23248 -104074 -124043 -63875 -41198 -6472 372 12491 -12782
14827 -12782 -53186 -52739 -9423 -1550 -9037 -3455 -14724 -6942 -23331 -30212 76699 93242 67334
14814 67334 38021 -4653 -48013 -86371 -65738 -30750 -34851 8656 10569 -29728 -68620 -65137
14802 -65137 -62760 -16172 6763 41999 56257 70023 54293 -33148 -51863 -35934 5444 33358
14790 33358 49456 -1222 -37839 -46962 -62255 -32874 -12227 11798 14151 -1136 -15079 -3170
14778 -3170 -22436 -69646 -118848 -76895 2981 22270 -12339 8366 -3006 -49807 -75884 -81260
14766 -81260 -65754 -9378 13741 11449 -16384 -32126 -56724 -61929 -67043 -86964 -64250 -5751
14754 -5751 54373 74938 33948 3543 -11548 -24680 -16893 30438 41625 54263 10843 18450
14742 18450 24548 -7904 -87690 -83080 -76073 -75392 -40566 -52327 -83740 -123709 -74697 -25850 -1577
14729 -1577 11768 35694 26757 3755 17998 -41513 -90437 -44958 -39207 -22371 2637 1924 1805
14716 1805 17543 51651 41394 45704 61240 6989 -34465 16339 12220 2878 7406 -8826 -40797
14703 -40797 -70344 -88860 -144290 -89025 -37259 -25114 20353 -30840 -83886 -66307 -56107 -63162
14691 -63162 -4894 42960 23683 -12945 -88773 -100324 -91956 -98525 -50642 -24828 -51877 14305
14679 14305 93271 102030 72698 80115 92690 118634 79926 41296 51240 85692 116066 42544
14667 42544 31666 2480 -27710 -29943 -30134 -15061 -8116 47237 61845 54446 64635 62465 36798
14654 36798 39218 23484 19433 -6169 -21807 48829 67886 10260 -17141 -44427 -38559 -10747
14642 -10747 -23931 -48489 -69289 -54407 -35751 -12056 -9062 13752 72623 100400 67812 46352
14630 46352 9054 19963 14327 14353 -16789 -9970 -18103 -9799 -79144 -121885 -92700 -101293 -88745
14617 -88745 -31976 -44575 -101142 -110184 -122731 -102590 -126810 -112312 -73073 -60408 -44510 -17471
14605 -17471 -3350 20574 35118 49257 8924 8808 42102 -33443 -58273 -4165 -8475 -38612
14593 -38612 -60369 -98380 -68751 4016 -20103 -71788 -70989 -30309 -13527 -28901 -83686 -52803
14581 -52803 11771 3694 -25125 3241 -175 8001 80888 61786 37791 -33055 -53029 -47510
14569 -47510 -5118 -24148 -65683 -77035 -48344 -35474 -79715 -72699 -16403 33501 -16475 -46403
14557 -46403 -18509 -11679 -72761 -97249 -90233 -61718 -82324 -110868 -129862 -143987 -116715 -72070
14545 -72070 -8816 19750 22921 68783 48786 49175 47869 53105 24024 55832 75426 81044 48548
14532 48548 32989 78051 75078 84117 79238 13503 -50113 -34797 -33530 5134 52093 39044
14520 39044 -3376 -45886 -62228 -65118 -19653 34731 4795 15581 41552 12470 -16401 -34026
14508 -34026 -22480 -44684 -69184 -21436 -11399 -53594 -35891 -17857 3108 -33686 -49060 -59489
14496 -59489 -27020 -19070 -16558 -40523 -33290 -22175 -68095 -102294 -104482 -84486 -81897 -102369 -92355
14483 -92355 -37290 -27338 -20237 12573 33240 38133 47878 25494 22497 15431 -18856 -33116 -31553
14470 -31553 -4361 -50160 -91562 -75971 -13999 49941 76675 48140 34092 44749 19996 -50635
14458 -50635 -56093 -60695 -90521 -104008 -52058 -11593 8075 2014 -23333 -48139 -22039 17328
14446 17328 20291 -6046 -8207 3154 11931 1117 1943 -29517 -1225 16810 -43619 -33303 -19435
14433 -19435 2008 77093 134431 112867 66324 11006 24460 52791 56151 33493 32221 16359
14421 16359 -43821 -55209 -63400 -102555 -76207 -58106 -26128 28407 12531 -7857 -48039 -26155
14409 -26155 -49312 -55129 -33301 -31064 -22068 -23335 -47969 -68417 -82807 -59407 -73487 -61398
14397 -61398 -5510 2150 -31226 -30059 52365 73328 14733 -5448 -6459 -37258 30636 29912 -10212
14384 -10212 -50793 -42453 -8507 -2130 -26299 -45384 -48451 11831 44162 9390 -14465 -3631
14372 -3631 -42140 -57990 -45661 -21733 30755 30183 61336 90134 27176 89106 123242 104771
14360 104771 64096 14338 1380 30176 55706 -6696 -42894 -69454 -21452 45629 104592
14349 104592 138318 186405 180364 108038 21329 -12931 -15026 -8571 8657 3669 38442 55696
14337 55696 -6162 -40068 1170 8568 -8414 -41197 -59913 -59392 -64918 -103269 -56708 -54367 -99505
14324 -99505 -80323 -65867 -69962 -63573 -36378 48604 50512 37324 63860 16236 -38195 -57814
14312 -57814 -41558 -65498 -65517 -48111 -32822 -36450 -40299 -32225 -42631 -4205 21471 30246 -35801
14299 -35801 -41418 -27450 -54391 -123242 -141084 -65379 -48048 -61671 -90744 -71539 -69450 -36608
14287 -36608 -41835 5403 -14364 -12427 -17383 -53137 -56661 -59609 2866 49940 15859 -16905 4202
14274 4202 22859 -33040 -44746 6838 19852 489 -5740 -2247 45993 55538 17196 11554 -20581
14261 -20581 -12660 -11468 -35578 -18697 6034 219 -25394 -26988 -28048 -70090 -46432 -70234 -32340
14248 -32340 26609 35225 10554 7785 -45498 -35072 27994 21068 -28981 -82188 -60506 -27530
14236 -27530 1052 44120 53740 56456 59805 61708 43584 -14558 -24234 -21422 9383 14328 27572
14223 27572 43938 46891 7807 22720 -28047 9440 36468 9654 -28873 -86947 -94453 -24610
14211 -24610 45776 32606 22643 29221 47745 61620 55033 50859 57402 10015 14462 43165 47935
14198 47935 57294 63758 37261 16009 23232 34672 16919 -2330 -1209 7178 11074 7540 5390
14185 5390 1917 15133 13722 -1957 55199 27745 -26549 -16997 3291 38388 41689 18197 9435
14172 9435 37217 31076 15816 -5426 -6972 -49342 -67815 -27187 -6956 28154 36571 -35713
14160 -35713 -42563 16536 -1125 -7116 -6482 -22063 14982 16556 -11098 -38130 -68940 -56704 -53019
14147 -53019 -31979 -8787 9921 34089 64060 50464 -1940 -23515 24029 -12051 -12578 -15352
14135 -15352 -21512 -42774 -74171 -77993 -49714 -41324 -39647 -9759 40204 7319 -4773 -567 -17442
14122 -17442 -6131 51495 78722 88125 80344 66042 11722 -2174 20172 26487 -10001 -30277
14110 -30277 -33535 -77275 -61583 -33654 -49423 -79340 -41497 19684 40372 76283 98550 53348
14098 53348 -3472 -42699 -94608 -56215 -73538 -91337 -37509 1929 -21634 -53241 -84105 -25474
14086 -25474 -45178 -56779 -39539 -43294 -59870 -51852 -46069 -14825 -51293 -117610 -98013 -76736
14074 -76736 -67380 -66464 -31551 -17844 -15487 -3688 12871 15831 -23121 -86237 -65532 -46588 -31833
14061 -31833 1553 -2189 4384 33249 56314 9934 -63735 -88787 -67648 -28025 495 25560
14049 25560 36008 17775 -1543 25992 37610 37711 7123 -3927 -7415 7525 -5166 9838
14037 9838 54484 54695 62761 64807 20981 -41001 -16387 -11318 -53559 -80457 -80766 -45738 -23385
14024 -23385 -68957 -86067 -45056 -9578 -11895 -1584 5259 16136 -47301 -52201 9126 51053
14012 51053 69903 61291 29302 -31946 -10801 53246 102351 111566 119562 129926 94291 116223
14000 116223 52090 39013 60385 65799 44562 11561 -4671 -1118 -13261 -73649 -49112 -47024
13988 -47024 -65412 -83120 -67417 -29048 -48751 -32651 15431 22488 48621 75353 62354 34021
13976 34021 3960 35155 83623 9104 -35242 -13625 17335 -8294 -25455 -68724 -65986 -73426
13964 -73426 -76077 -48774 -9446 -26937 16304 1122 -11885 -12840 2795 25438 14033 -4533
13952 -4533 -4354 -21763 -4694 -51824 -66239 -53986 -38246 -16136 -8303 27082 -660 -13787
13940 -13787 -4489 7564 17418 31493 42358 71059 109613 101060 120986 190951 261734 469506
13928 469506 853657 1395746 1630889 1336830 944370 709831 586794 516141 489403 446797
13918 446797 401207 415002 380875 257572 207056 193617 155817 68398 5393 31400 59987
13907 59987 34874 79213 107914 108902 109443 74618 50039 35130 11490 12117 32608 24801 4634
13894 4634 -46038 -12328 58412 84854 110555 89683 74917 75458 55899 33943 4707 35955
13882 35955 61728 69627 81997 57788 58042 105313 146554 78875 12589 -22545 -81080 -71963
13870 -71963 -68700 -86230 -60340 -62557 -64254 -68736 -96734 -90894 -21458 -7758 40725 78734 11252
13857 11252 -22749 18727 34968 52005 83340 100784 49339 36296 68256 58140 19917 29296
13845 29296 26420 -5570 8742 16240 28270 51434 75947 75206 76821 84216 21652 -2989 -25678
13832 -25678 -43138 -16696 -19480 16876 34392 -9821 12877 35927 2661 14702 15054 33096
13820 33096 29048 -27337 -21193 22000 18357 11153 1017 -37913 -63518 -101613 -109696 -102740 -63350
13807 -63350 1695 -4544 -6136 11981 35817 44034 65077 55596 75405 105084 86963 89176 99887
13794 99887 83287 87231 66941 41709 46826 3279 -34783 -68899 -70153 -33859 16017 53072
13782 53072 48379 51934 48743 32756 -36845 -58217 -63648 -23913 -4658 -96303 -83781 -64711
13770 -64711 -63911 -53218 -52448 769 43623 24298 -19560 -26532 1986 -17104 -68892 -93408 -71757
13757 -71757 -32172 -34145 -7139 30839 55049 7137 -72450 -44521 -8359 28730 11590 407
13745 407 14481 54843 68263 62012 53330 26800 2646 -31109 -56717 -26652 -2995 -9203 -59462
13732 -59462 -88930 -79778 -35726 4839 20371 10418 49909 65150 85699 99886 100275 49700
13720 49700 47761 120244 126113 125617 140576 89235 78713 77790 65456 51427 41439 29943 51387
13707 51387 82074 47571 49856 81454 78428 83150 155664 137099 60779 75737 105284 65846
13695 65846 54356 79135 93630 89260 71841 113099 139034 125311 120856 36293 9087 11416
13683 11416 62574 72778 10739 -19878 -24138 12778 43914 51107 58852 95891 121416 91071
13671 91071 15525 -17526 10842 10625 -7600 1425 158 21328 8317 -30825 -11916 53770
13659 53770 54153 46181 52278 24245 33813 -11280 26914 47573 92885 110200 78915 45447 5790
13646 5790 18518 65126 57684 52256 12192 5108 24579 10815 74156 115222 80158 51885
13634 51885 87711 87070 65702 87273 70606 40886 66901 69904 45686 35179 49968 106098
13622 106098 116011 86331 70925 63658 76729 92440 116023 51244 38811 72993 84510 48700
13610 48700 40480 52216 69872 93057 112325 128191 158531 119350 112759 117177 80911 52762
13598 52762 92040 105776 102349 70905 312 -14744 9462 68576 106126 97976 72786 77935
13586 77935 67417 98141 139571 135526 88731 104848 111291 114318 180186 210171 269473 386656
13574 386656 462813 472044 418694 300598 253268 260786 197133 135846 140535 171606 188388 189648
13562 189648 192231 153724 119055 87903 91962 96560 141893 93186 108790 171896 191472 124448
13550 124448 80633 100532 87152 99750 148930 154831 182110 200189 178828 125108 96176 91641
13538 91641 100898 158265 167609 156592 146172 143828 147237 169594 225151 202517 185916 156246
13526 156246 112174 160055 184432 217101 200027 194620 244150 232648 282782 329521 309999 286330
13514 286330 251910 255124 269542 290133 316189 349677 354207 390848 391074 374450 370674 347558
13502 347558 340846 354801 344083 300784 264066 335846 401308 381139 386120 429598 440518 414292
13490 414292 443033 520907 599657 624359 678201 705367 738602 768606 819195 896570 920140
13479 920140 900690 894313 955173 1065006 1148264 1251879 1419015 1619016 1793743 1911048
13469 1911048 2024632 2312305 2627855 2915010 3238460 3658486 4288502 5260883 6334404
13460 6334404 6930548 7285581 7964635 9195128 11155271 13902356 17868569 24063996 34656886
13451 34656886 54856039 97180057 183705164 289109979 300238367 229107251 159320763
13444 159320763 119020940 99275481 90661378 85966923 79337072 70076473 60060467
13437 60060467 50804689 42897263 36549968 31581326 27515010 23688059 20198361 17366961
13429 17366961 15083465 13328990 11862559 10645343 9696374 8876532 8130214 7447732 6961954
13420 6961954 6486203 6075078 5622070 5209787 4804771 4378001 3988024 3637385 3329379
13411 3329379 3082865 2861216 2711744 2520213 2349884 2255002 2135277 2028676 1958351 1838407
13401 1838407 1716456 1602988 1456101 1380648 1313676 1305928 1303694 1227929 1170899 1103505 1041480
13390 1041480 949822 862642 865520 874372 848071 808821 776483 678002 590948 596680 634234 578969
13378 578969 515551 418604 438953 487523 487193 513257 472603 475214 468242 388075 349166 333733
13366 333733 367871 388812 378645 366130 331796 322821 323821 289249 264586 255208 268060 255213
13354 255213 269797 263046 231486 179559 130605 160669 191508 237918 220193 185554 156658 113563
13342 113563 162429 200728 194182 206070 196038 141259 91617 111445 150706 153405 163981 169153
13330 169153 193626 155200 93848 47396 43647 -4408 52410 76121 -42144 -130381 -134453 -77059
13318 -77059 11523 45748 3012 28009 -12776 -6510 -25707 -54265 -60395 -60193 -19606 25462
13306 25462 -975 -38362 -29396 -2618 -6916 -33907 -54011 -36013 -9 -22969 -51328 -40994
13294 -40994 -21618 -3023 -8057 -24289 -53269 -63519 732 85215 86738 89150 91971 80711
13282 80711 30284 17242 50717 43474 30707 94020 104310 71756 68662 105783 119087 32024
13270 32024 1182 6443 20530 -2371 11174 -23931 -89252 -77919 -56978 -21687 -8514 -40642
13258 -40642 -30469 -37495 56317 47819 1288 14428 87853 44372 -17979 -73757 -57859 -62503
13246 -62503 -11169 17835 11400 -10459 -1380 47078 75731 42179 20357 3398 -10343 9072
13234 9072 34023 30713 31423 45699 43812 29330 17117 -14583 -27984 3360 5519 -33651 -41119
13221 -41119 -69060 -96342 -99200 -23162 -11748 -8502 19071 25810 58403 10960 -61579 -23186
13209 -23186 -2323 5532 194 33001 21203 14024 2778 -40442 -21629 -4775 -5532 14037 -18465
13196 -18465 -15422 -12872 -13511 -41918 -64485 -39139 -29507 -39230 -43807 -17447 21643 15274 -9653
13183 -9653 37188 32419 13074 61895 79208 70136 32972 -11058 4544 -31881 -35002 -5929
13171 -5929 35604 37741 -39640 -37996 18496 59131 -29239 -68226 -45782 -4208 11330 43486
13159 43486 16973 14739 44290 30198 -22384 -30976 -8144 -50283 -30492 14908 38214 21005
13147 21005 2335 -19604 -6389 -57683 -35795 -18902 -13104 11048 2033 -14046 -28133 -25662
13135 -25662 -6762 13793 43073 67132 83822 81569 33912 -16095 -33624 -74420 -76751 -57977
13123 -57977 -42083 -21871 15938 46799 21270 -9282 -10855 25407 46014 799 -56794 -119260
13111 -119260 -119451 -68223 -59674 -27363 -12956 -64267 -109676 -77926 -58171 -23475 33468 22591
13099 22591 -11597 -77231 -115415 -107729 -81610 -65177 -37323 -11652 41477 29109 -25692 -6726
13087 -6726 75350 87387 34563 -9186 40386 44198 13679 -21849 7963 38390 23463 34999
13075 34999 56979 42680 32237 42466 90837 77430 60469 75721 63203 52247 57321 19445
13063 19445 -20565 -32356 -46821 -18524 17424 24058 55871 89996 71906 74559 79808 124510
13051 124510 129308 118356 67662 81114 123946 108442 -26013 -34797 61659 103713 88118 51953
13039 51953 62428 77034 71162 53918 94207 128604 70023 -6343 -17122 17311 15457 1898
13027 1898 45436 55546 14709 14559 7689 45484 13846 -37867 -41865 18777 65677 85330 71813
13014 71813 63799 50001 62305 11910 8510 5054 -44161 -45943 -58130 -53948 11182 48348 50609
13001 50609 19678 28544 63710 100470 83682 89377 23603 28851 37001 98647 146310 146487 175216
12988 175216 145943 130608 56393 24481 22187 28766 42968 73437 80749 64330 60657 23761
12976 23761 -19145 -47743 -101128 -96617 -17305 44386 64466 120119 173445 250372 295735 391662
12964 391662 700321 1223883 1587240 1451609 1085521 803053 642651 636537 629368 617094
12954 617094 525123 414643 404301 330515 246011 223462 206471 182254 160656 197841 211705
12943 211705 196429 157316 125452 93575 117545 117836 120868 142415 92838 43182 74663 65070
12931 65070 84717 72750 46719 53073 25546 42502 33109 6738 -8987 90129 123098 54981
12919 54981 47363 31790 1589 -677 19295 -2300 -38916 -44361 -7470 -45189 -85698 -56205
12907 -56205 -57126 -13220 38270 33694 -21614 -38184 -65743 -89690 -57288 -26661 -5669 -10456
12895 -10456 -45986 -43059 2042 56319 35567 15656 -8919 -16850 6677 41219 49235 5102
12883 5102 -50584 -71349 -72213 -53643 -38179 -14305 -20203 -46591 -7379 32922 56183 22596
12871 22596 -4243 -24599 -52927 -27019 -12534 -1097 8582 -3609 14193 8365 -18232 -20990
12859 -20990 -2169 24158 40509 26433 12224 -16552 -58877 -38694 -3583 -35280 -53396 -64569
12847 -64569 -40909 -53497 -20537 -2129 13954 9522 45091 68266 47844 17873 3902 -46641
12835 -46641 -69621 -48344 -16743 38927 -19935 -58757 -37217 -23339 -2657 19011 -32486 -37437
12823 -37437 -25564 60246 44591 -5229 -78266 -59309 -24319 -15250 -51184 -123571 -160571 -116582
12811 -116582 -68869 -27246 -19682 -50269 -21960 -35524 -31468 -5497 24152 38925 84273 68127
12799 68127 -1998 -46294 -43618 -36883 3333 65037 51782 37849 20581 3547 2942 35041
12787 35041 44093 52248 35774 47407 18273 7904 5447 -6845 -3331 12930 47259 9700
12775 9700 -47676 -64582 -40663 -7417 10326 -35876 -66606 -28666 17758 15583 -37407 -53778
12763 -53778 -21548 -16441 -14520 -70251 -63699 -34938 -52878 -32392 -24319 22682 64994 31936
12751 31936 -12184 2109 11021 -43780 -58935 -71213 -56720 -52956 -42051 -47250 -17766 6194
12739 6194 -19258 -28109 26565 9777 -59609 -86055 -55122 -20816 29933 2634 1033 -260
12727 -260 -21608 -7595 18432 28364 2697 -6518 -27312 -64228 -110387 -132458 -56174 -43580
12715 -43580 -75538 -105329 -64389 -18812 9401 -52106 -57423 -55118 16675 23694 14044 -19682
12703 -19682 -27195 -37605 -50083 -34727 32076 58663 62990 43464 55689 43617 6370 -15990
12691 -15990 -18389 -46896 -77002 -48863 -29013 9288 -23044 -1610 -45972 -60363 -35746 -40143
12679 -40143 -49341 -8717 31473 42060 16454 -47605 -76214 -90628 -123837 -95343 -47881 -41942
12667 -41942 12175 47109 74240 63415 62650 16979 -4865 -34082 -26211 262 -26220 -15289
12655 -15289 -22912 12406 695 22054 23066 41196 53894 59345 43280 62660 20419 17722
12643 17722 563 -9697 -53310 -100697 -60192 -86174 -119453 -102736 -63107 -8650 5954 -11413
12631 -11413 2050 -23888 -11117 33525 77400 94175 73509 43186 30557 74421 123859 131401
12619 131401 109506 69560 67425 81198 108963 37363 -11622 -8743 33167 70982 60647 48754
12607 48754 54435 93229 109779 106417 83949 50487 24859 18344 -9662 28727 -2395 -29826
12595 -29826 -34427 -8898 -4843 -14952 12051 34547 3354 -19863 -25578 -8767 40380 32743
12583 32743 -1587 29887 25826 17352 8726 -11536 13808 75428 84279 58341 20574 -35879
12571 -35879 -54537 -1987 68272 93428 124515 136100 166952 172572 150037 129634 139790 142795
12559 142795 71321 9794 1751 -10526 3687 47577 31820 15615 21107 24536 39852 23672
12547 23672 21763 6861 -7519 -6220 -11668 -22847 -43254 -24323 -29175 -22499 -88821 -42901 17684
12534 17684 40629 76387 62681 10366 -35608 -22046 6797 27429 13035 -17330 -57369 -41437
12522 -41437 -16415 -20770 -63518 -87047 -89016 -25790 12828 31592 33803 16518 -62976 -88427
12510 -88427 -78042 -16145 -34959 -10943 10527 -15914 -11655 -49968 -74371 -47631 -16409 -10589
12498 -10589 -843 1006 -24644 -81064 -68779 -54191 1262 6801 -41777 -26669 -45217 -60704
12486 -60704 -34652 -4388 -4012 -20709 33829 70308 58682 119429 73393 51468 -11294 -32786
12474 -32786 -45542 -47972 -30586 21977 30031 45587 21753 -29901 -1051 17287 27192 -20994
12462 -20994 5893 60013 50384 -2248 -14621 -10635 -43602 24640 86086 76340 3180 -44314
12450 -44314 -79443 -58365 -28845 -1382 15952 27556 -28621 -75768 -67923 -52984 19427 95416
12438 95416 122608 109311 71392 43638 -964 -19085 -57379 -56872 -47100 -91496 -94014 -56488
12426 -56488 -19274 19695 57257 60866 49137 65424 51629 12393 48349 61768 24775 50020
12414 50020 56870 -8373 -23691 12400 51164 18339 3563 3001 -21501 -39129 -49422 2257
12402 2257 31414 -10696 -60728 -65723 -7617 33966 21129 27810 30076 10691 -34767 -13824
12390 -13824 5522 9707 -5010 -40582 16025 39426 38719 100881 123179 97624 51136 47999
12378 47999 61890 66654 47015 19580 48699 34432 10710 50664 61000 7676 -1467 3930
12366 3930 14262 64623 38169 13916 21743 -24650 -44473 7396 28438 32207 9691 -17964
12354 -17964 -20842 -29768 -14925 8520 27782 81485 51755 39277 18001 33863 27934 53152
12342 53152 19639 41313 48743 1596 -21302 -26109 -65617 -66867 -50485 -43573 -34691 20651 47834
12329 47834 77468 84372 39732 -34833 -12452 35442 28852 41988 24328 -6759 -1459 27876
12317 27876 19895 7648 -23117 -19422 5056 8601 3570 14061 43243 28289 8860 46478
12305 46478 33347 12707 6505 -25949 -37471 -54070 -37304 -11108 150 -27351 -9880 9497
12293 9497 908 15609 41229 -357 -8545 80227 121019 82969 126249 96748 65831 100410
12281 100410 65027 8522 -20457 -7561 36219 29287 30487 44731 -5289 -18745 1975 -21422
12269 -21422 21270 15889 -24641 -7888 -11564 -50115 -40059 -41368 -16852 15014 4225 8335
12257 8335 17002 50500 46227 71517 70117 73556 10520 46551 77242 90423 118198 35225 -34736
12244 -34736 -49622 29413 40133 55074 80317 42693 7377 53203 79821 47139 -31172 -66216
12232 -66216 -45485 -4323 -9110 -36071 -23678 -15719 -50298 -30307 23170 41396 44772 48887
12220 48887 81930 109796 93231 20420 -54389 -83675 -66754 -20717 -42551 -17614 -62938 -84837
12208 -84837 -36660 947 8250 -28220 -54391 -6920 20153 12011 -22230 -52219 -16951 -4761
12196 -4761 32357 49654 68103 22681 -20633 -34087 -58781 -48091 -76613 -40684 10842 1272
12184 1272 -13742 -50079 -66617 -65255 -64005 -81372 -46743 -4392 46575 68475 86913 58179
12172 58179 27407 20385 -1553 95767 100716 34982 59184 15537 -18921 8848 1236 11179
12160 11179 9756 53235 61367 46625 88834 64478 15882 27362 11725 -12689 -24160 10485
12148 10485 33275 42478 29998 4608 -13959 -77068 -99326 -83002 -13469 4310 4227 -8478
12136 -8478 -26764 -20763 -34265 -10807 39613 4697 -32633 -5771 43364 56479 77050 64866
12124 64866 44482 13520 -49381 -78484 -56986 -56366 -4801 -17866 -85267 -107202 -40833 -11735
12112 -11735 -3614 -29334 -18126 -21736 -31711 -30618 9345 44646 32306 1235 -36614 -42649 -49761
12099 -49761 -72563 -47852 -47414 -996 -5635 -50454 -40173 3102 48130 46016 -18753 -34539
12087 -34539 -15695 -22956 -35189 -47218 -22249 -29805 -26010 25993 40495 -3602 -40981 -7742
12075 -7742 20550 -20417 -29763 52720 78278 61222 47838 72991 98852 86203 14406 -51760
12063 -51760 -68027 -78126 -105128 -49303 -3161 -25891 -51700 25118 49413 69012 93737 59151
12051 59151 27507 7740 -40283 -59566 -53960 -75172 -22384 -5595 -43733 -42697 -15911 -3051
12039 -3051 35092 47487 92475 75516 27152 8083 8794 -541 70575 81234 39009 11209
12027 11209 28105 4656 40661 66728 74184 64530 20914 2980 -2582 -8059 -4478 46273 58951
12014 58951 60837 46219 11328 -53184 -65035 -58225 -52186 -11740 4383 -20476 15801 62917
12002 62917 69340 43218 39670 53263 28675 24777 -14618 -27254 -63384 -57666 -23629 -24687 -190
11989 -190 7024 -4004 12715 22070 7835 -3045 3979 -3377 -27357 38390 47143 36378 20694
11976 20694 6090 -14772 -33854 -19602 10209 33943 40635 64508 85709 110021 117816 93484
11964 93484 79790 67950 49015 -16910 -37604 4584 10626 -36239 -38020 -55768 -33903 -5889
11952 -5889 6024 38354 58163 81945 121645 95743 53983 31277 -23733 -32268 14223 18386
11940 18386 49587 54849 -10597 -32416 -40401 -57770 -60432 -8391 -3544 -11557 11578 28137 65251
11927 65251 40883 5280 2861 1211 -43413 -39787 14866 50392 19134 -3146 16623 26729
11915 26729 16862 -471 -8679 -9659 -22819 -25514 -3572 -28096 -68534 -4282 47770 30812 19384
11902 19384 51438 68936 76586 90115 7803 -33939 -12818 -19645 6546 50403 24537 13090
11890 13090 29289 47853 33665 102147 113246 66830 9955 -355 -10988 -44966 -9140 66729
11878 66729 88938 76824 25074 22546 38607 6603 -41690 -19999 -16422 -44556 2262 47822
11866 47822 24961 -6271 -50638 -41831 -39395 -35041 -13689 46391 62874 13163 -50590 -52133
11854 -52133 -42732 -47938 -32625 18211 46251 16359 -11800 -50454 -59276 -53692 -68664 -44184
11842 -44184 -5627 -13487 -19713 -63875 -40760 -14156 -18766 -21162 6934 22519 -21403 -52259
11830 -52259 -42910 -358 -8527 41518 53436 15879 -37920 -33783 1668 65526 63098 35361
11818 35361 36359 47254 84558 82816 57829 -12617 -3248 65295 69252 91632 106890 77545 69370
11805 69370 67381 43045 34031 9050 -3358 -12586 -62485 -60058 -16516 -21693 -48136 -82097 -97082
11792 -97082 -66566 -17804 -17302 -14524 -5589 14337 45354 62166 41160 21637 -42745 -38428 -34830
11779 -34830 -30492 -2016 14117 -22577 -54492 -87700 -94841 -55958 -47951 -27979 -13398 -24269
11767 -24269 -53419 -3644 23902 45438 18887 -26610 -5748 16266 10856 -8102 -46989 -54587
11755 -54587 -28909 -40979 -64426 -37944 -43796 -44307 -33676 -20202 -42790 -87990 -89538 -89828 -64235
11742 -64235 -87073 -74809 -6380 -27773 -47513 -45817 -22731 -26060 11434 67644 80499 83495
11730 83495 85539 57721 36890 902 -56235 -91899 -90693 -63103 -68393 -16596 12217 15595
11718 15595 7655 17272 24588 16351 34009 34848 61755 37754 11350 -2643 -41061 13586 23965
11705 23965 -22622 -44630 -79316 -88964 -62005 -18382 -36273 -25289 -18858 -29693 -41729 5348
11693 5348 -6878 -33724 19474 -6273 -59397 -43548 -6331 -1871 21807 12619 -35392 -84036
11681 -84036 -71916 -48705 -69098 -79176 -69540 -68853 -58083 -17960 9127 -23865 -23954 -59139 -82201
11668 -82201 -83144 -71734 -69649 -18430 -30313 -51662 -10358 -8847 -24991 -49925 -87902 -102441
11656 -102441 -73296 4157 4430 -44088 -25046 -18726 10216 21154 15479 14582 22699 43424 66277
11643 66277 61717 84220 84840 60076 41308 40965 5934 -5533 -10483 -25488 18072 50943 56988
11630 56988 28801 1226 3634 15693 22871 2663 -42579 -27148 20460 -29368 -80131 -85316
11618 -85316 -75606 -14169 24011 75204 38301 -8235 2857 -7332 -27388 -25491 -12637 60117
11606 60117 41622 45003 55219 76193 81237 46548 12954 37983 66368 85436 113420 57101
11594 57101 -4524 -3279 -24769 37813 86574 46640 6398 -24649 -58907 -35899 12625 9773
11582 9773 66862 91343 31826 -12001 -53768 -38760 -27305 -59979 -79255 -91947 -118332 -96685
11570 -96685 -86123 -81962 -74502 -90791 -44232 -15899 5461 13989 -430 -48600 -66319 -102156
11558 -102156 -106322 -85742 -40208 18034 97424 49652 19114 7687 15371 53572 65189 63261
11546 63261 -1290 -35852 -41929 -38191 -36450 -40249 -24441 -10991 8653 11719 -32198 -90990 -36045
11533 -36045 39128 29736 40031 50995 63708 53670 -3589 -7378 -32365 -38376 -17111 27046
11521 27046 23325 31806 75844 61027 19261 10961 3696 -7490 -27800 33922 64944 35293
11509 35293 48520 58189 63981 29831 -26811 -57622 -109251 -87542 -14665 19064 -8114 -6768
11497 -6768 7973 29007 -2498 -29034 -9341 35329 53652 22695 83956 121833 85289 31399
11485 31399 52175 42804 81336 120022 44368 17982 -14196 -34885 5062 49985 31437 6343
11473 6343 19570 -46568 -82602 -42975 -34961 40742 77651 1006 -36312 -53515 -62086 19420
11461 19420 156182 180130 91962 -11178 -78302 -93156 -85997 -130840 -109286 -47098 645
11450 645 970 -29510 -30453 -41679 -19238 13250 22325 -18885 -55011 4631 13235 -29752 26874
11437 26874 24130 47239 65539 48399 43314 46230 3864 -26038 -37657 -19484 19873 16099
11425 16099 -18386 -69954 -85592 -39310 -17462 1490 32145 50109 59677 88096 29921 41318
11413 41318 74506 67115 21561 66120 89955 84239 85294 99731 73775 52780 65607 68755
11401 68755 15078 -8669 -268 56153 82079 46330 29787 62609 135692 149663 109085 106260
11389 106260 80528 54107 27624 53201 43782 30173 6868 -12401 -32136 1422 51018 33153
11377 33153 46307 43230 36910 67076 74149 85223 113160 66236 -10531 -20509 37835 46379 36655
11364 36655 36435 85449 55942 4718 4146 -41583 -23793 -27235 -17647 -11686 -40334 -42380 -6179
11351 -6179 48050 54488 24417 29047 62385 79071 49977 71383 14758 -17965 -27312 -28971 13967
11338 13967 -15629 -21887 -7708 -44814 -38370 19948 20575 -21535 -56300 8 10519 14631 68723
11325 68723 125996 152832 150176 120648 102153 59072 63996 40620 71769 85717 76431 55111
11313 55111 58485 81860 136457 92905 5189 -19077 -19873 19878 47241 54449 46772 34344 80667
11300 80667 124273 59950 44267 38478 41122 85445 119417 106811 97706 126657 129717 174663
11288 174663 144560 97612 47402 -6726 -53835 -25227 5747 11880 52227 69015 94406 108588
11276 108588 128951 124414 165930 151463 88884 61897 68426 62932 97230 135719 204794 221619
11264 221619 215549 200315 172340 139581 115065 149915 201556 166626 157918 151786 135834 148938
11252 148938 139370 149945 137550 124708 137040 115860 100584 92885 78368 95172 81784 92703
11240 92703 43502 61980 122134 85280 41004 78905 115064 163589 164117 122909 119663 94088
11228 94088 121966 136358 160148 170880 156991 189677 200349 178975 161444 150804 170777 183864
11216 183864 214103 263985 273220 229602 232521 186494 210918 239489 266032 269266 266642 302338
11204 302338 335688 362228 365603 351749 346948 300502 261715 264520 285154 328202 299140 261377
11192 261377 275150 314449 366996 410500 450622 457708 461604 500650 499059 558891 565425 584681
11180 584681 611241 636559 639967 658090 656362 741365 852955 881886 846731 921334 1001405 1031963
11168 1031963 1062874 1117028 1180927 1229746 1358086 1481573 1624873 1775937 1820442 1935598
11158 1935598 2069499 2234767 2468367 2779210 3066299 3341327 3657819 4092651 4558083
11149 4558083 5063412 5629757 6349987 7204399 8167795 9235438 10413384 11731851 13098074
11140 13098074 14517783 15763359 16747000 17381392 17560645 17366505 16853457 16123714 15309784
11131 15309784 14409330 13526789 12652525 11755024 10926278 10194077 9507783 8862998 8224559
11122 8224559 7586064 7040368 6533775 6076809 5673319 5387767 5063465 4773880 4516508
11113 4516508 4331476 4125102 3921453 3820172 3748927 3617614 3572212 3561691 3571588 3629761
11103 3629761 3711664 3773311 3794141 3873814 4018325 4178286 4366812 4517992 4748000 5020111
11093 5020111 5298806 5519340 5685990 5875563 6090166 6228764 6326357 6439328 6524554 6582488
11083 6582488 6589716 6540281 6416860 6258177 6074105 5886808 5623338 5269742 4976954 4693046
11073 4693046 4404461 4160485 3939929 3686323 3407187 3090878 2834110 2668372 2484207
11064 2484207 2282592 2117689 2023928 1941705 1784715 1640750 1519850 1386214 1255631 1167228
11054 1167228 1115049 1102054 1043573 964367 874794 886969 898408 793885 721104 675287 659921
11043 659921 637419 597727 571195 541835 487345 428735 383713 405526 411202 388081 357731 332322
11031 332322 353897 324437 352635 376270 351180 300760 285388 290545 255522 205172 237299 277886
11019 277886 223206 223203 218654 188694 195404 181719 158761 138960 129352 145854 200068 195059 180505
11006 180505 147009 167821 186907 132850 108766 102354 47071 42824 87211 108545 122512 77671
10994 77671 23505 18570 67468 65884 79450 80486 139185 175147 155637 118184 44537 27563
10982 27563 18270 35015 53069 97803 81139 42963 34574 10623 65632 164611 194454 199255
10970 199255 133706 89224 142376 155347 111301 127550 114872 30018 -4186 17238 24351 26505
10958 26505 18475 50737 60730 28373 -27 1979 25779 36425 41127 43785 45752 26135 -13211
10945 -13211 -11064 19436 43545 53898 72298 12219 22160 44786 51027 71336 81926 131220
10933 131220 84263 -27230 -30563 44504 67801 48801 50442 18833 42338 54251 37781 17917
10921 17917 4625 55531 64353 31132 36682 27175 34327 29390 27285 62384 48907 -13544 -46452
10908 -46452 -18522 -3253 23242 35832 25324 23039 36553 45351 10073 -12706 -26378 -37009
10896 -37009 -38307 -11401 -2607 17317 18466 -15538 -42123 -38475 19773 48910 17499 680
10884 680 2012 22979 29385 29736 17371 2704 -1771 -4958 -49283 -75877 -67660 -57981 -49862 -36777
10870 -36777 -53860 -35291 -43302 -89171 -61654 -12425 21880 55022 7932 -31787 -21218 -41855
10858 -41855 -56500 1697 12394 -31850 -30286 1828 48281 18206 -2828 14472 65211 52749
10846 52749 17284 26737 79524 108412 98150 88225 136225 118591 67017 49960 48689 70635
10834 70635 -5844 -12911 -13411 23084 67309 85093 33318 49698 93667 -28194 -84005 -48416
10822 -48416 -16731 -3072 -16427 -51108 -38071 -39861 4654 131 31439 43320 19184 4746
10810 4746 -47404 -95912 -40219 1102 14372 57382 89868 141735 92519 41065 -9392 -43701
10798 -43701 -76318 -48532 -23301 -37320 -26160 -23831 -62327 -59884 -20820 25796 37855 38643
10786 38643 47584 44212 -992 -64593 -81713 -68384 -59770 -48900 -26250 11153 -5563 -15289
10774 -15289 -36300 -42321 -13904 -7122 -34495 -48054 1214 -13494 -26239 -71872 -52758 19282
10762 19282 -22631 -25490 3903 9470 52941 65182 79296 23684 -10578 -41002 -73287 -90396
10750 -90396 -24969 16411 48984 40370 9453 10690 46677 53464 -1095 -20495 -40264 -11308
10738 -11308 14627 39581 17240 33444 58700 88259 61590 26617 -2498 14694 10598 11079
10726 11079 -2158 17906 -4778 16706 45672 32494 42280 -23729 -23574 -14378 -9087 -49175 -58683
10713 -58683 -56635 -83521 -89384 -58770 -9947 22232 42595 22696 27279 44681 35802 32970 -7222
10700 -7222 -26616 2258 15097 -35107 -24335 32862 73843 88450 68972 55015 53372 -26067
10688 -26067 -14184 54770 78759 53449 -6624 -67566 -35548 50062 55730 17316 4061 -20379
10676 -20379 -28267 20909 49177 73925 15285 22276 9111 3717 26766 61408 29590 -19524
10664 -19524 -24582 14222 51275 14602 11353 10225 24520 22079 10327 11557 5298 -25642 -10281
10651 -10281 40083 34794 25137 56504 22030 2551 35927 32096 -6222 -32530 327 47562
10639 47562 82672 58286 20548 6806 -34585 -76460 -40666 25949 22446 6417 51388 20038
10627 20038 26812 -34449 -105568 -59567 23657 35165 2910 -34249 -43209 -36211 -4778 11604
10615 11604 38817 38441 57073 56158 56800 45319 438 -24171 -17157 -56815 -36158 -5286 29005
10602 29005 7042 -899 -23099 48122 48017 55335 66186 38789 6587 -24932 -44396 -15016
10590 -15016 -17731 10831 25941 22335 43650 35286 13246 22744 8903 -16375 -27027 -21396 -48205
10577 -48205 -45084 34722 46836 24682 -5047 4116 -44760 -98635 -117890 -64367 -9719 -23025
10565 -23025 -30120 -20747 8770 28925 13575 54271 61025 52162 42610 46749 4218 -8959 35137
10552 35137 64928 38353 17977 -4408 -26272 -52587 -74693 -40714 -3 29593 55977 40414
10540 40414 52018 56733 72865 82428 97362 74466 42256 48461 66485 26328 24807 -32937
10528 -32937 -79485 -73991 -48339 -5424 63123 77082 68861 40375 -4054 65979 82015 46386
10516 46386 -24106 -20076 -13381 24841 -3169 -16827 -16982 -26496 21525 62210 -2145 -13682 38463
10503 38463 47924 41752 622 -41004 -52683 -71088 -62654 -53757 -45082 -18159 -43628 -34191 -39352
10490 -39352 -28360 -12168 -34593 -23070 -27481 -35224 -21998 -26999 -76303 -64819 -19174 17751
10478 17751 44777 56798 -6993 -47632 -68640 -106290 -111563 -73896 -7361 -125 12930 -115
10466 -115 9223 9158 14907 -10009 -11882 -16890 -10070 6769 -7820 -17118 -36143 -33557 32530 63576
10452 63576 32793 -14575 15386 77067 75658 40733 -16018 -4628 24890 43322 3000 8786
10440 8786 -3665 -23533 -1244 -32394 -7448 6305 50835 31506 -68 -38779 -20612 25023
10428 25023 48102 -3015 -6702 12437 23938 19543 22043 33481 -8091 -25427 -36887 -45671
10416 -45671 -36661 -16956 -10059 13370 -3221 61579 112868 105091 75152 66398 24227 18012 57680
10403 57680 70427 116036 76778 60005 4939 7665 -3480 -47763 986 1552 -11405 -60609
10391 -60609 -75861 -43983 -4279 5387 57764 44970 7136 -15753 -28324 -10565 -6449 3610
10379 3610 347 -19369 -12729 -15938 -13391 -17158 -12069 -6403 -26848 -15280 9390 29842 50646
10366 50646 30793 17286 -2899 -21488 -46902 -62362 -37458 -59596 -64971 -22765 1908 10182
10354 10182 -10872 -78210 -127002 -77136 -30930 5837 55417 98751 90734 13438 -20705 21076
10342 21076 54443 40222 16953 3078 10635 36444 36422 17427 2228 -9151 23842 66624
10330 66624 57256 23423 18377 6931 14151 52215 46786 48883 48532 40164 20118 11331 -42934
10317 -42934 -24835 28849 13940 50892 105772 115359 19298 -27643 -8343 31728 96497 105940
10305 105940 77244 20250 -8794 5245 45539 83968 92247 107843 160896 139220 84517 55507
10293 55507 25424 37467 34526 -17151 3415 12348 16625 2613 -31205 -23437 55348 112656
10281 112656 119451 94383 57620 48597 44490 74071 113682 144961 216944 265610 272931 255641
10269 255641 234556 195921 152227 170480 136090 134347 149968 132900 127611 172247 283172 392589
10257 392589 498316 487982 430056 360186 285615 256393 137913 71195 74444 124378 184482
10246 184482 259997 342318 493143 587115 520616 434651 305582 268935 239613 241055 199297
10235 199297 215749 188419 125502 106453 161150 254461 328810 290558 220584 174059 120382
10224 120382 171094 183042 180594 199804 141198 141111 144598 139369 197143 243648 200257 133782 64853
10211 64853 37960 67775 64096 60217 81657 72404 57946 55031 64095 39576 35076 82318 74951
10198 74951 116962 85989 99277 131392 102725 36783 -13545 -16690 -14754 4255 39254 64452
10186 64452 50606 41765 17158 43478 48607 28980 38730 5855 12132 34401 -10535 -49564
10174 -49564 -19884 -21533 -39150 -55015 -43279 1288 26423 56802 53355 113214 117483 67834
10162 67834 41670 45692 99984 102646 71531 72857 76081 53229 55790 46984 26224 5560 39799
10149 39799 71507 72629 54079 -6201 -17765 -3873 15888 60276 93152 107595 98548 122181
10137 122181 94986 119978 116498 91420 43388 -28858 -10425 38138 46089 13000 -49612 -14648
10125 -14648 21290 -32306 -46095 25705 70584 55400 28194 27697 45634 88815 65236 80292
10113 80292 128660 138128 170228 214734 172210 184777 141177 117237 67546 61741 81116 77401
10101 77401 53231 22007 -12701 -31674 -30156 6585 -18877 -37808 -11564 34948 6638 -342
10089 -342 58859 71248 63764 59000 45756 60419 64762 78051 66435 76133 100575 48814 5467
10076 5467 39676 55195 57641 69764 26589 21860 43689 83798 113557 72312 46375 33139
10064 33139 33463 34918 7107 11241 11249 -23196 -27365 -397 35881 45933 33568 18987 20923 -29742
10050 -29742 -7223 31840 39447 7982 22110 92585 134568 197900 201863 156300 136511 90927
10038 90927 109961 88086 64691 78770 63402 71561 37554 43912 58419 39994 -22771 -25614
10026 -25614 25202 37897 29708 60375 98107 165671 140630 110727 91242 122174 119683 112684
10014 112684 134380 214377 312381 422135 569472 589588 517118 391714 275015 222224 230194
10003 230194 232673 310607 313043 184378 141879 117408 91257 95506 118442 153876 158284 175802
9991 175802 213866 201751 200764 176074 192188 181809 167221 126816 102885 97655 176167 198734
9979 198734 220301 213809 217714 233245 251648 271163 234866 234768 263861 247058 234869 229378 190905
9966 190905 206010 189374 162213 163761 195438 223111 226452 257844 307019 271341 237093 240802
9954 240802 222318 214179 212336 237714 263888 294563 324029 342281 308213 233431 183513 179109
9942 179109 165027 147683 242885 302982 324641 351751 321683 261479 263802 301399 294101 339381
9930 339381 303294 268642 325000 318115 317325 319378 310123 282692 363974 418216 411992 330866 303554
9917 303554 372540 465450 475150 465641 501525 457570 462224 548262 691522 912957 1143102 1493415
9905 1493415 1955588 2493348 2931266 3167356 3516894 4075196 4269737 3876325 3353635 3086529
9895 3086529 3043328 3155285 3436840 3983746 4656225 5082724 5607144 6353428 6681014 6191003
9885 6191003 5503104 5063615 5041466 5423919 6342201 7814758 10044414 13971105 20773817
9876 20773817 29673690 35648449 34545478 28725389 22847666 19047217 17288693 16848965
9868 16848965 17099254 17975828 19720025 23029410 29770553 42497856 59642757 69877969
9860 69877969 65106412 52064098 40497748 33592110 30308167 29214025 29036558 29255687
9852 29255687 30620201 34533936 43763803 61959669 85810425 98399070 89117875 69362675
9844 69362675 53075406 43720740 39198772 37005133 35456119 33975137 33155677 34268404
9836 34268404 39102682 50061568 64855176 71720031 64013557 49894498 38551378 31982740
9828 31982740 28618844 26777634 25291340 23786715 22631504 22495665 24317980 29208726
9820 29208726 35844865 38418975 33957914 26653656 20815693 17317520 15388029 14126021
9812 14126021 12964443 11596621 10203093 8966119 7904672 6932678 6058393 5340268 4761453
9803 4761453 4281295 3863159 3571111 3235467 2956435 2626387 2414493 2302757 2122861 1990093
9793 1990093 1899242 1796980 1648954 1511900 1465882 1379567 1244437 1103691 1011602 980365
9783 980365 896314 867029 839230 762238 692169 715478 753998 714194 662591 598651 580275 568819
9771 568819 597522 607293 567009 544542 529655 539272 504457 489948 403053 309881 296374 283246
9759 283246 298205 269985 274026 278867 216319 212871 201100 177424 187338 186060 203951 191090 173450
9746 173450 218350 197234 181500 177453 199240 204911 145303 103538 81365 51396 33240 38857
9734 38857 12281 8976 21495 36047 64080 122215 198029 167266 103515 48137 27849 53334
9722 53334 12554 -21931 -37278 25865 77657 55101 46346 49361 65277 136534 189797 275842
9710 275842 468039 584062 513763 369677 357239 442737 569948 617275 446006 309580
9700 309580 282522 258389 268022 292921 230995 155775 143210 120595 91902 87505 58485 42369
9688 42369 65280 87910 138081 133186 125418 112906 105625 5630 -50521 -75433 -106230 -56610
9676 -56610 -31938 -38860 -89624 -76692 -69895 -62271 -42596 -31786 -2891 3124 -52871 -137360 -138879
9663 -138879 -128578 -95056 -81720 -61385 -29500 6179 3156 38462 -15146 8241 81227 72116
9651 72116 3265 -17715 -26004 141 33596 3180 40576 54654 29080 53588 55026 15077
9639 15077 -66010 -12924 33135 97882 155121 108042 113001 131913 75530 16357 -18331 -34572
9627 -34572 11307 35819 49731 45401 19807 22161 17894 37414 102853 151899 105286 89846
9615 89846 84694 78124 -15305 10064 51993 49571 51341 43491 74303 160226 208595 252349 312393
9602 312393 282742 175026 91477 60560 84473 131581 110850 76575 43891 93817 135999
9591 135999 116676 85682 59355 24187 27204 -58464 -104849 -19907 34643 6112 13501 23886
9579 23886 46892 112544 124782 97804 119648 108314 73578 -20214 -27844 -78213 -129656 -119802
9567 -119802 -81840 -71418 -49348 -53971 -19930 3756 44129 33905 27181 -6506 -40221 -31023
9555 -31023 -74351 -85288 -43102 -8371 17852 -33818 -36621 28928 -5831 20604 46823 19742
9543 19742 -2243 -5618 -7070 -2589 30246 32892 21254 14757 -6782 -30369 14386 56514 78208
9530 78208 86045 46531 -19375 -111217 -87826 -41672 -57808 -55771 2014 43098 49149 64252
9518 64252 20614 22316 9090 25811 21076 -1386 37909 65984 79303 52981 4548 -14651
9506 -14651 13409 1146 8288 17694 11972 41172 41530 25939 -12508 30834 21003 -16044 -33340
9493 -33340 -3700 -12323 -42876 -1656 44071 46423 24950 1348 -44489 -47996 -17084 19773
9481 19773 -8326 -35387 -764 32849 53862 77666 151009 168617 191127 208178 190842 179426
9469 179426 131667 135480 178620 165230 115779 92267 114092 160716 279808 390143 424001
9458 424001 382723 317865 222778 186648 193587 189745 207270 196349 209607 294586 361841 448179
9446 448179 550723 553213 440562 310275 220411 226380 229191 192194 232593 242192 219968 238678
9434 238678 240813 340646 395469 356745 326733 293339 245139 211774 199322 193638 154223 139817
9422 139817 115387 89688 95894 219039 299340 280771 215534 167100 109624 151221 103622 39367
9410 39367 25165 99065 130250 98905 51941 77671 94908 52001 -11131 -77185 -99044 -64017
9398 -64017 -1322 14890 -32464 -39859 -2739 1459 29694 40621 22459 12242 42399 55280
9386 55280 53659 89779 56889 2415 -27291 -27787 -65732 -88411 -40540 -5621 17029 20161 27131
9373 27131 15606 31267 54673 82180 91259 85396 63465 57793 81908 69574 4826 -2913 3801
9360 3801 -9621 -83497 -87144 -67370 -91171 -78600 -54740 -12852 16128 22169 -35919 -110388
9348 -110388 -80313 2298 -7435 -5415 13494 86433 82923 89481 135419 56709 2198 -9429
9336 -9429 -1221 17380 -13951 -54022 -25637 5727 -1620 -45692 -16810 29963 113251 114694 31178
9323 31178 9426 19282 39481 37671 -37524 -26237 11322 -19754 -25763 -20401 -59257 -83833 -67333
9310 -67333 -72661 -28392 -23899 -39846 -14208 -21646 -52101 -15835 2446 12044 -24020 -53539 -43369
9297 -43369 -61893 -22829 -26133 -21194 -18932 -89535 -76667 -99407 -92258 -75850 -37909 -6056 4060
9284 4060 38332 67599 20360 -22999 -35701 -60918 -60861 -29385 24954 7513 3557 40032 54457
9271 54457 34161 -51005 -75450 -35261 -39853 -37846 -20896 35547 28451 13657 2289 -35979
9259 -35979 -48565 -40006 -2571 24760 21382 46365 -13970 -17917 -10341 11836 7879 20276 68094
9246 68094 76837 20287 14768 56893 59109 48912 1581 -6847 -2972 9094 77469 96047 3488
9233 3488 -59155 -42622 46612 54873 16515 -20700 -30083 -29377 -19573 -2333 4105 -9358 -10630
9220 -10630 26540 38452 63112 62148 67684 14161 29205 60260 34003 -3949 -18462 -49396
9208 -49396 -4934 9172 -70730 -39613 3151 5969 51372 43535 19930 -3631 13858 46061
9196 46061 60049 46190 70772 66957 55500 18669 17208 42639 48564 104728 98750 112542 50771
9183 50771 -2689 26598 35545 36326 34172 21371 -4109 -66467 -47242 -36461 7756 37911 47947
9170 47947 52605 25490 -7358 -35990 -66232 -6252 19143 8360 27097 11893 35996 55046
9158 55046 11957 66561 105125 102465 67851 36960 13031 9347 -11853 -41868 -2436 11101
9146 11101 -25811 -66805 -88197 -98926 -56349 -64257 -32519 -25916 -37872 -46260 -64088 -123839
9134 -123839 -105307 -19317 -10422 -3924 35074 31590 -8841 -622 -8849 27780 46233 76694 74718
9121 74718 38455 3659 -55449 -48902 -56238 -49913 -22511 8261 48729 62558 47494 15478
9109 15478 -7631 -45555 -7922 -32118 -59593 7467 45915 76202 87689 78236 81026 81351 -4574
9096 -4574 1985 -25437 -61963 -5147 3544 18983 3260 -52434 -20122 19746 56438 60087 35599
9083 35599 1885 -47161 -51313 -42690 -29127 -20576 -77306 -86596 -79145 -31093 19466 -1436 20623
9070 20623 25228 -16658 14999 201 -4548 38125 82115 53 653 34018 41230 11309 944
9057 944 1234 -2946 -11053 -38060 -4534 41997 -40602 -89318 -91523 -93526 -107624 -83386 -58345
9044 -58345 -60051 -89577 -92669 -44501 -20398 -29127 -17685 -27620 -38765 -15917 39811 113092 102113
9031 102113 78114 109544 81350 78211 70648 41708 -16717 -25974 -42665 -17104 -34468 -68628
9019 -68628 -24131 2225 15572 14605 47272 62422 12192 -71128 -53344 -34658 -43385 -15574
9007 -15574 23025 60710 98610 87803 -1699 -52252 -85369 -120761 -36029 33662 50095 22995
8995 22995 865 54511 8177 16097 55168 73817 77498 63481 68653 24421 -55135 -114766
8983 -114766 -92308 -73842 -72493 -63059 -31499 -36769 -39609 9258 20318 -24029 -23441 -58025 -62210
8970 -62210 -84540 -93402 -28667 27861 4534 56065 88220 67079 7205 -23388 -36151 -45783
8958 -45783 -61653 -90639 -64966 -55326 -32419 -38381 -49351 -41668 -46021 -74180 -54295 -32420 -21703
8945 -21703 -43161 7301 25238 49062 6559 -76758 -105200 -57042 -11013 12929 74828 107096
8933 107096 114014 43142 -12369 -58310 -67965 -63052 -60841 -58786 -52551 -56647 -28126 -14968 14565
8920 14565 27173 28759 53611 20822 -5107 -16010 -46840 -72730 -93293 -123268 -118600 -53028
8908 -53028 -71694 -53158 -2808 51090 48242 47334 52136 52560 31792 2277 -10411 -26397 -42849
8895 -42849 -42254 -55941 -72867 -41367 -18936 -33543 -35002 -57064 -37750 -25083 -47338 -47075 -83667
8882 -83667 -94243 -49993 -17596 -20024 -12112 -6330 -16964 -11184 1091 -257 -22176 -74151 -47628
8869 -47628 -44052 -70946 -42281 -31645 -7350 -52113 -15210 32017 12505 -29762 -57968 -44277
8857 -44277 -43661 -65659 -100773 -80540 -99014 -75213 -47174 -33812 -49173 -87059 -81828 -30475
8845 -30475 13238 31125 37458 42916 34455 43666 33193 46310 78870 37341 16045 5370 6490
8832 6490 42046 9845 -25559 -57414 -26769 -16480 -13288 -10350 -25770 -59527 -55149 3912 25678
8819 25678 -39859 -78456 -45726 -9602 36336 59263 32402 -3195 -30168 -82957 -114346 -55859
8807 -55859 -776 -19159 6594 -21811 -40093 -1709 -14144 -41020 -20732 28851 53549 48660
8795 48660 5994 22540 73133 97634 129792 120591 87991 41731 33210 23738 61456 43983
8783 43983 48323 65229 18743 19452 -2173 49478 47509 21959 -25377 -38256 19690 42027 38067
8770 38067 27113 -7817 -58825 -125698 -100816 -51430 -25063 36733 22996 6956 -19919 -40989
8758 -40989 -98694 -107105 -33607 -27334 -54135 -22122 -20850 14969 49904 29708 -27901 -40671
8746 -40671 -23972 -2558 24827 28570 39577 70538 52413 95201 109119 53890 13499 6643
8734 6643 31698 56525 43018 16093 26447 5726 11443 8799 27861 26745 10178 -2292 20307
8721 20307 28079 31306 78528 108763 100491 83328 44285 21285 51506 97573 112436 63106
8709 63106 23270 20750 28694 58406 31249 -6125 -12526 8167 -44124 -34996 -61230 -74662 -33074
8696 -33074 -14174 -17755 12587 -8408 -23394 -31286 -4502 9558 -39734 -32415 -15134 27462
8684 27462 29410 19895 41206 47395 25802 10444 15855 24007 24092 -10508 -9153 1935 20491 45410
8670 45410 22117 19305 13612 28162 20993 -16535 -16035 -29055 -91581 -77445 -20957 10738 -3279
8657 -3279 -58432 -55159 4391 33583 57428 58947 49182 45718 30836 9666 37600 -9747 13242
8644 13242 -17110 -19727 -21056 26849 33053 17433 16625 46774 87985 102984 57262 44358 26199
8631 26199 25063 25534 51447 62914 104937 111874 89742 91079 56054 30099 15865 -12199 6399
8618 6399 16398 7602 14200 -19311 -30173 -43949 -20499 3155 69875 118343 106212 92265 79571
8605 79571 58296 14942 62778 51553 18154 -24903 -32264 -18637 24623 72344 55406 43621
8593 43621 28386 14763 -3873 47368 69709 68459 24503 14681 -23902 -32186 -8283 17527
8581 17527 -29921 -36772 30019 38294 52170 84984 119035 97216 6215 2462 9100 -5130 5801
8568 5801 -2118 -13962 -25697 -27215 -49707 -52754 -55849 -52903 -45668 -49843 -10022 46986 31586
8555 31586 -16137 37061 56971 49034 21032 12562 3572 66650 66113 71134 89607 88130 107305
8542 107305 117292 64780 59769 72378 134703 171689 145128 102596 63784 20549 91651 120673
8530 120673 98440 152123 159044 146509 80066 16042 -11549 21734 5914 12951 30726 15358
8518 15358 -11922 -23973 -69560 -99450 -110388 -67845 -28141 -6913 -38245 -56130 -29606 -37041
8506 -37041 14402 65694 27273 7624 54286 95859 58054 43242 51629 47864 84317 132734
8494 132734 169631 243311 275765 238295 163887 142556 176823 140335 129915 132629 120128 115892
8482 115892 122807 82214 37606 3390 35156 84777 49635 16404 -2770 -44597 -52749 8459
8470 8459 40905 11170 56627 39090 7420 54475 96610 89296 66888 50315 15877 -29712
8458 -29712 -29363 -41721 -35593 -46453 -29422 6931 40010 27646 22883 54074 138492 192812 154421
8445 154421 108602 56012 42685 60307 101323 99097 73311 32722 33799 22298 15977 6722
8433 6722 74421 88980 68844 13903 42636 82471 92608 59203 14977 -2029 19767 -31486
8421 -31486 -36672 -27989 -3432 14526 71555 45594 19477 25978 38324 4436 63473 90770
8409 90770 77907 54719 14852 28480 100686 89897 29242 38176 13475 14908 1703 -18271
8397 -18271 -48256 -37117 13707 27277 -7846 11604 5628 -49839 -65230 -22163 -32590 -90474
8385 -90474 -68326 -40925 -28738 9182 7631 36371 64348 42728 50642 66001 77793 64747
8373 64747 85299 98359 27831 3524 35161 41321 60024 46996 65033 100434 81869 36714
8361 36714 -15286 31508 96786 101626 51777 45243 57408 71213 77084 49627 69255 53894
8349 53894 -15949 38192 49210 32536 12365 -23848 -70906 -114890 -119815 -107190 -109269 -29381
8337 -29381 40373 55062 53943 51060 7378 -13709 -9998 -20667 34122 52919 58883 97550 129028
8324 129028 117320 77565 58294 21807 18006 23672 7978 2746 -653 -29970 -2598 1641 12897
8311 12897 -10785 -44235 -52305 -42573 30975 55213 37744 21020 30782 25894 13951 70344 98307
8298 98307 60567 30646 55415 87160 19323 -17715 30081 20759 6757 -42992 -60446 -79380
8286 -79380 -52335 -7511 22546 50450 30968 39234 55249 47048 72315 81752 24911 11758
8274 11758 -30655 -34646 -17034 16956 47238 64561 54907 -17027 -26735 -56871 -49166 -34884 -68888
8261 -68888 -92102 -51739 31906 68587 96039 75937 22708 19947 30691 -16357 -4353 -710
8249 -710 3582 17220 14781 37397 26212 18182 6130 5674 42058 88390 30907 -23090 6840
8236 6840 18587 24619 22934 73728 58575 78056 131141 54974 -8392 28443 16205 21543 53214
8223 53214 53973 27660 20979 68424 48043 81157 101399 45917 -20369 -33123 27403 6326
8211 6326 49797 38165 17684 5102 -15777 -18936 6038 -27446 -52510 -62181 -42032 -24516
8199 -24516 -23956 -71424 -82098 -67845 3497 25730 -1352 -29853 -29859 6198 2568 -59072 -57098
8186 -57098 -63912 -53564 -50723 -87134 -103670 -83559 -28629 19539 3917 17578 77747 95155
8174 95155 113136 80370 63033 34304 -35310 -27406 -3529 16656 4799 47123 114672 139178
8162 139178 111373 79020 28269 -29487 -12217 62979 76573 46565 -28211 -69815 -41880 -20285
8150 -20285 -13216 19538 55378 71119 45401 -746 17754 -18716 -36856 -23401 3353 -12462
8138 -12462 -37499 -3240 15078 53674 99087 84170 45208 33837 42261 44603 46498 57823
8126 57823 68335 105736 80900 -12592 -40351 5234 2713 32549 36459 -4568 -53819 -32874
8114 -32874 29129 84963 154207 149216 124585 74771 68726 59921 73054 56528 22717 21878 18964
8101 18964 -10230 17408 19810 25311 -4745 6141 32232 47398 58390 41787 60306 96304
8089 96304 84369 40029 18396 14036 17610 5989 2030 23366 61545 72318 37826 27039
8077 27039 15237 17302 822 -68797 -64099 18345 33698 27528 46077 64131 83185 117966
8065 117966 83376 74225 71068 64565 95841 128115 110365 112465 91524 74139 83016 45860 5663
8052 5663 -31990 31627 69465 54256 42661 75695 56223 30480 83557 133631 139735 126507
8040 126507 119917 87777 76125 96678 94837 116152 85061 86964 105771 132668 85366 35983
8028 35983 25554 52089 5950 -34297 -7763 -29833 -69143 -41590 -877 43963 89694 42388
8016 42388 -10131 -10173 21906 24830 -25275 -47684 26 65333 82514 53639 67326 30339 -21819
8003 -21819 -20011 -10473 -34716 -48441 -11637 1757 -13826 31792 26603 -3724 8837 -2239
7991 -2239 -15521 45087 102323 112957 96435 93159 70061 94745 126755 111184 73172 14880
7979 14880 -7902 48732 42689 30955 21677 29255 45397 16934 36307 23248 26449 51940 80771
7966 80771 80800 61373 -657 9577 36182 28786 1348 -15045 -51272 -52852 -68939 -21199 12797
7953 12797 63480 46587 22627 12390 17862 34847 20720 40656 96478 115010 92501 -16634
7941 -16634 -75092 -13973 -1748 -19805 4531 27063 19264 60502 41806 19629 72325 109499
7929 109499 100065 57178 98225 41167 27682 47598 68132 84299 81743 115799 131095 163556
7917 163556 162688 140775 93176 28814 -47660 -56230 1561 42202 -9376 -37837 25548 55801
7905 55801 30166 -5192 6388 7591 4688 1762 32361 65940 53198 74243 120446 93481
7893 93481 44371 -19267 -39213 -20635 -27699 -46234 -28451 12934 38659 46827 50258 36279
7881 36279 2744 895 63720 65365 89516 80561 56643 64198 86515 116537 50013 -6031 5042
7868 5042 3816 -20774 5294 11293 26523 24631 13565 64863 62893 57462 48295 9314 -21664
7855 -21664 -21850 -32995 5218 35523 14371 -60710 -47921 -12150 19796 27241 866 -41267
7843 -41267 -31424 -2908 7776 8913 12583 15788 64720 90306 12808 -27987 -27330 13053 50695
7830 50695 48830 8017 -2151 -15742 -39961 -58666 -42489 -32485 -34211 10567 36179 -12611
7818 -12611 -37075 -42738 -18946 308 -54144 -120179 -98582 -91488 -45623 43887 26792 -5559
7806 -5559 -10133 9434 7676 1368 -39051 -54552 -25336 55327 121212 147076 97800 107801 115765
7793 115765 98151 10226 -15639 -67820 -66679 -34877 -26706 -38464 9766 21276 2953 -4210
7781 -4210 -5106 57517 43850 55293 108135 132486 134680 80805 38063 35220 26335 -5032 -20949
7768 -20949 -46710 -23292 10122 21675 39555 20686 -44235 -30545 -42222 -2616 -14566 -31171
7756 -31171 -25502 -4541 -4307 -38017 -15875 6719 44599 45414 20094 36547 70189 82862 44756
7743 44756 -1482 -10634 21460 4543 -27895 2782 56667 111415 107190 76521 12417 4980
7731 4980 20664 58469 110797 82595 61783 1663 -28981 -1211 48573 69689 21936 -30615
7719 -30615 -13843 -6674 -4437 17871 64178 70069 75390 44487 46019 60611 64575 29151 59191
7706 59191 59531 77193 74066 15009 -28926 -6593 27332 78922 57697 42590 14723 -4971
7694 -4971 -20696 11989 71718 44703 23242 39542 41661 -394 24407 36524 21086 7202
7682 7202 -4026 51184 -2606 -21426 29668 45513 45138 22733 37369 34982 3833 8660 22972
7669 22972 102381 91028 70630 84836 71596 38155 18831 28632 58866 90040 82791 64857
7657 64857 26654 6209 39231 57691 78 -37726 7796 56209 42500 40725 25042 33045
7645 33045 67067 80996 36766 36435 37914 36668 38878 27839 17646 36655 59260 31904 8317
7632 8317 9091 50125 67259 77154 38218 17476 45433 61362 96243 72064 60009 65611 87677
7619 87677 110258 64630 40757 48878 17068 -39965 -2655 44544 27917 19525 10713 17388 27736
7606 27736 97539 105038 100498 63365 51958 48125 45488 106526 146571 155005 150811 168039 164168
7593 164168 174936 170574 113104 75683 102823 107218 86999 100610 91008 80933 87767 80885 55652
7580 55652 53563 97448 116238 114714 111941 62017 31202 13148 61122 95105 104906 66442 30553
7567 30553 58705 62396 51483 29227 4374 8751 21764 -15274 20426 10955 24863 3813
7555 3813 32098 69851 71018 77285 97121 90787 60747 36067 48544 11692 34056 66305 29295
7542 29295 70543 88239 36142 -1732 -35861 23188 100994 111380 108024 101959 58364 61820
7530 61820 94835 82545 52762 72092 96575 95402 114649 147878 135473 129389 146406 80415
7518 80415 34316 29949 42071 54868 57703 81746 116638 138658 142114 157109 136010 121277
7506 121277 88201 58352 58237 67623 77241 99297 165867 201232 220383 214586 107038 88673
7494 88673 122101 136579 187696 177456 151659 93165 72480 138513 145028 101568 90444 121983
7482 121983 133343 156624 122412 98083 91398 79829 67016 36206 8299 -27216 18884 471
7470 471 55 67661 64409 85688 94860 132661 170931 143188 48226 49755 65030 51998 40188
7457 40188 78736 75974 77359 114129 94694 69655 65653 64961 105663 76624 75046 69527 73338
7444 73338 67749 96571 71406 9886 37213 54714 41321 50291 76767 69513 53189 38787
7432 38787 46204 27787 33343 26814 802 14149 57975 58550 53644 -8405 -53947 -73454 -55626
7419 -55626 -3537 -40840 -16774 45561 84014 105413 63522 12760 -31334 -15731 20397 6644
7407 6644 38184 63270 14313 33649 3911 -5086 84756 181593 142874 66053 18985 14403
7395 14403 -14473 -50729 -43604 -23278 -55727 -51720 -26142 12220 -24980 -47070 44118 100238
7383 100238 95620 73351 29523 -16064 2453 36001 40921 101185 68053 36335 38107 68147
7371 68147 60415 58013 70431 106943 101507 87721 33788 4210 -6436 45093 70007 42700
7359 42700 23547 11001 12001 -9955 26839 20973 63835 128886 156676 133025 44494 -34792
7347 -34792 -2200 69820 103504 111380 71829 58975 38894 74997 68111 80322 76015 52281
7335 52281 5360 -76802 -106336 -72779 -33082 -22793 -32690 -50933 9784 53997 83437 86523
7323 86523 72259 3403 -56947 -42368 9208 50841 113461 135572 140033 101192 78482 69249
7311 69249 116281 113788 95681 56031 17922 60731 70305 21241 44357 17933 -62327 -85858
7299 -85858 -76244 -97696 -120592 -46441 20856 76790 76198 39388 69419 89000 46434 34224
7287 34224 90712 112220 78290 84620 97622 99287 67917 1482 -26778 -34971 -33823 30201 51928
7274 51928 84446 86357 39608 37511 73909 79497 56279 56022 5867 -31644 48150 74829 59789
7261 59789 -2043 -8735 39220 55495 32449 1290 -8483 -1596 21740 47230 19196 4489
7249 4489 43161 5667 -19692 18811 46392 14013 18897 53640 50768 42969 20137 -29971 -18998
7236 -18998 -40932 -67651 -72652 -72242 -102296 -43957 -2659 9175 42551 45479 32093 77662 130753
7223 130753 55349 37885 36748 -36013 -60256 -41302 -37219 -31021 -11008 57051 69884 39785
7211 39785 24108 23342 27847 41883 14451 895 -48997 -18749 6900 37699 69656 30611
7199 30611 26223 85374 72567 49083 60979 65542 101672 78676 35869 8221 6020 -20504
7187 -20504 -61430 -124656 -152859 -166792 -91944 -22551 17559 42003 17993 20392 22997 35185
7175 35185 40553 -4987 -34759 -8247 24335 7955 30625 51942 40848 -31260 -43694 29301
7163 29301 42572 7614 17942 29109 8351 7279 26079 7432 -24322 -69901 -38014 -22978
7151 -22978 -32155 -19889 5879 14036 -35439 -49135 -8172 -2029 -39277 -53377 13397 75177
7139 75177 52040 9112 -20562 -7628 17474 -57860 -72012 -69772 -85305 -65033 -27626 -11565
7127 -11565 970 -11428 7439 -42939 -69301 -25251 33026 64620 94164 56486 43064 52094
7115 52094 39862 22128 35342 58240 86746 118102 119466 95880 21911 54866 49263 -41844
7103 -41844 -84407 -104580 -117953 -116312 -89316 -66039 -88420 -97889 -78910 -10127 46580 6031
7091 6031 14852 21095 -12937 -52260 -15604 -14798 -75358 -70738 -5094 -34044 -37550 14271 -21624
7078 -21624 -44878 -26976 -25168 -22530 -17761 -15740 13488 -28650 -32979 -36236 3338 7614 -66293
7065 -66293 -65783 -44089 -55609 -67692 -75693 -80082 -79914 -67038 -54990 -19230 2488 23307 35961
7052 35961 52825 60478 45970 20332 -16415 -25401 27708 24907 19629 4059 20824 11403 -52578
7039 -52578 -69845 -5674 49377 29894 17645 -346 20606 17133 10022 64091 74282 47710
7027 47710 44966 75020 75870 19341 -16792 -44371 -52236 -5285 27883 11524 28756 31641 -30162
7014 -30162 -81327 -72599 -14538 12874 23911 -49325 -93806 -58535 -6622 29664 64977 112986
7002 112986 84693 -35736 -46523 35862 48491 48606 24265 21692 36152 122584 54344 12528
6990 12528 8222 -31114 4576 29981 5374 -37122 -40418 -22130 21236 15746 66271 72522 54562
6977 54562 38623 66617 -8836 -26308 -33564 -42449 -55645 6647 61477 60630 29799 63975 64597
6964 64597 63384 67092 24977 -3620 10419 700 -8406 1245 -7535 -13263 -19545 -29452 -28568 9696
6950 9696 11442 -138 -35562 -63131 -63407 -56834 175 35065 -12768 -19294 12039 35863 11443
6937 11443 -1022 -15292 19118 28507 50575 50185 3432 11272 50770 9399 -61924 -83589 -79307
6924 -79307 -43757 -39747 -61764 -95700 -91194 -81751 -93016 -79987 -20750 -12143 -25375 -56322 -8432
6911 -8432 13854 21166 29225 26541 23438 21105 48858 50454 77357 56691 26754 -4552 11975
6898 11975 20749 34067 -5745 -42217 -14733 7655 24788 7049 4067 37654 62397 96383
6886 96383 91249 78454 69142 56570 -9982 -41657 -62591 -34410 -16997 -16917 8190 -20670 41776
6873 41776 79093 75240 41089 4780 -41823 12183 31113 51035 55493 71135 83865 81570
6861 81570 54369 27374 14360 42939 39832 40719 26206 28676 7393 -39846 -64745 -46408 12106
6848 12106 -5532 -34391 -613 27926 371 2089 -3911 -26502 -2255 48224 48544 71913 57452
6835 57452 54826 36237 30384 -7303 5640 -53683 -58129 16955 33794 -18014 -4362 42715
6823 42715 33020 2702 39016 40556 15403 12556 -29507 -21106 28292 52714 66387 30312 15483
6810 15483 22346 26152 8995 -9370 9224 32304 20431 -7463 8065 28059 31111 -13866
6798 -13866 -15800 13078 26830 55564 83844 84033 71073 68031 17294 -10317 -8406 17246 12763
6785 12763 -45352 -87740 -107624 -135553 -88933 -59997 -51541 -65451 -23705 -48060 -17987 46282
6773 46282 35180 11758 51333 58544 66640 49021 -3341 22391 47750 30809 -41903 -73089
6761 -73089 -38217 -23376 -78684 -67973 -56955 -112150 -133474 -113199 -60253 22524 26754 -3967
6749 -3967 2095 -11308 21592 -5691 -47779 -47226 -22870 -10594 -37750 -67004 -58926 -42680 -38989
6736 -38989 5694 -4701 -37735 -5401 -33223 -61197 -87364 -76996 -78032 -47138 -10668 20425
6724 20425 31390 -28284 -38380 -43726 -493 49588 45966 25812 -33945 -18469 -64212 -76028
6712 -76028 -25569 -16815 4229 -28992 -40134 -14803 10179 -10668 -24215 -45643 -61860 -80859
6700 -80859 -36074 -375 9773 41453 36891 60769 64438 27702 7270 41626 79419 66664
6688 66664 42314 65094 70556 44346 80551 55683 -6667 -72420 -107438 -70992 -45544 -59562
6676 -59562 -36393 -14488 6726 45929 49883 42830 1344 -25998 -2899 5930 15728 42752 -15808
6663 -15808 -14798 -35011 -58033 -63734 -69984 -37293 -10049 9328 -22558 -18136 -11530 -14751 -35084
6650 -35084 -5214 45837 -9047 -15916 -73801 -74441 3160 46790 26200 -2384 8687 35212
6638 35212 20667 -49252 -43424 54470 60916 31383 20102 -6180 -31855 -36494 -34160 -64560 -73109
6625 -73109 -59639 -68257 -51108 -71971 -19473 14330 -12649 -67227 -49851 -39821 -59860 -46882
6613 -46882 -33874 -17558 12560 28729 10611 13813 30551 55426 39313 -10735 -42635 -74957
6601 -74957 -69691 -44367 -37103 -46119 -4935 18179 7041 -5482 -36369 9582 56419 46780 15736
6588 15736 -32082 -81095 -75239 -50869 -58921 -18540 -360 6421 -13449 -9902 -40665 -28692 28164
6575 28164 34756 -13177 521 27052 33008 -20562 -44208 -18239 28660 49483 24755 44382
6563 44382 75725 67615 27107 30843 23173 5958 -3059 -80757 -122628 -93333 -79851 -52602 -42009
6550 -42009 -90894 -74360 -89645 -78717 -27889 -13622 -1671 -50317 -62433 -48274 2657 32999
6538 32999 -12959 -8185 -6045 -12876 -7572 -24658 -86357 -68403 -51393 17149 52596 69330 58402
6525 58402 -24568 -30625 -28874 22633 57957 24952 44450 81414 78167 71286 30367 26064 -20779
6512 -20779 -22301 -17954 -26229 -3883 44577 56339 52262 59984 54935 57860 14803 -45859 -24321
6499 -24321 -10167 -12306 5657 228 -26184 -52722 -46810 -9824 -3335 -53338 -71758 -55211 7404
6486 7404 9708 12267 19444 -24612 -20401 63941 134411 103704 40031 6821 -45747 -67113 -48489
6473 -48489 -55557 -14308 -22050 28097 82502 59606 81855 54510 17150 -27653 -18581 -40829
6461 -40829 -64044 -89534 -86807 -46233 -14083 -11102 -11567 -15146 9784 -3771 -31541 -6082 41566
6448 41566 33050 12044 -2760 -26172 -5603 -16763 -75465 -74766 -12378 -235 -26112 -23481 10667
6435 10667 8496 28341 1548 -4570 4684 -33418 -13946 -6832 4560 -23310 -90485 -66031 -20437
6422 -20437 22641 -47527 -121162 -109239 -54917 4219 4079 -24967 -30464 19888 80821 47681
6410 47681 28739 -22513 -56331 -40321 -26557 19589 12862 -13109 14312 97535 62556 42743
6398 42743 16948 13053 -21831 -167 27352 -9483 -1284 63949 48502 -8379 -6416 -51385
6386 -51385 -41634 -66372 -37626 -10699 28781 25799 -1094 -23068 -59057 -48463 -37557 11153
6374 11153 12337 38201 54774 52150 -39053 -103871 -88445 -73694 -44514 -18466 -16333 21783
6362 21783 44686 35882 5658 -26125 -16728 -43607 -25110 30719 53575 52882 25011 1770 4812
6349 4812 -4862 -56949 -63667 -56102 -8663 14062 1230 -7735 -20372 -21503 -1167 -21243 5043
6336 5043 26666 37971 48113 123012 132487 121112 103363 70810 80746 59442 41193 -1397
6324 -1397 -15600 -18966 6349 5979 -16301 -19057 5837 4748 19961 4168 -15184 -52244 3659
6311 3659 52840 29806 58507 30208 -6544 25351 84878 69368 44930 5475 9760 24193
6299 24193 29873 1695 -47138 -60809 18108 45599 8241 7213 -16580 -43466 -48340 -3913
6287 -3913 -22963 -46744 -57478 -59261 -57140 -17063 11100 -1721 -56023 -77883 -99770 -124862
6275 -124862 -36639 2967 22190 -16480 1797 19692 25285 31688 36838 50418 59474 -2160
6263 -2160 -33553 8905 -40160 -56261 -44446 -19064 414 77130 73762 73208 76807 100216 91236
6250 91236 87037 65499 7665 -6612 -47303 -20462 -32905 -11760 -9006 -43734 -44731 -10247 20756
6237 20756 23006 -14262 -62964 -43546 23300 22081 1978 -25751 -6320 59658 66086 32728
6225 32728 20189 17469 -13742 -40953 -33175 -38544 11859 29077 47521 12196 -74445 -72392 -49716
6212 -49716 -67844 -57139 -58026 -63800 -40875 10511 1111 -37162 -36113 -8694 28905 30011 -19909
6199 -19909 -46561 -53464 -85084 -99493 -113597 -79091 -95246 -84506 -93939 -45484 -45238 -52472 -81971
6186 -81971 -71135 -30580 -51332 -20103 -29580 -125935 -95229 -89562 -79134 -68417 -104005 -130177
6174 -130177 -90372 -99783 -69044 -36815 -27778 -42636 -68947 -51027 -51543 -18905 22229 30561 -8234
6161 -8234 -67871 -15406 46642 42930 30600 63983 65694 25361 -2732 -14299 51673 58316 25523
6148 25523 -37506 -27177 30327 64915 38232 6487 -60869 -68400 -53368 -13328 13942 2933
6136 2933 35516 46437 -7813 -23050 -7206 36899 9976 -21963 -5402 6762 -5277 22061
6124 22061 47016 63053 43382 7693 -39680 -67164 -61723 -33573 -13933 41215 47402 17289
6112 17289 19346 -30980 -13442 37494 39481 -11101 -54093 -110959 -70319 -33140 -51703 -57849
6100 -57849 -36109 -11604 -13727 -12346 -6118 22862 -8601 -20872 -25506 -34931 -32730 15500 12258
6087 12258 -36806 -74503 -34297 -48768 -47084 -22191 -40859 -18689 16397 24198 26007 16685 8099
6074 8099 -53973 -66407 -55306 -24961 -61386 -103124 -103277 -54786 -24417 -60634 -75091 -43887
6062 -43887 -43624 -52301 -30908 -33524 -32475 -29679 -26259 8199 21646 -31446 -54378 -69408 -113863
6049 -113863 -104034 -100118 -67881 -23640 -24757 -54391 -52323 -33135 -37920 -41124 -46549 -28350 -8271
6036 -8271 -26175 22662 3863 -7268 -1916 23658 44956 52311 5602 -44075 -36539 -76291 -103215
6023 -103215 -75497 -78084 -59196 -46018 -36254 -84492 -92122 -48019 -35151 -25383 9044 -14397
6011 -14397 6246 -7340 -44527 -58888 -51907 -62557 -94648 -76278 -72696 -60461 -59044 -47938
5999 -47938 -25972 -31685 -45782 -11887 -31713 -47111 9737 46665 55102 26912 49130 34732
5987 34732 11258 12173 -10786 31118 62002 19604 -41781 -68390 -18850 30696 56639 29518
5975 29518 6262 9415 465 18807 10001 -18240 -33429 -27919 -15204 -19129 7632 -22944 -63285
5962 -63285 -69812 -4737 5654 -9233 -29127 -50719 -39674 -10236 18026 11417 -7465 1186
5950 1186 11661 30281 8195 -11694 -11445 12607 -24650 -57494 -78305 -71437 -8643 -667 -39064
5937 -39064 -69371 -58376 -27801 -3406 15348 -28642 -14614 12622 -16331 -66047 -50533 -1049
5925 -1049 45234 47362 15152 -24088 10758 19342 20351 -5824 -20 47559 34381 41210 41872
5912 41872 -15247 -87205 -97830 -8271 5509 -33204 -21952 -26890 -27716 -41251 -38628 -63382 -52819
5899 -52819 -31412 22024 18145 12782 27567 10042 13384 19321 13819 -8027 581 39705 5618
5886 5618 -5654 -2983 -11022 -18367 -36232 -86381 -88118 -23930 10804 8550 -23050 -44855 -20753
5873 -20753 17447 79767 105701 108520 98633 101915 120241 104436 38538 -35682 -77239 -24536
5861 -24536 234 19968 5887 -35990 -58301 -47449 -66052 -37566 -42073 -15647 -44124 -29010
5849 -29010 -43003 -22063 7000 -18119 4151 -21724 -36520 -7858 -25650 -12402 -2935 -1914
5837 -1914 -62596 -74782 -68920 -31732 1880 -7131 26685 39952 23311 -18099 -21552 -15536 -35086
5824 -35086 -63496 -68618 -37193 -26491 -24393 -14483 52309 79253 75547 41664 177 -15547 -1607
5811 -1607 -44888 -77932 -66900 -60345 -68359 -63078 -50940 17765 59290 1665 -50414 -71075 -12206
5798 -12206 793 -18945 -17945 -85251 -62481 -19082 -60407 -63551 -29552 7539 33352 -2250
5786 -2250 30583 17939 39472 67136 50877 86779 46727 -18922 -28253 -9674 -1065 20843
5774 20843 42938 85270 98026 35127 6206 17473 35893 27409 25561 11637 -18915 -44101
5762 -44101 -36325 -16370 -13052 3215 22475 3956 -22572 9444 8240 -2741 -30322 11364
5750 11364 22749 40167 50248 14922 5011 -45622 -57159 -33810 -23277 -44346 -58726 -93838
5738 -93838 -92889 -103195 -106954 -18576 -29260 -59266 -51649 -56845 -68048 -52459 -18701 -20960 3462
5725 3462 39 15333 -931 -50377 -57621 -57781 -54106 -88506 -105371 -75362 -70009 -61566 -69235 -49987
5711 -49987 -69182 -72028 -36553 2678 -22079 -25362 -1631 1597 -18697 -48042 -73287 -57940
5699 -57940 -77435 -70766 -82915 -87095 -45307 -5512 -29641 -30307 -2630 37296 73238 26415 -10869
5686 -10869 -12713 -56443 -110216 -108065 -92441 -43264 -73623 -82110 -74813 -93073 -54354 -34990 -22196
5673 -22196 -43928 -38379 22781 14239 -54378 -51877 -30696 -36012 -8582 7749 1337 28083 40810
5660 40810 2872 -93071 -116735 -99344 -37423 -11791 -20930 -28605 -15750 -8810 -13211 -5558 -16157
5647 -16157 -42870 -74101 -83228 -23673 -13891 -52718 -41424 -38607 -29160 -31893 -19705 9023 -25907
5634 -25907 -88828 -97191 -92674 -60991 -43896 -46580 -86228 -93879 -77996 -8861 2081 -31214 -78514
5621 -78514 -124016 -129322 -103826 -34103 -1794 21120 -10170 -29743 -15777 -32281 -67497 -90769
5609 -90769 -58974 -52733 -57886 -32467 5273 3516 -36016 -9381 -6743 -47539 -96612 -67041 -69868
5596 -69868 -47482 -27839 -26414 -32619 -19914 -4838 15270 55043 44713 18737 -28898 6169
5584 6169 26911 51157 45023 93254 106332 124746 55028 -49759 -38337 51300 119536 91106
5572 91106 70047 108031 67781 42227 80164 73541 12964 17483 -30100 -33920 -20069 -26226 13878
5559 13878 26205 1009 25638 57101 74004 6618 10825 55285 -632 -21277 -45022 -66553
5547 -66553 -27539 3051 -72617 -107116 -65464 -11481 11884 43986 23928 11091 21552 33514
5535 33514 14869 -24123 -14412 -1051 -30127 -54173 -16258 -51049 -65119 -28232 23351 5348
5523 5348 14590 -20868 -30801 -14800 17958 17596 -1863 18645 35937 77183 39619 36821 102613
5510 102613 75813 -3244 3261 -26060 -42197 -22181 763 23257 -17989 -87593 -91891 -39863
5498 -39863 425 21818 36280 37886 -35346 -81726 -55861 -38882 -12054 3741 -55517 -22182
5486 -22182 -5220 46427 64723 67407 47718 62417 56942 44289 86147 87374 91861 61472 36654
5473 36654 65675 47517 37387 42554 21718 8769 2217 25427 36121 12751 2097 -1629
5461 -1629 14596 -3947 -41409 -31696 -28076 -16462 10912 29282 -46472 -57361 -22966 1882
5449 1882 6780 16933 1789 -44207 -53869 -18486 591 -18987 -12225 -16725 -18416 -19884 -41640
5436 -41640 -9516 34307 20508 -18292 -11663 -9685 -11716 -55955 -53625 -14162 -16626 -89824 -77560
5423 -77560 -31329 10916 -7962 -38841 -11748 -39072 -23705 -37961 -117066 -143110 -135884 -74815
5411 -74815 -35996 -14630 13523 -24276 -85398 -117868 -117091 -82236 -47476 -36434 -60569 -71872
5399 -71872 -111732 -124910 -134870 -98134 -40339 -57027 -60008 -51897 -93 46807 5844 16338
5387 16338 32608 -34958 -69950 -102523 -59381 -5263 25925 -4785 -46848 -84280 -68531 -55875
5375 -55875 -40197 -8100 22867 10047 4692 -2873 -50641 -22752 -32844 -67503 -109020 -107978
5363 -107978 -123523 -160318 -128191 -85306 -26931 -31006 -62516 -79927 -60828 -10147 -6283 -4083
5351 -4083 -25907 -56006 -26783 -9083 -8397 -43191 -35577 -33192 -59809 -69672 -6000 28593 3567
5338 3567 -27249 -27059 -41361 -44336 -34295 -7476 -9517 -18916 -55234 -52145 -48792 -45125 -60294 14867
5324 14867 30232 46153 36571 -10072 -26994 -29611 -4810 11223 46766 68742 76305 42294
5312 42294 -85062 -112190 -46898 -35273 -22411 3602 32161 10547 -6918 -28625 -116506 -114630
5300 -114630 -100454 -58762 2823 9162 -40248 -73016 -79536 -107412 -138688 -107360 -32971 -47902
5288 -47902 -15490 -31801 -13047 -14393 -3729 6532 10913 14031 -38843 -60652 -54353 -56713 -71670
5275 -71670 -69364 -74863 -63015 -31702 -23077 -60797 -80332 -45630 15671 -25085 -47754 -7882
5263 -7882 24919 -15894 -39277 -2434 -6415 15181 4325 -40425 -56180 -55169 -81882 -107121
5251 -107121 -111723 -114882 -93639 -61968 -51810 -46204 -28424 -49579 -54582 -32763 -29694 -59031 -83902
5238 -83902 -55565 -19377 -19084 -892 -10140 -22131 -24465 -46186 -52377 -43751 -37873 8837 15570
5225 15570 10929 -34076 -54209 -10028 25350 10716 -204 25822 2675 3502 -37631 -40101 -18934
5212 -18934 17432 258 -3900 17742 19245 -36427 -68022 -85356 -60666 -52868 -22751 -37834
5200 -37834 -88781 -108889 -49320 11590 65537 33995 -17650 -12552 148 14483 22753 9696
5188 9696 -28266 -86064 -46148 -16017 16679 89927 97382 45200 -10685 -28234 -40778 -55624
5176 -55624 -65967 -25700 -28762 -70244 -50059 -58292 -44643 -20517 -21607 31491 46410 49337 21935
5163 21935 22684 15293 -23524 -47197 -28950 -20707 -59367 -61138 -26825 8042 13594 -2438 -17363
5150 -17363 27440 95036 78269 46993 71625 20001 -51485 -65040 -55815 -28709 -24348 -23437 -43564
5137 -43564 -11040 29617 85793 69614 51628 29555 40168 42471 30408 21820 9257 -29416
5125 -29416 -58568 -72991 -39447 -27344 -56451 -90189 -107405 -122553 -64202 -27430 -22239 -43942
5113 -43942 -13047 -16720 -56102 40789 127299 113819 103932 94144 116372 42621 31615 -15423
5101 -15423 -36634 -62221 -40184 -11658 18366 53884 27858 1547 12759 2682 -25307 -73239
5089 -73239 -120137 -75142 -16501 26011 -12336 -43607 -45005 -72968 -107346 -88571 -73671 -5057
5077 -5057 2025 -25988 -12108 4999 24501 -26216 -71475 -65260 -53906 -30168 -32073 -37977 -47154
5064 -47154 -25347 -32373 -18134 8412 12006 -42261 -52659 -39137 4419 26152 30725 36397 54538
5051 54538 34302 3724 27154 36844 3973 -34100 -23223 -35860 -3036 -5107 19413 6014
5039 6014 25272 68949 40200 3574 -23181 -25924 -59245 -47685 -46390 -38971 -21480 6066 27001
5026 27001 -25512 -47827 -59474 -66552 -64318 -134872 -149429 -147288 -129816 -83564 -54903 -26083
5014 -26083 -22662 -20632 -33670 -53708 -41515 -49210 -72340 -83531 -92251 -81577 -51299 -25684 14102
5001 14102 -2437 -8745 -51146 -67025 -57442 -51133 -43330 -21449 -34320 -51887 934 26619 28091
4988 28091 59890 67504 34042 -26087 -16459 -52468 -97239 -44826 -14217 45282 44053 26252
4976 26252 -41446 -78793 -42239 -9150 22475 5957 -5670 21359 28536 -21543 -29228 -15069
4964 -15069 20931 23466 60684 42920 28592 26660 28194 70364 41982 -28656 -44518 -1727
4952 -1727 -4908 -37582 -55901 -49178 -45736 31815 16979 -30182 15414 -41410 -10512 18978 -18980
4939 -18980 -17343 -16687 -26651 -36911 -40066 35861 34543 -10630 -20155 -30987 -74628 -53521 21216
4926 21216 48321 63458 30450 25923 31575 11873 -83177 -113733 -124588 -80821 -32356 -63081
4914 -63081 -48609 -22763 -48525 -13340 12456 -30634 -7300 38447 58719 60250 12683 -413
4902 -413 -27045 -44162 -49595 -63115 -44144 -37430 -31097 -78341 -63489 -75414 -46315 -16270 -52890
4889 -52890 -40027 -14476 -41219 -41581 -54832 -47835 -20072 -17110 -59575 -70596 -96005 -50732 -44864
4876 -44864 -76391 -78934 -73167 -37683 18395 34332 92695 63295 13782 10206 -1751 25105
4864 25105 48243 67214 36659 4031 -6219 -58679 -72154 -75462 -41991 -41093 -14697 4126
4852 4126 13475 5021 -64718 -58465 -33190 -7104 -13010 -27399 4446 17769 26902 5146 -22999
4839 -22999 -55204 -44584 -6113 -1197 8330 52047 4920 -1841 26813 40591 25935 26492 12996
4826 12996 27252 35910 60834 26427 -21487 -15820 -9518 -11547 3277 37038 65824 99007 46513
4813 46513 -18359 -45978 -30594 -8860 -31685 -59988 -62077 -50221 -990 9085 43957 81408
4801 81408 51104 21621 46749 47312 39197 29874 60106 41810 6569 23903 -2922 -44460 -43004
4788 -43004 -62427 -71839 -70683 -12674 -42935 -57622 -14317 -37283 -40700 -22555 2415 2321 -29412
4775 -29412 4593 -45857 -28519 -6505 -21258 10598 44196 57405 83405 35799 24172 29431
4763 29431 3376 -30472 -27376 -37387 -49590 -41819 27289 80162 77465 12387 6670 -14868 -7801
4750 -7801 16628 4411 -11135 -48039 -38367 -24130 -46769 -48096 14587 39164 39553 39312 18831
4737 18831 -1198 -10167 25180 7029 26864 -13306 9318 67744 23158 -33968 10988 20384
4725 20384 41221 79946 64004 -8436 -34018 6530 -11314 684 15426 60341 59131 29347
4713 29347 53104 79621 70583 32370 14895 7185 -24665 -48998 -81924 -100893 -44654 -41358
4701 -41358 -48222 -42629 -29001 -25012 -44539 -91062 -75406 -21793 -11423 2713 -29771 -52788
4689 -52788 -39685 -241 -10794 -30706 18790 5434 -2187 22500 -6528 -15262 -48473 -51352
4677 -51352 -55430 -52311 -42901 -40974 9728 14652 -6353 10558 24469 -1330 -6642 4309 22924
4664 22924 11233 -65415 -83151 -97520 -125077 -130175 -103699 -75682 -68382 -40978 -42309 -16178
4652 -16178 54732 36488 -11651 -56749 -95745 -107919 -144155 -118839 -97690 -46919 -17766 -8789
4640 -8789 -6519 -29581 -59326 -28900 -10249 32092 29981 -200 -49317 -64121 -52752 -72114
4628 -72114 -93976 -131401 -133070 -138204 -120429 -4812 -5798 -18155 -2502 -8130 19033 21294 -6044
4615 -6044 -11674 -5684 -24366 -42910 -26507 15858 -33264 -13123 -55737 -32343 -19759 -4201
4603 -4201 -51162 -75467 -86876 -79622 -28559 21205 -11066 -35981 -30432 -34674 -22696 -23355 -7826
4590 -7826 39164 64071 91968 87390 108414 102241 -4317 -69622 -71645 -65283 -61588 -57963 4451
4577 4451 -7811 -34559 -5753 17616 -7351 24606 71723 38652 13111 -2955 -8561 -24861
4565 -24861 -54299 -45083 -28854 -21395 -28787 -89933 -73493 -45082 -16604 387 -18313 -6492
4553 -6492 -47861 -41480 -75763 -45586 -67061 -123142 -131671 -155123 -118977 -107027 -93747 -55901
4541 -55901 -79863 -57169 4035 10776 -10953 -3249 10264 -18333 -24841 -15463 10970 21876 20415
4528 20415 18296 55333 92068 33281 21870 51585 43730 -5928 -53928 -86304 -27015 15316
4516 15316 24795 43264 -5380 -994 -18387 -23900 -17239 -2222 46814 36693 -5514 -30927 -16249
4503 -16249 62299 61371 38267 1088 -68400 -81027 -63783 -41667 -5277 -38055 -75714 -29765
4491 -29765 31355 -4058 -54776 -95200 -59942 18784 59706 65240 42977 51289 40086 12049
4479 12049 37390 75183 58492 48097 34708 -10168 -22233 -55992 -42079 -8884 57399 61903
4467 61903 58819 65715 71487 62000 40057 2807 17864 11021 45351 76263 60625 59833 64535
4454 64535 48647 51229 54685 33720 19246 41387 18464 31413 24149 -3634 -35271 -46343
4442 -46343 -3697 17439 26814 26734 12180 12114 5767 3161 41097 37791 21983 -1064 -15832 -9156
4428 -9156 -2761 37704 86413 53066 10114 4312 21049 43540 58259 59077 31889 -3557 -39481
4415 -39481 -41743 -68190 -82886 -44480 23812 14209 -23722 -52012 -55370 -42350 13979 36208
4403 36208 22205 17062 11736 -39487 -48554 -698 40634 32095 -9906 -51191 -47046 -28507 -75172
4390 -75172 -121629 -104112 -6856 29641 21412 49834 12377 -28288 -61583 -57658 -33305 -30391
4378 -30391 -58494 -32783 -18450 -40331 -40255 -63714 -17700 -51104 -43356 -47935 -45111 -77531 -102492
4365 -102492 -84540 -88788 -73309 -54458 -92206 -103500 -30562 12357 23278 -3160 -10119 -26460
4353 -26460 -74693 -14877 21750 18117 44238 96016 45628 14284 1959 11069 331 -33947
4341 -33947 -26566 16926 25772 45951 29729 43989 13014 -24823 -29572 -2701 -10318 -7540 21336
4328 21336 20940 27090 10367 -2252 28167 31256 7205 -21880 -51384 -108809 -119942 -138378 -143447
4315 -143447 -154228 -113669 -130470 -142864 -158010 -90981 -65089 -46330 -53167 -27576 -15819 -18137
4303 -18137 13857 -27171 -7533 -34969 -50799 -28629 -1518 282 -8442 -29054 -39118 -27795
4291 -27795 -37783 -40388 -75378 -55424 -12631 -43622 -15808 -25720 -47454 -39669 -22005 19601 29307
4278 29307 15886 -10597 -49487 -25537 -40928 -46699 -53309 -70062 -79174 -88829 -105377 -103936 -40865
4265 -40865 -50089 10216 35654 -4263 31831 114932 135865 143846 75380 -37900 -79012 -4788
4253 -4788 55538 87734 42028 -37690 -48165 -6026 74978 77432 75242 61851 73990 57805
4241 57805 -4854 -54929 -31998 -37141 -69786 -72527 -107254 -95354 -37607 2169 26299 15486
4229 15486 -23239 -22391 -47983 -20236 6282 51499 18465 -35533 -82964 -22189 41741 32576
4217 32576 -709 20408 91216 158795 143059 83720 17678 -9339 -61633 -87671 -85044 -42477
4205 -42477 -25453 10966 37294 20810 -6486 -72871 -11173 31906 49172 61635 82206 58535
4193 58535 -21089 1080 74778 69027 35808 56017 52159 3738 -13659 -50068 -66944 -38147
4181 -38147 24345 35171 2191 35308 16328 43382 16984 4581 -14234 -40175 -10220 28620
4169 28620 10607 25644 19649 30896 59184 47316 45417 4041 -631 -45738 -59733 -41205
4157 -41205 -32296 -41299 -32526 -24597 20207 37504 -39603 -34376 -26287 -27124 -8314 35954 21145
4144 21145 -11851 -3946 -26744 -88025 -46880 51823 6848 -31154 15220 50901 12167 -35280
4132 -35280 -6838 56950 16387 -7659 -5232 4887 42278 28820 -30363 2595 32847 18219
4120 18219 17 26054 63022 46944 -4409 -22127 21395 33254 -17585 7157 39061 24771
4108 24771 15902 19827 49705 49958 73378 88635 75762 41476 20450 -21241 -39309 -62186 -35683
4095 -35683 -1072 -5920 -4685 -3694 3925 -4048 -23575 -41686 -77969 -90011 -60372 -989 39764
4082 39764 46978 8361 -15249 -12134 -38638 -24832 9948 28799 14948 -1199 -62878 -48058
4070 -48058 -84351 -126019 -135943 -105780 -56741 -24870 18520 -8533 -42336 -22960 -44145 -55367
4058 -55367 -26520 -35699 -27143 -63123 -51260 6934 -23101 -48214 -55524 -17516 1844 -46719
4046 -46719 -47332 -6467 4331 -18127 -14530 14652 -16041 -3130 -20654 -52777 -43146 -54669 -72549
4033 -72549 -44530 -20702 17302 21162 -11042 -20914 21495 19939 42243 11449 -2616 -4989 3049
4020 3049 -10621 -51855 -49564 -46402 -29482 -51860 -54654 -14046 19283 -10574 -63676 -34825 -6405
4007 -6405 -12122 -23846 -7347 50496 -17515 -23041 -13447 -60957 -80890 -26620 -5462 12332 10820
3994 10820 -30048 -83277 -59047 -61703 2873 2000 -5826 -23341 -31199 -94649 -52474 -32534 -7070
3981 -7070 4769 58745 56923 55423 9131 28001 8651 -23448 -20252 8382 42695 33253 14552
3968 14552 37350 79344 86318 71690 29608 43056 7766 -73878 -88078 -24977 18599 1473
3956 1473 15357 32613 -29373 -39029 -22356 -38834 -63584 -56013 -12755 28786 24952 14574 32118
3943 32118 28330 -16773 -41616 -52966 -48151 -61217 -10310 19938 44115 22204 -17288 -11031
3931 -11031 -60873 -57277 -66325 -64833 -83028 -41636 8896 25028 7957 -32362 -92326 -94136 -89423
3918 -89423 -75356 -51426 -20474 -38859 -58004 -22082 -19182 -32694 -17765 21164 28880 77510
3906 77510 50829 33373 5481 2955 50900 95504 71285 76893 87609 47182 -4387 -9685
3894 -9685 -36456 -54373 -32995 21402 18691 29232 24800 40506 19056 39949 41069 34705 -7712
3881 -7712 -29370 -27413 -94033 -112385 -50211 -40870 -60340 -85035 -89472 -80362 2092 63234 78372
3868 78372 56279 -2849 -18782 -73207 -116906 -68409 19075 21272 10375 10922 -31338 -22475 33601
3855 33601 66220 73606 32779 -15412 227 4105 10604 2136 -72829 -78302 -65738 -23618 -98952
3842 -98952 -138018 -119961 -70502 -32771 -38750 -31209 -24176 -8726 -16200 -73135 -113262 -47592 -5898
3829 -5898 -1047 13080 20093 37281 20979 9985 11340 -20829 16545 56206 56783 12649 -15021
3816 -15021 37818 35522 7415 -28136 -10010 -33134 -58391 -83202 -88636 -72317 -87068 -34703
3804 -34703 -4171 20312 50957 13862 -5152 -33576 -11695 -25766 -66827 -81447 -81519 -44007
3792 -44007 10368 46227 58945 75060 10959 -13647 -11088 9853 -6890 2261 8316 19289
3780 19289 -25344 -38571 -33741 -50225 -19548 77 33038 14600 -25410 -82783 -59907 -40353
3768 -40353 -50974 -30531 -18284 -19545 -26740 -29144 45827 56748 62444 -19645 -107115 -81737 -55468
3755 -55468 -37453 -29982 -278 -710 -32724 -30571 15284 -3791 4224 49998 80358 124920 83017
3742 83017 47948 -6028 -44817 -37569 -64314 -84725 -100247 -83240 -64205 -14281 6972 -14690
3730 -14690 -19509 -62063 -42412 18203 38568 2448 3693 -9698 6172 19787 28297 -42673
3718 -42673 -48036 -11808 -2455 -34603 -61726 -65290 -47133 -46190 -34819 -19968 -42102 -96514 -100735
3705 -100735 -58702 -26213 -83318 -62123 -57439 -52813 -36711 -43984 -6546 18266 -33056 -16524
3693 -16524 7256 25696 83997 92573 54902 -3793 3922 23113 5334 -42243 -20961 32994
3681 32994 32612 26351 -13047 -20409 18533 110882 144291 115697 59884 4503 -18827 -4335 2765
3668 2765 7560 -1342 -4921 4467 66818 103302 36177 39443 42721 37090 38916 31348 47583 44331
3654 44331 21532 7597 19477 -21173 -42780 -75191 -68605 -80168 -57068 -50393 -44028 28421
3642 28421 6339 -5124 -31159 -39858 -16186 1830 10342 8255 -21178 -90835 -81051 -29259 -24804
3629 -24804 -22310 -24606 -26283 191 -19023 -52702 -62246 -71809 -75566 -87428 -78757 -78704 -90878 -91698
3615 -91698 -103833 -82917 -18576 -4471 25298 429 11684 37046 44778 13312 -30381 -76502
3603 -76502 -61420 -8842 12894 37871 55827 91431 67033 6442 11029 7593 -36137 -53894
3591 -53894 -40847 -47859 -67630 -75112 -62575 14914 2911 -16222 -33961 -31675 -25163 -69311 -88099
3578 -88099 -64405 -57325 -88631 -108545 -99328 -78174 -12525 12128 27383 76329 80511 18419
3566 18419 -50048 -70011 -15395 4179 -21564 -62824 -133195 -125954 -78112 -97916 -81559 -46122
3554 -46122 -39581 -27140 -8719 -7203 -8371 -34279 -33483 -35515 -26713 -9162 20879 15494 47475
3541 47475 104595 128819 139446 102829 16122 -53748 -76395 -17597 7286 -1995 -31731 -69401
3529 -69401 -75421 -89595 -83466 -52808 -47890 -50705 -14827 6757 15166 -24100 -4680 30171 26553
3516 26553 -26172 -100052 -83515 -46983 -12026 -91167 -114423 -61163 -38953 -21208 6951 -7765
3504 -7765 -6967 -68071 -99014 -56543 28658 73031 16749 -24557 17245 72543 66521 34129 -2005
3491 -2005 -20286 -25656 -62525 -51193 -38288 -19088 14006 6358 7312 8773 -13076 -44345 -35598
3478 -35598 -5543 -25095 -74182 -105678 -105210 -41257 -18077 -31452 -46339 -13673 -31067 -65335
3466 -65335 -40696 11895 -46942 -95163 -68206 31693 -4692 -4314 -27976 -65621 -15652 -8904
3454 -8904 -20856 -45202 -71438 -44816 31307 15444 -24500 -68504 -156267 -148325 -84093 -83696 -61045
3441 -61045 -31460 -32825 -4194 -36339 -35866 -31989 -8832 29198 47495 71373 35925 -404 -33862
3428 -33862 -54365 -10476 22381 26252 74840 59547 48441 30160 48822 62104 88365 52460
3416 52460 -3835 -6939 -4054 -19792 -49342 -51183 -1954 -15482 -77160 -80462 -62473 -72544 -48598
3403 -48598 6422 -9717 -20951 44921 59315 18039 -33901 -36871 5257 21658 3447 -21346
3391 -21346 -23408 40882 81673 53953 -37651 -49667 24780 25038 21155 30664 8757 -22676 -16239
3378 -16239 3343 -1816 14771 40470 41834 71581 86469 54788 -10861 -8626 15177 -15772
3366 -15772 -54563 -51800 -23889 -19531 -36976 4647 12964 880 -18893 -34966 -25488 -7312 -8846
3353 -8846 14124 26686 15816 -17667 -37449 -40982 -49981 -22145 -57736 -49776 -61121 -52426 -32498
3340 -32498 9256 7269 -33126 -48145 -40082 -56017 -81576 -72090 -64425 -35693 5173 39724 54199
3327 54199 74062 103603 58265 39617 50586 24945 -23857 -45107 -24235 3617 19249 5930
3315 5930 -47518 -55339 -9811 34062 66112 60469 59596 38171 39147 14956 -11381 -486 26533
3302 26533 12939 8743 -16720 -23123 -28835 -34125 -54723 -28941 -6487 11849 41372 40464 37904
3289 37904 -1858 -22148 -8115 61269 73834 32101 39440 60378 48943 2068 -52437 -4254
3277 -4254 11926 -4140 -20577 -676 13893 36437 -844 -25413 12143 -3281 -15526 -13747
3265 -13747 7206 -2251 12840 -16124 -46531 -16309 -31874 -26584 -9954 -45427 -57315 -46019
3253 -46019 -57209 -38961 -56486 -100452 -111758 -112746 -70784 -4396 -5079 3449 21350 10528 -10939
3240 -10939 1929 24945 886 20176 -1654 54127 71915 45036 30194 9239 26126 1019
3228 1019 -6989 4898 32405 21265 8666 36234 78133 55998 1986 -34008 2655 50504
3216 50504 62206 37792 45866 15746 -3153 -22140 -41285 -68608 -68820 -65274 -5913 -24835 -34978
3203 -34978 -59085 -90308 -14314 36948 28026 -11109 -8882 -3069 -48805 -50017 -30537 -21652 -42595
3190 -42595 -47334 -17174 23081 40522 38553 -4883 -64961 -41241 -72634 -94552 -34442 -10025
3178 -10025 -7126 15413 15266 41217 26247 -2289 27715 49108 24930 21780 -24900 -90134 -107292
3165 -107292 -30358 11111 19353 59801 79641 24731 -26290 -42776 -23148 6317 -2267 -65041
3153 -65041 -90571 -83034 -48344 -70666 -74224 -18739 700 24578 42844 -15613 -21850 -12679 -39750
3140 -39750 -55845 -56053 -56459 -48964 3791 25709 10880 -50169 -61324 -42571 -17931 -9727 -9176
$$ [...]
##END NTUPLES=NMR SPECTRUM
##END=
