##TITLE=Analysis number 330362
Compound Code btb 10071
Project Code adrs
Chemist Name stores
##JCAMPDX= 6.0         $$ Bruker NMR JCAMP-DX V2.0
##DATA TYPE= NMR SPECTRUM
##DATA CLASS= NTUPLES
##ORIGIN= Bruker BioSpin GmbH
##OWNER= nmr
$$ XWIN-NMR		Version 3.5
$$ Mon Nov 19 12:02:33 2007 GMT Standard Time (UT+0h)  MAYBRIDGE\nmr@NMR_250MHZ
##.OBSERVE FREQUENCY= 250.131544655141
##.OBSERVE NUCLEUS= ^1H
##.ACQUISITION MODE= SIMULTANEOUS (DQD)
##.ACQUISITION SCHEME= undefined
##.AVERAGES= 16
##.DIGITISER RES= 18
##SPECTROMETER/DATA SYSTEM= dpx250
##.PULSE SEQUENCE= zg30
##.SOLVENT NAME= CDCl3
##.SHIFT REFERENCE= (INTERNAL, CDCl3, 0, 16.522)
##AUDIT TRAIL= $$ (NUMBER, WHEN, WHO, WHERE, WHAT)
$$ ##TITLE= Audit trail, XWIN-NMR		Version 3.5
$$ ##JCAMPDX= 5.01
$$ ##ORIGIN= Bruker BioSpin GmbH
$$ ##OWNER= nmr
$$ C:\u/data/dgb/nmr/ADRS/1810/pdata/1/auditp.txt
$$ ##AUDIT TRAIL=  $$ (NUMBER, WHEN, WHO, WHERE, WHAT)
(   1,<2007-11-19 12:02:08.17 +000>,<MAYBRIDGE\nmr>,<NMR_250MHZ>,
      <created by zg, POWCHK disabled, PULCHK disabled
       configuration hash MD5:
       76 6E 9A 78 1E 09 19 81 EC 84 63 8F B0 6A 59 2D
       data hash MD5: 64K
       E5 42 96 05 35 FA 8B 33 C1 EB DD EC 93 95 F8 BD>)
(   2,<2007-11-19 12:02:22.43 +000>,<MAYBRIDGE\nmr>,<NMR_250MHZ>,
      <Start of raw data processing
       ef LB = 0.3 FT_mod = 6 PKNL = 1 SI = 32K 
       data hash MD5: 32K
       6E 67 CA 6A 7E 3D AE 31 10 82 8F CC DE F8 9A 12>)
(   3,<2007-11-19 12:02:23.95 +000>,<MAYBRIDGE\nmr>,<NMR_250MHZ>,
      <apk 
       data hash MD5: 32K
       B8 CC D3 1E B5 CC C1 15 7E B2 41 40 1F 3C F1 C7>)
(   4,<2007-11-19 12:02:24.67 +000>,<MAYBRIDGE\nmr>,<NMR_250MHZ>,
      <abs ABSG = 5 
       data hash MD5: 32K
       03 27 23 35 90 69 8A 51 AA FD D2 2A 00 48 F0 3B>)
$$ ##END=
$$ 
$$ hash MD5
$$ 72 B2 BB 06 30 63 0D 24 E2 89 1B ED FA A9 66 7C
##$RELAX= 
##$RELAX= 
##$RELAX= 
##$RELAX= 
##$RELAX= 
##$RELAX= 
##$RELAX= 
$$ Bruker specific parameters
$$ --------------------------
##$DU= <C:\u>
##$EXPNO= 1810
##$NAME= <ADRS>
##$PROCNO= 1
##$TYPE= <nmr>
##$USER= <dgb>
##$AMP= (0..31)
100 100 100 100 100 100 100 100 100 100 100 100 100 100 100 100 100 100 
100 100 100 100 100 100 100 100 100 100 100 100 100 100 
##$AQSEQ= 0
##$AQ_mod= 3
##$AUNM= <au_zg>
##$AUTOPOS= <29 >
##$BF1= 250.13
##$BF2= 250.13
##$BF3= 250.13
##$BF4= 250.13
##$BF5= 500.13
##$BF6= 500.13
##$BF7= 500.13
##$BF8= 500.13
##$BYTORDA= 1
##$CFDGTYP= 0
##$CFRGTYP= 5
##$CHEMSTR= <none>
##$CNST= (0..31)
1 1 145 1 1 1 1 1 1 1 1 1 1 1 1 1 1 1 1 1 1 1 1 1 1 1 1 1 1 1 1 1 
##$CPDPRG= <>
##$CPDPRG1= <>
##$CPDPRG2= <>
##$CPDPRG3= <>
##$CPDPRG4= <mlev>
##$CPDPRG5= <mlev>
##$CPDPRG6= <mlev>
##$CPDPRG7= <mlev>
##$CPDPRG8= <mlev>
##$CPDPRGB= <>
##$CPDPRGT= <>
##$D= (0..31)
0 1 0 0 0 0 0 0 0 0.06 0 0 0 0 0 0 0.0002 0 0 0 0 0 0 0 0 0 0 0 0 0 0 
0 
##$DATE= 1195473726
##$DBL= (0..7)
120 120 120 120 120 120 120 120 
##$DBP= (0..7)
150 150 150 150 150 150 150 150 
##$DBP07= 0
##$DBPNAM0= <>
##$DBPNAM1= <>
##$DBPNAM2= <>
$$ [...]
##$SUBNAM7= <"">
##$SUBNAM8= <"">
##$SUBNAM9= <"">
##$SW= 20.6930455092707
##$SWIBOX= (0..15)
0 0 3 0 0 0 0 0 0 0 0 0 0 0 0 0 
##$SW_h= 5175.983436853
##$TD= 65536
##$TD0= 1
##$TE= 295.16
##$TE2= 300
##$TE3= 300
##$TEG= 300
##$TL= (0..7)
0 120 120 120 120 120 120 120 
##$TP= (0..7)
150 150 150 150 150 150 150 150 
##$TP07= 0
##$TPNAME0= <>
##$TPNAME1= <>
##$TPNAME2= <>
##$TPNAME3= <>
##$TPNAME4= <>
##$TPNAME5= <>
##$TPNAME6= <>
##$TPNAME7= <>
##$TPOAL= (0..7)
0.5 0.5 0.5 0.5 0.5 0.5 0.5 0.5 
##$TPOFFS= (0..7)
0 0 0 0 0 0 0 0 
##$TUNHIN= 0
##$TUNHOUT= 0
##$TUNXOUT= 0
##$USERA1= <user>
##$USERA2= <user>
##$USERA3= <user>
##$USERA4= <user>
##$USERA5= <user>
##$V9= 5
##$VALIST= <valist>
##$VCLIST= <CCCCCCCCCCCCCCC>
##$VD= 0
##$VDLIST= <DDDDDDDDDDDDDDD>
##$VPLIST= <PPPPPPPPPPPPPPP>
##$VTLIST= <TTTTTTTTTTTTTTT>
##$WBST= 1024
##$WBSW= 4
##$XGAIN= (0..3)
0 0 0 0 
##$XL= 0
##$YL= 0
##$YMAX_a= 276833
##$YMIN_a= -328007
##$ZGOPTNS= <>
##$ZL1= 120
##$ZL2= 120
##$ZL3= 120
##$ZL4= 120
##$ABSF1= 16.522
##$ABSF2= -4.171173
##$ABSG= 5
##$ABSL= 3
##$ALPHA= 0
##$AQORDER= 0
##$ASSFAC= 0
##$ASSFACI= 0
##$ASSFACX= 0
##$ASSWID= 0
##$AUNMP= <proc_1d>
##$AZFE= 0.1
##$AZFW= 0.1
##$BCFW= 0
##$BC_mod= 0
##$BYTORDP= 0
##$COROFFS= 0
##$CY= 12.5
##$DATMOD= 1
##$DC= 0
##$DFILT= <>
##$DTYPP= 0
##$F1P= 14.0000005364418
##$F2P= -0.99999901652339
##$FCOR= 0.5
##$FTSIZE= 32768
##$FT_mod= 6
##$GAMMA= 0
##$GB= 0
##$INTBC= 1
##$INTSCL= 1
##$ISEN= 128
##$LB= 0.3
##$LEV0= 0
##$LPBIN= 0
##$MAXI= 10000
##$MC2= 0
##$MEAN= 0
##$ME_mod= 0
##$MI= 0
##$NCOEF= 0
##$NC_proc= -2
##$NLEV= 6
##$NOISF1= 0
##$NOISF2= 0
##$NSP= 0
##$NTH_PI= 0
##$NZP= 0
##$OFFSET= 16.522
##$PC= 1
##$PHC0= 174.7799
##$PHC1= 5.673173
##$PH_mod= 1
##$PKNL= yes
##$PPARMOD= 0
##$PSCAL= 4
##$PSIGN= 0
##$REVERSE= no
##$SF= 250.13
##$SI= 32768
##$SIGF1= 0
##$SIGF2= 0
##$SINO= 400
##$SIOLD= 32768
##$SREGLST= <1H.CDCl3>
##$SSB= 0
##$STSI= 32768
##$STSR= 0
##$SW_p= 5175.98343685301
##$SYMM= 0
##$S_DEV= 0
##$TDeff= 65536
##$TDoff= 0
##$TI= <Analysis number 999999
Compound Code 99
Book Reference 9
Project Code 9>
##$TILT= no
##$TM1= 0
##$TM2= 0
##$TOPLEV= 0
##$USERP1= <user>
##$USERP2= <user>
##$USERP3= <user>
##$USERP4= <user>
##$USERP5= <user>
##$WDW= 1
##$XDIM= 32768
##$YMAX_p= 407405467
##$YMIN_p= -493559
$$ End of Bruker specific parameters
$$ ---------------------------------
##NTUPLES= NMR SPECTRUM
##VAR_NAME=  FREQUENCY,     SPECTRUM/REAL,   SPECTRUM/IMAG
##SYMBOL=    X,             R,               I
##VAR_TYPE=  INDEPENDENT,   DEPENDENT,       DEPENDENT
##VAR_FORM=  AFFN,          ASDF,            ASDF
##VAR_DIM=   32768,         32768,           32768
##UNITS=     HZ,            ARBITRARY UNITS, ARBITRARY UNITS
##FACTOR=    0.157963299565203, 1,           1
##FIRST=     4132.6476996994, 0,             0
##LAST=      -1043.33573715361, 0,           0
##MIN=       -1043.33573715361, -493559,     0
##MAX=       4132.6476996994, 407405467,     0
$$ Real data points
##PAGE= N=1
##DATA TABLE= (X++(R..R)), XYDATA
$$ [...]
17069c1612r981R681J6692p186j1553j0951p331K0339K2499r49j7704o081M593
$$ -31612 -41593 -31912 -15220 -22406 -33959 -44910 -52241 -31902 -9403 -10352 -28056 -34137 -29544
17056b9544J524J5165l389L689J8369k036k4215o924N389J712j1673J537J4059
$$ -29544 -28020 -12855 -16244 -12555 5814 3778 -20437 -27361 -21972 -20260 -31933 -30396 -16337
17043a6337R017j1819j0839J2553Q140O309Q853r198O817j4108k1326o283N257
$$ -16337 -7320 -19139 -29978 -17425 -9285 -2976 5877 -3321 3496 -10612 -31938 -38221 -32964
17030c2964L2956K3331J2293p967J3988J5006P117M1952P3133J626m8267n4613
$$ -32964 -8 23323 35616 27649 41637 56643 63760 105712 178845 180471 132204 77591
17018G7591m4973k8309l1294Q715K2426R416L394r543k9929J0886J1249J4764
$$ 77591 32618 4309 -26985 -18270 4156 13572 16966 7423 -22506 -11620 -371 14393
17006A4393L703j5256p041j680L0P623R81N757K1375N755j0603j3609j2501m830
$$ 14393 18096 2840 -4201 -5881 -5851 1772 2753 8510 29885 35640 25037 11428 -1073 -5903
16992e903J0332j9233j5248J523Q102R095J2793j4765j4560q491J7342P808o924
$$ -5903 4429 -14804 -30052 -28529 -20427 -11332 1461 -13304 -27864 -36355 -19013 -11205 -18129
16979a8129L1990J9867M521j585K4742N2669O7118J07014O1425m2173r7743o4310
$$ -18129 13861 33728 38249 36664 61406 114075 181193 288207 349632 307459 209716 145406
16967A45406o6641m8524k7511J6574r36l774j9511j548J4997l859m516j3568o398
$$ 145406 78765 30241 2730 19304 18368 14594 -4917 -6465 8532 4673 157 -13411 -19809
16954a9809M421J258k809J0691q78m681j8643j8068J1186K4843J5981K8060J5345
$$ -19809 -15388 -14130 -16939 -6248 -7126 -11807 -30450 -48518 -37332 -12489 3492 31552 46897
16941D6897j2595j2775p133L565O018q516r001K5920o83N825J1740o192n426l2240
$$ 46897 34302 21527 14394 17959 23977 15461 6460 32380 31697 37522 49262 43070 37644 5404
16927E404r7K398J531K8004L1333O7072M0165j9970m2605l6340k1077m8301k5424
$$ 5404 5307 7705 9236 37240 68573 135645 175810 155840 113235 76895 55818 7517 -17907
16914a7907l980K3540L8799M572k3683q362q141j2613n264R504K9866O208k519
$$ -17907 -21887 1653 40452 45024 21341 12979 4838 -7775 -13039 -3535 26331 32539 30020
16901C0020Q196q341j6363j2109J4483J0448j0980j5310J5223Q421P656n779K886
$$ 30020 38216 29875 13512 1403 15886 26334 15354 44 15267 23688 31344 25565 28451
16888B8451J884j1003r800Q062J3130k9843l2187M19j7963N107J6772K775Q722
$$ 28451 30335 19332 9532 17594 30724 881 -31306 -30887 -48850 -43743 -26971 -24196 -15474
16875a5474O096J2381p027q544J0664P368m1171j0089k204L420J3553J8022M728
$$ -15474 -9378 3003 -4024 -12568 -1904 5464 -35707 -45796 -48000 -44580 -31027 -13005 -8277
16862h277j2186Q371K083r994K028l746M509J2970K226m105K3500j1493j9948
$$ -8277 -20463 -12092 -10009 -20003 -17975 -21721 -17212 -4242 -2016 -6121 17379 5886 -14062
16849a4062K546p008J113j2300J1629K039k495J0214Q797j568M635K565J1253
$$ -14062 -11516 -18524 -17411 -29711 -18082 -16043 -18538 -8324 473 -1095 3540 6105 17358
16836A7358j851j4633j7848P887Q681l289k0116J759l099J1193J5856j0325r645
$$ 17358 15507 874 -16974 -9087 -406 -3695 -23811 -22052 -25151 -13958 1898 -8427 -18072
16823a8072L37P19J7033r25q041j2635m503O033p335J828j493Q004J3144L442
$$ -18072 -17735 -17016 17 -908 -8949 -21584 -26087 -20054 -27389 -25561 -27054 -19050 -5906 -2464
16809b464p990l887J0141J0891J248O829K851j3908J706K102m926j7230k4821
$$ -2464 -10454 -14341 -4200 6691 7939 14768 17619 3711 5417 7519 2593 -14637 -39458
16796c9458o560M661L2083J164j9802l968J8219K5730l156l832J006Q349p504
$$ -39458 -46018 -41357 -9274 -8110 -27912 -31880 -13661 12069 8913 5081 6087 14436 6932
16783F932n159n469M255J2558k2317k548M089o444o371o004J5667k2985K044K2472
$$ 6932 1773 -3696 559 13117 -9200 -11748 -7659 -14103 -20474 -26478 -10811 -33796 -31752 -9280
16769i280J420j645K844K5613J1862k3233J513l615j9306J0906N359K731j0383
$$ -9280 -7860 -9505 -6661 18952 30814 7581 9094 5479 -13827 -2921 2438 5169 -5214
16756e214N021K546o428O579J828j0022j1595J4001K0681k881j814O988J675j5944
$$ -5214 -193 2353 -4075 2504 4332 -5690 -17285 -3284 17397 14516 12702 19690 21365 5421
16742E421k4532q451K0577K0202j693m342L453J8777j3807j3310j4149j0861o122
$$ 5421 -19111 -27562 -6985 13217 11524 7182 10635 29412 15605 2295 -11854 -22715 -28837
16729b8837J5243R335J9837J5355l990j8965o117J9775O725k6726l0952J5865
$$ -28837 -13594 -4259 15578 30933 26943 7978 1861 21636 28361 1635 -29317 -13452
16717a3452J4207R649M154r222k1352j3852J0047R136P917p914p975J6791o05
$$ -13452 755 10404 14558 5336 -16016 -29868 -19821 -10685 -2768 -10682 -18657 -1866 -2471
16704b471P281O95k053O55Q550j8953p050j492o211R336J9874J2439j5113l7856
$$ -2471 4810 5505 3452 4107 12657 -6296 -13346 -14838 -21049 -11713 8161 20600 5487 -32369
16690c2369J0088K0087j679L569N979J5769m615N379P196j1108J084k598k0481
$$ -32369 -22281 -2194 -3873 -304 5675 21444 16829 22208 29404 18296 19380 16782 -3699
16677c699j0206J3724j5570l379n399M587P741O721j7M787n159j0421M789k099
$$ -3699 -13905 -181 -15751 -19130 -24529 -19942 -12201 -5480 -5497 -710 -5869 -16290 -11501 -13600
16663a3600P654Q248p902r953k316L147k304Q101J451l225n553N53P233o198j626
$$ -13600 -5946 2302 -5600 -15553 -17869 -14722 -17026 -8925 -7474 -10699 -16252 -15699 -8466 -14664 -16290
16648a6290l484P627R570p028l298K3067J2601J3633k531j4191j7010O527Q240
$$ -16290 -19774 -12147 -2577 -9605 -12903 10164 22765 36398 33867 19676 2666 9193 17433
16635A7433J2169K1509q892l4644k2487j4232K2871l25J447P170l431N218j4371
$$ 17433 29602 51111 42219 7575 -14912 -29144 -6273 -6598 -5151 2019 -1412 3806 -10565
16622a0565Q05O933K524j0775P532K2681j4221m479j5145J887p05j3738m464O616
$$ -10565 -9760 -2827 -303 -11078 -3546 19135 4914 435 -14710 -12823 -13528 -27266 -31730 -25114
16608b5114K7831L193l706J2882N366j2256o948j1454m950J412o605r812J3407
$$ -25114 2717 5910 2204 15086 20452 8196 1248 -10206 -15156 -13744 -20349 -30161 -16754
16595a6754n220j802P181N379K556o733J4201q722j0220M85J1780R973O6r288
$$ -16754 -21974 -23776 -16595 -11216 -8660 -15393 -1192 -9914 -20134 -19649 -7869 2104 2170 -7118
16581g118j2376P062O852o323J1820M302n53K883K688L551N236j1058J5178M49
$$ -7118 -19494 -12432 -5580 -11903 -83 4219 3666 6549 9237 12788 18024 6966 22144 22593
16567B2593j2394r131K231K3943K4256q525k1630k9571q061K440O96O157n290
$$ 22593 10199 1068 3299 27242 51498 42973 21343 -8228 -16289 -13849 -13153 -6996 -12286
16554a2286J464M858q225j3075P36K8564J8910o174J650j5278j1030Q929L122
$$ -12286 -10822 -5964 -14189 -27264 -26528 2036 20946 14772 16422 1144 -9886 -957 2165
16541B165j878j2879k4903j4908j0124J0262J726J6655q6q910P423Q966R86M461
$$ 2165 287 -12592 -37495 -52403 -62527 -52265 -50539 -33884 -33970 -42880 -35457 -26491 -25505 -21044
16527b1044R523K71M272j8797o541K3892R204l05p506Q871L087j0321k5809j3800
$$ -21044 -11521 -11250 -6978 -25775 -32316 -8424 780 475 -7031 1840 4927 -5394 -31203 -45003
16513d5003J7973J3430J6255J528q740J666n139j3869l472J9871J7122j1270j9646
$$ -45003 -27030 -13600 2655 4183 -4557 -2891 -8030 -21899 -25371 -5500 11622 352 -19294
16500a9294J5867J4060k7704k0219M971j0420k696J3027N817j3637o862J9137
$$ -19294 -3427 10633 -17071 -37290 -32319 -42739 -45435 -32408 -26591 -40228 -47090 -27953
16488b7953J8625R757J5195L0319j9380j7877k2469m843Q485l645m138J0396P503
$$ -27953 -9328 429 15624 45943 26563 8686 -13783 -18626 -10141 -13786 -17924 -7528 -25
16475b5j5810j9164o508P583R775J3631Q113j6739k1094N756J2581j2392r210
$$ -25 -15835 -34999 -41507 -33924 -24149 -10518 -2405 -19144 -40238 -34482 -21901 -34293 -43503
16462d3503M099J865O178r020M080R050n063J551N940J3679J1643m23l023r77
$$ -43503 -39404 -37539 -31361 -40381 -36301 -27251 -32314 -30763 -24823 -11144 499 76 -2947 -3924
16448c924K9235J260j4522k1051j0324n166r361K974M062P472J4975j3623P069
$$ -3924 25311 26571 12049 -9002 -19326 -24492 -33853 -30879 -26817 -19345 -4370 -17993 -10924
16435a0924R725J8449J1399j7856m8250n157L8684K9207K1245j7210j0587m411
$$ -10924 -1199 17250 28649 10793 -37457 -42614 -3930 25277 46522 29312 18725 14314
16423A4314j9292l625J4703k79P762n337l793j4490j5516j1288p557M219K5115
$$ 14314 -4978 -8603 6100 5821 13583 8246 4453 -10037 -25553 -36841 -44398 -40179 -15064
16410a5064Q539j7038M5q030L667L817J6415O399j7788n669L0446o692o155J357
$$ -15064 -6525 -23563 -23518 -31548 -27881 -24064 -7649 -1250 -19038 -24707 5739 -953 -7108 -5751
16396e751J046L991J3976J926M579N9j0771o254N329J0844j6781j4821K572j0130
$$ -5751 -4705 -714 13262 15188 19767 19826 9055 2801 8130 18974 2193 -12628 -10056 -20186
16382b0186J1012J1148J2010n554p033Q922o840l0646n377O102J2580J8171N255
$$ -20186 -9174 1974 13984 8430 1397 10319 3479 -27167 -32544 -26442 -13862 4309 9564
16369I564J4251k6930j8031K2649K6613l210J897M108k411l550k3652j8756m467
$$ 9564 23815 -3115 -21146 1503 28116 24906 26803 30911 28500 24950 1298 -17458 -21925
16356b1925q318K7172K0477k2911j2287J5077J3067J30j1009k4350r658n013J2099
$$ -21925 -30243 -3071 17406 -5505 -17792 -2715 10352 10482 -527 -24877 -34535 -39548 -27449
16343b7449K7551Q8L905j1930j0421j9412Q547o819J3423K044o791j9482Q337
$$ -27449 102 190 4095 -7835 -18256 -37668 -29121 -35940 -22517 -20473 -27264 -46746 -38409
16330c8409K1857P921q606K0702n081k4148j1298N600J6457J0167N636o3J8543
$$ -38409 -16552 -8631 -17237 3465 -1616 -25764 -37062 -31462 -15005 -4838 798 735 19278
16317A9278k354n179j2605o786n104P416J7688j896j1991l27n622N124J176K0437
$$ 19278 16924 11745 -860 -7646 -12750 -5334 12354 10458 -1533 -1860 -7482 -2358 -1182 19255
16303A9255k2415q603R954Q633R798j0460q502m103l382j0289j8944J8179l96
$$ 19255 -3160 -11763 -1809 6824 16622 6162 -2340 -6443 -9825 -20114 -39058 -20879 -21275
16290b1275k4827Q807K3894q375M636J4013j4305j3811N217J2018k0244p483K5951
$$ -21275 -46102 -37295 -13401 -21776 -17140 -3127 -17432 -31243 -26026 -14008 -34252 -41735 -15784
16277a5784m44o771o413O615p124K48r391J9715J2767J060J6882j3810J0904L467
$$ -15784 -16228 -22999 -29412 -22797 -29921 -29673 -39064 -19349 -6582 -5522 11360 -2450 8454 11921
16263A1921J3404k408j2690j5746j0692J2916K1319r049p971j0827n216J1420
$$ 11921 25325 22917 10227 -5519 -16211 -3295 18024 8975 1004 -9823 -15039 -3619
16251c619R770K2176q981k411j2643j2290p482L273J1750O555R200O090k4875
$$ -3619 6151 28327 19346 16935 4292 -7998 -15480 -12207 -457 6098 15298 21388 -3487
16238c487l304N8J7583o915m3698N532R471l187J3815J2615M764n729j853J6062
$$ -3487 -6791 -6733 10850 3935 -39763 -34231 -24760 -27947 -14132 -1517 3247 -2482 -4335 11727
16224A1727k0352j7574J90l44k78J2581o44o206J9261K2064j9649m2821J4783
$$ 11727 -8625 -26199 -26009 -26353 -26631 -14050 -14694 -20900 -1639 20425 776 -42045 -27262
16211b7262L2839j8122l913K2824J9749j3536l63j6086j8033k9449k0749K5438
$$ -27262 5577 -12545 -16458 6366 26115 12579 12216 -3870 -21903 -51352 -72101 -46663
16199d6663L0654K7864J2171O757q29k7294k7403O398K4588K719j0519j1810K655
$$ -46663 -16009 11855 24026 30783 29954 2660 -24743 -18345 6243 8962 -1557 -13367 -10712
16186a0712K523j7650j4230L326K6495J786J0970j0728J1120n832k029Q329R192
$$ -10712 -8189 -25839 -40069 -36743 -10248 -8462 2508 -8220 2900 -2932 -4961 3368 12560
16173A2560R935J6057m1126r865J4595j4142j3114L745K3559R890j5565j7909
$$ 12560 22495 38552 -2574 -12439 2156 -11986 -25100 -21355 2204 12094 -3471 -21380
16161b1380q856J0048m276j5080l7523n815Q039M5370M9316k0111j1250J8971
$$ -21380 -30236 -20188 -24464 -39544 -77067 -82882 -74843 -29473 19843 -268 -11518 7453
16149G453L539O832l565j9639j873r417j786J1709k099R635O872j3090Q733N7
$$ 7453 10992 17824 14259 -5380 -7253 -16670 -18456 -6747 -8846 789 7661 -5429 3304 3361
16135C361Q80P069l952o936N665k5547o527J807l420P662M782j4599J4664J5927
$$ 3361 4241 11310 7358 422 6087 -19460 -25987 -24180 -27600 -19938 -15156 -29755 -15091 836
16121H36j5759J172M927m986P529K6859K5282L259j5441k7756j5141L955Q432
$$ 836 -14923 -13751 -8824 -13810 -6281 20578 45860 49119 33678 5922 -9219 -5264 3168
16108C168N421O045o80j8631l194j527l096m70J2530j0375n655j041n990q80j4621
$$ 3168 8589 14634 13954 -4677 -7871 -9398 -12494 -12964 -434 -10809 -16464 -17505 -23495 -24375 -38996
16093c8996P989J0795p022q814M158J8319R588j160j3588J6087O725j7508k7980
$$ -38996 -31007 -20212 -27234 -36048 -31890 -13571 -3983 -5143 -18731 -2644 4081 -13427 -41407
16080d1407m455q09J7807J8863r091R083J3153J98N178l608p63J5361k033q345
$$ -41407 -45862 -46671 -28864 -10001 -19092 -10009 3144 3342 8520 4912 4149 19510 17477 9132
16066I132j1537j0073j9843j3169M952J0786J1734J2662J8889j5224K336Q770
$$ 9132 -2405 -12478 -32321 -45490 -40538 -29752 -18018 -5356 13533 -1691 645 9415
16054I415O606q38r222k520j2443k088J2904m102j6918L651N133N473J1835j265
$$ 9415 16021 15183 5961 3441 -9002 -11090 1814 -2288 -19206 -15555 -10422 -4949 6886 5621
16040E621J8109P944j3115k0020k3043N878k300Q352J8157J5345n961K945j326
$$ 5621 23730 31674 18559 -1461 -24504 -18626 -20926 -12574 5583 20928 14967 17912 16586
16027A6586k9523r609J1602K0521K4709q221q946k1015q369J0619r837p064J7497
$$ 16586 -12937 -22546 -10944 9577 34286 26065 17119 -3896 -12265 -1646 -11483 -18547 -1050
16014a050k946k0005p519K5905r856K924Q541m309J8050L0434J2972j8108j7153
$$ -1050 -3996 -24001 -31520 -5615 -15471 -12547 -4006 -8315 9735 40169 53141 35033 17880
16001A7880j856Q143m960j7821J0084o844p395n303J2862q353j1736j5755m529
$$ 17880 16024 24167 19207 1386 11470 4626 -2769 -8072 4790 -3563 -15299 -31054 -35583
15988c5583Q360J8868k294k0930J330j977R746M862q994M695K3874K0715k57R392
$$ -35583 -27223 -8355 -10649 -31579 -30249 -32226 -22480 -17618 -26612 -21917 1957 22672 22415 31807
15974C1807L106j7744k0857k6759j0308k195J0466M881q604r393K7745l653l0899
$$ 31807 34913 17169 -3688 -30447 -40755 -42950 -32484 -27603 -36207 -45600 -17855 -21508 -52407
15961e2407N812J2753L0558J330j134j014l0920L181P989o00J9323Q683l018q540
$$ -52407 -46595 -33842 -3284 -1954 -3088 -4102 -35022 -31841 -23852 -24452 -5129 3554 536 -8004
15947h004j6922j9324J3349L7161K5192j9735j3423q092k310J0731j873O291J9645
$$ -8004 -24926 -44250 -30901 6260 31452 11717 -1706 -9798 -12108 -1377 -3250 3041 22686
15934B2686J2622j4683j1706P009o385q739j248n256m165Q740k0350J3407N566
$$ 22686 35308 20625 8919 15928 9543 804 -444 -5700 -9865 -1125 -21475 -8068 -2502
15921b502R56n679j4559p176J114J0710m787M972K5931J5988r020o434l297N534
$$ -2502 -1546 -7225 -21784 -28960 -27846 -17136 -21923 -16951 8980 24968 15948 9514 6217 11751
15907A1751j6637p36K509o327q759j5611J5230O991j66Q506J8083q344m221J8760
$$ 11751 -4886 -5622 -3113 -9440 -18199 -33810 -18580 -11589 -11755 -3249 14834 6490 2269 21029
15893B1029l331j8360M630P959j880j4341n311j1037Q106j6591J0272O899Q023
$$ 21029 17698 -662 3968 11927 10047 -4294 -9605 -20642 -12536 -29127 -18855 -11956 -3933
15880c933J1861J9573L33j9032J267L2311o288l5836p226J4486K54j7975k3252
$$ -3933 7928 27501 27834 8802 10069 42380 36092 256 -6970 7516 7770 -10205 -33457
15867c3457J67J2656K0840j4183k893J0383K980j469O468n311M072Q865J1672
$$ -33457 -33290 -20634 206 -13977 -16870 -6487 -3507 -4976 1492 -3819 253 9118 20790
15854B0790k1939j2783O751l973J0917R111j161p20L629l2597j2085J5720M4092
$$ 20790 -1149 -13932 -7181 -11154 -237 8874 7713 6993 10622 -21975 -34060 -18340 25752
15841B5752M614r213r398p482L227j3012p501L343k06N851J3360P52J7476m404
$$ 25752 30366 21153 11755 4273 7500 -5512 -13013 -9670 -9876 -4025 9335 10087 27563 23159
15827B3159j844p045j6409J4034L8478J2057k4580l365J0944n650l0580k8021
$$ 23159 21315 14270 -2139 11895 50373 62430 37850 34485 45429 39779 9199 -18822
15815a8822m031M174J2150j742j3597k077K7398O038j582l837N055l72n12m443
$$ -18822 -22853 -18679 -6529 -8271 -21868 -23945 3453 9491 7909 4072 9127 8755 8243 3800
15801C800N682J1126K564o492j0090J463J0266q379j2820J6125J8167j7980j2413
$$ 3800 9482 20608 23172 16680 6590 8053 18319 9940 -2880 13245 31412 13432 1019
15788A019j2596P970K5792R773j1696r463q980K186j375L212q958j238K010R167
$$ 1019 -11577 -3607 22185 31958 20262 10799 1819 4005 2630 5842 -3116 -4354 -2344 6823
15774F823J1492p88l153m286j4830j4291j085M713J1748L1654J3270j1312j8859
$$ 6823 18315 17527 14374 10088 -4742 -19033 -20118 -15405 -3657 27997 41267 29955 11096
15761A1096K588k987k3958k4988O979J0424r29J9915n101l651J3042o682o134
$$ 11096 13684 10697 -13261 -38249 -31270 -20846 -21775 -1860 -6961 -10612 2430 -4252 -10386
15748a0386J113j5840k7233j9398L2210K4430n884j7915k338J9735K141M222M707
$$ -10386 -9273 -25113 -52346 -71744 -39534 -15104 -20988 -38903 -41241 -21506 -19365 -15143 -10436
15735a0436J5757J6911j0847j5999N661l066l831r427j1386q290J4597L974L3857
$$ -10436 5321 22232 11385 -4614 1047 -2019 -5850 -15277 -26663 -34953 -20356 -16382 17475
15722A7475j891K1298m768m0224J201j2774j3741k861N898L498K6566K2343o033
$$ 17475 15584 36882 32114 -8110 -6909 -19683 -33424 -36285 -30387 -26889 -323 22020 15987
15709A5987j9890n579j0140r732p642K5027L3331j3485j7351M090M051N593o030
$$ 15987 -3903 -9482 -19622 -29354 -36996 -11969 21362 7877 -9474 -5384 -1333 4260 -1770
15696a770q55Q303N877o113l901o308L838p067k0634k445J4927Q269q407R520
$$ -1770 -2625 5678 11555 5442 1541 -4767 -929 -7996 -28630 -31075 -16148 -7879 -16286 -6766
15682f766K3854M725r692p94o075n151j5518q861j305j0301P637O900K001k4090
$$ -6766 17088 21813 12121 11327 5252 101 -15417 -24278 -25583 -35884 -28247 -21347 -19346 -43436
15668d3436J0296J8457p028J1353j0901J5364l207J5057J0863k6433M64N030m536
$$ -43436 -33140 -14683 -21711 -10358 -21259 -5895 -9102 5955 16818 -9615 -9151 -4121 -8657
15655h657R510R108n372L066n050j4290O658J2204q067K1752N955j5884n390L77
$$ -8657 853 9961 4589 7655 2605 -11685 -5027 7177 -890 20862 26817 10933 5543 5920
15641E920n690L30P124K7365j2107k6264j7335M522N120j6535j836L998K0724
$$ 5920 230 560 7684 35049 22942 -3322 -20657 -16135 -11015 -27550 -29386 -25388 -4664
15628d664O337k723n670J0778p978Q09q292o354L262Q552k004L0342J651N210
$$ -4664 1673 -1050 -6720 4058 -3920 -3111 -11403 -17757 -14495 -5943 -7947 22395 24046 29256
15614B9256J0876n102k0534q114R824r872K386q354q363m700Q244q716J9462j4308
$$ 29256 40132 35030 14496 6382 16206 6334 8720 366 -7997 -12697 -4453 -13169 6293 -8015
15600h015k1099L577J0583j164N834J4305K112p112m71k1454j6301K805Q846J3146
$$ -8015 -29114 -25537 -14954 -16118 -10284 4021 6133 -979 -1450 -22904 -39205 -36400 -27554 -14408
15586a4408J2831j9372P586n349j2142q294P836K602J2720J869J1142R884J1186
$$ -14408 -1577 -20949 -13363 -18712 -30854 -39148 -31312 -28710 -15990 -14121 -2979 6905 18091
15573A8091k147n851j1398M439K7035P695q509j5890k3828K488J811R980m690
$$ 18091 15944 10093 -1305 3134 30169 37864 29355 13465 -10363 -7875 -6064 3916 -774
15560g74j1022P680j892J0799L620k0748j3170p32J4677J1124J0616j2251R26
$$ -774 -11796 -4116 -6008 4791 8411 -12337 -25507 -26239 -11562 -438 10178 -2073 -1147
15547a147k1330k6996r870m709J9800J1534R283j059N874J9108l0271j2911p550
$$ -1147 -22477 -49473 -59343 -64052 -44252 -32718 -23435 -24494 -18620 488 -29783 -42694 -50244
15534e0244P442J8277J7955J8414M790q988k3743J7564K1669q974l0201j7249
$$ -50244 -42802 -24525 -6570 11844 16634 7646 -16097 1467 23136 14162 -16039 -33288
15522c3288J81Q096J4000J1460j4597j3225K2543J1145k477R545J6585N573k4368
$$ -33288 -33107 -25011 -11011 449 -14148 -27373 -4830 6315 3838 13383 29968 35541 11173
15509A1173k1781p206J3134l67p672j6725k2694O729k229o952k047l222R212J0297
$$ 11173 -10608 -17814 -4680 -5047 -12719 -29444 -52138 -45409 -47638 -54590 -56637 -59859 -50647 -40350
15495d0350J1224J3728j2044J0882J6695R820K105O648j9899l2424L372J2876
$$ -40350 -29126 -15398 -27442 -16560 135 9955 12060 18708 -1191 -33615 -30243 -17367
15483a7367Q914m644k0394R34K8817J1398k547j5564L569J4063P293j1967L294
$$ -17367 -8453 -13097 -33491 -32557 -3740 7658 5111 -10453 -6884 7179 14472 2505 5799
15470E799o782Q1p260K6002J1445k4675k5262l26K3794J8446K475l866k3737j445
$$ 5799 -983 -902 -8162 17840 29285 4610 -20652 -20978 2816 21262 23737 19871 -3866 -5311
15456e311R43k709j0394l614o799J6486j1306j0456J4504J4920j435j4370K227
$$ -5311 -4368 -7077 -17471 -21085 -27884 -11398 -22704 -33160 -18656 -3736 -5171 -19541 -17314
15443a7314j1927k427K1396J866o844j6777O247J2580K8484R70k0588k0365O345
$$ -17314 -29241 -31668 -10272 -8406 -15250 -32027 -25780 -13200 15284 16254 -4334 -24699 -18354
15430a8354J8967j1981N469J8033o226k5747j202K2485j298j7938N299l974j277
$$ -18354 613 -11368 -5899 12134 5908 -19839 -21041 1444 146 -17792 -12493 -16467 -17744
15417a7744n540J3845n803j489L127Q858J9035r62j4634Q792J8264O011J215J520
$$ -17744 -23284 -9439 -15242 -16731 -13604 -4746 14289 13327 -1307 7485 25749 31760 32975 34495
15403C4495l6578k1215n57R397K6347p205j6534J8733K549K790j5198J1594n867
$$ 34495 -2083 -23298 -23855 -14458 11889 4684 -11850 6883 9432 12222 -2976 8618 2751
15390B751K557R508N121k5739k1618J2947j2435n943J4877Q007j5884k151l476
$$ 2751 5308 14816 19937 -5802 -27420 -14473 -26908 -32851 -17974 -9967 -25851 -28002 -31478
15377c1478L77N331K0979R743R916Q214j0665q730N765n954o098J2360k714q074
$$ -31478 -31101 -25770 -4791 4952 14868 23082 12417 3687 9452 3498 -2600 9760 7046 -1028
15363a028p708j3774n319J5442J002j1914j1017k947K0017J4794Q222J2292k9421
$$ -1028 -8736 -22510 -27829 -12387 -11385 -23299 -34316 -37263 -17246 -2452 5770 18062 -11359
15350a1359J7202k340m812K839J212m182O814R567N722l353k0701j7370J0557
$$ -11359 5843 3503 -1309 1530 2742 -1440 5374 14941 20663 17310 -3391 -20761 -10204
15337a0204J0224m74J5692J4732j6610r616O414j0092j2194o724M548N180P497
$$ -10204 20 -454 15238 29970 13360 3744 10158 66 -12128 -18852 -14304 -9124 -1627
15324a627N060m599j3582K2982J8950n158m951K2967j7851l9915q818J65K2887
$$ -1627 3433 -1166 -14748 8234 27184 22026 17075 40042 22191 -17724 -26542 -26377 -3490
15311c490J310j0829O05K3936K9296J4431j8746l4184j5448K3704J0513J4322
$$ -3490 -2180 -13009 -12404 11532 40828 55259 36513 2329 -13119 10585 21098 35420
15299C5420j6324K489j0891j4903M082l014l762j478j7553q790J3683J3662K0016
$$ 35420 19096 21585 10694 -4209 -127 -3141 -6903 -8381 -25934 -34724 -21041 -7379 12637
15286A2637l017q348M786J3944M299n101j6571N359l775q084j0491K385K3425
$$ 12637 9620 1272 6058 20002 24301 19200 2629 7988 4213 -3871 -14362 -11977 11448
15273A1448L0390P807m123j9970j4829J6401L635k0724j0571M904n859q329m734
$$ 11448 41838 49645 45522 25552 10723 27124 30759 10035 -536 4368 -1491 -9820 -14554
15260a4554p110m893L6048J0701Q041j5905m099j3050K0020k839k2363j1367J8817
$$ -14554 -21664 -26557 9491 20192 28233 12328 8229 -4821 15199 12360 -10003 -21370 -2553
15247b553j3889j5798L3919J7354J5787j4894j4364l197j8690r701L43M137L3461
$$ -2553 -16442 -32240 1679 19033 34820 19926 5562 2365 -16325 -26026 -25683 -21546 11915
15234A1915l974j0014P523N911R998j1562j3845R582n243k7322K023K9150J8657
$$ 11915 7941 -2073 5450 11361 21359 9797 -4048 5534 291 -27031 -25008 4142 22799
15221B2799j5762j4165j3112M528J5392R112J5135J477O003J1293J918m005N243
$$ 22799 7037 -7128 -20240 -15712 -320 8792 23927 25404 31407 42700 44618 40613 45856
15208D5856N096n875k2459k1893j5704p774J226l160o779J1617O041L619J8884
$$ 45856 50952 45077 22618 725 -14979 -22753 -21527 -24687 -31466 -19849 -13808 -10189 8695
15195H695o812k5930L947q392L921p786J6671Q331k4498j589J4798J9115J0517
$$ 8695 1883 -24047 -20100 -28492 -24571 -32357 -15686 -7355 -31853 -33442 -18644 471 10988
15182A0988N440p270R277j021j0319m673O788J6593K6181k3478l9181j5393J5274
$$ 10988 16428 9158 18435 17414 7095 2422 9210 25803 51984 28506 -10675 -26068 -10794
15169a0794K5259R909j5338l406J3271j973j4755j51J1233Q67k284l5825j1858
$$ -10794 14465 24374 9036 5630 18901 16928 2173 2022 13255 14122 11838 -23987 -35845
15156c5845J5736K0266K4527J7235k3702k5356l469J2691J8410P681j9641j9637
$$ -35845 -20109 157 24684 41919 18217 -7139 -10608 2083 20493 28174 8533 -11104
15144a1104j0055O528j0635q291L097J2886J2787k4769o551O820K2184j0761k2350
$$ -11104 -21159 -14631 -25266 -33557 -30460 -17574 -4787 -29556 -36107 -29287 -7103 -17864 -40214
15131d0214R407K1761n295k452L99L623M919J2182j913j2842o597k873L746Q530
$$ -40214 -30807 -9046 -14341 -16793 -16394 -12771 -7852 4330 2417 -10425 -17022 -19895 -16149 -7619
15117g619k397J4129J2365r474j7043J4183l663m418j0603J725K372K2471K4328
$$ -7619 -10016 4113 16478 7004 -10039 4144 481 -3937 -14540 -12815 -10443 12028 36356
15104C6356j4417k3899J6851L504J0775j0278q702L534j6164p552l337J0869J0801
$$ 36356 21939 -1960 14891 18395 29170 18892 10190 13724 -2440 -9992 -13329 -2460 8341
15091H341r495j1059K947j4690j2171J0170L903j1408m964J6378J5301n409M54
$$ 8341 -1154 -12213 -9266 -23956 -36127 -25957 -22054 -33462 -38426 -22048 -6747 -12156 -11702
15078a1702J7646j2601j1327J9099k223N474J6969K512m166O080q475j2053l4345
$$ -11702 5944 -6657 -17984 1115 -1108 4366 21335 23847 19681 25761 17286 5233 -29112
15065b9112j6134j016J3024L1781k289k4761K1861M574m179k31j1798J2897L2389
$$ -29112 -45246 -46262 -33238 -1457 -3746 -28507 -6646 -2072 -6251 -6482 -18280 -5383 27006
15052B7006k4641k1946j6199M452N124Q982k2910J6120J9682J5156j0843j0029
$$ 27006 2365 -19581 -35780 -31328 -26204 -17222 -40132 -24012 -4330 10826 -17 -10046
15040a0046n039N113M306J1692K6592o032j1193J3045L220k953k2140l695q320
$$ -10046 -15085 -9972 -5666 6026 32618 26586 15393 28438 31658 28705 6565 2870 -5450
15027e450r526J5425p318k9046k1446J3739P262J0276J2116r81r199J0381R262
$$ -5450 -14976 449 -6869 -35915 -57361 -43622 -36360 -26084 -13968 -14949 -24148 -13767 -4505
15014d505j1718Q497J7026j7353j4455J1409O024J6588j3326q643j3917M822J8945
$$ -4505 -16223 -7726 9300 -8053 -22508 -11099 -5075 11513 -1813 -10456 -24373 -19551 -606
15001f06M537o62j320J2628R978J242k1102q960j6324k4065n307L7972L0372J0213
$$ -606 3931 3269 1949 14577 24555 25797 4695 -4265 -20589 -44654 -49961 -11989 18383 28596
14987B8596k0761m965q592k720J8439k836K592j3559J280K4993o776m875q79j128
$$ 28596 7835 2870 -5722 -8442 9997 7161 9753 -3806 -2526 22467 15691 10816 9937 8809
14973H809J7807j1569k4923K2260K883k1048r238K3551K2100k73j543R020j6792
$$ 8809 26616 15047 -9876 12384 15267 -5781 -15019 8532 30632 30359 28816 37836 21044
14960B1044k0029j1627J3122o761m156J1036l670j3192Q603J8912m225r210k720
$$ 21044 1015 -10612 2510 -4251 -8407 2629 -1041 -14233 -5630 13282 9057 -153 -2873
14947b873j2196K055m192L037j3383j21R165k696Q768QJ6319J3809j9688l636
$$ -2873 -15069 -13014 -17206 -14169 -27552 -27673 -18508 -21204 -12436 -12428 3891 17700 -1988 -5624
14933e624j482q902N132J7152M459n709J64n250m266j1829N513J5893j1470k2465
$$ -5624 -7106 -16008 -10876 6276 10735 5026 5190 -60 -4326 -16155 -10642 5251 -6219 -28684
14919b8684m715N152K614p489N154j6090j242J2043K4147J7850Q072j0876j9678
$$ -28684 -33399 -28247 -25633 -33122 -27968 -44058 -45300 -33257 -9110 8740 16812 5936 -13742
14906a3742k816J6269k004k663o181k9115J5986K1383j0320Q403M748k706L183
$$ -13742 -16558 -289 -2293 -4956 -11137 -40252 -24266 -2883 -13203 -4800 -52 -2758 425
14893D25q783j9862L979K4028J1177J8236j0022o379l09N696J3482N953j1554
$$ 425 -8358 -28220 -24241 -213 10964 29200 19178 12799 12490 18186 31668 37621 26067
14880B6067j2223M058j2728j5501J3025K0102J2227j3116p745j1080p402R789
$$ 26067 13844 17902 5174 -10327 2698 22800 35027 21911 14166 3086 -4316 5473
14868E473J6740M126l45l2069k129j5741j7630J2802J8652m792o713L424r758
$$ 5473 22213 26339 25994 -6075 -8204 -23945 -41575 -28773 -10121 -14913 -21626 -18202 -27960
14855b7960L231l301J5396P4j8615n237J7337j4138r291m383J2161K0382J4510
$$ -27960 -24729 -28030 -12634 -12560 -31175 -36412 -19075 -33213 -42504 -46887 -34726 -14344 166
14842A66N834j6611k591K0647r476j3383K377p796K892J3505j510L845J0046R153
$$ 166 6000 -10611 -13202 7445 -2031 -15414 -13037 -20833 -17941 -4436 -5946 -2101 7945 17098
14828A7098J2375J1330l3704q418J0851K503q445j8046j685J4431M640J1640Q684
$$ 17098 29473 40803 7099 -1319 9532 12035 3590 -14456 -16141 -1710 2930 14570 23254
14815B3254j4066Q414j5455j424o639m653j151p315k2983L339L6963J1952j0254
$$ 23254 9188 17602 2147 723 -5916 -10569 -11720 -19035 -42018 -38679 -1716 10236 -18
14802a8J604o782q07j8994Q618J7451N833j0742p707r141j266J311K713J7899
$$ -18 1586 -5196 -6003 -24997 -16379 1072 6905 -3837 -11544 -20685 -21951 -20640 -17927 -28
14788b8L3017L34j2431l3203j0399J0649J1409r478r751J376Q351J035j941N081
$$ -28 32989 33323 20892 -12311 -22710 -12061 -652 -10130 -19881 -18505 -10154 -9119 -11060 -5979
14774e979o23j2604J0210P630k364R988J1983j2915l950k775n648p830j2610j0041
$$ -5979 -6602 -19206 -8996 -1366 -3730 6258 18241 5326 1376 -1399 -7047 -14877 -27487 -37528
14760c7528J091L296J0620j11K933R476N311k0905o082J4841Q48p882k6436o738
$$ -37528 -36437 -33141 -22521 -22632 -19699 -10223 -4912 -25817 -31899 -17058 -16210 -24092 -50528 -57266
14746e7266L688J7219L0214Q122K452Q599M6j9664R044j1390M896n263j2634K1846
$$ -57266 -53578 -36359 -6145 1977 4429 13028 13074 -6590 2454 -8936 -4040 -9303 -21937 -91
14732i1j891N40R996J576J62J4521L859n899p381J3492r326k4228M685j3385j8896
$$ -91 -1982 -1442 8554 10130 10292 24813 28672 22773 15392 28884 19558 -4670 15 -13370 -32266
14717c2266r625M422J8284N207q790L367O993K588M177q395L987K167j8098J5362
$$ -32266 -41891 -37469 -19185 -13978 -22768 -19401 -12408 -9820 -5643 -14038 -10051 -7884 -25982 -10620
14703a0620P93K100L4246K2184j6881j8036j8535p348P070K8819m384j8611j3094
$$ -10620 -9827 -7727 26519 48703 31822 13786 -4749 -12097 -5027 23792 19408 797 -12297
14690a2297l385o489n416q223J8101K2055p429l161j779j8259k0460q276J3657
$$ -12297 -15682 -22171 -27587 -35810 -17709 4346 -3083 -6244 -8023 -26282 -46742 -55018 -41361
14677d1361L3308J5217k1384K18J5037R007k5995r662K2117M171K473K6658Q68
$$ -41361 -8053 7164 -14220 -14002 1035 10042 -15953 -25615 -3498 673 3146 29804 30672
14664C0672o035K496l6700J2034J5780k2990q342K6882N004p988N543j9065K759
$$ 30672 24637 27133 -9567 2467 18247 -4743 -13085 13797 18801 10813 16356 -2709 50
14651E0J8463K843l162j9506l488J5595k5295K4788J7666j9655j5836n392o906
$$ 50 18513 21356 18194 -1312 -4800 10795 -14500 10288 27954 8299 -7537 -12929 -19835
14638a9835q900J2082j574Q447K2344R195j8988k6281j2029j416K452o598O091
$$ -19835 -28735 -16653 -18227 -9780 12564 21759 2771 -23510 -35539 -36955 -34503 -41101 -35010
14625c5010J2931N139M84P903l678N152R755k864J4079p122j912m483k7832K723
$$ -35010 -22079 -16940 -16456 -8553 -12231 -7079 2676 -188 13891 6769 4857 374 -27458 -24735
14611b4735K2923K0061j6308j8489k869K8762o42j0527K000J8197o6O656R901
$$ -24735 -1812 18249 1941 -16548 -19417 9345 8703 -1824 176 18373 18307 24963 34864
14598C4864P158n058k0158l099j5481j7743M09R242L037J8435j3691J023j8937
$$ 34864 42022 36964 16806 13707 -1774 -19517 -19108 -9866 -6829 11606 -2085 -1062 -19999
14585a9999K657K5173j3071o748j965O592q02J0381j1035J26M352j8947K3099
$$ -19999 -17342 7831 -5240 -11988 -13953 -7361 -8163 2218 -8817 -8691 -4339 -23286 -187
14572a87J5978n343q108m230m541R547M085R254j5982l109o235j950K0898j0828
$$ -187 15791 10448 2340 -1890 -6431 3116 7201 16455 473 -2636 -8871 -10821 10077 -751
14558g51k542r478m513L555K4461N959R418k1031N298K2420m121j772j2956o524
$$ -751 -3293 -12771 -17284 -13729 10732 16691 26109 5078 10376 32796 28675 26903 13947 7423
14544G423j134K1465q190l389j2248j5785K854J9827j2023j9368p581J8652J3310
$$ 7423 6289 27754 19564 16175 3927 -11858 -9004 10823 -1200 -20568 -28149 -9497 3813
14531C813r294K6742Q030j6837j7815P215j5690k1988j996L682J1133j7628P13
$$ 3813 -5481 21261 29291 12454 -5361 1854 -13836 -35824 -37820 -34138 -23005 -40633 -39920
14518c9920N256J3654n02J3873J8290l386j0512l692J4008Q788k004j140j1677
$$ -39920 -34664 -21010 -21512 -7639 10651 7265 -3247 -6939 7069 15857 13853 12713 1036
14505A036j9695P654K3784J9393q432l01n551m893m239R187l96m475l692qP201
$$ 1036 -18659 -11005 12779 32172 23740 23439 17888 12995 8756 17943 17547 13072 9380 9372 16573
14490A6573j161k2879j4884O119L7091O109j7457l007r647q580j0975R398n509
$$ 16573 15412 -7467 -22351 -16232 20859 26968 9511 6504 -3143 -11723 -22698 -13300 -18809
14477a8809M869R108r32J6094j135K6569k150j0843P045N976j4737k1831m742
$$ -18809 -13940 -4832 -5764 10330 9195 35764 33614 22771 29816 35792 21055 -776 -5518
14464e518Q487j768J949J0959p264M382N129j1297k633j9764j993J93k09L629
$$ -5518 2969 1201 3150 14109 6845 11227 16356 5059 2426 -17338 -19331 -19138 -19347 -15718
14450a5718J5577K2509N375k7386j8670K1394L0202K0648k0736j811j0541j5623
$$ -15718 -141 22368 27743 357 -18313 3081 33283 53931 33195 31384 20843 5220
14438E220J476m461K724j6359j909J6822k8025j4755L2181Q06J6384j666n016
$$ 5220 6696 2235 4959 -11400 -13309 3513 -24512 -39267 -7086 -6280 10104 8438 3422
14425C422M511J3177R064J3026j0474J576j939j8306q86j9732n027J2102l672
$$ 3422 7933 21110 30174 43200 32726 34302 32363 14057 13171 -6561 -11588 514 -3158
14412c158K415K0191K1084N639j5415k2568o250J3536J6532k197o346j4389q514
$$ -3158 -743 19448 40532 46171 30756 8188 1938 15474 32006 29809 23463 9074 560
14399E60p172J180P243j799K511n331M487k3519k615L5017J9285L991n114m448
$$ 560 -6612 -5432 1811 12 2523 -2808 1679 -21840 -24455 10562 29847 33838 28724 24276
14385B4276N37j4554p476k7430K550J8686m304k666m98o142j5479j01L1026J1523
$$ 24276 24813 10259 2783 -24647 -22097 -3411 -7715 -10381 -10879 -17021 -32500 -32601 -1575 9948
14371I948J999j7001n590J6412n502k485R972j7109l368R565L405l5618k2927
$$ 9948 11947 -5054 -10644 5768 266 -2219 7753 -9356 -12724 -3159 246 -35372 -58299
14358e8299Q196L0965p555j1071J21K7666J832J0056n21l3457k8729O383N784
$$ -58299 -50103 -19138 -26693 -37764 -37643 -9977 -8145 1911 1390 -32067 -60796 -54413 -48629
14345d8629L095o02R827K1520K3650J6505L46O09j1390j9074j7654m623N762o626
$$ -48629 -45534 -46136 -36309 -14789 8861 25366 25712 26321 14931 -4143 -21797 -26420 -20658 -27284
14331b7284j2650k839Q939J915K4370K0838l1O368j8892p337J0326r957o847M467
$$ -27284 -39934 -42773 -33834 -31919 -7549 13289 13258 19626 734 -6603 3723 -6234 -13081 -8614
14317h614J8003Q391k586n974k364J2070j0244l3750j4563Q343J5232o055n227
$$ -8614 9389 17780 15194 9220 6856 18926 8682 -25068 -39631 -31288 -16056 -22111 -27338
14304b7338M149J7445L751r952j2148O630o816K4014K9629J2423j7635j1138j7988
$$ -27338 -23189 -5744 -1993 -11945 -24093 -17463 -24279 -265 29364 41787 24152 13014 -4974
14291d974o704L1953J1947k1027j6745k3670m486q13J4072R504j0386n197O679
$$ -4974 -11678 20275 32222 11195 -5550 -29220 -33706 -34519 -20447 -10943 -21329 -26526 -19847
14278a9847J682K8P241J3543j0098M294K2550r45j8473O667J8558J0937R508k2154
$$ -19847 -18165 -18137 -10896 2647 -7451 -3157 19393 18448 -25 6642 25200 36137 45645 23491
14264B3491j5565K6211q626l1748k2084j7890L227K1759K8220M1l257j2917j4265
$$ 23491 7926 34137 25511 -6237 -28321 -46211 -42984 -21225 6995 7036 3779 -9138 -23403
14251b3403K620j5975j8560J335Q836J1499J1893K3390P017l621j5700j8465K057
$$ -23403 -20783 -36758 -55318 -53983 -45147 -33648 -21755 1635 8652 5031 -10669 -29134 -27077
14238b7077L2163j2921J421l581j3723j3815L479J3174L68k435N871m382p807
$$ -27077 5086 -7835 -6414 -9995 -23718 -37533 -34054 -20880 -20512 -22947 -17076 -21458 -29265
14225b9265j822K0888j4742j7050K4029K8468L578m171O189j1165L773O51k1274
$$ -29265 -31087 -10199 -24941 -41991 -17962 10506 14084 9913 16102 4937 8710 9361 -11913
14212a1913J250J2170n46m330n858o677r975O192Q141R556o318J1951R691M59
$$ -11913 -10663 1507 961 -3369 -9227 -15904 -25879 -19687 -11546 -1990 -8308 3643 13334 13793
14198A3793j3325j2575k628P465J1399q609o210K4338R88j8085J890R034q174
$$ 13793 468 -12107 -14735 -7270 4129 -4480 -10690 13648 14636 -3449 -1559 7475 -699
14185f99k342o201m374M618K3922j3386k4377j2420N472J2031J0561j5091q185
$$ -699 -3041 -9242 -13616 -8998 14924 1538 -22839 -35259 -29787 -17756 -7195 -22286 -30471
14172c0471J118J8442j2038j359J3105j2202k065J9579J1571p264L773J0193J1906
$$ -30471 -29353 -10911 -22949 -24308 -11203 -23405 -25470 -5891 5680 -1584 2189 12382 24288
14159B4288j5868j4374J9364j964k5733j4475J6922J2670K4803R2J410o809j5209
$$ 24288 8420 -5954 13410 11446 -14287 -28762 -11840 830 25633 25725 27135 20326 5117
14146E117j069J5363J8083P199k5205l0052K710q708j3909K095O880K602P544
$$ 5117 4048 19411 37494 44693 19488 -10564 -7854 -16562 -30471 -28376 -21496 -18894 -11350
14133a1350j0375p883J268J2945J6258n194K252O550k594j5373l563j7526p58
$$ -11350 -21725 -29608 -28340 -15395 863 -4331 -2079 4471 1877 -13496 -17059 -34585 -35343
14120c5343L2506R108N94J422j7658O329m724J4056q532l0403j352N653Q282J5157
$$ -35343 -2837 6271 6865 8287 -9371 -3042 -7766 6290 -2242 -32645 -33997 -28344 -20062 -4905
14106d905O826j4348j8061M468j110J3314R247J9302j2775k5505j1651K8564Q756
$$ -4905 1921 -12427 -30488 -26020 -27130 -13816 -4569 14733 1958 -23547 -35198 -6634 2122
14093B122k5640j6007K1146J2522k560O206K1654J3551k429j494l76p838m583
$$ 2122 -23518 -39525 -18379 -5857 -8417 -2211 19443 32994 30565 29071 28695 20857 16274
14080A6274P267k867j3634l6584r008j4710N03J0803O317J4525J6514K371M350
$$ 16274 23541 20674 7040 -29544 -38552 -53262 -52759 -41956 -35639 -21114 -4600 -2229 2121
14067B121j8417K681M381L069J3427l4928j3995J9668J0407l3107j1146J8422
$$ 2121 -16296 -13615 -9234 -6165 7262 -27666 -41661 -21993 -11586 -44693 -55839 -37417
14055c7417J9057R087j3074R083K961J276J3905l986M049r60j0975k6895P530
$$ -37417 -18360 -9273 -22347 -13264 -10303 -9027 4878 892 4941 3981 -6994 -33889 -26359
14042b6359o09L327J3394L089R993R1q572j747m719K3319j222n662Q856j7450
$$ -26359 -26968 -23641 -10247 -7158 2835 2926 -5646 -7393 -12112 11207 9985 4323 13179 -4271
14028d271j0496L240J8629P197N11J0226r581k7517p095Q194j1932m917J6344
$$ -4271 -14767 -11527 7102 14299 14810 25036 15455 -12062 -19157 -10963 -22895 -27812 -11468
14015a1468J3045J034j785p710j0651J7578j080n341m349K507j9755J6855J2557
$$ -11468 1577 2611 826 -6884 -17535 43 -1037 -6378 -10727 -8220 -27975 -11120 1437
14002A437J4435j4726R208K2475j2800k887p93j6494j0828j0429P212J2221j2161
$$ 1437 15872 1146 10354 32829 20029 17142 16349 -145 -10973 -21402 -14190 -1969 -14130
13989a4130k2099m577J9222J0676j880J5184k689J2845J501J2432l97n827m205
$$ -14130 -36229 -40806 -21584 -10908 -12788 2396 -293 12552 14053 26485 26088 20261 16056
13976A6056q306k762K0287j3057m642M472k8767j7927L791J3071O824l67J4240
$$ 16056 7750 4988 25275 12218 7576 12048 -16719 -34646 -30855 -17784 -10960 -11327 2913
13963B913K0227n293l329j0905K062J0992k0751r912j3792J5084J7356p711j3279
$$ 2913 23140 17847 14518 3613 5675 16667 -4084 -13996 -27788 -12704 4652 -3059 -16338
13950a6338j9834l347K4468J3216j6984J414K1148L622K461k146P47j2888J0994
$$ -16338 -36172 -39519 -15051 -1835 -18819 -17405 3743 7365 9826 7680 8427 -4461 6533
13937F533j2229J548P597J381j0789J4774p03j0767j003J0540k3663k0099k831
$$ 6533 -5696 -4148 3449 4830 -5959 8815 8112 -2655 -3658 6882 -16781 -36880 -39711
13924c9711Q811J1598j2547n585l420K104J5105R858J5098L060r248M098j037
$$ -39711 -30900 -19302 -31849 -37434 -40854 -38750 -23645 -13787 1311 4371 -4877 -779 -1816
13911a816m382P083p054j1558Q951J7044q36j0520l420J1608R213o834R618R042
$$ -1816 -6198 885 -6169 -17727 -8776 8268 7432 -3088 -6508 5100 14313 7479 17097 26139
13897B6139M989J0301j7196J333q912M673j5427j0033n906J7184O820j83j8864
$$ 26139 31128 41429 24233 25566 16654 21327 5900 -4133 -10039 7145 13965 13782 -5082
13884e082L724M676j991r361j1036P721P961P657p561j836J1521j5221L6J9734
$$ -5082 -1358 3318 1327 -8034 -19070 -11349 -3388 4269 -3292 -5128 6393 -8828 -8792 10942
13870A0942m374k772r63J2123j2139j5997o028P152K0996M986k2862k274K2486
$$ 10942 6568 3796 2833 14956 2817 -13180 -19208 -12056 8940 13926 -8936 -11210 11276
13857A1276j892j9662l578J4221K0608r49l5765k8250m959K2493R561L1803J9320
$$ 11276 9384 -10278 -13856 365 20973 20024 -15741 -43991 -48950 -26457 -16896 14907 34227
13844C4227q750q901K3708J0750o055j8072j2518J0244J5403j9894J1646J3812
$$ 34227 25477 16576 40284 51034 44979 26907 14389 24633 40036 20142 31788 45600
13832D5600j2736l213q512M231n577J4833j4560j1304Q803l134q966j0649l214
$$ 45600 32864 29651 21139 25370 19793 34626 20066 8762 17565 14431 5465 -5184 -8398
13819h398J2739j8981k0075j44K1911K512j2140J5293N722K6455k395j0930m216
$$ -8398 4341 -14640 -34715 -34859 -12948 -10436 -22576 -7283 -1561 24894 22499 11569 7353
13806G353j595L925n22j4190k637J3326p497n268L2732J9816j0511k990J475R7
$$ 7353 5758 9683 9161 -5029 -7666 5660 -1837 -7105 25627 45443 34932 31942 33417 33514
13792C3514j062j8636j7937j402J7237j1853j9970j1426k7615n092K367L4973
$$ 33514 32452 13816 -4121 -5523 11714 -139 -20109 -31535 -59150 -64242 -61875 -26902
13780b6902J6040l681o199p846J399l2m021P991J8516N967k826J2139p26O592
$$ -26902 -10862 -14543 -20742 -28588 -27189 -27221 -31242 -23251 -4735 1232 -1594 10545 9819 16411
13766A6411M619o765j1497j9262R205K3452j3667j2384L839J3771N297j4484k048
$$ 16411 21030 14265 2768 -16494 -7289 16163 2496 -9888 -6049 7722 13019 -1465 -3513
13753c513J7256l483K492N681k882N368n199j6309N055P037k6452J3541J7701
$$ -3513 13743 10260 12752 18433 15551 20919 15720 -589 4466 11503 -14949 -1408 16293
13740A6293j840K1850j376M458o855N206P600l7210m039J9146R488O77m803j4033
$$ 16293 14453 36303 34927 39385 32530 37736 45336 8126 4087 23233 32721 33398 28595 14562
13726A4562P044o854R550J20k0883l27o99j400l117j7335j231K0876J1082j791
$$ 14562 21606 14752 24302 24422 3539 3212 2513 1113 -2004 -19339 -20570 306 11388 9597
13712I597r892O005j3075j1333K586R043R725J2531p592l757P681j1885J933K0791
$$ 9597 -295 5710 -7365 -18698 -16112 -7069 2656 15187 7595 3838 11519 -366 1567 22358
13698B2358M13j0664j66n735j242m958p697M594J6392J0918j1041Q944r946j2890
$$ 22358 22771 12107 11941 6206 4964 6 -7691 -3097 13295 24213 13172 22116 12170 -720
13684g20Q640N674m587j3660j5847K7083p19j6054Q158Q74r137J671k785J2515
$$ -720 7920 13594 9007 -4653 -20500 6583 5864 -10190 -2032 -1158 -10295 -8624 -11409 1106
13670A106J5121j2605j7269K087J2996Q792R43j4881k3649R129K5021O758P351
$$ 1106 16227 3622 -13647 -11560 1436 10228 11171 -3710 -27359 -18230 6791 13549 20900
13657B0900j8368k1510q65N929n468k103j579J4243J5870q372J32j8787n635J4079
$$ 20900 2532 -18978 -19843 -13914 -19382 -21485 -23064 -8821 7049 -1323 -1191 -19978 -25613 -11534
13643a1534J4434M350K400o886j2616m016k83J4K5255p51l332l626L269N876j3701
$$ -11534 2900 7250 9650 2764 -9852 -13868 -14151 -14137 11118 10367 7035 3409 6678 12554 -1147
13628a147p612l928j7507M502r223P461J2327k708N018l319R751o575q989R458
$$ -1147 -8759 -12687 -30194 -25692 -34915 -27454 -15127 -17835 -12817 -16136 -6385 -12960 -21949 -12491
13614a2491k33J2532o712n926r669J4522J8922K407r025K462K745j3079k0890
$$ -12491 -12724 -192 -6904 -12830 -22499 -7977 10945 13352 4327 6789 9534 -3545 -24435
13601b4435J8779M506j4637l743j12K72R761J1719j2454l339o999J753o014J5746
$$ -24435 -5656 -1150 -15787 -19530 -19642 -19370 -9609 2110 -10344 -13683 -20682 -18929 -24943 -9197
13587i197L530r117K437J7689J0449Q549j6846M664p180q832k0123O840J5479
$$ -9197 -5667 -14784 -12347 5342 15791 24340 7494 12158 4978 -3854 -23977 -17137 -1658
13574a658J2837j8720P993M3448k2376j5862l03J748J1939l68q383J603l720l413
$$ -1658 11179 -7541 452 43900 21524 5662 5359 7107 19046 18678 10295 11898 8178 4765
13560D765j624q566J7665J8788M524r461j154M638P804r45j9378k4241o964J8344
$$ 4765 3141 -5425 12240 31028 35552 26091 24937 29575 37379 36434 17056 -7185 -14149 4195
13546D195m274k0415M125J3843M016K26J0066P706n073Q949k8436m8543L602J1587
$$ 4195 -79 -20494 -16369 -2526 1490 1716 11782 19488 14415 23364 -5072 -53615 -50013 -38426
13532c8426J7099K7803p273K1415J3419j9034o104J0055j1776j2206k7868L332
$$ -38426 -21327 6476 -797 20618 34037 15003 8899 18954 7178 -5028 -32896 -29564
13520b9564J6656J8121o596j2227j1369J3954q274N279J041k3850j1697K2797
$$ -29564 -12908 5213 -1383 -13610 -24979 -11025 -19299 -14020 -12979 -36829 -48526 -25729
13508b5729J3738q528J1714K6390M011j6291j5172O293J5282m214k6643j742P899
$$ -25729 -11991 -20519 -8805 17585 21596 5305 -9867 -3574 11708 7494 -19149 -20891 -12992
13495a2992O572k881J0296J0383J253M402J4559k929O527K694m140m1779j0464
$$ -12992 -6420 -9301 995 11378 12631 17033 31592 28663 35190 37884 33744 -8035 -18499
13482a8499J2739j1620j2722J5250L2961J1769n442n619m201O570j7854j4098
$$ -18499 -5760 -17380 -30102 -14852 18109 29878 24436 18817 14616 21186 3332 -10766
13470a0766n615K0658J0028R525J1611J0723j2546k9651j2282J9787J4194q762
$$ -10766 -16381 4277 14305 23830 35441 46164 33618 3967 -8315 11472 25666 16904
13458A6904k1457j6764J1529l200r936M147J6446P017J6608q502k0954n783j824
$$ 16904 -4553 -21317 -9788 -12988 -22924 -18777 -2331 4686 21294 12792 -8162 -13945 -15769
13445a5769J191K1616J5896j1650k513j2458r388k627k077J4472r09L880R096
$$ -15769 -14578 7038 22934 11284 8771 -3687 -13075 -15702 -17779 -3307 -4216 -336 8760
13432H760J2808Q923j2663l4528P404P440k2412P360R808J0202k056R13N605k8899
$$ 8760 21568 30491 17828 -16700 -9296 -1856 -24268 -16908 -7100 3102 1046 1959 7564 -21335
13418b1335M348L9160L77J910N438k4501K911m253P11J056O782j7007j1839R789
$$ -21335 -16987 22173 22550 24460 29898 5397 8308 4055 4766 5822 12604 -4403 -16242 -6453
13404f453J3394P829j1423k2005K3320J8295O91r443k5322j8943P551J4700o524
$$ -6453 6941 14770 3347 -18658 4662 22957 23648 14205 -11117 -30060 -22509 -7809 -14333
13391a4333J516j441R921N421K2457q300k0750k0658j351K0130Q15p256Q362J3922
$$ -14333 -12817 -14258 -4337 1084 23541 15241 -5509 -26167 -27518 -7388 -6573 -13829 -5467 8455
13377H455l896j511j941r545J3193J0296m1985j1125K8733N81l52J9823J7396
$$ 8455 4559 3048 1107 -8438 4755 15051 -26934 -38059 -9326 -8745 -9097 10726 28122
13364B8122j380j4308q189j1574J6940P13j2149p990J7697R233M889J0593j7981
$$ 28122 26742 12434 4245 -7329 9611 10324 -1825 -9815 7882 17115 22004 32597 14616
13351A4616J185M243J3676l486O22k940l211l12k3377l099K1965K572j3661l404
$$ 14616 15801 20044 33720 30234 30856 27916 24705 24393 1016 -2083 19882 22454 8793 5389
13337E389m631j6954O054q64J9103L1457J7205m323Q622k7900j1337O80J1439
$$ 5389 758 -16196 -10142 -11006 8097 39554 56759 52436 61058 33158 21821 22501 33940
13324C3940R445L669J0413J0652k7559k9675P900J0211R192k6348j1112m862j8380
$$ 33940 43385 47054 57467 68119 40560 10885 18785 28996 38188 11840 728 -4134 -22514
13311b2514P960Q05m667j0739n038J5401P220Q475L076Q686L7254J4048j2892
$$ -22514 -14554 -13749 -18416 -29155 -34193 -18792 -11572 -3097 -21 8665 45919 59967 47075
13298D7075k2368m322J6531j2381p316j2131L48M406j481j3604J474N422J357
$$ 47075 24707 20385 36916 24535 17219 5088 5436 9842 8361 -5243 -3769 1653 3010
13285C010j256j509r641P147l280O436J3559J4408J1387j0342j6121P891O431
$$ 3010 1754 245 -9396 -2249 -5529 907 14466 28874 40261 29919 13798 21689 28120
13272B8120J9636j3634k6093k627P13K920j6199r25K8031j6593L51J5978k8165
$$ 28120 47756 34122 8029 5402 6115 9035 -7164 -8089 19942 3349 3700 19678 -8487
13259h487l4324J3030P671J1668K1145j732k0392j1279J5897J1193Q089Q480j9929
$$ -8487 -42811 -29781 -22110 -10442 10703 8971 -11421 -22700 -6803 4390 12479 20959 1030
13246A030l1276k0899j0730j961Q276K4052J0055J5414j022j537J2893k2875j2495
$$ 1030 -30246 -51145 -61875 -63836 -55560 -31508 -21453 -6039 -7061 -8598 4295 -18580 -31075
13233c1075l935J4024K5407M216j4087p43j3648p266J2215J6017n462r601J140
$$ -31075 -35010 -20986 4421 8637 -5450 -6193 -19841 -27107 -14892 1125 -4337 -13938 -12798
13220a2798r239p947J3952K7980J2944J5300j1913m3211n85o464j9906J0834K3096
$$ -12798 -22037 -29984 -16032 11948 24892 40192 28279 -14932 -15517 -21981 -41887 -31053 -7957
13207g957p760J3528K9297M361M215p742j2383o094Q968p483j8044J5147J1194
$$ -7957 -15717 -2189 27108 31469 35684 27942 15559 9465 18433 10950 -7094 8053 19247
13194A9247L570K752l1456k8231L509J9000K9846J5061m278j4822k1087m010j0054
$$ 19247 22817 25569 -5887 -34118 -30609 -11609 18237 33298 29020 14198 -6889 -10899 -20953
13181b0953Q345J4659j8392q821J8108j3945P26K2392J1908P275L032k7394m459
$$ -20953 -12608 2051 -16341 -25162 -7054 -20999 -20273 2119 14027 21302 24334 -3060 -7519
13168g519L542l519j1918L308J2010m002L836J940J9196J5814P723j8826J1407
$$ -7519 -3977 -7496 -19414 -16106 -4096 -8098 -4262 -2322 16874 32688 40411 21585 32992
13155C2992J4697M36O528l4384k5275K950N881j2917j5205J3965o831J5615K1158
$$ 32992 47689 48125 54653 20269 -5006 -2056 3825 -9092 -24297 -10332 -17163 -1548 19610
13142A9610o093N251R242n714o042K439J2660k2921M281P176k6766k049o517p046
$$ 19610 13517 18768 28010 22296 16254 18693 31353 8432 12713 19889 -6877 -8926 -15443 -22489
13128b2489P741J4507J4312J2831o993q217k969k4435Q084k49p045N070J9349
$$ -22489 -14748 -241 14071 26902 19909 11692 8723 -15712 -7628 -7877 -14922 -9852 9497
13115I497R939j4695j2289J6083R220J72K329J3038R557R51R588l22k8801j3520
$$ 9497 19436 4741 -7548 8535 17755 17927 20256 33294 42851 43802 53390 53068 24267 10747
13101A0747j2283j3528R044J1008N12K1284J5162q809j0038M331j386j6518r553
$$ 10747 -1536 -15064 -6020 4988 5500 26784 41946 33137 23099 27430 26044 9526 -27
13088b7o46J5166k523J3750l539K5129J6667k4525j6461J2287j144j8465J2939
$$ -27 -673 14493 11970 25720 22181 47310 63977 39452 22991 35278 34134 15669 28608
13075B8608Q327k5741j9761j96M0640J2899j201j0741k558j0359o314J1870J1964
$$ 28608 36935 11194 -8567 -8763 31877 44776 43575 32834 30276 19917 13603 25473 37437
13062C7437M666Q552R832l9064j0702n079l938J2319K0411j1528j6925M014M783
$$ 37437 42103 50655 60487 21423 10721 5642 1704 14023 34434 22906 5981 9995 14778
13049A4778Q980j5070m154J7485Q105j4251k3892J4233N855R691J0961K011j4918
$$ 14778 23758 8688 4534 22019 30124 15873 -8019 6214 12069 21760 32721 34732 19814
13036A9814j6513R833K2100N785Q413J0417j0575o459j6270L507k0514j2771J6587
$$ 19814 3301 13134 35234 41019 49432 59849 49274 42815 26545 30052 9538 -3233 13354
13023A3354P801l692Q188Q343J9629j0566k2682k4653N467r179k206k5293k8181
$$ 13354 21155 17463 25651 33994 53623 43057 20375 -4278 1189 -7990 -10196 -35489 -63670
13010f3670J3848L5351N999J758j0211J5869J8066K509p085k0565j5162j5625
$$ -63670 -49822 -14471 -8472 -6714 -16925 -1056 17010 19519 12434 -8131 -23293 -38918
12998c8918K2636J4429N342P554n935j8143j5877J139P601j1520J6303J3327j9789
$$ -38918 -16282 -1853 3489 11043 5108 -13035 -28912 -27773 -20172 -31692 -15389 -2062 -21851
12985b1851J35n578J1908O570K343Q557J212L103k348k0764n596L763o751o643
$$ -21851 -21716 -27294 -15386 -8816 -6473 2084 3296 6399 4051 -16713 -22309 -18546 -25297 -31940
12971c1940J3001K403J4532m547j1084J5448m908K450q729L786J3370P046J2552
$$ -31940 -18939 -16536 -2004 -6551 -17635 -2187 -7095 -4645 -13374 -9588 3782 10828 23380
12958B3380k0276j9782J8292M951j3161j1527p63m4k520n637Q969L316j3910n539
$$ 23380 3104 -16678 1614 6565 -6596 -18123 -18886 -18930 -21450 -27087 -18118 -14802 -28712 -34251
12944c4251Q447K7045l044j1960M621J8171k435j1126j0562L980J155J9508j403
$$ -34251 -25804 1241 -1803 -13763 -9142 9029 6594 -4532 -15094 -11114 -9959 9549 8146
12931H146O344J857O014K540K527N10k922n17k3631j5685K6620J0523o870k5375
$$ 8146 14490 16347 22361 24901 27428 27938 25016 24499 868 -14817 11803 22326 15456 -9919
12917i919m398j0940N624q333Q415M880P940k646J381n761k958J4831L383J870
$$ -9919 -14317 -25257 -19633 -27966 -19551 -14671 -6731 -9377 -7996 -13757 -16715 -1884 1499 3369
12903C369J067J1522J1379m373k238J4401P034j4361k6694j2242J2853R717j237
$$ 3369 4436 15958 27337 22964 20726 35127 42161 27800 1106 -11136 1717 11434 10197
12890A0197J337q165k2435r076J6002J9544j4850m56J5597J6422r135k2685m393
$$ 10197 11534 3369 -19066 -28142 -12140 7404 -7446 -7902 7695 24117 14982 -7703 -12096
12877a2096n613K2550L592m030j8605O089K0195k935q115r720m938R515J7265
$$ -12096 -17709 4841 8433 4403 -14202 -8113 12082 9147 1032 -8688 -13626 -4111 13154
12864A3154J7029r897l9872l063n74m390J3442J085M665J2865J526o188j309o566
$$ 13154 30183 20286 -19586 -22649 -23223 -27613 -14171 -13086 -8421 4444 5970 -218 -1527 -8093
12850h093j2345r083J2085J982m874J2429p818j7506m765j2833q89L3333J9005
$$ -8093 -20438 -29521 -17436 -15454 -20328 -7899 -15717 -33223 -37988 -50821 -51710 -18377 628
12837F28J5245j4272k379j0527o60p369J5894j4075m034M60m241K203M967J0922
$$ 628 15873 1601 -778 -11305 -11965 -19334 -3440 -17515 -21549 -21089 -25330 -23127 -18160 -7238
12823g238j2020j449J83o199n0K3393J8295j4566N598N957N005k397j500j3808
$$ -7238 -19258 -20707 -20524 -26723 -26773 -3380 14915 349 5947 11904 16909 14512 13012 -796
12809g96j6881J4898K8366j4171q539J90j949q329m363J5672l490j7629j1775
$$ -796 -17677 -2779 25587 11416 2877 3067 1118 -7211 -11574 4098 608 -17021 -28796
12796b8796J5303K6091L419K183j5100j1073o632l215j1078J5580J7484O809K3058
$$ -28796 -13493 12598 16017 18200 3100 -7973 -14605 -17820 -28898 -13318 4166 10975 34033
12783C4033o64r278o002J1591J0261N240j1403m4089k2597m189P933K935M677
$$ 34033 33369 24091 18089 29680 39941 45181 33778 -10311 -32908 -37097 -29164 -26229 -21552
12770b1552M570k037N209J6024J555p090l36J2545j3257k2091j2749o860J4976
$$ -21552 -16982 -19019 -13810 2214 3769 -3321 -3657 8888 -4369 -26460 -39209 -46069 -31093
12757c1093Q740k64J3267J3196R431Q41N137l326K714r781K1099k7734k7807p633
$$ -31093 -22353 -22617 -9350 3846 13277 14118 19255 15929 18643 8862 29961 2227 -25580 -33213
12743c3213J2116J4126o293J758J7352J4751q129m412J5414p771o337J311Q142
$$ -33213 -21097 -6971 -13264 -11506 5846 20597 12468 8056 23470 15699 9362 10673 18815
12730A8815j6626q84J0780J1014j675J1065J0440o517j7793j2916l42P641k7964
$$ 18815 2189 1305 12085 23099 21424 32489 42929 36412 18619 5703 5361 13002 -14962
12717a4962O619k545k126K8091K8451j1040l9033r474j5392j9788K2200J4081
$$ -14962 -8343 -10888 -13014 15077 43528 32488 -6545 -16019 -31411 -51199 -28999 -14918
12705a4918K3395q679q947K89N772l413q951j0160J7727R852r415o963J4426J0813
$$ -14918 8477 -202 -9149 -8860 -3088 -6501 -15452 -25612 -7885 1967 -7448 -14411 15 10828
12691A0828J578j1491j580M54J0419J8143j2447j1737j2518K9j9042j5622K4508
$$ 10828 12406 915 -665 -211 10208 28351 15904 4167 -8351 -8322 -27364 -42986 -18478
12678a8478J4979K355m216k7264j4772J6760K9873l375J0220k159j6778Q271M096
$$ -18478 -3499 -1144 -5360 -32624 -47396 -30636 -763 -4138 6082 3923 -12855 -4584 -488
12665d88P79J1814M08J7657l28k4556j1968l227O427J8593l673j468L313Q63j139
$$ -488 291 12105 12513 30170 29842 5286 -6682 -9909 -3482 15111 11438 9970 13283 14146 13007
12650A3007N606o567j949J4586O261J3076L1422J4120J1634J3892j2376j0723
$$ 13007 18613 12046 10097 24683 30944 44020 75442 89562 101196 115088 102712 91989
12638I1989j8073k1044j5716k5352k4400m925o841P961J9917Q22j526p730q528
$$ 91989 73916 52872 37156 11804 -12596 -17521 -24362 -16401 3516 4338 2812 -4918 -13446
12625a3446N964M328N130m29n120O242j8587j0329J5088L211R917J4428P59j2282
$$ -13446 -7482 -3154 1976 1547 -3573 2669 -15918 -26247 -11159 -7948 1969 16397 17156 4874
12611D874m063k920M036P305P243R874p618l886n011j2040m043j5666j0362J119
$$ 4874 811 -2109 1927 9232 16475 26349 18731 14845 9834 -2206 -6249 -21915 -32277 -31158
12597c1158O343J1365q187r503J2676K1890J9948M050l577k2594j5245J3197k852
$$ -31158 -24815 -13450 -21637 -31140 -18464 3426 23374 27424 23847 1253 -13992 -795 -3647
12584c647k573K257o958O137L054J2596K326j2630L906P084J0814L303K228R99
$$ -3647 -6220 -3963 -10921 -4784 -1730 10866 13192 562 4468 11552 22366 25669 27897 28896
12570B8896r029n653j3614R803J4488p68k5241L621L176j8681P038N353n65N105
$$ 28896 19867 14214 600 10403 24891 24123 -1118 2503 5679 -13002 -5964 -611 -1176 3929
12556C929K4166J231k2451j9956k7009J5394K8247K283K73L322K4845R93j6516
$$ 3929 28095 29326 6875 -13081 -40090 -24696 3551 5834 6107 9429 34274 35267 18751
12543A8751r661n260R902q475j1699K909K0098K5293M954M218j7438J6587M9635
$$ 18751 9090 3830 13732 5257 -6442 -3533 16565 41858 46812 51030 33592 50179 99814
12530I9814L5002J4795r991j2801l1522j9200j9623l1625k0957j9057O830K3267
$$ 99814 134816 149611 139620 126819 95297 76097 56474 24849 3892 -15165 -8335 14932
12518A4932L201m066P819q919j5667L326J707j1377L679J4724O012k2368m323
$$ 14932 18133 14067 21886 12967 -2700 626 2333 -9044 -5365 9359 15371 -6997 -11320
12505a1320m370J9117Q360Q643o969l4961k7302J5245J5325O66m609Q474K049
$$ -11320 -15690 3427 11787 20430 13461 -21500 -48802 -33557 -18232 -17566 -22175 -13701 -11652
12492a1652J3690k186o380q966m369j5256K095J5617m87L102K5806J463j4793
$$ -11652 2038 -148 -6528 -15494 -19863 -35119 -33024 -17407 -17894 -14792 11014 12477 -2316
12479b316p360Q473K4218m665n600k5892k1771J9140J3246K066R427p247L39J1856
$$ -2316 -9676 -1203 23015 18350 12750 -13142 -34913 -15773 -2527 -461 8966 1719 2058 13914
12465A3914J73K557J1435j765j2531O964J2040j0862r939r243P8J3752K16n987
$$ 13914 14087 16644 28079 26314 13783 20747 32787 21925 11986 2743 2821 16573 16789 10802
12451A0802p685l635J0953j630j3262K121N074j088q821q129J6113k444j149J5529
$$ 10802 3117 -518 10435 8805 -4457 -2336 2738 1650 -7171 -15300 813 -1631 -2780 12749
12437A2749J695l690J0911p104p271j1357j0875K047J2469L251j1330l536r77
$$ 12749 14444 10754 21665 14561 7290 -4067 -14942 -12895 -426 2825 -8505 -12041 -13018
12424a3018j519J4304j1683l907K0617q25l4499k563J1656P315K134j3937n887
$$ -13018 -14537 -233 -11916 -15823 4794 3969 -30530 -33093 -21437 -14122 -11988 -25925 -31812
12411c1812q496J7222K3311N762k5620k4001j0502J7443J4355Q61k4733j7194
$$ -31812 -40308 -23086 225 5987 -19633 -43634 -54136 -36693 -22338 -21477 -46210 -63404
12399f3404K4968J6917K1115O225j2377j6420k6413Q782J5615K0047j8598m225
$$ -63404 -38436 -21519 -404 5821 -6556 -22976 -49389 -40607 -24992 -4945 -23543 -27768
12387b7768J3458M32j0662n44K300j2572K2342J1791J437M771J6945k5126j0498
$$ -27768 -14310 -13878 -24540 -25084 -22784 -35356 -13014 -1223 214 4985 21930 -3196 -13694
12374a3694J8885j709j0822j0197j2408J7814K2791K0163j1929r232K311J9424
$$ -13694 5191 3482 -7340 -17537 -29945 -12131 10660 30823 18894 9662 11973 31397
12362C1397j5097j8379J787n570R04r271J537J0102p90P876j8345k5686K4812
$$ 31397 16300 -2079 -292 -5862 -4958 -14229 -12692 -2590 -3380 4496 -13849 -39535 -14723
12349a4723K974j1638l786K2383J5406p699k93j4898R727L1176k71j1699k6903
$$ -14723 -11749 -23387 -27173 -4790 10616 2917 2624 -12274 -2547 28629 28358 16659 -10244
12336a0244q990J3389P040O993j4863j3867J1266l10j0311L460K3284J5220j8148
$$ -10244 -19234 -5845 1195 8188 -6675 -20542 -9276 -9586 -19897 -16437 6847 22067 3919
12323C919n344R184J0207o154n943l611j730J218j1494m92M905N931j2666k362
$$ 3919 -1425 7759 17966 11812 5869 2258 528 1746 -9748 -10240 -5335 596 -12070 -14432
12309a4432k72J0172j586j3727k914J777R053L1695q125J4518N872k3860j8422
$$ -14432 -14704 -4532 -6118 -19845 -22759 -20982 -11929 19766 11641 26159 32031 8171 -10251
12296a0251J2994k889J0190L3861J6178k9439j8264k33j5001j8301p788J1142
$$ -10251 2743 -146 10044 43905 60083 30644 12380 12147 -2854 -21155 -28943 -17801
12284a7801Q14Q31q143J672O722r26J7000K7501J3670j4137j6027j5805J5990
$$ -17801 -16987 -16156 -24299 -22627 -15905 -16831 169 27670 41340 27203 11176 -4629 11361
12271A1361r60l46n603j2807J1745P49k1322M740K5728P745j1497k66p830j5547
$$ 11361 10401 10055 4452 -8355 3390 4139 -17183 -12443 13285 21030 9533 9267 1437 -14110
12257a4110k5755m375L0281J0269K60j7603Q17J1849n650j3953P005M504K003
$$ -14110 -39865 -44240 -13959 -3690 -3430 -21033 -20216 -8367 -14017 -27970 -20965 -16461 -14458
12244a4458Q623J823j3797O06J1596K0052J6040K926J0246j4987l3293J2399K3734
$$ -14458 -5835 -4012 -17809 -17203 -5607 14445 30485 33411 43657 28670 -4623 7776 31510
12231C1510k9517r84q730k051P899K1101J3605N808k4563r53r288k224J2884m325
$$ 31510 1993 1009 -7721 -9772 -1873 19228 32833 38641 14078 13125 3837 1613 14497 10172
12217A0172J803J0391k816o007N791K309j0783j2471m709q341q291j0295J2049
$$ 10172 11975 22366 19550 13543 19334 21643 10860 -1611 -6320 -14661 -22952 -33247 -21198
12204b1198K4839k803p273R390J7440j3569q474K431k788J673l606Q283K301q933
$$ -21198 3641 838 -6435 2955 20395 6826 -1648 783 -2005 -332 -3938 4345 6646 -2287
12190b287J153j9965P032O909J5019J2837J7499L607j9144k9322j023j591j9227
$$ -2287 -1134 -21099 -14067 -7158 7861 20698 38197 41804 22660 -6662 -7685 -9276 -28503
12177b8503p105L588K7138J2094l019j2309n008O877K673R40N247M847j980o740
$$ -28503 -35608 -32020 -4882 7212 4193 -8116 -13124 -6247 -3574 -2634 2613 7460 5480 -1260
12163a260j3407J3215J8695j1513k6207l308Q420K0517q829K0769L1195J1209
$$ -1260 -14667 -1452 17243 5730 -20477 -23785 -15365 5152 -3677 17092 48287 59496
12151E9496j2434L592r500m086j3509K4863M1815L8728L9321N911k6154l3010
$$ 59496 47062 50654 41154 37068 23559 48422 90237 128965 168286 174197 148043 115033
12139A15033n0563l9515j3993m59J3265J6325r351j9444Q037l856j4977M798J1011
$$ 115033 64470 24955 10962 10503 23768 40093 30742 11298 19335 15479 502 5300 16311
12126A6311j0486j1292j3019j2366J1056Q492R601j0115M029J500l0619n07L809
$$ 16311 5825 -5467 -18486 -30852 -19796 -11304 -1703 -11818 -7789 -6289 -36908 -37415 -33606
12113c3606j0002R371J7209K7424K9993l802j556j0089l522q148k2433M771J1520
$$ -33606 -43608 -34237 -17028 10396 40389 36587 35031 24942 21420 13272 -9161 -4390 7130
12100G130R615j5652R336K516o501j8565r412O960L597j0821n052R24j78k128
$$ 7130 16745 1093 10429 12945 6444 -12121 -21533 -14573 -10976 -21797 -26849 -25925 -26103 -28231
12086b8231k625K103R040L4337l978O997q859k3210J434K7270J4316j3709k9047
$$ -28231 -30856 -28753 -19713 14624 10646 17643 8784 -14426 -12992 14278 28594 14885 -14162
12073a4162q759j851q003R627J709j907q019M14r43j2477J1241J6270K3060M013
$$ -14162 -22921 -24772 -32775 -23148 -21439 -23346 -31365 -30951 -31894 -44371 -33130 -16860 6200 10213
12059A0213o418O373j1816J5860k483n995M869N426k656k079n943l880J6058J766
$$ 10213 3795 10168 -1648 14212 11729 5734 10603 16029 13373 11294 5351 1471 17529 19295
12045A9295Q099j4314M145o61k3702K1212J6819J390m621j8761r495J3890O261
$$ 19295 27394 13080 17225 16564 -7138 14074 30893 32283 27662 8901 -594 13296 19557
12032A9557R965L9686L3336J6540L649j2185j4382k759l7388j7220L247J2742
$$ 19557 29522 69208 102544 119084 122733 110548 96166 93407 56019 38799 42046 54788
12020E4788r481k3195M202J5285R761j2240j1795r464j8957j801J1841N165m352
$$ 54788 45307 22112 26314 41599 51360 39120 27325 17861 -1096 -2897 8944 14109 9757
12007I757r510L998K3946J3583p484j4622j4732K050R585l583R269R721j4167
$$ 9757 247 4245 28191 41774 34290 19668 4936 6986 16571 12988 22257 31978 17811
11994A7811j6480m294N989q658J452p827K551K0373L979J469j7468k8384r025
$$ 17811 1331 -2963 3026 -5632 -4180 -12007 -9456 10917 14896 16365 -1103 -29487 -38512
11981c8512L2323J6696k0850j978k800o195l1885j7406K4084J2730O290P444R587
$$ -38512 -6189 10507 -10343 -12321 -15121 -21316 -53201 -70607 -46523 -33793 -27503 -20059 -10472
11968a0472k978n587N837J102m076O535p202J3920M723O635J3478K793j4788n659
$$ -10472 -13450 -19037 -13200 -12098 -16174 -9639 -16841 -2921 1802 8437 21915 24708 9920 4261
11954D261k4994R307L8526J7381j0921j1135j8013J830j1516j6005R957J1493
$$ 4261 -20733 -11426 27100 44481 33560 22425 4412 6242 -5274 -21279 -11322 171
11942A71q635j1300J3569P562P250n244j0240J4027J8649j1616j8721K308K1588
$$ 171 -8464 -19764 -6195 1367 8617 3373 -6867 7160 25809 14193 -4528 -2220 19368
11929A9368j0071p001m202m438j0560n341j488j2758o956j852Q691J0027N415
$$ 19368 9297 2296 -1906 -6344 -16904 -22245 -23733 -36491 -43447 -45299 -36608 -26581 -21166
11916b1166M2501K0917j2650j2833J265l986p821o407J574M929j1906l014m306
$$ -21166 21335 42252 29602 16769 18034 14048 6227 -180 1394 6323 -5583 -8597 -12903
11903a2903k662j4998q773k736l620p415K9377L4502j4386Q389N000n871p949
$$ -12903 -15565 -30563 -39336 -42072 -45692 -53107 -23730 10772 -3614 4775 9775 3904 -4045
11890d045k4011n323q20K0459R074j6003j5300N452O023J0576N127J6661J2089
$$ -4045 -28056 -33379 -34199 -13740 -4666 -20669 -35969 -30517 -24494 -13918 -8791 7870 19959
11877A9959k563J0934k5673j9129J2704L578O055m037N376l1958j9036J0652J8080
$$ 19959 17396 28330 2657 -16472 -3768 -190 5865 1828 7204 -24754 -43790 -33138 -15058
11864a5058M438l711j3076j6985p642R564M1744J3193m544k3694R002j0824k14
$$ -15058 -10620 -14331 -27407 -44392 -52034 -42470 -726 12467 7923 -15771 -6769 -17593 -17807
11851a7807K4279j3183j811j477p808J1845o009n691O947J1097J1385J4734j4849
$$ -17807 6472 -6711 -8522 -9999 -17807 -5962 -11971 -17662 -10715 382 11767 26501 11652
11838A1652k2356P961J0113p76r255J634o887p686m526j102k474R810m053j6567
$$ 11652 -10704 -2743 7370 6594 -2661 -1027 -7914 -15600 -20126 -21228 -23702 -13892 -17945 -34512
11824c4512J0711P567J3789o684k2729j6338J501J6439J4011j0342J7944J2910
$$ -34512 -23801 -16234 -2445 -9129 -31858 -48196 -46695 -30256 -16245 -26587 -8643 4267
11812D267L844k1858n819J2729J3187o802j0649j7166L791O315J815J3517r312
$$ 4267 8111 -13747 -19566 -6837 6350 -452 -11101 -28267 -24476 -18161 -16346 -2829 -12141
11799a2141o492o705L352J5205P516l032j2679J0182Q490l201l26K347J6111J149
$$ -12141 -18633 -25338 -21986 -6781 735 -2297 -14976 -4794 3696 495 169 2516 18627 19776
11785A9776K595j7617J099m468j7932L790J7397o501q808p69n847J4295r661N488
$$ 19776 22371 4754 5853 1385 -16547 -12757 4640 -1861 -10669 -11438 -17285 -2990 -12651 -7163
11771g163o409l505J795J0363k334p235N746m692L212K3247j9771n605K8543N043
$$ -7163 -13572 -17077 -15282 -4919 -7253 -14488 -8742 -13434 -10222 13025 -6746 -12351 16192 21235
11757B1235j7802j2668L5864m460r522j4047J0250M512J1463j1526Q898J6031
$$ 21235 3433 -9235 26629 22169 12647 -1400 8850 13362 24825 13299 22197 38228
11745C8228r482j4049j452k368j0017K2005J1222k2730k3118k312O263j048K9367
$$ 38228 28746 14697 13245 10877 860 22865 34087 11357 -11761 -14073 -7810 -8858 20509
11732B0509K8297l009r015l0992Q135R437q154o392j6234K484J1573K222j2198
$$ 20509 48806 45797 36782 5790 13925 23362 15208 8816 -7418 -4934 6639 8861 -3337
11719c337J2371L75Q680k0467j3583K3339J945K338l5364j1646K3318J9919j105
$$ -3337 9034 9409 18089 -2378 -15961 7378 9323 11661 -23703 -35349 -12031 7888 6783
11706F783o595J934m587j13J0169M467k319J805R989r049k4904L240K6356j6243
$$ 6783 188 2122 -2465 -2578 7591 12058 9739 11544 21533 12484 -12420 -9180 17176 933
11692I33R870n323J792R54K349K648k438j5155j6736Q597K098N474K4692J1794
$$ 933 10803 5480 7272 8226 10575 13223 10785 -4370 -21106 -12509 -10411 -4937 19755 31549
11678C1549p945k6498k6368J9236J5351m166j0215K2338J7208j471k2804j7910
$$ 31549 23604 -2894 -29262 -10026 5325 1159 -9056 13282 30490 29019 6215 -11695
11666a1695P627j7143R188j1424j8008l462P729J3233K2748K3705j787l327l6928
$$ -11695 -4068 -21211 -12023 -23447 -41455 -44917 -37188 -23955 -1207 22498 20711 17384 -19544
11653a9544j4319j1533J9119J0337M490P537L846j1723L735M906Q022Q249n9j7424
$$ -19544 -33863 -45396 -26277 -15940 -11450 -3913 -67 -11790 -8055 -3149 4873 13122 13063 -4361
11639d361j7365J7190K4559M202l462J3133q715r123j4890P210N665J853J5680
$$ -4361 -21726 -4536 20023 24225 20763 33896 25181 16058 1168 8378 14043 15896 31576
11626C1576r916o656r455Q83J1031p672m881j090n404r128o419J1339Q062k1838
$$ 31576 21660 15004 5549 6432 17463 9791 4910 3820 -1584 -10712 -17131 -5792 2270 -19568
11612a9568r770J1651J3575j4700R786J7354l714k3100j7716K36L9833L5099P814
$$ -19568 -29338 -17687 -4112 -18812 -9026 8328 4614 -18486 -36202 -35966 3867 38966 46780
11599D6780l9469m6698P471J8835M017K773q289k816j5052K1241L7694J08j634
$$ 46780 7311 -39387 -31916 -13081 -9064 -6291 -14580 -17396 -32448 -11207 26487 26595 24961
11586B4961j0105k0254j3611J770K3237J5972j836j5015k2385k424K041L422j357
$$ 24961 14856 -5398 -19009 -17239 5998 21970 20134 5119 -17266 -19690 -17649 -14227 -15584
11573a5584J8669J4333l41M010p361O625O623p352j3207N467J8094M211n157j3382
$$ -15584 3085 17418 17077 21087 13726 20351 26974 19622 6415 11882 29976 34187 29030 15648
11559A5648o513p980K0175L2432r15j3103l6534o007K8091J2370j0806k3244L743
$$ 15648 9135 1155 21330 53762 52847 39744 3210 -2797 25294 37664 26858 3614 7357
11546G357K0731q863n294k268N134n746J18j8413Q478J4942K7379j788r268k0702
$$ 7357 28088 19225 13931 11663 16797 11051 11169 -7244 1234 16176 43555 41767 32499 11797
11532A1797j7347M582J8125J1080q156j4043j7506K671J8160l2289k2902J6871
$$ 11797 -5550 -968 17157 28237 20081 6038 -11468 -8797 9363 -22926 -45828 -28957
11520b8957L1681j076r1j1099k1569J460J4123J410L863q293J850J5679P00N739
$$ -28957 2724 1648 1557 -9542 -31111 -29651 -15528 -14118 -10255 -18548 -16698 -1019 -319 5420
11506E420q49P324J7895k209k1495j3464R206Q680n178J0911O810J266j9585M03
$$ 5420 4571 11895 29790 27581 6086 -7378 1828 10508 5330 16241 23051 24317 4732 5135
11492E135M105M076j0140J306m183M401J778P289j420j8867k7597J0172K1085
$$ 5135 9240 13316 3176 4482 299 4700 6478 13767 12347 -6520 -34117 -23945 -2860
11479b860J5482j0201l3639r800J1774P107J9929L2709j6655j8955R223K9267
$$ -2860 12622 2421 -31218 -41018 -29244 -22137 -2208 30501 13846 -5109 4114 33381
11467C3381N904l6988k094J148o139J7401O79j6736L696L256J06m205j0364J4772
$$ 33381 39285 2297 203 1351 -4788 12613 13292 -3444 252 3508 3614 -591 -10955 3817
11453C817J8512M581L14q166j0000j9770k623N936K0696O456r486P979K0460l49
$$ 3817 22329 26910 27224 19058 9058 -10712 -13335 -7399 13297 19753 10267 18246 38706 38357
11439C8357o898j8871k3882p129J9138J0597j5144j982J5341R17P786j299M532
$$ 38357 31459 12588 -11294 -18423 715 11312 -3832 -5814 9527 10444 18230 16931 21463
11426B1463k991o093K1693P636l6287j4360k0068j3455K2622J9480K1499J3380
$$ 21463 18472 12379 34072 41708 5421 -8939 -29007 -42462 -19840 -360 21139 34519
11414C4519j938j0542M491q209r818j700j9127m103L728L2626J4477J4006m358
$$ 34519 32581 22039 26530 18321 8503 6803 -12324 -16427 -12699 19927 34404 48410 44052
11401D4052k1664j6697p191J7388J6712r04q536j8181j1371o766J9840K1474l830
$$ 44052 22388 5691 -1500 15888 32600 31696 23160 4979 -6392 -13158 6682 28156 24326
11388B4326l2543k1651q199J5621L6264J9335j1136J7170N587p675p150l0436
$$ 24326 -8217 -29868 -38067 -22446 13818 33153 22017 39187 44774 37099 29949 -487
11376d87J7233K513J0289q763p711q238K814n375n018R169p864m672J3567K1942
$$ -487 16746 19259 29548 20785 13074 4836 7650 2275 -2743 6426 -1438 -6110 7457 29399
11362B9399N622n954l5155l9264J0134J3181L1435J446N499J063Q151P734j48
$$ 29399 35021 29067 -6088 -45352 -35218 -22037 9398 10844 16343 17406 25557 33291 33143
11349C3143k1698j3357o686p930J1708O917K9329O210j3665M352K313l716L61
$$ 33143 11445 -1912 -8598 -16528 -4820 2097 31426 37636 23971 28323 30636 26920 27281
11336B7281J619J7876o388k4268N748p468L132m930N7J4755J4668n813K208m254
$$ 27281 28900 46776 40388 16120 21868 14400 17532 12602 12659 27414 42082 36269 38477 34223
11322C4223J3794k3738j4302r588J6941j5757j8273P950K8871r382j5368K03O17
$$ 34223 48017 24279 9977 389 17330 1573 -16700 -8750 20121 10739 -4629 -4426 -3809
11309c809J879J1707n51J126K3800K209J5373M824j0021n824Q348N278j4077j8801
$$ -3809 -1930 9777 9226 10352 34152 36361 51734 56558 46537 40713 49061 54339 40262 21461
11295B1461R883J0085j8494n817N601J3490j1281K922l166l396q073Q825J5842
$$ 21461 31344 41429 22935 17118 22719 36209 24928 27850 24684 21288 13215 22040 37882
11282C7882k871j133j3890p8l0138k168R352K0528R99k073Q274M506o816L221
$$ 37882 35011 33878 19988 19910 -10228 -12396 -3044 17484 18483 16410 24684 29190 22374 25595
11268B5595P564M726j1319J1862J3515j4811J1107j0242J3237J2428q656k9189
$$ 25595 33159 37885 26566 38428 51943 37132 48239 37997 51234 63662 55006 25817
11256B5817k2707K4812K1310J0658j5229j0204k1411J8708M5306K8033m191j7407
$$ 25817 3110 27922 49232 59890 44661 34457 13046 31754 77060 105093 100902 83495
11244H3495L310J5714N5496P7964J12399K00212L47976N62503O32293J60914m76604
$$ 83495 86805 102519 158015 235979 348378 548590 896566 1459069 2091362 2252276 1775672
11233A775672o12312m32353k45423j38967j10638m7194k8483k3218k4381K958
$$ 1775672 1163360 731007 485584 346617 235979 188785 160302 137084 112703 115661
11223A15661M252j8260k1235k1750p069k363M467J9760J0989k5275j6925j4212
$$ 115661 119913 101653 80418 58668 51599 49236 53703 73463 84452 59177 42252 28040
11211B8040o305L372P943Q835m627R131K0000J4863j2505K486k0946j4885Q675
$$ 28040 21735 25107 33050 41885 37258 46389 66389 81252 68747 71233 50287 35402 44077
11198D4077K887J1127J124k0232j5354k797M972j5805j0470N217j929J0095J0347
$$ 44077 46964 58091 59215 38983 23629 20832 25804 9999 -471 4746 2817 12912 23259
11185B3259m999j0195J5068J0076k8719j1121J6639j955R656O056j8336j1681
$$ 23259 18260 8065 23133 33209 4490 -6631 10008 8053 17709 23765 5429 -6252
11173f252P137L516J81J4483K9651o156n380j5239j3228J8284J4129j7350o131
$$ -6252 885 4401 4582 19065 48716 42560 37180 21941 8713 26997 41126 23776 17645
11160A7645J1551n34o298r748K192R448J5115j0075j03Q33j0291l93o024J5618
$$ 17645 29196 28662 22364 12616 14808 24256 39371 29296 29193 30026 19735 19342 13318 28936
11146B8936j305K7027J9186O443J585j0059k6294l4902L156J0590M203L1314J4988
$$ 28936 27631 54658 73844 80287 81872 71813 45519 10617 13773 24363 28566 59880 74868
11133G4868r380k302N672n173j8163m0637K882q296j018J8301R795r667n386j2808
$$ 74868 65488 63186 68858 63685 45522 4885 7767 -529 -1547 16754 26549 16882 11496 -1312
11119a312L412J0452K6571K0308Q89j7459m183K1663P833j4875M296q240k2495
$$ -1312 2100 12552 39123 59431 60320 42861 38678 60341 68174 53299 57595 49355 26860
11106B6860P404j6L678L53j2422k698J1500M993j463j0973n275R740P794n50q549
$$ 26860 34264 34248 37926 38279 25857 23159 34659 39652 38189 27216 21941 31681 39475 38925 30376
11091C0376J9453l041j155M8775N4149R5800R0798K1361k6900p0527n7478l2844
$$ 30376 49829 46788 45633 94408 148557 244357 335155 356516 329616 259089 201611 168767
11079A68767l0498m0299k4481o615k7539j1533N548Q694O126R379j1793k4223
$$ 168767 138269 97970 73489 66874 39335 27802 33350 42044 48170 57549 45756 21533
11067B1533j4903p92J6352K6365J1245n556Q134p523J5264n494j3377J2651J0472
$$ 21533 6630 5838 22190 48555 59800 54244 62378 54855 70119 64625 51248 63899 74371
11054G4371q627m3418l9799J0027Q647K4629L4802Q108K246k8411j4117L694J2898
$$ 74371 65744 22326 -17473 -7446 1201 25830 60632 68740 70986 42575 28458 32152 45050
11041D5050J8633r460j1089L136m363j5073m0065k2317J7331K8531J0084m811
$$ 45050 63683 54223 43134 46270 41907 26834 -13231 -35548 -18217 10314 20398 15587
11029A5587j7758J5071N4208K919j6569r787J0682K6159m356k0320p66k1710o861
$$ 15587 -2171 12900 67108 70027 53458 43671 54353 80512 76156 55836 55070 33360 26499
11016B6499k36L529l612q358r927J7212L220p229r810k294J4548K2572k496n370
$$ 26499 26263 29792 26180 17822 7895 25107 28327 21098 11288 8994 23542 46114 43618 38248
11002C8248m52m72j6932K1310P280m172l5768M357k128j0437O614m062M818K2099
$$ 38248 37796 37324 20392 41702 48982 44810 9042 13399 11271 834 7448 3386 8204 30303
10988C0303o266P717K1119K1976J1835Q014j2106k9332q248k2415j1068n372p919
$$ 30303 24037 31754 52873 74849 86684 94698 82592 53260 45012 22597 11529 6157 -1762
10975a762l888K8190j3038j2266J5543J3690R334N171j7855j6575k0697m3825
$$ -1762 -5650 22540 9502 -2764 12779 26469 35803 40974 23119 6544 -14153 -57978
10963e7978m4586k0953p5539j26475j39848k8180J85411K84398K13171O3866l111
$$ -57978 -102564 -123517 -199056 -325531 -465379 -493559 -308148 -23750 189421 253287 250176
10952B50176j187L193o729j274j8594k0444j5672j7007k3305L0947J9903j2325
$$ 250176 248989 252182 245453 244179 225585 205141 189469 172462 149157 180104 200007 187682
10940A87682k8806q056L298K6309K8064J490o894j1415M051K595P327q419K4151
$$ 187682 158876 150820 154118 180427 208491 209981 203087 191672 195723 198318 205645 197226 221377
10927B21377K3070J0047l46M607k2011j1595k0122M339j5834j7746o883J0894
$$ 221377 244447 254494 254148 258755 236744 225149 205027 209366 193532 175786 168903 179797
10915A79797j122M281p764M163J3572K5233K6255K2750M429k2382r447J4049L682
$$ 179797 178675 182956 175192 179355 192927 218160 244415 267165 271594 249212 239765 253814 257496
10902B57496n947j7204J4754O537j886k153K2323L0908N076K415K7797K0414J4373
$$ 257496 251549 234345 249099 255636 253750 251597 273920 304828 309904 312319 340116 360530 374903
10889C74903M037K8919J5436J4849M4966Q9090P4568M8902L3499j041O93K6909
$$ 374903 378940 407859 423295 438144 483110 572200 646768 695670 729169 728128 728821 755730
10877G55730J9515k0132j9772J6546L9833J2333J6401N5872P3827P8924O9185
$$ 755730 775245 755113 735341 751887 791720 804053 820454 876326 950153 1029077 1098262
10866A098262N9164N9720M4716O4908N4245J17894J50048J83991J79435J46895
$$ 1098262 1157426 1217146 1261862 1326770 1381015 1498909 1648957 1832948 2012383 2159278
10856B159278J63123K28713K71431L24160M98856Q63525J064231O64392J18089
$$ 2159278 2322401 2551114 2822545 3146705 3645561 4509086 5573317 6237709 6355798
10847F355798R6763L81531O99585J114433J643594K248653L014556M129499N860215
$$ 6355798 6452561 6834092 7533677 8648110 10291704 12540357 15554913 19684412 25544627
10838B5544627Q556317J2883664J9907229L2577161N8911790J03619358J18548799
$$ 25544627 34100944 46984608 66891837 99468998 158380788 262000146 380548945
10831C80548945K6856522r1325087j14686794p6773887m2142910k4045193j4898285
$$ 380548945 407405467 316080380 201393586 124619699 82476789 58431596 43533311
10824D3533311r707324o726795m968326l760170k808676k150145j801700j545810
$$ 43533311 33825987 27099192 22130866 18370696 15562020 13411875 11610175 10064365
10816A0064365j228547q06379m09079p5751j30287p40573j168070j008880p01377
$$ 10064365 8835818 8029439 7620360 7544609 7414322 6673749 5505679 4496799 3795422
10807C795422m86679m27976l52545k58678j63631j21858j32596j52431j37889
$$ 3795422 3308743 2880767 2528222 2269544 2105913 1984055 1851459 1699028 1561139
10798A561139j32657j25907j13253p6899l4676k2711k7461o0633r0400o1299q0857
$$ 1561139 1428482 1302575 1189322 1112423 1077747 1055036 1027575 966942 876542 815243 734386
10787G34386o5551o1672o5050l6474m7293n9484l5499O547L8982L4262Q529O661
$$ 734386 668835 607163 542113 505639 458346 398862 363363 369910 408892 443154 451683 458344
10775D58344j6727j1848k8822l6196K0611L237O679L445R142j4644m3480r987
$$ 458344 441617 429769 400947 364751 385362 388599 395278 398723 407865 393221 349741 339754
10763C39754q009j498p769J6063m000l7253j9135j1129j1844l1419j839K0999
$$ 339754 331745 330247 322478 338541 334541 297288 278153 267024 255180 223761 221922 242921
10751B42921O502J6433j5105k4786j3780n507q684o243J772j8299J0300R030k3975
$$ 242921 249423 265856 250751 225965 212185 206678 197994 191751 193523 175224 185524 194554 170579
10738A70579n9179l9171j8602j5281L5663M9888J7659K4313J386l579k4487J395
$$ 170579 111400 72229 53627 38346 74009 123897 141556 165869 167255 163676 139189 140584
10726A40584j4453k7074K54p681K36j0038j0974j8797k0259p713j0900p618k089
$$ 140584 126131 99057 99311 91630 91866 81828 70854 52057 31798 24085 13185 5567 3478
10713C478r692l626k363j6094J0253K9766J08657K67732K80640N7768j30572j11115
$$ 3478 -6214 -9840 -12203 -28297 -18044 11722 120379 388111 668751 726519 595947 484832
10701D84832q6048o2706m4301k9070k7942l5846l7502j9555j6598o843j284K3102
$$ 484832 398784 336078 291777 262707 234765 198919 161417 141862 125264 118421 117137 140239
10689A40239J5571O775j147p412j7700k104q252J783j2051l686Q243J0425Q410
$$ 140239 155810 162585 161438 154026 136326 134222 125970 127753 115702 112016 120259 130684 139094
10676A39094j1711l298j5718k4292L778N245j6829j1358o31m078J0282K1492n044
$$ 139094 127383 124085 108367 84075 87853 93098 76269 64911 64280 60202 70484 91976 86932
10663H6932l405Q472j3370K437j9408m260J4694J9878o849l7537l9721l959J2136
$$ 86932 83527 91999 78629 81066 61658 57398 72092 91970 85121 47584 7863 3904 16040
10650A6040J7671J7845L066j8317l706N619J884j4496j9380J7475K3448k856l194
$$ 16040 33711 51556 54622 36305 32599 38218 40102 25606 6226 23701 47149 44293 41099
10637D1099j1091J6592K5410O617p454q59J9164L389J657j6769l6142k1765O694
$$ 41099 30008 46600 72010 78627 71173 70314 89478 92867 94524 77755 41613 19848 26542
10624B6542J5184N205J937l686M874L033j7468j1304J148N940J8453R62O904n136
$$ 26542 41726 46931 48868 45182 50056 53089 35621 24317 25465 31405 49858 50820 57724 52588
10610E2588l1149j4746J356q979L141O621j3734j1294J970K8838K6064M534p345
$$ 52588 21439 6693 8049 -930 2211 8832 -4902 -16196 -14226 14612 40676 45210 37865
10597C7865m00N289j9830J3901J553M750j8952k2995j5905j4974r696O324K4972
$$ 37865 37465 42754 22924 36825 38378 43128 24176 1181 -14724 -29698 -39394 -33070 -8098
10584h098j501k6971J0396J0565L477o561l428P844J5437j382M279j0683m74J4916
$$ -8098 -9599 -36570 -26174 -15609 -12132 -18693 -22121 -14277 1160 -222 4057 -6626 -7100 7816
10570G816q857q037q78Q331p459J4154j4324k362J9726J3006j4518j9096J3513
$$ 7816 -1041 -9078 -9956 -1625 -9084 5070 -9254 -11616 8110 21116 6598 -12498 1015
10557A015L3140L826r749k6019Q82K1794J2308j7539L041L448p536N121K534r307
$$ 1015 34155 37981 28232 2213 3095 24889 37197 19658 22699 26147 18611 23732 26266 16959
10543A6959j1536J392K6732J8931j0082r394O190r326k8838j4878j0441J978J0001
$$ 16959 5423 6815 33547 52478 42396 33002 39192 29866 1028 -13850 -24291 -22313 -12312
10530a2312J1661K8378J6962O25m522q768k9416l4449j2772M271O139p498M849
$$ -12312 -651 27727 44689 45314 40792 32024 2608 -31841 -44613 -40342 -34203 -41701 -36852
10517c6852J6794J6997R692j5980k10P205K6841J0775P781L16j6086l4250R685
$$ -36852 -20058 -3061 6631 -9349 -9559 -2354 24487 35262 43043 43359 27273 -6977 2708
10504B708j843j4954K0506n768j0697K292M069m770J6627J1563k889O71J4353
$$ 2708 865 -14089 6417 649 -10048 -7756 -3687 -8457 8170 19733 16844 17515 31868
10491C1868m61n853j1683j7496k2624K549M296K2270J1843r160j2104j6093m277
$$ 31868 31407 25554 13871 -3625 -26249 -23700 -19404 2866 14709 5549 -6555 -22648 -26925
10478b6925J7174K2748K054j18N181j1460j3307O723M4014P929r323k454o017
$$ -26925 -9751 12997 15051 14933 20114 8654 -4653 2070 46084 54013 44690 42236 36219
10465C6219j4891j2957M057Q898P932L131J5002l196r999j8617j8658m221J1422
$$ 36219 21328 8371 12428 21326 29258 32389 47391 44195 34196 15579 -3079 -7300 4122
10452D122j660r391n30J4030J515q509K8046l531l395J1879q754O369J3464J0355
$$ 4122 2462 -6929 -7459 6571 8086 -423 27623 24092 20697 32576 23822 30191 43655 54010
10438E4010j2520k374O170J0595J809N748J2982L3450M1156O0968N6769R1305
$$ 54010 41490 39116 45286 55881 57690 63438 76420 109870 151026 211994 268763 360068
10426C60068J53156K92931N03458O52008L06618l68458o54749m80898k68951j26916
$$ 360068 513224 806155 1309613 1961621 2268239 1899781 1245032 764134 495183 368267
10416C68267j00106o6905k6581k8142j9150r189j6012k8651j6560k5060R813J2489
$$ 368267 268161 201256 174675 146533 127383 118194 102182 73531 56971 31911 41724 54213
10404E4213J1878J3796N683j7296k5753j8281m164J5884J4902j3061N395p93k5906
$$ 54213 66091 79887 85570 68274 42521 24240 20076 35960 50862 37801 43196 42403 16497
10391A6497l553k731q27P041k549O150J1490O240M211j6092P439L382K497j836
$$ 16497 12944 10213 9386 16427 13878 20028 31518 37758 41969 25877 33316 36698 39195 37359
10377C7359k395j9424j2877j7643n115J8267J323j7055m115M0785q920k2519L411
$$ 37359 34964 15540 2663 -14980 -20095 -1828 -505 -17560 -21675 19110 10190 -12329 -8918
10364h918J6150J7915J46j6454N461K2439j7399k1286K261k709R038J7991Q172
$$ -8918 7232 25147 25293 8839 14300 36739 19340 -1946 315 -2394 6644 24635 32807
10351C2807k5197j0415l84J1856O815O177R109j8090k9808J2449J3157J9023L142
$$ 32807 7610 -2805 -3189 8667 15482 21659 30768 12678 -17130 -4681 8476 27499 30641
10338C0641l2203j7080P19m879M560j232m240k246L362j912k263K967J0554K132
$$ 30641 -1562 -18642 -17923 -22802 -18242 -19474 -23714 -25960 -22598 -24510 -26773 -23806 -13252 -11120
10324a1120n521j3631K2425J4644j0806j4368P138K682l85L707J1605J6360j070
$$ -11120 -16641 -30272 -7847 6797 -4009 -18377 -11239 -8557 -8942 -5235 6370 22730 21660
10311B1660n839O684J2021M093q640m523j4048j7165k1665L862P054J8217J76
$$ 21660 15821 22505 34526 38619 29979 25456 11408 -5757 -27422 -23560 -16506 1711 1887
10298A887j503R412j403j1083J023r139q004L5530J4575j6899j3372k1252J0836
$$ 1887 384 9796 8393 -2690 -1667 -10806 -18810 16720 31295 14396 1024 -20228 -9392
10285i392J4597k095r105p578p058o967J3312j335K909k11n075K411J7401o194
$$ -9392 5205 3110 -5995 -13573 -20631 -27598 -14286 -15621 -12712 -12923 -17998 -15587 1814 -4380
10271d380Q070K7361l881j3236o55J3047r816j3403L762j3546r521O174J0183
$$ -4380 3690 31051 27170 13934 13279 26326 16510 3107 6869 -6677 -16198 -10024 159
10258A59P129o581N06j3820J6125l25J1925n481l3590j3937K6468J2786J9319
$$ 159 7288 707 1213 -12607 3518 3193 15118 9637 -23953 -37890 -11422 1364 20683
10245B0683P75j6187j0208j5410k5013P874J3861L8970J419j2498l2398k52N418
$$ 20683 21458 5271 -4937 -20347 -45360 -37486 -23625 15345 16764 4266 -28132 -28384 -22966
10232b2966M181L1273J5729j5617P310n865P89r26P25j733J442R929k3711j0062
$$ -22966 -18785 12488 28217 12600 19910 14045 14834 13908 14633 12900 14342 24271 560 -9502
10218i502Q018R217N72j0584j2638j3332j117J150J0166j3606R210P803k1657
$$ -9502 -1484 7733 8305 -2279 -14917 -28249 -29366 -28216 -18050 -31656 -22446 -14643 -36300
10205c6300K0482J795n688r404j636j228K656L4298K1429J3167j1069l3930J0045
$$ -36300 -15818 -14023 -19711 -29115 -30751 -31979 -29323 4975 26404 39571 28502 -5428 4617
10192D617J3698j0871M276j2005j8441j5161J1033J9645n840r231q369j767M68
$$ 4617 18315 7444 11720 -285 -18726 -33887 -22854 -3209 -9049 -18280 -26649 -28416 -27948
10179b7948J1032o305K3137J0265j900j973o620K3271J3139r806k909p245Q101
$$ -27948 -16916 -23221 -84 10181 8281 6308 -312 22959 36098 26292 23383 16138 24239
10166B4239m100l528J4905J0431K1188M6201L7971L7455L546n2391m3465j2963
$$ 24239 20139 16611 31516 41947 63135 109336 147307 184762 188308 135917 92452 79489
10154G9489Q90j2552J942J9039O0345N2362M90m0838m7368m2857l3542o683R344
$$ 79489 80379 67827 69769 88808 149153 201515 202005 161167 113799 70942 37400 30717 40061
10141D0061j8327J0526O010j7622k2847j7558J3293m458J0416J8254m844r245
$$ 40061 21734 32260 38270 20648 -2199 -19757 -6464 -10922 -506 17748 12904 3659
10129C659l481m037j2210O083J9214J0009l152j5770k1738m041K3143J1371r961
$$ 3659 178 -3859 -16069 -9986 9228 19237 16085 315 -21423 -25464 -2321 9050 -911
10116i11k1703q402J1179R37J5898L914j739J0181q629K236j5049R954p624M919
$$ -911 -22614 -31016 -19837 -18900 -3002 912 -827 9354 725 2961 -12088 -2134 -9758 -4839
10102d839J8894o407j0589P135j195J2193L868N883J379J1182k3928j1076L173
$$ -4839 14055 7648 -2941 4194 2999 15192 19060 24943 26322 37504 13576 2500 5673
10089E673q932J262k858l445k1421J6235J2565K085j337Q54R414j4783p87J4666
$$ 5673 -3259 -1997 -4855 -8300 -29721 -13486 -921 1164 -173 681 10095 -4688 -5475 9191
10075I191J7653o141R64J369M307J1434p877j0630n598j9275j4838M993J0822
$$ 9191 26844 20703 21667 23036 27343 38777 30900 20270 14672 -4603 -19441 -14448 -3626
10062c626L4745L064k129O154m74K0551O2283O9488Q5457J7560n5126p0133l6133
$$ -3626 31119 34183 32054 38208 37734 58285 120568 190056 275513 293073 237947 167814 131681
10049A31681l7111l7320p122o724j1232J0357M643O468K788j9231q264J726j2842
$$ 131681 94570 57250 50128 43404 32172 42529 47172 53640 56428 37197 28933 30659 17817
10036A7817j1657O768J4522J504P164Q787N363M405j9059J984j8625O925J596
$$ 17817 6160 12928 27450 28954 36118 44905 50268 54673 35614 37598 18973 25898 27494
10023B7494k6793J1998L499j7703J8105N989j8645j4880J7644p306N296K478k3389
$$ 27494 701 12699 16198 -1505 16600 22589 3944 -10936 6708 -598 4698 7176 -16213
10010a6213J0335R688L989j3951l282M768J3990O047P59L291P151k1205l561L491
$$ -16213 -5878 3810 7799 -6152 -9434 -4666 9324 15371 16130 19421 26572 5367 1806 5297
9996E297J3201K941q939J01j5287J2141j340j3125j1652J950J7160N780O018J0206
$$ 5297 18498 21439 12500 12601 -2686 9455 8115 -5010 -16662 -14712 2448 8228 14246 24452
9982B4452K7663O027k6136j1287J7473J2987m375p214J1908J1375j0016k6904
$$ 24452 52115 58142 32006 20719 38192 51179 46804 39590 51498 62873 52857 25953
9970B5953l77P030P76j8961p86l302j248P510j2778K0662J3373p632j4058j7386
$$ 25953 25576 32606 33382 14421 13635 10333 9085 16595 3817 24479 37852 30220 16162 -1224
9956a224o598P365J3541J2650J0641n998j3278p683O726J9402r105j5120k1907
$$ -1224 -7822 -457 13084 25734 36375 30377 17099 9416 16142 35544 26439 11319 -10588
9943a0588o729K3236M107N770j190R941J7999J144j6066N545k672K3055J7202
$$ -10588 -17317 5919 10026 15796 14606 24547 42546 43690 27624 33169 30497 53552 70754
9930G0754n820j1327l6661k3103M815Q080m358j9503J7136M183M214J3978j2692
$$ 70754 64934 53607 16946 -6157 -1342 6738 2380 -17123 13 4196 8410 22388 9696
9917I696K999K0813l887k6110k4810j7968K0019J6047J6319m854k7030k110J7403
$$ 9696 12695 33508 29621 3511 -21299 -39267 -19248 -3201 13118 8264 -18766 -20876 -3473
9904c473L397n25M344n98O591Q775p204l833K4231K6023L853l4217l3134n652
$$ -3473 -76 -601 3743 3145 9736 18511 11307 7474 31705 57728 61581 27364 -5770 -11422
9890a1422j4241O438K920N592K6201J4076j4215Q441K8113M846j3617k1174k1628
$$ -11422 -25663 -19225 -16305 -10713 15488 29564 15349 23790 51903 56749 43132 21958 330
9877C30N177l874n896q943j3036p457K653J0256J8517K0887r728R420J2606j48
$$ 330 5507 1633 -4263 -13206 -26242 -33699 -31046 -20790 -2273 18614 8886 18306 30912 30764
9863C0764l9608k960K7685J798q916J842L0062J3702j6675n568j3545k0684K866
$$ 30764 -8844 -11804 15881 17679 8763 10605 40667 54369 37694 32126 18581 -2103 763
9850G63Q662k277K971j1401j0227J6428K9504j0483j6127o630n175N618M264Q993
$$ 763 9425 7148 10119 -1282 -11509 4919 34423 23940 7813 1183 -3992 1626 5890 14883
9836A4883L484K50J949j2602J6449j082j092R131p181N432q447j5096K450R393
$$ 14883 18367 18617 20566 7964 24413 23331 22239 31370 24189 29621 21174 6078 8528 17921
9822A7921q083j139L675j6455j6021K1923J1949k7040P367l433k6316N920K8411
$$ 17921 9838 8699 12374 -4081 -20102 1821 13770 -13270 -5903 -9336 -35652 -29732 -1321
9809a321J1767P191J1066j0530j5091j036K190J7876L2898j4972j989L448k0213
$$ -1321 10446 17637 28703 18173 3082 2046 4236 22112 55010 40038 38049 41497 21284
9796B1284j9917j2040J553L048m818k5J705K9332J4772j788p428k1158L063J3690
$$ 21284 1367 -10673 -9120 -6072 -10890 -10915 -9210 20122 34894 33106 25678 4520 7583 21273
9782B1273k1k2173r880L718m343K0699j479P698j3922j1365J4452P537j2312m356
$$ 21273 21252 -921 -10801 -7083 -11426 9273 7794 15492 1570 -9795 4657 12194 -118 -4474
9768d474k425L723M990J6366Q079n92j477j2095o856K2458J2990L515j7115k1165
$$ -4474 -6899 -3176 1814 18180 26259 25667 24190 12095 5239 27697 40687 44202 27087 5922
9754E922q964J6334L577K02l33N905q510r638J2888J4939l973q101N605J0666
$$ 5922 -3042 13292 16869 17071 16738 22643 14133 4495 17383 32322 28349 20248 25853 36519
9740C6519k334N544M90q559j4586q271O360J5083Q232p236j8909J409O989k095
$$ 36519 34185 39729 40219 31660 17074 8803 15163 30246 38478 31242 12333 13742 20731 18636
9726A8636j1420j0863q387J1164J7889J1533l577j3434J428j212k3779q235j062
$$ 18636 7216 -3647 -12034 -870 17019 28552 24975 11541 12969 11757 -12022 -20257 -21319
9713b1319p977L6563L5866j5945p018k84j6438q327J3189l011l248K1455J3812
$$ -21319 -29296 7267 43133 27188 20170 19886 3448 -4879 8310 5299 2051 23506 37318
9700C7318O918m490k6900k196K0450l633l265J4772j0904j3392k875K371m885
$$ 37318 44236 39746 12846 10650 31100 27467 24202 38974 28070 14678 11803 14174 9289
9687I289j795j448n512P577K6306J889L687Q325n629j4651L017n063K2001J0353
$$ 9289 7494 6046 534 8111 34417 36306 39993 48318 42689 28038 31055 25992 47993 58346
9673E8346M595k0229j8410j9875j896n027J8577J1394M153k35J832j6677j7252
$$ 58346 62941 42712 24302 4427 2531 -2496 16081 27475 31628 31393 33225 16548 -704
9660g04k714j13N308J4280Q164j0814M275K830J8152m351k8679O064j4652M331
$$ -704 -3418 -3531 1777 16057 24221 13407 17682 20512 38664 34313 5634 11698 -2954 1377
9646A377Q662o669j0246k346K640K053L31O571R583j1018n438J1835m715k415
$$ 1377 10039 3370 -6876 -9222 -6582 -4529 -4198 2373 11956 938 -4500 7335 2620 205
9632B05J3125K5118j0710k6328q828J4848J1053O564J0408J1962j7692k2378J3892
$$ 205 13330 38448 27738 1410 -7418 7430 18483 25047 35455 47417 29725 7347 21239
9619B1239J0583k181j9607L784J1132J1705k098k0463M859R93L000N367j5915
$$ 21239 31822 29641 10034 13818 24950 36655 34557 14094 18953 19946 22946 28313 12398
9606A2398j4048j446J0662J7917J1462j318P846j4447k3756l844k004J912M845
$$ 12398 -1650 -3096 7566 25483 36945 35627 43473 29026 5270 1426 -578 1334 6179
9593F179Q993j603j8376O572J1793J51j6690K632J9126J3204j5911J1823J8956
$$ 6179 15172 13569 -4807 1765 13558 13709 -2981 -349 18777 31981 16070 27893 46849
9580D6849R970n882k7045j8134K5303R273k214m905l489J2678J0129k6922j2980
$$ 46849 56819 50937 23892 5758 31061 40334 38120 33215 29726 42404 52533 25611 12631
9567A2631k3524N320K7311R718J0638Q367J4860j9923k4641j3258O893K0230K472
$$ 12631 -10893 -5573 21738 31456 42094 50461 65321 45398 20757 7499 14392 34622 37094
9554C7094K6401J7055j4471o58k1621n620P264Q346K903J8472q939j3923j3248
$$ 37094 63495 80550 66079 65421 43800 38180 45444 53790 56693 75165 66226 52303 39055
9541C9055m888J3033p12P389n679o130J2456J6371q194l5530n187K0012Q873L736
$$ 39055 34167 47200 46488 53877 48198 42068 54524 70895 62701 27171 21984 41996 50869 54605
9527E4605k0555l693m508J7614J8043k6095n012K2780J34p855P993j2917L874
$$ 54605 34050 30357 25849 43463 61506 35411 30399 53179 53313 45458 53451 40534 44408
9514D4408L781l819j1982j1766J4752N526j4202R712J870K11K128k5074j1538
$$ 44408 48189 44370 32388 20622 35374 40900 26698 36410 38280 38491 40619 15545 4007
9501D007Q8L324J3914L1313n04j1649j2284m217j3711O982N407J2703N467j2514
$$ 4007 4095 7419 21333 52646 52142 40493 28209 23992 10281 17263 22670 35373 40840 28326
9487B8326p847L442k166n55L799j970J1205K5140r394k425p316J422q504J1098
$$ 28326 20479 23921 21755 21200 24999 23029 34234 59374 49980 47555 40239 41661 33157 44255
9473D4255L906R710L302R470r123k8767p306O10J4524O486l359j0954r772P704
$$ 44255 48161 57871 61173 70643 61520 32753 25447 26057 40581 47067 43708 32754 22982 30686
9459C0686M097j0242n863J4541O141O234j5873o931J0146n093m856N175Q969o571
$$ 30686 34783 24541 18678 33219 39360 45594 29721 22790 32936 27843 22987 28162 37131 30560
9445C0560M100O943J2317j7326k0152K1809J7629J0958j0231k976J5676j0560
$$ 30560 34660 41603 53920 36594 16442 38251 55880 66838 56607 53631 69307 58747
9433E8747M232Q341j4491k0525Q59n406j0437l418R879K1993K5029Q352o65j8643
$$ 58747 62979 71320 56829 36304 37163 31757 21320 17902 27781 49774 74803 83155 82490 63847
9419F3847Q074j926N275O189j4710k8611M53K3091L723j9827K401Q952l349p20
$$ 63847 71921 69995 75270 81459 66749 38138 38591 61682 65405 45578 47979 56931 53582 52862
9405E2862j338l7038p970Q868J820J0839j7980l467J4839J0947o712J2861l609
$$ 52862 51524 14486 6516 15384 17204 28043 10063 6596 21435 32382 25670 38531 34922
9392C4922J6320K4833Q8j2445j5329J1027K7392o366j7441p912K981j1423j222
$$ 34922 51242 76075 76163 63718 48389 59416 86808 80442 63001 55089 58070 46647 45425
9379D5425J9104j602r135k493N245O977j977j626L255J5842J9806k503L655k2484
$$ 45425 64529 62927 53792 51299 56544 63521 61544 59918 63173 79015 98821 96318 99973 77489
9365G7489q854m077J017P240O657J987l3588J1962K0841J5911J8470j6934j1497
$$ 77489 68635 64558 65575 72815 79472 81459 47871 59833 80674 96585 115055 98121 86624
9352H6624j8062k618j3542n435j7247j5599P757R548K436j8414Q334k27J0377
$$ 86624 68562 65944 52402 46967 29720 14121 21878 31426 33862 15448 23782 23555 33932
9339C3932J2000J8894J0389J1625P00P436j1921j6282o520J5645J0518L57j1559
$$ 33932 45932 64826 75215 86840 87540 94976 83055 66773 60253 75898 86416 86773 75214
9326G5214J2091N921K204L306K44k650k6751o239L507J0010K1674J3483j0827
$$ 75214 87305 93226 95430 98736 98980 96330 69579 63340 66847 76857 98531 112014 101187
9313A01187j2079K51K692P755k307j5597J1064J8464L641R5n278o471j1464k849
$$ 101187 89108 89359 92051 99806 97499 81902 92966 111430 115071 115166 109888 103417 91953 89104
9299H9104l849j195J387r921q564J041M414Q980J0044j8961l374J2060k889J0931
$$ 89104 85255 84060 85447 75526 66962 68003 72417 81397 91441 72480 69106 81166 78277 89208
9285H9208R807j4924n518K368J7171p694k0004M166J2503J7924K020K130j644
$$ 89208 99015 84091 78573 80941 98112 90418 70414 74580 87083 105007 107027 109157 107513
9272A07513p239k9263j0722k2092J4098J4825K2478Q30r248m59O491L345K361
$$ 107513 100274 71011 60289 38197 52295 67120 89598 90428 81180 80721 87212 90557 92918
9259I2918K1795j2619j9394j0040L3540R924O500J1793J9262m937j0924k7377
$$ 92918 114713 102094 82700 72660 106200 116124 122624 134417 153679 148742 137818 110441
9247A10441k6106j3972J4938K0402K9015j5272o478n228J1658p360J4189J0904
$$ 110441 84335 70363 85301 105703 134718 119446 112968 107740 119398 112038 126227 137131
9235A37131n328O89J1798q298k9657M880R169k5331l1873J4146K1090J0446K755
$$ 137131 131803 132492 144290 135992 106335 111215 120384 95053 63180 77326 98416 108862 111617
9222A11617p296k477J1079M112j6271l937N194K287O072J0906R802J9853M60l7062
$$ 111617 104321 101844 112923 117035 100764 96827 102021 104308 110380 121286 131088 150941 151401 114339
9208A14339k0996J2853O38M251K1407J4550k828j2461K0690o043l8812k6885L1043
$$ 114339 93343 106196 106834 111085 132492 147042 144214 131753 152443 146400 107588 80703 111746
9195A11746J0583Q726J7463N048l1268o422j3427k115J1909N330o793K501Q778
$$ 111746 122329 131055 148518 153566 122298 115876 102449 100334 112243 117573 110780 113281 122059
9182A22059O296J1527P334m532n575J938J0874j708J5755J6290j7530j9309j1275
$$ 122059 128355 139882 147216 142684 137109 139047 149921 148213 163968 180258 162728 143419 132144
9169A32144r013j4479O215N788K0436J1317p247Q223r384O244K0520R440K237
$$ 132144 123131 108652 114867 120655 141091 152408 145161 153384 144000 150244 170764 180204 182441
9156A82441k217J5004K8288J6244J584l3722P196M8683L6218M5106R3967J27863
$$ 182441 180224 195228 223516 239760 241344 207622 214818 263501 299719 344825 438792 566655
9144E66655J35478R0198j7064j12600j43029q9382n3693n0628n7904l1639k0756
$$ 566655 702133 792331 775267 662667 519638 430256 376563 325935 268031 236392 215636
9133B15636j1642k235j8261p683m89N879N54L347m133o293j2100p211k4018l334
$$ 215636 203994 201759 183498 175815 175326 181205 181759 185106 180973 174680 162580 155369 131351 128017
9119A28017J4177j2866L248L3869J0788p160O082o492j1180O610j3562k7544M427
$$ 128017 142194 129328 132576 166445 177233 170073 176155 169663 158483 165093 151531 123987 128414
9106A28414m943n592m386j6766p494K4440n325J2143K2259n598j6649K645K1765
$$ 128414 123471 117879 113493 96727 89233 113673 108348 120491 142750 137152 120503 123148 144913
9093A44913J4081k6275k9015o086n701L010j2816L940q858N185J5778Q589R382
$$ 144913 158994 132719 103704 97618 91917 94927 82111 86051 77193 82378 98156 106745 116127
9080A16127r410k3683J7396K8792q780j1664J8038p744J199P499k2835j5020J9801
$$ 116127 106717 83034 100430 129222 120442 108778 126816 119072 120271 127770 104935 89915 109716
9067A09716J8648r170J914j5335m292J5999J3929j7754k1522L542k577K0216O773
$$ 109716 128364 119194 121108 105773 101481 117480 131409 113655 92133 95675 93098 113314 120087
9054A20087m057j3929j27K3943l783M245K993R090m101j6576N136Q106K551k3938
$$ 120087 116030 102101 101974 125917 122134 126379 129372 138462 134361 117785 122921 131027 133578 109640
9040A09640k3041N541K3121K2101p041J024O332o895k4781j0916J45K550n278
$$ 109640 86599 92140 115261 137362 130321 131345 137677 130782 106001 95085 95230 97780 92502
9027I2502J6852p505j0322J4946K7085K6150r400k6641Q734J2871k3014n0057
$$ 92502 109354 101849 91527 106473 133558 159708 150308 123667 132401 145272 122258 72201
9015G2201j6055P558K3556R215o571K987J772k6034q534L4304J3850M083R006
$$ 72201 56146 63704 87260 96475 89904 92891 94663 68629 60095 94399 108249 112332 121338
9002A21338J1885k592j440n943l1785J90l007J7875J2788k3424m796J1295P76
$$ 121338 133223 130631 129191 123248 91463 91653 88646 106521 119309 95885 91089 102384 103160
8989A03160J482q69r207j182j7018k096j6061p704k0772O613L2690J9905M85J0021
$$ 103160 104642 103773 94566 93384 76366 74270 58209 50505 29733 36346 69036 88941 89426 99447
8975I9447k842j3870m843l928k0041k2667j415J0560O381J4353J7267m225p032
$$ 99447 96605 82735 77892 73964 53923 31256 29841 40401 46782 61135 78402 74177 67145
8962F7145j2224J1915P345p916J5740j0839j8692J3663j8948k4433K193J8891
$$ 67145 54921 66836 74181 66265 82005 71166 52474 66137 47189 22756 24949 43840
8950D3840l061L377J4340m024J9613K5695j0138R808j1351R984J3087j7014k746
$$ 43840 40779 44156 58496 54472 74085 99780 89642 99450 88099 98083 111170 94156 91410
8937I1410j2490j1910k237N645P400j2215NP328r956k3614q683J2427m648r133
$$ 91410 78920 67010 64773 70418 77818 65603 65608 72936 62980 39366 30683 43110 38462 29329
8923B9329o129K6847P008J2254Q278K284L810j0029j1677j4427L602J4559J8060
$$ 29329 23200 50047 57055 69309 77587 79871 83681 73652 61975 47548 51150 65709 83769
8910H3769j1233J6356j2476k3273j2283J434L201j712p447J7450N756k202N030
$$ 83769 72536 88892 76416 53143 40860 42294 45495 43783 36336 53786 59542 57340 62370
8897F2370m110j233j724J8998q483q280M060j5433N137j0641J0542K696j8551
$$ 62370 58260 57027 55303 74301 65818 57538 61598 46165 51302 40661 51203 53899 35348
8884C5348M675J3416n195J061L763r009j9030l64K6438O518J0083r341l0522k700
$$ 35348 40023 53439 48244 49305 53068 44059 25029 24665 51103 57621 67704 58363 27841 25141
8870B5141K9975J5875o294j3434M26k44K4786k670j4503M619p217m992J160n305
$$ 25141 55116 70991 64697 51263 51689 51445 76231 73561 59058 63677 56460 51468 52628 47323
8856D7323r721j0390j9331j876K8156J0378J0647j4225j9389q872K1897K0737
$$ 47323 37602 27212 7881 6005 34161 44539 55186 40961 21572 12700 34597 55334
8844E5334m822k6685j1339J7177K0046J435O886o441p237K2395J3295J66K505
$$ 55334 50512 23827 12488 29665 49711 51146 58032 51591 44354 66749 80044 80210 82715
8831H2715j8341j0948k759O891R756k0572l523o617L764J338j9642j2042o531
$$ 82715 64374 53426 50667 57558 67314 46742 43219 36602 40366 41704 22062 10020 3489
8818C489j129J1959o891j1629L4232L3335N625j8281j9077Q649M982P01K3430
$$ 3489 2360 14319 7428 -4201 30031 63366 68991 50710 31633 40282 45264 45965 69395
8805F9395K0056j3278j8693q50p5L71J624j1996j1287r831Q820K827k6981Q266
$$ 69395 89451 76173 57480 56630 56555 56926 58550 46554 35267 25436 34256 37083 10102 18368
8791A8368J7768N533j8684q829k728J03K2723o640J4279l416q444o807J4048J3371
$$ 18368 36136 41669 22985 14156 11428 11531 34254 27614 41893 38477 30033 23226 37274 50645
8777E0645j4770j7608L581M499p410J2869Q68N504n964M114j1195r582N838J0670
$$ 50645 35875 18267 21848 26347 18937 31806 32674 38178 32214 36328 25133 15551 21389 32059
8763C2059j972N732j4198o512R619l44J3688J1170J378p208M761j0523p12k660
$$ 32059 30087 35819 21621 15109 24728 24384 38072 49242 50620 43412 48173 37650 36938 34278
8749C4278q955r845K272q426K2510L6922k1258k3996K234l005n168O355N622j2200
$$ 34278 25323 15478 17750 9324 31834 68756 47498 23502 25736 22731 17563 23918 29540 17340
8735A7340J2300J4605j0500m869R31j0442j841j062j6519J1388L886L688P308
$$ 17340 29640 44245 33745 28876 29807 19365 17524 16462 -57 11331 15217 18905 26213
8722B6213K492J3150M769L814j2147k0682j0071r184J1118j2567L742Q045Q520
$$ 26213 28705 41855 46624 50438 38291 17609 7538 -1646 9472 -3095 647 8692 17212
8709A7212J2710l043J0730K7168p627k3138J263J0097r353j0209j8059j1986K3999
$$ 17212 29922 26879 37609 64777 57150 34012 35275 45372 36019 25810 7751 -4235 19764
8696A9764J2034k798N468J4820j3801k0261j8469K7726K9273O710J4251p149p711
$$ 19764 31798 29000 34468 49288 35487 15226 -3243 24483 53756 60466 74717 67568 59857
8683E9857j4407j3774p495Q515J3561j5N814m752j6548j4565K2640K0901k1997
$$ 59857 45450 31676 24181 32696 46257 46242 52056 47304 30756 16191 38831 59732 37735
8670C7735k3149p86n085j2999K3584P606j6328K0041O031j4948P636J4179J3814
$$ 37735 14586 13800 8715 -4284 19300 26906 10578 30619 36650 21702 29338 43517 57331
8657E7331n263j1982k890L459J7177m065j4310p521J1783P642j8254j0633j1741
$$ 57331 52068 40086 37196 40655 57832 53767 39457 31936 43719 51361 33107 22474 10733
8644A0733J0901J6045J3955j1758o922n290k773P519J7751k332j5084L02m163
$$ 10733 21634 37679 51634 39876 32954 27664 24891 32410 50161 47829 32745 33047 28884
8631B8884p775Q346L042j372K891j619j1099N747K8923R293m37K0541J8833J2661
$$ 28884 21109 29455 32497 31125 34016 32397 21298 27045 55968 65261 64824 85365 104198 116859
8617A16859j00j4646M368j4355k1278j862P660j346M238r661k8283R081Q671j1205
$$ 116859 116759 102113 106481 92126 70848 68986 76646 75300 79538 69877 41594 50675 59346 48141
8603D8141J1562N339k3327r101l730j4718J700L5914J1187K915r476j4401o941
$$ 48141 59703 65042 41715 32614 28884 14166 15866 51780 62967 65882 56406 42005 35064
8590C5064K0801J3759m25p050l606l3096n830k042m822J6538J9491P8l0152l3214
$$ 35064 55865 69624 69199 62149 58543 25447 19617 17575 12753 29291 48782 48860 18708 -14506
8576a4506p445J9201L6533J0010j3782O860N229K257J3177J5915r940j7920r378
$$ -14506 -21951 -2750 33783 43793 30011 36871 42100 44357 57534 73449 63509 45589 36211
8563C6211j1676k083J3334J9768k2848j2561p576j28j765J374Q995J4848J952
$$ 36211 24535 22452 35786 55554 32706 20145 12569 12441 10676 12050 21045 35893 37845
8550C7845l1108J833o202k8367j56J0366m953J4310M6590K4977j2542j4034n838
$$ 37845 6737 8570 2368 -25999 -26155 -15789 -20742 -6432 40158 65135 52593 38559 32721
8537C2721j256Q923J834j3321j3744R201n247j1022J6377J0830J7730J7856j3487
$$ 32721 31465 40388 42222 28901 15157 24358 19111 8089 24466 35296 53026 70882 57395
8524E7395k6614k0202Q08J7888J6664j4536l3024j4234K0627L0444j2765l4330
$$ 57395 30781 10579 11387 29275 45939 31403 -1621 -15855 4772 35216 22451 -11879
8512a1879P21m86M40J9188J9817J7137k953j8747j7625L888K508J848m137j2838
$$ -11879 -11158 -11644 -11204 7984 27801 44938 41985 23238 5613 9501 12009 13857 9720 -3118
8498c118l902o03r310J1242j960Q237j4271O304P988J6082N433K4469N39j3481
$$ -3118 -7020 -7623 -16933 -5691 -7651 586 -13685 -7381 607 16689 22122 46591 47130 33649
8484C3649j6270J6151Q017k1477P528M098j9251N96j9095R1J9314N822j1925P832
$$ 33649 17379 33530 41547 20070 27598 31696 12445 13041 -6054 -5963 13351 19173 7248 15080
8470A5080M153J1967j1797j9375M379J0134P574Q099j1295l285l664Q931J1066
$$ 15080 19233 31200 19403 28 4407 14541 22115 30214 18919 15634 11970 20901 31967
8457C1967n603o251q145J0529j0420j111j333J1155J5059R1n016J6738N539n299
$$ 31967 26364 20113 11968 22497 12077 10966 9633 20788 35847 35938 30922 47660 53199 47900
8443D7900K729j3177p839P59l680R169J1500N100j9008n508m17j2454j6096k5609
$$ 47900 50629 37452 29613 30372 26692 35861 47361 52461 33453 27945 27528 15074 -1022 -26631
8429b6631N925k74L027J3976M71J3953J175K321O02J7597m741j8873P677M238
$$ -26631 -20706 -20980 -17953 -3977 -3506 10447 11622 13943 14545 32142 27401 8528 16205 20443
8415B0443J0812J0925P811l4218o224K7p055L472j0743j0299r617M883J7400J2163
$$ 20443 31255 42180 49991 15773 9549 9576 2521 5993 -4750 -15049 -24666 -19783 -2383 9780
8401I780M172p309j9369J0278l99j7962N38J3821J6652n147k188r738n111j6549
$$ 9780 13952 6643 -12726 -2448 -2847 -20809 -20271 -6450 10202 5055 2867 -6871 -11982 -28531
8387b8531j4713K3085L2316K554Q106r825j6632p635O531N514o677J0107o433
$$ -28531 -43244 -20159 12157 14711 22817 12992 -3640 -11275 -4744 770 -5907 4200 -2233
8374b233M481J4881M60j3732j6472J1474J9131j6234k4104j5104K1865J0884o179
$$ -2233 2248 17129 17589 3857 -12615 -1141 17990 1756 -22348 -37452 -15587 -4703 -10882
8361a0882J4721J1857j0358j4362j2663J6815J7999n91j8827N631J6088r229K645
$$ -10882 3839 15696 5338 -9024 -21687 -4872 13127 12536 -6291 -660 15428 6199 8844
8348H844k190N406K3095j0118p513P351J0509j0326j1071j5942p900J9185Q224
$$ 8844 6654 12060 35155 25037 17524 24875 35384 25058 13987 -1955 -9855 9330 17554
8335A7554R261j1978k2100M915J3175L576J902r254j1899KM304O808L336p426
$$ 17554 26815 14837 -7263 -2348 10827 14403 16305 7051 -4848 -4846 -542 6266 9602 2176
8321B176k6103M727K2942P232j1763j663k616p088J1020J3843L167k452j6060
$$ 2176 -23927 -19200 3742 10974 -789 -2452 -5068 -12156 -1136 12707 15874 13422 -2638
8308b638j927L581J6019J219m584k043j0366J355N466J0120l945N042K271P7J642
$$ -2638 -4565 -984 15035 16254 11670 9627 -739 616 6082 16202 12257 17299 19570 19647 21289
8293B1289j7649O04J4095J2491j3073M142O008l387j0802P814m091K985p707o577
$$ 21289 3640 4244 18339 30830 17757 21899 27907 24520 13718 21532 17441 20426 12719 6142
8279F142j380J40k125j201j2655J5808K1821O105j548k778r131j9191p98K6697
$$ 6142 4762 4902 2777 1576 -11079 4729 26550 32655 31107 28329 19198 7 -791 25906
8265B5906M533j067L730N219j1341j3898k2487k1545j9002J6553J9614K3399L309
$$ 25906 30439 29372 33102 38321 26980 13082 -9405 -30950 -49952 -33399 -13785 9614 12923
8252A2923p621j5081p66k28o860m099J7347Q810j73j385l855M076N239J1475J1250
$$ 12923 5302 -9779 -10545 -10773 -17633 -21732 -4385 4425 4252 2867 -988 3088 8327 19802 31052
8237C1052Q222j4360l0499j4985J2207R809l618j8109J5729J2959Q803o978j1762
$$ 31052 39274 24914 -5585 -20570 -8363 1446 -2172 -20281 -4552 8407 17210 10232 -1530
8224a530k5013r864M914R033J6306K38Q951J5937q456r676L135j197o488K226
$$ -1530 -26543 -36407 -31493 -22460 -6154 -5916 3035 18972 10516 840 3975 2778 -3710 -1484
8210a484N272M04j937p998K539K65m075j0508J3516R790j0249r107Q39n640l239
$$ -1484 3788 4192 2255 -5743 -3204 -2939 -7014 -17522 -4006 5784 -4465 -13572 -12733 -18373 -21612
8195b1612r09k398l696J5857J3694k5894j5969L326L9847J1069j5191j2657k527
$$ -21612 -22521 -24919 -28615 -12758 936 -24958 -40927 -37601 2246 13315 -1876 -14533 -17060
8182a7060J1998n418o003K800j647J1579M334J4219j5611j2957L1565K1418o220
$$ -17060 -5062 -10480 -16483 -13683 -15330 -3751 583 14802 -809 -13766 17799 39217 32997
8169C2997j0312j334j648p849o089J3259R548j4742M873K30K54N195N941p259
$$ 32997 22685 21351 19703 11854 5765 19024 28572 13830 18703 18933 19187 24382 30323 23064
8155B3064J450O968J3840j1338j1015j6970j815L163K542J368j9990k1006K9302
$$ 23064 24514 31482 45322 33984 22969 5999 4184 7347 9889 11257 -8733 -29739 -437
8142d37K0196j5678p143Q251M594r274k1137J1530K5914r092k271J859N439j616
$$ -437 19759 4081 -3062 5189 9783 509 -20628 -9098 16816 7724 5453 7312 12751 11135
8128A1135n87K0814l961k4334k456j884M256k784P137j559j9325o961M952L8064
$$ 11135 10548 31362 27401 3067 611 -1273 2983 199 7336 5777 -13548 -20509 -15557 22507
8114B2507K0550r93j1972R211J1571N295j7274m931N313o73k0360j3719P606q429
$$ 22507 43057 42064 30092 39303 50874 56169 38895 33964 39277 38604 18244 4525 12131 3702
8100C702j6789j491L361J8202J1760J6303N651j4313q745K3581J1952n417K952
$$ 3702 -13087 -14578 -11217 6985 18745 35048 40699 26386 17641 41222 53174 47757 50709
8087E0709j4093n486j240K5514L6839j7926k2117k912J4124k9378l3695O474M297
$$ 50709 36616 31130 29890 55404 92243 74317 52200 49288 63412 34034 339 6813 11110
8074A1110k9584j6365K9895K2681j4284j3232k5546r689M008R640Q201N078N358
$$ 11110 -18474 -34839 -4944 17737 3453 -9779 -35325 -45014 -41006 -31366 -23165 -18087 -12729
8061a2729j9658n15P616J6559J026j763p529K2076l451Q852J2063q132k0519N522
$$ -12729 -32387 -32902 -25286 -8727 -7701 -9464 -16993 5083 1632 10484 22547 14415 -6104 -582
8047e82P827M849K530J6335J747J404K2498K945j7736L128O483j490k045k967
$$ -582 7245 12094 14624 30959 32706 34110 56608 59553 41817 44945 51428 49938 47893 44926
8033D4926j3506n737R995j2231j5285q522K4674p232k2181q260K2592J3826o577
$$ 44926 31420 25683 35678 23447 8162 -360 24314 17082 -5099 -13359 9233 23059 16482
8020A6482l7477j1011j1264K8842K4991J7896K706j172m692J722R70J3200J0727
$$ 16482 -20995 -32006 -43270 -14428 10563 28459 31165 29993 25301 27023 27993 41193 51920
8007E1920p142J4647J7772P761K628j6741k6238j6978J0858k971j0226L576K4969
$$ 51920 44778 59425 77197 84958 87586 70845 44607 27629 38487 35516 25290 28866 53835
7994E3835J1071N896K1313p171j2653j0189J879m770j4118k5701j4746J3734p442
$$ 53835 64906 70802 92115 84944 72291 62102 63981 59211 45093 19392 4646 18380 10938
7981A0938r270j733R556k862m916J2588j4101j532o195j1820L819R158P978J2560
$$ 10938 1668 -65 9491 6629 1713 14301 200 -1332 -7527 -19347 -15528 -6370 1608 14168
7967A4168p654K278q63J3756j0216L2595K0679j566j8453n8J6059l64j9948J756
$$ 14168 6514 8792 7929 21685 11469 44064 64743 63177 44724 44666 60725 60361 40413 42169
7953D2169J803R97J8070J2395j2665j267j3458l3188k8247N596m60j1969J8692
$$ 42169 43972 44969 63039 75434 62769 61502 48044 14856 -13391 -7795 -8255 -20224 -1532
7940a532J3138O592j6177o928n301J4697P053j1930Q533o838L291K2982J7510
$$ -1532 11606 18198 2021 -4907 -10208 4489 11542 -388 8145 1307 4598 27580 45090
7927D5090j5195j9509j4599J882J2276K0691k677k3735K338P074O245o723j3233
$$ 45090 29895 10386 -4213 -2331 9945 30636 27959 4224 6562 13636 19881 13158 -75
7914g5p026r32J624L2325q623j8460j794P847j1283M508j207O086N219l698J834
$$ -75 -7101 -8033 -6409 25916 17293 -1167 -2961 4886 -6397 -1889 -3096 2990 8209 4511 6345
7899F345O061k2641k6189l658J6663L1019J0598M484o634l93n227q041Q316N795
$$ 6345 12406 -10235 -36424 -40082 -23419 7600 18198 22682 16048 15655 10428 2387 10703 16498
7885A6498p028r552j56N991K539O471j8297j4357n268O753J3623N297J1635j405
$$ 16498 9470 -82 -238 5753 8292 14763 -3534 -17891 -23159 -16406 -2783 2514 14149 12744
7871A2744R204l082j4989j0685N742N295o090K899j1869n60N365J3777J4886o427
$$ 12744 21948 18866 3877 -6808 -1066 4229 -1861 1038 -10831 -11391 -6026 7751 22637 16210
7857A6210j8135j1115j7867P59J0519J5955J5673n242j8749O252J3694r164l363
$$ 16210 -1925 -13040 -30907 -30148 -19629 -3674 11999 6757 -11992 -5740 7954 -1210 -4573
7844d573j0040k2104j1559Q85K8639J6469l517R620j0277R902L761N365j3980
$$ -4573 -14613 -36717 -48276 -47391 -18752 -2283 -5800 3820 -6457 3445 7206 12571 -1409
7831a409O637K1509J437j2457j6933j6299o526O71J651r075m954J6419Q413J7449
$$ -1409 5228 26737 28174 15717 -1216 -17515 -24041 -23370 -21719 -30794 -35748 -19329 -10916 6533
7817F533l642o775Q06j2150j7203Q533K6382J1929P067q492j150O81l1690j6359
$$ 6533 2891 -3884 -3078 -15228 -32431 -23898 2484 14413 21480 12988 11838 12519 -19171 -35530
7803c5530J2855J7517M031l141k178J402K5195Q724m611l7151l2644l309R77K2973
$$ -35530 -22675 -5158 -1127 -4268 -6446 -5044 20151 28875 24264 -12887 -45531 -48840 -47863 -24890
7789b4890J8597J9524p309j0500k005N608n000j7339J3205l864J2354L0034j2271
$$ -24890 -6293 13231 5922 -4578 -6583 -975 -5975 -23314 -10109 -13973 -1619 28415 16144
7776A6144m024n970j4743R813l871p732Q740L2760l213r209j9654R211j7096j8666
$$ 16144 12120 6150 -8593 1220 -2651 -10383 -1643 31117 27904 18695 -959 8252 -8844 -27510
7762b7510K7553j6608K5019J7946j8126m628j3200q883K4678J2787P429n137q367
$$ -27510 43 -16565 8454 26400 8274 3646 -9554 -18437 6241 19028 26457 21320 12953
7749A2953n043j2375l691J8880q326L010J6742L835p082l498J684j0816J82j0448
$$ 12953 7910 -4465 -8156 10724 2398 5408 22150 25985 18903 15405 17089 6273 6455 -3993
7735c993k1256j1017P691R087q176O778J6641q841N608J3473k443l083k884j8011
$$ -3993 -25249 -36266 -28575 -19488 -27664 -20886 -4245 -13086 -7478 5995 3552 469 -2415 -20426
7721b0426K607J839Q025M037K3310j9918P148K3263l102K48o455J1581K7063j5086
$$ -20426 -17819 -15980 -7955 -3918 19392 -526 6622 29885 26783 27031 20576 32157 59220 44134
7707D4134l9248J0678J689j2822k980j8666M714P533q718j1549L046J2663J4505
$$ 44134 4886 15564 17253 4431 1451 -17215 -12501 -4968 -13686 -25235 -22189 -9526 4979
7694D979j458j3757K659P237n420J0962J2466o431Q837n837j4394l517J6812J286
$$ 4979 3521 -10236 -7577 -340 -5760 5202 17668 11237 20074 14237 -157 -3674 13138 14424
7680A4424n211r456N463m764J6405l53L563q774J696m429M037o972n16m087J76
$$ 14424 9213 -243 5220 456 16861 16508 20071 11297 12993 8564 12601 5629 5113 1026 1202
7665A202N47j7166K42R586Q373J177J4739J5273k9457j3411j3291k6271o101J8514
$$ 1202 1749 -15417 -15175 -5589 2784 3961 18700 33973 4516 -8895 -22186 -48457 -54558 -36044
7651c6044K9345K251k4839n974o334K657M239J3939J2363P201N820N222k696P011
$$ -36044 -6699 -4448 -29287 -35261 -41595 -38938 -34699 -20760 -8397 -1196 4624 9846 7150 14161
7637A4161j190j3783j090k2054j0775J6421K5666K0250q641l866j0460N693K1263
$$ 14161 12971 -812 -1902 -23956 -34731 -18310 7356 27606 18965 15099 4639 10332 31595
7624C1595K3310k4585O22O459P956j1141j8635j5260j8136q99J0633j9426k5053
$$ 31595 54905 30320 30942 37401 45357 34216 15581 321 -17815 -18714 -8081 -27507 -52560
7611e2560J3055J8639J8778L977K1263K3526k0381l7588r924J1823j0493m807
$$ -52560 -39505 -20866 -2088 1889 23152 46678 26297 -11291 -21215 -9392 -19885 -24692
7599b4692k364Q093O986k0213J8327L7248J6324j6351k0799k0128O251K6550l962
$$ -24692 -27056 -18963 -11977 -32190 -13863 23385 39709 23358 2559 -17569 -11318 15232 11270
7586A1270p105N056j0672j8914n320K1335N064J1061j4273k4093J2576j4958j655
$$ 11270 4165 9221 -1451 -20365 -25685 -4350 714 11775 -2498 -26591 -14015 -28973 -30628
7573c0628K0401j5842N957J4829M949J47O015l033M172O224k0171j3175n622j2241
$$ -30628 -10227 -26069 -20112 -5283 -334 -187 5828 2795 6967 13191 -6980 -20155 -25777 -38018
7559c8018l697K2226K0901R002R189j4126j6681n367k2107m462M3863J8555Q977
$$ -38018 -41715 -19489 1412 10414 19603 5477 -11204 -16571 -38678 -43140 723 19278 28255
7546B8255j277q548P391n905p873j137j2952k346k590q196Q206p834j396P276
$$ 28255 26978 18430 25821 19916 12043 10906 -2046 -4392 -6982 -15178 -6972 -14806 -16202 -8926
7532h926o743J5736P471j0313j1342O882j6498J8532Q443K826K454k0507J9884
$$ -8926 -15669 67 7538 -2775 -14117 -7235 -23733 -5201 3242 6068 8522 -11985 7899
7519G899J0068k0519K638j5429j0681J318K4737Q600M729l199p697k0310j5231
$$ 7899 17967 -2552 86 -15343 -26024 -24706 31 8631 13360 10161 2464 -17846 -33077
7506c3077J5845P265L630j8921L451J3983K3210o13m86j6889k3920K061M925m253
$$ -33077 -17232 -9967 -6337 -25258 -21807 -7824 15386 14773 14287 -2602 -26522 -24461 -19536 -23789
7492b3789k478K3150K217o861p417l699m128j0544j1530K716l1078n89J8383K671
$$ -23789 -26267 -3117 -900 -7761 -15178 -18877 -23005 -33549 -45079 -42363 -73441 -74030 -55647 -52976
7478e2976j0053L364L3172K1655p601n013L5014L1682J0245l2690l8036k434j511
$$ -52976 -63029 -59665 -26493 -4838 -12439 -17452 17562 49244 59489 26799 -11237 -13671 -15182
7465a5182k057L084q229J8937Q317j9005j6073J1821R436l925r809J0268R334
$$ -15182 -17239 -14155 -22384 -3447 4870 -14135 -30208 -18387 -8951 -12876 -22685 -12417 -3083
7452c083k218k1377J601l166J4447l505J550K445j759J4528m175j5773k1650Q264
$$ -3083 -5301 -26678 -25077 -28243 -13796 -17301 -15751 -13306 -15065 -537 -4712 -20485 -42135 -33871
7438c3871K955K363J1568o560R494j7926j2258L5066j534j0642l916l594M294
$$ -33871 -30916 -28553 -16985 -23545 -14051 -31977 -44235 -9169 -10703 -21345 -25261 -28855 -24561
7425b4561K1766R368k28k3982M790J0301j347K6635J0087j3747j9342j5749m982
$$ -24561 -2795 6573 6345 -17637 -12847 -2546 -3893 22742 32829 19082 -260 -16009 -20991
7412b0991j1038j4209j704J6212J920O818Q155K2486o09k3497q074J9524J5677
$$ -20991 -32029 -46238 -47942 -31730 -29810 -22992 -14837 7649 7040 -16457 -24531 -5007 10670
7399A0670K931J3249j1384P312Q785k2986j0311k7920j7560M831K0123K8941L6718
$$ 10670 13601 26850 15466 22778 31563 8577 -1734 -29654 -47214 -42383 -22260 6681 43399
7386D3399Q774k4556j4984o772j6691l1410r093J3570q796q421M986K6801J2309
$$ 43399 52173 27617 12633 5861 -10830 -42240 -51333 -37763 -46559 -54980 -49994 -23193 -10884
7373a0884J0758M831j0333k220J293j3761j5755J1557J6242L643J2051K3022j6257
$$ -10884 -126 4705 -5628 -7848 -6555 -20316 -36071 -24514 -8272 -4629 7422 30444 14187
7360A4187k8599j946K078O993P871K223m445q77j2773o20J9370J085K122j1721
$$ 14187 -14412 -16358 -14280 -7287 584 2807 -1638 -2515 -15288 -15908 3462 4547 6669 -5052
7346e052l217l44j2967l331Q403J4993J3105j1198K101Q91M454k622j9220o513
$$ -5052 -8269 -8613 -21580 -24911 -16508 -1515 11590 392 2493 3384 7838 5216 -14004 -20517
7332b0517n183r95R91N764j780K0512J0587j6958q309J0547M204j6768J0675K8636
$$ -20517 -25700 -26695 -25704 -19940 -21720 -1208 9379 -7579 -15888 -5341 -1137 -17905 -7230 21406
7318B1406R6p939P23L95r808j6545Q487J6832J5796l1162k0355P93k897J0827
$$ 21406 21502 13563 14286 14681 4873 -11672 -3185 13647 29443 -1719 -22074 -21281 -24178 -13351
7304a3351K277J6307J4190L392j8687P151o490n137j356k0161J6876K4853J1870
$$ -13351 -11074 5233 19423 22815 4128 11279 4789 -348 -1704 -21865 -4989 19864 31734
7291C1734Q690j5629k1903p940M538m526j2992n741j5149J3277M2263K7294k0346
$$ 31734 40424 24795 2892 -5048 -510 -5036 -18028 -23769 -38918 -25641 16622 43916 23570
7278B3570j3832j1910J4158Q811O38k986J8855J8179o052j3858Q205J5104k6890
$$ 23570 9738 -2172 11986 20797 21435 18449 37304 55483 49431 35573 43778 58882 31992
7265C1992k0597L983J4885j4854k4997J6131P097n098j4577l828R248j2026O13
$$ 31992 11395 15378 30263 15409 -9588 6543 13640 8542 -6035 -9863 -615 -12641 -12028
7252a2028J1376J0275j2352j8177K8455K9736m554j3107k0102j5503j7109J611
$$ -12028 -652 9623 -2729 -20906 7549 37285 32731 19624 -478 -15981 -33090 -31479
7240c1479j7917k3245J5415K3631k826k4308J0964K6238K1649k5496k0962k574
$$ -31479 -49396 -72641 -57226 -33595 -36421 -60729 -49765 -23527 -1878 -27374 -48336 -50910
7228e0910L866K918J639K1110R443p703r988j7919J3437K5209J7042J4343M03
$$ -50910 -47044 -44126 -42487 -21377 -11934 -19637 -29625 -47544 -34107 -8898 8144 22487 22890
7215B2890k7388k7853k980J4109j1844K5241J1596q888n087j2249J0255n615P096
$$ 22890 -4498 -32351 -35331 -21222 -33066 -7825 3771 -5117 -10204 -22453 -12198 -17813 -10717
7202a0717j466k49J7868q935J7274K768J9o503j2390O243J0296l103k5486j3117
$$ -10717 -12183 -12432 5436 -3499 13775 16543 16562 10059 -2331 3912 14208 11105 -14381 -27498
7188b7498J4427m158q971j1400m30J5378J1687k0577l280k597J5226J9075Q412
$$ -27498 -13071 -17229 -26200 -37600 -38030 -22652 -10965 -31542 -34822 -37419 -22193 -3118 5294
7175E294j659P497m156m087R048q408j1842j1565P026k672k556q264L311J2373
$$ 5294 3635 11132 6976 2889 11937 3529 -8313 -19878 -12852 -15524 -18080 -26344 -23033 -10660
7161a0660L879M907n227k081J6199J0132k799o915q138k9570q771P548J5034J291
$$ -10660 -6781 -1874 -7101 -9182 7017 17149 14350 7435 -703 -30273 -39044 -31496 -16462 -15171
7147a5171J1181q801p276L384J777l1258r891J0393m596L722K2059L5435M359
$$ -15171 -3990 -12791 -20067 -16683 -14906 -46164 -56055 -45662 -50258 -46536 -24477 10958 15317
7134A5317m637R158Q745k0518l6344j2635K5501K2115j519j8147q7j2286j4007
$$ 15317 10680 19838 28583 8065 -28279 -40914 -15413 6702 5183 -12964 -13051 -25337 -39344
7121c9344r63J5117J2394K858o962m839P439j346K8085J2409p138k4496n724j1313
$$ -39344 -40307 -25190 -12796 -9938 -16900 -21739 -14300 -15646 12439 24848 17710 -6786 -12510 -23823
7107b3823q633J4291N135K1873J5171j7838j7390q879J3055J4455N653L527k4124
$$ -23823 -32456 -18165 -13030 8843 24014 6176 -11214 -20093 -7038 7417 13070 16597 -7527
7094g527r469M58m972j0784q67J6871k670q427j7002K0741K3709j4819k4784O39
$$ -7527 -16996 -16538 -21510 -32294 -33161 -16290 -18960 -27387 -44389 -23648 61 -14758 -39542 -38903
7080c8903K929k35P796o646r733K4196j056N328K6230J8430j2672m284j2458j0318
$$ -38903 -35974 -36209 -28413 -35059 -44792 -20596 -21652 -16324 9906 28336 15664 11380 -1078 -11396
7066a1396O937n061r482k412r52K1737K0626j2659j0328J7166Q46j0228j3917
$$ -11396 -4459 -9520 -19002 -21414 -22366 -629 19997 7338 -2990 14176 15022 4794 -9123
7053i123K80K7847R501j4943O81j9789q773J8098L326J0009j4044R148J9013q630
$$ -9123 -8843 19004 28505 13562 14243 -5546 -14319 3779 7105 17114 3070 12218 31231 22601
7039B2601o875l815M055J315r134k2045J9701L4400k0306l0255o921m686L053
$$ 22601 15726 11911 15966 17281 8147 -13898 5803 40203 19897 -10358 -17279 -21965 -18912
7026a8912J5062K1322j5050n283k6165j7300K147L0818K6470r250j5638J8670
$$ -18912 -3850 17472 2422 -2861 -29026 -46326 -44179 -13361 13109 3859 -11779 6891
7014F891L4447O008r978k0950l5862K81K634j23J1869L707L476j4599q71O59O937
$$ 6891 41338 47346 37368 16418 -19444 -19163 -16529 -16652 -4783 -1076 2400 -12199 -13070 -12411 -5474
6999e474J3011p125n159l854M662m482j919j007J0167k193j0015j2740L165K1139
$$ -5474 7537 412 -4747 -8601 -3939 -8421 -10340 -11347 -1180 -3373 -13388 -26128 -22963 -1824
6985a824P863j2305j619K618P492M338j2138J6535R12q993P370O152p334k025
$$ -1824 6039 -6266 -7885 -5267 2225 6563 -5575 10960 11872 2879 10249 16401 9067 7042
6971G042j4653j8596R114K0420R928k0454j8119J2681L337m261j4758j683M16
$$ 7042 -7611 -26207 -17093 3327 13255 -7199 -25318 -12637 -9300 -13561 -28319 -30002 -29586
6958b9586l502L1062J83j3146q683J0080j2524N497J0965j7240J648k1549O303
$$ -29586 -33088 -2026 -1843 -14989 -23672 -13592 -26116 -20619 -9654 -26894 -25246 -46795 -40492
6945d0492K8274o554O703N307Q503J6528P695k996j1295k4256k239j2602o325
$$ -40492 -12218 -18772 -12069 -6762 1741 18269 25964 22968 11673 -12583 -14822 -27424 -33749
6932c3749J5735o011j2888Q26J5652J5694m888k071K924l1398j1780J0872o03
$$ -33749 -18014 -24025 -36913 -36087 -20435 -4741 -9629 -11700 -8776 -40174 -51954 -41082 -41685
6919d1685K6343M426l425K590j3764K3035O458p826r606m0055J9576K2078K1377
$$ -41685 -15342 -10916 -14341 -11751 -25515 -2480 3978 -3848 -13454 -53509 -33933 -11855 9522
6906I522p802j5600j5009J0629J9840K2519L118j7735k9552N47L08k6831J6325
$$ 9522 1720 -13880 -28889 -18260 1580 24099 27217 9482 -20070 -19523 -19215 -46046 -29721
6893b9721K2958p377j2040n289J2257j5826L495J0886j3213J2964Q548J2034j107
$$ -29721 -6763 -14140 -26180 -31469 -19212 -35038 -31543 -20657 -33870 -20906 -12358 -324 -1431
6880a431J1011j7486L676R603j9911j339P133o507j9424J2796J7368j3478q154
$$ -1431 9580 -7906 -4230 5373 -14538 -15877 -8744 -15251 -34675 -21879 -4511 -17989 -26143
6867b6143L330L014J2709O214Q886J0562n718r023j2677o95R103q739k4278n846
$$ -26143 -22813 -19799 -7090 -876 8010 18572 12854 3831 -8846 -9541 -438 -9177 -33455 -39301
6853c9301J3402J7899J1818M743n763J4074J1851j8369j4373o077oj955M031L642
$$ -39301 -25899 -8000 3818 8561 2798 16872 28723 10354 -4019 -10096 -10102 -12057 -8026 -4384
6839d384N809j3686P719R446O463l904k742m487j4330j08J0480l532O991R285
$$ -4384 1425 -12261 -4542 4904 11367 7463 4721 234 -14096 -14204 -3724 -7256 -265 9020
6825I020j5743j4242j2274q474J3937n806p928J0002O148k2333O064K3953J5213
$$ 9020 -6723 -20965 -33239 -41713 -27776 -33582 -41510 -31508 -25360 -47693 -41629 -17676 -2463
6812b463m559K0145j5644r049P90k5643q047J11O804J2592m844o68j6475P085
$$ -2463 -7022 13123 -2521 -11570 -10780 -36423 -44470 -44359 -37555 -24963 -29807 -30475 -46950 -39865
6798c9865K4110J4263J700J8746J2040j2508k2284q851j0287J719J7065J7223
$$ -39865 -15755 -1492 208 18954 30994 18486 -3798 -12649 -22936 -21217 -4152 13071
6786A3071K488k1879k0826j2542K7432K3828N753J1842k2623j8735P232J4421
$$ 13071 15559 -6320 -27146 -39688 -12256 11572 17325 29167 6544 -12191 -4959 9462
6774I462M317K705L854j3207l7664O163K043j1700j4984J4533K8826L5988l350
$$ 9462 13779 16484 20338 7131 -30533 -24370 -22327 -34027 -49011 -34478 -5652 30336 26986
6761B6986k0175j2353J188j927r003m982J969K834m889P464l771Q139J4647P867
$$ 26986 6811 -5542 -4354 -6281 -15284 -20266 -18297 -15463 -20352 -12888 -16659 -8520 6127 13994
6747A3994j2142J0276j1641k5854l8514Q332J4764J2096o659R041J4641K583k744
$$ 13994 1852 12128 487 -25367 -63881 -55549 -40785 -28689 -35348 -26307 -11666 -9083 -11827
6734a1827m601k494R3J1290P12R152o875l735J491J200k292J2746N680l72J513
$$ -11827 -16428 -18922 -18829 -7539 -6827 2325 -4550 -8285 -6794 -5594 -7886 4860 10540 10168 11681
6719A1681j5464K0035J3363j9529j3495q227J5534l219k0443j2717Q325O113M603
$$ 11681 -3783 16252 29615 10086 -3409 -11636 3898 679 -19764 -32481 -24156 -18043 -13440
6706a3440J5028J1016j0555q908K5472k5904J291K4731K049j8k2818k2411o783
$$ -13440 1588 12604 2049 -6859 18613 -7291 -6000 18731 20780 20762 -2056 -24467 -31250
6693c1250J1812J7539L716j0668j9086m569l953K9260J3966M0743K6602k2574
$$ -31250 -19438 -1899 1817 -8851 -27937 -32506 -36459 -7199 6767 47510 74112 51538
6681E1538j3356p233l1954n111K834p13n998O95J5509K4508M579K13k1272N126
$$ 51538 38182 30949 -1005 -6116 -3282 -3995 -9993 -9298 6211 30719 35298 35511 14239 19365
6667A9365j6460l5451R378R06M625O518k2534k207K1116J6163l703j6302J5062
$$ 19365 2905 -32546 -23168 -22262 -17637 -11119 -33653 -35860 -14744 1419 -2284 -18586 -3524
6654c524K843j7989k676L221m280q00k618N293j2260P496r320o81n681M02n540
$$ -3524 -681 -18670 -21346 -18125 -22405 -23205 -25823 -20530 -32790 -25294 -34614 -35295 -40976 -40574 -46114
6639d6114j2699l424k0887R370J6463P795o188L152J7678r742J2960J5951J4705
$$ -46114 -58813 -62237 -83124 -73754 -57291 -49496 -55684 -52532 -34854 -44596 -31636 -15685 -980
6626i80K864J5889J8719j3696o028l020k961J0995k4515R055M030r212J65k345
$$ -980 1884 17773 36492 22796 16768 13748 10787 21782 -2733 6322 10352 1140 1305 -1040
6612a040N137J5484m709m235N592m376k2765K187l614L066M984P750p889k480
$$ -1040 4097 19581 14872 10637 16229 11853 -10912 -8725 -12339 -9273 -4289 3461 -4428 -6908
6598f908K3559J7071J146m66k7710k3532j839p775J0014L972L018J3022k545l58
$$ -6908 16651 33722 34868 34402 6692 -16840 -18679 -26454 -16440 -12468 -9450 3572 1027 669
6584F69p978m653R164k310j4097p58K2737J2178j0885k6574J0957K7283J0642
$$ 669 -7309 -11962 -2798 -5108 -19205 -19963 2774 14952 4067 -22507 -11550 15733 26375
6571B6375l927k0846l1508O454K7784J3065O948J278r610j1546k4099k0295J1027
$$ 26375 22448 1602 -29906 -23452 4332 17397 24345 25623 16013 4467 -19632 -39927 -28900
6558b8900O649R500j0227R804J2130J9406j0638l6180q140J4012K5339O926j320
$$ -28900 -22251 -12751 -22978 -13174 -1044 18362 7724 -28456 -36596 -22584 2755 9681 8361
6545H361P99j1822k674j0808j4827l441J2363m843K3695l036p222r849J3783J766
$$ 8361 9160 -2662 -5336 -16144 -30971 -34412 -22049 -26892 -3197 -6233 -13455 -23304 -9521 -7755
6531g755j9356q383n621j2556R265L499j5155J2210L138P280J5235l585j5214
$$ -7755 -27111 -35494 -41115 -53671 -44406 -40907 -56062 -43852 -40714 -33434 -18199 -21784 -36998
6518c6998P64r77L003q301K818L5912J5954J704q727j4332L331q527m116J3461
$$ -36998 -36234 -37211 -34208 -42509 -39691 -3779 12175 13879 5152 -9180 -5849 -14376 -18492 -5031
6504e031K167k181R402p716j4663l059j7456J3369J8818L836j2173p912Q376J8113
$$ -5031 -2864 -5045 4357 -3359 -18022 -21081 -38537 -25168 -6350 -2514 -14687 -22599 -14223 3890
6490C890O868Q199j0059Q725J475k604k3475L617P318r850j2542j9809K706q621
$$ 3890 10758 18957 8898 17623 19098 16494 -6981 -3364 3954 -5896 -18438 -38247 -35541 -44162
6476d4162J0127J2379J1257P8M058l265j0948l783O730J3781n788j0247p533q784
$$ -44162 -34035 -21656 -10399 -10321 -6263 -9528 -20476 -24259 -17529 -3748 -9536 -19783 -27316 -36100
6462c6100L139O809j658n166J3223K2890k204p273k698M390R28J1533m036j5414
$$ -36100 -32961 -26152 -27810 -32976 -19753 3137 933 -6340 -9038 -4648 -3720 7813 3777 -11637
6448a1637N464L649j5005j0423j788j9134J8073J7695j4733J2465J091j4983j837
$$ -11637 -6173 -2524 -17529 -27952 -29740 -48874 -30801 -13106 -27839 -15374 -14283 -29266 -31103
6435c1103Q272P141J9225J6400K6003l110k9457L359K0399O465k3727j3535K098
$$ -31103 -22831 -15690 3535 19935 45938 42828 13371 16730 37129 43594 19867 6332 8430
6422H430j2219O49J1033K382R131R369j339l5193J808Q077l089P50J0529M567
$$ 8430 -3789 -3140 7893 10275 19406 28775 27436 -7757 -5949 2128 -961 -211 10318 14885
6408A4885j8635j1091M152N121k748j0829r643J0594o491J9239O416K376J4237
$$ 14885 -3750 -14841 -10689 -5568 -8316 -19145 -28788 -18194 -24685 -5446 970 3346 17583
6395A7583k0456k556J81k9055q217o59n435J8977J5715m118K656J7913O954j4449
$$ 17583 -2873 -5429 -5248 -34303 -42520 -43179 -48614 -29637 -13922 -18040 -15384 2529 9483 -4966
6381d966j4089l352J607J1823O441J9887J5410r586j5232j2017k128m904L4774
$$ -4966 -19055 -22407 -20800 -8977 -2536 17351 32761 23175 7943 -4074 -6202 -11106 23668
6368B3668J1493k473k9699k2592K703j128K893L407j6291k158Q511k575K1839
$$ 23668 35161 32688 2989 -19603 -16900 -18028 -15135 -11728 -28019 -30177 -21666 -24241 -2402
6355b402J2419J450j3401j1007j5910M934K270K570J198R032P756m994R989J4118
$$ -2402 10017 11467 -1934 -12941 -28851 -23917 -21647 -19077 -17879 -8847 -1091 -6085 3904 18022
6341A8022N102j6648L77K5301k72j0930q215m474K447M340L157m451m005k3867
$$ 18022 23124 6476 6853 32154 31882 20952 12737 8263 10710 15050 18207 13756 9751 -14116
6327a4116j3669j7544J0514K9835J9037j9934j3162j9913n064J4874K5377P77
$$ -14116 -27785 -45329 -34815 -4980 14057 -5877 -19039 -38952 -44016 -29142 -3765 -2988
6315b988j2494j2131J3783J3732j557l4533r346R179J9285j3517j2848p252J917
$$ -2988 -15482 -27613 -13830 -98 -1655 -36188 -45534 -36355 -17070 -30587 -43435 -50687 -48770
6302d8770K6015J6845O553m373j6065j9391J7280Q091q248K3163L1803k7811k6312
$$ -48770 -22755 -5910 643 -3730 -19795 -39186 -21906 -13815 -22063 1100 32903 5092 -21220
6289b1220k490p013o591n179p432j050J7432m550J6175M201q902L658L2279Q399
$$ -21220 -23710 -30723 -37314 -42493 -49925 -50975 -33543 -38093 -21918 -17717 -26619 -22961 9318 17717
6275A7717J4218J9983k8080k5799k869J4257O099n356k3066J0878K7877J0375
$$ 17717 31935 51918 23838 -1961 -4830 9427 15526 10170 -12896 -2018 25859 36234
6263C6234j5385l1786j8370Q999J3995L935n515j9541k402J2784J2165K6014K0120
$$ 36234 20849 -10937 -29307 -20308 -6313 -2378 -7893 -27434 -29836 -17052 -4887 21127 41247
6250D1247j7267k0176j5041n426N027j0504P420J4659J0903r505m853r227j4436
$$ 41247 23980 3804 -11237 -16663 -11636 -22140 -14720 -61 10842 1337 -3516 -12743 -27179
6237b7179J375J9406M288j9326J533k1573J1552K8237J5052j0662n042j3679r40
$$ -27179 -25804 -6398 -2110 -21436 -19903 -41476 -29924 -1687 13365 2703 -2339 -16018 -16958
6224a6958R088O023J0636J1350J910j4071j0966l426m198m19K735k672Q195J7461
$$ -16958 -7870 -1847 8789 20139 22049 7978 -2988 -6414 -10612 -11031 -8296 -10968 -2773 14688
6210A4688j3998j6560j5432j0073j60J278J0995K5187O825j0726j9376j1450Q128
$$ 14688 690 -15870 -31302 -41375 -41535 -40257 -29262 -4075 2750 -7976 -27352 -38802 -30674
6197c0674m147m972K0837J7292q333j1877J8858K61L835J1409J243j7340j8435
$$ -30674 -34821 -39793 -18956 -1664 -9997 -21874 -3016 -2755 1080 12489 13732 -3608 -22043
6184b2043P346r759j0825J2982o541J45O190J6274K7288R326r248o368o60R42
$$ -22043 -14697 -24456 -35281 -22299 -28840 -28695 -22505 -6231 21057 30383 21135 14767 14107 15049
6170A5049k4818M830L886K612J142p918j6254n194J7723n398j0623P866L1395
$$ 15049 -9769 -4939 -1053 1559 2701 -5217 -21471 -26665 -8942 -14340 -24963 -17097 14298
6157A4298o025j0563j6347p121K1582J2533R354j2314k5656M399J1179O222R570
$$ 14298 8273 -2290 -18637 -25758 -4176 8357 17711 5397 -20259 -15860 -4681 1541 11111
6144A1111l4229k2371j701j720M2400K3692L630l97q433m712q868j6193J0724
$$ 11111 -23118 -45489 -47190 -48910 -6510 17182 20812 20415 11982 7270 -1598 -17791 -7067
6131g067L2443M475k2554k5321K0936K246l7816j2550K197J1218Q331O522M5J0614
$$ -7067 25376 29851 7297 -18024 2912 5158 -32658 -45208 -43011 -31793 -23462 -16940 -16895 -6281
6117f281Q225m636o235j5884R79j539M563N198J9103k967j5063k006M456J4261
$$ -6281 1944 -2692 -8927 -24811 -23832 -25371 -20808 -15610 3493 526 -14537 -16543 -12087 2174
6103B174J3897J977j2420k2028J2756J8039j0916k9321j1277O270K3066K4459
$$ 2174 16071 18048 5628 -16400 -3644 14395 3479 -25842 -37119 -30849 -7783 16676
6091A6676J9001j1350j1864o287j5844J0643J038q43j8892j6326J4760Q257L432
$$ 16676 35677 24327 12463 6176 -9668 975 2013 1170 -17722 -34048 -19288 -11031 -7599
6078g599j760Q325L16j3838J5870o608J2521n732L946j5197j1628N425j7625k2453
$$ -7599 -9359 -1034 -718 -14556 1314 -5294 7227 1495 5441 -9756 -21384 -15959 -33584 -56037
6064e6037J8246K1375k524j9158J3524l925L325n268K8686J8459q015J3272j014
$$ -56037 -37791 -16416 -18940 -38098 -24574 -28499 -25174 -30442 -1756 16703 8688 21960 20946
6051B0946N447j0327k2002l902N894J0517m606n895j8163r2J1333K6587J1730
$$ 20946 26393 16066 -5936 -9838 -3944 6573 1967 -3928 -22091 -22183 -10850 15737 27467
6038B7467l1648k3029p537J4666k54J200J9123r664j4816K1035p124P958k88O808
$$ 27467 -4181 -27210 -34747 -20081 -20335 -19135 -12 -9676 -24492 -3457 -10581 -2623 -2911 3897
6024C897L351n062J474j0780j3395J5404O635j5756k761O514O250K2528j5876
$$ 3897 7248 2186 3660 -7120 -20515 -5111 1524 -14232 -16993 -10479 -4229 18299 2423
6011B423k1542O069J4038M611j4478L445K7767m584j7249r332l507P997O251r787
$$ 2423 -19119 -13050 988 5599 -8879 -5434 22333 17749 500 -8832 -12339 -4342 1909 -7878
5997g878K2817m074k0292k673L035J2765J1187O848K411k0161k3905J056M562
$$ -7878 14939 10865 -9427 -12100 -9065 3700 14887 21735 24146 3985 -19920 -18864 -14302
5984a4302J6921j25R74m810n41l032j640r389Q032K8055J0155l942j5632M40M313
$$ -14302 2619 2494 3468 -1342 -1883 -4915 -6555 -15944 -7912 20143 30298 26356 10724 11164 15477
5969A5477r350Q773N417m398r78J5901r491k5166L9M954p389J425k084j6689l5
$$ 15477 6127 14900 20317 15919 14941 30842 21351 -3815 -3776 1178 -6211 -4786 -6870 -23559 -23594
5954b3594J0415Q496j09j6378J68N426j3572m980J3879J1038L283m321J9466j495
$$ -23594 -13179 -4683 -4792 -21170 -21002 -15576 -29148 -34128 -20249 -9211 -5928 -10249 9217 7722
5940G722r178n590J2891J8487k847j6796l69J344J722m55L468l088o617O475N582
$$ 7722 -1456 -7046 5845 24332 21485 4689 4320 5664 7386 6931 10399 7311 694 7169 12751
5925A2751j5366k321n343j5222M691Q037J9623M62j0812j9110L346O354O055J015
$$ 12751 -2615 -4936 -10279 -25501 -20810 -12773 6850 7312 -3500 -22610 -19264 -12910 -6855 -5840
5911e840K649J9572N660m847k2210J5026K8793j7438j6366j954q908j5118N877
$$ -5840 -3191 16381 22041 17194 -5016 10010 38803 21365 4999 3045 -5863 -20981 -15104
5898a5104J1473L557Q436J0203k8208k7652O518l527J8544n392n777J5457P199
$$ -15104 -3631 -74 8362 18565 -9643 -37295 -30777 -34304 -15760 -21152 -26929 -11472 -4273
5885d273j1665R252q39J3667J6489M958j5286k2605Q373q077p407N578L6783P019
$$ -4273 -15938 -6686 -7525 6142 22631 27589 12303 -10302 -1929 -10006 -17413 -11835 24948 31967
5871C1967k4537m432n876K6191K4731j2345j1892P207K908j5939k4160n549K605
$$ 31967 7430 2998 -2878 23313 48044 35699 23807 31014 33922 17983 -6177 -11726 -9121
5858i121P293L382K268k2633P904k519j388O810R515J8905l821k2312P190J8703
$$ -9121 -1828 1554 3822 -18811 -10907 -13426 -14814 -8004 1511 20416 16595 -5717 1473 20176
5844B0176j8442j8823K1094N628j7749l769J0659J1609J8968k172o283n74j9591
$$ 20176 1734 -17089 4005 9633 -8116 -11885 -1226 10383 29351 27179 20896 20322 731
5831G31j2779J8966J8584j1407k8614q536j451l233p103J64n612j0237J0086J4303
$$ 731 -12048 6918 25502 14095 -14519 -23055 -24506 -27739 -34842 -34678 -40290 -50527 -40441 -26138
5817b6138M830K163O850q031J3494J2199l960l819J0479J1194j1384j4224q165
$$ -26138 -21308 -19145 -12295 -20326 -6832 5367 1407 -2412 8067 19261 7877 -6347 -14512
5804a4512m217r114j0914O814K241O132k07M649j4843n795J4697J3568k744j629
$$ -14512 -18729 -27843 -38757 -31943 -29702 -23570 -23777 -19128 -33971 -39766 -25069 -11501 -14245 -15874
5790a5874J7206M872J707J249j912q175l205j2334m774N400j0209J3526R984J9244
$$ -15874 1332 6204 7911 9160 7248 -927 -4132 -16466 -21240 -15840 -26049 -12523 -2539 16705
5776A6705K746P206n201p497k8893O835Q725j4474k2986J2304J1647J0779J5614
$$ 16705 19451 26657 21456 13959 -14934 -8099 626 -13848 -36834 -24530 -12883 -2104 13510
5763A3510L450j3577K876K643l5545k1576K7605K3768J4677p979j7422j3700Q341
$$ 13510 16960 3383 6259 8902 -26643 -48219 -20614 3154 17831 9852 -7570 -21270 -12929
5750a2929m234K1431K304k266N807r181n066J2750Q218j2933k6975J4388J8298
$$ -12929 -17163 4268 6572 4306 10113 932 -4134 8616 16834 3901 -23074 -8686 9612
5737I612j617l957l2293k4036K8673K7442q886j929o603n786K0391M224j2746
$$ 9612 7995 4038 -28255 -52291 -23618 3824 -5062 -6991 -13594 -19380 1011 5235 -7511
5724g511Q539p703J5338q942k2652o623q924q355j135K425n93J5481j10J3177
$$ -7511 1028 -6675 8663 -279 -22931 -29554 -38478 -46833 -47968 -45543 -46136 -30655 -30765 -17588
5710a7588K919K255q257j9373K997n755L054K4327K1965J2767k6690l563l74J5723
$$ -17588 -14669 -12414 -20671 -40044 -37047 -42802 -39748 -15421 6544 19311 -7379 -10942 -11316 4407
5696D407J1813r490M936J3351M405p346o794j4659l500Q154j283N97j6634j1235
$$ 4407 16220 6730 11666 25017 29422 22076 15282 623 -2877 5277 3994 4591 -12043 -23278
5682b3278O148R531J2690k2614q668J4740K5344J4814M590l4447k2346P511J1202
$$ -23278 -17130 -7599 5091 -17523 -26191 -11451 13893 28707 33297 -1150 -23496 -15985 -4783
5669d783n069k185j67j0332l47R793P154N889j4637n882Q711j968j7733J0985
$$ -4783 -9852 -12037 -12204 -22536 -22883 -13090 -5936 -47 -14684 -20566 -11855 -13823 -31556 -20571
5655b0571N094j173l374q940L0078L2773K805p412j4096j5759k373k2831r838
$$ -20571 -15477 -16650 -20024 -28964 1114 33887 36692 29280 15184 -575 -2948 -25779 -35617
5642c5617J6006Q790k061K6182J2296J6963r489k3549p600j4925N274o627n295
$$ -35617 -19611 -10821 -12882 13300 25596 42559 33070 9521 1921 -13004 -7730 -14357 -19652
5629a9652N368J6958J4445m375j328o62k032O019M412k2507q738p157P434m241
$$ -19652 -14284 2674 17119 12744 11416 10754 8722 14741 19153 -3354 -12092 -19249 -11815 -16056
5615a6056K279P39m3M068M550J5097O450k0600j0242Q881p926J2400j7895n527
$$ -16056 -13777 -13038 -13081 -9013 -4463 10634 17084 -3516 -13758 -4877 -12803 -403 -18298 -23825
5601b3825Q572M332J5932J6142j094j6104q151r046j1516R181R306M675O296o287
$$ -23825 -15253 -10921 5011 21153 20059 3955 -4196 -13242 -24758 -15577 -6271 -1596 4700 -1587
5587a587j689j0843J6624O354j5195k574k2599p435J0998j1977P110J7059J2322
$$ -1587 -3276 -14119 2505 8859 -6336 -8910 -31509 -38944 -27946 -39923 -32813 -15754 -3432
5574c432j6434Q070J7913l614k0450j5372q770J954J4881N390K947R848o572r766
$$ -3432 -19866 -11796 6117 2503 -17947 -33319 -42089 -40135 -25254 -19864 -16917 -7069 -13641 -23407
5560b3407o183k578K9227k69o871K3093o463n702o974K640l320q534M707N844
$$ -23407 -29590 -32168 -2941 -3210 -10081 13012 6549 847 -6127 -3487 -6807 -15341 -10634 -4790
5546d790r429L726J3115K093J3755j5533j8358n962o685J3088J561J6991J426
$$ -4790 -14219 -10493 2622 4715 18470 2937 -15421 -21383 -28068 -14980 -13419 3572 4998
5533D998k2631m2260R465l249K2120K2586M719J5346J3692N736K2427j9716j5102
$$ 4998 -17633 -59893 -50428 -53677 -31557 -8971 -4252 11094 24786 30522 52949 33233 18131
5520A8131o036l769m385J1642j0152n388p022j1578R998J7305J5144L903j0414
$$ 18131 12095 8326 3941 15583 5431 43 -6979 -18557 -8559 8746 23890 27793 17379
5507A7379p244k4515j4240n589R599j7L028q140K3990L478j006K3189O644j2734
$$ 17379 10135 -14380 -28620 -34209 -24610 -24627 -21599 -29739 -5749 -2271 -3277 19912 26556 13822
5493A3822K921n951J3658j585j1077O030o43j3851o092n067J234m018M851k049
$$ 13822 16743 10792 24450 22865 11788 17818 17175 3324 -2768 -7835 -6601 -10619 -5768 -7817
5479g817L80j4088l287J4825J8028o47r470p919p094j2691J3136J1082R193J4093
$$ -7817 -7437 -21525 -24812 -9987 8041 7394 -2076 -9995 -17089 -29780 -16644 -5562 3631 17724
5465A7724J4195K122J2797k0451k1758j0217M870J9123N816J2239o430l903l628
$$ 17724 31919 34041 46838 26387 4629 -5588 -718 18405 24221 36460 30030 26127 22499
5452B2499j9870k1572K779J0554J7612O279L909l006l725n86J1849N902j9441
$$ 22499 2629 -18943 -16164 -5610 12002 18281 22190 19184 15459 14873 26722 32624 13183
5439A3183l0866k4228k868J2344L8549J1747j0407O954Q470j8928j681J456n542
$$ 13183 -17683 -41911 -44779 -32435 6114 17861 7454 14408 22878 3950 2269 3725 -1817
5426a817Q543R33k0973L617J5055n99q889j4018n918j849J2560K2694k642J927
$$ -1817 6726 7659 -13314 -9697 5358 4759 -4130 -18148 -24066 -25915 -13355 9339 6697 8624
5412H624J78J4000j7907o545O428q720J059j4041j47J048J763P131O997p959O147
$$ 8624 8802 22802 4895 -1650 4778 -3942 -2883 -16924 -17071 -16023 -14260 -7129 -132 -8091 -1944
5397a944J9365M326j2393J3218J6203k0799M792o038j6634M114l098M787K99p536
$$ -1944 17421 21747 9354 22572 38775 17976 22768 16730 96 4210 1112 5899 6198 -1338
5383a338J0148J1779l855j1190M176M603q604l127m875p392j3464m196J2380K2579
$$ -1338 8810 20589 16734 5544 9720 14323 5719 2592 -2283 -9675 -23139 -27335 -14955 7624
5369G624R138j2425j0631j228j0837L201J5877N719l570K5342M062j7365r506
$$ 7624 16762 4337 -6294 -7522 -18359 -15158 719 6438 2868 28210 32272 14907 5401
5356E401J497R956K329j3145r249Q63P952k6843j0901J2560K3646J781o218j896
$$ 5401 6898 16854 19183 6038 -3211 -2348 5604 -21239 -32140 -19580 4066 5847 -371 -2267
5342b267O02J260n971L912K4747k961J2736q143k2034K5576n307j1468k0252n666
$$ -2267 -1665 -405 -6376 -2464 22283 19322 32058 23915 1881 27457 22150 10682 -9570 -15236
5328a5236K4725L926j0136l163n307K862L92L9774Q071k3420k0806m766K444j2563
$$ -15236 9489 13415 3279 116 -5191 -2329 -1937 37837 45908 22488 1682 -3084 -640 -13203
5314a3203J6982m566k9466j7790j2254N496J7181q95j5781J6999J0077M011p331
$$ -13203 3779 -787 -30253 -48043 -60297 -54801 -37620 -38515 -54296 -37297 -27220 -23209 -30540
5301c0540K5039Q83j3334m897j1806L023K1425J8899j7004k1290J4614m054r925
$$ -30540 -5501 -4618 -17952 -22849 -34655 -31632 -10207 8692 -8312 -29602 -14988 -19042 -28967
5288b8967n422j0157K5687M197k1023J0240K2354M169l891j3010m214L0943L0974
$$ -28967 -34389 -44546 -18859 -14662 -35685 -25445 -3091 1078 -2813 -15823 -20037 10906 41880
5275D1880J333l7800j2275j2235j7981k346p896L4713L5993l338K761k4126j8368
$$ 41880 43213 5413 -6862 -19097 -37078 -39424 -47320 -12607 23386 20048 22809 -1317 -19685
5262a9685l016J795J4208L2513N088J712j5359j2748k419k594k8834j5259J4824
$$ -19685 -22701 -20906 -6698 25815 30903 32615 17256 4508 2089 -505 -29339 -44598 -29774
5249b9774K3705J324j7037n54K4049K3580j6045l1452O700K4837j178n311N89
$$ -29774 -6069 -4745 -21782 -22336 1713 25293 9248 -22204 -15504 9333 8155 2844 3433
5236C433L484m412M942Q501k6291k7437O748L6907o516j5679M451j3881P130j069
$$ 3433 6917 2505 7447 15948 -10343 -37780 -31032 5875 -641 -16320 -11869 -25750 -18620 -19689
5222a9689j5719j3647K4177j1550j799K8652p226J0186J8009J6391j4128p483
$$ -19689 -35408 -49055 -24878 -36428 -38227 -9575 -16801 -6615 11394 27785 13657 6174
5210F174m634j1579J2176Q096j3875q75M309J320K1084M303j5174j2072O538j0375
$$ 6174 1540 -10039 2137 10233 -3642 -4517 -208 1112 22196 26499 11325 -747 5791 -4584
5196d584j1917J998M614J7504Q290N651k1244j389K1536l380o089K005j7447m320
$$ -4584 -16501 -14503 -9889 7615 15905 21556 312 -1077 20459 17079 10990 12995 -4452 -8772
5182h772P648k580k487J0521K520j9173J3601j2216j1112J2453L327K1083k3607
$$ -8772 -1124 -3704 -6191 4330 6850 -12323 1278 -10938 -22050 -9597 -6270 14813 -8794
5169h794m951O59N574K451j550j4970o04L1518J8834k236Q17R208L485j0162j8020
$$ -8794 -13745 -13086 -7512 -5061 -6611 -21581 -22185 9333 28167 25931 26748 35956 39441 29279 11259
5154A1259p222J761p564o947K590j6504K910J3396J2249j1627j0635M782N807
$$ 11259 4037 5798 -1766 -8713 -6123 -22627 -19717 -6321 5928 -5699 -16334 -11552 -5745
5141e745m183q241m557J6352J5798r497k204j2511n336J5703n845q755K778J2819
$$ -5745 -9928 -18169 -22726 -6374 9424 -73 -2277 -14788 -20124 -4421 -10266 -19021 -16243 -3424
5127c424J8974r982j7558P524J0891P961j9164j7319O353J5891k573K1986J7255
$$ -3424 15550 5568 -11990 -4466 6425 14386 -4778 -22097 -15744 147 -2426 19560 36815
5114C6815m770j4509j5156p728n224J0335K738q491k6603r584R655k5562o361
$$ 36815 32045 17536 2380 -5348 -10572 -237 2501 -5990 -32593 -42177 -32522 -58084 -64445
5101f4445L9979J8873j3145M635N43J579K7941j057j6793P243o771J1130n149
$$ -64445 -24466 -5593 -18738 -14103 -13560 -11981 15960 14903 -1890 5353 -1418 9712 4563
5088D563j3435j0927p830P71K8331K4750J0164j9569l8786j1420K1321K426N909
$$ 4563 -8872 -19799 -27629 -26858 1473 26223 36387 16818 -21968 -33388 -12067 -9641 -3732
5075c732O354k399q022k839k509O655J8199l794j6179J9981k51l415P275J968
$$ -3732 2622 223 -7799 -10638 -13147 -6492 11707 7913 -8266 11715 11464 8049 15324 17292
5061A7292o575p251p383J5882n132k0474M15K977R054J598j7894k0363K2817J2028
$$ 17292 10717 3466 -3917 11965 6833 -13641 -13226 -10249 -1195 403 -17491 -37854 -15037 -3009
5047c009P605J110m562M889K5241K07j2186k687k5855n262P256L191j5374j1706
$$ -3009 4596 5706 1144 6033 31274 31481 19295 16608 -9247 -14509 -7253 -4062 -19436 -31142
5033c1142L5923M5742J588j1186l232R49k0994L913K5302J0028j8567k646K06
$$ -31142 4781 50523 52111 40925 37693 38642 17648 21561 46863 56891 38324 35678 35884
5020C5884J1589k068m2304j8396L515J0379m824r45j7583k68k608k0437P561K2906
$$ 35884 47473 45405 3101 -15295 -11780 -1401 -6225 -7170 -24753 -25021 -27629 -48066 -40505 -17599
5006a7599R302q351p906l191J9318R647J2883O995l6146k0751J0525J3442K1629
$$ -17599 -8297 -16648 -24554 -27745 -8427 1220 14103 21098 -15048 -35799 -25274 -11832 9797
4993I797L55k2334J3498Q987j4449L258j3936r002K251K916J6206J3526j1776
$$ 9797 10152 -12182 1316 10303 -4146 -888 -14824 -23826 -21575 -18659 -2453 11073 -703
4980g03J0779o07J2196n461l3313J0874k1266l84J8136O434m538m745r593R673
$$ -703 10076 9469 21665 16204 -17109 -6235 -27501 -27885 -9749 -3315 -7853 -12598 -22191 -12518
4966a2518l955j0228N264J0099L1119J0566k3971k1422m395o071o379o202N448
$$ -12518 -16473 -26701 -21437 -11338 19781 30347 6376 -15046 -19441 -25512 -31891 -38093 -32645
4953c2645J7925N869k909j2223K6610O544r028J4756J7550j0732j266k019j2081
$$ -32645 -14720 -8851 -11760 -23983 2627 9171 143 14899 32449 21717 20451 18432 6351
4940F351j0186J5803K1163o290L862o474j7142j4420J4957O142r467M904J7994
$$ 6351 -3835 11968 33131 26841 30703 24229 7087 -7333 7624 13766 4299 9203 27197
4927B7197J4099K843m87l3877l9532k2240K5662J7147P268k961p058J3560j7306
$$ 27197 41296 44139 43652 9775 -29757 -51997 -26335 -9188 -1920 -4881 -11939 1621 -15685
4914a5685l0470J3919P841J5617L5559J2417k2443j7184Q886m568k2854r239M186
$$ -15685 -46155 -32236 -24395 -8778 26781 39198 16755 -429 8457 3889 -18965 -28204 -24018
4901b4018J9216J2590l985j1813r303k966J0169j0969J431j3474J5147P879N710
$$ -24018 -4802 7788 3803 -8010 -17313 -20279 -10110 -21079 -19648 -33122 -17975 -10096 -4386
4888d386M853l81O31j0180o548J2424P13N455N376J5554l533p168n741m3848p778
$$ -4386 467 86 717 -9463 -16011 -3587 -2874 2581 7957 23511 19978 12810 7069 -36779 -44557
4873d4557J1347J5075K2338l81O419K2682R526l710o968j972l4666l5532m670
$$ -44557 -33210 -18135 4203 3822 10241 32923 42449 38739 31771 29799 -4867 -40399 -45069
4860d5069P779J7908J1229j4783J91M435K4081K7035l970j6397j3468m122k8171
$$ -45069 -37290 -19382 -8153 -22936 -22745 -18310 5771 32806 28836 12439 -1029 -5151 -33322
4847c3322K546L4485R34m095k815j5559k986J9185l158q416Q13l758R316K637
$$ -33322 -30776 3709 4643 548 -2267 -17826 -20812 -1627 -4785 -13201 -12388 -16146 -6830 -4193
4833d193q498P301o17J0573J546Q023j3828j6953r008M963J581J8141N282J4530
$$ -4193 -12691 -5390 -6007 4566 6112 14135 307 -16646 -25654 -20691 -19110 -969 4313 18843
4819A8843R84l896k161l566j2228J7022K5888k144J29k223j3096j4620p034j841
$$ 18843 19827 15931 13770 10204 -2024 14998 40886 38742 38871 36648 23552 8932 1898 57
4805E7o905K1923l017j8465J2407J1238l2749k1474K2404J7767O029j1674j0643
$$ 57 -6848 15075 12058 -6407 6000 17238 -15511 -36985 -14581 3186 9215 -2459 -13102
4792a3102p151k135J7866K2523q747o874j3763r568Q085N3j3853Q89J8557J0202
$$ -13102 -20253 -22388 -4522 18001 9254 2380 -11383 -20951 -12866 -12813 -26666 -25777 -7220 2982
4778B982j946j5173M039Q186K047k0726n948J114J81J2952j0343L893Q487m193
$$ 2982 1036 -14137 -10098 -1912 135 -20591 -26539 -25425 -25244 -12292 -22635 -18742 -10255 -14448
4764a4448K663j8793p176Q182K8034L73R566j946j8500o17L487J4097J574P751
$$ -14448 -11785 -30578 -37754 -29572 -1538 -1165 8401 6455 -12045 -12662 -9175 4922 6496 14247
4750A4247j0372j1136j1584J0569R265J1137M967j0586r516j57L671k928J115
$$ 14247 3875 -7261 -18845 -8276 989 12126 17093 6507 -3009 -3166 505 -2423 -1308
4737a308N267p478l098p222k823R265R882j2231M803R981J3229n10j3288J419
$$ -1308 3959 -3519 -6617 -13839 -16662 -7397 2485 -9746 -4943 5038 18267 17757 4469 5888
4723E888m136J3009J2967j2447j0787L175o881q053O270M305J1848M689k2322
$$ 5888 1752 14761 27728 15281 4494 7669 788 -7265 -995 3310 15158 19847 -2475
4710b475n536Q185m237K2166K0501j37j3190r982j8920O564k2718J7784J2864
$$ -2475 -8011 174 -4063 18103 38604 38467 25277 15295 -3625 2939 -19779 -1995 10869
4697A0869q907j345K250n33J7734j6777k6841j5443j8060K2167M2119J7556o411
$$ 10869 1962 617 2867 2334 20068 3291 -23550 -38993 -57053 -34886 7233 24789 18378
4684A8378j2034J560j2926l474J2065k207k7329k1003L4327J7432J212K427k2147
$$ 18378 6344 7904 -5022 -8496 3569 1362 -25967 -46970 -12643 4789 6001 8428 -13719
4671a3719j30J9103j5849n746J2665r725q78m531L365K819N054K4181m756k5539
$$ -13719 -13849 5254 -10595 -16341 -3676 -13401 -14279 -18810 -15445 -12626 -7572 16609 11853 -13686
4657a3686M067M218L902K607J0059r755j7487q65j4229J0119J5069k101j7192
$$ -13686 -9619 -5401 -1499 1108 11167 1412 -16075 -16940 -31169 -21050 -5981 -8082 -25274
4644b5274J548J1107k193j7673J1796K8775n978l0051J7373J306q983J855k8077
$$ -25274 -23726 -12619 -14812 -32485 -20689 8086 2108 -27943 -10570 -9264 -18247 -16392 -44469
4631d4469M243J3435J0263K5918J0505l0543k6200K1549Q552L7327J7829n590
$$ -44469 -40226 -26791 -16528 9390 19895 -10648 -36848 -15299 -6747 30580 48409 42819
4619D2819o322j7247k71L804j9381Q391M397Q00k6985q605K0362q571n104J3879
$$ 42819 36497 19250 18979 22783 3402 11793 16190 16990 -9995 -18600 1762 -6809 -11913 1966
4605A966J7056r451k4545J3873J7089q324n607L429J0737j2681k0346r830J2439
$$ 1966 19022 9571 -14974 -1101 15988 7664 2057 5486 16223 3542 -16804 -26634 -14195
4592a4195K1192J3510j8742l595L499L857j4404j4955R176L86J8449J430j9320
$$ -14195 6997 20507 1765 -1830 1669 5526 -8878 -23833 -14657 -14271 4178 5608 -13712
4579a3712J6445J3328j5056q372k2900k1201m048J374J3159J9892q01O503K8844
$$ -13712 2733 16061 1005 -7367 -30267 -51468 -55516 -54142 -40983 -21091 -21892 -15389 13455
4566A3455N094j5491r155J1293J5508j2952k6901j7484M57N873J1556P428j3019
$$ 13455 18549 3058 -6097 5196 20704 7752 -19149 -36633 -36176 -30303 -18747 -11319 -24338
4553b4338j294J0209J7186R800j5634o255j3078J625J0403O429L48J295q612j5980
$$ -24338 -25632 -15423 1763 11563 -4071 -10326 -23404 -21779 -11376 -4947 -4599 -3304 -11916 -27896
4539b7896L370L0482j2115M1N811j498K5531J1633J388J409m973q113j3616r728
$$ -27896 -24526 5956 -6159 -6118 -307 -1805 23726 35359 36747 38156 33183 25070 11454 1726
4525A726J3887m552k7394R93J2287p331j2491J462O202q111J4123L70o477m374
$$ 1726 15613 11061 -16333 -15340 -3053 -10384 -22875 -21413 -15211 -23322 -9199 -8829 -15306 -19680
4511a9680j1239J6288L6013L796m407j9342J119O816J1481L974M843j0944J364
$$ -19680 -30919 -14631 21382 25178 20771 1429 2548 9364 20845 24819 29662 18718 20082
4498B0082j4570q911n995J0516R689j9265l0464j6745K3085P290Q295J1146R586
$$ 20082 5512 -3399 -9394 1122 10811 -8454 -38918 -55663 -32578 -25288 -16993 -5847 3739
$$ [...]
##END NTUPLES=NMR SPECTRUM
##END=
