##TITLE=Analysis number 330363
Compound Code btb 10078
Project Code adrs
Chemist Name stores
##JCAMPDX= 6.0         $$ Bruker NMR JCAMP-DX V2.0
##DATA TYPE= NMR SPECTRUM
##DATA CLASS= NTUPLES
##ORIGIN= Bruker BioSpin GmbH
##OWNER= nmr
$$ XWIN-NMR		Version 3.5
$$ Mon Nov 19 12:10:01 2007 GMT Standard Time (UT+0h)  MAYBRIDGE\nmr@NMR_250MHZ
##.OBSERVE FREQUENCY= 250.131544655141
##.OBSERVE NUCLEUS= ^1H
##.ACQUISITION MODE= SIMULTANEOUS (DQD)
##.ACQUISITION SCHEME= undefined
##.AVERAGES= 16
##.DIGITISER RES= 18
##SPECTROMETER/DATA SYSTEM= dpx250
##.PULSE SEQUENCE= zg30
##.SOLVENT NAME= DMSO
##.SHIFT REFERENCE= (INTERNAL, DMSO, 0, 16.522)
##AUDIT TRAIL= $$ (NUMBER, WHEN, WHO, WHERE, WHAT)
$$ ##TITLE= Audit trail, XWIN-NMR		Version 3.5
$$ ##JCAMPDX= 5.01
$$ ##ORIGIN= Bruker BioSpin GmbH
$$ ##OWNER= nmr
$$ C:\u/data/dgb/nmr/ADRS/1820/pdata/1/auditp.txt
$$ ##AUDIT TRAIL=  $$ (NUMBER, WHEN, WHO, WHERE, WHAT)
(   1,<2007-11-19 12:09:24.95 +000>,<MAYBRIDGE\nmr>,<NMR_250MHZ>,
      <created by zg, POWCHK disabled, PULCHK disabled
       configuration hash MD5:
       76 6E 9A 78 1E 09 19 81 EC 84 63 8F B0 6A 59 2D
       data hash MD5: 64K
       5D BC 18 51 AE 38 0D 74 91 76 2B EF 7D 13 92 99>)
(   2,<2007-11-19 12:09:46.90 +000>,<MAYBRIDGE\nmr>,<NMR_250MHZ>,
      <Start of raw data processing
       ef LB = 0.3 FT_mod = 6 PKNL = 1 SI = 32K 
       data hash MD5: 32K
       AF A7 55 80 8D 52 6D EB E6 74 A3 3D 2A 89 9D E0>)
(   3,<2007-11-19 12:09:51.01 +000>,<MAYBRIDGE\nmr>,<NMR_250MHZ>,
      <apk 
       data hash MD5: 32K
       9C 3D 26 BA 89 D9 09 23 0E 1A 8F 9B 5A E0 65 2E>)
(   4,<2007-11-19 12:09:51.76 +000>,<MAYBRIDGE\nmr>,<NMR_250MHZ>,
      <abs ABSG = 5 
       data hash MD5: 32K
       0D E1 22 36 82 E5 12 53 51 AB 4B 97 C1 00 07 8A>)
$$ ##END=
$$ 
$$ hash MD5
$$ EA 98 1A CD D3 DC 04 27 AF 0F E2 C0 59 39 77 31
##$RELAX= 
##$RELAX= 
##$RELAX= 
##$RELAX= 
##$RELAX= 
##$RELAX= 
##$RELAX= 
$$ Bruker specific parameters
$$ --------------------------
##$DU= <C:\u>
##$EXPNO= 1820
##$NAME= <ADRS>
##$PROCNO= 1
##$TYPE= <nmr>
##$USER= <dgb>
##$AMP= (0..31)
100 100 100 100 100 100 100 100 100 100 100 100 100 100 100 100 100 100 
100 100 100 100 100 100 100 100 100 100 100 100 100 100 
##$AQSEQ= 0
##$AQ_mod= 3
##$AUNM= <au_zg>
##$AUTOPOS= <30 >
##$BF1= 250.13
##$BF2= 250.13
##$BF3= 250.13
##$BF4= 250.13
##$BF5= 500.13
##$BF6= 500.13
##$BF7= 500.13
##$BF8= 500.13
##$BYTORDA= 1
##$CFDGTYP= 0
##$CFRGTYP= 5
##$CHEMSTR= <none>
##$CNST= (0..31)
1 1 145 1 1 1 1 1 1 1 1 1 1 1 1 1 1 1 1 1 1 1 1 1 1 1 1 1 1 1 1 1 
##$CPDPRG= <>
##$CPDPRG1= <>
##$CPDPRG2= <>
##$CPDPRG3= <>
##$CPDPRG4= <mlev>
##$CPDPRG5= <mlev>
##$CPDPRG6= <mlev>
##$CPDPRG7= <mlev>
##$CPDPRG8= <mlev>
##$CPDPRGB= <>
##$CPDPRGT= <>
##$D= (0..31)
0 1 0 0 0 0 0 0 0 0.06 0 0 0 0 0 0 0.0002 0 0 0 0 0 0 0 0 0 0 0 0 0 0 
0 
##$DATE= 1195474163
##$DBL= (0..7)
120 120 120 120 120 120 120 120 
##$DBP= (0..7)
150 150 150 150 150 150 150 150 
##$DBP07= 0
##$DBPNAM0= <>
##$DBPNAM1= <>
##$DBPNAM2= <>
$$ [...]
##$SUBNAM7= <"">
##$SUBNAM8= <"">
##$SUBNAM9= <"">
##$SW= 20.6930455092707
##$SWIBOX= (0..15)
0 0 3 0 0 0 0 0 0 0 0 0 0 0 0 0 
##$SW_h= 5175.983436853
##$TD= 65536
##$TD0= 1
##$TE= 295.16
##$TE2= 300
##$TE3= 300
##$TEG= 300
##$TL= (0..7)
0 120 120 120 120 120 120 120 
##$TP= (0..7)
150 150 150 150 150 150 150 150 
##$TP07= 0
##$TPNAME0= <>
##$TPNAME1= <>
##$TPNAME2= <>
##$TPNAME3= <>
##$TPNAME4= <>
##$TPNAME5= <>
##$TPNAME6= <>
##$TPNAME7= <>
##$TPOAL= (0..7)
0.5 0.5 0.5 0.5 0.5 0.5 0.5 0.5 
##$TPOFFS= (0..7)
0 0 0 0 0 0 0 0 
##$TUNHIN= 0
##$TUNHOUT= 0
##$TUNXOUT= 0
##$USERA1= <user>
##$USERA2= <user>
##$USERA3= <user>
##$USERA4= <user>
##$USERA5= <user>
##$V9= 5
##$VALIST= <valist>
##$VCLIST= <CCCCCCCCCCCCCCC>
##$VD= 0
##$VDLIST= <DDDDDDDDDDDDDDD>
##$VPLIST= <PPPPPPPPPPPPPPP>
##$VTLIST= <TTTTTTTTTTTTTTT>
##$WBST= 1024
##$WBSW= 4
##$XGAIN= (0..3)
0 0 0 0 
##$XL= 0
##$YL= 0
##$YMAX_a= 368213
##$YMIN_a= -497764
##$ZGOPTNS= <>
##$ZL1= 120
##$ZL2= 120
##$ZL3= 120
##$ZL4= 120
##$ABSF1= 16.522
##$ABSF2= -4.171173
##$ABSG= 5
##$ABSL= 3
##$ALPHA= 0
##$AQORDER= 0
##$ASSFAC= 0
##$ASSFACI= 0
##$ASSFACX= 0
##$ASSWID= 0
##$AUNMP= <proc_1d>
##$AZFE= 0.1
##$AZFW= 0.1
##$BCFW= 0
##$BC_mod= 0
##$BYTORDP= 0
##$COROFFS= 0
##$CY= 12.5
##$DATMOD= 1
##$DC= 0
##$DFILT= <>
##$DTYPP= 0
##$F1P= 14.0000005364418
##$F2P= -0.99999901652339
##$FCOR= 0.5
##$FTSIZE= 32768
##$FT_mod= 6
##$GAMMA= 0
##$GB= 0
##$INTBC= 1
##$INTSCL= 1
##$ISEN= 128
##$LB= 0.3
##$LEV0= 0
##$LPBIN= 0
##$MAXI= 10000
##$MC2= 0
##$MEAN= 0
##$ME_mod= 0
##$MI= 0
##$NCOEF= 0
##$NC_proc= -3
##$NLEV= 6
##$NOISF1= 0
##$NOISF2= 0
##$NSP= 0
##$NTH_PI= 0
##$NZP= 0
##$OFFSET= 16.522
##$PC= 1
##$PHC0= 159.7067
##$PHC1= 6.738065
##$PH_mod= 1
##$PKNL= yes
##$PPARMOD= 0
##$PSCAL= 4
##$PSIGN= 0
##$REVERSE= no
##$SF= 250.13
##$SI= 32768
##$SIGF1= 0
##$SIGF2= 0
##$SINO= 400
##$SIOLD= 32768
##$SREGLST= <1H.DMSO>
##$SSB= 0
##$STSI= 32768
##$STSR= 0
##$SW_p= 5175.98343685301
##$SYMM= 0
##$S_DEV= 0
##$TDeff= 65536
##$TDoff= 0
##$TI= <Analysis number 999999
Compound Code 99
Book Reference 9
Project Code 9>
##$TILT= no
##$TM1= 0
##$TM2= 0
##$TOPLEV= 0
##$USERP1= <user>
##$USERP2= <user>
##$USERP3= <user>
##$USERP4= <user>
##$USERP5= <user>
##$WDW= 1
##$XDIM= 32768
##$YMAX_p= 448882843
##$YMIN_p= -120715
$$ End of Bruker specific parameters
$$ ---------------------------------
##NTUPLES= NMR SPECTRUM
##VAR_NAME=  FREQUENCY,     SPECTRUM/REAL,   SPECTRUM/IMAG
##SYMBOL=    X,             R,               I
##VAR_TYPE=  INDEPENDENT,   DEPENDENT,       DEPENDENT
##VAR_FORM=  AFFN,          ASDF,            ASDF
##VAR_DIM=   32768,         32768,           32768
##UNITS=     HZ,            ARBITRARY UNITS, ARBITRARY UNITS
##FACTOR=    0.157963299565203, 1,           1
##FIRST=     4132.6476996994, 0,             0
##LAST=      -1043.33573715361, 0,           0
##MIN=       -1043.33573715361, -120715,     0
##MAX=       4132.6476996994, 448882843,     0
$$ Real data points
##PAGE= N=1
##DATA TABLE= (X++(R..R)), XYDATA
$$ [...]
20023 -27428 -21054 -17974 19186 11577 -6379 -18834 -348 11432 -15473 -33668 -34976 -23457
20011 -23457 -35189 -57331 -66935 -47749 -32409 -27934 -35728 -47091 -71013 -74608 -68066 -68090 -55774
19998 -55774 -33250 -8770 10562 30457 27112 3399 9154 7470 -4993 -7777 -23898 -25040 -28231
19985 -28231 -31806 -25167 -19537 -12225 -4226 -18044 -8750 -16811 -7107 -3323 -13021 9196 3682 -3194
19971 -3194 -12480 -6043 -454 -10513 -6427 -18207 -49155 -53280 -36725 -2185 1493 -3812 -12294
19958 -12294 -17516 -17040 -46847 -41914 -17055 4949 12399 -1734 -19958 -7612 -4469 6865 5473
19945 5473 -6245 -9448 4438 2962 -768 8039 20189 41087 24739 31999 67661 88666 94491
19932 94491 113156 142005 183088 229518 246128 274855 298123 278131 246885 221066 208707 154787
19920 154787 131056 147277 134122 121662 109167 130727 168841 192562 245595 277805 259611
19909 259611 267834 261471 216552 201196 172281 143259 119633 88362 51653 24983 37659 48316
19897 48316 52464 46909 50564 56032 31610 29418 32580 -1141 -6848 -10624 -35151 -24724 -8566
19884 -8566 -39848 -36117 -29207 -33470 -30829 -5947 34626 42647 37316 19399 12943 19342 8099
19871 8099 2918 -2652 -10792 -451 5496 -35046 -50724 -49375 -28792 -9717 17719 6380 11761
19858 11761 24948 13718 -8766 -26223 -25173 -29610 -18343 -6056 -7173 -8155 -20212 -23144 -58417
19845 -58417 -54116 -43020 -10509 -16220 -14316 -19421 -14949 -25339 -5661 8145 21516 8707 -24923
19832 -24923 -34569 -25123 -9804 -16676 -18621 -4341 -4808 4163 9370 -21433 -20945 -14852 1222 -1970
19818 -1970 -6535 -8117 -35888 -40636 -21626 -10247 -11126 -26970 -35911 -24723 -21115 -35733 -24219
19805 -24219 -13676 -36752 -41541 -29798 15350 26012 1436 4208 4277 -11552 5590 -11751 -14969
19792 -14969 -22113 -13672 -6182 12229 18847 19227 8126 31053 26309 7796 -7597 -2500 17245
19779 17245 15414 2907 -11329 -12573 12004 -19250 -16648 -15485 -18055 -39770 -35431 -35691 -38791
19766 -38791 -28657 -25936 -20193 -22342 -3717 128 14385 30433 6314 440 8315 23997 29858
19753 29858 21742 19053 8227 -14015 12183 30052 17036 -14794 -12935 -4675 19794 27889 39298
19740 39298 17220 -15080 -44960 -41899 1015 1294 -15141 -12671 763 6795 4285 8833 19291
19727 19291 -20252 -15887 7576 2233 -4146 472 -6369 -30874 -36693 -15204 -3742 -15483 -11018
19714 -11018 -3830 13372 30489 26413 2388 1051 -28137 -61333 -48420 -25969 1086 23936
19702 23936 -7401 -23429 -2198 4049 -30617 -30277 -8649 -3351 -27117 -56184 -51139 -48834 -59055
19689 -59055 -57296 -43613 -29805 4031 26599 34945 33685 9261 -22946 -15284 -10411 -41260 -42816
19676 -42816 -11663 1126 14071 36844 50839 41490 27262 32356 33683 30338 31922 66590 81260
19663 81260 43366 19211 34344 42834 37624 19450 -7053 1174 43255 67138 70236 63720 42113
19650 42113 6456 16977 11271 15613 9323 24166 31176 26188 29657 12937 18982 -16575 -35488
19637 -35488 -10586 8669 2920 -20872 -11688 -23384 -5342 13229 14880 6435 -3172 -675 1767
19624 1767 5280 23876 35132 40451 35812 40156 46960 44956 65733 39791 35812 31449 31297 50810
19610 50810 31709 24411 8868 21092 37216 50177 34409 23592 15533 34272 32409 23532
19598 23532 57739 78832 88476 93989 143012 167917 187409 188578 191819 222360 245951 329098
19586 329098 393543 470787 571061 659417 745135 793737 800610 792147 708504 606344 527540
19575 527540 467819 404172 361188 300659 254441 221627 176699 142449 112678 92562 93768 94602
19563 94602 101358 100807 91786 101948 94258 112274 120130 106294 76604 77236 61846 50570 55181
19550 55181 48481 31009 12401 31852 60192 47204 28846 37700 46559 56928 54921 78969
19538 78969 67752 46853 38251 68787 86597 76932 78592 64030 55847 66485 58521 53652 50742
19525 50742 53023 59201 47990 23664 38726 36491 39819 17819 57648 95745 94273 56976 55885
19512 55885 64739 66544 66839 85092 116717 139838 116521 104228 90487 108358 104370 89883 83741
19499 83741 89581 83243 93350 94183 84934 99291 94608 111936 126380 146385 129792 111795 114955
19486 114955 132748 125177 117758 126964 141563 179333 196580 215000 227529 255359 246397 217940
19474 217940 229130 228346 225592 257857 297613 294323 265099 256199 266998 287379 291900 305955 300862
19461 300862 327757 357032 394115 427912 441227 431462 423917 446258 472408 518109 576534 666702
19449 666702 728579 766654 838629 957623 1079701 1194156 1307917 1395996 1477048 1557188 1671075
19438 1671075 1781902 1873194 2012702 2220967 2479808 2765345 3107929 3487243 3929820 4526984
19428 4526984 5323549 6344843 7663344 9364222 11698940 14972013 19586100 26078962
19420 26078962 34697362 44791826 54683046 62041903 64929605 62487459 55537076 46293099
19412 46293099 37268059 30049034 25135619 22324468 21266669 21773278 23957344 28124514
19404 28124514 34589986 43347814 53388407 62407736 67794230 67926079 62696304 53503691
19396 53503691 42803060 32824529 24814834 18955836 14798782 11889919 9798385 8234472
19388 8234472 7030124 6093177 5351832 4741213 4224803 3732665 3360749 3043806 2754645
19379 2754645 2535941 2383588 2263495 2154954 2020694 1885862 1757355 1638401 1472197
19370 1472197 1315068 1163247 1046155 1003519 943007 887241 804909 727685 680862 659600 625703
19359 625703 582266 586502 582464 547861 510139 463542 472252 469980 445007 424438 431118 411707
19347 411707 392472 389697 357301 331120 305755 293761 292720 308436 300935 302250 288237 282316
19335 282316 286185 264398 241564 244572 255131 240756 238563 232037 206163 193616 183275 201550
19323 201550 194149 196847 224068 225548 218929 224604 233159 221650 217700 215407 247118 280984 273910
19310 273910 291764 317376 314441 312489 281088 259179 261298 221035 189548 171346 171985 168098 166933
19297 166933 185105 200465 207939 246370 262911 236903 224667 202714 184509 151664 141776 154015
19285 154015 155604 144837 131756 122203 125311 117383 134159 129033 116418 101809 83225 58372
19273 58372 52958 59639 76593 85258 79913 94426 99135 84944 69882 85974 106007 112500 115160
19260 115160 122572 140108 165310 182796 203176 189135 198465 205331 207899 211491 210230 205214 184701
19247 184701 146446 118198 70819 69819 126075 133411 123731 113406 160395 192059 194197 197914
19235 197914 189941 143463 96879 59685 62960 80478 66631 37669 43475 67700 95012 73747
19223 73747 41695 14965 24984 39821 52214 40510 27393 7192 7515 4910 19127 22629
19211 22629 13021 2069 -13366 -14475 -10540 2071 -24342 -46627 -18575 -7349 -1555 -4466 31467
19198 31467 63921 68667 47961 8162 -7747 -7034 13181 31970 26620 43231 35211 14602 15965
19185 15965 33345 44609 46276 57482 59645 65594 74941 64390 46598 42215 49705 63765 28153
19172 28153 22711 19323 24339 31067 32953 34178 48941 71155 74656 49850 57665 91293 80459
19159 80459 54924 30445 16103 8502 36516 40922 32593 49833 44182 44088 69603 92975 70433
19146 70433 33478 20155 34560 54860 48940 27093 30952 22729 -4436 9404 30414 37814
19134 37814 28113 35413 14272 -19452 -19870 -17848 -1578 10535 6666 19861 20817 21822 26272 -4234
19120 -4234 -4730 1638 -8308 -21427 -21544 131 16981 13550 30988 32423 41688 44894 55477 54593
19106 54593 47898 14872 5449 30489 485 7576 7941 6351 14820 40830 45053 24027 3498
19093 3498 10627 124 -11702 190 371 9476 13052 7235 17376 22211 17372 -15459 -19799 -14254
19079 -14254 -10636 23937 37883 228 -1297 21292 28363 47018 67654 36749 14287 28722
19067 28722 8877 3811 -5332 5634 21260 22702 19167 9675 -37702 -53457 -63509 -48999 -15563
19054 -15563 -8595 -3784 -10413 11078 31432 21313 -13332 -29728 -14356 -8170 -8781 -38712 -44827
19041 -44827 -27332 4483 47938 31955 -316 1789 3935 -25179 -10775 5247 4251 15830
19029 15830 21493 28239 24425 27291 21446 16707 4675 12542 947 4159 6093 21337 19038 -110
19015 -110 5994 -33411 -37415 -7575 -16344 -13507 -399 -17587 -36803 -32266 -33530 -25891 -5139
19002 -5139 8114 3033 23860 42240 22519 30908 27599 19669 9748 9626 5695 6172 20410 19869
18988 19869 6044 -1333 -565 21974 21641 28523 42767 55316 45492 42394 28997 20932 26192 12118
18974 12118 13212 -781 -12176 -27712 -15227 7617 33032 43008 26936 1980 -17771 -10994
18962 -10994 4908 -17446 -33262 -12063 -2350 -28787 17289 41914 30472 6377 6558 12365
18950 12365 5466 4408 18278 -5363 -15970 -51 23379 2352 473 -17065 5701 25140
18938 25140 36118 49887 59895 56535 28704 11271 7249 -1643 7205 17019 8270 -5781 5460
18925 5460 23236 53922 45748 29220 26064 18660 22499 36786 56189 68502 53194 62351 88259
18912 88259 98335 97357 98328 100945 131106 158878 159918 195602 235874 269620 305265 333552 327685
18899 327685 312376 284903 249401 222074 222346 209797 195117 218241 238752 229913 218604 223981
18887 223981 253825 316573 364723 368851 356002 359407 328756 268601 203934 169282 144615 103051
18875 103051 111148 111431 117493 118489 124850 143635 151821 145577 137848 126491 148905 150413 150909 154843
18861 154843 144804 156339 149695 141868 153474 165597 132564 97589 106025 130891 159809 178224
18849 178224 186809 200317 226231 245138 230756 238760 219577 218662 236655 253677 267429 277838
18837 277838 292568 300957 323690 353501 394117 449577 493945 543718 548464 563839 592434 612157
18825 612157 624761 632968 682563 717462 791046 901066 1004250 1097831 1210353 1298453 1428962
18814 1428962 1606240 1789724 1999788 2263056 2617296 3100758 3759332 4690655 5987300
18805 5987300 7818242 10402873 14118671 19326730 25875816 32323929 36085753 35485473
18797 35485473 31098843 25087773 19549756 15413000 12645537 10990481 10131817 9944224
18789 9944224 10398934 11582901 13623524 16867065 21520454 27230618 32411429 34704208
18781 34704208 32867243 27840811 21741109 16361294 12350778 9589082 7658731 6259376
18773 6259376 5228339 4454199 3930558 3519958 3200428 2948230 2751779 2593583 2487348
18764 2487348 2444799 2417312 2375194 2359376 2388034 2469251 2558475 2698912 2893520 3151190 3492486
18753 3492486 3940557 4579617 5491967 6728918 8442423 10850343 14285154 19185187 25640523
18744 25640523 32797887 38367206 39841708 36603852 30394861 23839782 18581997 14941585
18736 14941585 12662571 11376013 10909673 11147762 12079275 13926333 16949925 21482887
18728 21482887 27458789 33773284 38059382 38054512 33586240 26759311 20004197 14748165
18720 14748165 11086679 8583126 6819151 5551134 4592939 3863593 3354551 2967696 2664355
18711 2664355 2389553 2120800 1908566 1697921 1546734 1421128 1293270 1165990 1083917 1021063
18701 1021063 960119 905554 882895 845701 841318 845656 823760 771598 727838 660761 594605 545850
18689 545850 478800 431677 413488 411700 422910 399812 379233 337573 299408 287151 267213 259397
18677 259397 279321 292343 287252 275053 280089 263784 244736 224785 228182 231950 215187 205757
18665 205757 189453 202768 169560 175759 207881 213851 197301 167274 181825 167478 162890 183683
18653 183683 178929 169798 134372 132455 149174 167836 187778 172780 115262 84441 99115 124474
18641 124474 93431 91359 97421 84729 72891 109127 131453 113270 111661 121174 136388 126312
18629 126312 118642 124930 148195 162169 114782 70099 54653 62461 76738 71546 22028 17026
18617 17026 38605 29214 15296 4398 20511 40895 36220 44269 40930 43114 55105 56722 47000
18604 47000 45278 50677 57489 52751 80741 79239 69279 71523 91843 82904 46794 41991 49186 47562
18590 47562 63768 48047 61488 70898 68009 63648 51215 40146 45621 46662 29055 21163 13776
18577 13776 15854 27716 22246 995 22268 36132 45493 19945 -10323 28944 43062 54631
18565 54631 48314 46240 57771 46106 52645 72960 66866 54364 42308 47049 19871 -6638 1422
18552 1422 15770 17944 8295 26241 31250 27545 68602 68555 66170 57918 64323 53197 68872 74421
18538 74421 33777 37987 32121 42050 43518 18184 3424 8849 13241 5385 11905 -3938 -7393
18525 -7393 -395 12805 5478 -5428 -12351 8435 21692 26935 25496 13708 24931 49015 90662
18512 90662 99004 82276 38825 39126 52317 19297 17576 30567 31961 47336 76458 86484 76390
18499 76390 69674 83719 79765 83442 89341 60374 66772 66226 58274 41674 74394 92031 75676
18486 75676 83404 79449 99185 105722 87159 71783 61272 43369 71337 83319 67775 68626 57082
18473 57082 60643 42273 48427 69283 88317 50160 24875 6420 34033 29728 10524 7363
18461 7363 8160 -856 -1360 -2177 18063 23246 46067 35529 21826 -10073 -18912 -9041 8761 -9151
18447 -9151 4943 20876 22330 17262 12590 34739 45101 37840 70880 77366 65641 53288 32806
18434 32806 27066 36250 60679 81492 103522 130144 130196 145677 140967 90454 28735 10563 24411
18421 24411 22172 7473 15909 21238 -5262 6547 30188 11652 2059 9994 18260 20514 28316
18408 28316 23211 11434 23703 35832 35388 30963 17006 4030 13110 20641 33866 51650 82912
18395 82912 71763 49122 56359 43659 48584 49860 21108 -27322 -33768 -13094 261 -1255 4507
18382 4507 14782 9986 5089 17997 44264 53399 32528 24410 17062 28609 46810 4580 4922
18369 4922 20859 21214 14960 6018 21218 10341 8008 -3852 -683 18252 12273 -17931 -25577
18356 -25577 11855 -3246 -41594 -38553 -32984 -31060 -16778 -180 -7751 -16057 -15407 5765 13298
18343 13298 -33477 -39859 475 26462 36350 48500 54201 32924 34837 37508 -2867 -3068 19419
18330 19419 11855 12058 -20860 -19548 -29721 -8339 13816 39634 27665 31153 42022 28903 22568
18317 22568 32098 10791 15543 14379 25823 16609 -8039 5301 30214 54528 45018 30399 18730
18304 18730 9813 11927 28995 23746 31662 18686 31967 41297 44043 66316 59974 46310 23221
18291 23221 18932 24208 66599 137049 129507 120225 134016 150200 144973 163257 202527 172144 152940
18278 152940 121826 115642 133747 115535 93461 97259 118618 110030 117575 132914 166593 187713
18266 187713 175810 177699 159752 125389 107781 102410 81387 64294 64165 73961 54528 29704
18254 29704 29912 54873 93642 124105 97577 61787 37884 55866 66978 88130 87294 49282
18242 49282 40186 87259 78870 79449 73890 83571 62020 57234 69153 57211 21617 41380 75787
18229 75787 117248 135304 152735 196849 217799 217720 189073 161260 135441 91861 102972 122464
18217 122464 130286 134278 130546 123635 106517 101818 134725 193249 232976 223546 209062 169462 140617
18204 140617 131397 106737 87441 91832 80327 42930 30105 37549 37397 29234 18989 -14012 -27361
18191 -27361 -23095 -13246 4141 8269 15886 6351 12110 42226 17392 -9919 252 31651 14499
18178 14499 12319 18653 8576 -1717 -6232 -1695 -18676 -6332 3732 -2696 21934 45528 38518
18165 38518 31958 29617 14577 -26282 -49550 -34376 -25064 -8746 -4162 3627 -4405 -24398 -28407
18152 -28407 -18864 -20863 -8314 -6660 -3915 -10739 -31080 -25854 11727 26383 22582 35320 30148
18139 30148 1418 -10517 -1401 19376 16619 -829 -11544 -7434 31869 41403 64501 75695
18127 75695 87790 101214 134302 156327 206153 253064 283851 294594 283854 289781 285816 256843
18115 256843 225432 178182 126843 86981 77199 48786 40288 22212 18158 36966 38813 18008
18103 18008 4179 6085 10627 20325 12972 -100 12197 35352 41499 44660 28946 10410 -2924
18090 -2924 -22656 -27437 -22013 -18980 -10644 -11228 -20158 13369 12130 24799 30568 18234 27179 48375
18076 48375 31401 40192 44509 34816 57743 49992 63437 75150 102766 134682 162442 214523
18064 214523 250253 295748 300338 270700 241471 201154 159962 97863 79482 67880 67230 52059
18052 52059 32436 24427 11936 974 12880 11216 13790 29347 50862 60800 54169 28360 -13702
18039 -13702 -23366 -22139 2303 27592 33310 31587 41395 36866 27388 -1684 -33343 -46655 -43277
18026 -43277 -31665 -9189 -20274 -27500 -27392 -36658 -27217 -30753 -4451 -9258 -4338 -8497 1116 -6405
18012 -6405 6207 28605 -5336 -21830 5001 14919 22878 19983 4126 -12545 -11607 5674 18544
17999 18544 13304 32861 27221 28610 25808 39268 42945 44319 35146 28112 18495 -4838 -23989
17986 -23989 -2076 1292 -3658 6259 -11761 -25607 -34593 -69778 -77533 -38754 -1699 8832 968
17973 968 -26456 -11879 2299 8453 12824 24119 13780 11515 9914 11380 3872 -3848 -8171 427
17959 427 -4126 6430 15742 20143 4116 -6784 4581 14070 8079 3542 -3768 32388 36214 19963
17945 19963 10717 21164 20858 19839 4136 -11163 -15114 -35749 -30754 -12567 -7990 -13212 -29499
17932 -29499 -37392 2884 50051 36614 32222 27579 13041 -3842 -9768 -16132 -30479 -29792 -6025
17919 -6025 7814 -27671 -53031 -42767 -34318 -45471 -65872 -54545 -38031 -20947 7435 10719
17907 10719 25753 27995 28223 2225 -8446 -4937 -1233 -39042 -56620 -36138 -13372 -3640 -1334
17894 -1334 -6008 16630 17587 4493 -10961 10210 3402 10264 5968 8277 16459 319 -24318
17881 -24318 -57665 -71562 -63936 -53088 -37419 -48779 -38388 -42456 -30394 -10987 -33866 -37792
17869 -37792 -38858 -33591 -16677 -18562 -34408 -23815 61 -4915 21886 25266 4531 -7307 -21054
17856 -21054 -41708 -53172 -30906 -19218 -26255 -22881 -26883 -36367 -24352 -46431 -42357 -16246 -19807
17843 -19807 -16019 -13238 -22146 -27806 -7332 -3419 30670 55784 50938 12762 6525 14598 21400
17830 21400 5156 -37096 -78520 -55390 -17800 8721 18750 8475 15826 -7745 -20617 -26249
17818 -26249 -24016 -32966 -20843 -8710 35297 22857 6559 16703 23937 21320 33730 54111
17806 54111 56623 71529 56102 46216 45114 30383 27103 24783 -10278 -15673 13999 26890 14078
17793 14078 16752 1643 6142 -14141 -21968 -6455 -16480 -26080 -6680 10510 23806 -26813
17781 -26813 -34244 -25041 -13318 21303 21651 21027 29975 54875 32327 10810 -945 25843 37917
17768 37917 10749 -4611 -7374 -33314 -10781 11620 3827 -35129 -25686 3184 -5072 3512 23869
17755 23869 40939 77436 38268 17187 28048 28134 27612 13276 44816 60109 46107 42951 30130
17742 30130 27738 42073 33023 46046 37413 6234 13438 25107 44508 47855 46835 10926 32224
17729 32224 55541 59930 56078 44299 35024 62919 77409 89276 61077 30283 19542 17419
17717 17419 44366 63472 65887 51937 42394 14088 748 17000 50020 61675 53555 69045
17705 69045 62668 47778 28018 32167 30955 52967 50107 52529 63184 69036 59841 44847 52292
17692 52292 53197 69023 66948 51952 54262 73617 92523 103174 122077 136432 139285 143246 154382
17679 154382 146241 133727 112603 132077 134326 145018 118836 128144 176954 197204 180878 177730
17667 177730 178140 188182 207884 202294 221608 240065 254150 246656 220239 208919 222210 242940
17655 242940 239624 247797 263879 285901 305328 299614 330981 364169 415117 427713 451724 514201
17643 514201 594343 674145 788035 886891 953694 982367 1009873 1042166 1057124 1025571 1059283
17632 1059283 1142817 1253203 1404347 1583321 1784221 1985173 2195668 2406642 2637499 2944592
17622 2944592 3354166 3905290 4624073 5622541 7019515 8995217 11769269 15748455 21543667
17613 21543667 29850805 40990670 53947232 65798822 72935214 72991270 65889287 54101626
17605 54101626 41355654 30365628 22227696 16652800 12843155 10160384 8220925 6790097
17597 6790097 5729881 4889352 4243039 3766051 3415543 3131372 2913957 2671278 2469149
17588 2469149 2299540 2147281 2051434 2021235 1996357 1997837 2000836 2038056 2033119 2038388 1991698 1950301
17576 1950301 1904601 1867046 1880065 1976675 2085569 2220790 2378136 2546902 2736392 2952659
17566 2952659 3240508 3650275 4228628 5001767 6113215 7672879 9863073 13037333 17640061
17557 17640061 24326632 33702667 45362356 57099678 65512076 67860355 63248048 53322838
17549 53322838 41432804 30576317 22210749 16415577 12497750 9763375 7809477 6374833
17541 6374833 5255650 4405252 3749619 3264451 2902558 2621021 2407120 2222747 1996795
17532 1996795 1783084 1593625 1421816 1295429 1217170 1142364 1099562 1083983 1062859 1053721 1023150
17521 1023150 1006749 956895 842229 727307 646160 602443 573403 565886 542837 529447 528267
17510 528267 518657 490980 443499 411138 390084 356342 335394 330703 328305 292027 266800 245850
17498 245850 244239 251060 267055 277949 262033 231232 204104 195427 214247 198600 185461 163649
17486 163649 149295 169940 160567 144849 140890 138006 127434 126285 140096 130129 152556 147781 133658
17473 133658 133251 129421 118855 160240 200800 164972 131728 130190 138970 135523 116401 109480 134551
17460 134551 153188 153397 166281 140099 143714 166207 201065 214798 201039 181094 161136 139111
17448 139111 111938 102297 98885 93125 94940 105413 77318 61828 67030 66568 63065 34898 33223
17435 33223 46667 49311 51948 23634 31077 39982 41901 58123 44690 35479 30590 37584 75263
17422 75263 80133 76060 89345 66811 71263 67059 23816 -9747 -15644 -16261 -7672 18445 48424
17409 48424 80697 57929 21644 18128 23215 34027 26884 41511 63758 80284 85697 70990
17397 70990 67051 61129 51115 66423 59262 50517 14832 2495 4138 -16596 -15262 -26386 -25098
17384 -25098 -3001 36618 48006 49638 19097 9825 3723 5703 11824 878 -26812 -10764 6532
17371 6532 34824 41234 26239 35276 55934 38023 28219 57894 45504 19092 32445 46513
17359 46513 28969 -6692 -10256 -8823 -14754 -6659 37125 40306 20260 2950 4724 1277 -2042
17346 -2042 -38545 -45633 -29793 -22188 -6924 -3170 456 -12171 -13175 10041 27782 19670 25768
17333 25768 28266 33090 39515 35298 33833 33733 4960 9478 4944 1000 -24588 -34494 -10229 -11656
17319 -11656 -8853 10849 38759 44964 32895 28956 29258 25888 -846 -5281 -4843 13976 16996 -6010
17305 -6010 -12125 27541 17006 -17477 1224 39904 22705 -8384 -6325 24843 41684 47896
17293 47896 40222 29746 36441 33592 814 -8162 -4071 -18448 -28453 -20443 6181 9060 28637
17280 28637 15853 3719 486 1674 17239 22738 10921 -12497 446 -11414 -31625 -40895
17268 -40895 -7429 22562 5141 -16 8618 17009 5274 -2782 -24856 -24531 -24726 -16031 -13381 -19230
17254 -19230 3389 13798 42551 50680 24746 -2141 -30545 -28109 -7601 -11709 -11200 -16777 -21463
17241 -21463 -12175 8104 14957 -3549 -26644 -32494 -35509 2055 14075 4600 -1015 31716 33659
17228 33659 22937 49669 43198 14417 -21309 -42312 -64609 -33647 -5995 109 -8821 -5564
17216 -5564 20561 18109 9039 2128 28948 7756 -32835 369 4070 -29819 -40673 -38391 -21528
17203 -21528 -3017 5904 15855 19252 3647 -9952 11815 22680 7633 10632 38886 24262
17191 24262 -19447 -33501 -39405 -33871 -20411 -12467 -12563 -11795 12395 15568 13087 3712 -19854 -39701
17177 -39701 -25832 -20700 -2469 8079 -6338 -13907 9662 -190 -2618 -1980 -9321 1573 6761
17164 6761 -2933 -2050 26463 35664 34167 45247 62487 50983 41414 20228 17898 23271 25465 -349
17150 -349 -13064 -5619 -2228 -11577 7611 20101 -2046 -22915 -1907 -22371 -24098 -37425 -42519
17137 -42519 -27465 -10868 20709 31317 10119 5915 11226 2531 16004 39995 22835 -5530
17125 -5530 -15631 -32195 -24560 -20215 -6565 13279 31373 7131 7562 27610 19488 13210 20687
17112 20687 -1276 9706 14656 25179 29392 24441 25870 16133 749 12946 25624 15195 28084
17099 28084 94388 92962 111407 149683 208496 263796 265588 248853 238833 211180 189058 137744
17087 137744 100080 75926 39240 22300 37738 63122 63288 39868 54065 67418 82005 69042
17075 69042 33609 25404 41874 32169 -13972 -25230 -36864 -19880 12901 5302 -3513 -8232 -23965
17062 -23965 -30455 -9172 20540 44690 53848 64347 67407 67617 67442 75453 74606 90325 72297 72486
17048 72486 80268 75912 78323 70469 81890 74458 82303 135240 202185 268119 265892 258670 246463
17035 246463 209468 193928 190645 151487 79330 58538 64220 33100 16729 -10151 -33271 -39355
17023 -39355 -31362 -1671 13560 16929 -9995 -18016 -19987 -3559 -18048 -5294 7433 13618 24518
17010 24518 20116 15121 -9652 -5348 28276 34242 37396 31716 14658 -8101 -8351 -23083 -25820
16997 -25820 -1085 -1351 -12386 -11133 -10433 -11049 -21858 -22146 -36247 -29442 -11217 -7153 -15197 -30276
16983 -30276 -44340 -65300 -39299 -18560 3311 2519 -7283 -13018 -14411 -2515 -14891 -35586 -47866
16970 -47866 -33266 -35837 -56633 -56934 -8702 -15489 -10018 176 4716 7103 31145 35699 45790
16957 45790 24976 -5119 -1934 -836 -24486 -31168 -26014 -16048 -38710 -26697 19997 30157 31984
16944 31984 31381 -5439 -32386 -41407 -19622 -22789 -46970 -47717 -36544 -25499 -32503 -50355 -51748
16931 -51748 -28084 -7097 13543 3840 -18408 -13322 -6899 -2908 -22318 -16372 8981 13640 9537
16918 9537 -2304 -19586 -29911 -52010 -33300 -34988 -50658 -72485 -44434 -42256 -44840 -27860
16906 -27860 -18940 -2534 -32527 -45073 -33137 -31394 -42659 -43189 -13949 3983 17828 34871
16894 34871 -7594 -60977 -59238 -58186 -33115 -36541 -59285 -63004 -31627 -14918 -1291 -10056 18890
16881 18890 37855 32057 3758 -6198 -20218 -17658 -6397 2288 3080 7938 2139 -13725 -6307
16868 -6307 -760 145 -10436 -16356 2629 26594 35143 12430 -21630 -26778 -6581 1896 3590
16855 3590 12442 -5802 -37468 -33179 -5502 12384 16831 12492 -4788 -23210 -52985 -41146 -34512
16842 -34512 -39827 -20129 -8327 -4420 -6837 -28866 -51177 -84060 -99602 -79433 -59665 -58046
16830 -58046 -58364 -29612 -16018 -27300 -11922 -25099 -11121 19225 21540 11054 9924 -19015
16818 -19015 -23982 -23487 -9529 -28222 -36688 -25905 -20325 -25316 -32904 -38683 -49064 -60003 -57754
16805 -57754 -44772 -48720 -46574 -45891 -41870 -42670 -66438 -59597 -46308 -42355 -48131 -38342 -23152 -16211
16791 -16211 13725 39729 42902 38954 -3402 -19066 -12007 -8220 -11670 -19791 -46082 -19133 10272
16778 10272 -6035 -9217 -18795 -3706 -12568 -28023 -37617 -25614 -11720 -16418 -32465 -41138 -15393
16765 -15393 2705 -11485 -17025 -6668 -6059 3116 -6423 -3298 -18390 -42147 -21740 -1483 -5487
16752 -5487 -21857 -10213 -31140 -11935 7297 -7065 -11158 42 -13202 -15689 -20036 6961
16740 6961 9993 -2770 22469 3719 -6220 18065 35484 29389 13681 15898 18831 7528 -22236
16727 -22236 -29141 -46887 -39691 -7676 -3401 2635 -6997 -43175 -40168 -23568 -36073 -32964 -37040
16714 -37040 -30455 -28958 -40985 -29994 1788 11355 20450 35579 25812 33574 50190 50689 19120
16701 19120 -11841 -7225 -12220 -34360 -43782 -16207 -14729 -20684 -6293 -10913 -15910 -15170 -6807 6596
16687 6596 17045 -6596 -16002 -15823 -27777 -46405 -52506 -56330 -48971 -22100 -11830 -5331 -12515
16674 -12515 -5695 -22861 -27105 -49584 -53509 -53879 -39823 -20605 4628 11706 7265 9574 9401 -25607
16660 -25607 -43035 -99342 -120715 -79809 -55111 -47221 -43928 -31350 1654 36446 35905 38881 46034
16647 46034 28302 -5719 6636 7772 -14168 -14101 -19200 -23648 -20218 -8483 -20965 -23616 -53265
16634 -53265 -71227 -56518 -8848 731 -28857 -65141 -69997 -41137 -30901 -42026 -41696 -35636 -29668
16621 -29668 -28315 -55444 -44711 -25676 -36475 -15593 -18930 -18172 -6299 28128 44073 36170 13514
16608 13514 3551 -12862 -13254 -30229 -12437 4382 -6947 -21813 1689 4640 -10985 -23951
16596 -23951 -4816 -6762 -25842 -4436 -9251 -37101 -41655 -19695 -29426 -35318 -14975 8760 16341
16583 16341 2429 -20317 -11298 -25485 -44025 -47734 -39494 -52515 -73869 -72450 -46543 -27916
16571 -27916 -15001 -39511 -51126 -47352 -12662 15758 37123 42523 -12658 -42942 -49628 -34270
16559 -34270 -32840 -41932 -37960 -13799 -9140 -19376 -17488 -21660 -24845 -37932 -31934 -14374 -38405
16546 -38405 -53680 -38975 -31722 -10863 -15937 -19961 -11305 -7235 -9611 -13583 7664 6535 -28928
16533 -28928 -36709 -38565 -28162 -18915 -21868 12513 30662 -3929 -25339 -38071 -58541 -46530
16521 -46530 -22684 -16398 -37052 -63589 -43425 -7291 178 7896 -5993 -10486 255 -12176
16509 -12176 -29875 -50169 -34814 -17381 790 17596 18054 8358 37154 34328 -12578 -54100
16497 -54100 -53969 -52765 -57265 -37799 22147 21154 -15108 -59590 -70644 -47298 -31866 -19268 -37824
16484 -37824 -58363 -47078 -27627 -60911 -69830 -34367 -18466 -8173 22450 9293 -89 -24465
16472 -24465 -57478 -58428 -44216 -9240 3731 13037 1661 -12413 -32030 -9270 3258 15355
16460 15355 13769 2279 -5819 -23736 -9109 10228 15214 13330 -2832 -17802 14540 17617 -7074
16447 -7074 -8703 -5566 -24067 8747 18486 16693 -14731 -31540 -42878 -563 -2621 -14317 -28555
16434 -28555 -24241 -48512 -29154 8656 19592 -4494 -16326 -13865 11101 -4335 5563 16935
16422 16935 -4987 16614 12796 -3286 3246 23873 17194 6474 -1415 -12409 -22461 3232
16410 3232 15455 20771 28934 8812 949 694 4473 -4417 -34620 -74220 -88377 -87532 -46618 -25727
16396 -25727 -30046 -19470 8301 16785 21884 19026 9460 3841 -10307 -2754 7004 22293 11456
16383 11456 -24239 -32761 -30581 -25139 -17894 -13129 -21941 -47998 -58446 -66083 -55641 -51736 -58164
16370 -58164 -56020 -49513 -41399 -43060 -2327 -15402 -44246 -56510 -47815 -34665 -48847 -44777 -39988
16357 -39988 -34488 -26201 -39139 -27910 -26984 -25093 -3079 -17916 -46828 -29552 -36305 -9969 6861
16344 6861 18130 12833 6629 -17311 -36389 -21115 -10310 19401 20460 12515 -9568 -11959 -7029
16331 -7029 3990 -7084 -43673 -58778 -28756 -854 -6593 -9794 -26428 -10488 1901 4389
16319 4389 24274 30083 -4488 -20056 -17145 -11432 4155 -4965 -10370 2591 -13483 -21735 -18113
16306 -18113 -34217 -64655 -61858 -56090 -40093 -37630 -30145 2572 20525 14982 10208 13400 19413
16293 19413 -2391 -30786 -20808 14331 1646 -17375 -27237 -20463 -30926 -20067 -4559 2397
16281 2397 5883 4217 -413 5613 6844 10193 11853 7510 -2415 11086 7890 9879 10688 454
16267 454 -18432 -36362 -31441 -26699 -23222 -45848 -46816 -48779 -27265 -3983 11474 -15467 -3081
16254 -3081 4895 1986 -18031 -45266 -36761 -31657 -45400 -32433 -11702 8577 67 6329 3047
16241 3047 -8476 24722 33124 -898 -10594 11492 3242 -798 6590 12097 32654 22401 4276
16228 4276 -19535 -24909 -34395 -32800 -6000 -16121 -35426 -32857 -21579 -4821 -6031 -13417 -6110
16215 -6110 -14683 -20252 -14793 -30845 -14529 3561 -18384 -7538 9 10349 -4783 -15838 -5452
16202 -5452 -12141 -29693 -40265 -61910 -73455 -76171 -47600 -8991 2042 -13211 -40269 -47395
16190 -47395 -56425 -47315 -32325 -38926 -52232 -61276 -57484 -50837 -40984 -47010 -42191 -6643 -7101 -38495
16176 -38495 -44095 -53606 -46354 -21143 259 18626 44196 14941 22031 39699 2822 -22082
16164 -22082 -15736 -32913 -45206 -22462 -34380 -47430 -37329 -21743 -3057 -24904 -47529 -45605
16152 -45605 -26743 -14834 -13074 -23561 -24792 -32111 -33578 -36702 -42854 -40032 -50578 -58598 -39569
16139 -39569 -41533 -34156 -19314 -18348 -29320 -39275 -48191 -18488 -8457 -5679 -37284 -23071 -30281
16126 -30281 -15881 3221 -11202 -31205 -45255 -41279 -39045 -54179 -54125 -46821 -16757 -24008 -27342
16113 -27342 -54750 -40437 -44489 -36988 -33260 -43827 -53776 -35468 -12915 -26179 -7194 4344
16101 4344 15685 -8266 -24388 -15552 -27846 -42886 -42899 -26012 -39510 -57754 -51962 -25491 -6621
16088 -6621 -15800 -5183 16431 34204 29151 6392 507 311 12338 1459 -8000 8965 -8261
16075 -8261 -23501 -21032 -12869 -6785 16899 42003 41677 29563 36097 35858 23654 -18900 -27195 -23383
16061 -23383 -33348 -14770 -11261 -15754 -4301 17606 22927 4459 32830 19890 12717 9174 -1234
16048 -1234 3344 -20862 -22283 -8743 9361 -10209 -4207 6564 23270 28392 17493 -1711 -25370
16035 -25370 -50427 -60671 -43497 -15660 -9370 -35198 -30575 -31185 -18789 -27523 -19051 -3438 -1182
16022 -1182 -15465 -24018 -27778 -31595 -39598 -33807 -37861 -54713 -39258 -10974 10286 20059 38638
16009 38638 30676 13161 -1594 -34570 -20668 -5204 -2778 7231 15120 27393 37146 28261 27461
15996 27461 43576 67151 67135 61999 28276 12251 8353 26144 38745 24049 17503 738 32370
15983 32370 28895 9803 6195 -20834 -38333 -40198 -30624 -16117 -24061 -15712 -5344 -15128 -18295
15970 -18295 -13511 8297 40274 61939 59568 43699 16153 -3695 -39737 -37110 -11680 -10662
15958 -10662 -34868 -11519 39739 5028 -20283 -1752 19457 14051 -675 -1819 14725 18738
15946 18738 15407 8227 -31305 -24720 -5518 31179 63331 49729 17075 -10390 3099 -7046
15934 -7046 -23266 5389 1287 -2871 -769 -8365 -13148 -25726 -53139 -68084 -68809 -13684 -11961
15921 -11961 -10915 -20646 -27208 -19869 -43451 -69170 -46540 -28916 -14342 8070 -15996 -23894 -24514
15908 -24514 4796 21470 12897 8223 9014 -3202 -17220 -20667 -2699 6991 -11370 8904 27537
15895 27537 37492 4531 -29938 -64018 -56894 -25192 -17178 -28640 -32097 -29138 -16129 2467 -2190
15882 -2190 -15989 -42097 -41165 -42776 -32408 -46522 -41114 -43378 -64565 -70447 -35081 -2668 -19536
15869 -19536 -22656 -12950 -45507 -56228 -48919 -25243 -24381 -45581 -49484 -43512 -39261 -36514 -20225
15856 -20225 -22950 -17859 -24022 -23573 8124 14739 -12593 -38089 -55108 -62806 -46242 -37051 -25335
15843 -25335 -18787 -10487 -27756 -52868 -49759 -49940 -36939 -45810 -23810 -12755 -15172 -9132 -8938 1541
15829 1541 -10059 -11842 2727 8799 -17065 -39567 -46333 -34205 -12619 -18421 -29090 -13751 1670
15816 1670 7204 -595 4880 15363 34455 -1426 -12953 -2393 -6391 -8677 2411 -3681 -13059
15803 -13059 -16697 -24897 -8904 8090 26549 20158 11042 9325 31521 21483 9869 6975 -16948
15790 -16948 -50022 -58639 -59670 -71046 -54900 -29406 -12440 18749 45266 12309 -1667 16114
15778 16114 18734 -12909 -25796 -41764 -17857 -8864 -14427 -24777 -37016 -35852 -47172 -55173 -49558
15765 -49558 -33534 -15267 -25227 -47739 -33593 5469 21389 4477 -13269 -17735 -30330 -24587
15753 -24587 -31005 -32159 -25323 -19583 -21252 -11338 -9533 -37204 -47631 -32200 -1802 13368 8178
15740 8178 7335 5793 38616 53201 43371 9007 -21640 995 16952 258 -14795 -12654 -1474
15727 -1474 -14213 -3029 -19213 -11231 11156 19531 13150 27077 -7183 -7944 -6391 -16312 -25301
15714 -25301 -8598 -808 15548 12808 1198 2981 7832 -19585 -3419 17276 6518 -40132
15702 -40132 -41167 -23372 -23461 -5620 -5589 11008 32799 28455 44151 13951 22370 13763 -9069 -11522
15688 -11522 -20088 -31348 -28463 -34974 -33218 -31054 -22118 -12862 -19208 10846 30472 48855 41515
15675 41515 20448 1372 -31903 -40373 -24121 -33072 -22422 -6459 -2582 -7909 -13780 -23531 -14627
15662 -14627 -16646 -33530 -35899 -4532 16071 12986 20271 33039 43566 31580 23587 -173 -17436
15649 -17436 -6124 12167 -7004 -26514 -23889 -26841 -40447 -34879 -29901 -22445 -4106 10274 4418
15636 4418 -13699 -18238 -18567 -19557 -17406 -35190 -41727 -43570 -42987 -44495 -34580 -35355 -26079 -17945 1271
15621 1271 5235 -23826 -41720 -56680 -73139 -65631 -23882 -15798 -15582 -35627 -54378 -38311 -40107
15608 -40107 -28740 -31514 -44080 -47844 -59254 -42581 -1889 2788 -11496 2032 -7289 -18406
15596 -18406 -11273 -7745 170 4386 7821 10666 -24798 -47867 -46494 -37005 -39020 -22765 -30175 -28899
15582 -28899 -8789 -24530 -51411 -43458 -52978 -44698 -33089 -7352 2998 -14119 -18290 -27166 -32389
15569 -32389 -21856 -11634 -2690 -14935 -34219 -44626 -42874 -32795 -17091 -18063 -33573 -57227
15557 -57227 -62378 -40274 -29529 -821 30075 22892 -3462 -1089 19977 28230 -4673 -27119
15545 -27119 -46637 -32485 -17620 -25976 -15436 -2407 -20927 -18292 -616 14589 30698 22145
15533 22145 13210 1725 2038 -22353 -34571 -39780 -34287 -22018 -34744 -31873 -14513 -23084 -16276
15520 -16276 -15470 -12693 -20521 -26235 -33621 -23629 -62467 -78798 -76759 -58630 -43211 -30940 -23215
15507 -23215 1174 -21839 -54682 -52537 -22225 -36470 -55007 -75477 -60527 -41867 -51977 -58394
15495 -58394 -66490 -65065 -18161 2280 24707 31240 30818 13230 -26659 -35708 -14072 9742 10989
15482 10989 -8521 -2973 16706 7208 -6754 -22867 -35016 -24939 -5063 10889 19324 12337
15470 12337 12904 -2567 -5601 -1267 -5656 -24421 -40152 -32545 -29358 -27774 -47388 -16795 5314
15457 5314 -4140 -5788 -15324 -24567 -8992 -3799 -15501 -21696 -11910 -20510 -18212 6544 15255 32291
15443 32291 22167 -2029 -3822 -20939 -10433 17557 20471 16366 33577 34856 18420 1244
15431 1244 5467 10337 -7641 -12793 -11367 -13491 4220 -2232 -28493 -22284 -14466 -51481 -57868 -67200
15417 -67200 -60847 -57345 -52334 -49047 -66055 -75240 -39617 -27213 -41129 -16930 -10789 -6259 -16856
15404 -16856 -3591 5127 22820 26795 -11586 -34005 -39277 -33224 -39009 -55142 -29897 -11782 2240
15391 2240 21735 7935 -18959 -50574 -50077 -27624 -25022 -14053 -28000 -20942 8970 6934 7776
15378 7776 -2106 -16202 -28978 -44812 -39077 -9841 15927 19043 23528 16342 -32912 -38240 -31293
15365 -31293 -22941 1783 30133 26405 15518 7467 -8848 -19387 -30175 -40613 -33860 -10814
15353 -10814 1555 -12302 -6748 10321 17040 -15595 -30160 -39067 -53152 -52638 -33768 -3306 7992
15340 7992 30433 38825 28018 -2574 -15782 -14004 -14769 1844 2290 -15875 -28634 -10675 -8097
15327 -8097 -19369 -28793 -29349 -4100 9569 10032 13754 -10071 -24439 -16314 -13244 -17336 -18037 -33854
15313 -33854 -19853 -18411 -20012 -29992 -26710 -26398 -26122 -50618 -12822 27282 6768 -24227 -10218
15300 -10218 -21470 -43437 -35518 -26932 -27563 -10354 -14135 -33633 -42039 -25336 -19296 -24368 -202
15287 -202 32268 41055 24593 5738 -9615 11829 32201 52013 49848 29943 2893 -6151 -31459
15274 -31459 -43862 -34277 -16117 -21991 -28473 -5681 17972 6327 -11106 -45663 -7982 2041
15262 2041 -24409 -33179 -18826 -11309 -21640 -30558 -14414 -36675 -34236 -34096 -36695 -47276 -47083 -33400
15248 -33400 -37962 -61121 -62882 -45330 -37380 -32190 -14027 -7163 -19819 -27234 -42775 -47429 -61918
15235 -61918 -42225 295 -12822 -23003 -28999 -10572 7467 -9383 -3462 8223 -18903 -35974
15223 -35974 -41353 -35027 11408 15197 -10760 -28301 -20610 -5139 -35563 -59011 -60428 -41704 -52871
15210 -52871 -77072 -63732 -68751 -79735 -61279 -26927 2142 -6194 -5414 12984 2955 -13235
15198 -13235 -1468 -14513 -24422 -10828 156 15376 17214 29978 15618 -5581 -8146 -6893
15186 -6893 -14070 -10435 6322 13269 29279 47833 47951 41703 37110 -5923 -30895 -10084 -6968
15173 -6968 -16165 -10778 -28211 -70512 -72666 -51033 -48137 -34272 -30228 -31636 -22596 7540 16105
15160 16105 2613 -22411 -47381 -49706 -26929 -10289 -10933 -1408 15281 29849 46151 43037 18601
15147 18601 19287 33866 37625 36500 12756 -5940 -24573 -23990 -20702 -26329 -17001 10501 4897 -16147
15133 -16147 -16325 3164 -1476 -24427 -52694 -48069 -14715 -16783 -31031 -20861 6162 2395 335
15120 335 -17649 -35691 -43864 -38823 -41738 -71855 -56433 -26180 -19718 -33194 -41039 -30042 -30223
15107 -30223 -35797 -39013 -28621 -45674 -25517 -9928 12100 23597 36376 41574 41418 50096 46530
15094 46530 33461 17800 -22450 -43290 -33134 -20189 -35267 -44945 -45819 -41697 -52228 -69613
15082 -69613 -45627 -8203 -4093 -1739 12021 11244 10123 9155 17104 23190 -12460 -41759 -47823 -50307
15068 -50307 -48808 -64394 -66837 -30386 11982 39872 14178 9323 40042 51984 16915 -11000
15056 -11000 -13312 14011 36361 26135 -14131 -38050 -52450 -21410 -8083 -4718 -8990 -37114
15044 -37114 -59538 -54986 -41307 -28133 -2101 8012 -1083 2335 20505 13465 13447 27039 17851
15031 17851 12397 7455 6571 -6081 -19974 -20118 8839 10173 15707 33031 31728 12458 22181 22925
15017 22925 -4798 -24157 -3326 3689 -19212 2029 20645 33479 5529 -13645 13050 8458
15005 8458 -21696 -48425 -51213 -56948 -70779 -42869 -4809 4398 14544 35222 43674 56274 53926
14992 53926 53957 19248 11200 9603 -3479 1837 43964 34679 -13166 -14393 -7064 -8742 8450 21670
14978 21670 20308 4678 -7124 7388 1954 4648 28778 34370 36437 24178 23529 -4692 -14380
14965 -14380 -7368 -22311 -29600 -17038 -5493 -11946 -9172 4134 19796 29796 16213 13050 -23736
14952 -23736 -18977 547 2504 -30865 -40409 -18444 -10063 -18307 -17074 -3138 15478 30477 28060
14939 28060 13461 -1436 -29770 -49504 -55170 -19861 -2233 -19456 -19520 -9755 3087 18192 11409
14926 11409 -541 -8762 7085 6875 1976 9779 4967 -11549 -1929 -1452 -14036 -55058 -56614 -49760
14912 -49760 -57281 -72973 -75958 -54788 -37331 -37647 -45114 -44320 -27189 -15540 -13894 1893 7130
14899 7130 5337 21562 26623 25285 27342 38296 36184 17916 4834 8499 -5145 -12017 -9125
14886 -9125 -38173 -52025 -42978 -37774 -43377 -15206 -15949 -10380 4458 8956 23141 24835 7958
14873 7958 -3406 -12366 -4377 -9751 -10258 -12586 -4003 -21501 -27738 -32796 -31143 -40550 -42816 -17953
14859 -17953 -717 3273 -4830 -20435 -7197 -19043 -5746 4557 -272 478 2377 7808 -3021
14846 -3021 -1700 4143 4139 -1620 -11899 -14036 -7093 23076 7102 -6091 -38738 -13628 -12161 -47497
14832 -47497 -56331 -62210 -53033 -10080 -3325 -14965 -28923 -23181 -28182 -30170 -19060 -25474 -23882
14819 -23882 -12339 -11447 -3038 5682 -6331 -30686 -23651 -269 -1653 -28740 -35794 -36990 -33598
14806 -33598 -13403 -14779 -12794 18932 42725 33996 30150 26420 14463 -29425 -39584 -46787 -47846
14793 -47846 -60053 -70645 -69813 -80020 -73590 -36282 -21366 -8065 -1573 -27896 -26915 -46803 -43148
14780 -43148 -18798 -24531 -43130 -58107 -33204 -15129 22348 39028 38982 51544 49904 49248 23441
14767 23441 8917 -1205 -12050 -3956 -14220 -25614 -6560 -9219 12817 26477 17163 -11248
14755 -11248 -21083 -36773 -19117 -1701 -30612 -51976 -83319 -57558 -47767 -36998 -25362 -17085
14743 -17085 -5918 -11892 -14388 -19265 -2581 -16829 -46832 -59049 -28383 -4707 -21151 -34626
14731 -34626 -30151 -14603 -16955 -13322 -16956 -14696 -22977 -14607 -17319 -12702 7316 11843 19441 -19689
14717 -19689 -27391 -9074 -8434 -26932 -44547 -69048 -76438 -56141 -28769 -35636 -53949 -48044 -60692
14704 -60692 -67172 -51392 -62065 -53618 -32107 -30281 -44795 -45259 -19925 -29723 -40631 -57043 -49124
14691 -49124 -23640 -4492 8593 13352 6571 -22809 -47505 -25851 -4919 -11566 -18931 -11229 -28461
14678 -28461 -30048 -36023 -18868 411 17979 20399 -4548 -23093 -6954 28719 33530 51748
14666 51748 62403 33320 -13229 -22248 9549 24876 12053 -15601 -46012 -16724 -7753 11415
14654 11415 32660 28083 19359 11928 -15470 -31111 -38397 -25768 -42226 -41435 -13697 -420 2373
14641 2373 -9813 2483 3024 -28480 -57527 -47895 -39226 -31556 -49634 -28504 -25618 -22337 -28933
14628 -28933 -16988 -15540 -10745 -29303 -22661 -19968 -21727 76 13200 18957 32243 28464 -13865
14615 -13865 -11395 -18020 -28113 -30560 -31919 -27268 -13281 7914 -1433 13477 28054 25487 18195
14602 18195 12263 25001 30834 31877 25576 6445 -17863 -15712 -8763 15769 19817 7802 -11558
14589 -11558 -42427 -26586 -26134 -37390 -28211 -28908 -28210 -15216 -34049 -21414 16591 4603 -7141
14576 -7141 -284 9389 -13131 -10035 -1374 10986 10373 10411 -7754 -27803 -22857 -21593 -6628 8608
14562 8608 11980 14211 7047 -25258 -24203 -30031 -31339 -57116 -39837 -19611 -6332 -11681 -13956
14549 -13956 -15472 8723 23652 15437 -8485 -6402 -18865 -29916 -28443 -23388 -39639 -29893 -26234
14536 -26234 -26691 5721 10352 7911 -21182 -21471 -1606 5546 -19636 -15326 -603 -7568 -38283
14523 -38283 -53492 -77158 -74802 -97673 -100326 -83559 -72163 -86777 -90865 -51837 -30911 -1644
14511 -1644 -6729 -29927 -27544 -27005 -43620 -47895 -20028 -25949 -16762 -24323 1302 21904 20643 -6769
14497 -6769 -33634 -48966 -65303 -38944 -9340 -12547 -8475 -12706 8281 11020 -549 -40401 -56717
14484 -56717 -49319 -41371 -53317 -51168 -37741 -34075 -36504 -49937 -42261 -62056 -62628 -22262 23308
14471 23308 15262 -22109 -21550 -26013 -37662 -37892 -45493 -53455 -34604 -28813 -26579 -34414 -10885 -4239
14457 -4239 -15866 -5261 21768 33601 4460 -30874 -32079 -9886 -6982 -19096 -32723 -17597
14445 -17597 -18283 -34539 -8829 -16163 -20641 -8381 -9147 -12083 -40945 -42746 -21343 -3012 1877
14432 1877 6734 7553 -28227 -23625 -14175 -22199 -25220 -33498 3871 36082 25429 11878 -9564
14419 -9564 2200 24551 30770 19371 4258 -15230 -39229 -63938 -52536 -61394 -68833 -50066
14407 -50066 -7182 -10590 -25826 4690 -3131 -40367 -34302 -25316 -35486 -31861 -17537 2706 2914
14394 2914 2446 -13239 -19113 -22509 -49790 -53770 -25819 -35714 -33738 -6752 15079 7169 -6345
14381 -6345 -13059 -42165 -51055 -42776 -14812 28859 32506 32601 25232 10698 -6141 -25689 -24485 -26871
14367 -26871 -27882 -13057 -13964 1220 12207 18480 19182 -179 -2798 12248 16485 24361 8346
14354 8346 -1930 -26244 -37624 -38656 -20694 -35641 -53900 -37909 -11845 5462 21597 22297
14342 22297 7547 16310 4351 -5822 13514 19865 14420 -13055 -13284 -30907 -42831 -22532 13290
14329 13290 25104 16306 -16807 -29252 -17144 -29606 -33761 -44840 -62324 -86146 -57107 -54588
14317 -54588 -38340 -26542 -17714 -20791 -42955 -53006 -62933 -47430 -4917 11326 21965 17739
14305 17739 -8642 -28533 -28159 -31641 -37726 -53240 -58124 -26402 21715 11901 -1555 -27950 -44834
14292 -44834 -25821 2514 7399 -9135 -21238 -14390 -10706 -2833 1234 13291 32266 -1378 -14091
14279 -14091 -25622 -8122 5925 12929 15447 -4035 -28305 -50799 -45605 -15949 -13477 -21870 -17051
14266 -17051 -13352 -3090 -25 -8042 -19653 -9328 7529 9876 -21144 -26467 -39060 -31763 -2268
14253 -2268 6016 1048 1126 -4628 23393 7345 7495 -9343 -45600 -26686 9010 9807 -17971 -31518
14239 -31518 -29553 -28190 -7156 -4826 7728 18304 20672 15659 -5594 -798 8134 19149 23178
14226 23178 16304 15915 16604 27229 37651 21394 14748 -1679 -6534 1062 4701 -19603 -22468 -13754
14212 -13754 -4209 -1599 -10611 7450 15384 -14107 -18405 -3108 9615 17715 16880 25816 22143 25920
14198 25920 16835 -5790 4678 26512 34843 2994 -19092 -7086 -13686 -11756 -2829 10522 20550
14185 20550 21424 19581 -9721 -13083 10519 1803 -196 -8886 7961 20260 16654 13104 -5765
14172 -5765 -23398 -7722 -14186 -50681 -48778 -11513 347 24342 40344 55539 51854 24579
14160 24579 1113 27114 22580 8224 -5911 23825 25787 13798 -9655 -27328 -41891 -21024
14148 -21024 -31607 -45412 -13333 -9928 -23113 -50824 -68398 -46155 -25174 -20841 -2762 16176
14136 16176 22265 -15607 -35040 -38384 -20311 8821 2940 20918 7189 7701 37109 11665 -28263
14123 -28263 -34335 -27774 -18867 -17470 -30753 -30849 -47188 -44347 -54494 -41002 -24410 -6292 -7071 -12105
14109 -12105 -18515 -3301 29546 19073 -15855 -9996 24634 15224 16088 16671 -12103 -10593 -9851 -6902
14095 -6902 -2757 1339 9190 4785 1283 18440 -11987 -22369 -26881 -2325 -1452 -1518 -630 -24359
14081 -24359 -16926 -20472 -19495 -6651 -36083 -39915 -48520 -53821 -49240 -46955 -39708 -26842 16257 55177
14067 55177 45982 43187 -1824 -21045 -12958 -218 25032 40902 28223 8011 5879 -5213
14055 -5213 -8932 -30215 -25771 -37747 -30287 -27734 -10060 1597 5588 8613 2872 -1453 -16156
14042 -16156 -20521 -26177 -23459 -25461 -36111 -34714 -14098 6519 17356 28829 -5337 -25802 -21630
14029 -21630 1174 16022 30322 376 -5362 11625 14602 -878 -10308 -28568 -44438 -6271
14017 -6271 8197 24686 22138 12682 5213 -4527 -14651 -28399 -36875 -24127 3218 4904 -22857
14004 -22857 -35493 -20768 -9728 5307 -9112 7801 -3753 -19085 -40202 -15155 -9425 -2688
13992 -2688 11291 12611 22916 13260 -6211 -19117 -43183 -21629 -13850 -6368 -22084 -57919 -22301
13979 -22301 11796 25356 8999 8990 9021 -21709 -14731 -10190 -18178 -14918 -9454 412 -7489 1122 -7501
13964 -7501 -29687 -23566 -3052 15337 1640 -23836 -21374 5759 10256 37637 6735 -10945
13952 -10945 -22038 -31978 -36685 -49089 -62536 -65015 -75343 -50834 -17038 -11684 -34514 -40415 -32550
13939 -32550 -9530 4970 -3486 -7820 -27163 -34540 -38284 -36713 -25673 -17512 -13276 -1920 7265
13926 7265 1901 -42913 -56737 -31686 -13435 4609 -14426 -51060 -59112 -58568 -59922 -43750 -30223
13913 -30223 -33214 -26185 -45325 -59534 -44556 -12002 215 -3698 -3795 9057 16836 14466 37154
13900 37154 33671 22845 16454 9035 -1693 -24948 -13700 -27620 -35979 -33636 -19201 -18174 -33505
13887 -33505 -37774 -15810 -17225 -37198 -37246 -23951 -23768 -2659 -3736 3394 -5871 -17384 -38989 -44492
13873 -44492 -36707 -40880 -47493 -30486 -18710 -24193 -6336 9979 37910 42456 25930 52016 13970
13860 13970 -14837 -22318 -44502 -44508 -20605 -3738 -3265 -8823 -17941 -7413 -3836 20078 5378 12219
13846 12219 20825 14173 -6222 -27667 -20312 -9169 -28100 -26495 -16272 -26737 -16850 -6051 563
13833 563 11694 -6472 -27568 -19928 -22490 -17762 -17178 -7611 29644 51254 26758 2797 -22108
13820 -22108 -38002 -46988 -38435 -36813 -37246 -58903 -51086 -42129 -50423 -38023 -34695 -11314 5876
13807 5876 4481 18938 -17586 -32238 -18137 -19490 -23110 -30802 -36742 -34703 -10089 -9185 17259
13794 17259 22303 2021 -45798 -34164 -15895 -18721 -29737 -12538 4688 20472 29946 6472
13782 6472 -11375 6782 23935 -3067 -15529 -25359 -18985 -9641 397 -239 -10043 -10178 -19814 -19827
13768 -19827 -20062 -9325 -8155 -5939 -258 18631 17176 4449 -22095 -16120 -1215 -4492 -1914
13755 -1914 4461 -17015 -25485 -2743 2545 -3672 -16009 13778 22073 11349 13044 -9568 -25578
13742 -25578 -29909 -48173 -47881 -22537 -17984 -12292 1177 13281 -17255 -45077 -38720 -34830 -39303
13729 -39303 -28577 -37216 -24963 -10818 -14026 -9264 -29148 -39677 -7526 -3745 -6247 27157 42739
13716 42739 16588 -2279 -9716 -2216 10806 -11009 -18614 -22572 16969 30068 20857 13844 10116
13703 10116 20770 -1290 -25638 -31446 -7694 27802 4277 -22586 -2939 7469 26292 28144
13691 28144 2074 -14290 -26619 -33205 -12417 -19909 1079 -25186 -12434 -3810 -4170 6075 159
13678 159 -19374 -20583 -26912 -30333 -54124 -64659 -59603 -47873 -28739 -10185 -27246 -46072 -34610
13665 -34610 -44094 -37378 -14192 10654 3847 -5411 -19877 -12449 -3719 24424 16337 25765 27604
13652 27604 33828 18770 3929 20988 62123 48197 22890 35308 59194 52035 29016 4490
13640 4490 -5004 -1025 12739 25920 35391 10793 13785 24858 41675 34937 30870 14787 13612
13627 13612 7649 7385 -1560 -9070 -14122 2754 18122 5704 -296 6 10365 4274 19333 33786
13613 33786 47565 36330 45433 40871 2561 4001 5376 -17639 -9199 -17004 -3959 -22002 -34239
13600 -34239 -28791 -21535 -719 22876 25460 21096 7039 36520 52314 13044 4675 -161 9622
13587 9622 25321 45935 46281 9594 31456 27477 -11556 -37248 -33665 -15003 -15929 9559 -11845
13574 -11845 -1469 -12 -8759 9080 -5126 -28546 -14706 -6365 -20326 -24198 -26608 -6284 14675
13561 14675 -3465 -2597 -3004 6826 9078 -13717 -8947 -4430 -14432 -12555 -20474 -16083 -1230 6349
13547 6349 2818 -18392 -9455 17013 40150 33954 -10303 -4036 7061 -3427 -16468 -15863 -42374
13534 -42374 -52700 -53612 -28340 -35342 -12617 -4599 -8118 -484 -6812 -3285 6478 30660 27958 22025
13520 22025 19843 23925 21651 -914 -26308 -25981 -2194 25358 34919 16329 -13256 -23794 -19633
13507 -19633 -1095 5142 -11862 -10325 3374 19049 28910 10120 -7410 -12911 -13077 10470 -6301
13494 -6301 -44439 -30691 -12494 -7414 -13668 -9718 -1151 -822 5739 -6193 -3568 11435 39491
13481 39491 20592 -4506 14625 11820 6437 -15206 -12056 3634 27758 33457 49522 83139
13469 83139 104316 64053 37212 14096 1363 -18139 -10227 -15629 3298 24721 24111 -2938
13457 -2938 -7138 5924 -7980 595 -5051 -15787 -38078 -20973 -10367 17104 32284 38961 48949
13444 48949 35404 20500 717 6243 24178 -2246 -13827 -3764 13442 10522 -3051 -29515
13432 -29515 -41347 -15854 -9066 -1495 17487 26551 8739 -19964 -36108 -5806 9722 11647
13420 11647 3430 4081 17332 -6430 -16644 -16675 -13574 -37949 -25899 608 11720 -3421 7526
13407 7526 12437 24054 36938 20226 -7936 -3792 435 -14593 -8243 -7370 -1819 -1487 -6157 -1463
13393 -1463 12072 8561 -3901 -453 29945 40675 21432 17360 19634 20084 7108 -18627 -22489
13380 -22489 5405 25814 45227 49611 66148 68906 39735 17860 -13278 -11860 -4964 22571
13368 22571 24349 10732 -19952 -62123 -73186 -47425 -22166 -48498 -41874 -35634 -21516 -2502
13356 -2502 5843 12873 49900 29230 4479 10880 189 -5791 -16267 -14063 -21071 -16994 -8699
13343 -8699 -22356 -4996 -2884 -518 22279 19015 3005 -14953 -37534 -32583 13187 26497 15190
13330 15190 9289 -21182 -33182 -32746 -3123 19715 25689 17157 26316 20820 13554 -26435 -42084
13317 -42084 -21935 -538 26384 16280 9342 -7938 -32071 -35257 -21689 -27358 -20013 -27795 -32897
13304 -32897 -9869 4502 18168 37596 60806 21907 13781 -1556 14854 30012 38531 42276
13292 42276 14021 31235 1335 -21404 -30893 -13566 -4944 -18053 -14649 19125 35304 25981
13280 25981 27351 36258 23246 -10613 -15064 4579 -9889 -20640 -19094 -18141 -16960 -35181 -19645
13267 -19645 13546 26118 21739 -3484 11363 23420 4606 -9909 -9404 9200 43986 32245
13255 32245 10273 34194 33650 7244 -15658 -7821 6793 19635 33550 8804 -9415 3849
13243 3849 -6409 -1074 26630 44923 54873 35176 14922 10695 2088 -18710 -18901 7864 25738
13230 25738 12223 10238 19029 10572 8146 41252 43816 10772 -18969 -42637 -50737 -50715 -18973
13217 -18973 -4975 5005 8412 -4931 -10301 -9754 -1047 17024 -14679 -36278 -45022 -45301 -18574
13204 -18574 15993 20516 17424 -684 -8941 -18396 -23983 -5441 26467 21777 20782 14732 -17258
13191 -17258 -14288 -4407 -11796 -27855 -42822 -10644 -530 18789 17870 -3979 -3966 2546 5331 -8068
13177 -8068 4907 -17866 -12714 -4443 33084 26752 3507 14045 26371 6137 8266 12777 11060
13164 11060 -1286 8408 11474 21966 23214 -16394 -17620 -10759 -22489 -13958 1537 -11695 -3125
13151 -3125 7902 40492 20015 -11368 -18492 -31764 2171 8527 -1237 5494 13777 5495 -32825
13138 -32825 -58969 -23335 4680 -4791 27036 27284 -16248 -37548 -30640 -18801 -22962 -30750 -28623
13125 -28623 -16862 22216 59206 87657 66636 16244 7623 34139 29033 18640 22352 14106
13113 14106 -6216 -23622 -14459 -4444 -15909 24297 17942 10455 20204 35275 11592 -12820
13101 -12820 -11259 21093 16814 -37381 -35511 27379 29505 18893 14263 18855 22992 26152 25322 16074
13087 16074 22311 37408 51686 78120 55958 14032 16703 19816 -26947 -17207 -5928 -19758
13075 -19758 -21435 -12262 -17651 -2655 -1420 -2222 -2261 -8657 -3467 -2864 -2720 -13221 -25706 -36388 -23905
13060 -23905 7080 13097 -584 -10851 -18190 -30604 -41812 -33445 -35381 -78 30463 30526 13226
13047 13226 37336 46250 44153 35799 7139 -12268 -23031 -27167 -11410 -20483 -23335 13714 35581
13034 35581 27247 25335 21470 27946 30599 50043 50288 58731 51028 37089 29609 -829 17864 34428
13020 34428 17533 10099 17531 23377 39432 50927 36698 5541 -661 -17440 -13744 20453 38427
13007 38427 34209 28686 20438 31908 19784 3475 -24854 -21494 -11735 24830 22487 -9403 -24529
12994 -24529 -7543 26482 5007 -11981 -21476 -28281 -13952 -4741 1797 16418 48020 46316 25001
12981 25001 5534 -120 -26016 -7327 27701 49177 17757 6292 23715 6529 -8606 -7757
12969 -7757 3670 6522 -16656 3279 40651 39162 13768 22988 23835 6790 19986 -343 -38020
12956 -38020 -30926 -17640 15095 35801 35663 39132 31129 49253 27996 -3075 -19767 -19824 -15857
12943 -15857 -16551 11140 41160 63083 58893 33869 -131 9589 36703 34589 19522 9015 17611
12930 17611 10524 18051 33479 23343 23706 17568 28469 14564 -6993 14979 19098 25906 32019
12917 32019 41768 53879 59149 60508 80229 73004 86579 72567 70628 50606 18567 -7298 -7210
12904 -7210 -9310 896 7273 -557 8343 3780 4105 -17417 -28118 -17021 19724 40359 68078
12891 68078 66759 56060 63780 79603 71901 44424 7473 -29099 -30783 -17166 -22337 -14903 12125
12878 12125 21814 31355 26210 19659 36998 30365 42831 76193 62730 29712 28303 27463 21688
12865 21688 42936 52887 31584 13728 4075 22660 28029 51046 27629 34322 29412 49578 49036
12852 49036 35788 23335 -9095 -31377 -33702 -15499 -20537 -37893 -10809 5736 -15908 -565
12840 -565 -16253 -8547 29670 37852 35363 49653 67961 68902 58068 25691 17596 12565 19888 35528
12826 35528 29473 33725 32423 8575 13183 20447 2743 8158 42371 45422 28460 32497 14804
12813 14804 22454 31207 50528 45211 36621 33649 20469 12531 16499 13894 28369 59767 51784
12800 51784 31317 19260 5456 -5628 -5538 -23503 -22601 -18125 -11692 -7351 5539 24742 29406
12787 29406 26412 23708 4014 -10917 21604 47821 50569 36427 17983 13426 42185 43419 37807
12774 37807 51575 28134 95 7513 22276 7406 -7780 8102 27053 46658 15195 -9793
12762 -9793 -20421 -14920 -1449 37225 35065 13971 20712 31706 43525 58483 47870 43451 48349
12749 48349 60032 41052 14173 20251 19241 22192 32673 38348 49451 53816 38320 -1206 -12766
12736 -12766 7318 35425 37626 57746 67064 32817 21844 -1700 -15393 7480 36985 65242
12724 65242 78321 37050 29895 49351 67590 93052 96868 67160 67913 57730 37843 38243 14227
12711 14227 8571 10359 -10115 -2644 37973 39322 61453 84173 69438 61348 31930 18570 5405
12698 5405 29157 43718 34686 19431 14160 21576 22256 14186 43890 25583 35924 41294 54680
12685 54680 76456 87923 66736 42176 24778 33023 36135 16131 22829 4119 14595 53037
12673 53037 75076 80719 67365 57319 63193 57367 63356 68009 66088 42595 23131 34537 34475
12660 34475 36443 44639 52639 57401 42445 56417 66010 51777 28278 26775 7362 -12148 -25430
12647 -25430 -35586 -7995 38561 50408 54639 44432 44528 51354 70679 50551 44629 47811 45988
12634 45988 58161 45203 28979 51495 55528 66720 80689 73901 62637 47618 25593 10190
12622 10190 -2997 14321 53477 56783 44719 41586 29374 5702 9577 16020 43148 43152 37702
12609 37702 61099 83940 101752 85774 57663 32689 42595 47629 44941 51713 66716 68715 68599
12596 68599 91878 91501 79986 55387 44689 32098 14695 33380 51815 55245 40397 63900
12584 63900 85676 91427 106379 78966 81652 98145 78977 67637 60828 55327 74655 77143 82571
12571 82571 63224 49078 52213 30626 42574 68836 70065 57974 46954 41131 37004 41213 60199
12558 60199 67674 68658 64989 71566 85540 84854 69891 62002 52484 38642 18213 25545 66597 68840
12544 68840 46098 16949 -2766 13561 36614 23824 10085 51099 101472 91557 59323 58971
12532 58971 42861 29313 20567 48851 52587 41983 51259 86870 110066 147145 130313 114857
12520 114857 111052 112958 110799 89989 77868 71160 82012 82953 72307 93294 122132 142061 156577
12507 156577 153214 143136 126370 148652 166536 183711 220635 293235 381662 493185 617873
12496 617873 668218 621029 527260 420802 306233 215523 187991 137891 122267 122139 129662 132010
12484 132010 120229 103071 104078 98370 75840 66433 69669 80597 104307 98509 78074 59277
12472 59277 64122 79896 105965 110506 92216 85562 80182 78077 73555 70621 58859 66010 83572
12459 83572 74947 65526 64869 98542 98210 68100 74215 115988 129564 125621 114195 100855 95589
12446 95589 94246 102508 99742 101219 97104 109032 111487 103239 87011 100939 122274 123056 109821
12433 109821 110502 117787 117362 129596 151571 127977 86195 80822 100638 114374 109344 112263 100383
12420 100383 90788 87029 91660 90036 71762 74474 98259 132305 111293 107252 101859 93134 67519
12407 67519 86366 99089 108272 96273 92209 101086 104937 116402 144742 139511 133424 119130 91511
12394 91511 95345 108012 105521 77998 75287 94808 126741 84837 72700 108711 124980 123507
12382 123507 128604 128919 121854 144724 144510 123126 100556 135157 154216 132311 114653 123467 127644
12369 127644 120459 132429 137698 123834 126078 123579 125077 118927 140437 172542 166416 173308 166335
12356 166335 153432 167304 169242 135418 131361 140597 148706 144519 163246 174879 198830 192912 163529
12343 163529 139798 139743 160412 152689 158454 166679 173397 191200 199337 198118 184660 170516 151497
12330 151497 112296 87343 84853 82473 132818 160472 164312 189045 208864 182974 182716 184125 165292
12317 165292 156189 160774 175985 180772 181628 186377 205728 220172 216698 205739 193754 223724 217758
12304 217758 188771 159732 169387 215535 220160 225719 234698 236372 216653 200105 204393 192933 179640
12291 179640 201299 195285 195579 213835 223321 216813 205465 227717 226091 224615 221057 186817 196058
12278 196058 231811 232067 227635 223956 222789 216899 229945 224997 202425 191001 184875 204028 207348
12265 207348 219847 252798 238962 223365 217569 185002 167227 203537 227200 229525 258507 292994
12253 292994 292302 263298 215147 213568 223545 222840 236515 253323 241684 237061 257413 276391 266313
12240 266313 276907 293692 279869 278254 275953 251393 268915 303139 324637 300700 310275 317175
12228 317175 325108 334030 338830 331532 308881 290006 310931 315804 297067 273760 271411 289517 298258
12215 298258 303497 301690 318581 332079 322195 324116 318204 323456 342651 328612 315627 316127 313910
12202 313910 343659 365213 397001 398526 366836 344772 368503 391572 400148 381848 378182 379832
12190 379832 386117 389956 376598 383641 380597 400676 402424 400454 392613 408209 419225 399573 412898
12177 412898 426173 410154 411397 444914 460040 497420 493739 474572 454842 457431 429082 475015
12165 475015 517851 516413 522641 520203 517604 527640 525521 510866 496138 496102 500041 496872 530765
12152 530765 572078 567560 540288 536617 546617 587294 622017 629244 623821 600174 611741 605337
12140 605337 589216 584195 571995 570024 586247 618662 633178 628796 641992 621551 590372 604177
12128 604177 622958 642396 634710 611458 612682 654159 692211 730492 743329 711950 678052 684560
12116 684560 719956 726309 736036 745902 755851 782858 793072 798007 805083 792856 790493 813218 864782
12103 864782 906618 920762 945833 991022 1026665 1039729 1042745 1005252 977600 920809 872058 865218
12091 865218 884028 916290 910744 916185 947745 968550 969317 1001549 1023436 1027095 1039245 1056794
12079 1056794 1073297 1051522 1025724 1039984 1060846 1063631 1089845 1113487 1157500 1190504 1195922 1227138
12067 1227138 1240328 1236492 1222391 1219472 1253968 1289654 1302333 1343341 1361150 1403242 1466750 1527026
12055 1527026 1530661 1529537 1515245 1511072 1490639 1478890 1489457 1484392 1473671 1517053 1534340 1529059
12043 1529059 1552671 1580624 1599951 1620110 1645282 1648290 1656201 1684247 1674630 1697214 1738008 1785110
12031 1785110 1813267 1820865 1853851 1887722 1886124 1865979 1867046 1897871 1932425 1960928 1976078 2013969
12019 2013969 2054440 2103566 2157536 2188906 2233342 2275050 2302662 2338279 2357250 2360015 2401593
12008 2401593 2421607 2447900 2455108 2482802 2515773 2544042 2545890 2586461 2631838 2652249 2657002 2672650
11996 2672650 2686510 2713321 2748783 2784727 2836491 2847135 2854661 2882617 2920051 2955056 3001221
11985 3001221 3053416 3090399 3118669 3148331 3183456 3206651 3236786 3280750 3303862 3344233 3355612
11974 3355612 3392787 3428327 3463090 3516366 3581057 3625844 3639648 3657448 3675290 3704277 3737036
11963 3737036 3761600 3800340 3831508 3837424 3862413 3910834 3949950 3966867 3967615 3952189 3969525 3995433
11951 3995433 4014880 4055001 4097583 4129852 4128692 4128277 4127334 4122348 4147576 4172547 4177845 4166595 4153559
11938 4153559 4156049 4160070 4155619 4181428 4192589 4175304 4188476 4187847 4165339 4161344 4159934 4131212 4098331
11925 4098331 4118258 4114407 4094924 4068006 4033751 3998360 3966279 3940449 3926648 3915818 3902960
11914 3902960 3883093 3860457 3816991 3777030 3741278 3729338 3716333 3689944 3659413 3630507 3587770
11903 3587770 3567577 3533467 3480503 3430934 3420977 3404892 3375380 3344315 3290943 3263037 3232050
11892 3232050 3179421 3121360 3086216 3066120 3052337 3047686 3014404 2973696 2954934 2935648 2893932
11881 2893932 2861970 2811754 2778254 2752817 2715645 2683863 2649529 2590007 2575241 2560660 2529883
11870 2529883 2490522 2445861 2441812 2418535 2392075 2386235 2393141 2342701 2281337 2234577 2186717 2162999
11858 2162999 2141648 2096177 2099061 2100524 2081648 2052139 2009856 1980507 1967058 1959418 1932877 1883560
11846 1883560 1858428 1843725 1830595 1781424 1751155 1757830 1741786 1706973 1688223 1646052 1628810
11835 1628810 1598662 1553660 1528866 1540962 1537645 1517035 1507763 1503983 1489175 1479180 1453457 1414738
11823 1414738 1389801 1378116 1358478 1371686 1372495 1351227 1305599 1262425 1249446 1247178 1252084 1243438
11811 1243438 1222250 1213796 1191984 1196120 1209428 1195458 1163772 1118755 1068373 1058682 1049545 1030523
11799 1030523 1032448 1007334 973947 991060 1020392 995584 956398 927347 919939 933853 956158 958467
11787 958467 942273 922073 899605 910057 904787 897463 887000 869276 838424 841759 849823 849283 858700
11774 858700 855598 843259 835189 834649 819796 816909 814157 774423 736216 722590 716058 701274 702188
11761 702188 722671 733778 722083 716280 695969 683963 691237 689159 696241 701448 677790 658788
11749 658788 655596 667593 661132 653808 617721 574558 554031 546048 567459 558898 555264 565063 572472
11736 572472 586115 579387 573269 572086 569654 569388 530092 504904 499115 513830 518847 501470 496372
11723 496372 472435 478184 494076 482700 462847 473731 467944 458100 451642 448883 452999 449322 454006
11710 454006 462972 450426 450668 451317 467914 459889 450748 449773 459991 471355 461462 434116 425078 417052
11696 417052 411628 377360 383713 403276 419037 405519 392843 399321 394689 415200 431215 408515
11684 408515 376830 371214 366928 351592 348569 361417 389616 388316 367616 357809 336407 312225
11672 312225 307167 305057 328672 319695 298313 309200 312202 321617 317933 307857 299577 298442 300385
11659 300385 297397 303878 328259 312311 298056 289273 286317 272834 265204 271444 285287 301108 314699
11646 314699 306174 266819 265647 305185 280324 260956 258177 266214 302503 314742 309826 285584
11634 285584 256097 254597 234229 245068 245591 221875 221001 218845 247293 257204 250141 223800 238857
11621 238857 251123 275232 265839 270194 297129 293816 278825 246165 213350 196317 190870 206973
11609 206973 205740 186983 161265 185692 207266 222009 215549 205379 194492 185117 181304 213580
11597 213580 219017 199252 195777 185897 199024 194870 188889 200233 202015 200159 212512 179842 171146
11584 171146 181842 197724 176325 139642 131607 142785 142619 144530 159900 183310 176568 165205
11572 165205 157036 185706 201619 202988 223461 221866 196137 161249 137991 157332 151948 170607
11560 170607 169408 168917 184429 180287 174721 162823 182111 178366 168936 133504 133806 161591 175225
11547 175225 161234 147347 129654 156555 171397 176334 154871 138025 130128 148292 176745 179242
11535 179242 163479 141717 150309 137260 128509 139814 134519 129703 117478 119399 125742 152577 173116
11522 173116 172502 156158 147353 140359 136288 158915 177256 162300 162047 159046 160058 154200 149570 157187
11508 157187 183016 182266 179014 169157 162988 135210 137116 148662 151274 131441 112221 105654 118823
11495 118823 127896 158866 164861 149462 147648 143787 137398 109257 97487 74638 75496 104979 125720
11482 125720 131861 131087 112121 113653 131397 138920 117581 104892 103441 131813 129595 117227 108565
11469 108565 120832 102841 93693 82879 83735 99847 108925 116902 111891 122093 129851 105257 67642
11456 67642 43449 76834 81139 89968 104743 80592 67105 82881 70385 60217 86406 101011
11444 101011 104856 132088 112718 87909 75003 104402 116016 120380 121713 131260 108467 108397 136018
11431 136018 113714 86743 68074 63914 51972 47149 59898 60988 52339 42502 58479 81807
11419 81807 90438 70066 94603 88073 79442 97572 100948 81838 78598 96157 97455 98037 91526
11406 91526 87423 101113 91387 68900 93391 113050 101226 102040 85092 93710 139017 136618 114048
11393 114048 117089 125796 99073 62138 35666 21856 43047 79820 85881 76745 44438 10847
11381 10847 17346 43458 50251 59337 61122 43644 46025 50154 62888 71494 73905 48679 59756
11368 59756 67557 65020 64955 89222 87782 71995 87297 101085 87456 60831 79234 99451 90645
11355 90645 63826 61944 59985 83135 77526 66297 43310 49054 59628 42784 45012 49659 71237
11342 71237 73391 71518 64485 21224 29529 48547 60281 59897 54962 50345 63471 53508 48770 45896
11328 45896 34365 43614 50549 38166 35759 43716 50440 48172 32864 38952 56082 56112 58666 74787
11314 74787 59146 45681 14194 24351 21839 20347 50081 88614 86674 82043 52302 25208
11302 25208 35530 58476 93020 95589 71623 46565 35610 34193 52677 44172 50521 38525
11290 38525 62444 79149 74952 58503 62247 68643 47641 42973 18882 19299 37493 37954 40001
11277 40001 40859 53608 39601 16959 21562 24047 23649 31254 57851 55700 39245 18032 14389
11264 14389 14825 20038 45478 61082 68781 31803 9552 9194 13929 34853 53841 62792 64835
11251 64835 61726 41952 23778 39396 51104 41048 28474 46246 70556 65388 96362 94536
11239 94536 72048 57298 47351 44691 57878 84154 116152 89501 60746 57046 54223 60935 59405
11226 59405 45310 15832 3495 13631 38744 43828 24245 10429 11230 45309 61675 41748
11214 41748 23332 52079 56912 72860 76902 58571 19797 20134 20750 34140 46075 55047 72436
11201 72436 84766 69862 22712 9894 31849 19156 30049 29281 36015 60815 79704 80988
11189 80988 67955 53452 59847 63159 71446 72015 73717 87097 82791 82324 94673 94017 74311 68062
11175 68062 70025 59581 80994 82536 72448 34864 28071 57411 72951 69416 78995 84719 81566
11162 81566 68624 66321 48275 64390 59068 65245 94457 101585 131461 139375 162480 165325 170959
11149 170959 176596 170612 172128 203505 256313 302464 384390 496750 625558 830039 1097682
11138 1097682 1438089 1814573 2157533 2288946 2117233 1724767 1290039 938678 724805
11129 724805 582516 483199 420115 364183 287432 242532 212670 167860 135210 103159 105638
11118 105638 118361 156304 157116 118274 103851 78175 74764 74163 92675 122203 99297 69232
11106 69232 70693 68822 44571 49351 62891 67324 62033 81330 86126 68312 26795 53969 83357
11093 83357 101463 84580 72919 63789 43625 50408 81560 71494 74371 68626 84226 109231
11081 109231 100223 67684 36102 29297 54357 76929 63323 53021 16199 26751 38449 45330
11069 45330 56628 54163 51751 35357 23442 38361 41732 29315 11486 29006 55852 42908
11057 42908 44863 57698 61729 64283 69947 68766 95703 132128 127945 132735 148082 162293 162362 151179
11043 151179 118624 130679 162751 163784 195200 242249 312051 350896 369563 394271 377272 308824
11031 308824 258295 213500 180257 185108 215640 286961 345625 417382 481527 477186 459806 416068
11019 416068 344776 297035 284766 259091 242673 278626 308001 321060 348848 359464 349168
11008 349168 301573 262275 264365 230714 219213 220273 204695 207650 176268 169060 204311 194330
10996 194330 176870 191111 175114 150830 143874 136835 127890 144426 174872 223296 255160 261723
10984 261723 250143 222574 177920 128531 113606 90985 49094 38662 63276 51762 29723
10973 29723 18682 18623 10499 -4568 11028 17149 27603 49600 49139 57209 52974 51572 55846 52280
10959 52280 67109 115528 126487 94963 81834 87879 88726 88500 98184 87795 84183 90307 84339
10946 84339 110206 118082 118621 108754 106302 110819 111899 104049 126083 146240 137448 124052 90128
10933 90128 49680 50573 85801 78122 83996 93201 81511 94446 93485 99338 61464 13183 1040
10920 1040 1081 22217 56766 70519 75676 72984 89291 96399 81179 66802 90056 123522 123333
10907 123333 100880 91992 97864 85844 68574 65995 75953 74831 85184 106451 94158 80082
10895 80082 76438 66667 78265 87921 74128 65341 52092 23232 -5977 3100 26707 99677 158193
10882 158193 152461 102167 68427 51444 54567 86174 70102 88249 104402 119346 110798 114174
10870 114174 134814 140769 130703 148940 146017 142820 159860 195519 214096 233219 284584 328820
10858 328820 321443 299368 274940 256825 262690 290737 324175 317406 317752 339871 310728 281646
10846 281646 301442 319834 333687 335728 311830 302284 292421 260323 273273 295866 316866 325434
10834 325434 320582 334342 350540 367740 402560 420440 427409 415060 412430 389906 397016 424007
10822 424007 435677 425245 474359 507087 495007 509128 518706 530458 549909 540319 542262 575774
10810 575774 576564 580174 616594 635886 643872 660718 695515 726561 740119 762511 828636 894527
10798 894527 903606 904672 942314 1006253 1056717 1098994 1133144 1187820 1223300 1275635 1304369 1371876
10786 1371876 1452987 1527275 1589633 1644836 1729864 1858164 2034707 2250419 2558864 2964347
10776 2964347 3504651 4205136 5015997 5722835 5972119 5713830 5187642 4647712 4248279
10767 4248279 3974753 3831676 3800500 3795466 3886015 4099860 4355589 4698127 5112991 5557899
10757 5557899 6074754 6677328 7414686 8318619 9457178 10783038 12127739 13322790 14410070
10748 14410070 15589403 17099300 19167121 21934352 25517409 30270306 36694938 45515487
10740 45515487 57787349 75184057 100011149 135546096 186283820 256426250 342217114
10733 342217114 419562123 448882843 414866993 338619745 253741771 184938007 136457831
10726 136457831 103091755 79728086 63007732 50755224 41612706 34679667 29399002
10719 29399002 25275943 22025872 19460379 17480719 16015115 14923960 14004338 12993881
10711 12993881 11829819 10591199 9448162 8470471 7648399 6973787 6425668 5963395 5602124
10702 5602124 5253905 4910361 4563790 4277650 4026881 3772761 3588228 3454887 3290910
10693 3290910 3120125 2968565 2806704 2674354 2549710 2436559 2349889 2250604 2145975 2051173
10683 2051173 1931561 1832442 1777823 1752149 1678543 1579490 1529562 1487537 1426570 1380251 1329743
10672 1329743 1287079 1246699 1217643 1213187 1226183 1205005 1178278 1163888 1173227 1202059 1214879 1198669
10660 1198669 1220966 1206601 1188036 1149851 1114512 1104043 1090754 1078370 1095114 1091790 1074153
10649 1074153 1069305 1030721 1043685 1061384 1052069 1078000 1104289 1153779 1186930 1250629 1329659 1401505
10637 1401505 1494374 1647226 1802024 1957051 2104907 2257498 2374536 2509077 2710128 3013751
10627 3013751 3389324 3847489 4527379 5469764 6778125 8521901 10774907 13654928 17126552
10618 17126552 20868408 24123003 26090810 26471953 25681226 24618568 24126181 24669253 26552797
10609 26552797 30003302 35223068 42073312 49541586 55514490 57892247 56243238 52024964
10601 52024964 47431196 44229960 43221540 44657153 48680463 55302073 64044063 73134368
10593 73134368 79339046 79863515 74547037 65817195 56918251 49953030 45621976 43905548
10585 43905548 44618854 47491717 51899323 56307757 58500386 56775269 51338627 44018741
10577 44018741 36920326 31355764 27655351 25621790 24989546 25424424 26426889 27239505
10569 27239505 27022268 25235062 22092886 18309155 14655350 11603283 9264752 7513986
10561 7513986 6208487 5211260 4450193 3880080 3419806 3068720 2765765 2514733 2285233
10552 2285233 2125140 1969481 1801129 1668698 1553799 1466846 1386215 1307800 1236662 1134919
10542 1134919 1045913 972554 909881 856684 820670 831822 819233 801911 751037 726661 710763
10531 710763 695540 660830 646798 607617 592404 594807 579782 572424 551995 493058 475134 486228
10519 486228 487263 468563 439129 453961 462231 486783 476808 445733 418385 404480 375293 370382
10507 370382 398087 405308 403325 392780 410825 405366 413943 429283 406384 387628 415645 416635 388378
10494 388378 372328 354166 361615 345375 354100 371626 368481 369973 373966 406745 409723 357886 322418
10481 322418 319018 340017 365819 372577 368541 361779 360616 318909 285767 291798 296719 300969 266742
10468 266742 245421 268373 288583 277777 287778 297162 305434 255735 239805 258801 241585 252529
10456 252529 276593 271784 268678 269095 243311 258282 293745 294143 228925 204909 214652 228375 229835
10443 229835 239938 253113 249777 234005 241346 247757 236884 230234 232245 223369 227555 226481 194509
10430 194509 166946 164621 149091 151469 193992 208889 208256 168767 144966 139821 136872 151342 171787
10417 171787 174694 159240 177216 192840 173817 155142 159335 193923 189761 166156 164905 184690
10405 184690 184143 156503 134151 131079 155248 139272 121173 141727 149926 147853 168047 174072 168312
10392 168312 171817 163610 136159 93652 89600 107084 130421 145578 121427 122085 130256 144494 147370
10379 147370 135556 139147 151485 158496 147741 149924 148915 121187 104032 116563 164948 193973
10367 193973 164314 145029 172658 160431 151960 141644 140057 151763 170313 168752 177679 163324
10355 163324 165192 158120 147322 135201 133181 169117 182557 185034 164129 148326 182125 198530
10343 198530 195602 192746 197485 254330 267299 236574 237325 278348 322348 358594 407081 450440
10331 450440 531319 651789 805296 999619 1319019 1705863 2049624 2300223 2275899 2001031
10321 2001031 1632984 1239692 968374 777068 646048 552934 459216 370729 321499 278267
10311 278267 260198 236361 211709 199604 193273 197037 186634 179423 218940 226772 193415 174685
10299 174685 163568 163047 141411 133619 157173 175271 174271 143475 116185 88279 97610 119227
10287 119227 134702 141470 147625 162014 152476 123563 95864 110267 128695 119417 108455 122045
10275 122045 109822 95560 95369 123228 126703 122038 116163 121922 143420 118259 143041 161054 131140
10262 131140 119225 124801 115163 108541 110252 102482 111747 114170 123133 119676 123794 116286 117824 149376
10248 149376 161543 165889 184549 182574 191936 220132 261219 299886 323069 362893 438759 561378
10236 561378 687714 851581 1040478 1304178 1641039 1912299 2053742 1989453 1740113 1440059
10226 1440059 1157150 929530 740959 589935 495914 421006 343719 281580 270554 256228
10216 256228 234819 201869 174269 176833 153829 137142 152829 136556 115505 120754 115617 115298
10204 115298 92691 94377 112915 144216 133311 108455 96898 63984 62401 86588 96304 112982
10192 112982 124340 124253 120638 107554 90396 110280 106314 134060 172046 197989 229349 235471 258527
10179 258527 259070 257311 260694 256040 270438 278815 284050 289727 312931 347570 388951 409538 421119
10166 421119 439620 422368 358162 333544 337011 340228 366594 394231 443523 463215 490028 506710
10154 506710 480879 430890 400025 396605 366152 340788 325506 333806 361193 420182 418898 377380
10142 377380 339088 316440 276166 234094 184974 174129 185101 185853 227133 245136 231076 213253
10130 213253 166408 135252 118894 86047 74752 74074 45952 66629 100343 107849 96406 108819
10118 108819 91734 54650 54088 65690 98260 116523 94955 81553 94083 81880 94201 108540
10106 108540 112787 106074 107164 97283 86778 86036 89824 106974 106814 102687 127239 121580 111099 106547
10092 106547 87179 100676 89994 67814 82273 102669 121642 127898 174854 213857 254880 293547
10080 293547 302841 281297 217273 175779 137671 114978 107174 101293 109429 130198 132129 104495
10068 104495 100683 115720 104328 86161 72588 72936 72705 58703 88967 103745 103801 103838 71789 96829
10054 96829 141031 155904 118962 103859 101174 110498 117162 80291 57960 57974 64822 85916 110255
10041 110255 96498 56695 67699 80260 99543 105067 86126 99228 103769 101377 97586 112066
10029 112066 118055 114242 103991 112054 144730 141922 141822 145261 165182 153722 123818 88175 78880
10016 78880 92879 98290 88415 80612 93490 133226 153406 155565 174080 177067 168933 173455 169025
10003 169025 159862 151669 175405 180789 154059 148598 150305 163067 172661 170042 165710 135672 122769
9990 122769 118523 106963 98091 120802 111004 106771 95579 69903 73183 74460 56290 76375 101688
9977 101688 119471 148113 160033 139807 113812 117418 130868 157931 152566 118779 108429 105558
9965 105558 115589 125682 129610 166587 178894 185158 217785 262043 282674 298699 296442 325496
9953 325496 354492 351236 310844 309182 343016 353838 315803 312708 330042 329906 321085 321255 331640
9940 331640 354675 361410 380391 366865 414642 493909 608917 782583 1061524 1431111 1625411
9929 1625411 1505754 1241462 916378 675189 576095 532739 510267 502699 473433 464260 464637
9918 464637 478753 478493 472194 496963 512441 537841 531120 519416 530200 541363 567574 587117
9906 587117 569281 570921 596009 647368 667541 681305 682224 707557 744651 782771 814590 865320
9894 865320 898982 937773 947406 965388 1008734 1030941 1056740 1077374 1102200 1157138 1192696 1236645
9882 1236645 1273299 1301960 1329785 1350215 1376132 1406045 1487790 1599592 1699283 1752324 1835794
9871 1835794 1930515 2033322 2123932 2244059 2387933 2528950 2677912 2861358 3048176 3233232
9861 3233232 3413313 3622684 3893930 4211711 4567191 4963886 5437926 5974437 6581798 7317378
9851 7317378 8147932 9170542 10377428 11733079 13114612 14405975 15704560 17190049
9843 17190049 19065737 21540056 24741697 28854748 34226566 41324317 50789460 63682808
9835 63682808 81397066 105806628 139517852 185563567 245794776 315462542 376424089
9828 376424089 400849310 376472754 317269713 247914551 188042790 143147779 110731545
9821 110731545 87248174 69956708 57041036 47200443 39643017 33766842 29124909 25462830
9813 25462830 22522681 20162065 18303995 16874318 15738736 14664440 13511333 12309967
9805 12309967 11119937 10034967 9092621 8301021 7639970 7106900 6655304 6247691 5893554
9796 5893554 5575662 5276255 5007913 4833057 4710759 4543288 4327819 4069820 3812444 3549089
9786 3549089 3318185 3135052 2972199 2832914 2707540 2626677 2547524 2446249 2353325 2264186
9776 2264186 2167502 2077298 1978450 1898504 1822489 1752448 1697705 1633621 1573313 1539754 1495361
9765 1495361 1472039 1440132 1404239 1373548 1352109 1344555 1337932 1330139 1339726 1330914 1307194 1254091
9753 1254091 1213542 1167366 1139347 1129342 1110538 1056340 1039498 1041876 1006917 949728 921516 886759
9741 886759 874402 876581 864131 851267 826547 812947 801675 765660 769911 749872 742213 776277
9729 776277 775259 750409 749740 728763 702796 683860 672068 658694 662003 656277 648908 654385 634196
9716 634196 614883 576117 565224 576911 597329 600503 590607 542628 524266 492594 493964 511535
9704 511535 519955 523781 544137 553745 531736 530668 542728 555762 548086 537579 517213 524762 515093
9691 515093 516778 513847 513138 519125 494604 458317 432901 449947 454733 460281 469587 484625 457829
9678 457829 427233 429345 470112 476750 474261 451184 437328 412527 392375 397667 403825 390526 358013
9665 358013 345480 355507 361013 354846 347824 365062 336851 305703 332169 339091 365545 359492 330074
9652 330074 332451 336878 317480 310992 299695 288838 303126 313032 325707 353166 361443 369615 388462
9639 388462 390116 379495 373820 318650 325950 330715 333090 331772 337135 342338 364734 361829 360610 358384
9625 358384 343251 328244 306439 306828 356212 368290 348283 368639 391345 431952 506365 589137
9613 589137 725599 878574 1104720 1462562 1951723 2348126 2337077 2046321 1629682 1229771
9603 1229771 925810 745541 649381 600002 569799 552074 530818 498019 458895 430441 411573
9592 411573 405563 403568 390809 397781 396187 386186 381579 406716 419617 429312 435512 428339 442334
9579 442334 422841 397900 369934 359317 363031 366342 360221 364893 367532 360612 332258 317122 301993
9566 301993 275103 260974 266667 253052 254435 227093 207824 196245 190582 193626 197003 193299 197226
9553 197226 233174 230754 219307 206909 212228 217677 219093 228287 239191 243672 225903 202733 200326
9540 200326 224073 237606 237546 205939 203216 194091 203176 210970 213371 221764 227859 211963 218847 202503
9526 202503 188608 163215 158366 144921 157199 166286 163804 159842 156825 142851 126919 129017 115761
9513 115761 123056 131408 154904 143255 104133 81686 87196 105121 129074 117007 121053 136231
9501 136231 142475 118269 119126 109015 107176 102489 109916 117021 117549 113745 123445 103565 103016 99908
9487 99908 98419 84060 96171 85854 94366 124696 106609 89234 99457 89325 81630 91832
9475 91832 93528 90812 98667 118695 106889 82694 76133 82485 83291 97671 113274 93488 97340
9462 97340 92423 107452 119765 109825 119684 116707 134330 127512 122455 125373 151007 156119 155123 163026
9448 163026 154439 133792 138024 134577 122725 154973 162992 197532 226556 222529 195941 192240 187620
9435 187620 172370 184805 241095 266797 319134 375027 434369 484222 559167 717691 933640
9424 933640 1214565 1534049 1851102 2020522 2019432 1807452 1485975 1176996 934994 742699
9414 742699 598045 496260 385659 304712 280512 253025 226860 219821 193103 169445 173238
9403 173238 170095 164152 167117 168678 166647 183255 180505 143487 127366 129092 114929 81171 56368
9390 56368 75509 106674 106117 108805 108645 121448 127660 119387 105365 55543 43370 61880 55527
9377 55527 54722 51176 48239 61476 84083 80807 90267 97816 89193 71230 61880 51583 57431 58019
9363 58019 73395 95882 104576 103858 79963 59632 72218 73489 55713 48835 86029 104485 101256
9350 101256 99907 106227 93137 85430 85343 67348 43150 43740 52499 59428 90015 69480 62112 68184
9336 68184 64582 59676 72146 82020 74235 81771 62111 55013 74073 66286 28579 14610 21932
9323 21932 44357 68451 76895 75698 81739 93977 70209 32861 15118 32212 30973 25593 31970
9310 31970 33180 33884 44570 53893 76719 91246 75491 57064 37051 28502 24633 34862 42230
9297 42230 29566 33010 15767 11839 36856 65224 45285 45045 80279 100682 100353 80626 72086
9284 72086 53307 52096 64616 50458 39291 43081 71600 78567 70687 72003 65114 67078 42461
9271 42461 7911 33988 56229 78724 71659 85614 108835 92523 91606 72822 56610 74988
9259 74988 92417 81690 71652 47175 43347 34855 5420 -10433 14756 19953 28137 45489 57964
9246 57964 54445 44058 37891 24793 22850 45289 40804 19377 7836 15730 17592 16366 31832
9233 31832 35392 45404 35628 23523 18898 -4018 14872 50509 46534 42586 51770 60436 69834
9220 69834 47404 67608 79885 70098 67797 67469 56893 45656 21067 12729 -1873 13475 36356
9207 36356 48642 34147 39737 51327 59662 45648 32623 25645 23103 14095 7670 28628 32479
9194 32479 14203 52085 81706 95942 111433 84394 54793 48580 47590 40646 22873 23018 18506
9181 18506 29381 47274 58710 47702 25889 16778 30975 39362 26251 42912 68152 97117
9169 97117 111125 113895 89230 83183 82624 64606 40064 18456 5103 19694 47734 59130 51896
9156 51896 42469 24188 25806 20693 19325 45471 48544 19421 33083 46749 27341 -2072 16279
9143 16279 30953 37089 32826 27441 -2016 -5060 -6217 -6919 18134 -320 15 -3328 -25293 -42755
9129 -42755 -35967 -18030 -6314 15856 35886 71372 63705 53723 25196 15486 18451 23304 29065
9116 29065 16866 -11715 -30942 -26395 -15489 -4618 9367 8748 2115 -12889 578 5074 8539
9103 8539 46128 62248 29635 6265 10941 26193 46586 64507 39189 51299 57330 42645
9091 42645 67912 91056 68425 34077 36697 62249 35117 37829 56901 61745 48889 60422
9079 60422 69092 44078 -1388 20244 49264 26832 45794 59863 86226 61615 58633 57430
9067 57430 49829 32402 14582 18955 25870 18404 13957 8151 12462 19231 12430 13053 23065 10179
9053 10179 28801 40385 61252 70651 44448 30713 24510 17011 20461 48347 27451 38473 59472
9040 59472 44360 35523 43984 60223 57651 42472 52430 51284 31668 -1041 6693 15940 31634
9027 31634 37486 42838 38675 29949 15782 21165 3687 -21257 -23514 -10605 -10581 -6087 17949 3794
9013 3794 6297 35500 51539 49564 49222 33923 35240 20125 -5289 -26883 -40651 -45449 -23735
9000 -23735 7970 27239 17025 11574 24408 37846 43309 36343 46672 48712 42130 30831 45204
8987 45204 73619 68395 41173 12592 9804 22177 45919 56001 54002 43285 45247 38209 40246
8974 40246 6377 17094 36369 49510 41456 9302 -8664 -6497 17117 14312 20909 39817 63723
8961 63723 65279 47102 36342 39761 27556 38305 38083 21868 34420 43113 25218 3318 7874
8948 7874 43769 57085 62589 66443 64434 53159 45688 62371 64692 59666 38739 10812 31774
8935 31774 31753 30042 34519 47659 51197 33824 41829 26759 19623 26473 49241 68593 52082 25903
8921 25903 5173 -8920 -5278 -23748 -25014 -8444 7457 28902 32541 21971 17838 35968 36733
8908 36733 53407 61615 56599 52842 54740 51133 49322 37824 30399 17614 5670 8183 -7177
8895 -7177 8417 23288 29145 33572 16460 34551 11881 16562 7031 2829 31677 48075 50451
8882 50451 59813 57832 37196 40161 58999 47831 40464 5412 -13188 -25004 5747 27895 17007
8869 17007 25420 31791 22973 35793 20179 11212 14599 3610 -19154 -6349 18771 50197 35025
8856 35025 15353 24863 22200 34855 38843 28968 19682 38988 48296 60323 57144 22954 -15571
8843 -15571 -19932 -14118 -12288 19220 15157 -4494 4246 11493 17230 12757 -2381 -1675 -1700 12507
8829 12507 56817 57696 35139 65693 69410 24572 13865 44627 37505 23194 23253 33641 35505
8816 35505 20392 -3344 -629 15484 -15390 -1724 -12472 -22349 2110 5415 13002 4721 -4980
8803 -4980 1781 2950 5896 28249 19207 17845 12258 15364 23460 28960 17352 42799 49120 77050
8789 77050 80278 56350 49085 50950 75032 63562 20218 11878 21376 11581 -8970 4641 -10406
8776 -10406 -23866 -13022 5878 4731 18228 32020 51018 69143 80074 45824 37203 34216
8764 34216 38498 40756 17386 19537 34652 27184 28261 46774 42648 21746 43838 49201 26755
8751 26755 47915 32904 50055 56776 46762 26111 18765 19975 -4551 18260 59178 65413 70244
8738 70244 66146 56655 57346 38572 56762 59050 36232 34205 43421 19199 1555 29598 35535
8725 35535 13404 -7676 526 -8542 -20131 6749 20421 37623 45142 63095 54235 10029 23799
8712 23799 81305 108205 90752 59059 25574 9556 13310 26553 47157 69099 45160 29903
8700 29903 46424 76318 72163 41813 30466 21563 32147 11514 4596 34088 52112 26785
8688 26785 22398 42039 49734 46244 38927 37916 27129 18603 32468 67209 97156 63383 47829
8675 47829 57330 64144 66768 53423 35891 21961 38789 44002 65708 79742 98952 74983 51303
8662 51303 60427 67238 36690 24355 34546 19433 33112 29520 40738 59886 80851 65516
8650 65516 38559 41428 46979 54030 65823 66707 47997 42832 42308 28876 20550 43319 44189 54055
8636 54055 81670 73019 49573 36660 17104 1141 -4508 9236 17430 45802 50519 49212 42910
8623 42910 30609 11901 14890 49347 47370 30984 -1549 -13854 1401 35545 23821 -8046
8611 -8046 20883 27813 36364 39408 35456 29964 51100 83121 59279 56316 43271 25993 46893
8598 46893 27930 3207 -9935 -1285 1253 -2320 21358 10535 6347 -3837 28434 50536 45231
8585 45231 53444 75581 77916 38672 12882 13800 52764 57074 33328 28910 46760 33084 43795
8572 43795 62365 74549 67798 35876 40056 6366 14748 44916 30906 -9210 3807 30258
8560 30258 45249 56088 22317 12039 42408 64655 72150 75021 56202 39643 60117 82519
8548 82519 73203 60534 94363 83268 64210 90979 87137 68197 18542 20487 31693 45063
8536 45063 53237 50803 56668 29068 9315 13928 17751 29833 19342 32471 45123 38332 25886
8523 25886 29936 15292 3539 6645 44863 27279 49117 47391 49136 45370 77814 79349 72012
8510 72012 79812 65053 37893 49850 35892 44017 61187 44600 36702 24998 7979 -4641
8498 -4641 2663 25641 32596 27915 49089 66239 54390 56605 57548 59411 72357 73980 74776 86117
8484 86117 102412 88297 83494 85440 76604 57263 48219 54795 38045 28876 43125 60614 69638
8471 69638 53756 44168 41898 42529 43854 52681 30404 2689 25781 4873 -18903 3161 38869
8458 38869 44103 30287 21819 13172 42568 54558 54047 61998 55353 56951 78939 67467 51247
8445 51247 62234 81473 80083 92813 127233 110440 88060 71660 60508 61984 75226 39626
8433 39626 41438 53360 41839 47221 41004 18642 38993 59668 63534 23532 21830 35686 34228
8420 34228 31315 40987 41607 52953 72890 72799 73633 79273 81463 77242 78840 88556 41685 24461 16527
8405 16527 17612 28498 28454 25012 28806 42601 21470 7551 12466 25624 39027 78548 71265
8392 71265 57877 60210 62875 71045 86912 94773 93379 95256 89946 79535 53938 27239 41565
8379 41565 46567 34337 23441 46345 63172 73921 75881 108826 101190 70438 29006 23157 30743
8366 30743 39965 42831 42372 38423 61730 83357 76336 68889 89662 84019 77700 65090 78516 64167
8352 64167 46581 55667 67313 84908 123813 153043 207457 303267 403012 409845 353609 259258
8340 259258 179705 165997 145392 131690 129489 143695 124766 95890 91681 87707 74593 57102
8328 57102 45836 54427 61992 69632 57218 58662 58019 94572 103422 84911 68407 87306 111572
8315 111572 119404 87910 73899 76691 75920 83465 76592 84978 116346 162455 191150 213721 272508
8302 272508 372322 535672 721733 738031 613471 443789 312186 236936 211860 181169 140191
8291 140191 117804 79019 73531 67313 83091 85556 80175 58427 60955 62318 51187 47844 78809
8278 78809 76314 76838 67741 59722 70906 91453 73627 36215 27104 45773 76539 84321 59598
8265 59598 52700 63063 110113 133001 136197 146954 146906 190921 251181 326580 360880 333493 273623
8252 273623 222952 162679 134362 109754 82588 105111 108790 128391 110987 80299 47251 35335
8240 35335 35738 24684 49254 73469 78865 71942 70614 54966 59250 66110 64740 76724 67042 41158
8226 41158 44623 39932 34672 57192 73358 93696 118236 94681 73192 61610 55669 52279 59457
8213 59457 63368 68023 59295 34316 27590 28175 22384 19010 33853 20482 27495 54780 65301 68024
8199 68024 63119 41156 12954 -12364 9902 49799 57035 44184 43243 50476 53186 70690 60577
8186 60577 40877 51066 63065 83862 78301 68842 83841 72078 55226 34013 6559 14164
8174 14164 19859 4752 23052 33984 55982 74760 61367 34261 60984 48214 32450 48421
8162 48421 63583 76942 76448 79728 64034 70005 77590 68208 69883 86812 79665 58304 24757
8149 24757 20781 42977 67857 64503 56698 58866 58739 34880 45810 26409 628 -7130 -17594
8136 -17594 14361 33857 21167 30260 50685 59625 59733 48169 52928 36927 27389 21523 27717
8123 27717 34165 11102 29836 42870 53187 22708 6236 -17844 -8448 -7120 -16207 3896 6884
8110 6884 15009 33166 36716 32245 35834 18850 -1543 25521 16760 2639 13017 10130 -1889
8097 -1889 19989 49002 41501 31005 27748 34245 43385 32213 39733 42512 24917 -42 -3587
8084 -3587 11135 3572 -222 1279 9193 -6394 -9067 5932 21988 30655 35491 21169 -18918
8071 -18918 -12273 -3833 -16325 -38549 -27013 1654 -13024 -20817 -5811 16310 30633 51128
8059 51128 61507 46991 40249 29168 11827 10200 23113 14955 24847 39047 35353 12388 -9404
8046 -9404 1968 11293 -9664 -13041 12970 52367 58584 48410 35474 36718 16461 29687 34857
8033 34857 42682 39900 48696 49514 52688 43170 19124 26958 46141 38856 -862 -39827 -28766 -28471
8019 -28471 -22991 -15673 15277 34764 38079 59193 58836 35825 24537 28595 55028 43830 33190
8006 33190 25882 45665 51085 35414 32965 4500 29256 43482 63030 72517 95560 109489 102745
7993 102745 88675 82878 64884 46441 29055 28730 34825 38036 25073 19159 34743 48542 44620
7980 44620 31019 38183 37944 17117 346 24666 20800 -21461 -14966 10534 18700 16818 19045
7967 19045 12370 -3483 4627 16818 28493 16151 15744 38531 51114 66101 69410 41067 30146
7954 30146 34457 39677 33477 24480 16815 13217 28609 35461 26887 14284 20624 44022 33974 10955
7940 10955 25543 49563 37185 19408 8747 5593 38609 26559 -4085 -5902 -6392 -30293 -23860
7927 -23860 -12098 1610 8537 -8840 -380 6484 -5294 -19282 -30013 -28395 9915 31185 29590
7914 29590 50566 82704 65953 59919 41274 18992 33555 57623 79764 40091 11295 -1197
7902 -1197 -10746 -22104 -6186 -8233 -11889 -3990 15547 30590 10837 3898 5375 -4052 -12259 -10674
7888 -10674 464 8631 -2570 -11400 2872 25981 15966 -25657 -39211 -36624 -9293 -14396 -27712
7875 -27712 -16383 -4520 -10378 -22833 -41139 -18541 -13522 -1606 13234 34585 31242 25223 28157
7862 28157 42282 25753 29264 8012 10557 34674 28872 22125 27026 42495 47870 38608 27568
7849 27568 7585 -10762 -34343 -45336 -16411 -539 -10728 -13910 -6192 -9431 -14829 -18478 14241
7836 14241 32844 26073 15138 -3752 624 -3763 20168 16688 34817 50178 33902 14861 11326
7823 11326 -22275 -5971 512 19913 19540 10763 -3862 3510 37925 46021 28179 14024 -6820
7810 -6820 1390 6190 6118 -881 -9785 -13040 -4377 1793 9100 -8534 -11615 -13636 -6786 7228 3761
7795 3761 -8814 -16470 -7290 -1978 -25057 -31314 11260 25426 -16721 -1372 10555 7417 -24823
7782 -24823 -28400 -9998 -6580 -6726 -17511 -5412 1036 -358 27362 38254 26736 38885 21070
7769 21070 4752 -15074 -29122 -18143 -46626 -28691 14412 55128 65394 58314 50203 34757
7757 34757 27535 23911 12728 4057 -898 1793 13286 29614 22966 2723 16180 12015 13550
7744 13550 48735 32192 37551 51003 43727 52886 40465 9196 16112 47189 52770 40204 39028
7731 39028 36504 53588 35876 23253 19236 22228 22590 23797 34926 53854 89059 69076 36194
7718 36194 24665 46425 44994 -3141 -27423 -3705 15702 15136 7117 4714 37672 58156 44603
7705 44603 18870 10089 20627 39043 23688 24868 41727 61662 51988 34682 40696 55271 67224
7692 67224 60986 21333 22932 30070 26608 32516 28635 51122 47214 26046 5602 -4420 -20503
7679 -20503 2046 3188 21910 27730 25748 30697 45303 56069 65303 52405 47016 34267 24972
7666 24972 1765 -17835 -1705 24708 21229 32206 37628 30248 19629 -17087 -6150 -5150 -3785
7653 -3785 5201 -2391 10887 29885 37763 44533 45067 14709 6575 13631 41904 53500 32486 16848
7639 16848 26849 26047 13702 30883 39263 24930 6581 3448 12977 5013 949 4276 19288
7626 19288 6047 3279 34461 49249 24467 17395 -1812 578 10287 15236 13820 24237 7856
7613 7856 -8238 6875 12373 25838 52504 62602 60024 29613 9386 -4119 1873 15467 18861
7600 18861 -1258 3991 28044 17791 32447 48012 39057 54989 39171 -3131 9075 11156
7588 11156 3738 -4778 -15487 -13873 -24601 -41965 -40828 -24174 -12053 -8732 3412 -11882 -33025
7575 -33025 -42575 -36995 -27865 -14787 -2533 4955 -2989 11579 10950 26590 25124 12165 2701 8258
7561 8258 20700 22359 15791 6245 6480 24959 23855 22328 34064 37302 50283 29936 43531 25795
7547 25795 33115 50363 58825 31197 23046 13158 15687 44693 64781 88410 95172 92433 60314
7534 60314 44846 60885 54225 49158 25640 6745 -16969 -11530 -125 -23570 -46446 -43132 -8355
7521 -8355 11675 25780 17210 -8635 -30709 -19906 13833 37550 40060 22174 9420 14158 46565
7508 46565 34447 -12189 -20193 -9697 19419 35106 32426 26692 27646 26416 14133 -20180 -33625
7495 -33625 -26379 -21986 -7064 -904 8616 -5037 -4931 16962 1422 -16683 -24230 -14007 -6481
7482 -6481 -19191 -20342 -22151 -31771 6574 45080 60542 52666 34573 46420 37631 17501 -13769
7469 -13769 -36955 -30009 -17460 -29554 -26482 -16736 -11268 -2895 8141 22372 39900 52480 43918
7456 43918 38803 30168 500 -28172 -5183 21542 19607 26060 34434 53683 35201 51656 49830
7443 49830 32250 35778 45678 29587 24418 13757 22521 36196 31428 60689 77819 44847 -3547
7430 -3547 -33566 -40634 -37662 -34762 -13220 20342 5177 -10158 -2385 -12304 17026 7459 -9381
7417 -9381 31525 59784 61043 48248 38387 18064 -741 3679 -8949 -915 9949 4761 -3635
7404 -3635 574 14675 27594 9695 1496 1585 -15029 -36698 -21833 6237 -1522 622 493 -25284
7390 -25284 -39103 -14800 -3445 3396 14770 29163 20476 -19195 -5545 2787 -27379 -41691
7378 -41691 -29643 -23976 -20012 -19203 -12256 11723 14312 16096 34487 60070 36774 -6304 -10344
7365 -10344 -14800 -36988 -49685 -23364 -12726 -9121 2552 8337 23707 32775 26494 22428 19209
7352 19209 17105 20453 3909 18141 7662 -7685 -9315 -22417 -25370 -15256 -7040 3418 -21663
7339 -21663 -22663 2469 29247 20270 3906 1969 2398 -28073 -51158 -50376 -46797 -44951 -37883 529
7325 529 -6703 -13422 19933 36243 24312 17352 18872 16317 19431 26163 31124 22609 39922 37967
7311 37967 2472 6072 800 -8042 -31863 -29455 -4270 44673 37200 16922 793 -11201 -12930
7298 -12930 -40213 -59458 -64265 -42852 -30912 -34354 -38196 -33485 -39200 -44967 -48984 -33096 -11690
7285 -11690 -7831 3266 -5062 4188 14998 24442 10475 -17402 -18786 -10496 4726 19473 17362
7272 17362 8546 -417 4396 5587 -6203 2925 14054 18425 10965 -2363 2002 29291 47815
7259 47815 34361 16646 -856 -7890 16404 -12628 -25536 -46867 -39968 -25002 -18893 -9555 -17182
7246 -17182 2416 -5338 211 3666 -3250 -7178 26398 30494 33241 28947 21057 7727 4949 26473
7232 26473 -662 -21081 -28699 -25314 -25886 -28635 -35023 -32089 -42613 7515 36909 21912 7903
7219 7903 -21599 -27597 -5379 3148 -5908 -17518 -34811 -29569 -17776 -18278 -24786 -33662 -72157 -96450
7205 -96450 -52641 740 9290 27970 41088 35851 9566 -15883 -25922 -39274 -56226 -52219
7193 -52219 -47749 -34274 -4220 21298 12369 2271 7853 2939 -35110 -49144 -30144 -11007 -13114
7180 -13114 -34369 -41710 -35040 -40531 -40558 -32332 -18342 3046 -7382 -6259 11256 -21313 -14120 4733
7166 4733 -6362 -44481 -28088 16874 4837 -9248 -12449 -12026 5098 -21378 -62706 -51169 -58990
7153 -58990 -57678 -59375 -22201 -14701 -6284 -29027 -39711 -71867 -82179 -52666 -28518 -28829 -25136
7140 -25136 -23588 -23178 -27177 -34014 -27359 -13689 -1770 5710 12303 13860 21599 -151 11540 38035
7126 38035 49733 35384 351 -7399 8426 1803 -3958 -13926 -18779 273 35108 28141 55
7113 55 8873 8788 9608 4354 -4310 -18170 9932 -922 -7307 14044 10091 5787 29935 20716 -1210
7098 -1210 2978 10588 14016 23683 19400 6040 -16133 -9268 20277 51561 61736 62451 21917 -21845
7084 -21845 -28600 -10314 -440 -4115 -16534 -30687 -31312 -47006 -48724 -28433 -28175 -32005 -39584 -39857
7070 -39857 -23543 -44067 -49664 -26704 11767 22256 19985 -1149 -4935 -14912 -18641 13571 22506
7057 22506 8946 28063 30609 40897 29226 19937 4915 -15476 -13549 -18507 -21699 -39276 -25459
7044 -25459 -7705 14874 20699 31030 52369 53986 47444 32531 7186 -2858 20700 11786 -6873
7031 -6873 18209 15789 9742 14329 21358 5237 -19213 -11399 -3542 10387 25393 25596 10260 -13490
7017 -13490 -22381 1656 18858 -5540 -23002 -5545 -14529 -7341 -15527 -38615 -35338 -11499 -21692
7004 -21692 -46238 -49132 -16565 -12881 -8376 -12188 -14935 -18846 -15092 -12621 -14317 -42252 -69409 -93863
6990 -93863 -71440 -27756 -39293 -69894 -66690 -32785 13199 22436 5260 11315 4807 18092 35416
6977 35416 22149 4904 -3496 -12820 -22007 -12413 -10115 -18028 -47997 -82906 -94837 -73558 -64417
6964 -64417 -69022 -58224 -59068 -46000 -33506 -26482 -20623 -39845 -22028 -14838 -2476 15742 -1740
6951 -1740 -15290 -10456 -26692 -16942 809 -1257 -1966 -11969 -9914 -17279 -14986 -8853 -15382 -19323
6937 -19323 -7202 -3984 -31118 -36177 -20642 -373 -7447 -11958 12177 32997 49398 77904 68982
6924 68982 37103 42503 62200 48980 22807 -8258 -16613 -8172 2788 -7749 -14466 -7522 24605
6911 24605 44101 12639 -11227 12802 17548 19771 277 -33837 -39361 -8100 -1073 -19284 -20565
6898 -20565 -18870 -30950 -29773 -18258 -17315 -12740 7874 8794 -8826 -2658 -2780 16423 14504 3563
6884 3563 12067 20579 30067 37886 8506 -11309 2265 3189 -6466 -31768 -32408 -17440 -8719 13245
6870 13245 13952 -3105 -19448 -12617 -15693 -39026 -29891 -36206 -30948 -34304 -39763 -43647 -30340 -17293
6856 -17293 -26334 -16675 -20066 -34276 -34251 -40931 -31806 4743 10106 16774 36386 7811 -13318 -6277
6842 -6277 -6174 -15588 -39411 -52287 -37350 -39648 -50864 -41607 -23492 -22651 29921 63135 50065
6829 50065 8010 -10680 -21583 -26738 9474 112 -8393 -8424 -12092 -21765 -16271 -26224 -28704 -37006
6815 -37006 -50021 -39628 -37685 -27535 -23907 -13036 -20413 -13835 28700 31575 19182 -19498 -34778
6802 -34778 -29699 -23695 5505 14111 28192 28997 4803 4810 19054 17741 -8662 -15716 -25044 -6396
6788 -6396 1225 901 -4338 -7411 -8123 15095 16063 9678 11134 1617 -8072 7314 26808 7937 2665
6773 2665 -10465 -14921 10766 10126 10744 13762 11590 13561 19933 17703 10092 15294 3199 -1783 1829
6758 1829 5985 19465 27350 26485 36188 42032 17170 8672 16266 25105 9046 -13524 -33963 -59115
6744 -59115 -34844 5658 51256 54705 39971 24128 4671 -10504 -11401 32254 43027 26373
6732 26373 -2201 -27510 -11683 -6631 -12283 -16811 10066 13529 1901 21335 32663 15338 8866
6719 8866 -7342 -17020 -24001 -17932 -42353 -31257 26576 58019 51970 40751 32644 38542 30708
6706 30708 3716 -20224 -18912 3776 35693 22360 28438 2177 -4190 13489 6622 3230 2228
6693 2228 -2968 -13363 -25696 -4994 3710 -40132 -60980 -14540 -3891 -7531 -315 -37889 -36945
6680 -36945 -36619 -47971 -36747 -20024 1689 3618 -3256 5490 26543 32735 13764 1094 -13232
6667 -13232 -23988 -27607 -32456 -33678 -12470 16017 10678 -14390 -27813 -35944 -34486 -29312 6307
6654 6307 -1300 -9995 6946 16031 23774 50639 50295 28655 24401 4644 -1208 5269 40257 17473
6640 17473 16230 18266 1920 1415 -35468 -26177 -870 -12220 -23199 -45487 -48335 -55148 -33505
6627 -33505 -28295 -40213 -23107 -19420 -14332 -32629 -53623 -17869 16135 20788 7264 14022 -8508
6614 -8508 -6966 -18498 -75151 -84472 -35300 -16693 -17447 24970 12773 -18212 4101 11157 19419
6601 19419 30367 29097 6560 4880 26121 43131 36770 27116 17439 6116 -21104 -10293 -14572
6588 -14572 -57222 -59204 -45466 -54427 -18700 363 30905 31146 27110 24779 -4511 -18347 -24451
6575 -24451 -65 10239 21560 26808 24219 7009 -29961 -43612 -20442 -9974 -11718 6297
6563 6297 17042 7983 -33226 -31878 3008 13277 7313 15162 20050 6894 1179 -3827 -22444
6550 -22444 -38397 -49187 -39353 -12167 30255 36499 30439 25493 -4913 -18687 -15738 -25765 -34100
6537 -34100 -31089 -35752 -46716 -29729 -29844 8735 47339 24818 -13778 -13067 118 -2842 -26695
6524 -26695 -32581 -24077 -28320 -17153 -4413 -6870 690 -12824 -17182 -20764 -31450 -16974 8195
6511 8195 9589 4241 -8253 -933 -10054 -2727 21132 34561 19747 28611 52645 58216 21005
6498 21005 21518 11336 -9972 -12290 -5382 -322 -1188 9804 9764 -5136 8446 1146 4727 -4994
6484 -4994 -7704 -14 -6437 -19648 -34713 -33731 -21807 -33990 -31835 -20408 -34714 -32525 -49676
6471 -49676 -57002 -49180 -56513 -11192 2298 -16207 -23891 -7547 -1917 -3690 -6866 272 17954
6458 17954 4069 -29068 -43279 -38438 -25245 -18054 5652 -1472 -27320 -39003 -8103 31239
6446 31239 33652 56932 52966 22796 -4359 -13770 -16116 -18608 -24539 -33025 -23492 -5920 12333
6433 12333 17724 32961 27670 22574 21370 4879 -5346 -13414 -34852 -46311 -48187 -44409 -44603 -43850
6419 -43850 -29168 -20624 -17419 -42159 -61622 -39189 -15926 7367 8613 13239 -5394 -46026 -30552
6406 -30552 -13738 -10885 -31820 -33782 -14365 -32055 -26264 -8737 5427 15388 50369 4765 -36775
6393 -36775 -28457 -5070 -14494 -16957 -15670 -12461 -27417 -2838 16263 -4673 -4087 3486 -13151
6380 -13151 4121 32112 -3388 -8797 -985 -1023 8872 18757 6659 11782 5455 1752 4144 -15589
6366 -15589 -47828 -88414 -94664 -63522 -24023 6707 5210 15441 51890 59329 60608 44821 11212
6353 11212 19678 12265 945 5791 14472 12365 4493 -7003 -24814 -25670 -23775 -16373 -11196 -3864
6339 -3864 6144 18629 35090 10822 -15472 6431 21307 7020 -44397 -30976 -16866 -32157
6327 -32157 -35409 -42603 -20364 2451 -8899 -22131 -32062 -31124 -39290 1437 27843 10959 -14554
6314 -14554 -8379 -16447 -20550 -24992 -25232 -39147 -31083 -16861 -42582 -58723 -31780 -20169 4666
6301 4666 7280 6810 11847 35907 20786 -6922 -20440 -7377 -1710 -8554 -9117 9781 19913 27996
6287 27996 24385 29292 40854 34451 24342 -13879 -33485 -8668 -20160 -17339 -11240 -7313 -6687
6274 -6687 501 -27299 -24264 -21721 -28089 -27296 -9489 18227 -2136 -27963 -14254 -1012 6723
6261 6723 -787 -35509 -33597 -13214 2506 -18561 -55724 -67670 -40727 -15060 3286 -6217 -31717
6248 -31717 -18780 -1843 1438 -24527 -42112 -41270 -41425 -34112 -17218 989 30101 33759 25855
6235 25855 32798 35195 42967 51248 41174 25982 10845 3157 -12309 -10435 331 2812 16405
6222 16405 21688 -21088 -42753 -28993 -14181 -12009 6714 -26714 -38080 -49878 -38154 -24906
6210 -24906 -37926 -26973 4748 -16358 -29014 -5872 4639 421 -27391 -37290 -45839 -50541 -30432
6197 -30432 -16276 -22015 -8375 -43881 -60341 -71856 -60018 -37818 9416 3451 -6569 -15060
6185 -15060 -5866 21218 29969 27064 7039 -7215 -27000 -33580 -44051 -41226 -59215 -40142 -49223
6172 -49223 -53647 -33298 -20966 -29411 -33454 -1987 26315 25624 -10700 -35423 -14220 -14425 -5569
6159 -5569 -17391 -12550 -15558 -15711 -27409 -13859 -9734 -23898 -19249 -24293 -10017 8585 11883 -6860
6145 -6860 -20063 -30726 -46119 -39115 -35087 -12336 -5040 -18813 -26914 -22039 -14557 -8688 -7939 15774
6131 15774 52305 38113 14941 -15996 -23017 2581 33241 44901 29991 -5267 -17828 -9319
6119 -9319 16872 14076 20141 -8267 -8809 496 -7633 -2274 19814 22628 13184 24503 21505 7359
6105 7359 -10707 -50889 -53363 -49196 -33585 -42080 -34448 -27778 -26099 -22411 -17291 -9011 -17349 -11103
6091 -11103 -14099 -41023 -36561 -23968 -2149 -16445 -29759 -17366 376 86 18618 3406 -28358
6078 -28358 -53544 -30776 11877 6741 -9392 -36294 -32802 -24085 -24547 -40295 -41791 -31760 -17865
6065 -17865 7116 9062 -1059 -12633 352 6137 13476 5920 -9664 -18628 -14218 -8583 -387
6052 -387 12138 -6045 7685 6847 -3256 -11232 -26095 -31870 -41975 -35275 -21077 -28172 -67133
6039 -67133 -76653 -45604 -46701 -62140 -45064 -30091 -12679 -21832 -29385 -41377 -36161 -30055 -34041
6026 -34041 -31171 -21455 -9100 1044 -11472 -11419 -39812 -31561 -36264 -49960 -47526 -26546 -31250 -26749
6012 -26749 -12875 2844 -13651 -14948 7480 20199 23552 17337 16726 -14159 -38086 -46542 -43185
5999 -43185 -32293 -41667 -50022 -12801 -10138 -20431 -20281 -52053 -70468 -80236 -81081 -34855 -5147
5986 -5147 -20644 -40838 -45788 -69703 -56557 -30623 -17580 5258 3521 -21205 -21558 -26259 -18505
5973 -18505 -18743 -19890 -19152 -23397 -12765 13682 5082 -24831 -36471 -3804 -249 11643 8726 32321
5959 32321 21584 23569 15390 16264 12568 3915 13650 7657 16291 29551 30651 18608 -4406 -32826
5945 -32826 -43786 -39599 -33088 -34820 -28130 -11914 1529 -3291 8303 21076 18762 -27259 -22890
5932 -22890 16972 27465 1287 -30117 -15924 -12930 -20215 -32585 -37899 -35750 -15768 -3273 -7685
5919 -7685 -22700 -17848 8706 13267 -4334 -25531 -54225 -41245 815 18778 31216 18665
5907 18665 14088 24606 -12390 -34497 -20260 -38260 -71346 -63640 -47963 -50705 -57341 -75839 -64324
5894 -64324 -4963 -3763 -21834 -22838 -15520 -2053 1649 2666 -13404 -11105 11250 11738 7884 -6903
5880 -6903 -8638 5638 5309 7527 15787 27860 28405 10243 33033 62137 69257 55891 3209 -35085
5866 -35085 -12012 -7633 -13431 -19574 -11510 -15447 -8949 -7454 -8751 -34572 -38801 -48789 -29994 -8882
5852 -8882 19583 55 -9653 21933 7410 -23408 1978 18763 13120 -1607 -2994 -8265 -11837
5839 -11837 28519 26100 -7904 -41806 -35052 -7687 -26121 -15391 13075 15526 25801 49620
5827 49620 30842 43594 40712 7636 4664 19842 12909 -27268 -17794 -38604 -55938 -69550 -45516
5814 -45516 -12305 -34986 -62239 -45356 -24001 -37162 -56852 -50944 -38338 -27996 -13243 868
5802 868 8750 20092 -8306 -32233 -37822 -17171 -11027 -3886 16932 48577 43112 20885 11644
5789 11644 -11898 -4067 -18739 -23375 -17249 -5043 -13041 3322 -542 -30268 -44225 -47307 -22455
5776 -22455 -34109 -31293 -14674 2076 -1266 18488 6904 3896 20441 -12106 -28851 -33339 -23521
5763 -23521 -21090 -53980 -67551 -59013 -64251 -52805 -40326 -17878 -9573 -19049 -23084 -17609 -64849
5750 -64849 -70175 -10505 31050 17582 -13308 -13936 -24253 -7953 4077 8023 10667 -3301 -19933
5737 -19933 -24683 -36162 -42154 -16710 -21391 -13575 -27776 -22238 -17504 -28315 -17900 -38178 -35143
5724 -35143 -16964 -16840 -13139 -5468 9740 5755 4325 7262 -146 3121 -6688 -22174 -13853 -8210
5710 -8210 -3189 1364 16564 6221 12589 30374 32859 31010 42889 51307 22350 5699 -2019
5697 -2019 -18603 -17572 -4505 30035 41111 9230 -8301 7641 7742 4858 -20563 -28042 -11944
5684 -11944 -21324 -40892 -28555 -23641 -24315 -35922 -39832 -20268 -20172 -10 -17645 -12420 -6867 -12349
5670 -12349 -456 7312 12896 -9411 -42953 -34426 -39129 -68942 -59783 -44502 -26571 -5520 2882
5657 2882 -621 -11022 6076 22723 3618 -28856 -22988 -433 -12688 -51195 -75059 -77178 -60397
5644 -60397 -50425 -48181 -38628 -52860 -57854 -23715 -40611 -34422 -19132 -14234 -7784 -7599 -17951 -7364
5630 -7364 -27381 -25851 -24772 -24009 -52715 -54884 -16330 571 8154 8754 -13384 7370 36001 37791
5616 37791 9332 -20074 -27465 -25989 -5553 4841 6301 6681 -11822 -8357 1819 19905 40319
5603 40319 21711 13673 8183 -17119 -18166 -9190 11419 983 12615 2632 -24741 -28811 -60453
5590 -60453 -43501 10835 2526 -1960 4762 9179 11822 7052 -15711 -27787 -57199 -44372 -20756
5577 -20756 -33794 -41081 -9026 25297 12951 -7876 -15833 -35827 -17858 -782 -2518 -20659
5565 -20659 -41753 -49971 -19273 -2094 -18555 -18377 -20757 -49526 -70888 -59152 -33765 6224 344
5552 344 -6457 -17931 -6351 24715 11591 28247 16211 6229 12242 439 1776 330 -5709
5539 -5709 11907 9081 1481 -4405 -8169 8449 -16130 -31554 -13884 14872 -7208 -32318 -26141
5526 -26141 -35293 -13740 6638 -11838 -32098 -36959 -55191 -30999 -32987 -62085 -54881 -22449 -29783
5513 -29783 -30653 -23967 -29817 -29840 -13894 -2369 476 -11163 -5655 -14326 -18452 -28730 -46338 -44908
5499 -44908 -46497 -45256 -24339 -2438 15219 -3882 -3756 14178 7282 -24917 -38212 -33557 -19288
5486 -19288 -40447 -61116 -32743 -46599 -57335 -37291 -34897 -19216 18391 25265 18622 6797
5474 6797 -13388 -13400 -13402 -26338 -45093 -45616 -30642 -38168 -38534 -12996 -6723 -14007 -13369 -9642 15561
5459 15561 12139 -18812 -24883 -9411 -7667 -11022 -23215 -12011 -734 11882 9590 6678 -6009
5446 -6009 12614 55950 47000 34148 46888 34990 14228 1485 -10411 17687 36218 34634
5434 34634 51818 54382 31657 7540 -19979 -9492 -10442 -29315 -7080 2585 -3097 -13292 -27029
5421 -27029 -28743 -42042 -35334 -11707 -39398 -21868 15475 2284 -3998 -6110 7161 34090 10866
5408 10866 -12824 -29144 -30853 -22093 -10399 -29473 -48716 -49582 -10621 -10387 -44157 -77470 -69980
5395 -69980 -16059 15733 29480 25402 11755 -5730 -1148 14319 18031 12983 19876 17982 25337
5382 25337 38339 35829 25165 17836 32765 38805 20300 -931 5521 17793 32300 38961 15025
5369 15025 8518 17232 -2559 -37621 -51569 9610 37556 10149 -11764 -16409 -18417 -21625 -27650
5356 -27650 -63024 -43838 -18209 12698 26550 27572 19694 34908 42769 -12133 -43791 -58941
5344 -58941 -63045 -55545 -33781 -28069 -27536 -6664 -2712 30867 43553 28789 4541 -19555 -20828
5331 -20828 -2507 -3365 -16673 -38205 -42926 -23926 -16840 -33625 -21846 -28136 -32692 -24504 -12560
5318 -12560 -30880 -42293 -30482 -32170 -18293 -21339 -41383 -40078 -53220 -62206 -25543 -4400 10211
5305 10211 12602 -13605 -20559 -35621 -21833 -26381 -15006 -21144 -8285 7986 -8804 -35127 -14569
5292 -14569 -852 -13325 -135 3829 18279 24085 15024 -259 11898 21721 16089 21761 5215
5279 5215 -2112 14551 25679 15267 -18829 -37939 -50556 -77729 -65865 -22610 2485 -1589
5267 -1589 -31240 -37140 -54150 -51531 -51951 -54823 -41363 -44543 -29276 -9086 7360 -9531 -24755
5254 -24755 -44009 -16854 -3384 15255 24914 -7818 -33581 -41473 -43077 -36641 -24578 -32376 -19559
5241 -19559 -23258 -24271 -7654 -10083 -37431 -31624 -21823 -22966 -8429 16546 19973 26748 22978 14933
5227 14933 4178 89 2297 -12713 -29657 -16654 912 -4642 -18110 -27114 -62210 -38863 21481
5214 21481 33986 54938 82203 47345 5857 -35102 -34706 -55271 -39633 -38026 -1196 1475 -19145
5201 -19145 -31368 -32845 -33342 -25653 -29268 -31119 -13187 13920 28233 11107 18930 6463 9269
5188 9269 8658 18343 13136 -3493 10884 26980 34005 35262 36063 21069 13914 3472 12086 17641
5174 17641 7851 2962 -14988 -15032 -14755 -19586 -23998 -16746 -25624 -48001 -57893 -21077 10648 13315
5160 13315 -9667 -24483 5076 2910 -13958 9729 18482 12474 -23474 -22120 -1701 1979 -11975
5147 -11975 -3584 -20323 -23842 5486 -10412 -36515 -19487 -18344 -31761 -42439 -65838 -83638
5135 -83638 -57258 -53330 -49715 -25024 -5113 14937 42595 19910 2175 14583 8069 -6476
5123 -6476 -23106 -1232 21990 -18853 -42276 -19956 729 -8111 -4519 6593 -10090 -34407
5111 -34407 -67802 -87063 -75443 -64868 -60013 -37948 -5847 14050 34587 -3650 -39812 -41936
5099 -41936 -17107 -12 -16400 -7091 -20366 -24431 -30990 -48380 -42962 -21073 -16681 -41926 -38796
5086 -38796 -14669 -18723 -49986 -54783 -29144 9227 27773 12198 -19660 -13216 2237 6149 21686
5073 21686 39845 36085 28382 -2757 -17984 -8896 -16349 -27892 -24241 7452 23640 18722 28243
5060 28243 20755 22582 32916 43497 20281 24858 22431 -40168 -51188 -4707 15856 21985 4058
5047 4058 4666 24308 19875 -6033 9771 -896 -21750 160 12338 7113 24383 15607 -7561
5034 -7561 -6600 135 17603 21422 12791 -11341 -21717 -27687 -43502 -23063 -6524 -17187 -25827
5021 -25827 -21396 -2141 3195 1396 -15071 -19583 714 39027 13349 -3529 15242 5068 -28621
5008 -28621 -10425 10214 -18330 -48427 -28999 -4359 -11485 -11868 -680 -9141 -5961 7155 8430
4995 8430 -3576 -21532 -7920 30079 31758 7851 -12317 -14331 -4975 -1367 12674 12970 16199
4982 16199 4777 -2589 8215 689 -5164 -11886 -31295 -3053 22818 13561 12758 53526 64637
4969 64637 55324 25009 11935 6822 9201 -1179 16329 25646 22238 5547 2492 37316 46908
4956 46908 23852 14196 8845 -14379 11849 -3052 -8503 2388 5086 -403 -3680 -22568 -23850
4943 -23850 -31953 -22463 -1160 7167 -17697 3219 23480 22160 8232 -7569 -18238 -10251 2271
4930 2271 23601 28874 29768 2233 -28602 -26448 -30672 -13317 11611 30277 32692 30913 20489
4917 20489 12527 8864 1708 -9478 -18473 -45016 -60039 -35374 4251 904 -2125 -11449 -24509
4904 -24509 -23302 -34618 -48988 -60335 -62944 -64004 -62765 -53334 -37633 -40801 -51952 -38192 -31962
4891 -31962 279 15026 1353 -10010 20246 43555 60843 33701 -9674 -47320 -50414 -22370
4879 -22370 -13317 -28918 -39679 -23819 -1172 -5385 -4496 -560 3678 22070 -19640 -54692 -65820
4866 -65820 -42337 -13044 6585 3175 3779 6218 8221 18724 21949 -9116 -19864 -4829 -8477
4853 -8477 3096 -28787 -9545 22878 36233 12727 -25106 -36719 -16280 2014 -5426 -5121 -21670
4840 -21670 -34045 -37217 -17570 3049 -7052 1239 -32502 -40634 -8939 2928 -28912 -39510
4828 -39510 -47677 -53910 -32140 -19401 -10877 -8332 5079 6282 -27037 -50346 -37492 -45385 -20033
4815 -20033 22933 56430 49772 16760 23394 12612 -821 13719 -4118 -25752 -53513 -34206
4803 -34206 -42748 -50475 -16837 -4164 1007 -4725 -30014 -61590 -55142 -32605 -9675 -22562 -38628
4790 -38628 -51064 -40917 -23496 -11369 14308 16660 25313 28458 -13126 -19981 953 8374 -2708
4777 -2708 -15579 -13470 2030 3354 5546 -2204 35280 35118 23133 26147 22976 6676 16281 34032
4763 34032 115 -18650 -10301 -20484 -37890 -51449 -44812 -43755 -39032 -32082 -25801 -33497 -23262
4750 -23262 -8907 -8536 -10702 -19935 -6402 -11121 -37835 -48693 -23867 12928 8821 -3738 -28687
4737 -28687 -28739 1391 -1245 1837 -13336 -24234 -24087 -3743 -9133 -1246 6003 8998 -17877 -38049
4723 -38049 -33898 -12405 -9838 2449 25206 32049 14187 6947 -11929 -27050 -3750 4356 1636
4710 1636 -15045 -4859 -24728 -42483 -43082 -47577 -47903 -34118 -27443 -38864 -61652 -75453 -73422
4697 -73422 -50181 -34683 -28792 -16941 -36686 -35606 -17329 -1927 17833 12577 -5764 -23836
4685 -23836 -4488 4459 -19182 -19178 -12827 -2825 -10118 -5495 5588 -6252 -5509 4086 -9216 -65912
4671 -65912 -78354 -66840 -59905 -25934 19271 40212 33751 19427 32525 32078 16857 -10248 -352
4658 -352 10049 -3367 1898 -14414 -35033 -30796 -43290 -40840 -32343 -54716 -35396 -18302 -97
4645 -97 21319 -17139 -33645 -20404 -22470 -20777 3364 26484 -719 -13260 -6119 21393 52185
4632 52185 41891 1657 -38801 -70452 -28615 -2942 1492 -3290 -36573 -67639 -64273 -70488 -58999
4619 -58999 -36907 -35810 -40290 -14259 -7615 10051 20836 28557 31164 15357 -9464 -24007 -33709
4606 -33709 -40633 -29866 -36931 -38377 -33968 -15964 -10343 -16081 21562 8831 -25439 -51774 -44264
4593 -44264 -49596 -37040 -30827 -18979 -23697 -13974 -10309 6669 21894 28196 28274 21167 39592 53802
4579 53802 50870 6055 -38282 -59355 -51344 -44397 -52349 -53592 -43475 -27185 -22918 -3400 36155
4566 36155 18695 -4911 -10386 29094 42531 16178 -5617 3783 -2924 10344 9623 -22347 -34675
4553 -34675 -50575 -60536 -59267 -12286 13850 14725 8803 -18533 -15024 -24167 -23751 -17544 -24211 -28203
4539 -28203 -31561 -13631 -24698 -34235 -25825 -35115 -22370 -7492 -22288 -29279 -9319 -27614 -90038
4526 -90038 -85731 -51903 -57546 -48019 -33264 -25210 -22506 -23487 -15975 -17000 1638 20476 12797 -33466
4512 -33466 -54595 -39677 -22782 -11242 -4430 9315 21839 20958 -14820 -30174 -14536 -15957 -16187
4499 -16187 -1322 -2571 15022 16058 -12575 -1421 6887 -7532 7065 1479 11680 -19554 -34058
4486 -34058 -37267 -50009 -37969 -33841 -32678 -27174 -9197 3800 -37365 -58071 -40369 -33237 -17331
4473 -17331 1335 3721 12471 11766 4943 9449 -14653 -13814 -23174 -19524 -2686 6750 -13034 -34429
4459 -34429 -32958 -22909 -47621 -57690 -32588 -12208 -2538 -4067 -13196 -15523 -25257 -41268 -4873
4446 -4873 -12744 24073 49763 35416 7796 -6556 -26270 -67710 -42561 -15570 -9073 -9816 -25439
4433 -25439 -23917 -21872 -24058 -16459 -27410 -17488 8378 -3984 -21464 -21238 -23557 -24440 -20896 -8974
4419 -8974 -4332 -5984 24991 17094 -11220 -20138 -6187 19200 30428 3543 -11478 -14966 -10517
4406 -10517 -20597 -19629 -23108 -33317 -23465 -6763 361 10451 19328 30017 57503 38909 19562
4393 19562 -15413 -10433 -15993 -25268 -20686 -17813 2667 -1447 -34355 -41484 1316 23496 49249
4380 49249 33142 393 -24376 -31434 -42273 -10968 -29567 -52704 -36745 -19890 -23468 -8838
4368 -8838 30433 24162 18814 19523 -4876 -19860 -24793 -21242 -23798 -28211 -17046 -20097 -32472 -53031
4354 -53031 -67399 -70068 -44564 -23590 5606 15702 25741 24553 14612 5646 -1187 6829 -17387
4341 -17387 549 33181 5968 12131 24869 6366 -39371 -11917 2318 -15575 -28186 -30353
4329 -30353 -59090 -70803 -69315 -41291 -23436 -38222 -77524 -58728 -40900 -25907 331 -2617
4317 -2617 -11641 -22955 -38069 -62055 -57316 -38739 -18829 11854 -3636 -20734 4551 17524
4305 17524 21914 17041 12909 11414 4646 11731 33489 5099 -7850 11167 12996 -35323 -46197
4292 -46197 -46904 -51251 -37430 -17177 -6874 -3251 -24159 -28038 -12533 -21708 -7509 -26484 -36737
4279 -36737 -18021 -46214 -51174 -35786 -16216 -5050 15233 1541 -4136 5433 26969 48654
4267 48654 40828 6473 1023 -19627 -31855 -3280 -4227 -39441 -47163 -33373 -15056 -20738 -11986
4254 -11986 7002 28459 21983 3079 19054 26121 52156 59631 61804 73091 48381 25583 24046
4241 24046 19513 -5884 -21182 -2973 34136 57163 36202 10280 22752 12256 1039 -4907
4229 -4907 -17159 -13555 -26807 -31041 -7318 -2544 -6549 -6912 -17403 -7088 -7089 -23344 -40285 -24912
4215 -24912 -18488 -18966 -29094 -37974 -44256 -33198 -21366 -24492 -22755 -31516 -37886 -29828 3358 9595
4201 9595 -3621 -1732 -16356 -22900 -4607 5123 14488 34182 28896 17289 18504 -12085 -29738
4188 -29738 6618 10660 -3311 -5238 2972 11549 -9851 -37120 -50741 -53990 -42297 -21363 -13787
4175 -13787 -20905 -31667 -19989 -12624 -14341 -19940 -24571 -829 -4449 12518 17580 22428 -1887
4162 -1887 -2757 -36296 -47593 -37466 -23960 -7632 -21825 2838 3715 -5961 8190 16996 -6033
4149 -6033 -39283 -38599 -40577 -36979 -6341 -6130 -10299 -7254 5925 36405 24262 -3242 -15349 -15952
4135 -15952 -585 11345 24752 9658 17165 22536 16679 17112 41170 66751 52446 33887 37092
4122 37092 44379 41149 21842 36498 47803 15146 -18975 -35387 -23736 -2660 700 19476
4110 19476 15531 8142 -10829 3193 26886 9393 -4636 -4413 15427 11115 -7308 1137 21017
4097 21017 24263 -2700 -25256 -15632 -12707 8047 -14649 -48768 -23884 4892 -8224 -23352
4085 -23352 -34848 -21641 -23982 -20006 -61931 -70308 -49440 -46336 -29271 -35348 -43965 -50323 -48725
4072 -48725 -44200 -12074 3625 17815 32351 15471 16175 6027 17954 16257 -4951 -29222 -7078
4059 -7078 8136 7538 -9934 451 -22634 -37021 -21467 -19455 -41612 -62306 -55712 -41436 -30994
4046 -30994 -40978 -38683 -25558 -2478 5030 17909 34999 9471 5733 24048 28430 3167 -30891
4033 -30891 -33648 -15885 -12315 -33885 -51822 -34571 -13375 -32818 -45264 -51519 -28368 -1992
4021 -1992 -6053 7691 29492 27259 -10091 -18869 -21057 -17467 -33452 -30445 -40215 -42031 -55000 -22852
4007 -22852 675 24547 9354 11651 25618 15688 -2066 -4953 -1945 10417 17295 29998 21222
3994 21222 4479 2188 -13061 -19990 -28213 -63381 -47650 -54875 -51305 -33649 -13118 -24592 -30492
3981 -30492 -19854 -16323 -21030 -28967 -35910 -26149 -20995 -55953 -65133 -31948 -10225 -1937 -12984
3968 -12984 -23667 -39507 -15276 6162 18807 19177 4432 -1350 -8744 -18362 -17630 -13012 -14095 2975
3954 2975 17447 -7286 -19500 10909 27800 10996 8066 878 19238 -18397 -27481 -7538 -31199
3941 -31199 -42896 -18370 12297 21688 45983 36089 20146 27994 21392 23450 15884 9537 -9486
3928 -9486 -5901 16455 21287 15940 6997 -10420 -26459 -52510 -50823 -27423 -12010 2901 -17597
3915 -17597 -44604 -61617 -22075 -38032 -68584 -41945 -23693 -16253 -7928 -14557 -28697 -20200 -15224
3902 -15224 -23801 -5802 32055 47273 59239 42847 10514 -4769 13147 19712 5443 11657
3890 11657 5442 -9048 -31102 1153 -520 -34599 -34360 -38256 -36583 -27083 -34946 -56062 -40315
3877 -40315 -45656 -67523 -48589 -11505 -8616 -49912 -65681 -17370 -588 -15952 -27603 -10319
3865 -10319 -28805 -33434 -37561 -51658 -28819 -14615 -13294 -16025 -185 2706 5519 -20 4141
3852 4141 7631 7889 4266 6396 25863 24376 -4034 7027 9463 -226 -14264 -20866 -20810 -30809 -11158
3837 -11158 4706 15979 11996 -2462 -9037 -25757 -36289 -41027 -29310 -19816 -25316 -39584 -54875
3824 -54875 -44408 -23847 -20960 -23834 -19266 -26519 -26039 -29841 -28128 -18189 -22326 5229 9630 21893
3810 21893 26495 30065 37740 56356 47289 28375 23340 30307 1389 -13165 -5109 6610 21309
3797 21309 18371 -11254 -4824 -8397 -4890 -16436 -40325 -31470 -16334 -13130 -11514 -19096 -18334 -23595
3783 -23595 -28362 -22750 -11330 -10562 2856 -2561 -7378 -9687 15380 30357 17749 -5819 -11394
3770 -11394 7422 46880 26456 -8298 -24374 -25904 -27863 -33279 -49470 -68021 -53086 -32628
3758 -32628 -37142 -27666 -56192 -53114 -28290 -10225 -36131 -46768 -45800 -48488 -85384 -73848 -41946
3745 -41946 -10238 14280 16033 -11017 -23465 -17983 -2393 6161 15692 2101 2881 -1222 9401
3732 9401 24248 -2144 3109 33056 38213 12252 -19215 1193 27919 21184 -6067 -5270 3786
3719 3786 13137 16418 -449 -10558 -9690 872 20413 41349 45713 15510 -882 -9257 -12864
3706 -12864 -5943 6541 21504 1376 -14042 -18304 -30330 -21931 7369 -1837 -36358 -82744 -77686
3693 -77686 -70079 -84802 -84500 -43185 -30365 -11982 -8689 -9880 -24885 -12546 18429 5647 -1571
3680 -1571 -1993 -2386 24970 31541 16256 13236 3675 3822 -2422 -9266 -11603 9471 20227 37890
3666 37890 22848 31978 33647 23180 23101 16957 10135 1073 819 24418 23231 12145 8223 13516
3652 13516 20381 36612 34889 21369 1190 -25962 -32975 -44149 -22538 -10843 -22848 -16105 5764
3639 5764 27001 36974 28712 -3530 18252 6329 -29220 -29473 -15077 -9334 17000 15673 14527
3626 14527 -6328 -15589 -18757 -35075 -26380 4105 582 -5880 -23954 -45737 -33362 -53783 -43237
3613 -43237 -37800 -61897 -73108 -61164 -29668 -20298 -22437 -4039 -42 452 -12202 -32968 -23771
3600 -23771 -19963 -19215 -17219 -22423 -2948 966 5177 36675 45835 42861 33574 8411 -31290 -55398
3586 -55398 -32374 -54557 -34121 -12318 -12677 -27113 -38989 -49566 -51263 -64130 -29755 -11607
3574 -11607 -3660 -6971 -30199 -31067 -23065 -7423 14367 8912 1361 -17469 -24226 3460 5631 -17119
3560 -17119 -51957 -68563 -51543 -8685 21030 -14435 -22245 -38223 -52085 -23983 -20850 -15577
3548 -15577 -12258 8911 1581 -13043 -17790 -21271 -18907 -32390 -24199 -7072 -16605 -38170 -14377
3535 -14377 9037 -6157 -18422 -14743 -34731 -19958 -21945 -37078 -35982 -14566 -33839 -18204
3523 -18204 -25382 -19011 -9291 -33778 -57811 -58428 -44763 -48577 -34187 -26004 -20782 -22378 -34378 -38845
3509 -38845 -3498 -7052 -26058 -23900 -20100 -41133 -31127 -52102 -64120 -53281 -54599 -50731 -29633
3496 -29633 -31577 -11520 1497 -4795 10861 13123 21170 4458 3314 23872 18693 30835 23045
3483 23045 10201 8327 1883 21183 3380 -22932 -28631 -33117 -4687 6138 18782 2060 -6565
3470 -6565 7111 -1407 -2661 9509 1151 -42537 -47851 -31685 1252 18150 9137 -7560 -11792
3457 -11792 -15352 -26799 -13622 27170 21149 -13703 -24556 -33474 -36165 -15310 -2467 -6112 177
3444 177 17389 22592 24196 17485 8094 -17073 -54078 -46100 -5948 -24242 -51667 -65077 -46961
3431 -46961 -23875 13216 29942 15059 7552 -10635 -13997 -27937 -22182 -19088 14909 8722 -820
3418 -820 -35438 -26571 -23866 -47110 -20821 10162 1250 7848 18153 27125 18818 1471 1671 -20247
3404 -20247 -25036 -26647 16087 20070 3701 -1985 -11344 -33866 -33811 -37202 -19611 -9970 -11761 -12535
3390 -12535 20758 45959 24693 2870 -26471 -15428 -337 -13427 15613 37114 51798 39916
3378 39916 42589 5397 -15677 -6117 -12822 -17342 -24952 -10778 -5679 -3725 7231 2128 -30728
3365 -30728 -55235 -52622 -37215 -12085 4111 11303 2021 -1126 13826 -2367 -44424 -40215 -33372
3352 -33372 -41711 -35160 -31695 -49551 -60739 -48429 -51574 -20573 9324 21473 7339 4380 18897
3339 18897 14145 10228 15292 9854 17667 8755 2591 -24051 -45792 -39134 -25362 -6396 6204
3326 6204 -816 -34311 -27310 484 321 7594 11134 16381 14798 15714 9866 -8505 -27272 -37018
3312 -37018 -25324 -5441 8264 -17944 -14744 15226 18405 5342 -8694 -26395 625 274 -6501
3299 -6501 36404 28811 9091 14876 443 708 3416 -23567 -15741 -15143 -11505 4171 30395 36118
3285 36118 29290 35949 51931 37104 21544 14798 -9525 -11896 -22139 -30956 -51331 -47590 -29976
3272 -29976 -9685 4494 -9466 -40605 -60934 -32080 9131 -1191 -5550 -23946 -22493 -20826
3260 -20826 -14199 4271 -9106 -37308 -31645 -11827 8321 2739 7536 18454 10516 -9066 -21557
3247 -21557 -41197 -29385 -30440 -36156 -46054 -46949 -59676 -60222 -67469 -56228 -41522 -19201 -13134 -7871
3233 -7871 -12458 2955 4763 4344 -916 -11958 -3427 7200 -12277 -26734 -18758 -3481 -16245
3220 -16245 -21382 -6928 30959 38551 22507 25531 27086 43859 50816 11788 6253 2749 -3486
3207 -3486 -2157 -9493 23825 2739 2189 26464 15705 -301 14540 -699 -22924 -36010 -2352
3194 -2352 42472 23256 -15010 -8865 -1172 1524 365 -20246 -21762 -19820 -31986 -32393 -18146 7944
3180 7944 -4563 -13412 -32086 -47567 -40879 -47753 -47977 -22585 -4109 -6650 -21260 -31193 -22392 -8789
3166 -8789 -8357 300 7842 22319 9300 9905 9329 34058 19515 9189 -8057 -15247 -5610 -2911
3152 -2911 19613 41053 36389 24733 -15402 -14040 -4831 13205 -3368 -14445 -1275 2780 26910
3139 26910 30096 12539 6403 5961 5202 7161 3965 -14165 -32328 -20794 32609 26179 19413 30520
3125 30520 44118 38223 20116 6287 -1332 4138 31593 27297 2220 -18814 -38699 -46517 -57813
3112 -57813 -48175 -70050 -59864 -51198 -46252 -53549 -64080 -38897 -19937 737 -4336 -19965 -8144
3099 -8144 522 -45490 -60416 -29666 -7784 -850 -6838 -2172 -20132 -11681 -6091 -16149 -22364
3086 -22364 -42639 -40924 -31283 -10254 28207 46094 29252 29734 23345 1889 -4897 -1047 16420
3073 16420 -4273 -1589 -31743 -43699 -29055 -13506 9805 3738 -16084 4774 29341 -12332
3061 -12332 -38840 -28664 -14685 -9036 -32503 -47072 -23741 -9378 -22387 -25158 -1280 22367
3049 22367 29440 26331 2525 17784 16295 -12232 -13751 13971 15726 27571 20938 -23327 -44445
3036 -44445 -23289 -10211 3458 13051 42149 56885 28045 26760 42170 27861 1809 -7575
3024 -7575 -17385 -1892 11383 3403 -8196 -39919 -9245 14654 28714 51806 54594 36210 25146
3011 25146 29565 25157 27930 39803 36798 25402 11729 -4965 14139 17531 -7428 -28448 -36841
2998 -36841 -7494 -8921 -33794 -15031 -1316 -12664 -17743 -28735 -25014 -9579 -7664 -28922 -24664
2985 -24664 -6775 -2641 26411 20831 25925 40460 34897 39511 31880 35095 20934 -19032 -13402
2972 -13402 -915 6950 3557 -1241 -1593 -33303 -52809 -41333 -35982 -42729 -48967 -16808 20464
2959 20464 21837 10325 4862 -5923 -20481 -27854 -9960 21417 40562 29508 -17952 -27280 -11109
2946 -11109 -13677 -23713 -39393 -36757 -16166 10288 14994 32939 35578 23662 14322 2036 12285
2933 12285 2407 -6914 -9762 13123 13959 -8365 -15004 -18820 -34900 -30381 -37547 -37704 -26234 -30569
2919 -30569 -10128 25673 23472 26486 36042 24893 31626 41405 12041 -7940 -8071 -12759 -48429
2906 -48429 -56577 -16361 5101 -4726 -1659 -1098 -3357 -1130 -26340 -34085 -39119 -42565 -33723 -16300
2892 -16300 391 13432 21696 29571 21222 3472 5766 -28603 -29131 -12613 -19118 -19161 -24237 -34456
2878 -34456 -21739 10517 4214 -1978 -12977 7188 -16094 -18331 25423 23495 868 -23442 -12882
2865 -12882 3715 21608 25321 -4574 8697 20207 33909 21600 17337 7887 8680 -8701 -21208
2852 -21208 -39287 -44682 -35048 -25397 -3623 -10430 -8388 -9274 -24961 -17668 -8730 -45576 -51770 -37208
2838 -37208 -10194 2338 10527 2750 2597 6263 3597 4848 -22065 -6514 18054 38955 65624
2825 65624 42359 29689 13275 -6054 -24413 -4798 -23771 -16277 20178 29029 19011 -1961
2813 -1961 -9502 -23762 -43670 -32550 -19537 -41891 -24795 -20440 -19927 -18022 -19790 -31851 -38970
2800 -38970 -43746 -17532 -15159 -25429 -15237 -12282 -7575 -10113 -19781 -35953 -49917 -38257 -31162
2787 -31162 -37213 -30687 -45314 -29450 -8197 -7113 -11458 -31862 -10603 -9549 -24120 -21632 -39004
2774 -39004 -32243 -24861 -18494 -20076 -26301 -34194 -28189 2196 16783 4453 -10938 -19757 -14872 -22876
2760 -22876 -17170 -23674 -17660 -19415 14451 49006 46957 54448 70428 49023 12718 3731 6986
2747 6986 8591 -5336 -23798 1743 4762 7467 3706 11464 5082 -10445 4083 30145 19015
2734 19015 1428 -11915 -12554 12790 14254 20799 10605 24629 16452 19759 30029 23672 2174
2721 2174 31295 48802 47394 23378 17501 -6446 -23613 -39642 -21711 16314 17380 36950 25329
2708 25329 17827 21199 9656 32707 21430 29678 34267 15932 -11880 6523 20018 38994 52422
2695 52422 50383 16652 1163 7677 7540 31769 28777 -890 -20439 -17988 11992 38796 40994
2682 40994 21494 -1858 -21896 -36958 -8789 1165 -5360 -2829 -6725 -15956 -45930 -58666 -61001
2669 -61001 -35043 -42698 -41991 -18802 11591 8813 1870 -2359 -18313 -10179 6221 15530 15680 -8320
2655 -8320 -27263 -26295 -17309 -1657 550 -9659 12925 34599 24778 13808 -16753 -39629 -39475
2642 -39475 2290 24328 10454 -13098 -24021 -31670 -23286 2013 -3093 4977 -10966 -1727 17326
2629 17326 23450 43886 42568 33188 34368 13680 -7497 -39186 -46448 -29557 -23891 -10674 -22738
2616 -22738 -9112 -2405 -11059 10658 23281 -5321 -13576 -5611 9959 -15795 -61292 -40505 -15000
2603 -15000 -25601 -44573 -27788 2631 31979 54425 20729 -23040 -17364 -10403 4617 -2024
2591 -2024 15840 18838 12034 4843 5284 -6821 -6199 26946 86586 72924 25701 777 -8910 -11203
2577 -11203 3066 -2583 -26843 -42938 -17925 -9381 -5885 -15577 -7772 -7600 10994 16620 -3819
2564 -3819 429 31100 35097 10772 -3712 -35557 -60273 -63408 -29125 -4500 620 -2223 -22370
2551 -22370 -11549 -7625 -7232 -10415 -31244 -14719 4508 16647 11708 5127 -10902 -5702 841
2538 841 4783 18058 18697 15659 1519 3928 -2080 -5824 25130 41054 37615 34590 36985 50860
2524 50860 60212 38101 42134 32336 15770 17515 14317 22839 16731 16426 16955 18174 29763 13686
2510 13686 -11057 -6498 416 -13906 -20944 -2886 16542 9207 -28320 -29107 -12506 -6091 -13031
2497 -13031 8845 13044 -22472 -10783 18831 10988 -5219 3860 7925 -6054 -22783 -10904 -1444
2484 -1444 -29225 -57096 -44538 -19380 5352 6692 13686 20533 -6486 527 10661 -527 -28826
2471 -28826 -44441 -24118 3203 -10592 -31043 -13568 -1586 -17571 -22450 12392 29897 20241
2459 20241 -920 -8967 9938 716 -6679 10468 26677 18450 -3094 -44703 -37651 -28328 -31108
2446 -31108 -9955 -2456 -10427 -21600 99 10306 4779 41689 45751 34518 49245 32569 38054
2433 38054 62156 61474 46314 74907 50335 7131 9927 25854 55293 35364 10745 13223 18980
2420 18980 1462 -14204 16451 30177 42950 56679 54382 57620 55695 50505 27974 17930 8561
2407 8561 21874 1151 -15350 -31927 -17460 -946 5723 11827 3813 -23017 -40461 -44920 -34025
2394 -34025 3352 -3027 -9252 -26458 -29622 -36876 -41257 -44757 -2583 35593 17643 -19133 -45769
2381 -45769 -55728 -59595 -67075 -45406 -37066 -3239 44121 71263 56644 36745 16277 4829 -3160
2368 -3160 10562 26778 -4381 -10184 -20325 -15622 -1515 24136 33562 21857 9590 -7487 -17479
2355 -17479 -1908 19055 15019 16644 9390 15479 3153 9977 19286 18322 36869 33000 20303 19598
2341 19598 12576 18011 21451 -2527 -1250 13433 -16073 -11165 5806 -12294 -33577 -42895 -39166
2328 -39166 -47894 -27637 8271 36269 30937 17590 3262 -614 -19192 -5824 21986 25222 5007
2315 5007 8656 4213 4411 24140 23573 16258 8431 -5832 -30575 -20470 -19214 -21962 -18839 6699
2301 6699 24131 22581 -1151 -15237 265 6661 -876 -227 -1932 13161 -2492 -20634 -3710
2288 -3710 5318 8914 29385 17786 1371 8724 7009 13734 28624 23969 14934 20202 21817 19040
2274 19040 9088 13323 -8570 -32131 -27408 -16515 -14531 -23802 -12925 2297 5430 8018 21399
2261 21399 18284 9427 25124 15969 668 5359 7810 -7196 -20233 -26868 -29254 -7889 3997
2248 3997 -8899 -21400 -24222 -4340 28469 25404 5308 -5268 -18542 -5526 -5799 -8115 -24459
2235 -24459 -19974 -18922 -19936 -15380 -30463 -30113 -5127 -19412 -18116 2311 20375 3293 2359 8207
2221 8207 -18990 -21574 -10655 -9204 -15177 -16699 -28898 -6527 -11089 -15742 -12082 -23265 -16719 -24666
2207 -24666 -2025 1297 -18955 -16810 388 22000 10423 -4901 1179 -163 -9296 -28824 -57300
2194 -57300 -64711 -82652 -84056 -76795 -63694 -64973 -57307 -27270 -9503 32534 40705 27265 27388
2181 27388 -13424 -36559 -43659 -33749 -5934 24270 18745 34608 51607 45537 22889 38681 51372
2168 51372 59428 45597 36162 23308 39662 31735 8515 12620 7077 9271 16626 23636 41276
2155 41276 45001 24510 8180 14077 10660 18245 21092 10762 29331 28312 22935 31416 39297 57565
2141 57565 61420 35008 34285 551 -21087 -25682 -33729 -28143 -18199 -2464 2601 -27223 -29368 -14768
2127 -14768 3100 1751 3294 1308 5403 21745 39965 25971 8291 -13389 -26430 -16322 4237
2114 4237 34561 28222 4920 11110 17717 8044 -923 11670 29289 3375 -5174 -15870 -52222
2101 -52222 -55128 -31444 -25351 -16329 -37341 -35624 -40096 -33482 -37193 -29464 -14596 19959 39690
2088 39690 18638 50679 71523 48797 19133 -425 -14872 -15091 -12435 -30450 -38840 -17497 10625
2075 10625 4273 13968 3758 -29171 -49057 -61594 -61573 -44825 -9077 -625 -10067 -29752 -34850
2062 -34850 -18786 -8575 -9044 -13339 -2739 12230 2381 -2536 -26520 -25394 -9248 1618 25290
2049 25290 51729 59121 50052 31846 -1220 -15071 16696 12433 19518 25947 17607 13661 38110
2036 38110 34739 5662 21462 30589 49264 10087 9252 18338 21700 24317 24417 30883 57052 52189
2022 52189 36980 11155 6269 -4448 -8398 -19002 -6270 19175 31499 53931 44543 33131
2010 33131 -11705 -31456 -15536 -10673 -4205 -5986 -2294 -14762 -25597 -19591 -32371 -13207 7539
1997 7539 10848 7558 7089 8126 29730 28687 11291 -4522 1051 6080 -14074 -9702 -7022 -21188
1983 -21188 -14431 -19601 -23028 -18642 4454 11131 14550 24946 24905 28081 22052 9794 26861 33626
1969 33626 18544 15533 23830 37042 22340 5311 19621 32171 23573 27056 10611 11636 22123
1956 22123 568 -559 -8402 -41706 -53097 -27158 8800 7574 -8062 8151 5666 -9875 -13698
1943 -13698 -7240 -1054 -11393 -24288 -17945 16623 14830 8925 -21918 -27407 -512 6635 -10828
1930 -10828 -18553 -3422 -32895 -40432 -27147 -5337 -645 -486 8621 24322 -11451 10180 43900
1917 43900 47018 32480 48335 44368 9777 -16492 -17955 -31356 -36688 -36739 -13522 2871 4612
1904 4612 -13438 -2727 -3540 6578 9812 11409 29009 48082 50183 41811 40799 46510 23088 19141
1890 19141 11830 -10187 -16496 13996 12189 20968 21198 -26535 -25589 -14328 19865 32863 36813 19353
1876 19353 -769 4008 -7873 -9402 -12498 3898 25636 26686 7414 16526 30222 17920 1524
1863 1524 -29594 -39786 -16152 17178 39565 41675 11654 1811 13905 26265 46729 44364 14687
1850 14687 4161 13694 51759 40301 26656 22327 19232 429 2867 12018 29757 43077 17808
1837 17808 20345 14349 26889 34005 25544 11295 20383 15664 11809 -8599 -23349 -8706 -14529
1824 -14529 28820 75354 60240 32349 6194 -12340 2501 4760 -5841 -17517 -14990 -4404
1812 -4404 -8286 -35137 -32351 -35410 -16964 33753 48388 9656 -23626 -20275 -6712 11574 29575
1799 29575 44231 27075 2853 -1996 6035 41534 47116 39174 46852 37154 -4630 -16103 11911
1786 11911 25744 17600 -15436 -17402 -8116 12055 18038 2480 20079 22979 40424 12716 -6485
1773 -6485 -8429 24849 26400 28166 23009 -23873 -15529 -14427 7130 25171 34946 -5496 -29542
1760 -29542 -426 570 -11390 -40241 -41095 -19753 -38809 -61052 -53971 -54092 -24308 -25647 -24427 7654
1746 7654 6837 -12185 -16358 1911 4964 -9018 -6287 -14793 -30438 2735 27573 1633 7797
1733 7797 12333 17847 18035 27481 34856 25570 37588 41810 28240 40572 21212 1562 -13097 -23952
1719 -23952 -25142 -23880 -29098 -15060 -7978 1740 -29640 -37911 -34442 -23903 -33176 -35492 -24624 2503
1705 2503 16691 11579 -2616 -5147 23868 23328 6022 -10279 -13478 -7666 -12066 -7985 -7112 -9362
1691 -9362 -6606 26200 35613 39544 11117 -34572 -16624 7567 48 -10734 -22952 -37795 -28149
1678 -28149 -7631 16679 21070 19627 3425 -8273 11108 8313 -3934 -21559 -20980 1651 11530
1665 11530 22550 21640 -9462 3526 32687 57152 60758 17320 -22339 -26474 11972 2291 -18958
1652 -18958 -7755 10668 24390 -2329 -25109 -29519 -33644 -31051 -16035 6538 1665 -23282 -41167
1639 -41167 -43335 -34404 -34663 -20618 997 17520 22747 27847 20403 12048 5609 8789 -810 -7716
1625 -7716 -15627 -10503 -7768 -15073 -6382 8678 41773 32909 19345 8972 51677 52318 22827 -2796
1611 -2796 -3939 -2297 15007 35068 33644 4 3048 -1120 25254 39703 6456 3004 22499
1598 22499 36942 29095 2814 -6083 6253 -6638 -11137 -17447 -21498 -8631 -6065 -10553 -8084
1585 -8084 30514 34789 13696 14416 71 -6641 557 -13695 6733 38743 42011 40405 6541
1572 6541 -4665 -15670 -13788 -18682 -14778 -13003 -25923 -12029 -3342 -769 3363 5712 23571 36640
1558 36640 16012 20997 18697 -32 1496 -3270 -4260 8786 9295 5441 22327 42682 18092 3069
1544 3069 4198 4279 10723 13392 33381 42482 40428 52945 45268 24088 -22377 -11196 -212 24938
1530 24938 14121 16727 22816 -2662 -14226 3456 31916 40139 51644 43759 13964 13404 36756
1517 36756 46551 29223 9205 -30213 -48883 -60749 -58856 -34964 -31384 -38244 -39131 -19293 -38210
1504 -38210 -40038 -37932 -8001 5076 -7350 -14030 15254 2192 -28926 -44379 -30045 -11492
1492 -11492 -12775 -15290 -689 35664 46143 35087 16406 -3806 2482 5725 14199 10523 20180
1479 20180 23201 57494 62066 55393 16987 268 5712 22810 2781 -25720 -28235 4400 14209
1466 14209 36396 23461 6318 12028 -3652 -20762 -24376 -21861 -1505 1163 17219 32997 33100
1453 33100 20694 12504 14926 7107 7031 -13977 -13296 -1372 -1582 12047 9858 16867 434 -17872
1439 -17872 -31098 -23016 -1816 -12933 -36727 -20482 8157 35745 46908 35009 7964 -20478
1427 -20478 -6290 8666 -3907 19884 34744 5290 6066 21969 -4853 -14999 -16257 -35043
1415 -35043 -39201 -56841 -45282 -42889 -44208 -38841 -24571 -11769 -18117 -11825 24606 44391 42885
1402 42885 20595 31724 25369 9648 7232 -5111 -22588 -20580 -26645 1344 12352 19393 16479
1389 16479 6200 8617 13817 -5622 -15158 -5405 25178 10263 -5094 -36685 -26168 -3908 -2995
1376 -2995 1792 -919 -9601 -2582 -3124 -1254 25566 57746 50920 -923 -25861 5174 17164 6751
1362 6751 16921 41648 42206 20234 3109 -20006 -9799 12109 20499 10134 8343 34595 47490
1349 47490 46819 31041 40046 44765 36129 23837 3379 7444 3262 1612 12144 7380 5971 2377
1335 2377 -7773 15226 7860 -10806 13052 32131 41091 58426 61532 40036 31187 32212 8749
1322 8749 -5837 -13479 8409 22554 6251 6654 19312 26203 24190 32470 29551 48605 56239 37940
1308 37940 10979 -4335 12850 33544 53433 50032 28662 29263 -10854 -18300 -8841 900 -8011
1295 -8011 8557 7939 11026 -17021 -28392 -9104 -15644 -40131 -43241 -13618 2667 17953 15980
1282 15980 -14023 -12260 -26182 -15251 -20217 -22776 3478 28374 59449 40505 43842 48272 38103
1269 38103 27135 30619 21776 467 -4207 -19898 -22208 -4239 32762 48734 38363 46346 36519
1256 36519 35563 24091 46954 38013 22718 16109 21826 24363 27172 14362 -6546 -5494 4858
1243 4858 -17030 -25158 -14395 -23891 -12762 8166 7131 427 17052 61114 52216 32119 19209
1230 19209 19515 19765 25477 21375 10010 19460 23573 17527 9201 -21564 -36755 -7189 -4499 11267
1216 11267 1669 14411 32547 24787 39361 40844 33034 31105 29447 24420 14144 506 -8964
1203 -8964 -39327 -31575 -6471 -18388 -3209 11776 8954 1981 9162 33638 47934 59758 35886
1190 35886 26866 -3669 -32411 -10959 -2895 8646 30570 25063 31367 19778 16560 30068 15117
1177 15117 14388 28446 40818 32396 13216 16598 27105 43085 21452 24453 40373 10683 14728
1164 14728 35564 12539 20783 33255 19626 -2102 -18934 -25765 -23127 -23879 8850 24843 13608
1151 13608 -1729 13693 7530 5065 11925 34149 33501 23016 33349 33533 32412 -18957 -6854
1138 -6854 6358 -22514 -17763 -16326 -34519 -39111 -33134 -14039 -17777 -20225 11201 36728 15877
1125 15877 5001 13643 10397 24490 45385 29066 7218 16342 1600 -12127 -2563 -3787 176
1112 176 5077 7743 6476 29931 20993 -6548 -24485 -40343 -34816 -10559 22529 19235 -277
1099 -277 25433 35598 28990 10014 9466 20349 28224 22002 -9472 -19558 13794 37246 44794
1086 44794 63780 83282 51826 17605 -3312 -24251 -22347 -27063 -28813 -17124 2707 12980
1074 12980 -1185 4119 31384 14221 757 8308 33892 53417 35200 26894 14019 -1978
1062 -1978 -7316 -12901 12201 5426 19514 41433 41046 11700 13946 13784 -19747 -18249 -24097 -1122
1048 -1122 21089 27277 39092 77579 55571 11244 15185 30409 25897 14558 6397 -3437 5648
1035 5648 42620 43343 12085 -14565 -19829 -25939 -45355 -44801 -37350 -22149 10426 35373 52774
1022 52774 34270 16640 10767 11660 8499 5405 -8675 8375 24178 38637 58827 54304 16877
1009 16877 11280 14966 14089 29787 36635 50457 43844 28912 23248 22530 -148 29631 46962 41264
995 41264 29237 36861 42036 32992 16394 2240 12472 16638 18532 6676 6619 11465 18521 -1047
981 -1047 -13900 7782 26465 35582 30426 35357 28387 20563 11169 34468 32066 41433 31110 27311
967 27311 16769 1046 330 -1900 29088 12432 -19743 -22109 1166 23150 14811 20257 23862
954 23862 19283 -3396 6419 13862 -3634 -3563 4291 13226 2524 -28872 -21192 5292 28994 39113
940 39113 11506 24780 27237 41733 34257 44046 27963 4706 5464 14063 -586 15474 27733
927 27733 12341 16812 24665 14529 20214 41228 38336 23503 4147 -5054 10045 -4021 2609
914 2609 16203 24841 -11010 -12526 2964 12322 18646 -3567 -7536 6767 -24774 -14536 -699
901 -699 24705 40871 23896 -2720 -22518 -15879 5862 29661 30298 6753 -15043 -447 33237
888 33237 43879 47792 57910 39806 20400 28356 19128 14410 41510 76920 74026 35084 21783
875 21783 9396 28817 42869 24309 6154 1187 27520 59416 41110 49103 32284 22838 19409
862 19409 2983 27551 44222 31121 6407 -11202 -3037 5417 5530 6820 -3465 -19281 -28872
849 -28872 -4292 9425 25164 -5892 -9182 -6356 -9867 8765 4624 2109 5777 9524 11503 5999
835 5999 -2948 3786 8879 -9064 -5935 2636 14958 -378 11164 12142 1081 -21237 8188 17315
821 17315 -2139 -31478 -31612 -13288 6201 1250 -20190 -21724 -2056 -700 18939 20415 9552
808 9552 2742 230 -2073 34071 50722 53667 48869 28128 10095 1854 24888 13589 6558 1451
794 1451 20943 30645 38664 60304 38276 10558 -2169 4019 21963 51100 30601 31751 33139
781 33139 43665 29457 17966 -1593 -9429 -32425 -59971 -65553 -58207 -29591 -30772 -32546 -19924
768 -19924 12077 25769 33005 42686 49335 31040 1791 -10217 -7176 -15794 -33535 -38239 -43383
755 -43383 -59422 -69959 -63332 -34427 -11163 3770 -6836 -36631 -29315 -22678 -46826 -43779 -17498
742 -17498 -24907 -33617 -19113 -10517 9586 4800 -16749 -12947 2037 -12939 -25536 -6613 19849
729 19849 37806 25505 20795 14110 29786 5372 25991 52659 48872 25348 5309 634 3913
716 3913 -2508 15274 24588 33187 16834 8674 -6017 -9027 -13033 12035 1547 -21486 -40812
703 -40812 -56830 -42391 -22202 -16236 12993 7751 -7918 10212 33521 47350 23945 3453
691 3453 23550 33903 50171 38599 29490 49027 29779 -1077 15660 15099 -2239 -18798 -10554
678 -10554 -11503 2153 1820 19007 45683 72793 60015 24970 -15662 2994 26085 40473 43625
665 43625 35537 13752 -1400 3604 22689 29267 29752 26906 22969 25152 12751 -6495 -1014 19766
651 19766 39481 36898 48042 52829 18631 471 -4924 11900 4255 7296 8820 6164 29136
638 29136 12962 9731 -19451 -37132 -30581 15229 19488 -3209 -12073 -1101 16833 30148 49307
625 49307 59967 46108 20406 -6317 -11400 -15819 1062 4726 -7960 -23037 -27498 -39950 -20552
612 -20552 -3305 -2089 7882 17592 17932 -6936 -8039 4381 8838 -1247 -36825 -23879 -25335 -33321
598 -33321 -57596 -75347 -43023 -1076 -9056 -17656 -30882 3877 23989 8221 6719 6449 -7298
585 -7298 -5466 14193 34550 45322 47100 65669 40319 31548 43719 29598 8699 7290 21622
572 21622 17030 14957 22923 37284 33937 38045 50586 33255 26867 7433 -8958 -4078 10855
559 10855 23031 21168 33044 29960 10918 2071 -9096 -3265 -13357 -6550 46015 64177 40883
546 40883 17296 7518 21769 40245 59114 53507 46659 74674 63415 48506 3468 -25125 -12515
533 -12515 355 1671 14024 19823 22617 10098 -3086 3361 25664 47268 50556 47941 21915
520 21915 8410 -10702 -29465 -29564 -26521 -48576 -32577 -8977 -25019 -36092 -23880 703 2407
507 2407 -286 -12221 -4801 6932 1764 -26464 -14514 -19467 -14533 -33532 -16741 861 -18300
494 -18300 -15257 12755 8155 36798 45021 23114 11352 -3604 -23755 -6133 -2935 -1731 2969
481 2969 -7443 -4517 20091 -132 -16944 -6268 2261 5809 4233 3219 21589 15497 -7053
468 -7053 -24642 -42850 -26184 -28158 -52530 -37572 1493 25535 35424 53895 22447 16034 19385
455 19385 36576 41148 37449 10364 -11396 -5208 -8468 -2880 -2389 19611 23106 -9419 -8336 -5667
441 -5667 -13613 -15026 -18980 -18755 -16719 -36287 -14320 -20745 -18468 1756 22680 11381 -2257 3751
427 3751 1359 22522 52576 61897 72472 50458 33894 -2 4237 18907 25342 42125 32607
414 32607 17615 13279 1094 -11774 -21910 -15904 -2276 18067 31968 29704 23819 38670 44597
401 44597 53325 22811 5557 15726 17749 -11663 -28937 -9313 14365 24099 24955 22896 11210
388 11210 9594 13236 11146 -2970 -8873 -5997 -4964 558 -6041 -1866 -20723 -31992 -20526 -14565
374 -14565 -6784 4334 1969 5604 -1077 -7696 -11775 -29501 -36664 -34369 -1588 29873 39871 36205
360 36205 24621 37766 46288 25120 465 -12151 -7564 15070 41374 30239 2035 -12280
348 -12280 11136 47855 40265 44365 36722 30373 36477 27606 21395 -11948 -19176 -12302 -1323 -4577
334 -4577 12156 45985 31459 21722 13647 18829 25565 13153 19831 24992 36515 29312 11253 1670
320 1670 5202 -2818 -7992 -20872 -39890 -15194 -820 12400 6644 2558 13952 30229 47507
307 47507 47452 33586 15470 4870 16312 -4313 -20636 -28253 -11953 -14052 -6420 21698 58607
294 58607 42433 29270 43463 61444 39391 43247 65476 49294 31303 33742 23943 23428 34990
281 34990 45013 52094 27747 17782 7061 30486 26789 20195 15188 18334 17570 21145 20877 8902
267 8902 23657 50363 39264 24717 26929 41518 31348 9803 -15765 7382 14759 6035 -490
254 -490 11176 22979 21650 22558 29203 35113 32424 28496 5363 -2661 7705 -12829 -29993 -47190
240 -47190 -47385 -30663 -12809 -18112 -3337 18125 38120 43215 42576 41238 25314 9092 29333
227 29333 41288 38296 1353 -21350 -29066 -45651 -55763 -42298 -33960 -14246 6450 -10460 -17077
214 -17077 -16621 -20610 -6074 -1339 -26007 -37629 -13039 -5710 22732 24648 12192 15378 18973 30949
200 30949 40116 43428 34585 15729 10197 17585 12458 24784 36583 29007 7777 31908 23399 23768
186 23768 10695 1150 -927 -4332 -23443 -13653 -5052 -598 -12765 -2415 6637 -1589 25881 31892
172 31892 20642 24971 32257 24835 28132 20202 20725 4973 -1776 9067 12646 765 -4388 -6932
158 -6932 1052 -17187 -2039 8014 5591 20253 25601 28596 9482 5769 260 31490 57838
145 57838 41675 30224 37577 39743 24292 26732 19013 3167 -7423 -13109 -9446 3578 11136
132 11136 16583 9421 21657 32235 29750 39182 42923 31854 7770 10624 31017 51405 52000 52548
118 52548 49330 29860 292 -11445 596 11652 753 9510 24462 21767 10614 4589 15158
105 15158 3686 -25455 -24526 -30182 -11622 3839 2132 2831 15739 31084 31691 30958 13170 5158
91 5158 64 -12734 -12018 -10338 603 12750 15225 14024 21160 34270 32796 8715 -13626 -5514
77 -5514 14863 6566 2783 -2537 6059 12094 28985 30712 34118 44129 54693 51265 39708 27700
63 27700 9241 11127 22879 26236 26906 17260 7162 -1779 10132 7362 -4944 -12964 -5593 5350
49 5350 7790 8647 -590 -14116 -25797 -26524 6237 11390 10989 6334 11719 19642 12433 4250 -15835
34 -15835 -13042 -10370 9810 29878 34647 39138 42406 33227 31448 29748 33587 25386 17949 -344
20 -344 -6267 -7359 -10377 -14977 2412 3235 14198 21296 13312 27497 27316 38474 49309 47379 20784
5 20784 11501 22666 43242 28858 2314
0 2314
$$ Imaginary data points
##PAGE= N=2
##DATA TABLE= (X++(I..I)), XYDATA
32767 93191 114310 130342 145689 146527 151114 151587 156450 147041 128008 105294 94471 112128 126382
32754 126382 128426 115174 115153 128689 131111 119677 134923 132300 118389 127526 144352 143862 128391
32741 128391 125028 130739 134734 133294 133378 135916 137307 143286 147292 133646 125150 131698 134241 129318
32727 129318 131219 146087 155864 150947 147619 150267 156089 140326 152237 160425 164701 153212 134980
32714 134980 132187 160074 161434 150395 170258 175719 179443 200386 203749 194235 186114 182541 162927
32701 162927 150833 151634 156051 149441 158780 173510 180269 170653 170251 161588 145677 151487 165299 180406
32687 180406 184057 185459 206332 204092 194290 188994 202230 204861 204865 211922 219317 218629 228116 215899
32673 215899 211237 209086 200099 200512 200975 195942 197038 191165 199642 221037 214502 201279 214186 212499
32659 212499 206115 217983 218296 203600 197229 202969 195623 205427 206274 192160 194576 225758 240885
32646 240885 215328 209913 213699 235865 210671 214301 230210 246535 250696 223415 210393 217909
32634 217909 221314 214115 215654 226095 231949 227346 235034 264197 303368 297727 265836 239058 223766
32621 223766 230116 235365 242954 251890 224742 224268 236104 257209 266906 270748 261819 255933 257773 251330
32607 251330 250340 246568 230808 233938 245002 266583 284908 301871 288330 301438 298378 270577
32595 270577 276044 270671 275594 289353 295368 299444 273143 259037 251720 265906 295026 311249 288937
32582 288937 285719 306354 321010 304086 287355 291835 308756 311494 320302 314148 294098 278200
32570 278200 291378 298370 292162 292597 280631 299353 304206 314859 336041 338585 324660 310134 301390
32557 301390 300842 290472 299565 308374 314547 304179 299698 298486 301974 297113 325092 307170 295328
32544 295328 315484 315000 315684 322442 314719 315066 328688 308740 286479 294214 341164 364929 346928
32531 346928 324410 335109 343833 346298 356010 345133 330350 324453 331702 328047 298494 300938 327462
32518 327462 335668 337443 357770 357662 361735 375920 357663 352459 358649 363409 351014 331285 327489
32505 327489 366384 376236 376962 342172 338027 343783 357084 349301 355768 357786 372116 389449 398490
32492 398490 390112 394734 389044 387335 386770 374273 356819 347689 361242 354912 350960 368733 380277
32479 380277 383638 405576 411539 388510 393360 399424 411135 411254 404807 396824 406137 429311 450507
32466 450507 436239 396205 391491 402450 397364 379503 386281 404644 379754 378516 399351 402054
32454 402054 415721 419901 396634 399289 394144 401328 402923 388544 373507 357010 387558 444726
32442 444726 437359 431950 410831 403911 411889 392350 419396 444470 443010 424759 402245 405871 421518
32429 421518 419665 399091 378127 364080 383766 400375 435947 425858 400202 391883 397110 416291
32417 416291 425007 412071 421716 429238 438374 425645 423000 416610 405350 406262 411814 421873 434243
32404 434243 424707 416204 397594 375332 385237 404170 438368 434666 432108 426788 424903 426375 425988
32391 425988 420927 404725 410582 421726 436262 431183 419243 419169 392177 399191 432033 446083 445157
32378 445157 438597 442811 460533 457351 435614 448697 451806 441671 430265 435808 426559 418269 392200
32365 392200 395558 409088 396788 384572 415736 432242 439242 448205 452968 439761 442775 461337
32353 461337 466512 478448 482860 452554 427548 428416 440300 443269 447963 429666 409251 414457 417961
32340 417961 425204 439325 445292 440414 472008 501588 488296 472035 462227 452704 429237 432373 432996
32327 432996 425209 464869 470061 467755 486221 485482 470362 480494 466553 435177 418170 423623 424357
32314 424357 446211 451002 464310 475952 465920 440211 443302 431398 406616 402052 423282 457090
32302 457090 451928 438224 432963 432752 452241 455437 443917 472352 506636 493610 495431 489226 476005
32289 476005 438992 455827 463344 454025 445689 433712 402139 435134 455383 426437 393536 410673
32277 410673 447652 470552 479046 473654 447553 429194 446938 452430 462711 487654 491551 472770
32265 472770 431073 404425 400457 386383 394900 373084 368791 410960 424101 452260 460214 471866
32253 471866 459239 461440 464739 472928 483215 462256 476363 475194 472401 490227 511977 507503 505232
32240 505232 503258 479319 467573 463549 433364 425673 443851 453184 447472 454400 472176 489599 509627
32227 509627 501583 511340 490999 472583 462935 441324 436207 427767 432435 446770 446598 437579 453288
32214 453288 456849 457448 459161 456578 450795 447549 445592 475609 477037 466469 448891 440744 445315 446744
32200 446744 453664 469882 490415 482882 481202 474982 444827 444189 453217 451635 447241 467004 463058
32187 463058 459428 460798 448166 438839 439118 433533 466429 473396 463627 447000 453129 442359 421662
32174 421662 431219 434102 452850 466324 485724 464085 462164 458897 463199 470892 469365 445880 433322
32161 433322 441584 455501 469510 490574 495989 499731 509745 496984 479210 471463 470978 458825 445104
32148 445104 445998 475138 493851 478339 449916 438313 449565 475815 468743 468854 464517 472433 467656
32135 467656 454980 465973 462947 467087 479026 471962 462778 452011 444795 482159 490270 491439 458701
32122 458701 447421 420215 412780 414913 461109 472221 456928 461706 490170 512038 483477 453103
32110 453103 444920 461160 472131 475580 475578 467358 440728 457819 463058 465715 460737 467484 484975 497314
32096 497314 504506 484739 492652 514277 512089 469762 451715 453965 469956 486882 503840 508866
32084 508866 493623 481224 494726 497642 480506 503484 515644 487061 486833 520485 543834 551879
32072 551879 546100 517979 459130 449644 461381 461667 451899 450604 461713 448845 449424 446310 462532
32059 462532 480908 479319 449247 458702 469270 470385 479540 493711 495055 472636 452542 445621 418113
32046 418113 412335 451629 486359 522450 522295 528136 545883 566339 543778 507303 463954 420423
32034 420423 456363 494121 489165 481993 498061 470898 477630 471336 438207 414903 423498 437962
32022 437962 464359 489474 500069 476871 453865 470156 468420 443292 429364 443380 445579 449961
32010 449961 458879 447759 439188 450938 465149 453897 420750 440441 440849 450668 462775 456383 461256
31997 461256 448306 432191 426510 428586 444193 453282 436781 446017 438331 420218 410372 407415 436450
31984 436450 448181 448227 431301 440037 457589 438537 408920 448371 468007 452118 451997 466922 488787
31971 488787 518979 517111 506725 504007 507963 495156 472908 440591 429255 439738 462290 481294
31959 481294 494029 470910 466815 474844 477406 455629 459549 469221 457930 462269 486121 499284 494926
31946 494926 501251 485251 478806 461709 463365 471019 477896 506363 494056 474401 462201 464780 455757
31933 455757 448335 451061 492737 497098 478924 477758 468203 466119 475693 472412 451853 480036 499933
31920 499933 494825 483013 465614 445461 454709 453761 449897 439266 456568 465921 457441 442031 432839
$$ [...]
##END NTUPLES=NMR SPECTRUM
##END=
