##TITLE=Analysis number 330164
Compound Code cc 00810
Project Code adrs
Chemist Name aci
##JCAMPDX= 6.0         $$ Bruker NMR JCAMP-DX V2.0
##DATA TYPE= NMR SPECTRUM
##DATA CLASS= NTUPLES
##ORIGIN= Bruker BioSpin GmbH
##OWNER= nmr
$$ XWIN-NMR		Version 3.5
$$ Thu Nov  1 12:16:49 2007 GMT Standard Time (UT+0h)  MAYBRIDGE\nmr@NMR_250MHZ
##.OBSERVE FREQUENCY= 250.131544655141
##.OBSERVE NUCLEUS= ^1H
##.ACQUISITION MODE= SIMULTANEOUS (DQD)
##.ACQUISITION SCHEME= undefined
##.AVERAGES= 16
##.DIGITISER RES= 18
##SPECTROMETER/DATA SYSTEM= dpx250
##.PULSE SEQUENCE= zg30
##.SOLVENT NAME= CDCl3
##.SHIFT REFERENCE= (INTERNAL, CDCl3, 0, 16.522)
##AUDIT TRAIL= $$ (NUMBER, WHEN, WHO, WHERE, WHAT)
$$ ##TITLE= Audit trail, XWIN-NMR		Version 3.5
$$ ##JCAMPDX= 5.01
$$ ##ORIGIN= Bruker BioSpin GmbH
$$ ##OWNER= nmr
$$ C:\u/data/dgb/nmr/ADRS/110/pdata/1/auditp.txt
$$ ##AUDIT TRAIL=  $$ (NUMBER, WHEN, WHO, WHERE, WHAT)
(   1,<2007-11-01 12:16:16.35 +000>,<MAYBRIDGE\nmr>,<NMR_250MHZ>,
      <created by zg, POWCHK disabled, PULCHK disabled
       configuration hash MD5:
       76 6E 9A 78 1E 09 19 81 EC 84 63 8F B0 6A 59 2D
       data hash MD5: 64K
       66 9D 42 59 B5 61 19 9D A7 71 D1 15 ED 27 4A 0D>)
(   2,<2007-11-01 12:16:29.91 +000>,<MAYBRIDGE\nmr>,<NMR_250MHZ>,
      <Start of raw data processing
       ef LB = 0.3 FT_mod = 6 PKNL = 1 SI = 32K 
       data hash MD5: 32K
       51 75 D6 BA 0E 8A 31 4B 57 06 6E FA EE 97 B2 A6>)
(   3,<2007-11-01 12:16:31.47 +000>,<MAYBRIDGE\nmr>,<NMR_250MHZ>,
      <apk 
       data hash MD5: 32K
       9A 9C 81 EF E6 26 26 2C 79 C3 4D 1B BF 90 83 63>)
(   4,<2007-11-01 12:16:32.41 +000>,<MAYBRIDGE\nmr>,<NMR_250MHZ>,
      <abs ABSG = 5 
       data hash MD5: 32K
       5E 2C FD 3C 96 10 27 4B 51 B2 BE 37 06 28 5F 20>)
$$ ##END=
$$ 
$$ hash MD5
$$ 1E FE 6E EC 47 51 B4 85 E5 FF AB 2E 34 0B 44 F9
##$RELAX= 
##$RELAX= 
##$RELAX= 
##$RELAX= 
##$RELAX= 
##$RELAX= 
##$RELAX= 
$$ Bruker specific parameters
$$ --------------------------
##$DU= <C:\u>
##$EXPNO= 110
##$NAME= <ADRS>
##$PROCNO= 1
##$TYPE= <nmr>
##$USER= <dgb>
##$AMP= (0..31)
100 100 100 100 100 100 100 100 100 100 100 100 100 100 100 100 100 100 
100 100 100 100 100 100 100 100 100 100 100 100 100 100 
##$AQSEQ= 0
##$AQ_mod= 3
##$AUNM= <au_zg>
##$AUTOPOS= <14 >
##$BF1= 250.13
##$BF2= 250.13
##$BF3= 250.13
##$BF4= 250.13
##$BF5= 500.13
##$BF6= 500.13
##$BF7= 500.13
##$BF8= 500.13
##$BYTORDA= 1
##$CFDGTYP= 0
##$CFRGTYP= 5
##$CHEMSTR= <none>
##$CNST= (0..31)
1 1 145 1 1 1 1 1 1 1 1 1 1 1 1 1 1 1 1 1 1 1 1 1 1 1 1 1 1 1 1 1 
##$CPDPRG= <>
##$CPDPRG1= <>
##$CPDPRG2= <>
##$CPDPRG3= <>
##$CPDPRG4= <mlev>
##$CPDPRG5= <mlev>
##$CPDPRG6= <mlev>
##$CPDPRG7= <mlev>
##$CPDPRG8= <mlev>
##$CPDPRGB= <>
##$CPDPRGT= <>
##$D= (0..31)
0 1 0 0 0 0 0 0 0 0.06 0 0 0 0 0 0 0.0002 0 0 0 0 0 0 0 0 0 0 0 0 0 0 
0 
##$DATE= 1193919374
##$DBL= (0..7)
120 120 120 120 120 120 120 120 
##$DBP= (0..7)
150 150 150 150 150 150 150 150 
##$DBP07= 0
##$DBPNAM0= <>
##$DBPNAM1= <>
##$DBPNAM2= <>
##$DBPNAM3= <>
$$ [...]
##$SUBNAM6= <"">
##$SUBNAM7= <"">
##$SUBNAM8= <"">
##$SUBNAM9= <"">
##$SW= 20.6930455092707
##$SWIBOX= (0..15)
0 0 3 0 0 0 0 0 0 0 0 0 0 0 0 0 
##$SW_h= 5175.983436853
##$TD= 65536
##$TD0= 1
##$TE= 295.16
##$TE2= 300
##$TE3= 300
##$TEG= 300
##$TL= (0..7)
0 120 120 120 120 120 120 120 
##$TP= (0..7)
150 150 150 150 150 150 150 150 
##$TP07= 0
##$TPNAME0= <>
##$TPNAME1= <>
##$TPNAME2= <>
##$TPNAME3= <>
##$TPNAME4= <>
##$TPNAME5= <>
##$TPNAME6= <>
##$TPNAME7= <>
##$TPOAL= (0..7)
0.5 0.5 0.5 0.5 0.5 0.5 0.5 0.5 
##$TPOFFS= (0..7)
0 0 0 0 0 0 0 0 
##$TUNHIN= 0
##$TUNHOUT= 0
##$TUNXOUT= 0
##$USERA1= <user>
##$USERA2= <user>
##$USERA3= <user>
##$USERA4= <user>
##$USERA5= <user>
##$V9= 5
##$VALIST= <valist>
##$VCLIST= <CCCCCCCCCCCCCCC>
##$VD= 0
##$VDLIST= <DDDDDDDDDDDDDDD>
##$VPLIST= <PPPPPPPPPPPPPPP>
##$VTLIST= <TTTTTTTTTTTTTTT>
##$WBST= 1024
##$WBSW= 4
##$XGAIN= (0..3)
0 0 0 0 
##$XL= 0
##$YL= 0
##$YMAX_a= 403005
##$YMIN_a= -546662
##$ZGOPTNS= <>
##$ZL1= 120
##$ZL2= 120
##$ZL3= 120
##$ZL4= 120
##$ABSF1= 16.522
##$ABSF2= -4.171173
##$ABSG= 5
##$ABSL= 3
##$ALPHA= 0
##$AQORDER= 0
##$ASSFAC= 0
##$ASSFACI= 0
##$ASSFACX= 0
##$ASSWID= 0
##$AUNMP= <proc_1d>
##$AZFE= 0.1
##$AZFW= 0.1
##$BCFW= 0
##$BC_mod= 0
##$BYTORDP= 0
##$COROFFS= 0
##$CY= 12.5
##$DATMOD= 1
##$DC= 0
##$DFILT= <>
##$DTYPP= 0
##$F1P= 14.0000005364418
##$F2P= -0.99999901652339
##$FCOR= 0.5
##$FTSIZE= 32768
##$FT_mod= 6
##$GAMMA= 0
##$GB= 0
##$INTBC= 1
##$INTSCL= 1
##$ISEN= 128
##$LB= 0.3
##$LEV0= 0
##$LPBIN= 0
##$MAXI= 10000
##$MC2= 0
##$MEAN= 0
##$ME_mod= 0
##$MI= 0
##$NCOEF= 0
##$NC_proc= -4
##$NLEV= 6
##$NOISF1= 0
##$NOISF2= 0
##$NSP= 0
##$NTH_PI= 0
##$NZP= 0
##$OFFSET= 16.522
##$PC= 1
##$PHC0= 157.1177
##$PHC1= 5.8258
##$PH_mod= 1
##$PKNL= yes
##$PPARMOD= 0
##$PSCAL= 4
##$PSIGN= 0
##$REVERSE= no
##$SF= 250.13
##$SI= 32768
##$SIGF1= 0
##$SIGF2= 0
##$SINO= 400
##$SIOLD= 32768
##$SREGLST= <1H.CDCl3>
##$SSB= 0
##$STSI= 32768
##$STSR= 0
##$SW_p= 5175.98343685301
##$SYMM= 0
##$S_DEV= 0
##$TDeff= 65536
##$TDoff= 0
##$TI= <Analysis number 999999
Compound Code 99
Book Reference 9
Project Code 9>
##$TILT= no
##$TM1= 0
##$TM2= 0
##$TOPLEV= 0
##$USERP1= <user>
##$USERP2= <user>
##$USERP3= <user>
##$USERP4= <user>
##$USERP5= <user>
##$WDW= 1
##$XDIM= 32768
##$YMAX_p= 478359228
##$YMIN_p= -226367
$$ End of Bruker specific parameters
$$ ---------------------------------
##NTUPLES= NMR SPECTRUM
##VAR_NAME=  FREQUENCY,     SPECTRUM/REAL,   SPECTRUM/IMAG
##SYMBOL=    X,             R,               I
##VAR_TYPE=  INDEPENDENT,   DEPENDENT,       DEPENDENT
##VAR_FORM=  AFFN,          ASDF,            ASDF
##VAR_DIM=   32768,         32768,           32768
##UNITS=     HZ,            ARBITRARY UNITS, ARBITRARY UNITS
##FACTOR=    0.157963299565203, 1,           1
##FIRST=     4132.6476996994, 0,             0
##LAST=      -1043.33573715361, 0,           0
##MIN=       -1043.33573715361, -226367,     0
##MAX=       4132.6476996994, 478359228,     0
$$ Real data points
##PAGE= N=1
##DATA TABLE= (X++(R..R)), XYDATA
$$ [...]
19382a8972J3532J646K7010r087n9226M906L2558L6545L3539K0289k1787p5121
19370a4168q15J1276L2399p8287K3981o698J5075P502l7604j1026j3469j8179
19358i0013K5467J2900j3721K934M3940K2315j2721Q843j6103l6844Q18j8148
19346g0333j484k1487L4854Q917K5202J1675R624q356O121n728l7843l8231j6465
19333a03534M2454K4951M9112k5030j5590q084m1849K0702L1020l2385J5628N6132
19321A3527N41N0276l9563q8935J0553J6085L1242j3341o8j8326L4365J4720J0864
19308B1940j1342M2240k0564o1605L1593n50n5223J0063N5826N0875j3559k0433
19296B9261r837L9108r958j2232L1969m1629r4906j5889N7136N6292j8775P1424
$$ y = [-18972, -5440, -3794, 23216, 14129, -45097, -40191, -7633, 28912, 62451, 82740, 60953, -14168, -14983, -3707, 28692, -49595, -25614, -32312, -17237, -9735, -47339, -58365, -71834, -90013, -64546, -51646, -65367, -62433, -18493, 3822, -8899, -56, -16159, -53003, -52185, -70333, -71817, -93304, -58450, -49533, -24331, -12656, -3032, -11388, -5267, -10995, -48838, -87069, -103534, -61080, -36129, 12983, -12047, -27637, -35721, -77570, -56868, -25848, -58233, -42605, 13527, 14068, 64344, 24781, -64154, -53601, -37516, -6274, -19615, -19683, -38009, -3644, 11076, 21940, 10598, 52838, 32274, -29331, 2262, 1712, -53511, -43448, 12378, 63253, 49694, 29261, 19424, 58532, 48574, 36342, 68311, 26682, -68224, -84113, -26977, 29315, 10540, 81964]
19284H1964L5122p0048m2246L1668L5371l6936j00484m3677N1792M6433k954L2974
19272A8979O3233M7072q047p0607k7799k9608m8552L2519M2742Q898J1270n0346
19260a0246l2042k3988m5188K3570N2926k1903j0578n2425p0651K7242L159N0182
19248a09942P2303J8594k8704j0896k3199K8230L8207k3906L7224L2788k5745
19237D954j6855n361k8927K3584L7689J4222M0122k8824N755l1662m9026j1900
19225d6229J8664L0107j8928J6888N049o8716n180N9699o733N514n8489J390L9411
19212b7553L9272J9548o1367l4721O8873M3173J1904Q8744J106k6082n5512q3133
19200a5748R79Q449N2340K799P722j9815J8938n4099j4319l6015q895M2716k6484
$$ y = [81964, 117086, 47038, 4792, 36460, 71831, 34895, -65589, -109266, -57474, -11041, -13995, 18979, 82212, 129284, 121237, 50630, 22831, -6777, -55329, -22810, 19932, 28830, 40100, -10246, -42288, -66276, -111464, -87894, -34968, -56871, -67449, -119874, -190525, -163283, -160124, -109942, -37639, -19045, -47749, -58645, -81844, -53614, -15407, -39313, -2089, 30699, 4954, -11901, -17262, -46189, -22605, 15084, 29306, 69428, 40604, 46359, 14697, -34329, -46229, -27565, 2542, -16386, 502, 5551, -63165, -68345, -8646, -15379, -9865, -68354, -66964, -27553, 11719, 31267, -30100, -64821, 4052, 47225, 59129, 147873, 148979, 122897, 67385, -15748, -14769, -6320, 46020, 48819, 56541, 36726, 55664, 1565, -12754, -48769, -57664, -14948, -41432]
19187d1432J9847K399N312m4388l7113K6144m9849K4856N4108j7894O0710O7622
19175G0322L51r3446o279J595j356k3515j4470L5231O0420k0543k2111N8834J721
19162D6754j2273m4821k1400M2823P0418K6807n8575p9664k3107k0983K259M5931
19150b5831k7288p8045O651N9937P9411q3051J000K926o9168J143R1953J4527
19138b5835J5262O7487m1680m8228j5890l6467J5610N6295M4165k0000K76m3283
19126c2288j4448L8281N5808K0511O8590o5035p9167n6786K6830K8526j2634n6847
19114g8659l050M205K2948M4803P9087J0426k7396k6349l5802M6392L9912j6168
19102F0349j8041k1299K6588k598l8487n2225q7604k7443J23136J23493M8988
$$ y = [-41432, -21585, -19186, -13874, -58262, -95375, -69231, -119080, -94224, -40116, -58010, 2700, 70322, 70673, -22773, -29052, -27457, -28813, -52328, -66798, -31567, 28853, 8310, -13801, 45033, 46754, 34481, -10340, -31740, 11083, 81501, 108308, 49733, -29931, -53038, -74021, -71762, -25831, -53119, -131164, -124513, -64576, 14835, -68216, -67216, -64290, -133458, -132315, -40362, -25835, -10573, 56914, 15234, -32994, -48884, -85351, -69741, -13446, 30719, 10719, 10995, -32288, -46736, -8455, 47353, 67864, 136454, 71419, -7748, -64534, -37704, -9178, -21812, -78659, -81709, -77504, -54556, -9753, 69334, 79760, 52364, 26015, -9787, 36605, 76517, 60349, 42308, 21009, 47597, 44999, 6512, -45713, -133317, -160760, -37624, 85869, 134857]
19091A34857l8186p9423p4204m6262O5805M6843K0729k1469p8529p368L1533J0525
19079c5149k4615m9527k8574o14M6085J1415O7470O740q252j5263J723M92K2189
19066e880J9315j4028j5165N930l0724Q706J5782j8704j2744L2606J7864o2671
19054e9713j6443K2958K3795K5013j7323L471k9230o7000n8524O7695N7145l9875
19042h8031K7683m043j3492L3518j1568J1377n1657k3117M6954M1139K0448m5446
19030e6235K036K780K248j5176K6129J4193Q43L5484R719j59j0132J5351M474
19017C1555k8598o4349k112k2175J378j8907j3310Q3394L7741j6126l8513K0744
19005b9278k9882p957k1348P5434j844k0711L2071R245K2139Q55j7118K4957M224
$$ y = [134857, 96671, 17248, -56956, -103218, -37413, 9430, 30159, 8690, -69839, -77207, -45674, -35149, -59764, -109291, -137865, -138479, -92394, -80979, -13509, -6769, -15021, -30284, -28561, -28069, -5880, 13435, -593, -15758, -9828, -40552, -31846, -16064, -34768, -47512, -14906, 2958, -59713, -76156, -53198, -29403, -4390, -21713, -18242, -47472, -114472, -172996, -105301, -48156, -88031, -60348, -64391, -77883, -44365, -55933, -44556, -96213, -119330, -72376, -31237, -10789, -56235, -54199, -51419, -49171, -64347, -38218, -24025, -23182, 12302, 22021, 21862, 11730, 27081, 31555, 2957, -61392, -63504, -85679, -84301, -103208, -116518, -33124, 4617, -11509, -50022, -29278, -59160, -67117, -88465, -13031, -14875, -35586, -3515, 5730, 27869, 28724, 11606, 36563, 40787]
18992D0787m0119k2317M5605L9225M709j0076n1334q0998l0543K1388N8479m0225
18980f5419o2379L3161N403k2044k5064J6601N2400L5960J8897L0970j9477m2415
18968d3406L3455M1078l6061o7331j1279p272j4180K3981L8532L6075p016n4351
18956f7775P247P445J489Q6679Q5364j0899k9263l2233r738q9773j5219L9733
18944b6943O7273r897l0192L6155L6897L1643j0973k4800p14j9274j7192j4165
18932A7818N387J0207p4062j5534K3238k8178K2458l0797k2565M316J623L8856
18920d7233N199N8018o2868j4275M2470J0278q0124K1690P2401Q2760j0257l3075
18908D4984m5271N251l7721J646N2184j5653j3369J7839M4123k6091n7313l4600
$$ y = [40787, 668, -21649, 23956, 63181, 67890, 57814, 6480, -74518, -105061, -83673, -25194, -65419, -127798, -94637, -89234, -111278, -136342, -119741, -67341, -31381, -12484, 18486, -991, -43406, -9951, 31127, -4934, -72265, -83544, -90816, -104996, -81015, -42483, -6408, -13424, -67775, -60528, -53083, -51594, 35085, 120449, 109550, 80287, 48054, 38316, -51457, -66676, -26943, 40330, 30433, 241, 36396, 73293, 104936, 93963, 69163, 68449, 49175, 31983, 17818, 23205, 33412, -40650, -56184, -32946, -61124, -38666, -69463, -92028, -87712, -86089, -47233, -42034, 15984, -46884, -61159, -18689, -8411, -88535, -66845, 5556, 88316, 78059, 44984, -287, 4964, -32757, -31111, 21073, 5420, -7949, 9890, 54013, 27922, -29391, -63991]
18896f3991L568j4419j1104K2492O142K0713L9960n3645m9137k5551L3498j3880
18884a05354j7174j7299Q4765M2321l5356n471L0508L2577L236n4462L983L6574
18872a152J7982j21k859M0454M696j9506k5786J6503L0475L8505J3612k8051l9313
18859D5439J1377o253K4526O4760J2907j9446l5494n6729k9659K0871O7891K1411
18847A21601K362J6039k997j4044k6797j6542j0717l0197l3559J5009L5089n122
18835E0125J4670J9796k4745J5417J2978k6851M675k8298m2935k0598N8600J9112
18823E1946n102l9182k7531p3669p068j4559k2547L4256L7210r260K0726P2289
18811A7509J4172o190o3101n306N0946p9194k2919N967J2504j4157K9356l1311
$$ y = [-63991, -60423, -74842, -85946, -63454, -57312, -36599, 3361, -50284, -99421, -124972, -91474, -105354, -122528, -139827, -55062, -12741, -48097, -53568, -23060, 9517, 12753, -41709, -37726, -1152, 16830, 16709, 13850, 54304, 59000, 39494, 13708, 30211, 60686, 99191, 112803, 84752, 45439, 56816, 50563, 75089, 139849, 152756, 133310, 97816, 41087, 11428, 32299, 100190, 121601, 123963, 140002, 137005, 122961, 96164, 79622, 68905, 38708, 5149, 20158, 55247, 50125, 64795, 84591, 59846, 75263, 88241, 61390, 66065, 37767, -5168, -25766, 32834, 51946, 46844, 7662, -19869, -93538, -100606, -115165, -137712, -103456, -66246, -75506, -54780, 17509, 31681, 25491, -37610, -42916, 8030, -71164, -94083, -88116, -75612, -89769, -60413, -91724]
18799i1724j8877O7456k8647J5962N0804k0914n9635l4339q448M5812N5057k3244
18787e0737O340Q861L2882L1716k7223l4105K0449J6103j3577R791n4557L8674
18775a5383L6053L5305K9567K610M7961O6715J36048K76371O2074j16811j35641
18764D24869j98719j73035j2935O7839K7629n6242m4074m4308M1531K9340l4213
18753B7682L5827N7156j7719m6150l3442r925o4444m6303M2282O2195J7593p196
18741A7556j8014r441N2417n348l863J7599K8954M49K1236r874k9341l9565p217
18728A5548k1640p5842k283O4588J7979n3899k0827j9682P383K9974M1035k2042
18716c9708l540M6661j5969K3585L566M5717r938j9001m600N0709k4418n8907
$$ y = [-91724, -110601, -43145, -71792, -55830, -5026, -25940, -85575, -119914, -128362, -82550, -27493, -50737, -44397, -35536, -2654, 29062, 1839, -32266, -11817, 4286, -9291, 500, -54057, -15383, 20670, 55975, 85542, 88152, 136113, 202828, 338876, 615247, 677321, 560510, 424869, 226150, 53115, 40180, 108019, 135648, 79406, 35332, -8976, 32555, 61895, 27682, 63509, 120665, 102946, 56796, 23354, 13429, -51015, -97318, -55036, 7159, 24752, 17556, -458, -9899, 42518, 37170, 33307, 50906, 79860, 80309, 101545, 91671, 62330, 22765, 15548, -6092, -81934, -84217, -19629, -1650, -55549, -76376, -96058, -88675, -58701, -17666, -39708, -43248, 3413, -12556, 11029, 14595, 60312, 50374, 31373, 26773, 77482, 53064, -5843]
18704e843J7545O223Q506r516k3125m1938J5028M3792K8436J16026J0602j1588
18692A54148j4154q719P8052N4279M783P6443N0453Q4086j4999j1958O7862R6757
18680F17033J17400J84480O9707J8549o3524j00423k2081L5953N0635K2682l1997
18669H98414p6917l4554k9123K9011J11593J5114n5471r2684r6319o9996p6518
18658E22550m7896K4164j3961r3087l1379o7906o6532K9484k1458k5241n6177
18647A52561j5101m9841n1368o391K7521P351r496j4235J5500k8276j725P6582
18635A03082j0637n1544j3823M6609j257P61p1975j3130l495R5228K0927R796
18623A10542k6085o6669J2896P447l8588o1963R685M8923n08k2752J8054J8758
$$ y = [-5843, 11702, 17925, 26431, 16915, -6210, -48148, -33120, 10672, 39108, 155134, 165736, 154148, 139994, 131275, 209327, 263606, 268389, 344832, 395285, 479371, 464372, 452414, 520276, 617033, 734433, 918913, 988620, 1007169, 943645, 843222, 821141, 857094, 907729, 930411, 898414, 821497, 786943, 757820, 786831, 898424, 913538, 858067, 765383, 669064, 599068, 522550, 474654, 498818, 484857, 391770, 360391, 292485, 225953, 255437, 233979, 208738, 152561, 137460, 87619, 36251, 29860, 57381, 64732, 55236, 41001, 56501, 28225, 26500, 103082, 92445, 40901, 27078, 73687, 72430, 73191, 1216, -11914, -15409, 79819, 100746, 110542, 84457, 17788, 30684, 38131, -457, -62420, -52735, -3812, -4320, -27072, -9018, 9740]
18611I740O6697m184M353K886n1165p1542O976r391j7503K8355P0692J8371n875
18598D8410k1192r112m327j8923K8083M0302P763k1698K0995l2552n0918l9188
18586e2357L4052K934J7994M5159Q444J2509j0380J3769k2883r2664p804O1887
18574A0660R278r988J1588L9653m7968N1931R4650P2850Q8039L0215k6694P610
18562C31824J5419R8713N4738p707r2757j7692K4676K1958r36K6697L5768p3593
18550D17108l8939K580M4974P6980k0934k7982l2840p3347p716Q845k5570p0514
18538B52645r8816l2506r343J8211j0250l1672p9682o415L0554k1286n6089k4712
18526f9361K3188P266M1145o740m585K3322n8884m438k2808O73M5654L1747J07155
$$ y = [9740, 76437, 72253, 76606, 79492, 28327, -43215, -36239, -45630, -63133, -34778, 35914, 54285, 48410, 27218, 18106, 13779, -5144, 22939, 63241, 71004, 49306, 70301, 37749, -13169, -52357, -18305, -15371, 2623, 47782, 56226, 68735, 58355, 72124, 49241, -43423, -51227, 10660, 19938, 9950, 21538, 61191, 13223, 65154, 159804, 232654, 320693, 350908, 324214, 331824, 347243, 445956, 500694, 492987, 400230, 382538, 407214, 429172, 428236, 454933, 490701, 417108, 378169, 380749, 425723, 502703, 481769, 453787, 420947, 347600, 339884, 348729, 323159, 252645, 153829, 121323, 111980, 130191, 119941, 88269, 8587, 2172, 32726, 11440, -44649, -69361, -46173, -38907, 2238, -4502, -9087, 14235, -44649, -49087, -71895, -71222, -25568, 6179, 113334]
18513A13334N4460J15819L8766l8703N2346J07492Q0338J6539p7279k7152m5711
18502C90249J8378M3317J5254k392J2247K073p4997n0319J18228Q3261J4190n3718
18490E15771m5141p0673n1313n2246q1866n8468K3296O2196k7177p4569J251j1392
18478A29669o0393q2557o6535j3112M2206j4305o4991Q222Q7798P3329m3733l5664
18466d0066O3218N6016m229N395k4810R118j0946N320L5094J79o6932l1467N4044
18453D9934k001P194K7965j6570j1210J3082K5455o112k7362J291K3501m0475
18441D4692J5365M479M1303j4598p1328o9167M2913L2992P744l4833L0402J7565
18429D7529J3901K5798K1020j1757j3228Q536K9602R53K7316n2883L3914J1213
$$ y = [113334, 167794, 283613, 322379, 283676, 336022, 443514, 523852, 540391, 463112, 435960, 390249, 408627, 451944, 467198, 464806, 477053, 479126, 404129, 353810, 472038, 555299, 569489, 515771, 470630, 399957, 348644, 296398, 214532, 156064, 179360, 241556, 214379, 139810, 141061, 129669, 69276, -13281, -79816, -92928, -50722, -65027, -130018, -121796, -33998, 39331, -4402, -40066, 23152, 79168, 74939, 80334, 55524, 64642, 53696, 59016, 94110, 94289, 27357, -4110, 49934, 47933, 55127, 83092, 66522, 55312, 68394, 93849, 87737, 60375, 61666, 85167, 44692, 60057, 64536, 105839, 91241, 19913, -49254, -6341, 26651, 34395, -438, 29964, 47529, 61430, 87228, 108248, 96491, 83263, 91799, 121401, 122354, 149670, 96787, 130701, 141914]
18417A41914l8281K8026m959m6426J0718O7061j4887k9725k941K7580K7137p777
18405A57440r322k3267k764O8425N205J0122k5405j3189K3148O356l8349o7328
18393I1072n0000j9903j8876L2064K7199N0078L9426l084o493j2962K5958k4378
18381A30101q946l3898j6998M2672R362p393N3529j559n9896k4703k5667K285
18369E8889N5616P407N9276J0013p3113N9053K5650k0100j3161j5040n1721l1687
18357G1082j0661N5083M0601L0458k9560J3842M2876P3398M1472L8394O0646J15443
18345E43074R9971K05806L44097L54106J41103N2881O9238L83631N55166K16785
18335B965858j74764l17356j70329J19567K61382J80707j41193l07633j93736
$$ y = [141914, 103633, 131659, 126700, 80274, 90992, 158053, 143166, 113441, 110500, 138080, 165217, 157440, 148118, 124851, 122087, 190512, 195717, 205839, 180434, 167245, 190393, 196749, 158400, 91072, 41072, 21169, 2293, 34357, 61556, 111634, 151060, 147976, 141483, 128521, 154479, 130101, 121155, 87257, 70259, 112931, 122293, 114900, 168429, 166870, 106974, 82271, 56604, 58889, 114505, 121912, 181188, 191201, 118088, 177141, 202791, 182691, 169530, 154490, 102769, 71082, 60421, 115504, 156105, 186563, 157003, 170845, 213721, 287119, 328591, 366985, 427631, 543074, 643045, 848851, 1192948, 1547054, 1688157, 1741038, 1810276, 2193907, 2749073, 2965858, 2791094, 2473738, 2303409, 2422976, 2684358, 2865065, 2723872, 2416239, 2222503]
18326B222503J77201M31041K58344j54615m11883m00620j58275j0529k00853l93740
18316A358574l26469k27126q3119j4071J2870K636o1197j45115j08480j3694M3091
18305D37900J912j6366O3711L0794m0023o7687k1422o11k6455m0444j8592r104
18293B93613l4899j5233O2788k1621n9728k7969N335J9801M0233O722J0927J7334
18281B97303j0170l4385k2208O2392j9962m0773m3468N575N0323M3991L1267p334
18269C12551l0311n4325o1452j9763n9939j9434K7000j3025j6871L1135N6152
18258A51718j8310P399K3829l349o822J798M9472K6589K5701k0791L6519K9852
18246C03605L469L4685k2347j1080k6632O0223N31k2663j3193L1373M6748M603
$$ y = [2222503, 2399704, 2830745, 3089089, 2934474, 2522591, 2121971, 1963696, 1953167, 1752314, 1358574, 1032105, 804979, 721860, 707789, 720659, 723295, 662098, 516983, 408503, 394809, 437900, 439812, 423446, 487157, 517951, 477928, 410241, 388819, 388208, 361753, 321309, 302717, 293613, 258714, 243481, 306269, 284648, 224920, 196951, 202286, 222087, 262320, 269042, 279969, 297303, 287133, 252748, 230540, 292932, 272970, 232197, 188729, 194304, 244627, 288618, 319885, 312551, 282240, 227915, 166463, 146700, 86761, 67327, 94327, 81302, 64431, 95566, 151718, 133408, 140807, 164636, 161287, 154465, 156263, 205735, 232324, 258025, 237234, 273753, 303605, 307074, 341759, 319412, 308332, 281700, 341923, 342454, 319791, 306598, 337971, 384719, 389322]
18234C89322Q133l9399k2471M712O3188J3360L0897L8972q87k8741m0499O213
18222D22800M197K943J9203o272K8417L5117o299L5435K5753l3953J4158q247
18210E33252l3284L720L6316N6143N1823k5154k0296k8136K7764J49950R6489
18199H48587L7177P5833M6479L9965J07916N7447J32534J83049J05176O1587O8970
18188A764720J51741K01872K88575L68154L79042L97737K49279K46662L63908
18179D411690N90178P09788Q17768R43089J077203J258895J619492K209987L098434
18170A6736524M353406O630653J0426084J3441873J1702618R158346N901358N56632
18162G8907494P52149P424371J7262481J8203091J2789526Q716770l391502q336349
$$ y = [389322, 397455, 358056, 335585, 340297, 403485, 416845, 447742, 486714, 485827, 457086, 416587, 422800, 426997, 429940, 449143, 442871, 471288, 506405, 500106, 535541, 561294, 527341, 541499, 533252, 499968, 503688, 540004, 596147, 647970, 622816, 602520, 574384, 602148, 752098, 848587, 885764, 961597, 1008076, 1048041, 1155957, 1213404, 1345938, 1528987, 1634163, 1695750, 1764720, 1916461, 2118333, 2406908, 2775062, 3154104, 3551841, 3801120, 4047782, 4411690, 5001868, 5711656, 6529424, 7472513, 8549716, 9808611, 11428103, 13638090, 16736524, 21089930, 27720583, 38146667, 51588540, 63291158, 72449504, 78350862, 78907494, 79659643, 87084014, 104346495, 122549586, 135339112, 144055882, 140664380, 132328031]
18154A32328031j324177P527145J0195513P965345J973422p656501r832139n23993
18146A40652646J0818856R157579M473661k907027j8587230k2673756j7227630
18139A03707099p624107k066365k538358m328583j0863119j5156359j4681799
18132D6448409j2091837q292322n273479l413602k267657j619957j200807q98313
18124A1390435p69380o35534m64967j50091K12158N19744J056829J972298K860669
18115A5992161L349538M317889P134000J3533599K7296799M4136824K2212454
18108A37973264j7113860k9904431l2908676k2775016j1850088o177410l710917
18101A3532866k435807j841295j489913j109044q64919o74369n58786m83459m30123
$$ y = [132328031, 131003854, 138530999, 148726512, 156691857, 158665279, 151008778, 141176639, 140652646, 151471502, 160629081, 165102742, 162195715, 143608485, 120934729, 103707099, 96082992, 94016627, 91478269, 87149686, 76286567, 61130208, 46448409, 34356572, 26064250, 20790771, 17377169, 15109512, 13489555, 12288748, 11390435, 10621055, 9985521, 9520554, 9370463, 9582621, 10102365, 11159194, 13131492, 15992161, 19341699, 23659588, 30793588, 44327187, 71623986, 115760810, 137973264, 120859404, 90954973, 58046297, 35271281, 23421193, 17243783, 13532866, 11097059, 9255764, 7765851, 6656807, 5791888, 5117519, 4558733, 4075274, 3645151]
18092C645151l61098l16087k67824j76950j42298j81199j59198n7844r7665p2214
18082A812774O0366J01703l0212p1173l9098O4059J24701J10330N4672R2137J14150
18071B394409K07986K23639K84757L07621K45980Q8644l2563Q4182L47849O22633
18061D775137Q37729O44406J60548j10041P6729M07777N61442O54011P95286R06556
18051I709580J312366J873514K860628M165800O233232R922080J2513024Q012525
18043E6602749K337929K346515Q160972J6653279J1657414m179155j1063821j0375958
18035G2139924l012801K195421o5463o80813r03695m377077m859499j383513N802091
18026F4854575J1663095L778513p432494j0849481q943150l073318k181169o260319
$$ y = [3645151, 3284053, 2967966, 2700142, 2523192, 2380894, 2199695, 2040497, 1982653, 1884988, 1812774, 1873140, 1974843, 1944631, 1873458, 1834360, 1898419, 2023120, 2133450, 2188122, 2280259, 2394409, 2602395, 2826034, 3110791, 3418412, 3664392, 3753036, 3720473, 3804655, 4152504, 4775137, 5612866, 6257272, 6417820, 6307779, 6384508, 6792285, 7353727, 8007738, 8803024, 9709580, 11021946, 12895460, 15756088, 19921888, 26155120, 36077200, 48590224, 56602749, 58940678, 61287193, 69448165, 86101444, 97758858, 93579703, 82515882, 72139924, 69127123, 71322544, 71257081, 70576268, 69672573, 65295496, 60435997, 59052484, 64854575, 76517670, 80296183, 72863689, 62014208, 53071058, 49997740, 47816571, 41556252]
18018D1556252q321912q374414o505019m113136k442201j486220j046836q53372
18010H413142o26226l61475q3737r2438j62546l0335P5358J90958K71269L34114
18000G928084O67054J013464J391192J811898K358355L342274N519389R343567
17992C3375277J3627224J2193686M831030J891339N219852J4481697J7708751
17985A03328856K555402r824707j2289108p050846J205069J611540l67239M49906
17977G9618873k507965n670727l615931K889210J2169766J0579125m163115j1971583
17969G7327653j2456256o639615j942350n381633r288918j0227910q903935o020447
17961A6466589l608089k222082j619356j199577r39435p45704n23058m28225m29658
$$ y = [41556252, 33234340, 24859926, 18354907, 14241771, 11799570, 10313350, 9266514, 8413142, 7786916, 7425441, 7341704, 7249266, 7086720, 7056385, 7131743, 7322701, 7593970, 7928084, 8595138, 9608602, 10999794, 12811692, 15170047, 18512321, 24031710, 33375277, 47002501, 59196187, 64027217, 65918556, 71138408, 85620105, 103328856, 105884258, 96059551, 83770443, 76719597, 77924666, 79536206, 79168967, 79618873, 77110908, 71440181, 67824250, 70713460, 82883226, 93462351, 89299236, 77327653, 64871397, 58231782, 56289432, 50907799, 41618881, 31390971, 22487036, 16466589, 12858500, 10636418, 9017062, 7817485, 6878050, 6132346, 5609288, 5181063, 4751405]
17952D751405l48533l80020l78029k52618k62769k73719j69116j62547j83009
17943B341045q6669r5314m777k3669j44024j93280j20504j07566j41633j26547
17933A297062j4306k1965j41799j28920p1769J3758M3551M0728N0822K1345J25149
17922A213656L1562k6000l4270m5152K7240j1586l8210j3549k7366k5431p4961
17911I75933r3376J8717K9427o096q1138n6906o9878r3623n2387K8257J3800M6703
17899F59433k315r316q1111l4305M972j4860K661P76k0406k2749n6881J288m810
17886D22377k5011k8866N2685P2091Q3335Q4895J11345J10333M4133P5404O2953
17875A065674J08260O8464M0675L5303j0361n3909M778L6292O1723k4345q1723
$$ y = [4751405, 4402872, 4022852, 3644823, 3392205, 3129436, 2855717, 2686601, 2524054, 2341045, 2254376, 2159062, 2154285, 2130616, 1986592, 1793312, 1672808, 1565242, 1423609, 1297062, 1282756, 1260791, 1118992, 990072, 918303, 932061, 975612, 1016340, 1067162, 1088507, 1213656, 1245218, 1219218, 1184948, 1139796, 1167036, 1155450, 1117240, 1103691, 1076325, 1050894, 975933, 882557, 901274, 930701, 924605, 843467, 786561, 716683, 623060, 570673, 598930, 612730, 659433, 657118, 647802, 566691, 532386, 537358, 522498, 525159, 525935, 505529, 482780, 425899, 427187, 422377, 397366, 368500, 421185, 493276, 576611, 661506, 772851, 883184, 927317, 1002721, 1065674, 1173934, 1242398, 1283073, 1318376, 1308015, 1254106, 1258884, 1295176, 1356899, 1332554, 1250831]
17864A250831p8072r2852p9271m9938j03075j29585q0865o4726j00055n6945m0924
17853C74523j04019j9646K4538J3680j12998k8280k7252N8746M8425J8295L326
17842B49338L746j4491J7520m0096J306L8068k4578r921L4140L8029N9760N8430
17830D11251N4489N3282K6447K1090P5061N7175K127J935K4416l8816K8287J3850
17818G30594o757j5436P6327n6824q4056n1286k4677l0958r5189m1301Q371o2003
17806C46805p3228j06419l3060k4476m4391N9311L8567L1258p982K2100n1624
17795A56861o7170K682J02106j5145J870K7135P5597l917r5400m9505l2359j0677
17783I2078L0828K2103M2240K3802J1884j3277n8692n2052M8540K1257l1092k0310
$$ y = [1250831, 1172759, 1079907, 1000636, 950698, 847623, 718038, 637173, 572447, 472392, 415447, 374523, 270504, 250858, 275396, 289076, 176078, 147798, 120546, 179292, 227717, 246012, 249338, 253084, 238593, 256113, 216017, 217323, 255391, 230813, 220892, 255032, 293061, 352821, 411251, 465740, 519022, 545469, 566559, 641620, 698795, 700922, 702857, 727273, 688457, 716744, 730594, 723837, 708401, 784728, 727904, 643848, 592562, 567885, 536927, 441738, 400437, 408808, 346805, 273577, 167158, 134098, 109622, 65231, 124542, 163109, 194367, 186385, 208485, 156861, 89691, 92373, 194479, 179334, 181204, 208339, 283936, 280019, 184619, 135114, 102755, 92078, 122906, 145009, 187249, 211051, 222935, 209658, 150966, 98914, 147454, 168711, 137619, 117309]
17771A17309l0677j5323r681N5975L9002L1018J8283k0400j4516o2752r3381J8862
17759C3719K2878J2663J5048K1149J8569M1061L6388q8031q1181K2922Q5549K7016
17747A67750k8317J5677l0476l907j3302l7422O907J9135q9233k6467N5926j8033
17735A8238J4519m3947q877Q2111J00806J7133n4758J1961k6200j9966L0131j8578
17723A02573l7803k9724l2020l7487O870J7282l732j2757k7533L0583J775k2520
17711d4493N8923N245R634M4918P0581R449K592O0177N3203J23213J71874J11062
17699F76378J14587K14467K13400R5664M5161j3048j56844k05598k29808j74079
17689E80280j01895j73683o9075m2505o8435m8340m5388J6618M4371j3374M4855
$$ y = [117309, 86632, 71309, 61628, 117603, 156605, 187623, 205906, 185506, 170990, 108238, 14857, 33719, 56597, 69260, 84308, 105457, 124026, 165087, 201475, 113444, 32263, 55185, 140734, 167750, 139433, 155110, 124634, 120727, 107425, 70003, 76910, 96045, 6812, -19655, 36271, 18238, 32757, -11190, -20067, 62044, 162850, 179983, 125225, 137186, 110986, 91020, 121151, 102573, 64770, 35046, 3026, -34461, -27591, -10309, -14041, -26798, -54331, -23748, -21973, -44493, 14430, 19675, 29309, 74227, 144808, 154257, 156849, 217026, 270229, 393442, 565316, 676378, 790965, 1005432, 1218832, 1314496, 1359657, 1346609, 1189765, 984167, 754359, 580280, 478385, 304702, 235627, 193122, 124687, 76347, 30959, 47577, 91948, 78574, 123429]
17678A23429M6780K2152p35L192l3326j0823P05l570o4426m2570J5429J8413j7381
17665E7269L2150j3795l1568k3671J6281N56M3987L3862o4010l7670N5217J0527
17653G9135k3408L4321K5319N7986J02946J9168M9493R0609K24827K21723J57904
17642A040023J45985P7437l6188r6691p3908q4525j06597r7216q186R3170N2724
17631I06028L0809K2177j9347n3621l3028k2604j1722j0714m7286l6729L5371
17620G59334J6217j7429K7313L3507n1200r6673o9415l7583M1990l100k5559n0870
17608E26532q5784p4366p9921p8779q5997o616K3524J8119k9601k4249p2274m6748
17596a6160j8740R5598M7985m600M0404J741m727P941l1642l9885K6392J197k0012
$$ y = [123429, 170209, 192361, 191626, 194818, 161492, 150669, 151374, 147804, 83378, 40808, 56237, 74650, 57269, 89419, 75624, 44056, 20385, 36666, 37222, 81209, 115071, 51061, 13391, 68608, 79135, 55727, 90048, 115367, 173353, 276299, 295467, 344960, 435569, 660396, 882119, 1040023, 1186008, 1263445, 1227257, 1130566, 1056658, 972133, 865536, 768320, 760134, 853304, 906028, 936837, 959014, 939667, 886046, 853018, 830414, 818692, 807978, 760692, 723963, 759334, 775551, 758122, 785435, 818942, 767742, 671069, 601654, 564071, 606061, 602961, 577402, 526532, 440748, 366382, 286461, 207682, 121685, 115069, 138593, 156712, 127111, 102862, 30588, -16160, -34900, 60698, 108683, 104083, 144487, 146228, 141501, 149442, 117800, 77915, 104307, 105504, 85492]
17583H5492l5602J0182L9782M3063O3351o8668k2429N91J00544J32485o234p6355
17571B66202n5891q2380k2376P998l296j2178K2596N6605K2843l1198o5912k1509
17559H1504j8295J1995K2122k8737j0381l1705k6990O385J1710K8363J585j8727
17547B8829M5922J6656n4455o7501j8753j6303K1259R078P9006M9791N6038K3865
17535A73432R275l1994o9631J7676l1529j4326l6102J4574q220j1478J6597L5458
17523F3732N6445M1721M0000O9447L5489K2613M1327M1774L5957k0372J2986l588
17511D37531k1116k5746k6781N5203l3794J2074k3936J1909l6204n143N7742O4412
17499D66151k5567j7621M1918J05243J11423P3799R7533J69p3123j5727K4590
$$ y = [85492, 49890, 60072, 99854, 142917, 206268, 137600, 115171, 115762, 216306, 348791, 342557, 266202, 210311, 127931, 105555, 113553, 110257, 98079, 120675, 177280, 200123, 168925, 103013, 81504, 63209, 75204, 97326, 68589, 58208, 26503, -487, 5898, 17608, 45971, 47556, 28829, 74751, 91407, 36952, -30549, -49302, -65605, -44346, -35268, 43738, 93529, 149567, 173432, 182707, 150713, 81082, 98758, 67229, 52903, 16801, 31375, 23155, 11677, 28274, 63732, 120177, 161898, 201898, 271345, 306834, 329447, 370774, 412548, 448505, 428133, 441119, 437531, 416415, 390669, 363888, 419091, 385297, 397371, 373435, 385344, 349140, 343997, 401739, 466151, 440584, 422963, 464881, 570124, 681547, 755346, 852879, 853048, 779925, 764198, 788788]
17488G88788R530N7206R0003l2451j11328j76689k48347j45947l3959L0465j4393
17477B12878L5501J4122m3764j6852q827N128l2204J6914J6237L7989L9935Q0724
17465C57781R2017K2721p593J6678R7089J13993o1776m5215k2904M5527O1033
17454F69351Q1668J2892L3718N3338J00738J77534K65071L55896K50417J03004
17444B103627R3869R4908K5664k6793j09792j66390k88991l27792k98299k32875
17434H67136j47021j13540j21836n2750l1711j07711m2974p6218m3254N6501k1357
17423A65265l6381J0174j4082n4803O5222P1637L8432L445m5373p2782N0384O9120
17411B50258m6000q4648j2740N9940L0513L6488O0454Q7186J29276J00054K15833
$$ y = [788788, 798318, 855524, 945527, 913076, 801748, 625059, 376712, 230765, 196806, 227271, 212878, 248379, 262501, 218737, 201885, 193058, 198186, 165982, 182896, 199133, 237122, 277057, 357781, 449798, 472519, 464926, 481604, 578693, 692686, 630910, 585695, 562791, 608318, 669351, 751019, 763911, 797629, 850967, 951705, 1129239, 1394310, 1750206, 2000623, 2103627, 2197496, 2292404, 2318068, 2291275, 2181483, 2015093, 1726102, 1398310, 1100011, 867136, 720115, 606575, 484739, 431989, 400278, 292567, 249593, 173375, 130121, 186622, 165265, 128884, 139058, 124976, 70173, 135395, 207032, 245464, 248909, 203536, 130754, 181138, 250258, 204258, 119610, 106870, 166810, 197323, 233811, 294265, 381451, 510727, 610781, 826614]
17400H26614K30429K22296J76821J66636J22354R5734J06031Q8083L4036q5626
17390A983408j65972k47929j43874j13859k12022j62559p9936j22344p9005j19533
17380E36375r1982r3546j7476n0102j10075n8447M59M074k1318k9662q439K4965
17368H4826O241k715J0107l638k3608J3663K1645k7277k2638k2877O4950J5799
17356A14478j2222M7429O6148J7567l0218M2726J28980J96366J21930J25606J28776
17345I47566Q4146J05256J05349m686O3731l7084r1212j11545n0424n9684j27298
17334H24115j12128j22222j44435j14214l7414j31840j13392K4729K2770p765
17324H8204L7557m127p1520j6124P1487J08772l0588l0154M2032j8779p915L0060
$$ y = [826614, 1057043, 1279339, 1456160, 1622796, 1745150, 1840884, 1946915, 2034998, 2069034, 1983408, 1817436, 1569507, 1425633, 1311774, 1099752, 937193, 857257, 734913, 655908, 536375, 444393, 350847, 333371, 283269, 173194, 114747, 115206, 119280, 97962, 68300, 59861, 84826, 91067, 88352, 98459, 94821, 71213, 84876, 106521, 79244, 56606, 33729, 98679, 114478, 102256, 149685, 215833, 233400, 203182, 245908, 374888, 571254, 693184, 818790, 947566, 1031712, 1136968, 1242317, 1237631, 1301362, 1264278, 1173066, 1061521, 1011097, 951413, 824115, 711987, 589765, 445330, 331116, 293702, 161862, 48470, 73199, 95969, 88204, 125761, 121634, 50114, 33990, 105477, 214249, 183661, 153507, 195539, 176760, 168845, 198905]
17312A98905p13K1154O3675K7610M2411K1624j0508n1370o5596p7815p8171L8766
17300A29972M4977j4803l1319k2474l427k8693K7558P576l156P7841K9488l2504
17288A81036n084J9895l4801j3740l7591P8M0105k4321l3174K1482K1444J1629
17276A46958J8559m3134O86K2187J8887Q0753N4601q49k4684K2768M2163n1335
17264B87560k7905R1895L3964l6971J9992K4622O4692L6284N938j3733J272j6605
17252D71005p6115o213o8698l9543j5495k6671k6958L7989n3411M9832L143Q232
17240B57097M141P1344N2002N5668K2391j6183j7050m0732l465J8944o6801n6536
17228B80820N13K3688P9695l9561P8834J00574J23133J38960J06327J41540K50064
$$ y = [198905, 198192, 219346, 283021, 310631, 353042, 374666, 364158, 312788, 247192, 169377, 91206, 129972, 174949, 160146, 128827, 106353, 102926, 74233, 101791, 109367, 106211, 184052, 213540, 181036, 175952, 195847, 161046, 147306, 109715, 109793, 149898, 125577, 92403, 113885, 135329, 146958, 165517, 122383, 123069, 145256, 164143, 244896, 299497, 298648, 273964, 296732, 338895, 287560, 259655, 351550, 385514, 348543, 368535, 393157, 457849, 494133, 500071, 486338, 487610, 471005, 394890, 388677, 319979, 280436, 264941, 238270, 211312, 249301, 195890, 245722, 248865, 257097, 261238, 332582, 384584, 440252, 462643, 446460, 429410, 388678, 385213, 404157, 337356, 280820, 281333, 305021, 384716, 345155, 423989, 524563, 647696, 786656, 892983, 1034523, 1284587]
17217A284587K61520L06261J83296J07752M5384k5804m7849o7159n8441m8501
17207A941046R1007J73458J27202K92400L96878M57785M85835N90004N17281O39242
17197E712138O93195O85283Q51319J217863J721009K501001L459549M775693O879115
17188B8496165R877924J5304771K2971828K7250195L1404689L8136405K6203264
17181A99645241J2594840N546867j7904770k9731118l1781789l4248147k8816709
17174G5304415k1629484j5083716r527954o079778m107622k916385k235010j803777
17166A1920689j362569j066343q74047o45206o07598n63917m42658n31671n28800
17157E297880m17624k20151j82985j12465r401J59902K02313L48769M14956M33804
$$ y = [1284587, 1546107, 1852368, 2035664, 2143416, 2188800, 2162996, 2115147, 2047988, 1989547, 1941046, 2032053, 2205511, 2332713, 2625113, 3021991, 3479776, 3965611, 4555615, 5072896, 5712138, 6405333, 7090616, 7941935, 9159798, 10880807, 13381808, 16841357, 21617050, 28496165, 38374089, 53678860, 76650688, 103900883, 135305572, 173441977, 199645241, 212240081, 217786948, 199882178, 170151060, 138369271, 104121124, 75304415, 53674931, 38591215, 29063261, 22983483, 18875861, 15959476, 13724466, 11920689, 10558120, 9491777, 8617730, 7972524, 7364926, 6801009, 6358351, 5826680, 5297880, 4880256, 4660105, 4477120, 4364655, 4355254, 4515156, 4717469, 5066238, 5481194, 5914998]
17147E914998M31351L49990K48388K98985L44985N33258Q51755J281074J834980
17138A2089764K558537L575052N058080P306985J0990786J7233532K2916389K5306116
17130A07035241L1929324K9992842J4418316Q880404o211033k4226499k7123058
17123A34695537l0087944k8333629k1754955j5785747j0408610o526076m171197
17116A7627379k954039k275565j729156j383805j139254j003975q44178p52310
17108E545097p55866o26073m67520l81638l60015k32144j26928j47666r6259m276
17098B346712N1701J06817N090k4406n5656j05331k08713k01799k21577k08680
17088A484158j20967j32866j32246q7115r2294n4652M551k3304l8511n914j7967
$$ y = [5914998, 6346349, 6696339, 6944727, 7243712, 7588697, 8121955, 8973710, 10254784, 12089764, 14648301, 18223353, 23281433, 30588418, 41579204, 58812736, 81729125, 107035241, 138964565, 168957407, 183375723, 192256127, 186045094, 161818595, 134695537, 104607593, 76273964, 54519009, 38733262, 28324652, 21798576, 17627379, 14673340, 12397775, 10668619, 9284814, 8145560, 7141585, 6297407, 5545097, 4789231, 4163158, 3695638, 3314000, 2953985, 2721841, 2594913, 2447247, 2350988, 2346712, 2398413, 2505230, 2510320, 2485914, 2430258, 2324927, 2116214, 1914415, 1692838, 1484158, 1363191, 1230325, 1098079, 1010964, 918670, 864018, 868569, 845265, 806754, 800840, 782873]
17077G82873o7655m5632j4737k3519l0035M5881o650k9391j31195q0791K6380
17066D25529L188p3648L6580M9655o923l5962j2574m0021L1751M0879n953m7844
17054C64657n6722l0300N4050n2841n9868m692M2321N9518r465p5074m0705M0467
17042B31346k9557l5949k7412j8604K9262M4236M038m5649j3294N0299O1344j6027
17030B34033n7078p7850k8965J2451M137r375Q487P5875L0097M06m4473k0986
17018A26759l850k8179K1443O9661K8319K9735m509J4046k9541q18k6346J1131
17006B07851p82k3337J0773L925m7864K212L4627n3456n6563m4201j8289K2602
16994C7498K2621O5046k9546o8359J3197L9624J8417N8623o335r568l659o785
$$ y = [782873, 715218, 669586, 654849, 631330, 601295, 647176, 640526, 611135, 479940, 399149, 425529, 428717, 355069, 391649, 441304, 434381, 398419, 385845, 345824, 377575, 418454, 412501, 364657, 307935, 277635, 331685, 278844, 218976, 214284, 256605, 316123, 306658, 231584, 190879, 231346, 201789, 165840, 138428, 119824, 149086, 193322, 197360, 151711, 138417, 188716, 250060, 234033, 176955, 99105, 70140, 82591, 86728, 77353, 85840, 161715, 191812, 192218, 147745, 126759, 122909, 94730, 116173, 185834, 214153, 243888, 239379, 253425, 223884, 223066, 196720, 207851, 207069, 183732, 194505, 198430, 150566, 152778, 187405, 133949, 77386, 33185, 14896, 37498, 60119, 125165, 95619, 27260, 40457, 80081, 98498, 157121, 150786, 141218, 137559, 130774]
16982A30774M6323M8452n9198q5849NN5672J4576K4372O1414m5432m0312k0681
16970A30116l3861Q599K7127M4181P878l2613M01l2370j8278L6485K0535n1131
16958A07069k2390r939j0875j2639P851N9647N050j3649q0634l9860L5717L0638
16946E5986K3585j7651n2035r639J6570n565j0242K3844l4976K6118M6274O6760
16934A29029J7530J4298M8527o3989p3038l5456J0707k3284J2530M1312k2327
16923E5839N5002K3457j06456r3323m467K6396M8031K8932j2713J2669k7455N665
16911A1577P977k3493R260P3089K9592p9455o9629J1215P751K0551k3795K7642
16899B282M6756l8044J0548M7817k7073l8662o0072k2223M3428j9014j6913L1351
$$ y = [130774, 177097, 225549, 166351, 80502, 80507, 136179, 150755, 175127, 236541, 191109, 150797, 130116, 96255, 104854, 131981, 176162, 184040, 151427, 151828, 119458, 101180, 137665, 158200, 107069, 84679, 74740, 63865, 51226, 59077, 118724, 123774, 110125, 29491, -10369, 25348, 55986, 79571, 61920, 9885, 246, 16816, 11251, 1009, 24853, -10123, 15995, 62269, 129029, 146559, 160857, 209384, 145395, 72357, 36901, 47608, 24324, 36854, 78166, 55839, 110841, 134298, 27842, -65481, -69948, -43552, 4479, 33411, 20698, 33367, 5912, 11577, 19554, -3939, 5321, 78410, 108002, 28547, -41082, -29867, -22116, -1565, -25360, 2282, 49038, 10994, 21542, 69359, 42286, 3624, -56448, -78671, -35243, -54257, -71170, -39819]
16887c9819k2317j6221N650J5212N841L2921K6151K4267l830l3178K8624l6180
16875a2879j5126K4419m2889L8754l8891K7493Q3976K8575j3757j911m6254l6476
16863d966P2950O4486m0025p8488r659J2514L8303O841P522j7145m1902K0331
16851C0762j662R410P916j5004L2787j8291p8323m1595L098M8550j5284m4292
16839h1928J3593J9821k3521K1315Q3676j6197J880M2287J3850k1237J2111m9434
16827A6216k8207l1997m4640M6028Q0656k0731k8579j4549J221K3331k818L145
16815i24M2988q4345m3540L9920M1728K3990R15l2948j087K2068j5812L7613L9198
16802F9764j2772l3500q615n7300l3588J6264m034J0016K2865P5580O3179k181
$$ y = [-39819, -62136, -78357, -72707, -57495, -51654, -18733, 7418, 31685, 27855, -5323, 23301, -12879, -28005, -3586, -46475, -7721, -46612, -19119, 64857, 93432, 79675, 77764, 31510, -4966, 67984, 132470, 92445, 13957, 4298, 16812, 55115, 61956, 69478, 52333, 10431, 30762, 29100, 38510, 46426, 31422, 64209, 45918, -32405, -74000, -70902, -22352, -37636, -81928, -68335, -48514, -72035, -50720, 32956, 16759, 18639, 60926, 74776, 53539, 65650, 16216, -11991, -43988, -88628, -42600, 38056, 17325, -11254, -25803, -24582, -1251, -4069, -924, 42064, -42281, -85821, -45901, -4173, 19817, 20732, -12216, -13303, 8765, -7047, 30566, 69764, 56992, 23492, 14877, -42423, -76011, -59747, -63781, -53765, -30900, 44680, 107859, 105678]
16790A05678n2990n7966m5796K8047L9873k0472k6402k987k7526l0261N4836O4770
16778B8804n108m0408o912r3463k7601P9664L4397m2279L9229P3596M3141M4240
16766A27300n6165q7656q0688n110Q545O4487L6202k3276J7861o249M2360l6771
16754H40j6566k795m573J6872m2325L7502K1333R874l3091N0400M7954q0849k4884
16741b0308L0686L6290Q414o9863M8987R6389k5953k8228L7710l4310m9519l2433
16729b138J6234o3967r113N3435j8103l3511m776L5989P0152L9278j6443j7823
16717D9214l9085j4942j2034l3687j7911M0953L3o3385q76M9490M5450j4791l7818
16704d9389n506R938O77n411Q178O0907O0232j2463o1747n8983k4637J2883M3549
$$ y = [105678, 52688, -5278, -51074, -23027, 16846, -3626, -30028, -33015, -60541, -90802, -35966, 28804, 23696, -16712, -23624, -117087, -144688, -65024, -30627, -72906, -33677, 39919, 83060, 127300, 71135, -16521, -97209, -102319, -93774, -29287, 6915, -16361, 1500, -4749, 37611, 840, -15726, -18521, -23094, -6222, -48547, -11045, 10288, 20162, -12929, 37471, 85425, 4576, -20308, 10378, 46668, 55082, -14781, 34206, 130595, 104642, 76414, 114124, 79814, 30295, -2138, 14096, -49871, -58984, -5549, -23652, -57163, -61939, -25950, 44202, 83480, 67037, 49214, 10129, -4813, -16847, -50534, -68445, -27492, -27459, -90844, -91720, -42230, 3220, -11571, -49389, -54895, -44957, -44280, -49691, -41513, 19394, 79626, 67163, 5416, -53567, -78204, -65321, -21772]
16691b1772M1387N8072j7191p0900o8752q788M4994O3142k6237J0968K1544n576
16679B0891m43L427M8662N790k4006p668O9603r797P2965L1926R692n5M3674P5786
16665C40447K3704J01559J75247J90803J20826N2886Q6484j5534j42646j81885
16655G51891k00785j39317j33569q8289o5519n1288l7901q817k0096j0858J6552
16644A2004K0269R950j099l0881n2550m6299R706N0466k0099K5649J8537n3509
16632e7856J8536O1522O2518P402j2836j9038k8931P9153l2674j6996j4916m8434
16620b550l9586P730O0254Q3261N0172L0108j056q152L9423J38609J31313J53402
16608F42928J86857J41140N9805m6746j42180j26549j51521j26680j70318j08687
$$ y = [-21772, 19615, 77687, 60496, -10404, -79156, -87944, -42950, 20192, -6045, 4923, 26467, 20891, 20448, 23875, 72537, 78327, 54321, 46653, 116256, 106459, 179424, 211350, 221042, 220987, 264661, 340447, 364151, 465710, 640957, 831760, 952586, 1005472, 1091956, 1076422, 933776, 751891, 551106, 411789, 278220, 189931, 124412, 73124, 35223, 26406, 6310, -4548, 12004, 32273, 42223, 41124, 10243, -42307, -88606, -78900, -28434, -48533, -22884, -4347, -57856, -39320, 22202, 84720, 92122, 79286, 60248, 31317, 110470, 77796, 60800, 45884, -2550, -42136, -34406, 25848, 109109, 159281, 189389, 188333, 180181, 219604, 358213, 489526, 642928, 829785, 970925, 1030730, 983984, 841804, 715255, 563734, 437054, 266736, 158049]
16598A58049k0036l6522n9152M119k9290j6842P2955j9170q5484K2295l500L6641
16586B4063J7295o7197N793j4405K6713j2917k3988J5417j6506j5442L8054L1837
16574H717m1648L4559j4228j6781j7205M6407M6607J6965p185m9858n382J8620
16562A9588m3731m0170K1986O1147m5653l8840l0881r269j1835M9593N4739P418
16550e908J5001l2329K5268Q312j9939m7787q0634l4627N5565P9500K8538J5364
16538F324J1591n1387j2006m2281P222k9864m1455O5354K9561R958L4410M5600
16526C3027L7076k5560m3179L5652P9903k4139q76l0401P335k1771l4848k7297
16514a5078K5884K640J5535J0110o0203m9150K4779L4396k7239n2667j1088K137
$$ y = [158049, 138013, 101491, 42339, 46458, 17168, 326, 73281, 54111, -31373, -9078, -12578, 24063, 41358, -25839, -20046, -34451, -7738, -20655, -44643, -29226, -45732, -61174, -23120, 8717, -32931, 1628, -12600, -29381, -46586, -179, 46428, 63393, 56208, 6350, 968, 19588, -24143, -64313, -42327, 18820, -26833, -65673, -96554, -105823, -117658, -68065, -13326, -5908, 9093, -23236, 2032, 10344, -9595, -57382, -138016, -172643, -117078, -37578, -9040, 6324, 17915, -33472, -45478, -87759, -80537, -110401, -151856, -86502, -56941, -46983, -12573, 33027, 70103, 44543, 1364, 37016, 116919, 92780, 91904, 61503, 68838, 47067, 12219, -15078, 10806, 13446, 28981, 39091, -21112, -70262, -45483, -11087, -38326, -90993, -102081, -99944]
16502i9944O7813K6610p084j1316q732r088J4613j692J8176j1415L927j06k1846
16489d0084j4487j3848j1070o289l640K4251K421N364J643K1325j3330K7980J01284
16476H1520L6640m9729L6581J4826n6733p6907J3411l2525n780J1688k8329P542
16464d7795N8209O1440l328k162j5211l367j8758k2329k3916m3905r066K2973
16452d7215L0101K4052l0308j4396k2730j2126K2982R889P574M3027L4407l3341
16440A1916l0562j0056l7402j8056L2139M8071J6235K5557k5763K8411M5998J9697
16428A06185j8810l2742o048j9021J8087n0924o6457M5313O0709l2676o6829j0510
16416g3723l0515M499K9832k5325M622l4585k4449J8684L0928L7287M5746l8859
$$ y = [-99944, -32131, -5521, -12605, -23921, -32653, -41741, -27128, -28820, -10644, -22059, -18132, -18238, -40084, -54571, -68419, -79489, -85778, -89418, -65167, -62746, -57382, -55739, -34414, -47744, -19764, 81520, 118160, 68431, 105012, 119838, 63105, -13802, -391, -32916, -38696, -27008, -55337, -47795, 10414, 71854, 68526, 66364, 51153, 47786, 29028, 6699, -17217, -61122, -70188, -47215, -17114, 6938, -23370, -37766, -60496, -72622, -49640, -39751, -32177, 10850, 45257, 11916, -18646, -28702, -66104, -84160, -52021, -3950, 12285, 37842, 12079, 40490, 86488, 106185, 87375, 54633, 48585, 29564, 47651, -3273, -69730, -24417, 36292, 3616, -63213, -73723, -104238, -99739, -69907, -95232, -90610, -125195, -149644, -130960, -100032, -62745, -16999, -55858]
16404e5858k6779J0979J5350j6780l1492K6299j0461m4264k3215l0348p308O7621
16392a26256Q3911P1326l1471l4066J5782K0252l2754m887R985j79j5846n772
16380d9975J1477L3584M5294j4480n1123j6753l0833l328J0834L4296J4605k3735
16368d0137m996N7884J5199m802K3758J3440J4203l6747m8219L612K4152k033
16356A5314M4736J3090o6039k8770k0598N097J7107J696l7455L2152j5529j6563
16344e5762P0999M4523J4787l4827l8462J2075j9540J3811o2726o846R134r756
16332f2590J4660J6459K7552k1299l7926L6096O0324J8592l6338j2253M5399K4344
16320G3020l3587l2935j2150l8748L4726L9290p0708q67K2835L3453O2616n8744
$$ y = [-55858, -82637, -71658, -56308, -73088, -104580, -78281, -88742, -133006, -156221, -186569, -193877, -126256, -42345, 28981, -2490, -36556, -20774, -522, -33276, -38163, -28178, -28357, -44203, -49975, -38498, -4914, 40380, 25900, -25223, -41976, -72809, -76137, -65303, -31007, -16402, -40137, -45133, 12751, 27950, 23148, 46906, 60346, 74549, 37802, -10417, -6805, 17347, 15314, 60050, 73140, 7101, -21669, -42267, -37170, -20063, -18367, -55822, -23670, -39199, -55762, 15237, 59760, 74547, 39720, 1258, 13333, -6207, 7604, -55122, -61968, -52834, -62590, -47930, -31471, -3919, -25218, -63144, -27048, 33276, 51868, 15530, 3277, 48676, 73020, 39433, 6498, -5652, -44400, -9674, 29616, -41092, -41959, -19124, 14329, 76945, 18201]
16308A8201k8951m3926l383L5597K5282P1097J09q2207l9465L2725k9825p6693
16296a21439k2761N3187O9731M8913L4840r122k0653l6896j3014q33p7554l9778
16284a35379P0914J3560Q066O1908J0993l4142k5829L4342m515J0154k9717r4812
16272a14457p1804M2824P0567l162o2k7232q294N561L9439M6398L8648P464M6373
16259G2263j08795j9051R593l6074L616j028l71N450K2247o73n395q713m818L91
16245g1358m7727l340P8102O5146J4784l7811l5395K9001P8948N001r5758o9017
16233h9424m552J4009k8240O2548L2815m6978Q577L6413k6357J2967Q871M9713
16221C0362k1785m1331m3055J8395L8569R984J8205L864K578K8892o7640k0534
$$ y = [18201, -10750, -54676, -58059, -22462, 2820, 73917, 74026, -8181, -47646, -14921, -44746, -121439, -144200, -91013, -21282, 27631, 62471, 53349, 32696, -4200, -17214, -18047, -95601, -135379, -64465, -50905, -42839, 19069, 30062, -4080, -29909, 4433, -82, 10072, -19645, -114457, -186261, -143437, -72870, -76032, -76094, -103326, -111620, -106059, -66620, -20222, 18426, 25890, 72263, -36532, -55583, -45990, -82064, -78448, -79476, -79847, -74397, -52150, -52823, -58218, -66931, -71749, -71358, -119085, -122425, -44323, 20823, 35607, -2204, -37599, -8598, 70350, 75351, -20407, -89424, -93976, -79967, -108207, -45659, -12844, -59822, -51245, -14832, -41189, -28222, -19351, 30362, 8577, -32754, -75809, -57414, -18845, -8861, 9344, 13208, 15786, 44678, -22962, -43496]
16209d3496J1579k1959N9220N4310o522J1656M3548j0976m6826l3179j9484J6808
16197A4679P661k7858q955P866j7900J1364m6417M7631Q8905j5812k6314j9586
16185A5264N114L7343j8735q7013m6381k9896l4692k4511M8650M4352K3288L7770
16173b9447L674Q528N7388L4466n8315o0785k0687K3664L7952M6118K0454P064
16161G0074j1089p509l6504k0874J07m8935p778P168L1161J1284m4183l7758r724
16148a04560j7762j8569J1956N0433K7721k7988J6607j825r742J0639j7155M0066
16136d0179P7944K2904J432J2536k6390p3910o2052p8306K9144J7949k0678N2189
16124h7417L3255J1062j0020k2937K2544J3399K3312N839l7672j0855Q82J0054
$$ y = [-43496, -31917, -53876, 5344, 59654, 53132, 64788, 108336, 97360, 50534, 17355, -2129, 14679, 22340, -5518, -14473, -6607, -24507, -13143, -59560, -11929, 76976, 61164, 34850, 15264, 20378, 57721, 38986, -48027, -94408, -124304, -158996, -183507, -134857, -90505, -67217, -29447, -25773, -17245, 40143, 74609, 16294, -44491, -65178, -41514, -3562, 42556, 63010, 70074, 58985, 51476, 14972, -5902, -5795, -54730, -62508, -55340, -24179, -12895, -57078, -94836, -104560, -122322, -140891, -128935, -78502, -50781, -78769, -62162, -63987, -73729, -63090, -80245, -40179, 37765, 60669, 62101, 74637, 48247, -25663, -87715, -166021, -136877, -118928, -139606, -87417, -54162, -43100, -53120, -76057, -53513, -40114, -16802, -10963, -48635, -59490, -58608, -48554]
16112d8554j1767n2999l3510L6305P5592M9966j3479j8075l3944l5440K0508K4111
16100d1286K4001L4845k4011m3623N1796J04772q059q6715l3750K0793N2596O1275
16088A12634K3677k2370p6929o2313n0288L0431K4710j6322p614l4585m8809L1984
16076i5794N6446K7695M5427M2633j2172o3030L5464L3725n8969k9692K8015n1678
16064d1930j250Q1158l6568J5443J5673k4064M648p3567P020O5418j1656k694
16052b369L7938J4058m97k1203p7639M3682j2577m3595J3640N208k8767j8814
16040i0935R3459n3470l6229l4817J9529J1132M0015j4197j4719L2451J7897L1284
16028A400J8400k5499K0031j41J1907j8670l0657K0393O7105K7682k0947o1811
$$ y = [-48554, -60321, -113320, -146830, -110525, -34933, 15033, 1554, -16521, -50465, -85905, -65397, -41286, -17285, 17560, -6451, -50074, 1722, 106494, 98435, 11720, -22030, -1237, 51359, 112634, 136311, 113941, 37012, -25301, -75589, -45158, -20448, -36770, -44384, -78969, -127778, -95794, -39348, -11653, 33774, 76407, 64235, 1205, 36669, 70394, 11425, -18267, 9748, -41930, -43180, 37978, 1410, 16853, 32526, 8462, 13110, -60457, -53437, 11981, 325, -2369, 35569, 49627, 49130, 27927, -49712, -6030, -18607, -62202, -48562, -43354, -72121, -90935, 2524, -50946, -87175, -121992, -102463, -91331, -51316, -65513, -80232, -47781, -29884, 1400, 19800, -5699, 14332, 14191, 26098, 7428, -23229, -2836, 64269, 91951, 71004, 9193]
16016I193j2566N4052O4623k7848q509k4063m8742j0867R832j3214J7930L4496
16004D4317M5762j7312q6497p65O5725l9116p0804l3558K1826K7246R293K6928
15992f955P4783j9439l4016J6755Q478j8219l3077l5120l95K6468R592J7874j6953
15979a0224k6230N853P2078l3110m5094k5727K5375N06N4700R622L2299q365r784
15966D1899o6564q627N5626L8768k605K4559J482K3083j00657j06178K6636K5426
15954d7152J7612J1874K0232O612m75N0073M2794P037R70K2134j5384r3997l7613
15941a5283q772M0773Q8050N4445k2019o8607m6335L081j5268l7983P126J8766
15929b026n3793o3162N1061l212l9012Q890L0900N5991J8473K4555K0846K3861
$$ y = [9193, -3373, 50679, 115302, 87454, 78945, 54882, 6140, -4727, 5105, -8109, 9821, 44317, 90079, 72767, -13730, -14495, 51230, 12114, -58690, -92248, -70422, -43176, -33883, -6955, 67828, 48389, 14373, 31128, 39606, 21387, -11690, -46810, -47205, -20737, -11145, 6729, -10224, -36454, -30601, 41477, 8367, -36727, -62454, -37079, -36573, 18127, 27749, 60048, 51683, 41899, -24665, -33292, 22334, 61102, 58497, 83056, 84538, 107621, 6964, -99214, -72578, -47152, -29540, -17666, 2566, 9178, 8703, 58776, 101570, 108607, 109577, 131711, 116327, 22330, -15283, -24055, 16718, 104768, 159213, 137194, 68587, 22252, 25333, 10065, -27918, -20792, -2026, -55819, -118981, -67920, -71132, -110144, -101254, -70354, -14363, 4110, 28665, 49511, 73372]
15917G3372P053O0208j9210l5764l5017l9507N034j8049N447M3794j26o9327m0206
15904f2298l2076l9308N0731K949j8029K8660P2262l3273k7921M7242K1330L4333
15892D4602l6000k9441m269k3137m9762L6947K0540j7834j0504M3192P973j2268
15880b9961L4166j1941l0482q029M8293K7607L3140M6131k754o5345k7200J3613
15868B7238O9537R91n2685P0927n3687m3170j5472k3738k512m8059J438j2813
15856h2005M6200j5019N749L9949M2933R215p9778J1176o063n1607j0438L9779
15844d9909j162K3210k1608l3334o104L8135L6575j4984j464l8572j9112M190
15832h4139L2619j848K9065K5971o569m8419l2371N0239O8984J3571L0727K6501
$$ y = [73372, 80425, 140633, 121423, 85659, 50642, 11135, 16169, -1880, 3567, 47361, 47235, -22092, -62298, -94374, -133682, -82951, -80002, -98031, -69371, 2891, -30382, -58303, -11061, 10269, 44602, 8602, -20839, -25108, -48245, -98007, -61060, -40520, -58354, -68858, -25666, -17693, -29961, 4205, -7736, -38218, -46247, 2046, 29653, 62793, 108924, 106170, 40825, 13625, 27238, 96775, 97766, 45081, 116008, 62321, 19151, 3679, -20059, -22571, -70630, -69192, -82005, -35805, -50824, -45075, -5126, 37807, 47022, -32756, -21580, -27643, -79250, -89688, -49909, -51071, -27861, -49469, -82803, -88907, -50772, -14197, -29181, -30645, -69217, -88329, -84139, -51520, -53368, -24303, 1668, -4901, -53320, -85691, -35452, 33532, 47103, 77830, 104331]
15820A04331p9006m5823P5k4228j5214N6694M4355o879j143K8028M3709j3401
15808I1498q5214l0014K3876m125R576J2086n3445k7804N2221n21k065q264K0771
15795a424l2222o6528k6516K090M2632K9382P0490k0148K1028O5529P561n7859
15783C4015K7094L6006m3872j03136Q017N7852K6733j9987m6118l3217K958j4773
15771f8428j9482L3359L8862k752J2565n096l4380k5908j1077J05842O0130O340
15759H9975P953O652P314p7340m5893N1837L4220o0700k7042O647l0657j4970
15747e2004L6313J2669K2129Q9663j0719q3209Q595K8348N759m0352J5851K6454
15735E9497j0855k9788l7647L1680O7405N965J945k5982o9851l5835O9153J1382
$$ y = [104331, 25325, -20498, -20423, -44651, -59865, -3171, 41184, 34305, 33162, 61190, 104899, 91498, 6284, -23730, 146, -3979, 5597, 17683, -35762, -63566, -11345, -11866, -13931, -22195, -1424, -33646, -100174, -126690, -124600, -81968, -52586, 17904, -2244, 18784, 84313, 91874, 34015, 61109, 97115, 53243, -49893, -41876, 15976, 42709, 22722, -23396, -56613, -53655, -68428, -87910, -54551, -15689, -18441, -5876, -10972, -45352, -71260, -82337, 23505, 83635, 89975, 97928, 104580, 111894, 34554, -11339, 40498, 74718, 14018, -13024, -6377, -37034, -52004, -15691, -3022, 19107, 108770, 98051, 14842, 23437, 51785, 57544, 17192, 33043, 59497, 48642, 18854, -18793, 12887, 80292, 86257, 88202, 62220, -7631, -43466, 25687, 37069]
15723C7069N0343J0845k8064m3578j0327n3759k951k609k2630O9586O5102K7325
15711I6352m5582j2516K2982o2340m7215K1131J6910r156J268L0512l701k0333
15699a1688J0393p862P849P595l1908J5650L62j7271K3093m241l0591m8797L0071
15686e7345L1854J5025N9168l8713o0455m4639N5397M3765K3833j06402k0804
15675i9316q872k562N3737J4031M3228J701n0701j2332K5538k318r83J5481j601
15662b4969n8253l3218L3146L6833o051P838n0356K0652O1123l6347M2270L2830
15650B5498K1157K3771k7391l4375j2454j6771L7492j6239J6890L3451m7828l8346
15638c5145J7328k948m7619l6696K7473J8947p891M0970J9197j9816J4377p180
$$ y = [37069, 87412, 98257, 70193, 26615, 16288, -37471, -40422, -43031, -65661, 3925, 69027, 96352, 50770, 38254, 61236, -1104, -48319, -27188, -10278, -19434, -18166, 12346, 8645, -11688, -1295, -9157, -1308, 6287, -25621, -9971, -9609, -26880, -3787, -8028, -38619, -87416, -57345, -25491, -10466, 48702, 9989, -50466, -95105, -39708, 4057, 27890, -78512, -99316, -108188, -110750, -57013, -42982, 246, 1947, -48754, -61086, -35548, -37866, -38849, -23368, -24969, -83222, -116440, -83294, -46461, -52512, -44674, -95030, -74378, -13255, -49602, -7332, 25498, 46655, 70426, 43035, 8660, -3794, -20565, 16927, 688, 17578, 51029, 3201, -35145, -17817, -20765, -68384, -105080, -77607, -58660, -66551, -25581, -6384, -26200, -11823, -19003]
15626a9003o880J5923J5791J0647O6842L4697n3915r7207l1820L2601L4587r653
15614g390k3003K0424j4187K2783l9596o8066m7824K6756K6800K3835j9580M0061
15602e8987o848o8207j5050L2137O6166j7132K4435K3923p4328M3440P9192O2770
15590I1511J9367l2927j3236J0926l1019l2036q684N443L3147o1816m8345M2352
15578b5317L0979j1377J2043n8739J6918M5788L6291P616J2843p092O581N8438
15566A24972M2801n6623n1283o2269q089l2119k825K7589P3359P2663m9872j17761
15554c9457o586j7464o839K2200J7169n044k7707k1555j1656K8440P797K8430
15542c2272K8305Q9278M520R278J530M628o3391k6002J5027m905r0428M2529N772
$$ y = [-19003, -25883, -9960, 5831, 16478, 83320, 118017, 64102, -33105, -64925, -32324, 2263, -7390, -30393, -9969, -24156, -1373, -40969, -109035, -156859, -130103, -103303, -79468, -99048, -58987, -65835, -134042, -149092, -116955, -50789, -67921, -43486, -19563, -93891, -50451, 28741, 91511, 110878, 77951, 64715, 75641, 44622, 12586, 3902, 9345, 42492, -19324, -67669, -25317, 5662, -5715, 6328, -52411, -35493, 10295, 46586, 54202, 67045, 59953, 66534, 124972, 167773, 111150, 59867, -2402, -10491, -42610, -45435, -17846, 55513, 128176, 78304, -39457, -46043, -63507, -70346, -48146, -30977, -36021, -63728, -85283, -96939, -68499, -60702, -32272, -3967, 85311, 89831, 99109, 100639, 105267, 41876, 15874, 30901, 25996, -64432, -21903, -16131]
15529a6131j9318L7051j0295k3642J0120P3858L0279n935k6543J435Q820p222
15517E2477l8832r094n492K9982N663K714p4826l1161l1797M803P8668P7415K7600
15504H8120o1679l4244j491l9648l8841k0770J4516L9470k6489P630L2541J6134
15492b4751K0562K3580N3342l5639j24033p7816N4335N7011l024O7541M1052J0801
15480F2961q557l5325K866J5009j2642r252l9197m661P493L6739K7934m0358q4501
15467h1491m9235k1115M7198M0824K2440J0515j2806M0323k3040N5935P871n010
15455C2409m0897k8737L0883j9213j2367R508k349R8943k0564o5636l4508l276
15443e5804L3464N7260L1727k0980J1919p332q371L7838k1054J4305O6721K3351
$$ y = [-16131, -35449, 1602, -8693, -32335, -22215, 51643, 81922, 75987, 49444, 50879, 59699, 52477, 13645, 4551, -941, 29041, 34704, 37418, -37408, -68569, -100366, -95563, -16895, 60520, 88120, 26441, -7803, -9294, -48942, -87783, -108553, -94037, -54567, -81056, -73426, -40885, -24751, -4189, 19391, 72733, 37094, -86939, -164755, -110420, -53409, -56433, 11108, 52160, 62961, 54404, 19079, 21945, 36954, 24312, 15060, -24137, -28798, -21305, 15434, 43368, 3010, -81491, -130726, -151841, -104643, -63819, -41379, -30864, -43670, -3347, -26387, 29548, 37419, 32409, -8488, -37225, -6342, -25555, -37922, -28414, -30763, 68180, 47616, -18020, -52528, -55804, -22340, 34920, 66647, 45667, 57586, 50254, 41883, 79721, 58667, 72972, 139693, 163044]
15431A63044n6565m3464n0318n4245M4556N9704P147Q084M4013K039m1533k348
15419H0114L5523l6997k2626k6038J258J4220k4939k8406j4737N678N7671N2157
15407I2878L11o9221m3611k8187q235m0872j1916N5813M2739M405M2143N0305
15395H6552q808p8071m8252L406M1593j4887k7351N8548r486q3549N6555J0854
15383a2896k6621M5688J8842J4442L5520j8636o835l3498j9443l2985K1924L1281
15371A6783J9266J0335K762J8432m7633L719R54M868k0656l3198n9884L8002M4705
15358a545K1833P4863j0523j0257K0803Q55k4199q257j6756k7605p595J0709j4898
15345G428J7231J7838k1044J114J7140k2479j5969L6334n538R135o613n6000n130
$$ y = [163044, 106479, 63015, 12697, -41548, 3008, 62712, 69859, 77943, 121956, 123995, 82462, 80114, 115637, 78640, 56014, 29976, 31234, 45454, 20515, -7891, -22628, -16950, 40721, 92878, 93189, 23968, -19643, -47830, -56065, -96937, -108853, -53040, -10301, -5896, 36247, 86552, 77744, -327, -48579, -45173, -3580, -18467, -45818, 12730, 3244, -80305, -23750, -12896, -39517, 6171, 25013, 39455, 74975, 56339, 49504, 16006, -3437, -36422, -14498, 16783, 36049, 46384, 49146, 67578, 19945, 23664, 24618, 29486, 8830, -24368, -84252, -46250, -1545, 20288, 95151, 84628, 74371, 95174, 96029, 71830, 63573, 46817, 19212, 11617, 22326, 7428, 24659, 42497, 21453, 22567, 39707, 17228, 1259, 37593, 32055, 41190, 34577, -21423, -26553]
15332b6553l0646J4553L0840K5008o8984k6619P3658M3986j6962q105n1262n1046
15320i2132n25M9823O4982K6510l2027q4455m1319M4714r179L6283m2562N2558
15308b7329J3162p501m589m91l3622m6182M1242L0104j3849M475M320K0876L4430
15295A5046m0348J6742R285p1387J0998M1490K9349N1962r4577k3297j4311J6913
15283e2135J1845j0347K1269k6017l9863K2281P0055J2540J066N3500q1073j7381
15271c4260k6328k9289J3951j3543K1101K6246N3851N0176k5470m0948k9626L0069
15259d070l2805N087K1248K1414j0820q097r30m4414J6608N3888J5835l1850m1644
15246d0550M0183j8144j3385K7183n101J3169M2866l1627j0282q01m5834j4328
$$ y = [-26553, -57199, -42646, -11806, 13202, -55782, -82401, -8743, 35243, 18281, 10176, -41086, -92132, -92657, -42834, 22148, 48658, 16631, -67824, -109143, -64429, -73608, -37325, -79887, -27329, -14167, -21668, -26257, -26748, -60370, -106552, -65310, -35206, -49055, -44580, -40260, -19384, 15046, -25302, -8560, 725, -70662, -59664, -18174, 11175, 63137, -31440, -54737, -69048, -52135, -40290, -50637, -29368, -55385, -95248, -72967, -2912, 9628, 10694, 64194, -16879, -34260, -60588, -89877, -75926, -89469, -68368, -42122, 11729, 61905, 36435, -4513, -34139, -4070, -36875, -31788, -10540, 10874, 54, -8043, -8973, -53387, -36779, 17109, 32944, 1094, -40550, -367, -18511, -31896, -4713, -9814, 3355, 46221, 14594, 4312, 3511, -42323, -56651]
15234e6651L8820R1697j2869l7255k2774K7447P9582L7198j8068J5412K9420n5285
15222A16674o2378M2573n2478k7913k5247n9406l1449K9889J2868K7225N3848
15211B4206j6188n7548k8689P5793J9178L2121j7170o7186J358o12o79L8009L0676
15198C3269J201m7773p654J2045k806K9114P591K1484L4382l7076J625J1017m657
15185E1762j2121J2323k9719M3358J2316m4444n0443k8801l9288K2249M544j3882
15173g2146M2087P77L844l2312K1859l4221N8404L0080L3804l1994l8219m2329
15161f0366j4752j4204J00085K0890k9591p378O617j2523k4704J4966p40n7869
15149g9569J0281M2702j1983j7555O79N6756M0678l692R971R034l98j2163k7944
$$ y = [-56651, -17831, 73866, 60997, 23742, 968, 28415, 107997, 145195, 127127, 142539, 171959, 116674, 54296, 96869, 44391, 16478, -8769, -68175, -99624, -69735, -56867, -29642, 24206, 8018, -49530, -78219, -2426, 16752, 48873, 31703, -35483, -34125, -34737, -35416, 2593, 33269, 34470, -13303, -20957, -8912, -11718, 17396, 24987, 46471, 80853, 43777, 45402, 56419, 51762, 39641, 51964, 22245, 65603, 77919, 33475, -16968, -45769, -85057, -62808, -58264, -72146, -30059, -29282, -25438, -57750, -35891, -70112, -11708, 18372, 52176, 20182, -18037, -60366, -75118, -89322, 10763, 31653, 2062, -5316, 1301, -11222, -35926, -20960, -21700, -79569, -69288, -26586, -38569, -56124, -55445, 1311, 41989, 38297, 48268, 57302, 56904, 44741, 16797]
15136A6797n0662j4150o900M614k0240j8642L76N515R466O0638q764j0279L2398
15123A67R437m3033j6249J799k5968O8338K7243k2378L868k1292l898P0019J6054
15110F4107o1972Q031J3023l4649P832R223j6250j1133m1337j8069J0831J03533
15098C3170p904n1113l1176l2485p133m1572j2840j8978L5643N4030L6103K1000
15086b3255n52k4046J5489L5859J168m0538Q5963J6030p809O039o4597m4877N050
15073d0076M3656L5504j9394K2294K272l0539l0324k0606R145O1089q753l874
15061B0394L2565K1661p9020r3403P9420O3647p4762p2078k1309k4623P6240j3073
15049h4341M1984N4113M8063O2497N6222j3985l5124j77151j17120N4544P6765
$$ y = [16797, -33865, -48015, -54915, -50301, -70541, -89183, -88807, -83292, -73826, -13188, -21952, -32231, 167, 9604, -33429, -49678, -47879, -73847, -5509, 21734, -644, 3224, -18068, -21966, 48053, 64107, 2135, 10166, 23189, -11460, -3628, 5595, -10655, -21788, -63125, -81194, -70363, 33170, 25266, -25847, -57023, -89508, -96641, -138213, -151053, -170031, -134388, -80358, -44255, -23255, -23807, -47853, -32364, 3495, 4663, -35875, 50088, 66118, 58309, 64348, -249, -45126, -40076, 3580, 39084, 19690, 41984, 44256, 13717, -16607, -37213, -28068, 33021, 24268, 20394, 52959, 74620, -4400, -97803, -18383, 45264, -29498, -101576, -122885, -147508, -71268, -84341, -42357, 11756, 59819, 122316, 178538, 164553, 129429, -47722, -164842, -110298, -33533]
15038c3533M2721l0895L0079Q321k94r579K1361l8396P445j3003k3142N5361p243
15025I203r1517L308K4300J9384J8216N36j607j6283M1776K6987o604M54L4491
15012F2644R225m6555N5554P9710k1894Q111K0572O1188O201p9380j36441o4994
15000d6059K2400P6453P4684k2491j17344o5915K3645O7649J6195k1930m7999
14989d0712n319L2411l9385l0744M7757J334K0462p699M0826K2045l1368k7618
14977a8010k8250o5627Q002j0561K2107J6058J0018r293lk858L1778P176j3785
14964e3248J3596J3904j4008m6987N4550j6233L2807j6039p3909k6577J5176j3507
14952a30475J4937N8324L4746M826l6j8796k7290K4119J8618m7802k3781K939
$$ y = [-33533, 9188, -21707, 8372, 16693, 16399, 6820, 28181, -10215, -2770, -15773, -38915, 16446, 9203, -82314, -79006, -54706, -35322, -17106, -16570, -18177, -34460, 7316, 34303, 27699, 28153, 62644, 71869, 25314, 80868, 160578, 138684, 146795, 167367, 228555, 234756, 155376, 18935, -46059, -23659, 52794, 127478, 104987, -12357, -78272, -54627, 13022, 29217, 7287, -40712, -46031, -13620, -53005, -83749, -35992, -34658, -14196, -21895, 18931, 40976, 9608, -18010, -46260, -111887, -103885, -114446, -92339, -76281, -66263, -75556, -75559, -78417, -46639, -39463, -53248, -39652, -25748, -39756, -86743, -32193, -48426, -15619, -31658, -105567, -132144, -116968, -130475, -115538, -57214, -22468, -17642, -17678, -36474, -63764, -39645, -21027, -68829, -92610, -89671]
14940h9671Q161O7936r719p406M434K7855k5369k2831K9958M3056J4838r366m3706
14927a1830p523N0107j1673n0681l5500l9463L9024N8106j2264o3919n5223L2744
14915a08095K7927L4030p737P2771o161O764L7234M0500l8165p1664n7910n1787
14903a22293J840Q0902Q1456k661j7969o01n9027k1132j2645M2094k477k0196
14891e2709k5993R323J5984K2959J9812K0362m430j5376k2905L1279K4046O9704
14879I2056n5848m6029q480k101R770n7165J6321K8306K4850N1841N0167o8283
14867C5405n104J2872j2792o2766k3577L6255k5096l9177l0318K9558M3511Q1993
14855D0764p480L598J6158K8300j0010o7676l4275j0065K669K0095J7108l9462
$$ y = [-89671, -81510, -13574, -23293, -30699, -26265, 1590, -23779, -46610, -16652, 26404, 41242, 31876, -11830, -19353, 30754, 19081, -31600, -67100, -106563, -67539, -9433, -21697, -85616, -140839, -108095, -80168, -46138, -53875, 18896, 12735, 19499, 56733, 97233, 59068, -12596, -70506, -122293, -120453, -39551, 41905, 39244, 21275, 20674, -38353, -59485, -72130, -30036, -32513, -52709, -78702, -69379, -53395, -30436, -10624, 9738, 5308, -10068, -32973, -1694, 22352, 92056, 36208, -9821, -18301, -20402, -10632, -67797, -51476, -23170, 1680, 53521, 103688, 35405, 30301, 43173, 30381, -32385, -55962, -19707, -44803, -83980, -114298, -84740, -41229, 40764, 33284, 36882, 53040, 81340, 71330, 3654, -30621, -40686, -38017, -17922, -814, -40276]
14843d0276K856J2875l4833j9228q906L8869N0534P8925P5235L641m4637o9954
14831D5101l585K2870M660m3319J4028m5357n4995r930L8924J021k0938Q312M7246
14818D038M101O4864N7137m823o3884o2932K9954O6265L3516j6589n0969n3018
14806G660j4082k8633J2610L1091J1192J5644q350m5804n6336K5412j9856J4175
14794e5277O7042L2148n6701n0447L6443N0916k5338P438K2191o572J4387m3616
14782g386K8820L6412k8426M9519M580q278k447m5127r9622m3708L2784N6637
14770b6242M8448K2992P1815M8858n3520j6732l4630o7614J0090M2007R42o0541
14758a4127p698J6428m175k3950n4054j5122O2498j5420k2684J2261K8124L0374
$$ y = [-40276, -37420, -24545, -59378, -78606, -87512, -48643, 1891, 80816, 156051, 159692, 115055, 45101, 41516, 64386, 69046, 25727, 39755, -5602, -60597, -70527, -31603, -30582, -51520, -43208, 4038, 8139, 73003, 130140, 125317, 61433, -1499, 28455, 94720, 128236, 111647, 60678, 7660, -6422, -35055, -22445, 8646, 19838, 35482, 27132, -18672, -75008, -49596, -69452, -55277, 11765, 43913, -12788, -63235, -26792, 24124, -1214, 6224, 28415, 21843, 36230, -7386, 21434, 57846, 29420, 78939, 83519, 75241, 72794, 27667, -71955, -115663, -82879, -26242, 22206, 45198, 117013, 165871, 112351, 95619, 60989, -6625, 3465, 45472, 46414, -14127, -21825, -5397, -9572, -33522, -87576, -102698, -40200, -55620, -78304, -66043, -37919, -7545]
14746g545J1057l6307O2293K5207j3980J4938o911o533L0673l0869m6312n2148
14734e6437k2287Q3271O2429J0179n1666o0557k3114M3475L8242j8926k0239l9773
14722e5403K1140N6920K7565k5892p1151N8670M2494N617M1907l3460m2439J5830
14710D1798l8277J9500J2239L6488n711m7135P3538P932l7778o368M071l0227
14698C0070m2916q406K226J5616j2946Q829P0082n406m8262M9083M7206j9577
14686H5599q3005q6740k890L4478K7739N7035O1135l128R196j3342l4920l7828
14674A3329j8250j1140j6073K0571p260j1451Q991K0485M4853K4613K4109m319
14662H8458m1241L4775K0722o0631p5710N166M3376N3109R056k6891p945M9650
$$ y = [-7545, 3512, -32795, 29498, 54705, 40725, 55663, 48752, 42219, 72892, 42023, -4289, -56437, -78724, 4547, 66976, 77155, 25489, -35068, -58182, -14707, 23535, 4609, -15630, -55403, -34263, 22657, 50222, 24330, -46821, 11849, 54343, 59960, 101867, 68407, 25968, 41798, 3521, 23021, 35260, 71748, 66037, 18902, 92440, 100372, 62594, 56226, 60297, 30070, -12846, -21252, -19026, -3410, -16356, -7527, 62555, 57149, 8887, 57970, 105176, 85599, 2594, -84146, -87036, -52558, -24819, 32216, 93351, 90223, 99419, 86077, 51157, 13329, -4921, -16061, -32134, -11563, -18823, -30274, -21283, -798, 44055, 68668, 92777, 88458, 47217, 81992, 102714, 42083, -33627, -28461, 14915, 68024, 77080, 50189, 42244, 91894]
14650I1894J1077o2753o4700L2748L7042j9061M050j6063j1637M7988l4904J559
14638A7240L5788o2911j7735K8130p042l3706l3948K5634Q7959J4465K989K4292
14626H1155n2081J9014J2208N3320J2626l0448r1339l9947j1378o432N6686J02398
14614A05782M9448l6217o3926k5248K196o8855l5879l5029j3247L2524N4508M639
14602b9304K7668N076m7735K9931J5611O2710O1558j6576q968k0231j06836K5807
14590a289O6786l197m877j3068m412N3148l73j9243m2761m6748J9607N7141L2727
14577I3441m1808j01o8859l4833m5727R097n346L0277O3730L0669k2998K0200
14565B7742m4157k4178l9416j0314J7121J7310K661L7839K0655K4231J401J4334
$$ y = [91894, 102971, 40218, -24482, 8266, 45308, 26247, 30297, 14234, 2597, 50585, 15681, 17240, 53028, -9883, -27618, 512, -6530, -40236, -74184, -48550, 39409, 53874, 56863, 81155, 29074, 48088, 60296, 113616, 126242, 95794, 4455, -35492, -46870, -53302, 3384, 105782, 155230, 119013, 55087, 29839, 32035, -36820, -72699, -107728, -120975, -88451, -33943, -29304, -1636, 3440, -44295, -14364, 1247, 63957, 125515, 108939, 99971, 79740, -27096, -1289, 65497, 62300, 57423, 44355, 39943, 93091, 92718, 73475, 30714, -16034, 3573, 60714, 93441, 51633, 51532, -17327, -52160, -97887, -88790, -94136, -63859, -129, 30540, 7542, 27742, -16415, -40593, -80009, -90323, -73202, -55892, -53231, -15392, 5263, 29494, 30895, 45229]
14553D5229O46j8331J7227o230j729O082l6123q748M5177K9165j4299k8375m8384
14540a8693j2040L3490J990L6990r903k2835k2877p1921l3645M7786M3650M3795
14528A5787L5359j7922J9938j9254l6240k2518m517p06l3288n0448m2560l407
14516a59776O4074K4972j4632n616N9163J6263k3631n0634m2117P1094O6669r733
14504c904n7903K2035L7001J9324k8827n082R094l7434O9518j3608o9068J6691
14492d2163N9468R977o3001r410P460K5461N1947N7209M2921m051m0776r7869
14480b827m7829K660j3406M8356R4546L1447p4408l4784r113m3993j02804j6821
14468a68976Q8262M8142L3751j8801j3339k1059k348P4139J324m6642q1799J0786
$$ y = [45229, 45875, 27544, 44771, 38541, 36812, 42894, 6771, -1977, 43200, 72365, 58066, 29691, -18693, -30733, 2757, 4747, 41737, 31834, 8999, -13878, -85799, -119444, -71658, -28008, 15787, 51146, 33224, 53162, 33908, -2332, -24850, -29367, -30073, -63361, -113809, -156369, -159776, -95702, -70730, -85362, -90978, -31815, -15552, -39183, -89817, -131934, -60840, 5829, -3904, -61807, -39772, -2771, 16553, -12274, -17356, -8262, -45696, 23822, 10214, -58854, -42163, 17305, 27282, -35719, -45129, -37669, -12208, 39739, 96948, 139869, 135818, 95042, -2827, -50656, -47996, -61402, -13046, 81500, 112947, 38539, 3755, -5358, -49351, -152155, -168976, -80714, -32572, 1179, -17622, -30961, -52020, -54368, 19771, 21095, -25547, -107346, -96560]
14456i6560O3073N2520J0222q757K307j5313P603L1210k6403k0402K099O2697
14444F4296M6828j0179n974p368J7294p864m7062k5701K0225k6402R04K9589m6258
14431B328p7254O877P5830J21678P0371q8372p8993j4054M9547l523n3694O038
14419A6779O1672m3675k860n253l1659n2600O050K0249L3690R184J1995N895m180
14406B5287J6954M5255K0708q350q2384n0092n3151m9841P1238J08166L2771P745
14394H4306k2999l3447P8093M964K8678L8122J898J0283L5596O0209J28126K80311
14382F94140L52160K86722N2249j58904k08507k31921j85825j33983j04340j45837
14372B15954r9309J8238P4079n159j2498j8373m1684K7533L5283j01274o2752
$$ y = [-96560, -33487, 19033, 29255, 20498, 22805, 7492, 15095, 46305, 19902, -500, 1599, 64296, 111124, 100945, 94971, 87603, 104897, 97033, 49971, 24270, 44495, 18093, 18997, 48586, 2328, -74926, -68049, 7781, 129459, 199830, 111458, 32465, 18411, 67958, 64435, 10741, 16779, 78451, 34776, 31916, 26663, -4996, -57596, -51546, -31297, 2393, 11577, 23572, 29467, 25287, 42241, 87496, 108204, 99854, 17470, -32622, -85773, -135614, -64376, 43790, 76561, 84306, 61307, 27860, 105953, 110917, 139595, 177717, 179615, 189898, 225494, 285703, 413829, 694140, 1046300, 1333022, 1385271, 1226367, 1017860, 785939, 600114, 466131, 361791, 215954, 116645, 134883, 208962, 203803, 191305, 172932, 131248, 158781, 194064, 92790, 30038]
14361C0038M2435j0611n4145J6028P1344K3459o4935J4222J0743l5539k837K2924
14349F3126N3441k6904m3229q4952K8799M4759J6082K0743j9739n783j0456N2321
14337H8208K2760j3239M3441P5766R8208R8309J12372J85936K67219L84221O15191
14326A978392M35674J00941j94890l74598m24437m33975k63807j84460j78386
14317D60454j20865r1493j27746K025j5564M5253k9961M9123j3214o737J5803
14306A67078m3975l381M12M4075o4886m8401Q534K8106M2221j4415k3835M427
14294I5960L6557M1489k4323l7730O0k071J7418J0558n1569j0116K7930j0490
14282I3673k2332K3251N2181J4166N7422o023J2371M6914J09726K18971K77761
$$ y = [30038, 72473, 61862, 7717, 23745, 95089, 118548, 53613, 67835, 78578, 43039, 40202, 63126, 116567, 89663, 46434, -38518, -9719, 35040, 51122, 71865, 52126, 46343, 35887, 88208, 110968, 97729, 141170, 216936, 315144, 413453, 525825, 711761, 978980, 1363201, 1978392, 2414066, 2515007, 2320117, 1945519, 1521082, 1087107, 823300, 638840, 460454, 339589, 248096, 120350, 122375, 106811, 152064, 122103, 171226, 158012, 151275, 167078, 123103, 119722, 120134, 164209, 99323, 50922, 59456, 87562, 129783, 115368, 91533, 95960, 132517, 174006, 149683, 111953, 112013, 109942, 127360, 137918, 86349, 76233, 104163, 93673, 71341, 94592, 146773, 160939, 218361, 212338, 224709, 271623, 381349, 600320, 878081]
14271H78081L55328K99715K4419k63127m02763l17470k10772j0756l7244j1799
14261C03612p4878p5162k0313o2136K933Q856o8802k6970J5956l778j1664j004
14249a3350K5742J6920n5203m124L045O9069N0188r968k2261J9474l8443j4918
14237B6171M691N94n152J6516o5040L5082l3763q333o591L5311N7702L7738n3739
14224D1187n6835L6811N799L9021l0781J3631p429J4645J5577K2935M8224K5861
14212A68646k0980o6175O411j708j6635l9924k9343M2216J4667m743P8720J9980
14200A51132q8954m5002M7267J7787J6788l3190l1592k4702l7898j6353K5782
14189a8935N3063m8306k6645n1736J1667K8656P6120K8131P547K6829n2892m603
$$ y = [878081, 1233409, 1533124, 1557543, 1294416, 891653, 574183, 363411, 352655, 315411, 303612, 228734, 153572, 133259, 71123, 74056, 82912, 14110, -12860, 3096, -682, -12346, -13350, 12392, 29312, -25891, -30015, -26970, 42099, 92287, 82319, 60058, 79532, 41089, 26171, 30862, 31456, 26304, 42820, -22220, 12862, -20901, -29234, -35825, -514, 57188, 94926, 41187, -15648, 21163, 26962, 65983, 35202, 48833, 41404, 56049, 71626, 94561, 142785, 168646, 147666, 81491, 87902, 86194, 69559, 29635, 292, 42508, 57175, 52432, 131152, 151132, 62178, 17176, 64443, 82230, 99018, 65828, 34236, 9534, -28364, -44717, -18935, 34128, -14178, -40823, -92559, -80892, -52236, 23884, 52015, 59562, 86391, 33499, 28896]
14177B8896L6847K7312j9391O713k9256J2025L200M9989l452k5564J3545K5988
14165A26852O6772J2558J13474R1378m9606n7380m9902l3123o8858q4439m6873
14154B0853L1697n051j9852J0588L3718P0040p818m6887r3129n3561J8659L7669
14142c074M3995O1611O3960k8055p2419j7304N3663J0291m886m6839j9665j709
14130C9569M6222P4096j1213k2132k6489j1286N591M5677L7185n8143l4604j2186
14118G2287q171M5606M1680J1710L5080J3064M2805L9521j6791J30077O6320k9241
14106D43947j00879j02634l4934o5635o1556k1409n6902L5664P6181J1336K6306
14095A49485n072l1781j297J917n433R273M4955N7812J9025o761K7154M2417p3936
$$ y = [28896, 65743, 93055, 73664, 80377, 51121, 63146, 66346, 116335, 112883, 87319, 100864, 126852, 193624, 206182, 319656, 411034, 361428, 304048, 254146, 221023, 152165, 67726, 20853, 52550, 47499, 27647, 38235, 71953, 141993, 134175, 87288, -5841, -59402, -40743, -3074, 40921, 102532, 166492, 138437, 66018, 48714, 102377, 112668, 107782, 60943, 41278, 39569, 85791, 159887, 148674, 126542, 100053, 88767, 94358, 140035, 177220, 119077, 84473, 72287, 64116, 109722, 151402, 163112, 198192, 211256, 254061, 293582, 276791, 406868, 473188, 443947, 343068, 240434, 205500, 139865, 78309, 56900, -2, 35662, 111843, 123179, 149485, 144413, 112632, 111335, 113252, 107819, 117092, 162047, 219859, 238884, 232123, 259277, 301694, 227758]
14082B27758m1678j9380o5483Q1144J35937P9770J6435M81J6492O0454J19435
14071F11365J67636J97695K26146M62234P65145R17388O44112L8267n62745p86026
14061B681217p80414n15832l79426k37902j11629k4164k6851o9610k5452k1770
14051D88167o3629l5425n6098m9688J301j4062j2811K6375J16665O9100l1432
14040D38463q7039j2004N4671M1263j2419m7760j8361p558o8900k0929M069j6167
14028B47329l5856q634L6681J6980L2801N4518R0144O9209J10388J02602J04909
14017H21071K13928L01522L83565M67031O59703J219468J712646J614053M80605
14008G873592m03006r22525j384236j213060j046906q62432m77622k86790k61832
$$ y = [227758, 186080, 166700, 101217, 182361, 318298, 398068, 414503, 414984, 431476, 491930, 611365, 779001, 976696, 1202842, 1665076, 2430221, 3347609, 3991721, 4029988, 3467243, 2681217, 1900803, 1384971, 1005545, 767643, 656014, 631850, 604999, 535389, 509937, 488167, 424538, 389113, 333015, 283327, 284628, 270566, 257755, 284130, 400795, 469895, 438463, 351424, 339420, 394091, 435354, 422935, 375175, 356814, 349256, 280356, 259427, 263496, 247329, 211473, 202839, 239520, 256500, 289301, 343819, 433963, 503172, 613560, 716162, 821071, 1034999, 1336521, 1720086, 2187117, 2846820, 4066288, 5778934, 7392987, 7873592, 7470586, 6548061, 5163825, 3950765, 2903859, 2041427, 1563805, 1277015, 1015183]
13999A015183j63039p5128p7656o7503n8119p2779k0423l9658J8297M7221M925
13988E11321L2631L1174K6343Q8416o080l0785k970r409k2064r358j7251k9783
13976E62185q1110L2433N1551m156p6888l5961m4609J9831N0486M3424J10267
13965F27453J45078J32737J17942L4662O1846M7436J70496K68043M47556O59834
13955B713083R53732R78886L65563l61391p84943q74435p78758m15943k02733
13946A593061j18680M2879k8857j01599o170L4379R7764J07781O3230J05522J21629
13935A910939J93190J74663J66688K08263L34255L32978L59781M57591N56689
13926D695037N41393N30572P34109R64184J230309J611402K197212L115438M284596
$$ y = [1015183, 852144, 777016, 699360, 631857, 573738, 500959, 480536, 440878, 459175, 506396, 511321, 543952, 575126, 601469, 689885, 683805, 653020, 650050, 640641, 618577, 609219, 591968, 562185, 481075, 513508, 565059, 560903, 484015, 448054, 403445, 423276, 473762, 517186, 627453, 772531, 905268, 1023210, 1057872, 1119718, 1167154, 1337650, 1605693, 2053249, 2713083, 3666815, 4645701, 5011264, 4649873, 3864930, 2990495, 2211737, 1795794, 1593061, 1474381, 1517260, 1488403, 1386804, 1380634, 1415013, 1512777, 1620558, 1683788, 1789310, 1910939, 2104129, 2278792, 2445480, 2653743, 2987998, 3320976, 3680757, 4138348, 4695037, 5236430, 5767002, 6501111, 7465295, 8695604, 10307006, 12504218, 15619656, 19904252]
13917A9904252N683942P231657Q949015J2008933J8526820L1758349N1672321
13910A55735289O1376522L9338893m610735m2969011n5468474m8631418l3223427
13903G1547639j9495626j1074990o873232m537646l151189k753527l171095l189693
13895A7300641k904911k312205j569128r59865n08969n9055N0322q3194m68463
13886H485173o78397o87848n44258l12691n3871P0654O4530J48593K16353L58329
13876G066567M54761N05349P16281Q03552Q34693J001535J209862J434559J871517
13867A5898676K402948L105379M227318O063855Q430069J0902286J3942764J7511796
13859H2485091K3950773L7250760O2571149R9901547J13537145N8662763p297732
$$ y = [19904252, 25588194, 32819851, 41768866, 53777799, 72304619, 104062968, 155735289, 217111811, 256450704, 251839969, 208870958, 153402484, 104771066, 71547639, 52052013, 40977023, 34103791, 29566145, 26414956, 23661429, 20490334, 17300641, 14395730, 12083525, 10514397, 9554532, 9045563, 8986508, 9036830, 8953636, 8485173, 7806776, 7118928, 6574670, 6261979, 6208108, 6278762, 6343292, 6491885, 6708238, 7066567, 7521328, 8026677, 8742958, 9546510, 10381203, 11382738, 12592600, 14027159, 15898676, 18301624, 21407003, 25634321, 31698176, 40128245, 51030531, 64973295, 82485091, 106435864, 143686624, 206257773, 306159320, 419696465, 478359228, 471061496]
13852D71061496m4001189p8031589q8255086p4397214n6171737l6306495k1817130
13845G2081056j4172479j0398453q176595o605519n214795m073746l268613k539275
13837A7631581j699249r24945l05782k17471o88141r74612j114170j305642j081320
13828I320249q65629o84801l94296k29982j80070j54557l5083J9157J34813K70998
13818G200799L75174M95471O44370O61417P50294J016480J294092K022329K933162
13809A7393588M214694M895967M906282N747475P247532R535046J4012214K3124348
13801I1077146M0403898O4071650O9170851L0121502k5724741n8639243o3383826
13794A47097237m9333837l0545555j7224986j0209657o948106n555670m733473
$$ y = [471061496, 427060307, 349028718, 260773632, 186376418, 130204681, 93898186, 72081056, 57908577, 47510124, 39333529, 32728010, 27513215, 23439469, 20170856, 17631581, 15932332, 15007387, 14701605, 14484134, 13795993, 12821381, 11707211, 10401569, 9320249, 8454620, 7769819, 7375523, 7145541, 6965471, 6810914, 6775831, 6794988, 6929801, 7200799, 7575973, 8071444, 8715814, 9377231, 10127525, 11144005, 12438097, 14460426, 17393588, 21608282, 26504249, 31410531, 37158006, 44405538, 53940584, 67952798, 91077146, 131481044, 195552694, 264723545, 294845047, 269120306, 210481063, 147097237, 97763400, 67217845, 49992859, 39783202, 32835096, 27279426, 22545953]
13787B2545953l939956l173748k440043j890887j411121j017864p29871l27680
13779G614783N395n9565m95113q45753q97229q60114n75885l54125k69392j94220
13769C068782k19410k41067k38129j53930j19160j02212k5905p2444j03940p4398
13759A718187l5476R716l4869k4419j32374j11309K2480p9830j06043p3756n0229
13748A102078q0424j5736L3749Q181r3074o4339J6042j9069l1128j8931K6564
13737H63913o682m6586j5619k7211K439N708n3604L3920n9366n7109q5927r6765
13725D57111L7281P792o1576j0327l3820K6591N2505M141K5973M7211j9279K2869
13713E56472N3701m647m0838m165k1086l9512L3144l9941l5091P2115O2020Q1335
$$ y = [22545953, 18605997, 15432249, 12992206, 11101319, 9690198, 8672334, 7942463, 7614783, 7620178, 7560613, 7065500, 6219747, 5322518, 4462404, 3886519, 3532394, 3263002, 3068782, 2849372, 2608305, 2370176, 2216246, 2097086, 1994874, 1968969, 1896525, 1792585, 1718187, 1682711, 1692427, 1657558, 1633139, 1500765, 1389456, 1411936, 1332106, 1226063, 1152307, 1102078, 1021654, 1005918, 1039667, 1047848, 954774, 890435, 906477, 887408, 856280, 837349, 863913, 857231, 810645, 795026, 767815, 770254, 775962, 722358, 756278, 696912, 639803, 553876, 457111, 494392, 502184, 440608, 430281, 396461, 423052, 475557, 479698, 505671, 552882, 533603, 556472, 610173, 605526, 564688, 560523, 539437, 499925, 533069, 493128, 458037, 530152, 592172, 673507]
13701F73507J29765J46346J9363r2812j43771q2143q2235p0591n6736m8607K699
13690C94785j1177p5645n0415O0421L6815m0603M2611j7615j2576O190k4170L084
13678C11705N3311K5936K3441o4239n3276n3460l5447k3346n219k8236n4907P3383
13666A69646Q5390Q765o9084K3477P4M2652M2752j6657j9Q843J4473o453o2515
13653B41344k7957L2767p770O3307o3612m1800j10069k4579M4583M2509J6197
13642A64920J7222j4239J3129K9245J3148P59J2525p353J0897k8308m8796j7494
13630A45655o533J6605L1739k2046l6086l6994n1447L4920j598K3665k1912l834
13618G2134M7883M0873L6799K1246K7519l504m2333J2134k8110N3696K4908l2574
$$ y = [673507, 803272, 949618, 968981, 876169, 732398, 650255, 568020, 497429, 440693, 392086, 394785, 383608, 307963, 257548, 317969, 354784, 314181, 356792, 339177, 326601, 332791, 308621, 311705, 365016, 390952, 414393, 350154, 296878, 243418, 207971, 184625, 179406, 151170, 96263, 169646, 255036, 263801, 194717, 218194, 218268, 260920, 303672, 287015, 286996, 295839, 310312, 303859, 241344, 213387, 246154, 238384, 301691, 238079, 196279, 86210, 61631, 106214, 148723, 164920, 182142, 167903, 181032, 210277, 223425, 224184, 236709, 229356, 240253, 211945, 163149, 145655, 139122, 155727, 187466, 165420, 129334, 92340, 40893, 75813, 74215, 97880, 75968, 72134, 120017, 160890, 197689, 218935, 246454, 242950, 200617, 212751, 184641, 238337, 263245, 230671]
13606B30671j4651k1377L3870M949n7898K0691n49J6035J7262j0911n4048k7120
13594A36924l5123k479k970Q89J9060K5813O1775J7616L129K1577o8037p1612
13582A06562r571o785l0568K5654K9112O8467k4844p6543k3804N2706L910J2489
13570A26785K4065K421q662mJ4227n4354m6594j9719M734L319M4267O7940O1875
13557B20300j9979j1717j5307o8650K1654K7132n8423q700L8439M6575J1985l3892
13545A49417q9716k2202k0140M609j523O441J840m336J9413R1310Q3770k2964
13533A95919l6692l4687J2139j2891k3111J3977M0717j1974n6361k9369L335K4223
13521H5225j0016K3839j1317M2546L6640j762k4544l9575O1930M0399P097n9092
$$ y = [230671, 216020, 194643, 228513, 233462, 175564, 196255, 195706, 211741, 229003, 218092, 164044, 136924, 101801, 99322, 96352, 97241, 116301, 142114, 203889, 221505, 224634, 246211, 178174, 106562, 96991, 90206, 59638, 85292, 114404, 182871, 158027, 81484, 57680, 110386, 114296, 126785, 150850, 153271, 144609, 144605, 158832, 104478, 57884, 38165, 42899, 46218, 90485, 158425, 220300, 200321, 188604, 173297, 104647, 126301, 153433, 95010, 86310, 124749, 171324, 183309, 149417, 59701, 37499, 17359, 21968, 20445, 26886, 28726, 24390, 43803, 135113, 218883, 195919, 159227, 124540, 136679, 123788, 100677, 114654, 155371, 143397, 87036, 57667, 61002, 85225, 75209, 99048, 87731, 130277, 166917, 165155, 140611, 101036, 162966, 203365, 210462, 151370]
13509A51370l1032n0943P280R038o9173k4589P3832L5700M1756N9717o3239o7259
13497G2458m1981q440K5913P869k0763j8879m8776Q0321K1864l3080L92k0464
13485A6434O4883K9279j6770l5934m002j2594l9982K1424O9200l0028j8671j1463
13473C1776k1752M0451K1319n838N5950M0733k273n5932Q076M3759l6569o442
13461A13258j5024k2110m9103J7608O046J0997K7604L6245J7275l6238o348p8412
13449B1798m3941j0372K5173M4491J7314N0666M7619J5163k0709l9756k4819K3354
13437A05981Q6919P7607N2922N3908R4155J14059J75124K62964K59636N7506j57611
13426A183170k30412k98007k53548j35895L0668k1229p3873L9560j9510p6362
$$ y = [151370, 120338, 69395, 76675, 85713, 16540, -8049, 65783, 101483, 143239, 202956, 139717, 72458, 30477, 22037, 47950, 55819, 35056, 16177, -32599, 47722, 69586, 36506, 36898, 16434, 81317, 110596, 93826, 57892, 53890, 41296, 1314, 22738, 91938, 61910, 43239, 31776, 10024, 50475, 71794, 65956, 121906, 162639, 160366, 104434, 112510, 156269, 119700, 113258, 98234, 76124, 27021, 44629, 50675, 61672, 89276, 125521, 142796, 106558, 100210, 21798, -22143, -32515, -7342, 37149, 54463, 105129, 152748, 167911, 147202, 107446, 82627, 105981, 192900, 270507, 323429, 377337, 471492, 585551, 760675, 1023639, 1283275, 1340781, 1183170, 952758, 654751, 401203, 265308, 295976, 274747, 200874, 240434, 220924, 144562]
13416A44562L4935m8513q8164M8146Q7019j0028q8867j0824l9279m2719l9992
13405e3724j8965O2164O0838p021J681k0363Q277j3958R136O6257R362m9700J9655
13392G3639K8642k3565L1081k3522J2348K0018k8893K2971L8400M8652K3337M5329
13380B68437J05981J25347K35907L10447M69820M89512K49399o686j49909k73519
13370A824736l75631l81843l26976j75613j26061q1050j12257m2625r0423n2582
13360E9675N9391k919K4824o1975N1498K8294M6628j3102k5730K7532q4582j3390
13348I6144j371j647n5273l1949L3396L7988j1189l7585K8744K9063n799K0524
13336A01046M3057m9907l0348P656P2701j4938l488N4227P7669Q5174K1811k2150
$$ y = [144562, 179497, 130984, 42820, 90966, 177985, 167957, 79090, 68266, 28987, -13732, -53724, -72689, -10525, 50313, 43292, 44973, 24610, 32887, 18929, 28065, 94322, 103684, 53984, 73639, 102281, 78716, 109797, 86275, 98623, 118641, 89748, 112719, 151119, 199771, 223108, 268437, 374418, 499765, 735672, 1046119, 1515939, 2005451, 2254850, 2248164, 2098255, 1824736, 1449105, 1067262, 740286, 564673, 438612, 357562, 245305, 202680, 112257, 59675, 119066, 116147, 140971, 78996, 130494, 158788, 205416, 192314, 166584, 194116, 109534, 96144, 94773, 93126, 37853, 5904, 39300, 77288, 66099, 28514, 57258, 86321, 80522, 101046, 144103, 94196, 63848, 71504, 144205, 129267, 125779, 180006, 257675, 342849, 364660, 342510]
13324C42510j6817N2473J32197K02571L32883L03042J39718j01748k70778l06530
13314H09521k24241j82752j34130r8902j2376j3291P043j7593j5668m7108k4793
13303D5710M8839j8042m5151J1501R2154M2077K3862k1803L190m8093q5442k7239
13291B1563M4315M1325l6531q82l3014K0082O5713n0213o460J0519M6006n1455
13279G0968k8617o0740l736M3978R723L1407j8287m4204P950N2366m228L437L1943
13266I1960j7605k1421J6376M237k0214m5805J6376J8577K226k4558K5367K7233
13254G2749q943m8989l4447K471m9319j5084P3730J8107j3851Q5361n261m0522
13242C6002o1590p2560j5389N2791K6952K8690M223l1362O5430L0235K7603J7024
$$ y = [342510, 325693, 378166, 510363, 712934, 1045817, 1348859, 1488577, 1386829, 1116051, 809521, 585280, 402528, 268398, 169496, 157120, 143829, 150872, 133279, 117611, 70503, 45710, 94549, 76507, 31356, 42857, 135011, 177088, 200950, 179147, 182337, 134244, 48802, 21563, 65878, 107203, 70672, 69790, 36776, 56858, 122571, 72358, 65898, 76417, 122423, 70968, 42351, -18389, -22125, 21853, 31576, 62983, 44696, 492, 8442, 60808, 56580, 60017, 91960, 74355, 52934, 69310, 73547, 53333, 7528, 23904, 42481, 44707, 20149, 45516, 72749, 63806, 14817, -19630, -17159, -66478, -81562, -7832, 10275, -3576, 81785, 76524, 36002, -25588, -98148, -113537, -60746, -33794, -5104, -881, -32243, 33187, 63422, 91025, 108049]
13230A08049l008q4335m4023k1331Q912K2944J2525J10r131N7004k0337l9980
13218a2601o6568J1446K5728M6598j5158m6207J3817N1578r889k2011n8986r457
13206i1710O6767L2186r764j3062P479o676m083M2233o6183m6097K666L5885O8784
13193A8425N4174M5158j4611j07548l8233p031L059M8182K7143l6761p275j2560
13181b7878n197L4691k3909P713j1336j0384P8538k7352J5982n5259L4144P1615
13169H1368P3043j5163n3231k8667n0743O584L9143l9935l1049K5458l8128j274
13157c2594M6007m7955n8059N4616M5306J8872J3223l823n830J0847M541k5265
13145A9886j9871j436k5146K3943q940j3801j3225k3491K2976l6211J5205j477
$$ y = [108049, 105041, 20706, -23317, -44648, -35736, -12792, -267, -157, -9288, 47716, 27379, -12601, -79169, -67723, -41995, 4603, -10555, -56762, -42945, 8633, -1256, -23267, -82253, -91710, -24943, 7243, -2521, -15583, -8104, -14780, -18863, 23370, -42813, -88910, -86244, -50359, 18425, 72599, 117757, 103146, -4402, -42635, -49666, -46607, 1575, 28718, -8043, -15318, -27878, -33075, 1616, -22293, -14580, -25916, -36300, 42238, 14886, 30868, -24391, 9753, 81368, 154411, 139248, 86017, 57350, 6607, 13191, 52334, 12399, -18650, 6808, -31320, -32594, 13413, -34542, -92601, -37985, 7321, 26193, 39416, 35593, 29763, 40610, 45151, 19886, 15, -1421, -26567, -2624, -11564, -25365, -38590, -62081, -39105, -75316, -60111, -61588]
13133f1588O922K2916J0344P923n519R148m7136M0163o600l6324J1208R34l0314
13120g7923j1897K3575l1283O4308J4974q248l0059K5231j5637j2564j1633N4930
13108a6226O9763K58l6108j4449k9304n690L5838J9736K5371j3122n5920l8388
13096e8241M0554K0171L0553M7832k4437j447n909o0297N995j5985P541K7676
13084A4006k8370M1560O4719k9084k0567p473m5803O0638k1443k6634m530j0207
13072a3188L5327m482m5219O949m2312K6338L2119j0847N957M144j8302P3338
13060D9822K6775n9014Q312j7355K6756L9777l5106k8446J6751K1727J3900n0246
13048A3653m199J5166k5213l9782M562M6099K5831l790k2027k8111m215j8273
$$ y = [-61588, -54666, -31750, -21406, -13483, -19002, -9854, -56990, -16827, -23427, -59751, -48543, -47609, -77923, -89820, -66245, -97528, -33220, -18246, -26494, -56553, -31322, -46959, -59523, -71156, -16226, 53537, 53795, 17687, 3238, -26066, -31756, 4082, 23818, 49189, 36067, -19853, -58241, -17687, 2484, 33037, 80869, 56432, 54985, 49076, -11221, -5226, -21211, -13670, 14006, -14364, 27196, 91915, 62831, 42264, 34791, -11012, 49626, 28183, 1549, -2981, -13188, 22139, 17657, -27562, -20613, -62925, -36587, -4468, -15315, -9358, -5214, -23516, 49822, 76597, 17583, 25895, 8540, 35296, 75073, 39967, 11521, 28272, 49999, 63899, 13653, 9454, 24620, -593, -40375, -35813, 10286, 36117, 32327, 10300, -17811, -22026, -40299]
13036d0299m0002K178M8909K9594L9911J063o1729L8059J159J3729o228j1486
13024A4858m5129p792K1734l9238M0601K9890j3521l0708k9704k2954K4222J1738
13012d6003m5823J0021K3259l1670j0893k184M459M6296M0739j992m6321N5361
13000d751L8291P169j6995l8180n047m4521m8377L7971L0210L2289Q334l0532
12988c4139Q507J8856j4293o7819r20o686L6024J6436k6168n0173J0768L0132
12976g9475L8449o145J5996m0472q4030J127M3075O1431M4010N2975o2490n4316
12964f9865K4017J6765L4906n2265n3075K1287O636M3250R0023p729k2501m8379
12952a6930Q638K0086K6054m44L0656p285J1092m8490j6967q2917K6577R9344
$$ y = [-40299, -80301, -78123, -29214, 380, 40291, 41354, -20375, 17684, 18843, 32572, 26344, 14858, -30271, -38063, -16329, -55567, -14966, 14924, 1403, -29305, -59009, -81963, -57741, -46003, -91826, -81805, -58546, -90216, -101109, -103293, -98834, -52538, -11799, -13791, -60112, -4751, 33540, 40709, 23714, -14466, -19513, -64034, -112411, -74440, -44230, -11941, -3607, -34139, -25632, -6776, -21069, -88888, -89808, -96494, -60470, -44034, -70202, -120375, -109607, -79475, -41026, -47171, -31175, -71647, -155677, -154550, -111475, -50044, -6034, 46941, -15549, -69865, -45848, -29083, 5823, -46442, -99517, -78230, -71594, -28344, 61679, 53950, 31449, -16930, -8292, 11794, 37848, 37404, 68060, 60775, 71867, 23377, 6410, -76507, -49930, 49414]
12940D9414L8529J5550L2180n4531o7731m9193J9139O2296j7541k4077k5583l8134
12928e9682J5721j4994k5073p40O0643L0510Q047L2058p0996n6401M78Q626k4521
12915i6324N321J0860k09O72R4081N115Q931j235k2146n036n0061K7969L7345
12902A5283O1210R304M3092P4736n4224k8276j24j22524n6929L7605k085L5651
12890A2719l8974J6183P399L409Q0027l2866O450J042k2178j0487m6569k4052
12878d7897k0913M7698Q1947j0006m5663k693M0862j5195k3946k7108K3378L5944
12866C6408R882P111j5964k2511L3118K4887o6556J4249p319k42k932n4180p7217
12853a21266K5380n717r403K1195L5158J2044K2185L5501o2923p2461O5580R0216
$$ y = [49414, 87943, 103493, 135673, 81142, 13411, -35782, -16643, 45653, 28112, 4035, -21548, -59682, -43961, -58955, -84028, -84768, -24125, 6385, 14432, 46490, -24506, -80907, -80429, -71803, -96324, -91003, -80143, -80352, -79680, 14401, 19516, 28447, 27212, 5066, 30, -50031, -22062, 15283, 76493, 85797, 128889, 203625, 149401, 121125, 121001, -1523, -58452, -20847, -22932, 12719, -26255, -10072, -2673, 736, 80763, 47897, 54347, 55389, 33211, 22724, -23845, -47897, -68810, -21112, 60835, 50829, 5166, 2473, 43335, 28140, 4194, -22914, 464, 36408, 46290, 53401, 37437, 14926, 48044, 72931, 6375, 20624, 13305, 13063, 10131, -44049, -121266, -95886, -101603, -111006, -89811, -54653, -42609, -20424, 15077, -47846, -120307, -54727, 35489]
12841C5489n555l9043L6113j1019k2335J1561L701p478k7981j3002J4576k858
12829b7831l02L1776K4929N3403L1359o465o5271p2298k5594M2449J2198L6012
12817C4365M0366K6718j8594l0436n4444k9875R1086O559j4260k6865j2079K5874
12805C8415m8626K0018j5207L2575J3679l980j6519l5516N154J1018L8212n2883
12793a3660j3144K3849J0503m3042m1304m6887J2371j5179j2619J5158L7836k8283
12781a14401L070Q8760K8042p482J2213Q0159l4836J6434p1359m976L2680r615
12769A8689l1832n0088K8205K2591m8709n9493O2280q961K1807N2282L2553n6313
12757a6989j2131m4455n0865M9084m076J7108j5014M3352J7494K7921K7724l7423
$$ y = [35489, 29934, -9109, 27004, 15985, -6350, 5211, 8912, 1434, -26547, -39549, -24973, -27831, -28133, 3643, 28572, 81975, 113334, 106869, 41598, -30700, -56294, -13845, -1647, 34365, 74731, 101449, 82855, 52419, -2025, -31900, 59186, 65745, 51485, 24620, 12541, 38415, -10211, 9807, -5400, 27175, 40854, 36874, 20355, -15161, -10007, 1011, 39223, -13660, -26804, -2955, 7548, -35494, -76798, -123685, -111314, -126493, -139112, -123954, -86118, -114401, -111331, -22571, 5471, -2011, 10202, 90361, 55525, 71959, 600, -4376, 28304, 18689, -13143, -63231, -35026, -12435, -61144, -120637, -58357, -67318, -45511, 6771, 39324, -16989, -29120, -73575, -124440, -75356, -79432, -62324, -77338, -33986, -16492, 11429, 39153, 1730]
12745A730n6136N270L3222j6720k3525N088K5141K3116j3412m2964P1994K9936
12733D2740o0059j9740L928j5154m5672j5627l1632J0386K6273O6701J6982O5077
12721D4203N1961q222j5285l8481J4206M5379Q297o1398l3482K527J5070l0190
12709e415o3913K6891K8735K3359j4590j9057J7251r282L7348L9451q9422o6265
12697i4909R745L7582k6880J5230O7332K7551K5356o945K4889p6517J266K7864
12685C1564o633j98L9198m70m4684j2112j7315J1365K4035l5620j1155J2004l2230
12672d2251J1054J5468l726O0899J00663k241l6051L166K1261K928j4180p0144
12660D6846j9661M673k3919k585M0221j2130l2267m3606k2630L7124M2365M8512
$$ y = [1730, -54406, -49136, -15914, -32634, -56159, -51071, -25930, -2814, -16226, -59190, 12804, 42740, -17319, -37059, -33131, -48285, -93957, -109584, -141216, -130830, -104557, -37856, -20874, 44203, 96164, 87942, 72657, 34176, 48382, 93761, 102058, 40660, 7178, 9705, 24775, -5415, -69328, -42437, -13702, 9657, -4933, -23990, -6739, -16021, 21327, 60778, -28644, -94909, -85164, -47582, -74462, -59232, 8100, 35651, 61007, 54062, 78951, 2434, 3700, 31564, 24931, 24733, 63931, 63461, 18777, 6665, -10650, 715, 24750, -10870, -22025, -10021, -42251, -31197, -15729, -19455, 41444, 142107, 139866, 103815, 106981, 128242, 131170, 116990, 46846, 27185, 31858, 7939, 5354, 45575, 33445, 1178, -42428, -65058, -27934, 14431, 62943]
12648F2943K3851j9073l6248j752R898n309p4647k8852j5036J9442Q7273K9583
12636E2073l7088l8172l9482j3043J7228j9328q519O3600L4877M0931l2891l89
12624A9797R409j1217M8110J697k2370k901k063k9808O442n6789m3947r50O7181
12611a7409J2048l063L1978M5713j5912N138j9976O751K6531j4442k4685l0770
12599A902j955L3867m815M5241r821j0127k1015p465N5447J8723m6895k8007K4453
12586D9533K1819l9169j06383n8680J7643J4527P8596P9171k0784m1843m4239
12575d9809M5548j359l18m5209n2811J914M7230P5771L3628J4823J0349N3745
12563A33502J4169o0241r322L3043J1969j3178k0165j1176l3552j7146K9285M360
$$ y = [62943, 86794, 67721, 31473, 29721, 39619, 34310, -40337, -69189, -84225, -64783, 22490, 52073, 14985, -23187, -62669, -75712, -58484, -77812, -86331, -22731, 12146, 53077, 20186, 19797, 29206, 17989, 66099, 67796, 45426, 42525, 40462, 10654, 17096, -39693, -83640, -84590, -17409, -5361, -8424, 23554, 69267, 53355, 58493, 38517, 45268, 71799, 57357, 32672, 1902, -53, 33814, 28999, 74240, 64419, 54292, 33277, 25812, 81259, 99982, 53087, 25080, 49533, 71352, 32183, -74200, -132880, -115237, -100710, -22114, 57057, 36273, -5570, -49809, -4261, -5620, -5938, -51147, -103958, -102044, -54814, 20957, 54585, 69408, 79757, 133502, 147671, 87430, 78108, 111151, 123120, 109942, 89777, 78601, 45049, 27903, 57188, 61548]
12551F1548M2774M797m6216j7263J8942k3322j7823j6160o0216L6348N131j1203
12539b2663k0235n4387k3421L8019l9468j0833R142O4555J5085l2971N9233j5948
12527c3892k7033k9083L7464Q5133K660o2714k3810M0544R338K9320J08346L968
12515A40241k2939n0029l6217n0135K922N3811N6000L610J5714J060K8004J7802
12503A59844k4139k4805o8510m8215N8748L260l8976m0260j4879K9724j6015n4272
12491g8495P0548L5954l5140p483j6237l799j25j3030L645K1302R2465K2964n5829
12478C6740l333l9074N624N351m442J7385O0420K7542O838o3580q6851l6989K7394
12465d6975K5751k9492o8065Q9472O4916l1917j7638m519j2421N7944j2956m2432
$$ y = [61548, 104322, 109119, 62903, 45640, 64582, 41260, 23437, 7277, -52939, -16591, -11460, -22663, -42898, -97285, -120706, -82687, -122155, -132988, -123846, -59291, -44206, -77177, -17944, -33892, -60925, -90008, -52544, 32589, 35249, -27465, -51275, -10731, -1393, 27927, 136273, 140241, 117302, 67273, 31056, -19079, -16157, 37654, 93654, 97264, 112978, 114038, 142042, 159844, 135705, 110900, 42390, -5825, 52923, 56183, 17207, -23053, -37932, -8208, -24223, -78495, -7947, 28007, -7133, -14616, -30853, -34652, -34777, -47807, -44162, -22860, 69605, 92569, 36740, 33407, -5667, -43, 5308, 866, 18251, 78671, 106213, 113051, 49471, -37380, -74369, -46975, -21224, -50716, -118781, -29309, 35607, 3690, -13948, -18467, -30888, 27056, 14100, -28332]
12453b8332Q624k647j6175L1562M3076L1675m4847n9485l2733K8608J8428L0607
12441H361m4934o6990j6542J05007K2420k4732K6807n311m3520n7824J3051M4498
12429c9709P403k6884K7235M8306K9734j3096J4927j712k3572m1407O3078J1296
12417E5599M3938j5463j9087j6688o5013o0192M3062P178L5911n3978k0416Q3430
12405A8281N8832L982K2092J2184o5040k3600l3073k3320q055j0413K429k3839
12393f9540R1891L3193O494k2444n4296n0657k6947K7932N0354R161j1084k676
12381a8619n0036k3681L0396N7516M0163O247p060K3775l0580l4523L8896N1070
12369H3564o124o3629o6858M9525K8217p908K661O789J9960j8301J6516M244j7395
$$ y = [-28332, -19708, -22355, -38530, -6968, 36108, 67783, 22936, -36549, -69282, -40674, -22246, 8361, -36573, -103563, -120105, -15098, 7322, -17410, 9397, 4086, -39434, -97258, -84207, -39709, -32306, -59190, -31955, 16351, 46085, 32989, 47916, 46204, 22632, -18775, 44303, 55599, 99537, 84074, 64987, 48299, -16714, -76906, -33844, -26666, 9245, -44733, -65149, 18281, 77113, 81095, 103187, 115371, 50331, 26731, -6342, -29662, -37717, -48130, -45701, -69540, 22351, 55544, 62038, 39594, -14702, -65359, -92306, -64374, -14020, -4859, -15943, -18619, -68655, -92336, -61940, -4424, 35739, 41986, 34926, 58701, 28121, -6402, 32494, 83564, 77440, 13811, -53047, -3522, 24695, 16787, 19448, 26237, 46197, 27896, 44412, 48656, 31261]
12356C1261j5981J9264J3904j3317j3055q01K8020l931m1718q538L7854j6832
12344A6130m5661l3313M315M8656O9081k4735l9610J9075k4928j3937o488L279
12332b8136j5163K8301M3805n8912k9779K5647P6841O7026K0420Q829l9049q4398
12320A5432j4024L2623O31n4878l836K2995J7396l5332M2205K2511j4841j9833
12308A1049J9599k5223j8599N6362M7517K077l7389O604O9172O3955N300l0232
12296A70192q3479q6935j9814L2794L9876O4932Q00n1702l5389K8069O579l9203
12284B6720J3225k457r8865j7894J3084N2007M3403J9381J7427k7051o8606m3898
12272g3524l0168N1759P817p680L8642K4642k3588p3905l4412O2970Q6811M8033
$$ y = [31261, 15280, 34544, 48448, 35131, 22076, 21275, 49295, 45364, 3646, -4892, 32962, 16130, -29531, -62844, -58529, -9873, 59208, 34473, -5137, 13938, -10990, -24927, -31415, -28136, -43299, -14998, 28807, -30105, -59884, -34237, 42604, 109630, 130050, 138879, 99830, 15432, 1408, 34031, 34662, -20216, -24052, -1057, 16339, -18993, 23212, 45723, 30882, 11049, 30648, 5425, -13174, 43188, 90705, 92782, 55393, 61997, 131169, 195124, 200424, 170192, 86713, -222, -20036, 12758, 52634, 117566, 118366, 66664, 31275, 59344, 65923, 26720, 39945, 37488, -61377, -79271, -66187, -14180, 29223, 48604, 66031, 38980, -29626, -73524, -103692, -51933, -44116, -51796, -13154, 11488, -12100, -86005, -120417, -57447, 29364, 77397]
12260G7397j6588k6805l490o352j8195J656k0893O2592L6101o2485m238L09N5553
12247G4562J6052r802m2179n0504j3627J552j4650j952l218R545L6875k644k9428
12234b9418J589J6103m1166M0741M2700J5416J7703M699k6247m4165q028M6901
12222C6828N1587m68j4213J1069J5546L0693p2466m1892O357M280l0144m9966
12210e2789L7330L6784L0751J7896m9024j8872l5189l2327N2184k5767j3999k9715
12198h2737r173K2664L7800K1078J7985P3528l3621O454l3755n4489J0845m1020
12186f4441K9374N7456j2960L1449j1698j6715N1164M5725K3365P638K2133m0787
12174A21703k9129q399N471j8606P7964J41643J04746O2883J9422P1537N1705
$$ y = [77397, 60809, 34004, 30514, 24162, 5967, 7623, -13270, 49322, 85423, 22938, 18700, 19009, 74562, 90614, 80812, 38633, -11871, -25498, -23946, -38596, -40548, -43766, -34221, 2654, 10, -29418, -27829, -11726, -52892, -12151, 30549, 45965, 63668, 68367, 42120, -2045, -10073, 36828, 88415, 87947, 73734, 84803, 100349, 131042, 58576, 16684, 23041, 27321, -2823, -52789, -15459, 21325, 52076, 69972, 20948, 2076, -33113, -65440, -13256, -39023, -53022, -82737, -91910, -69246, -31446, -10368, 7617, 81145, 47524, 53978, 20223, -34266, -23421, -64441, -35067, 22389, 9429, 40878, 29180, 12465, 63629, 109354, 132719, 140357, 162490, 121703, 92574, 84175, 89646, 71040, 149004, 290647, 395393, 458276, 477698, 549235, 600940]
12163F00940k831J01315O5498o2061n537K4716J0829o3538j08039n4834n6865
12152D49593j7726l7975m1604l0202j15650j02677l7317l039L2124N588J5744
12141A16859k3008m3449J9592j3889q1902j4452J5835N4364J2920k4891j1858
12130F121j4084k2060O4780L2345O6957m105N105K3739r339K1972k9053j7221
12118A25157L0285N5596R0195J27499P3428J30915J38854J28627Q7627J3760O7899
12107A069842J08393Q5548m950n045R424r5054r0665q4692m7808p5094r5553j05335
12095F69011j58831j48051p3619J1086m549j01036k1554n172r965p2625q4200
12084D95M824M1153P6463J2533r8441q2857m1180m157L1632L6817P3958J9723
$$ y = [600940, 598109, 699424, 764922, 702861, 697324, 722040, 732869, 669331, 561292, 506458, 449593, 431867, 393892, 352288, 322086, 206436, 103759, 66442, 63403, 95527, 101115, 116859, 93851, 50402, 69994, 56105, -25797, -40249, -24414, 29950, 42870, 17979, 6121, -7963, -30023, 34757, 67102, 134059, 129954, 135059, 158798, 149459, 171431, 142378, 125157, 155442, 211038, 301233, 428732, 502160, 633075, 771929, 900556, 988183, 1001943, 1069842, 1178235, 1263783, 1258833, 1253788, 1263212, 1168158, 1077493, 992801, 944993, 869899, 774346, 669011, 510180, 362129, 288510, 299596, 295047, 194011, 172457, 167285, 157320, 84695, 495, 5319, 46472, 122935, 135468, 37027, -45830, -87010, -91167, -59535, -22718, 51240, 70963]
12072G0963N7034O52k7305m1333j425O2098L3481k8296l7653k3000K7144P3983
12060A66343N7332M8845O3356M0854o512K7182M1355N4284j3454K4024R4167Q5264
12048F83040o3234n8911R459j722m3268J4760l2327j07393o1239l8196l7202j0398
12036B53369J612m1638l6641l729m9171j8658k6059j6643J4079p665P0138m5770
12024I3224o3308r4042k7434L3076M338K4223P4561j0018J7982l6264J3030j9696
12012I672P962k3894o2353O3337K2458J2078L9483m3610M044L533j0645J4555
12000C6620L3582O601o0170Q058M9666j8455M4942J9706m155R492k009L1513r173
11987A46218l4282J1752j3178l1919K2684j9972l247n0690K1961L4085K571J6902
$$ y = [70963, 127997, 128649, 101344, 60011, 58586, 120684, 154165, 125869, 88216, 65216, 92360, 166343, 223675, 272520, 335876, 376730, 370218, 397400, 438755, 493039, 479585, 503609, 597776, 683040, 619806, 560895, 570354, 568632, 525364, 540124, 507797, 400404, 339165, 300969, 263767, 253369, 254981, 213343, 176702, 172973, 123802, 105144, 79085, 62442, 76521, 68856, 138994, 93224, 29916, -64126, -91560, -58484, -54146, -29923, 44638, 34620, 52602, 16338, 29368, 9672, 17634, -6260, -68613, -5276, 17182, 29260, 68743, 25133, 29177, 32710, 22065, 36620, 70202, 76803, 16633, 24691, 74357, 55902, 100844, 120550, 116395, 125887, 123878, 155391, 146218, 111936, 123688, 110510, 78591, 101275, 81303, 78056, 27366, 49327, 83412, 85983, 102885]
11975A02885J0237j1420m2983j7681J8777j4258k3033l093K4602k351K2220J9629
11963H3531l4772O530K9785R595n9990k7809K4009K5502K5868J2908j1118K7029
11951A11068J2544K878Q404K0497n0941j5749M0718M353j3655l591R656P7862
11939B04044M2382J9469k1625k414n1077j0264K9448k1717n4625o700O3688Q347
11927A98956m444r859O520P6653M9156m583M9031Q7595O0118P1627J29788K00033
11915I10591L34710K72260J33754P2878K9134J07011K41374K21788N3161q6305
11905B290356k44221k62563j48684M6536M0053j25438k67984l16796k05856j78885
11895F26518j23212r5327m0451K1283l9057r1409p9563L6642J9752M2117L2337
$$ y = [102885, 113122, 101702, 58719, 41038, 59815, 45557, 22524, 19431, 44033, 41682, 63902, 83531, 48759, 55289, 85074, 94669, 34679, 6870, 30879, 56381, 82249, 95157, 84039, 111068, 123612, 126490, 134894, 155391, 104450, 88701, 129419, 133772, 120117, 116526, 126182, 204044, 246426, 265895, 244270, 241856, 190779, 180515, 209963, 188246, 133621, 126921, 190609, 198956, 194512, 184653, 191173, 267826, 316982, 312399, 361430, 449025, 509143, 580770, 710558, 910591, 1245301, 1517561, 1651315, 1724193, 1753327, 1860338, 2101712, 2323500, 2376661, 2290356, 2046135, 1783572, 1634888, 1681424, 1721477, 1596039, 1328055, 1011259, 805403, 626518, 503306, 407979, 367528, 388811, 349754, 258345, 178782, 215424, 235176, 277293, 309630]
11884C09630P825m8221m3007p111K0172R203P8415L3483K8628N6291j8711m5989
11872C80608j7403j5236N9315J34841J16582M4515O5150P3417J06408J92571K20870
11861A361638K70611L18947L44650M25020L09493J92525J88341K00117K64907
11852C876249K63346J14736k6568k75796l68011k67920k30343j40328k51377m16552
11842B277436m27718l23753k93720k31063j29023o9518k5255r8460n2104l5324
11832E91498l2925K1348m1475p0442o5315j7850k8608j271J6130j7215J5799L539
11820C73213N8849R6264r61K4878O3918M8057l0511M074J03899N9368J2135K4466
11808H37649L6842N4075R5041P1234K19914K96241J88927J17033L5190q700K00996
$$ y = [309630, 317455, 269234, 226227, 219116, 239288, 248491, 326906, 360389, 389017, 445308, 426597, 380608, 363205, 347969, 407284, 542125, 658707, 703222, 768372, 841789, 948197, 1140768, 1361638, 1632249, 1951196, 2295846, 2720866, 3030359, 3222884, 3411225, 3611342, 3876249, 4139595, 4254331, 4227763, 3951967, 3583956, 3316036, 3085693, 2945365, 2693988, 2277436, 1849718, 1525965, 1232245, 1001182, 872159, 802641, 777386, 678926, 626822, 591498, 558573, 579921, 538446, 468004, 402689, 384839, 356231, 354960, 371090, 353875, 369674, 373213, 432062, 528326, 527365, 552243, 616161, 664218, 633707, 637781, 741680, 801048, 813183, 837649, 874491, 928566, 1023607, 1094841, 1314755, 1610996, 1799923, 1916956, 1952146, 1943446, 2144442]
11797B144442K53691J64164M4353j34838k65896j77278r4469K8128o5640j08072
11787A788585k05607k48867k10844j28895r6438l0877K1670Q6127O7378J02738
11777A144970P1720N7241L3586M366L4708J17456J63787J09363J28858J55497
11767B021552K78671L54373L20106L47081L96248M95687N22052N70311O32112
11758E938193P04461Q18617R65440J170094J477403J859626K372747L025563M068291
11749B2400435N762783Q656393J2375611J4173288J2716742J0889254R511627
11742I6486133Q315781Q488449R212758R186800O505115O96993m716672p969698
11734A26205659q729824q394303q469571q296094r830230j2660885j3679293j2476137
$$ y = [2144442, 2398133, 2562297, 2606650, 2471812, 2205916, 2028638, 1934169, 1962297, 1896657, 1788585, 1582978, 1334111, 1123267, 994372, 897934, 867057, 888727, 974854, 1042232, 1144970, 1216690, 1273931, 1307517, 1311883, 1346591, 1464047, 1627834, 1737197, 1866055, 2021552, 2300223, 2654596, 2974702, 3321783, 3718031, 4213718, 4735770, 5306081, 5938193, 6642654, 7461271, 8426711, 9596805, 11074208, 12933834, 15306581, 18332144, 22400435, 28163218, 36819611, 49195222, 63368510, 76085252, 86974506, 96486133, 104801914, 113290363, 122503121, 131689921, 138195036, 138892029, 134175357, 126205659, 117475835, 109081532, 100611961, 92315867, 82485637, 69824752, 56145459, 43669322]
11726D3669322r841596o920332m746897l351593k469453j876586j593872j368886
11718A1500107j119642q52708o53442m61399k87781j62429j3136J22264L01239
11709H373073M19721M79996O13008O76786Q44219R89454J132352J348911J613551
11700A6491071K071143K567176L248780M249656N686446P859401J1439773J5120392
11692F8733838J7490670K1736873K4765383K1687804J9047366J8031175J6106283
11685B07599392J5196628J2600131R889867N565995l081190j0382502j5632588
11678B21755733j6614597j6350088j8989568j8805624j9499936k2652918k2673615
11671H6169387j9915456j5548351j0959528p476187n189739l940942l104675k417978
$$ y = [43669322, 33827726, 26907394, 22160497, 18808904, 16339451, 14462865, 12868993, 11500107, 10380465, 9527757, 8874315, 8412916, 8125135, 7962706, 7949570, 8071834, 8373073, 8792794, 9272790, 9885798, 10562584, 11406803, 12396257, 13528609, 14877520, 16491071, 18562214, 21129390, 24378170, 28627826, 34314272, 42173673, 53613446, 68733838, 86224508, 107961381, 132726764, 154414568, 173461934, 191493109, 207599392, 222796020, 235396151, 245286018, 250852013, 247770823, 237388321, 221755733, 205141136, 188791048, 169801480, 150995856, 131495920, 108843002, 86169387, 66253931, 50705580, 39746052, 32269865, 27080126, 23139184, 20034509, 17616531]
11663A7616531j938069j569484j403501j163895q51553o74883n47660m37734k84197
11654H745555j42670l1718J1303J10095J78517L32950N44361P76768Q79841Q91825
11644A2296827J126631J427356J847609K277924L001880M265558O116014Q818691
11636D1178490J1464730J1935322J0844858R143016P886402P276001P301135P925027
11628A14954981O857350L532608j340393n728621p699100q294785q120955p794589
11620H6366496q386929j0001902j1931761j2106637j0482363p951168n484681
11613B0021055l823983k693113j993198j602168j239835j021105r03320p42890
11605F001443n72694n52422m48556l68835l07279k30385k43070k19041k41333
$$ y = [17616531, 15678462, 14108978, 12705477, 11541582, 10690029, 10015146, 9467486, 9029752, 8745555, 8602885, 8571167, 8582470, 8692565, 8871082, 9204032, 9748393, 10525161, 11405002, 12296827, 13423458, 14850814, 16698423, 18976347, 21978227, 26243785, 32359799, 41178490, 52643220, 64578542, 75423400, 84566416, 92452818, 99728819, 107029954, 114954981, 121812331, 125344939, 124004546, 118275925, 110576825, 102282040, 94161085, 86366496, 77979567, 67977665, 56045904, 43939267, 33456904, 25505736, 20021055, 16197072, 13503959, 11510761, 9908593, 8668758, 7647653, 6744333, 6001443, 5428749, 4876327, 4427771, 4058936, 3751657, 3521272, 3278202, 3059161, 2817828]
11596B817828j69672j99290k17717j48282j55924j14455l8260p0395n3727p2365
11586A577741r6025n3328q8430q2617j7815J5712J0663k7570l9685o9874p6639
11575A052133o2179k327n3758m4938J0769m3311k5405K2131k3218m3599l1010
11564G55288o2869j8509J1052J4496m5911j4937j9979R769O257k9363k8719j1210
11552E65365j4369j0820j075o0353l8754Q573L3632L0646k3964q040O612n5331
11540D32122m0496j7619N29M1093O8039N6554J8123m8554j5962K8167P4097M6149
11528F42242r77L2643m1602m4066J730M0247k6189p9352n5870J1536k1151l9417
11516D19774m2539r4405l3837M3563O0340K7886k0330l1351m8417K7255J6603
$$ y = [2817828, 2648156, 2448866, 2231149, 2082867, 1926943, 1812488, 1774228, 1703833, 1650106, 1577741, 1481716, 1428388, 1339958, 1257341, 1239526, 1255238, 1265901, 1238331, 1198646, 1128772, 1052133, 989954, 987627, 933869, 888931, 899700, 856389, 830984, 853115, 829897, 786298, 755288, 692419, 673910, 684962, 699458, 653547, 638610, 618631, 628400, 634657, 605294, 576575, 565365, 550996, 540176, 539101, 478748, 439994, 448567, 482199, 512845, 488881, 480841, 487453, 432122, 391626, 374007, 374536, 415629, 483668, 540222, 558345, 509791, 493829, 521996, 596093, 642242, 641265, 673908, 632306, 588240, 589970, 630217, 604028, 524676, 468806, 480342, 459191, 419774, 377235, 282830, 248993, 292556, 352896, 380782, 360452, 329101, 280684, 307939, 324542]
11505C24542o1897l1327m9153P652j4016n2057n3971Q792O4475j5800q124L1978
11493A51094l7483L7351R2747O6449J9860l6053k4464k7681J9468m5308k9377
11482A86603k491p523o617n3973N920k755j5421K8108j6955N2291O1570Q546r2892
11469A44411k622J16786m956k6276n9812k1839J2241k6468j4519J8203m083L0939
11457A62005j479n5989l2387J5778M8498j2419K8324L2946r900l888k8193l4535
11445A08761o8894K2274L2239k073m4497M0701Q0770l2238l4119J2553j563j4857
11433I9057k0411m2443l4785L7967P2890N8422L6583q7470l5854P1696K6450K5344
11421B07446J8230n2205o9453l8358M0786J1624l6153r921K0122j9307p2861O3748
$$ y = [324542, 262645, 231318, 182165, 189817, 175801, 123744, 69773, 78565, 143040, 127240, 119116, 151094, 113611, 150962, 243709, 310158, 330018, 293965, 269501, 241820, 261288, 215980, 186603, 184112, 176589, 169972, 115999, 121919, 119164, 103743, 131851, 114896, 167187, 228757, 237303, 144411, 141789, 258575, 253619, 227343, 167531, 145692, 157933, 131465, 116946, 135149, 131066, 162005, 160526, 104537, 72150, 87928, 136426, 124007, 152331, 185277, 175377, 171489, 143296, 108761, 39867, 62141, 94380, 92307, 47810, 88511, 169281, 137043, 102924, 115477, 113914, 99057, 78646, 36203, 1418, 39385, 112275, 170697, 207280, 119810, 83956, 155652, 182102, 207446, 225676, 173471, 104018, 65660, 106446, 118070, 81917, 71996, 92118, 72811, -50, 63698]
11409F3698Q065L5690K8713m5148n6740J2481k0644K5590P7178P978k5063j6195
11397I5603K5129J973K326M371M7110r979j8500l8378m3637n1919j1865m900M5989
11384D3323N9319R095r0461r300K7182K9288K757K1517K0328j5446n3355n3064
11372h817J9554L4886L9049K3196j9738Q030k9634m065J1541J4106j4871k1894
11360E1343L010K8592M2743Q615o8824m0154J6352P440L7766K2770L996K134L0306
11347A46089k0491m7872j4724K928K5664J8351L4574N1387o8443o8167k3961K9672
11335F5007j4143k8208L6211R957j9035M4044L4670J4968J9990n422m4752m6463
11323F6824N0956M7371l2179J2254O8027O1835J01056J00402K7534K4594L2443
$$ y = [63698, 71763, 107453, 136166, 91018, 34278, 46759, 26115, 51705, 128883, 136861, 111798, 95603, 120732, 122705, 125031, 129402, 176512, 166533, 148033, 109655, 66018, 14099, 2234, -2666, 43323, 102642, 111737, 21276, 11976, 39158, 68446, 71203, 92720, 113048, 97602, 44247, -8817, 10737, 45623, 84672, 107868, 88130, 96160, 66526, 62461, 74002, 88108, 73237, 51343, 54353, 82945, 125688, 134303, 65479, 25325, 41677, 49117, 86883, 109653, 113649, 115783, 146089, 125598, 77726, 63002, 65930, 91594, 109945, 144519, 195906, 127463, 59296, 35335, 65007, 50864, 22656, 58867, 68824, 49789, 93833, 128503, 143471, 163461, 158039, 113287, 66824, 117780, 165151, 132972, 145226, 213253, 275088, 376144, 476546, 504080, 528674, 561117]
11312E61117M6984M8824r68L3312K5609k4159O229k0846n9690m1322o4757r1560
11300D18773k3311n0660p0718o3024q4256k2023k2711l9473J1849N086j9444J3282
11288E3370J6119K1564l9143n7182L175O0152M8183J1358J6836m6163j9363m4945
11276B3961k0262N7672N8294M1161m3899L2892J4937r603J2350P0766J18383J16407
11264D73059J24568Q2559J21614O6656L8396N7523O9372R5857Q7662O9458M6116
11253A332840K7111r957N007j57711j31334r2157j22480k8863r8572j96721j32480
11242C94683j07061q2590n4922k1984N1481j5089K337L0804m249K5508L4217q7766
11230A65369o6746L9030j421n399m5681n7670K333K4593q993K7922K1147k138
$$ y = [561117, 608101, 656925, 655957, 689269, 714878, 690719, 696948, 676102, 616412, 575090, 510333, 418773, 395462, 344802, 274084, 211060, 126804, 104781, 82070, 42597, 54446, 59532, 40088, 53370, 69489, 91053, 51910, -5272, -2097, 58055, 106238, 117596, 134432, 88269, 68906, 23961, 3699, 61371, 119665, 160826, 116927, 149819, 164756, 155153, 167503, 238269, 356652, 473059, 597627, 680186, 801800, 868456, 906852, 964375, 1033747, 1129604, 1217266, 1286724, 1332840, 1359951, 1349994, 1355001, 1197290, 1065956, 973799, 851319, 822456, 723884, 527163, 394683, 287622, 205032, 150110, 128126, 179607, 164518, 166855, 197659, 193410, 218918, 253135, 165369, 98623, 137653, 136232, 130833, 85152, 27482, 29815, 54408, 45415, 73337, 94484, 92346]
11218I2346L3996M5642p065l1910m0898m9511M441K3945M2484Q5806M8559R0814
11206C38649N4035L6413l684K9859O2543p054K0066M2795m891o264m1716r097
11194E11654k9671m381n941j7950n4070p0296p8366J3373m2283r5143p3999K1559
11182G4486m1727J8252K0728n158n351j6255k2163l4818j0009j748j82M6215L6933
11169E9203m7307P995L5984j3023m713J0196k3061l2526l696n4869o3383m738
11157a33938N8748P4713J1447j8095m9158m4304m0186J6150M2008O2094O4646
11146D4125j0157k7527n2963k4859m8538P1228L6532N3952M6487o172m1634k7399
11134A3075k5275k0647l8554j7000K8770O8826O9346l3590o7586l0827Q6376k434
$$ y = [92346, 126342, 171984, 164919, 133009, 92111, 42600, 47041, 70986, 113470, 199276, 247835, 338649, 392684, 429097, 425413, 455272, 517815, 510761, 530827, 573622, 568731, 562467, 520751, 511654, 481983, 477602, 471661, 453711, 399641, 329345, 250979, 264352, 222069, 126926, 52927, 74486, 32759, 51011, 71739, 66581, 61230, 44975, 22812, -12006, -22015, -23763, -23945, 22270, 59203, 11896, 19891, 55875, 42852, 38139, 48335, 25274, -7252, -10948, -65817, -129200, -133938, -75190, -477, 10970, -7125, -56283, -100587, -140773, -124623, -82615, -20521, 44125, 33968, 6441, -46522, -71381, -119919, -48691, -12159, 41793, 88280, 82108, 40474, 13075, -12200, -32847, -71401, -88401, -59631, 9195, 78541, 44951, -22635, -53462, 32914, 30480]
11122C0480k4764q3731m057M6259J6906K4769N4187j8635q5432k2267K7761l5007
11110g3531N454Q0678M5132j7723q3985n0027M1040L9988j5065J8607R038O387
11098E993j2172J6528K5417l0296o4603l5381J9967M5849O7145L3004M320p023
11086F8748o5390n4122O5487O3430k0913n5408j8859p699J4288K7965L6262O294
11074F0083K5874O0544l1894r5407j1409m5681K4326L8248O280m7028m5904J3050
11062d8918N1747J1682m1672M303N5114M2350l4363M6608r466m8481n1114M833
11050a7377L2933k724J1158M2237k3006L7878j4543m9822j2547k9523L8236M2547
11038E5447l5220m2137M7136L1969N138J9401j0943M473k8684m2015j758J9098
$$ y = [30480, 5716, -78015, -82072, -35813, -18907, 5862, 60049, 41414, -44018, -66285, -38524, -73531, -68077, 12601, 57733, 40010, -43975, -94002, -52962, -12974, -28039, -9432, -394, 5993, -6179, 10349, 35766, 5470, -59133, -94514, -74547, -28698, 38447, 71451, 75771, 68748, 3358, -50764, 14723, 78153, 57240, 1832, -17027, -24726, -10438, 17527, 53789, 60083, 85957, 146501, 114607, 19200, 7791, -37890, -13564, 24684, 30964, -16064, -61968, -48918, 2829, 14511, -27161, -22858, 32256, 74606, 40243, 86851, 77385, 28904, -22210, -17377, 15556, 12832, 23990, 66227, 43221, 81099, 66556, 16734, 4187, -25336, 12900, 55447, 20227, -21910, 25226, 57195, 62333, 81734, 70791, 75264, 46580, 4565, 2807, 21905]
11026B1905l2942j4928O713M8818n955J5202k5706l4639R974q353L6867j5169
11014A787l4637k31K7777M1357n2646l0757P4728P4514k7893l7768j804o452q4244
11001e6269m4981m401Q4790O926k043O4774M7516n3417m5791L3084k2724o2154
10989e4690j4161j702l6636J6426K5380P4001N5262j0909L0179p722q811P8717
10977A45334R15m0922o8213m6357k5728K5454j1483k3220k8793k5932j5440j3313
10965a27698l2768P239R6425K3953j3954k0811L2873q320J915J3105j2124J2440
10953b7725O3546k0909o5297J0787J3022q537L002M4387L7574n5894l0814K8511
10941h347P4764J844j8690K88O467P880m7263n0145q305K8735J7054j6705k0378
$$ y = [21905, -11037, -25965, -19252, 29566, 23611, 38813, 13107, -21532, -11558, -19911, 16956, 1787, -32850, -33081, -5304, 36053, -16593, -47350, 27378, 101892, 73999, 36231, 34427, 27975, -56269, -101250, -105651, -20861, -13935, -15978, 48796, 96312, 42895, -2896, 30188, 7464, -54690, -68851, -70553, -107189, -90763, -65383, 8618, 63880, 52971, 83150, 75428, 66617, 145334, 146249, 105327, 37114, -9243, -34971, -9517, -21000, -44220, -73013, -98945, -114385, -127698, -160466, -153227, -56802, -32849, -46803, -67614, -34741, -43061, -41146, -28041, -40165, -27725, 35821, 14912, -50385, -39598, -26576, -35113, -32111, 12276, 49850, -6044, -36858, -8347, 66417, 68261, 49571, 49859, 56326, 64206, 16943, -33202, -41507, -12772, 4282, -12423, -32801]
10928c2801m3188L3631K6571J6920M5735q323p7288J1977l6352N622L8327J2607
10916f562j6926j064l6257p682L9691l737M0359M4486m8641l9489M4053P023n2662
10903c7408o820N8645k0508J2555K9377j0705o4430Q629M1479K8419N2418k452
10891H9199k8915l1159j6921q144J2462N0928l0961m9467j4974P4024j8412p587
10879B0073M0796k6432j9260L4863Q8038L6874m5694l7887r63l4201l5491p7719
10867e7003j4231M7827L2320K8916q1268j7670M5968J5776M0145l06l5537L5445
10855D0382k8725n7595L3529L267l2335J6930L3400l3388N2041K0395j9996m0259
10843a2354J2741K6663n2297r0607n277l836N9253Q811K9159P7019o138j6832
$$ y = [-32801, -75989, -42358, -15787, 1133, 46868, 38545, -38743, -26766, -63118, -57496, -19169, -6562, -23488, -24552, -60809, -68491, -28800, -32537, 7822, 52308, 3667, -35822, 8231, 15254, -37408, -44228, 14417, -6091, 6464, 35841, 25136, -39294, -30665, 10814, 39233, 91651, 89199, 60284, 29125, 12204, 4060, 16522, 67450, 36489, -12978, -27952, 46072, 27660, 20073, 60869, 34437, 15177, 50040, 138078, 174952, 129258, 91371, 90408, 56207, 20716, -57003, -71234, -23407, 8913, 37829, -43439, -61109, -15141, 635, 40780, 40474, 4937, 40382, 11657, -45938, -12409, -9142, -41477, -24547, 8853, -24535, 27506, 47901, 27905, -12354, 387, 27050, -25247, -115854, -121131, -124967, -65714, -56903, -27744, 49275, 43137, 26305]
10831B6305j9607n9070j6361o492L4015K5644N651m1894l4265K8518J43792N3839
10819A40075o8028l2114J4946l1709n4854M521O784K0056p522p7298N254J03858
10807B3969n3623j3740K9200K8382M3883q3419m5112M5956j8421J8399L9235k864
10795A1845k459j59j863N351k4660J8218k6588N051m078M10j0108k0188K637O3007
10781A6416L2805k6246o3560M419L2431k1698R94j5387n4984J262M0637K3162
10769b9749Q6306M9237m430m2064m022j7450K109k4897m2541J2852p332J5095
10757f886m150j3627K968J4350r550J7616O4894j3721l7529K5601L8821L4714
10745A13501K197n6704K7808J8710n6086n8534n5970J747k2262K1997k3951Q803
$$ y = [26305, 6698, -52372, -68733, -75225, -41210, -15566, -9915, -51809, -86074, -57556, 86236, 140075, 72047, 39933, 54879, 23170, -31684, -27163, -20379, -323, -7845, -85143, -79889, 23969, -29654, -43394, -14194, 14188, 58071, -25348, -70460, -24504, -42925, -24526, 14709, 11845, 9386, 9227, 7364, 12715, -11945, 6273, -20315, -15264, -19342, -18932, -29040, -49228, -46591, 16416, 49221, 22975, -40585, -36166, -3735, -25433, -24439, -39826, -94810, -93548, -52911, -29749, 56557, 105794, 101364, 59300, 55278, 37828, 39937, 15040, -27501, -14649, -21981, -6886, -11036, -24663, -21695, -7345, -16895, 721, 65615, 51894, 14365, 39966, 78787, 113501, 115698, 58994, 86802, 105512, 49426, -9108, -65078, -63331, -85593, -63596, -87547, -78744]
10733g8744L3797L3801J8556K0601l6470q375Q530M026j3993k2093R622K1119
10721i623L132J5291k1082m5673m7585N0930P816J070O6035j8565J163K6107o2841
10708c3825l4042L8735J8801m6654r899P1611M7815l0995j4894K8485J4747k9173
10696B0712O4653l9612l8186j4735o1987j746k6586k7313M112R971O4368K2764
10684b3585j4565J92O3599m934L8579L5419J0689p8112p9922L1184M3681J6434
10672C8659j3225j2707m4726m1129M0056L5335k9142j9715K5263j0630K7428n7994
10660f2527o135K8774Q605K7703k4732n2858p5849l1968N1001P5733J7830M9346
10648D923m13k3029l7053j5043K9031N2675O6110n1143k1476J3270J3087M480
$$ y = [-78744, -44947, -11146, 7410, 28011, -8459, -16834, -8304, -4278, -18271, -40364, -30742, -9623, -6491, 8800, -12282, -57955, -105540, -54610, -46794, -45724, 20311, 1746, 2909, 29016, -33825, -67867, -29132, -10331, -56985, -66884, 4727, 52542, 21547, 6653, 35138, 49885, 20712, 85365, 45753, 7567, -7168, -69155, -70901, -97487, -124800, -120688, -110717, -46349, -23585, -38150, -37958, 25641, 20707, 59286, 94705, 105394, 27282, -52640, -21456, 22225, 38659, 25434, 12727, -31999, -73128, -33072, 2263, -26879, -46594, -21331, -31961, -4533, -62527, -68662, -39888, -31283, -3580, -28312, -81170, -157019, -188987, -137986, -62253, -44423, 4923, 4510, -18519, -55572, -70615, -41584, 11091, 77201, 26058, 4582, 17852, 30939, 35419]
10636C5419m7557m5142l31M6882M0943M0941K9072j21592m3463J1586M3090R289
10624h63n430j9082l1820n4070P647N5488O1781L4218m4004o0442J6161K4742
10612a5674m1441n2264O6968O5248O5370o690k2337n1102j7359p854p23J5725
10600b133L2190O076o2918J2382j4009L862K9496l3357N36L3820n1573q5026o3326
10587a93980K5804N0496O3770O8094o521p2243j3283K5288L476O1558P540k7996
10575g997J8481K2189K6807j760K1297l0884q010o2507l0359N6510k3057j8753
10563c8043L7121L3317p2686o0229L4808J8682M8117n006l7853J5599O954L9866
10551B0647M2400m0835o306J6540J8915j4934l3849p5978k8366O422k8080K5867
$$ y = [35419, -12138, -57280, -57611, -10729, 30214, 71155, 100227, -21365, -64828, -53242, -10152, -863, -6293, -25375, -57195, -111265, -103618, -48130, 13651, 47869, 3865, -56577, -40416, -15674, -57115, -109379, -42411, 22837, 88207, 81517, 59180, 8078, -9281, -17135, -17858, -2133, 30057, 36133, -26785, -14403, -28412, -24550, 4946, -28411, -27875, 5945, -45628, -130654, -193980, -168176, -117680, -53910, 14184, 7663, -64580, -77863, -52575, -49099, 12459, 19999, -7997, 10484, 32673, 59480, 57720, 79017, 48133, 40123, -22384, -52743, 3767, -19290, -38043, -922, 32395, -40291, -100520, -65712, -47030, 1087, -3919, -41772, -26173, -19219, 20647, 63047, 22212, 15906, 32446, 51361, 36427, 2578, -73400, -101766, -95344, -123424, -97557]
10539i7557L6750N7258J0250k865j1608J471k4930q1631l8962P3523L9320N2018
10527A3037K0584m7255j2793j3336J4494o077K153M17M659k3864M7658M5228j3411
10514C1494j8237M0406M7352p5934p4496j8263j3889p220L0646M2565R058J2661
10502F143Q963m1227o2903k5205L7160N5604M1055J2358k6475K0830L3973J0371
10490G0647Q033k9880K3942l1346o0987q0740r88L9446L0189l0991m4493Q336
10478i8832J4372R242O6890J146n901l4819L897M2583J1960N534Q7874j7047k9351
10465E7548N1453k2269m8996m0377l355O185Q15L5549j3978o6756Q612O2141R581
10452C6153L9553j2463m8737O194r901j1175l607l8625l53j6244j7329j1902O345
$$ y = [-97557, -60807, -3549, 6701, 3836, -7772, -6301, -31231, -112862, -151824, -78301, -38981, 13037, 33621, -13634, -26427, -39763, -25269, -31346, -29193, -28776, -24117, -47981, -323, 44905, 31494, 13257, 53663, 101015, 25081, -49415, -67678, -81567, -88787, -58141, -15576, -6518, 6143, 15106, -26121, -89024, -114229, -77069, -21465, 19590, 31948, 5473, 26303, 60276, 70647, 78680, 48800, 72742, 41396, -19591, -100331, -101319, -61873, -31684, -62675, -107168, -98832, -84460, -75218, -8328, -7182, -13083, -47902, -44005, -1422, 10538, 16072, 103946, 86899, 57548, 109001, 86732, 37736, -2641, -5996, 189, 1004, 36553, 22575, -44181, -35569, 26572, 36153, 75706, 63243, 14506, 20700, 10799, -376, -3983, -42608, -42961, -59205, -76534, -88436, -82091]
10439h2091R6500j0306l4380J7881P886L070L3783l6345p9817J2644M971k0268
10427h6472n5591P979L8245N5104L0450n2269J9156l8191n464K5959j1989N840
10415f7243M0190J9271j6196m590M9016N2255j2836p507j710J6212j1141J1163
10403F6884J3220j8636o0495l540K4510j4207k7530J8706O2263J5567k8451m8286
10391El230j6630L3588P0580J3548j4352L1219p204j074l0814o0038k3891K9540
10378B1247M6019M146n8692r3619M9922P3509l210k4762R626Q173j0956J8033
10366C9436j5378o7911n5073r335L3043K2207K3150J9091k5736R583L7529q990
10354A616M5589Q199J938n467k7986p3477J232N4297O5848n0566r4064m4661L892
$$ y = [-82091, 14409, 4103, -30277, -12396, -4510, -1440, 32343, -4002, -83819, -71175, -66204, -86472, -142063, -134084, -95839, -40735, -10285, -62554, -43398, -81589, -87053, -61094, -73083, -67243, -27053, -7782, -23978, -28568, 20448, 72703, 59867, 52360, 50650, 66862, 55721, 66884, 80104, 61468, 973, -2567, 21943, 7736, -19794, -1088, 61175, 76742, 48291, 5, -3225, -19855, 13733, 84313, 97861, 83509, 114728, 107524, 106450, 75636, 15598, -8293, 21247, 67266, 71412, 12720, -80899, -30977, 42532, 39322, 14560, 24186, 32359, 21403, 39436, 24058, -43853, -98926, -108261, -75218, -53011, -29861, -10770, -36506, -26923, 10606, 1616, 47205, 55404, 57342, 51875, 23889, -49588, -48356, 5941, 71789, 21223, -72841, -117502, -113610]
10341a13610K7458N1677K3463o009J6968j531L401M530J1049l724j2703M22p199
10328e808L4601L1816J5733k9953j1780j7563O7189l5685n332k3261M2641J0558
10316G3156n6368r5423K8306j8485j92N4525M1019m390k3771j2102K8298L2938
10304D7511j6227K2012k8424J4412O358k8141o648l7391j2108N2898P2773R41
10292H7966L9573q518o3958j4461k1302l4198q306R003m214K284L3337N1989j42
10279F9053o2724k3101j6711J3510J6968k1752l2771j2051n717K0127P0253n192
10267I892k7600m0816j473R0355j2008k3662J69R29L9440l5419j1298k159R348
10254d302m5967j7443k3018k1234o2361N2860O1615J8331K8970j0115M8565O3183
$$ y = [-113610, -86152, -34475, -11012, -17021, -53, -1584, 1817, 6347, 17396, 13672, 969, 1391, -5808, 28793, 60609, 76342, 46389, 34609, 17046, 84235, 48550, 43218, 19957, 62598, 73156, 16788, -78635, -50329, -68814, -69006, -14481, 26538, 22148, -1623, -13725, 14573, 47511, 31284, 53296, 24872, 39284, 45642, 17501, 10853, -26538, -38646, 14252, 87025, 87966, 127539, 119021, 55063, 40602, 19300, -14898, -23204, -14201, -18415, -16131, 17206, 69195, 69053, 6329, -16772, -33483, -19973, -3005, -24757, -57528, -69579, -75296, -55169, 15084, 9892, -17708, -58524, -59997, 30358, 18350, -5312, -5143, -4214, 35226, -193, -11491, -13650, -4302, -50269, -67712, -90730, -111964, -174325, -121465, -59850, -41519, -12549, -22664, 25901, 89084]
10242H9084K4675j7937j0676j6649m5828m4964K7169L2403l172j3062n0493k0915
10230e0365O1247K2904o6196l2051M9499k8229K724M3070o2889l7029L678J538
10218i2099J1376j016L7579M6387K0072J5780k3320l1393J3991N0819k662o2796
10206a7282j6289K8147q025J5784K6967j5474l88n6427L671L0387m687J1389m5384
10193d7611o304j1406q723m094Q0042j5367l530M3284N20L351l6753K6389p5748
10180e5950l4719K4149k5474J3328N7265O5342n527n7886L9438J1679L721m9323
10168a3957o9617M0650L6785K591L9361M1138j3980p031j4012j2274l012j9830
10156F812j5225J3129L4941j031J1764J5455J0757p8135k6499J6529k3424P0320
$$ y = [89084, 113759, 95822, 85146, 68497, 22669, -22295, 4874, 37277, 34105, 21043, -29450, -50365, 10882, 33786, -32410, -64461, -14962, -43191, -40467, 2603, -60286, -97315, -93637, -92099, -80723, -81739, -44160, 2227, 22299, 38079, 14759, -16634, -2643, 48176, 45514, -17282, -33571, -5424, -13449, 2335, 29302, 13828, 13440, -42987, -39316, -8929, -13616, -2227, -47611, -53915, -65321, -74044, -78138, 1904, -13463, -16993, 26291, 26811, 30162, -6591, 19798, -55950, -90669, -66520, -91994, -78666, -21401, 43941, 38414, -19472, 19966, 31645, 35366, -13957, -83574, -42924, -6139, -3548, 35813, 76951, 62971, 55940, 41928, 29654, 26642, 6812, -8413, 4716, 39657, 38626, 50390, 65845, 76602, -1533, -28032, -11503, -34927, 35393]
10144C5393j5476j5977r427K8309M403l8811j8484J8985K5285j9343J6974K6497
10132C8328k1903j1739P443o76J2651K0587l6479L075j0776l7410j1910m9271
10120i8080K8836M6658K7595q438K6317M1754o010Q360j008o0028M268J8173k6466
10107A931J4836K7499n6552l9844Q236M4989K6389m5802j2501l8582l1573O4700
10095c6274K2055o4413N5717O912k5681k6689m7644K7154M0844K325O5276J05720
10083A25302J47625L8529l9011m9534j6200l2315m1344L1120J19899P4718o1068
10072B97721p9113q7034n0678o239M827J3470J2594q6455q5080q15M5859J13574
10060I2631j462N2340M8794j4084o3262q769K1973K2508l8640m0738p2214k355
$$ y = [35393, 19917, 3940, -5487, 22822, 27225, -11586, -30070, -11085, 14200, -5143, 11831, 38328, 16425, 4686, 12129, 11453, 24104, 44691, 8212, 11287, 511, -36899, -48809, -98080, -69244, -22586, 5009, -3429, 22888, 64642, 58632, 66992, 65984, 5956, 10224, 28397, 1931, 16767, 44266, -12286, -52130, -43894, 1095, 27484, -18318, -30819, -69401, -100974, -36274, -14219, -78632, -22915, -16003, -41684, -68373, -116017, -88863, -48019, -45694, 19582, 125302, 272927, 311456, 272445, 222911, 206711, 174396, 133052, 164172, 284071, 358789, 297721, 218608, 131574, 80896, 74657, 79484, 92954, 105548, 19093, -65987, -66802, -20943, 92631, 91169, 143509, 192303, 178219, 114957, 106188, 128161, 150669, 112029, 71291, -923, -3278]
10048c278j5526j1731j4226k2201K9746M1167p206k8677k218m127L9471P1794
10036G2988L4140M764j7619j0923m9876o0171j9736J1848R211o8764m0225M3939
10024i0424J11595q979n2395J6041P1053O354q6281k4058p34K6800n973k827K6988
10011a2840m7008k429P5907R424j0231M1656l9913k2830N270O1585J5803j9355
9999E5039n2573j0576K3108j8321j0191n7928j4964P2361L3749L539q935J4824
9987B9132N9548j5736j22198O7674J0604K407j2166m8519l2734k4622j4708M4269
9975e7049O6707K2974k4486O214l344m8999L0212M9565O1701J6246J7092j7961
9963A18872k0191O8214o9525m2210l4817M4306m9256n9321J1701K1986k524j2743
$$ y = [-3278, -18804, -30535, -44761, -66962, -37216, 3951, -3255, -31932, -34150, -38277, 1194, 72988, 107128, 111892, 94273, 83350, 33474, -26697, -46433, -34585, -25374, -94138, -134363, -90424, 21171, 12192, -40203, -24162, 46891, 53245, -33036, -57094, -57828, -31028, -37001, -39828, -12840, -59848, -62277, 13630, 23054, 12823, 54479, 14566, -8264, -2994, 58591, 74394, 55039, 2466, -8110, 14998, -3323, -13514, -71442, -86406, -14045, 19704, 23243, 14308, 29132, 88680, 72944, -49254, 18420, 29024, 31431, 19265, -29254, -61988, -86610, -101318, -57049, 9658, 32632, 8146, 14360, 11016, -37983, -7771, 41794, 103495, 119741, 136833, 118872, 98681, 166895, 97370, 55160, 20343, 64649, 15393, -43928, -32227, -10241, -12765, -25508]
9951b5508M8522k81M9285l6459m0852j0296N788N1791L3593j25507k8510k300
9939h0734L2489L7704R5188L5187k0444n1383l2316o2582k7712K7753J6335j7172
9927d7687j1605N6587L6668j7727J306k1070Q55k8490k7979j0023L2004L2572
9915d589j2183o9682r673k4874l1945L3079L1499J0903j8795l4590L6622O4549
9903b9679K0853J9896L4497L2245P250m1384l6204l2016K3575O5426j8093J3429
9891E9795L5723k7146P643r656J7857m422m1050p8298j951m8054k3164O62K0020
9878i2041P0462O875k2409L2763J9634n928J4279n4878J016J4688K6095L5836
9866D6392K7002L5537M4985J5357K0191j914j8676m3550p6147J2303N0210l5921
$$ y = [-25508, 23014, 22733, 72018, 35559, -5293, -15589, -9801, 41990, 75583, -49924, -78434, -80734, -48245, -10541, 84647, 119834, 99390, 48007, 15691, -46891, -74603, -46850, -30515, -47687, -59292, -2705, 33963, 16236, 17542, -3528, -2673, -31163, -59142, -69165, -37161, -4589, -16772, -86454, -96127, -121001, -152946, -119867, -88368, -77465, -96260, -130850, -94228, -29679, -8826, 11070, 45567, 77812, 85062, 43678, 7474, -24542, -967, 64459, 46366, 59795, 95518, 68372, 76015, 66359, 84216, 79794, 38744, -39554, -41505, -89559, -112723, -112061, -92041, -21579, -14704, -37113, -4350, 15284, 9356, 23635, -31243, -30227, -15539, 10556, 46392, 73394, 108931, 153916, 169273, 189464, 187550, 168874, 125324, 49177, 61480, 111690, 75769]
9854G5769l0253j7809N153k2082l6312L556P4077J9888l2532m8403n058n6112
9842g0118J5229K9028P3356O334K1112m3383o1003K6819N5992j7058k0429l0449
9830a4570M202L1590m5901N548J3432L2744m1641l8808L4472K047N485n015l017
9817a9432M1890J5220j7034j5497m1633l2921K1498L1053K0950L265N8289k271
9805F3377k9457m1827o648N6745Q5118P1199J0166l8810j29669m4943K0141n418
9793I974N1752K4991l047j4382j993m5175O5K1115l449J4343n4790m2109M770
9780c7935L3072J8708L4132K6938o9656l0196l7368L1145P642j8162J6102J2508
9768a3070r841Q551o03n0762j0277N3815P8011n1749n1523N3864L2882K5758l8007
$$ y = [75769, 45516, 27707, 32860, 10778, -25534, -21978, 52099, 71987, 39455, -8948, -14006, -70118, -54889, -25861, 47495, 53829, 74941, 31558, -29445, -2626, 53366, 36308, 15879, -14570, -10368, 21222, -24679, -19131, -5699, 27045, -14596, -53404, -18932, -16885, -11400, -16415, -19432, 22458, 37678, 20644, 5147, -36486, -69407, -47909, -16856, 4094, 7359, 65648, 63377, 33920, -7907, -14555, 42190, 127308, 198507, 208673, 169863, 40194, -4749, 15392, 9974, 61726, 86717, 83670, 69288, 67295, 22120, 22185, 43300, 39851, 54194, -596, -42705, -37935, -4863, 13845, 47977, 74915, 5259, -24937, -62305, -31160, -23518, -41680, -25578, -13070, -22911, -14360, -14963, -65725, -76002, -22187, 55824, 4075, -47448, 6416, 39298, 65056, 27049]
9755B7049l1829L1062O709m8845m7832M8725M1314o5422l9477k3999l0159L0146
9743a02558R4392L9863n0647n7882L8360N1112K8303j9362m9369r279M1843K9819
9731C4595m616j1914j8108l2390N3805N9701K37o7306l2748N1121k4911m090q192
9718d816k2559n5999J1063J5960R082M1768L9975J976q099K3948N6086m4962r3171
9705b9748K1333j4309j6060L5833N514J1061J922M282m2287J6085M299o316K8989
9692B0598K7502m425o422r824j9880j9248N7767L8906k2774o140P671m8588l9841
9679b4698l7607K7665J5292Q3968L1204j4794l0239r073r37o8633j3880Q9306
9667D7574N7625o4789r249L7261M526l415K4914K0910l9546o2513k0475j5983
$$ y = [27049, -4780, 26282, 32991, -15854, -63686, -14961, 26353, -39069, -78546, -102545, -132704, -102558, -8166, 31697, -18950, -76832, -38472, 12640, 40943, 21581, -27788, -37067, 4776, 34595, 29979, 18065, -43, -32433, 21372, 81073, 81310, 14004, -18744, 32377, 7466, 3376, -4816, -27375, -83374, -72311, -56351, -47269, -5501, 34474, 36450, 28351, 52299, 108385, 63423, -29748, -8415, -22724, -38784, -2951, 2563, 13624, 15546, 19828, -22459, -6374, -2075, -8391, 20598, 48100, 43675, 37253, 27429, 7549, -11699, 46068, 84974, 62200, 56060, 63731, 15143, -24698, -62305, -34640, -19348, 64620, 95824, 81030, 50791, 41718, 40781, -27852, -41732, 47574, 105199, 40410, 31161, 68422, 72948, 69533, 94447, 115357, 75811, 13298, -7177, -23160]
9655b3160j4820l1130L4223O4502j3334k2589K4132K4599O817J2392r147k7484
9643B5001k2668M8057L394n8900l6953j6618M4076m201O1306L9305O193r442k5741
9630E2809p94k5804k0311K0692n121J1258k4270J5518K4462q624j9786L2335K0737
9617G3101O632J0649l4831k4882M119O3235M0571J9693m2004l2890L703m4984
9605D2112l5272j4600k3916l1744J7140P566J05669Q1036m1980o2696m2711J1111
9593A1715N9251M3603L039R216j7987r2170l0466J4052j4966k6777k857J472Q1376
9580C8501Q473k4787o6853k6566J0526L6800K0126J3761O3869Q117p688o2797
9568A1482l2808m0879j0785R184O9394K3628P1714J4994K687k7100j9210o7464
$$ y = [-23160, -37980, -69110, -34887, 29615, 16281, -6308, 17824, 42423, 49240, 61632, 52485, 25001, 2333, 50390, 53784, -5116, -42069, -58687, -14611, -18812, 42494, 81799, 87992, 78550, 52809, 52015, 26211, 5900, 26592, 21471, 32729, 8459, 23977, 48439, 39815, 20029, 52364, 73101, 79733, 90382, 55551, 30669, 34788, 98023, 138594, 158287, 116283, 83393, 87096, 42112, 6840, -7760, -31676, -63420, -46280, -38714, 66955, 147991, 106011, 43315, 604, 11715, 70966, 114569, 117608, 126824, 108837, 16667, -13799, 253, -14713, -41490, -44347, -42875, 38501, 46974, 22187, -44666, -71232, -60706, -23906, -3780, 9981, 73850, 81967, 74279, 11482, -21326, -62205, -72990, -63806, 5588, 29216, 100930, 115924, 118611, 91511, 72301, 4837]
9556D837J3920k0153J5980K5488Q532M4552j8413k9181m922K4459o921j7072Q2879
9543A23985j7078o819l2717m1404J3855k8550j3178P857J3997O3626N310K1603
9531A10487K294J7107J2712q122P758P008n6454Q132m089n3677K7915m9174k0356
9518A541M9562L1595m5551l7608L3004k6737l9173l6931O14O8595Q4293J5763
9506I8967j2177j9927J4692L0841k7203j4072q945K3860j8090k9352j948K9636
9494F6282k2634j2203L3411j0540l4958l150O710L2095j0406p5927l0412M5755
9482a5977L0040M0677k6043l270k5407l8066M402N6355J0195L1940m4322j4708
9470E816K9667Q4927k6629n5807M7991P756k0635J672L848o4884k4056J9110J5691
$$ y = [4837, 18757, -1396, 14584, 40072, 48604, 93156, 74743, 45562, 40640, 65099, 58178, 41106, 123985, 106907, 100088, 67371, 25967, 39822, 11272, -1906, 5951, 19948, 83574, 88884, 110487, 112781, 129888, 142600, 134478, 142236, 149244, 92790, 100922, 96833, 43156, 71071, 21897, 1541, 51103, 82698, 37147, -461, 32543, 5806, -33367, -70298, -69684, -1089, 83204, 98967, 86790, 66863, 81555, 112396, 85193, 71121, 62176, 86036, 67946, 38594, 36646, 66282, 43648, 31445, 64856, 54316, 19358, 16208, 22918, 55013, 44607, -31320, -61732, -15977, 14063, 54740, 28697, 25427, 20, -38046, -33644, 22711, 32906, 64846, 20524, 5816, 35483, 120410, 93781, 37974, 85965, 93721, 73086, 74758, 78606, 13722, -10334, 8776, 24467]
9457B4467L3060L6075K5563J9962l2332l5053j0760n484K8754J1058k3838n7194
9445A4278j1480M5691O366j8615n6141P375M5317L5549M339J1555K823m1869o7815
9432b2627j938J8953L1510L9674N8666Q5395O817m3180m5174m374j10599m8395
9420c5272O1236M4871j8632L1546J6916o9592o156k2540n8924K9672N2769J3945
9408C9839k8238j0567O3888J9893K9043L5236O5230m8999o5987l8510M7726k6703
9396H1851q620M567m9612L0320N3368K990J3449k1428m9766J7161J7034m7768
9384D3546m0900P731p221J9029L5917K1124j192O8553K9112n9115l6344l4225
9372D6015o7563j8547K7375L4671N2282l4423q4956n0489M8329R1610J7122k9703
$$ y = [24467, 57527, 93602, 119165, 139127, 106795, 71742, 60982, 55498, 84252, 95310, 71472, 14278, 2798, 48489, 54855, 36240, -19901, -12526, 32791, 68340, 72679, 84234, 87057, 45188, -22627, -24565, -5612, 25898, 65572, 124238, 209633, 216450, 173270, 128096, 123722, 13123, -35272, 25964, 70835, 52203, 83749, 100665, 31073, 24917, 2377, -56547, -26875, 25894, 39839, 11601, 1034, 64922, 84815, 113858, 149094, 214324, 165325, 99338, 60828, 108554, 81851, 73231, 77798, 28186, 58506, 111874, 114864, 128313, 106885, 57119, 74280, 91314, 43546, 2646, 10377, 3156, 22185, 58102, 79226, 78034, 146587, 175699, 116584, 80240, 46015, -21548, -40095, -12720, 21951, 74233, 39810, -45146, -95635, -47306, 44304, 61426, 31723]
9360C1723L7084J8055L2230j3115m8023L032L9681J2497O0186o789l6257o3273
9348F7031o7379k955L1792N362l9566L9206N143l7514k269O6721O5798M1272J4488
9335A87130n3692J3658L4306l9550j00346k4964O2923k7600l352L362M5945J1854
9323A09674L578K8348J5846J8317K5290r503l370J9831K4709o3129N616q154n0306
9310A16747K1202N6636l1549j02891m1316K3312L6663K7552J4057K5291n2260
9299I3444q2067n3745J1885j0679K7662J7551K9229P1191K364j3410k1342m6961
9287B5122m085L0899M0147J9101J0932l6395l0102L5643N0182l3792k3540l1580
9275E2532k1010l741q498J3679j3471J2998p039O559N9424N3963J4815m249l0833
$$ y = [31723, 68807, 86862, 119092, 105977, 57954, 60986, 100667, 113164, 173350, 166561, 130304, 67031, -348, -3303, 28489, 33851, -5715, 33491, 38634, 1120, -1149, 65572, 131370, 172642, 187130, 133438, 147096, 181402, 141852, 41506, 16542, 79465, 51865, 48513, 51875, 97820, 109674, 113252, 141600, 157446, 175763, 201053, 191550, 188180, 208011, 232720, 169591, 175207, 167053, 116747, 137949, 194585, 163036, 60145, 18829, 42141, 78804, 106356, 120413, 145704, 93444, 11377, -42368, -30483, -41162, -13500, 4051, 33280, 104471, 106835, 93425, 72083, 25122, 21037, 51936, 92083, 111184, 122116, 85721, 55619, 91262, 141444, 107652, 84112, 52532, 31522, 27781, 19283, 32962, 19491, 32489, 25450, 32009, 91433, 145396, 160211, 155962, 125129]
9262A25129L187p238L5604N411M3792m8656l5397J458J8171m631N991L5076k3436
9249A54461j6749M7456n1776k6144k1780j2769m4843o586K7102j7077J7075L9660
9237H8030J8891K4387j1332N6609M3286n7203o3566L3401j3466J3503M8964K1392
9225B02896m514p1430m9832P1373o786J3048l8866M4181j6918j2117l5344J2008
9213A07699N5765k4843m1622J6436L8734l3205k1475K6737l1095L0575N4553j7247
9201A61012J8983m733k688J8378k6843n4693k1874K6268j606l3408k5781j1698
9189D1317K3179M7620Q724N1681Q52l6865k007J7920P99J1563J1434K6914l2603
9176A70528n2622J173q389J8952m360K4925K4855k124L4710j1898n2609n7962
$$ y = [125129, 128316, 121078, 156682, 162093, 205885, 157229, 121832, 123290, 141461, 136830, 142821, 177897, 154461, 137712, 185168, 133392, 107248, 85468, 72699, 27856, 21270, 48372, 31295, 48370, 88030, 106921, 131308, 119976, 176585, 219871, 162668, 99102, 132503, 119037, 132540, 181504, 202896, 198382, 126952, 77120, 148493, 141707, 154755, 115889, 160070, 143152, 131035, 95691, 107699, 163464, 138621, 96999, 113435, 152169, 118964, 97489, 124226, 93131, 123706, 178259, 161012, 179995, 175262, 172574, 190952, 164109, 109416, 87542, 113810, 112204, 78796, 53015, 41317, 64496, 112116, 120840, 172521, 173373, 136508, 134501, 152421, 153220, 164783, 176217, 203131, 170528, 117906, 119079, 110690, 129642, 125282, 150207, 175062, 172938, 207648, 195750, 143141, 85179]
9164H5179M4333K1668p843N8838K3561L8556o677l6904k8447O5820M5130l2706
9152B70508q941p274o5716n3605M4710L8225k6946K3628J8453j3705m57K0798
9140B39678p209k3283k5147J3819R8941K6945m0278l4736q0042l2967j460P7079
9128B11340O8110K7102J6203q470m4749M821N3852n6017p0232O7785R2053L4638
9116C96436J1059K4861k536j8516P438J081L1898N9987N1149N8991K9843Q824
9104F60515L0151N5763M3561J9269L6200N3717J26214J47781J63097J75916K21734
9093A733918K74350L69914M09498N57731P79163J028833J290248J718347K287311
9084A0449313L391931M897633O592178O662073L055392k067266n388236o427799
$$ y = [85179, 129512, 151180, 143337, 202175, 225736, 264292, 257615, 220711, 192264, 258084, 303214, 270508, 261567, 254293, 188577, 134972, 179682, 217907, 190961, 214589, 233042, 219337, 218880, 239678, 232469, 209186, 184039, 197858, 296799, 323744, 283466, 248730, 168688, 135721, 134261, 211340, 279450, 306552, 322755, 314285, 269536, 274357, 328209, 272192, 201960, 269745, 361798, 396436, 407495, 432356, 429820, 411304, 418742, 419823, 451721, 511708, 562857, 621848, 651691, 660515, 690666, 746429, 789990, 809259, 845459, 899176, 1025390, 1173171, 1336268, 1512184, 1733918, 2008268, 2378182, 2787680, 3345411, 4124574, 5153407, 6443655, 8162002, 10449313, 13841244, 18738877, 25331055, 31993128, 35048520, 32981254, 27593018, 21165219]
9076B1165219n654643m097759k769635j857369j321809r81015p44816n98121m93468
9067B646584l33237k43590j88809j56456j27751j86209j49843r9826j24697q7607
9057I48559r0160n6708n2936j6965k0413J4956p7468m5540j7988p9982k1839l9813
9045D43703L3014j0699j13359m2200K4970J6257n1136p62L8888n998l8995K9804
9033C23487J2498l3345n7108N0453r385K1800l875k9132j4592m7274o104J4501
9021B21924M5892J6929j9155m8787m5238M514L4802O0606J6115m1547j8686n2455
9009A74914j8293k1294L3173q633K761O267m044J3055L0724N1914K0721m5554
8997B35711O165K0449k3026l7871p0128K916Q637l4898L656J8916L0701L1428
$$ y = [21165219, 15510576, 11412817, 8643182, 6785813, 5464004, 4482989, 3738173, 3140052, 2646584, 2313347, 2069757, 1880948, 1724492, 1596741, 1410532, 1260689, 1160863, 1036166, 948559, 858399, 801691, 748755, 731790, 711377, 726333, 648865, 603325, 585337, 505355, 483516, 443703, 476717, 466018, 352659, 310459, 335429, 351686, 300550, 299788, 338676, 332678, 293683, 323487, 335985, 302640, 245532, 295985, 286600, 308400, 304525, 275393, 260801, 213527, 207423, 221924, 267816, 284745, 265590, 216803, 171565, 176079, 210881, 271487, 287602, 246055, 227369, 174914, 156621, 135327, 168500, 159867, 162628, 168895, 164851, 177906, 208630, 260544, 281265, 235711, 241876, 262325, 239299, 201428, 131300, 134216, 142853, 107955, 111611, 130527, 161228, 192656]
8985A92656o335K3073k2717R4l0886p1346m1609P3660K042K431L065N2427R0562
8972B67117l2981n2264l54l8855K8675J9929j7152o2661k0148R1330L6621l0144
8960A89113p6590O971M592M42P485p364j2585L407L1433l3981l7428L5535m9266
8947F1764m8605Q633L7999M6949K4152O9465m3643k7874l5426k9361L2129K8406
8935A24588l2636j1477N948l8842K5013L3399j1821l1753n0860q9455N70K3648
8923e3678L2494K4725P8982J7028k1314m0012L7262O5812l9553k9909L2713K4575
8911A29125n594o3006L0146J3307m7542k3288l8057J3153L6548j6750l8611L2789
8899B2220L7103J1768K5781K0555K3859K4498q8253n2457k6732O8283m297o3593
$$ y = [192656, 186321, 209394, 186677, 186771, 155885, 84539, 42930, 116590, 118632, 121063, 124128, 176555, 267117, 234136, 181872, 181518, 142663, 171338, 191267, 174115, 111454, 91306, 182636, 219257, 189113, 112523, 119494, 124086, 124528, 132013, 124649, 112064, 115471, 146904, 112923, 75495, 111030, 61764, 13159, 21792, 59791, 106740, 130892, 200357, 156714, 128840, 93414, 64053, 96182, 124588, 91952, 80475, 86423, 47581, 72594, 105993, 94172, 62419, 11559, -77896, -77326, -53678, -21184, 3541, 82523, 99551, 78237, 38225, 75487, 141299, 101746, 71837, 104550, 129125, 123531, 60525, 90671, 103978, 56436, 33148, -4909, 8244, 44792, 28042, -10569, 22220, 59323, 71091, 96872, 117427, 141286, 165784, 77531, 25074, -1658, 66625, 62328, -1265]
8887a265M5183L4003j0377J138J3179k7040r353j4541K737J7918L6884k1015J5692
8874H3143M0547J2467K0226j4158n0624l3221j6887K1861K3156M8021K6096n2829
8862A07798k1317N0377K3829k020l5134q0931J026l2254R022M8195k2251o809
8850C9531m3927k3703m2849K9021L5674l5327j4000L1077L4952K983J6971Q7468
8838A17871L3485l0656l6865m5485j0401k9861o1443L7353J9158O776K657Q249
8826A0838J1261O5538m2481o1080j5949l205m0577L577Q7792N0621L7827K7007
8814A31169r679n5546Q030m379j4023m1787N9604R126j7319n022j4687k2428J754
8801B4813l7859n7187P3016N7846k3670L081l0368K2225J8756J399K544l7554
$$ y = [-1265, 43918, 77921, 67544, 68682, 81861, 54821, 45468, 30927, 33664, 51582, 88466, 67451, 83143, 123690, 136157, 156383, 142225, 91601, 58380, 41493, 63354, 86510, 134531, 160627, 107798, 86481, 136858, 160687, 158667, 123533, 42602, 43628, 11374, 20396, 68591, 46340, 39531, -4396, -28099, -70948, -41927, -6253, -41580, -55580, -24503, 10449, 13432, 30403, 117871, 151356, 120700, 83835, 38350, 27949, -1912, -63355, -26002, -6844, -68, 2589, 10838, 22099, 87637, 45156, -15924, -31873, -35078, -75655, -72078, 15714, 66335, 104162, 131169, 121490, 65944, 73974, 69595, 55572, 13785, 73389, 82515, 65196, 60174, 45487, 23059, 24813, -13046, -70233, 2783, 60629, 36959, 40040, 9672, 31897, 50653, 52052, 54596, 17042]
8789A7042J3948M9584M1542j8759k7140O6048L4179m5474Q2649l6465j32903n6152
8777a1901M0488N0877L7007l0308l7684J914j6801L729J2945m3080j5714O1495
8765E2967q713L8866K8802k5456P557m1619N7393j9079J2338m526n6348k2601
8753A9581N667r77J1836N074O5814O0572L435q4441m2634N5609L7049N4363k0295
8740A70653J1078m0927N5937K52l0822N863J3784o3560m1246J3377K922N2117
8728A49428O1490n942n4057J890l486K9316M0365o6280m1457l6962P724R82J8681
8715A01692M0085k8633J4184Q4783J5617k8856p2276j2985N7938J5612M8510j9500
8703B16171N0293O8276J6371j2647q600N6811m30n5269k2356K0865L7079L8252
$$ y = [17042, 30990, 80574, 122116, 103357, 76217, 142265, 176444, 130970, 213619, 177154, 44251, -11901, 28587, 79464, 116471, 86163, 48479, 50393, 33592, 37321, 50266, 7186, -8528, 52967, 44254, 83120, 111922, 86466, 94023, 52404, 109797, 90718, 103056, 98530, 42182, 19581, 25248, 24271, 36107, 41181, 106995, 167567, 171002, 86561, 43927, 99536, 136585, 190948, 170653, 181731, 140804, 196741, 196993, 166171, 172034, 185818, 122258, 81012, 94389, 97311, 149428, 210918, 204976, 150919, 152809, 149323, 178639, 219004, 152724, 111267, 74305, 82029, 83011, 101692, 141777, 113144, 127328, 212111, 227728, 198872, 126596, 113611, 171549, 187161, 235671, 216171, 266464, 334740, 351111, 338464, 329864, 386675, 386245, 330976, 308620, 329485, 366564, 404816]
8691D04816K4040J9833k350o9291n5133j2820J9134N6603O8714L7084J8571j8121
8679D91080o2331q8512J5859q405k9843J2715O3949P2697j1452k4998P863R1010
8667E29632K8494o3600k5078M598j1162J3021J2804K4334N8246P2640p6660p5949
8655D91320O6859N8674k6637K778K8492N4982l475j3470L0079O9796j8001l0794
8643G10603K8920L9127O3802M7407O6375J20832J36619P2597Q8069J69831J39641
8632A683823P0076N0239Q2115M3042J18830R4393K6742L9948j0327j4135k2621
8621B162125o2436l3167j31996q8708k3488o7034p2060p8953r458j6306O898l9230
8609A546187P110J9898M893q2679p2172O2458J0555q2068j34826j16632j09888
$$ y = [404816, 428856, 448689, 446339, 377048, 321915, 309095, 328229, 384832, 453546, 490630, 509201, 491080, 428749, 340237, 356096, 347691, 317848, 330563, 394512, 467209, 455757, 430759, 438622, 529632, 558126, 494526, 469448, 474046, 462884, 475905, 488709, 513043, 571289, 643929, 567269, 491320, 558179, 616853, 590216, 592994, 621486, 676468, 672993, 659523, 689602, 759398, 741397, 710603, 739523, 778650, 842452, 889859, 956234, 1077066, 1213685, 1286282, 1374351, 1544182, 1683823, 1753899, 1804138, 1886253, 1929295, 2048125, 2142518, 2169260, 2209208, 2198881, 2184746, 2162125, 2099689, 2066522, 1934526, 1845818, 1822330, 1755296, 1683236, 1604283, 1594825, 1578519, 1585417, 1546187, 1553297, 1573195, 1578088, 1495409, 1423237, 1485695, 1496250, 1414182, 1279356, 1162724, 1052836]
8598A052836p2481j06183p650n6476j40108j06073o5626m9182k7992n6572r084
8587C55409K1553k5782K1980k5962n7821p2035m4503l1187J4578J3058Q071m649
8575A72710L6059K598J6178m4347j5031K6716j7792o7M2801M2111l5448m8883
8563A77605n8878k4243P586j357N5449N6669j5198p3534k5646M6021l057k5757
8551A15660L2970L5361J1865l2809k9623q661K3950k1393l4840K0278l7535p1252
8539C971l6632Q9298O4682m4632p7505L564r657N0224Q6524L4714l6331l8840
8527H9380l0594r403k9334p8807M7182K5134L7617M154k8363o2980M3150O8943
8515G6079m2756k6726k4915L7153M6149n899l5335K5666K9060o0662k9753M7509
$$ y = [1052836, 980355, 874172, 866522, 810046, 669938, 563865, 498239, 449057, 421065, 364493, 355409, 376962, 351180, 373160, 347198, 289377, 217342, 172839, 141652, 156230, 169288, 177359, 172710, 208769, 211367, 227545, 183198, 168167, 194883, 177091, 177024, 219825, 261936, 226488, 177605, 118727, 94484, 102070, 100713, 156162, 212831, 197633, 124099, 98453, 144474, 141417, 115660, 148630, 183991, 195856, 163047, 133424, 124763, 148713, 127320, 92480, 112758, 75223, 3971, -32661, 56637, 121319, 76687, -818, 2746, -6911, 43313, 129837, 164551, 128220, 89380, 58786, 49383, 20049, -58758, -11576, 13558, 51175, 55329, 26966, -36014, 7136, 76079, 33323, 6597, -18318, 18835, 64984, 59085, 23750, 49416, 78476, 17814, -11939, 35570]
8503C5570O9396M4239l6847l9271j8596k239N8522L8293K9673m8689o0510l7206
8491C2335j6630L0508M5962k3451n133L1744N559L92k3888R06j7836j241n9842
8478f15p613K0647o842L0483m0180l4988J0704j0371M9760M8200J8443p3380m8821
8465d4573L8576M8859J195l8887l5716K2013J7505L4751j1950r237l6405j1986
8453b5855J6042j1536n10M565L2728K5004j4270j2851m175L0024K386l0110L8
8440A1480m071J7665J1632j8464O909M5953L9090N591l5594j2258Q0494J4138
8428A62565p9038n9610N926Q7692K9597m3354r0671m5930L3397J5334j0474k3849
8416a8415o36M626P0801N9825m6363l2164j7943r565k6088o6720j1734L4297N2245
$$ y = [35570, 104966, 149205, 112358, 73087, 54491, 52252, 110774, 149067, 178740, 130051, 69541, 32335, 15705, 46213, 92175, 68724, 63591, 95335, 100894, 101286, 77398, 78304, 60468, 59227, -615, -8228, 12419, 5577, 36060, -4120, -39108, -28404, -38775, 10985, 59185, 77628, 4248, -44573, -5997, 42862, 44057, 5170, -30546, -8533, 8972, 43723, 31773, 22536, -13869, -25855, -9813, -21349, -21859, -17294, 15434, 40438, 26168, 13317, 9142, 39166, 41552, 11442, 11480, 7409, 25074, 36706, 18242, 25151, 71104, 110194, 115785, 80191, 67933, 148427, 162565, 83527, 23917, 29843, 117535, 147132, 103778, 13107, -32823, 574, 15908, 5434, -18415, -19051, -14425, 56376, 116201, 69838, 37674, 19731, 10166, -15922, -82642, -94376, -60079, -7834]
8403g834Q3697j5245L2399l3842k5805k1552Q521N177j2821j3627L7618M6956
8391H3642n0505O079L5315N8652j629m6254J1371q772o2875m9649L756K2085P891
8378I107K1863o4224q3001j6378R5264j1396l5877M8293J2762j0042K3746N3114
8366D3231L1054N164J4665k724j1589j5716J4393j6230J0706j4778K0401k7107
8354E1470o7387L9828k1188N6509K2460q497n6229j6243L5864Q464k44L1181l1034
8341D4954j2752k4333k224p340N2126J4044m7592K7004O1008L1634q1913q8345
8329c3729m0144l8612J5870O8456N8635L0043N3789j2697p7590k9104q026k6799
8317c9908m1187j4905M5707L0262O5371j3331m8597L3480J330l6635K4675P307
$$ y = [-7834, 75863, 60618, 93017, 59175, 33370, 11818, 20339, 25516, 12695, -932, 36686, 83642, 33137, 39216, 74531, 133183, 131554, 85300, 96671, 87899, 25024, -24625, -20869, 1216, 9107, 30970, -33254, -116255, -132633, -37369, -48765, -84642, -36349, -23587, -33629, -9883, 43231, 74285, 79449, 94114, 91390, 79801, 64085, 78478, 62248, 72954, 58176, 78577, 51470, -15917, 23911, 2723, 59232, 81692, 73195, 16966, 723, 36587, 45051, 44807, 75988, 44954, 32202, 7869, 5645, -1695, 50431, 64475, 16883, 43887, 104895, 136529, 54616, -33729, -73873, -112485, -96615, -28159, 30476, 60519, 114308, 101611, 24021, -5083, -13109, -39908, -81095, -96000, -50293, -20031, 45340, 32009, -16588, 16892, 18222, -18413, 6262, 13569]
8305A3569m2813M0662N2264J5228n0250m0632J327k1474j6538M0175O355o2946
8293f5073M5239N3540k3175L7413L7948j771j9854l2293L815k8991j4537r819
8281a7558N920M0727M5890M4732K3822K0081l7395l9961j8462l7223n0886k264
8269b2577M6996L2956K8595N992o022k7565l611p807L4876N2694l0605m7774o5334
8256i186o5978L4899L5354L0516o9595j4428K019n7727J5316O2294J087O1454
8244B6025J6556j7442m6545j9180p831j783K9424k8451J5735J8362k2378N2817
8232A5309k4520l1747j84R918J399L2419R962J8748J9704l9747L637k7144m5567
8219e7813j8111m303j7687M1517M8926R959o0515N228l3318N326j063m6604K4958
$$ y = [13569, -29244, 11418, 63682, 78910, 28660, -11972, -10645, -32119, -48657, -8482, -2127, -65073, -19834, 33706, 10531, 47944, 85892, 84121, 64267, 31974, 35789, 6798, -7739, -17558, -11638, 29089, 74979, 119711, 143533, 163614, 126219, 86258, 67796, 30573, -20313, -22577, 24419, 57375, 85970, 91962, 85940, 58375, 54764, 46957, 81833, 134527, 103922, 56148, -9186, -75164, -40265, -4911, 25605, -43990, -58418, -56399, -114126, -98810, -36516, -35429, 26025, 42581, 25139, -21406, -40586, -48417, -50200, -20776, -49227, -33492, -15130, -37508, 15309, -9211, -40958, -41142, -31224, -29825, 2594, 12556, 31304, 51008, 11261, 14898, -12246, -57813, -75924, -80227, -97914, -56397, -7471, 2488, -58027, -52799, -86117, -80791, -81854, -128458, -103500]
8206a03500L0574J2147K0727m115K8465L5777o466K0533l8446m5750L1934k2920
$$ y = [-103500, -72926, -60779, -40052, -44167, -15702, 20075, 13609, 34142, -4304, -50054, -18120, -41040]
$$ [...]
##END NTUPLES=NMR SPECTRUM
##END=
