##TITLE=Analysis number 330428
Compound Code cc 04904
Project Code adrs
Chemist Name craigr
##JCAMPDX= 6.0         $$ Bruker NMR JCAMP-DX V2.0
##DATA TYPE= NMR SPECTRUM
##DATA CLASS= NTUPLES
##ORIGIN= Bruker BioSpin GmbH
##OWNER= nmr
$$ XWIN-NMR		Version 3.5
$$ Fri Nov 23 11:27:04 2007 GMT Standard Time (UT+0h)  MAYBRIDGE\nmr@NMR_250MHZ
##.OBSERVE FREQUENCY= 250.131544655141
##.OBSERVE NUCLEUS= ^1H
##.ACQUISITION MODE= SIMULTANEOUS (DQD)
##.ACQUISITION SCHEME= undefined
##.AVERAGES= 16
##.DIGITISER RES= 18
##SPECTROMETER/DATA SYSTEM= dpx250
##.PULSE SEQUENCE= zg30
##.SOLVENT NAME= CDCl3
##.SHIFT REFERENCE= (INTERNAL, CDCl3, 0, 16.522)
##AUDIT TRAIL= $$ (NUMBER, WHEN, WHO, WHERE, WHAT)
$$ ##TITLE= Audit trail, XWIN-NMR		Version 3.5
$$ ##JCAMPDX= 5.01
$$ ##ORIGIN= Bruker BioSpin GmbH
$$ ##OWNER= nmr
$$ C:\u/data/dgb/nmr/ADRS/2200/pdata/1/auditp.txt
$$ ##AUDIT TRAIL=  $$ (NUMBER, WHEN, WHO, WHERE, WHAT)
(   1,<2007-11-23 11:26:32.22 +000>,<MAYBRIDGE\nmr>,<NMR_250MHZ>,
      <created by zg, POWCHK disabled, PULCHK disabled
       configuration hash MD5:
       76 6E 9A 78 1E 09 19 81 EC 84 63 8F B0 6A 59 2D
       data hash MD5: 64K
       72 46 C0 35 0D B1 2D 21 86 48 B2 81 11 6D AE D8>)
(   2,<2007-11-23 11:26:52.79 +000>,<MAYBRIDGE\nmr>,<NMR_250MHZ>,
      <Start of raw data processing
       ef LB = 0.3 FT_mod = 6 PKNL = 1 SI = 32K 
       data hash MD5: 32K
       5B A6 4A 0E E3 C5 E9 31 E5 E5 42 14 3E 97 50 D8>)
(   3,<2007-11-23 11:26:54.47 +000>,<MAYBRIDGE\nmr>,<NMR_250MHZ>,
      <apk 
       data hash MD5: 32K
       1A 2B CD DB D4 D8 AC E1 A0 D6 E4 1E 3D B4 D4 2C>)
(   4,<2007-11-23 11:26:55.19 +000>,<MAYBRIDGE\nmr>,<NMR_250MHZ>,
      <abs ABSG = 5 
       data hash MD5: 32K
       22 FC 39 F0 90 29 2C 62 FD 13 0E 8D 17 85 BC 0B>)
$$ ##END=
$$ 
$$ hash MD5
$$ 46 66 27 32 00 D3 68 6A 0A 0B 86 01 3D 32 CF 1C
##$RELAX= 
##$RELAX= 
##$RELAX= 
##$RELAX= 
##$RELAX= 
##$RELAX= 
##$RELAX= 
$$ Bruker specific parameters
$$ --------------------------
##$DU= <C:\u>
##$EXPNO= 2200
##$NAME= <ADRS>
##$PROCNO= 1
##$TYPE= <nmr>
##$USER= <dgb>
##$AMP= (0..31)
100 100 100 100 100 100 100 100 100 100 100 100 100 100 100 100 100 100 
100 100 100 100 100 100 100 100 100 100 100 100 100 100 
##$AQSEQ= 0
##$AQ_mod= 3
##$AUNM= <au_zg>
##$AUTOPOS= <3 >
##$BF1= 250.13
##$BF2= 250.13
##$BF3= 250.13
##$BF4= 250.13
##$BF5= 500.13
##$BF6= 500.13
##$BF7= 500.13
##$BF8= 500.13
##$BYTORDA= 1
##$CFDGTYP= 0
##$CFRGTYP= 5
##$CHEMSTR= <none>
##$CNST= (0..31)
1 1 145 1 1 1 1 1 1 1 1 1 1 1 1 1 1 1 1 1 1 1 1 1 1 1 1 1 1 1 1 1 
##$CPDPRG= <>
##$CPDPRG1= <>
##$CPDPRG2= <>
##$CPDPRG3= <>
##$CPDPRG4= <mlev>
##$CPDPRG5= <mlev>
##$CPDPRG6= <mlev>
##$CPDPRG7= <mlev>
##$CPDPRG8= <mlev>
##$CPDPRGB= <>
##$CPDPRGT= <>
##$D= (0..31)
0 1 0 0 0 0 0 0 0 0.06 0 0 0 0 0 0 0.0002 0 0 0 0 0 0 0 0 0 0 0 0 0 0 
0 
##$DATE= 1195817190
##$DBL= (0..7)
120 120 120 120 120 120 120 120 
##$DBP= (0..7)
150 150 150 150 150 150 150 150 
##$DBP07= 0
##$DBPNAM0= <>
##$DBPNAM1= <>
##$DBPNAM2= <>
$$ [...]
##$SUBNAM7= <"">
##$SUBNAM8= <"">
##$SUBNAM9= <"">
##$SW= 20.6930455092707
##$SWIBOX= (0..15)
0 0 3 0 0 0 0 0 0 0 0 0 0 0 0 0 
##$SW_h= 5175.983436853
##$TD= 65536
##$TD0= 1
##$TE= 295.16
##$TE2= 300
##$TE3= 300
##$TEG= 300
##$TL= (0..7)
0 120 120 120 120 120 120 120 
##$TP= (0..7)
150 150 150 150 150 150 150 150 
##$TP07= 0
##$TPNAME0= <>
##$TPNAME1= <>
##$TPNAME2= <>
##$TPNAME3= <>
##$TPNAME4= <>
##$TPNAME5= <>
##$TPNAME6= <>
##$TPNAME7= <>
##$TPOAL= (0..7)
0.5 0.5 0.5 0.5 0.5 0.5 0.5 0.5 
##$TPOFFS= (0..7)
0 0 0 0 0 0 0 0 
##$TUNHIN= 0
##$TUNHOUT= 0
##$TUNXOUT= 0
##$USERA1= <user>
##$USERA2= <user>
##$USERA3= <user>
##$USERA4= <user>
##$USERA5= <user>
##$V9= 5
##$VALIST= <valist>
##$VCLIST= <CCCCCCCCCCCCCCC>
##$VD= 0
##$VDLIST= <DDDDDDDDDDDDDDD>
##$VPLIST= <PPPPPPPPPPPPPPP>
##$VTLIST= <TTTTTTTTTTTTTTT>
##$WBST= 1024
##$WBSW= 4
##$XGAIN= (0..3)
0 0 0 0 
##$XL= 0
##$YL= 0
##$YMAX_a= 277762
##$YMIN_a= -377698
##$ZGOPTNS= <>
##$ZL1= 120
##$ZL2= 120
##$ZL3= 120
##$ZL4= 120
##$ABSF1= 16.522
##$ABSF2= -4.171173
##$ABSG= 5
##$ABSL= 3
##$ALPHA= 0
##$AQORDER= 0
##$ASSFAC= 0
##$ASSFACI= 0
##$ASSFACX= 0
##$ASSWID= 0
##$AUNMP= <proc_1d>
##$AZFE= 0.1
##$AZFW= 0.1
##$BCFW= 0
##$BC_mod= 0
##$BYTORDP= 0
##$COROFFS= 0
##$CY= 12.5
##$DATMOD= 1
##$DC= 0
##$DFILT= <>
##$DTYPP= 0
##$F1P= 14.0000005364418
##$F2P= -0.99999901652339
##$FCOR= 0.5
##$FTSIZE= 32768
##$FT_mod= 6
##$GAMMA= 0
##$GB= 0
##$INTBC= 1
##$INTSCL= 1
##$ISEN= 128
##$LB= 0.3
##$LEV0= 0
##$LPBIN= 0
##$MAXI= 10000
##$MC2= 0
##$MEAN= 0
##$ME_mod= 0
##$MI= 0
##$NCOEF= 0
##$NC_proc= -4
##$NLEV= 6
##$NOISF1= 0
##$NOISF2= 0
##$NSP= 0
##$NTH_PI= 0
##$NZP= 0
##$OFFSET= 16.522
##$PC= 1
##$PHC0= 172.6942
##$PHC1= 5.031346
##$PH_mod= 1
##$PKNL= yes
##$PPARMOD= 0
##$PSCAL= 4
##$PSIGN= 0
##$REVERSE= no
##$SF= 250.13
##$SI= 32768
##$SIGF1= 0
##$SIGF2= 0
##$SINO= 400
##$SIOLD= 32768
##$SREGLST= <1H.CDCl3>
##$SSB= 0
##$STSI= 32768
##$STSR= 0
##$SW_p= 5175.98343685301
##$SYMM= 0
##$S_DEV= 0
##$TDeff= 65536
##$TDoff= 0
##$TI= <Analysis number 999999
Compound Code 99
Book Reference 9
Project Code 9>
##$TILT= no
##$TM1= 0
##$TM2= 0
##$TOPLEV= 0
##$USERP1= <user>
##$USERP2= <user>
##$USERP3= <user>
##$USERP4= <user>
##$USERP5= <user>
##$WDW= 1
##$XDIM= 32768
##$YMAX_p= 443410041
##$YMIN_p= -224815
$$ End of Bruker specific parameters
$$ ---------------------------------
##NTUPLES= NMR SPECTRUM
##VAR_NAME=  FREQUENCY,     SPECTRUM/REAL,   SPECTRUM/IMAG
##SYMBOL=    X,             R,               I
##VAR_TYPE=  INDEPENDENT,   DEPENDENT,       DEPENDENT
##VAR_FORM=  AFFN,          ASDF,            ASDF
##VAR_DIM=   32768,         32768,           32768
##UNITS=     HZ,            ARBITRARY UNITS, ARBITRARY UNITS
##FACTOR=    0.157963299565203, 1,           1
##FIRST=     4132.6476996994, 0,             0
##LAST=      -1043.33573715361, 0,           0
##MIN=       -1043.33573715361, -224815,     0
##MAX=       4132.6476996994, 443410041,     0
$$ Real data points
##PAGE= N=1
##DATA TABLE= (X++(R..R)), XYDATA
$$ [...]
28886c5465P4955K5446k6365K8536P4833o1765q2605m9338m7120p07M6222K0737
28874c2636K6142M4682k1870l8273J1162O666L6440J6334k2402M952K9101m1614
28862A8684o7265r743Q104J0734k5588l2429j0615J0168K8474j4232J6497R279
28850e7932l2339Q1834J7874K8512K0717M5392J7007o884k2744r8228J6202L2274
28838D1685L9648q556l5972k8420J152J674j0768K2804J0911l881k0383l4584
28826b4690r642O9280k9987Q687N810Q716J024q943J8172M9988J118K9567K3093
28813A42193k5122k8597k3255j1773R422J6291K4084n0156J5862j507p966L556
28801F3032p927N7411J1194l3812j5571M9031j0233N267n2893n5967J8651Q4331
$$ plain form
28886 -35465 39490 64936 38571 67107 141940 80175 -2430 -51768 -98888 -99595 -53373 -32636
28874 -32636 -6494 38188 16318 -21955 -10793 -4127 32313 48647 26245 31197 60298 18684
28862 18684 -48581 -58324 -50220 -39486 -65074 -97503 -108118 -97950 -69476 -83708 -67211 -57932
28850 -57932 -90271 -8437 9437 37949 58666 104058 121065 114181 91437 -6791 9411 41685
28838 41685 81333 72777 36805 8385 9537 11211 443 23247 34158 30277 9894 -24690
28826 -24690 -34332 34948 4961 13648 19458 28174 29198 20255 38427 88415 89533 119100 142193
28813 142193 117071 88474 65219 53446 62868 79159 103243 53087 68949 67442 59476 63032
28801 63032 55105 112516 123710 89898 74327 123358 113125 118392 65499 9532 28183 112514
28789A12514l2556k1878L5563N1652l2680q4094m1654K8450R724J2141p314n0758
28777b0890l769L0168L7074k5569m9356m0874j1737L4382P0739m5206j0012J231
28765c3819M7043L51P131J42l3048l0997k7008j2693L1668L3707n119N4504J6243
28752D8105o3771L138Q1994j4353k9887m9559l64n8366L159n40L8329J7736r738
28739c4117M114j8111j9978J566K7421K8105j5504J0538K6559m118j2889m2118
28727d8532p7557K3060P3650M5341J7743J5218M288o0603o1681N3499O420k1780
28715c0934J5262K8512K9789J8215m3380K9554j4365l3634L72K2096k8495k9466
28703c6474J7868k8343K9893J8618J3793j2399o9176M064M1169j0987M8356L4948
$$ plain form
28789 112514 79958 58080 93643 145295 112615 28521 -13133 15317 25041 37182 29868 -20890
28777 -20890 -24659 5509 42583 17014 -32342 -73216 -84953 -50571 20168 -25038 -35050 -33819
28765 -33819 13224 13575 20706 20848 -12200 -43197 -70205 -82898 -51230 -17523 -22642 31862 48105
28752 48105 -15666 -12528 69466 55113 25226 -24333 -24697 -83063 -79904 -80444 -42115 -24379 -34117
28739 -34117 -30003 -48114 -68092 -66526 -39105 -11000 -26504 -15966 10593 6475 -6414 -48532
28727 -48532 -126089 -103029 -29379 15962 33705 48923 53211 -7392 -69073 -15574 -9154 -30934
28715 -30934 -15672 12840 42629 60844 17464 47018 32653 -981 -609 21487 -7008 -36474
28703 -36474 -18606 -46949 -17056 1562 15355 2956 -66220 -62156 -20987 -31974 16382 51330
28691E1330K7036J1671q590j3366K8621m7880J3485Q231j7499q747j6094k4294
28679C904j3051J3839J9546m0866l4209L2889M0617m3259k0221N1031M1926L0475
28667H2621j8279L338n4l5286p8025M2257N3655k2050k8470m8122m8528L6704
28655f0239K7303j1858L7914L4047O3658m474l5054o048k9395J724J5887n8398
28643b4933j8023J2300J4875R181j1664P186Q957N0787K3600j008J7395k3652
28631F5001k3348k9395K695K8809N3710n36Q173k4990j00209J4005N1040l4068
28619A0887m5351p0437L010L3139J0432L7069J4212M1540Q8609o8019q6015J3260
28607a7664K2600k1300k6847l0450J4116N0939r125l6882O899l3048O1840M7448
$$ plain form
28691 51330 78366 90037 81447 68081 96702 48822 62307 70538 53039 44292 28198 3904
28679 3904 -9147 4692 24238 -16628 -50837 -17948 22669 -20590 -40811 10220 52146 82621
28667 82621 64342 67680 67626 32340 -45685 -3428 50227 28177 -293 -48415 -96943 -60239
28655 -60239 -32936 -44794 -6880 27167 90825 86351 51297 45249 15854 17578 33465 -24933
28643 -24933 -42956 -30656 -15781 -6600 -18264 -11078 -2121 48666 72266 71258 88653 65001
28631 65001 41653 12258 14953 43762 97472 96936 105109 80119 -20090 -6085 44955 10887
28619 10887 -34464 -104901 -101891 -68752 -58320 -21251 -7039 34501 123110 55091 -30924 -17664
28607 -17664 4936 -16364 -43211 -73661 -59545 -8606 -17731 -54613 -47714 -80762 -18922 28526
28595B8526l3507j4573K404K8403l3870l7702J4668l7643O9266K7848k6468o696
28583a9344J572l6493N741L3897L6972k3676l3471K2289k6039m4626J5037J6820
28571e1321k8534q749L295J0512J7823M6711J7112q8657j7018M611j3790P2201
28559c5804Q9844M2766k7070J4621n3044k4807N248J7239k1271r643K9109q170
28547A9018K2588k6145j6464j6897o850M1217K0669l5340L1568K6788m4413j4172
28535A567k2130o944J9049P946m3425j7307L322l0343j278N543K5717K9684o165
28522c4764L3647K7608l8246o094p013J6376J5939L4263k2867j16056l0238O4188
28510f3257M8096l3552M9624l721k3327j0578J8138j6969m846l1839M0654l305
$$ plain form
28595 28526 -4981 -19554 -17150 11253 -22617 -60319 -45651 -83294 -14028 13820 -12648 -19344
28583 -19344 -17772 -54265 -48524 -14627 22345 -1331 -34802 -12513 -38552 -83178 -68141 -51321
28571 -51321 -79855 -88604 -85309 -74797 -56974 -10263 6849 -81808 -98826 -94215 -108005 -35804
28559 -35804 54040 96806 69736 84357 31313 6506 11754 28993 7722 -1921 27188 19018
28547 19018 41606 15461 -1003 -17900 -24750 16467 37136 1796 33364 60152 15739 1567
28535 1567 -20563 -27507 -8458 -512 -43937 -61244 -57922 -88265 -89543 -84000 -58283 -28599 -34764
28522 -34764 -1117 26491 -11755 -17849 -24862 -8486 7453 41716 18849 -97207 -127445 -63257
28510 -63257 -15161 -48713 911 -2810 -26137 -36715 -18577 -35546 -40392 -72231 -31577 -34882
28498c4882q307J0004L4137M0456j9871p503k0043L0494J0385m1633k4190O7476
28486C6523L9763m1025J864l268j228M251J6142L6800l8592k5095J4762K2424
28474F3321l0761m1927J5894N1466p979l6028j3995J6147J3395k4125J0077k939
28462A2546n221l3315m7550L922K4369j8736K9351J3166K4551M7638j8055q5093
28450e2427K8210r17J3401J0240k6069Q314J2171m5122N622N2682J0825p688j9317
28437a0075j1831k2985j7272l3582K1000L7402L3196K9191q639M7579M533J2514
28425H1031R676n368k4515j2650l0261l3367n6844K6154P1099l492k7857N6881
28413E0487J09772n4129m6821J4767o031j4809j9171m213M9492K3151m8546o6337
$$ plain form
28498 -34882 -43189 -33185 952 41408 21537 14034 -6009 24485 34870 -6763 -30953 36523
28486 36523 76286 35261 37125 33857 32629 36880 53022 89822 51230 26135 40897 63321
28474 63321 32560 -9367 6527 57993 50014 13986 -9 16138 29533 5408 15485 12546
28462 12546 7325 -25990 -73540 -69618 -45249 -63985 -34634 -21468 3083 50721 32666 -52427
28450 -52427 -24217 -25134 -11733 -1493 -27562 -19248 -7077 -52199 -46577 6105 16930 9242 -10075
28437 -10075 -21906 -44891 -62163 -95745 -74745 -37343 -4147 25044 16405 63984 68517 81031
28425 81031 90707 85339 60824 48174 17913 -15454 -72298 -46144 24955 21463 -6394 50487
28413 50487 160259 106130 59309 74076 68045 53236 34065 29852 79344 102495 53949 -12388
28401a2388l0245N511N5740J5806l1438J2427k6186J8858M200k8448k3120j2361
28389e1644K4013K2759p0740o439K2732j095K9559r00l1482k669Q8330Q4310J7608
28376A24342k4269q1329k1041j5392L1586N5429O9023J6342k886j06536m158N9052
28364A00163p3948l8778L1389j8697R98l9231k938k9497j1502P471J7783J8663
28352c8124l4449j3988K639j7718J3138J08982M3036n7312N148j7212j0628l0605
28340d7093k2363N0729J1660l5319n6754K770R214M0424L5793J3780J0888o9901
28328e6172n374k8421k1134J4759Q216K6029j8735j6273J9495J9366L9077O4034
28316D4867K6000o1191k9827p804M1903k1756k3237Q609M1077L8278m940M6887
$$ plain form
28401 -12388 -42633 -37122 18618 34424 2986 15413 -10773 8085 12285 -16163 -39283 -51644
28389 -51644 -27631 -4872 -75612 -82051 -59319 -60414 -30855 -31755 -63237 -65906 22424 106734 124342
28376 124342 100073 18744 -2297 -17689 13897 69326 138349 154691 151805 45269 41111 100163
28364 100163 26215 -12563 18826 129 1127 -38104 -41042 -70539 -82041 -74570 -56787 -38124
28352 -38124 -72573 -86561 -83922 -101640 -88502 20480 63516 6204 11352 -5860 -16488 -47093
28340 -47093 -69456 -18727 -7067 -42386 -99140 -96370 -87156 -46732 -10939 2841 13729 -56172
28328 -56172 -61546 -89967 -111101 -96342 -88126 -62097 -80832 -97105 -77610 -58244 -19167 44867
28316 44867 70867 9676 -20151 -27955 13948 -7808 -31045 -22436 18641 56919 51979 98866
28304I8866j8830p2053K929R894K8391r3641j1521N2421J85l3765K1071J211P918
28291f924p8271k6324K0502O2659K9378K3152k2629N458N4622J0963m2691M1776
28279G1671m2292j4047n9358K1084P4991K3791J3034J1603j486k8108p3472j8883
28267b1472k4198M5201j42o8137j4271M3077J0862J0102P074J0867K5757J5106
28255C9826j3139l4909L9955K525m2091J2494Q1589j7365p8843J258N090J1141
28243G531M3428K4564l9726j8282m4259l7939k1477L4855P6709K0984m682j5999
28231B5707M3667J2206j8927m4281n7220m676p497m2625N8813m452M8887l3319
28219b3717k3438k3269k3228K5443M1849q551L3102K3952l7172j6692N7626K9144
$$ plain form
28304 98866 80036 7983 10912 20806 49197 -44444 -55965 -3544 -3359 -37124 -16053 -14842 -6924
28291 -6924 -85195 -111519 -91017 -28358 1020 24172 1543 7001 61623 72586 29895 71671
28279 71671 29379 15332 -44026 -22942 52049 75840 88874 100477 98991 70883 -2589 -21472
28267 -21472 -45670 -469 -611 -68748 -83019 -39942 -29080 -18978 -11904 -1037 24720 39826
28255 39826 26687 -8222 31733 34258 -7833 4661 86250 68885 -9958 -8700 -3610 7531
28243 7531 50959 75523 35797 17515 -26744 -64683 -86160 -51305 25404 46388 41706 25707
28231 25707 69374 81580 62653 18372 -38848 -43524 -51021 -93646 -34833 -39285 9602 -23717
28219 -23717 -47155 -70424 -93652 -68209 -26360 -34911 -1809 22143 -15029 -31721 25905 55049
28207E5049q569K4479j3024j7965n0242j8801P36K5956n2275n5648J8321N9942
28195c2041k685J5255J4355O8332j1866r700j5662K4887l379m8817p3090j754
28183g6165K7766K2295K9059k0665K8721j6227j8969M7089j3850K1228R211k8931
28171A0562n947j1645K2491J4563K5318K494j511l0254R473n0972l1000n7487
28159a03915j6142Q7674P2662k6742J4261K017l2857k3817J2004J00627k2728
28148F3044J0957M6243m3126m7150l3975l0632j3047J7363L8816N2392l9970M069
28136B4984k1978M741O3069j2866n4576j1832P5101R2642m2922q4266m4502q989
28124b1394J9525n183j618o1581k7233n639j2265M2557M8243L0343J6299o3061
$$ plain form
28207 55049 46480 70959 57935 39970 -10272 -29073 -28337 -2381 -54656 -110304 -91983 -32041
28195 -32041 -34726 -19471 -5116 63216 51350 41650 25988 50875 47496 -1321 -74411 -76165
28183 -76165 -48399 -26104 2955 -17710 11011 -5216 -24185 22904 9054 30282 39493 10562
28171 10562 4615 -7030 15461 30024 55342 57836 56325 26071 35544 -15428 -46428 -103915
28159 -103915 -120057 -32383 40279 13537 27798 29815 -3042 -26859 -14855 85772 63044
28148 63044 74001 120244 77118 29968 -4007 -34639 -47686 -30323 8493 60885 20915 24984
28136 24984 3006 7747 70816 57950 3374 -8458 66643 159285 116363 32097 -12405 -21394
28124 -21394 -1869 -7052 -8670 -70251 -97484 -103123 -115388 -72831 -24588 5755 22054 -41007
28112d1007K0356K2601n3152M7794J7053M2162K2800j6790l1931J9302o310j9199
28100B3679K7008j4358p398L8607k0146P433J8149n8206k700O0106M7760m2053
28088G7881j5918J9149o7854L7793m552o460J2217o0221j9313J9648p793k8330
28076d3753K8738k3845m9068P032k326M32J3949K1021J1415q784M1766o0750k4771
28063h8944P1572k8860P77J4627o0296l823Q0776P0476R540m8880k4468K6762
28051A9259K4077m2269J3712J6338K2157j1588l1858K2282l0244L783M5048N218
28039E5915o207m97N384P587k3015j5758l2822l00R677j7263P4672M6930j723
28026A02580j0635o7642j1742p959M0620p9089j8844K5727J3622J8125L3509P2560
$$ plain form
28112 -41007 -20651 1950 -51202 -3408 13645 55807 78607 61817 29886 49188 42878 23679
28100 23679 50687 36329 28931 67538 47392 54825 72974 14768 12068 72174 119934 77881
28088 77881 61963 81112 13258 51051 46499 40039 52256 -7965 -27278 -7630 -15423 -43753
28076 -43753 -15015 -38860 -87928 -80896 -83222 -82790 -68841 -47820 -36405 -45189 -3423 -64173 -88944
28063 -88944 -17372 -46232 -45455 -30828 -91124 -94947 -14171 56305 65845 16965 -7503 19259
28051 19259 43336 1067 14779 31117 53274 41686 9828 32110 1866 5649 50697 55915
28039 55915 49708 49211 54595 62182 39167 23409 -9413 -9713 -36 -17299 57373 104303 102580
28026 102580 91945 24303 12561 4602 45222 -33867 -52711 -26984 -13362 4763 38272 110832
28014A10832j2817k5264m0606m699J9755n9225k5378j1110L8124R6513j0321o5111
28002A0693k1361L6982M927n3934n3453j0416m1852O120l92l2804L4086L8200
27990h3204O9147L4116r2113m0177R1662O8485n0675k8443j8066L0050P7222K9171
27978H7175p705n3311n3218M0457j25M0186O8753j0179p0138j5794J3477l9767
27966a89J9973M0929J0502J661j9304J5916L0393K2622m4078n2476p119k108j29024
27953a12302O234N0655N1990j3114m5985m704N526K234M7941l0287N824O0200
27941B4212J6904j5896M1115r692Q516l3037p5952J3610N737m584J4197n1494
27929f6364O0937k3357j0817P2314M2040j1798k2748P471J2569l3684o220J3005
$$ plain form
28014 110832 98015 72751 32145 27446 47201 -12024 -37402 -48512 -10388 86125 75804 10693
28002 10693 -10668 26314 31241 -22693 -76146 -86562 -128414 -122294 -122686 -155490 -121404 -83204
27990 -83204 -14057 20059 -72054 -112231 -20569 47916 -2759 -31202 -49268 -19218 58004 87175
27978 87175 79470 26159 -27059 13398 13273 53459 122212 112033 41895 26101 39578 -189
27966 -189 19784 60713 71215 72876 53572 69488 99881 122503 78425 25949 18830 16722 -112302
27953 -112302 -106068 -55413 -3423 -16537 -62522 -67226 -61700 -59466 -11525 -41812 -35988 24212
27941 24212 41116 25220 66335 56643 65159 32122 -43830 -30220 -24483 -29067 -14870 -66364
27929 -66364 -5427 -28784 -39601 32713 74753 62955 40207 47678 60247 26563 20343 33348
27917C3348K3290J3776M0718k610j1578k0937l1392k8641K1146K083j8743J2745
27905C3205K3324L4497O5671m4838p7149k0522k3511n7196l52K9297M7903P3251
27893H3580O130p9854l3196R3732L5274m9244l0104P484j4184l0050n9013K8617
27881d0828O7949j2768l367M0729o269M386n8292N866N8908j985J636O528K1491
27868H3984j5555l0896J0034j0478k5815m6187n3293J8743L2137M530O108M1326
27856A4638O9299j1672n3165p1048l9356P7367J6317K6231N0296J8093o1581j9925
27844A5494N690J5758k9238K456k1523L1781J7289j3183J7220l2484O645M5223
27832F1128N972j3435k1712j284K6429J6490N0541L1380m7316l5469J446j0487
$$ plain form
27917 33348 56638 70414 111132 108522 96944 76007 44615 15974 37120 39203 20460 33205
27905 33205 56529 91026 156697 111859 34710 14188 -9323 -66519 -66871 -37574 10329 83580
27893 83580 89710 9856 -23340 70392 105666 56422 26318 33802 19618 -10432 -69445 -40828
27881 -40828 27121 14353 10986 51715 45446 49832 -8460 -2594 56314 54329 55965 62493 83984
27868 83984 68429 37533 47567 37089 11274 -34913 -88206 -69463 -37326 -32796 -26688 14638
27856 14638 83937 72265 19100 -51948 -91304 -13937 2380 28611 78907 97000 35419 15494
27844 15494 21184 36942 7704 10160 -11363 20418 37707 24524 41744 9260 15905 61128
27832 61128 67100 53665 31953 30669 57098 73588 124129 155509 108193 72724 74170 63683
27820F3683n305K8646p2740n4658k1797j7684k1289K1191O3156K2266l7872K5640
27808f763N0381m881j4994n4646l3022N1149k7806k4960l4881L4209K4832K6521
27796a4861k1537j4211l349K8910P1798O242p2882j0442K6492k2932j644K8362
27784e4m1909N5828M3412j1500Q488o3115m554J5316Q1884k2158n1833n7499L5090
27771a2604m065K9809J9413J20l3449l3403L709K9313L7705l5599K5466K9422
27759E5837j2234o088L4744j4810o9649n7212R481N0057R090j3940m807J8938
27747e93k3970l9952O842M0686O1274n507k4119m887m2108J2882J0067m4319j8697
27734g2401K5613N1468J4301j9017J054j1623k2838l062K1686n14J7407J7093
$$ plain form
27820 63683 58378 87024 14284 -40374 -62171 -79855 -101144 -79953 -16797 5469 -32403 -6763
27808 -6763 43618 38737 23743 -30903 -63925 -12776 -40582 -65542 -100423 -66214 -41382 -14861
27796 -14861 -36398 -50609 -53958 -25048 46750 52992 -19890 -30332 -3840 -26772 -28416 -54
27784 -54 -41963 13865 57277 45777 54265 -8850 -13404 1912 83796 61638 9805 -47694 -12604
27771 -12604 -16669 13140 32553 32673 -776 -34179 -30470 -1157 36548 949 26415 55837
27759 55837 43603 37515 72259 57449 -12200 -69412 -59931 -9874 -784 -14724 -19531 -593
27747 -593 -24563 -64515 -57673 -16987 44287 38780 14661 9774 -32334 -19452 -9385 -53704 -72401
27734 -72401 -46788 4680 18981 -36 1018 -10605 -33443 -36505 -14819 -15333 2074 19167
27722A9167J7701j6005K5840q278K5412j8948o572k993j0233j1327J2807k1534
27710E037K0555j6916k5079O0377M9090L0312M444o0393k2427k2890J0252l1563
27698G99l6485k9922K3615k0729P087O0237N2788k2803l9774M3915J9250k3816
27686C4162q895J0550K9898R6329k2937n1065l095j1927l1340m9291j6970K8260
27674C679L078J3467J9383j9175M848o303K4878l271R742q615p8917J3156O636
27661a7414L1768J4678O5207n0168j8375K4512J3194j9196L2713J3011k8784j3135
27649D8011L5210o2110L7526K4609j1501o6261k4273k8728J8969P3551M0677j855
27637H3825l0480K5071K9554m9043j7825J5280N25m0384j5648L9356L9407l2034
$$ plain form
27722 19167 36868 20863 46703 38425 63837 44889 38317 35324 25091 13764 26571 5037
27710 5037 25592 8676 -16403 43974 93064 123376 127820 67427 45000 22110 32362 799
27698 799 -35686 -65608 -41993 -62722 -55635 4602 57390 34587 -5187 38728 57978 34162
27686 34162 25267 35817 65715 162044 139107 88042 84947 73020 41680 -7611 -24581 3679
27674 3679 6757 20224 39607 20432 25280 18977 43855 40584 50326 41711 -37206 -24050 -17414
27661 -17414 14354 29032 94239 44071 25696 50208 63402 44206 76919 89930 61146 48011
27649 48011 83221 21111 58637 83246 71745 5484 -18789 -47517 -28548 45003 85680 83825
27637 83825 53345 78416 107970 58927 41102 56382 56907 16523 875 40231 79638 47604
27625D7604l3442o8132J6938J6448K2148P2284J3011k6500l757K209L1874k1743
27613F8942r1706l0046o418J4029n916j4787K2094M7091K7435l7890J8584J23259
27601A34671l5748l1757Q89k2122j017L6687k0102m2546m1935k9162J4527M0359
27589B744j9927J3441O838K3387n6969l9054K9149L2035K9482j6840j8372k5862
27577c9948L3234J9549K2206L470l089k8317j0893l9545l1132k1011O2131L1226
27565b119k5510m1625M124J2837j0510J7412M6783J9856P7746K4114n5992k4520
27553D2596l7133j4179L5782j4693j1116L6427k821k2279K1817N636j2086k9925
27541a974J9073k8201l5128R0558j6914o8660L1597k97o8213O0679K6083j8415
$$ plain form
27625 47604 14162 -53970 -37032 -20584 1564 73848 86859 60359 56602 58811 90685 68942
27613 68942 -22764 -52810 -59228 -45199 -51115 -65902 -43808 3283 30718 -7172 11412 134671
27601 134671 98923 67166 68055 45933 44916 81603 61501 18955 -22980 -52142 -37615 2744
27589 2744 -17183 -3742 3096 26483 -30486 -69540 -40391 -8356 21126 4286 -14086 -39948
27577 -39948 -6714 12835 35041 38511 35422 7105 -3788 -43333 -74465 -95476 -33345 -2119
27565 -2119 -27629 -69254 -65130 -52293 -62803 -45391 1392 21248 98994 123108 67116 42596
27553 42596 5463 -8716 27066 12373 1257 37684 34863 12584 34401 40037 27951 -1974
27541 -1974 17099 -11102 -46230 44328 27414 -41246 -9649 -9946 -78159 -17480 8603 -9812
27529i812Q425q0599m101M3029L0267j4172j1741N0979J4146J181k2862o9518
27517f4778L5276P4207l0834N301N1331J2483k4920n0001J905K1640j2297k9933
27505a0620Q694M1999k1624n085L1226L2805j1827n1403L123k8102K8762l11k926
27492A4711l7338R591p280n2146j2276J7651J6822k82l4886k0298L1259N2024
27480b2448r219k738m547m646L8666J5360J3472J504k5435p898j7825j4k6124
27467e1892j6621n608L5054L728J8676l0545L5952j4404o73m7594k6667P0107
27455c0487L9110J0447N492O837j2540n2455j9235M125O1893k1043J2790J7062
27443B1996L2160k9370o6438l5612p507r552l8453K3727L5655J4893l0765L625
$$ plain form
27529 -9812 -1387 -81986 -86087 -43058 -12791 -26963 -38704 12275 26421 27602 4740 -64778
27517 -64778 -29502 44705 13871 19172 70503 82986 58066 8065 9970 31610 19313 -10620
27505 -10620 -1926 40073 18449 13364 44590 77395 65568 14165 17288 -10814 17948 17637 14711
27492 14711 -22627 -13036 -20316 -72462 -84738 -67087 -50265 -50547 -85433 -105731 -74472 -22448
27480 -22448 -31667 -34405 -38952 -43598 -4932 10428 23900 25404 -31 -7929 -25754 -25768 -51892
27467 -51892 -68513 -74121 -39067 -35339 -16663 -47208 -11256 -25660 -26333 -73927 -100594 -30487
27455 -30487 8623 19070 24562 31399 18859 -33596 -52831 -48706 13187 -7856 4934 21996
27443 21996 54156 24786 -41652 -77264 -84771 -94323 -132776 -109049 -73394 -58501 -89266 -85641
27431h5641L612l0412O377K8457P3896K7254M0031L9195m1886j06343l9050K0949
27419f3561L2041j7716n51o0867q622N2971L9944L5714j577K3002m4741p5493
27407h9456l6221o645j798o427k0844M2359k252R6884R6021Q3520q5100j18401
27395d8360o2963M5736O8728j161j4274l5877k5997N230k1670O5200K7251K4382
27383B6225K310M4212n2863n1702M4492N2504J3051O461n4103k023n4645n3586
27371g9667N6754Q0996K6361o2720r2508N50N4681L4827N2259k0300m0288K3633
27359C4578R113o4854M9366K879j9008M5299K8359J8402n2755l9660o6090m3366
27347i7737N2499j2334j4432j4677M8806k010j9019M3939M6785P053J0037n0883
$$ plain form
27431 -85641 -82029 -112441 -106064 -77607 -3711 23543 63574 102769 60883 -45460 -84510 -63561
27419 -63561 -31520 -49236 -49787 -110654 -119276 -66305 -26361 9353 7776 30778 -13963 -89456
27407 -89456 -125677 -132322 -134120 -140547 -161391 -119032 -121284 -24400 71621 155141 70041 -48360
27395 -48360 -111323 -65587 3141 1980 -12294 -48171 -74168 -68938 -90608 -25408 1843 26225
27383 26225 28535 72747 19884 -31818 12674 65178 78229 84690 30587 28564 -26081 -79667
27371 -79667 -22913 58083 84444 21724 -70784 -70234 -15553 19274 71533 51233 10945 34578
27359 34578 43691 -21163 28203 31082 12074 57373 85732 104134 51379 11719 -54371 -97737
27347 -97737 -45238 -57572 -72004 -86681 -37875 -39885 -58904 -14965 31820 38873 48910 -1973
27335a973n4413J9612N0444n167j6854M5858M1342l3741p5119m5950O4421O7823
27323E6283j3026L97j1175l6097J708l1899K8860K6149K2848N7349l574n4703
27311D3120j1775j4680j7242l3799J164j6366L5231K7929j1945L8118J7455o5422
27299h212L4511N4424l7618j1136l2241k8302J0694K003N618L1391K580j0423
27287A3289m460n113k5565M0524P0269M3643M709r186m7428n0086n3820L0715
27275G491k0877L3400M8675J0172m5199o1721J0193m876N6633M6811m307k4899
27263E1496P983o5430Q02L0984k5845j4779O7490m5483o3422j1883P9472N6206
27251F7591J1862l3380l4020N801J5131K8613l756l1999L4826J07024l3161k0727
$$ plain form
27335 -1973 -56386 -36774 13670 8503 -8351 37507 78849 45108 -30011 -75961 -11540 56283
27323 56283 43257 43654 32479 -3618 -1910 -33809 -4949 21200 44048 101397 97823 43120
27311 43120 31345 16665 -577 -34376 -33212 -49578 -14347 13582 1637 39755 57210 -8212
27299 -8212 26299 80723 43105 31969 -272 -28574 -17880 -15877 -10259 21132 23712 13289
27287 13289 8829 3716 -21849 18675 88944 132587 137296 128110 80682 30596 -23224 7491
27275 7491 -13386 20014 68689 78861 33662 -28059 -17866 -22742 33891 80702 76395 51496
27263 51496 59479 -5951 -5149 25835 -10 -14789 52701 7218 -56204 -68087 11385 67591
27251 67591 79453 46073 12053 17854 32985 61598 57842 25843 60669 167693 134532 113805
27239A13805J2034m6856o1733l436q259n0277M0216k368L7472R843j1111q024
27227B1306P35k503q367J3557N332r1463J4023j325n687J6862J5605l5775j3402
27214g1102K6891J2463J2270R776Q9374L3246q2807r6974k8441k7845k3657L0045
27202a16761R6400N2764L9187M0313L2687L1450l6791n8112r585o0899k3542p9328
27190i2217N82J4514J2906M7431J0170m552J0204l5068k4017K6058P8459L4401
27178G8871l9232m435K2251K7984O525r7424m6149J6624k8945K2251j8946p464
27166f8089O8985l093K3518M803k0792j8390j3370K1176l583L9954J196m7129
27154a4814q863O147J9451K0487N1887J7818n9182l0645r301j3066L6526j990
$$ plain form
27239 113805 125839 78983 17250 13814 5555 -44722 -4506 -6874 30598 40441 29330 21306
27227 21306 22041 19538 11171 24728 30060 -61403 -47380 -48705 -54392 -37530 -21925 -57700 -71102
27214 -71102 -44211 -31748 -19478 -9702 79672 112918 30111 -66863 -95304 -123149 -146806 -116761
27202 -116761 -20361 32403 71590 111903 144590 176040 139249 81137 71552 10653 -12889 -92217
27190 -92217 -91635 -77121 -64215 -16784 -6614 -11166 -962 -36030 -60047 -33989 44470 78871
27178 78871 39639 35204 57455 85439 91964 -5460 -51609 -34985 -63930 -41679 -60625 -68089
27166 -68089 896 -2197 21321 26124 5332 -13058 -26428 -5252 -8835 31119 32315 -14814
27154 -14814 -23677 -17530 1921 22408 74295 92113 32931 2286 -7015 -20081 16445 14455
27142A4455M577k6500l7080J8197O5425j759l9291p264L6788k0253L6265J8677
27130F2237n8263k3493P0230P3716m6486J67M403m7936k0205K2778N5260j7129
27118G5279k9993k3298q5828K596j8454l1642Q1661Q7235K2085l762k1874j3321
27106D0684r0123J9289K3043k3701J8511L3241j0430n63l032M7330J3049j0457
27094E6841k5053K0750N5932n0974j09042n9617j0887p173J15228P265m1600r576
27082e7906N2153L1526l561R633n1157p625P1065j6864K9579K5443n5737q2491
27070e5942L1223J2360J3604j2444J431J3955l5798K2349N5558r318r844m437
27058B2697k8212n4724O9570m799j2839L4387j6619l7934k6634O812N0560Q615
$$ plain form
27142 14455 19032 -7468 -44548 -26351 39074 37315 -1976 -9240 27548 7295 43560 62237
27130 62237 3974 -19519 50711 124427 77941 78108 82511 34575 14370 37148 92408 75279
27118 75279 45286 21988 -63840 -61244 -79698 -111340 -29679 57556 79641 75879 54005 40684
27106 40684 -49439 -30150 -7107 -30808 -12297 20944 10514 9951 6919 54249 67298 56841
27094 56841 31788 52538 108470 57496 -51546 -111163 -122050 -129223 -13995 -6730 -48330 -57906
27082 -57906 -5753 25773 22212 31845 -19312 -26937 44128 27264 56843 82286 26549 -55942
27070 -55942 -24719 -12359 1245 -11199 -9768 4187 -31611 -9262 46296 36978 27134 22697
27058 22697 -5515 -60239 9331 4532 -8307 26080 9461 -28473 -55107 -48295 2265 10880
27046A0880k0112k8804N9667M0004j9778r638J3700K4344m2933j8075j0264j9642
27034b0651l7403l2265K3018R9289P9788l1669n3745L2249o657l5376J8985K0803
27022E6366o370K0306L0027O7034M4114k2194o9329l5287m998N9566n304m0657
27010I3274n3264K9053j4637o5348j6429M22K9662K6672L7767Q7255K2707p8822
26998I8312k5098O0824k3221p0549k7110J1896l7868L2868L2130J5646j5359j5968
26986C6503N8484k535l8027k8364P814K1814P620k1086n5053J3849k1309m6541
26974f6831m0441k3398P2079L5941J0150K459m5574j6764N1869Q7393n6009o8531
26962e7657J3743r928Q0051L2272J2769m3402n9766j2639k3463l2733l9954J4551
$$ plain form
27046 10880 -9232 -38036 21631 61635 41857 32219 45919 70263 27330 9255 -1009 -20651
27034 -20651 -58054 -90319 -67301 31988 111776 80107 26362 58611 51954 16578 35563 56366
27022 56366 49996 70302 100329 167363 211477 189283 119954 84667 79669 139235 133931 93274
27010 93274 40010 69063 54426 -10922 -27351 -26929 2733 29405 67172 154427 177134 98312
26998 98312 73214 134038 110817 40268 13158 25054 -12814 20054 52184 67830 52471 36503
26986 36503 94987 92452 54425 26061 33875 55689 63309 42223 -12830 1019 -20290 -66831
26974 -66831 -107272 -130670 -58591 -22650 -12500 -10041 -55615 -72379 -20510 66883 10874 -57657
26962 -57657 -43914 -53842 26209 58481 71250 27848 -31918 -44557 -68020 -100753 -140707 -126156
26950a26156j4944K4346N3344N4980N9033J225O088J7948l3561l4139p3144m5200
26938a10180K2872M1361L91p480M7438j1158J3585l238o81M0316r409p7696J3266
26925d0613P943L3849j2592L222O874k8884j4612O3441O7557j0658K6663k5305
26913G6885q40m763m7497r938j461N9018M0948n0969k7846l0220o951m6454M141
26900d5947J3514M9358L2019j9262l4846J8841L994j0854l5553n6843k9527N6769
26888e8337N182L7491M5981m9464l743J4599m1400M817k082J843M1376N6552K5233
26875G8048K190j1492n9447P238m0360O405N7212K9255p5044k1557k2842k0837
26863g1231Q3396L1973j0121r052o0816o8730o750O7179n8825l0012N8105N7379
$$ plain form
26950 -126156 -141100 -116754 -63410 -8430 50603 51828 57916 75864 42303 8164 -64980 -110180
26938 -110180 -87308 -45947 -45556 -53036 -5598 -16756 -3171 -6409 -7090 33226 23817 -53879 -40613
26925 -40613 -32670 1179 -11413 -8191 -1317 -30201 -44813 18628 86185 75527 102190 76885
26913 76885 76045 71282 23785 13847 12386 71404 112352 61383 33537 3317 -3634 -50088 -45947
26900 -45947 -32433 16925 48944 29682 -5164 13677 17671 6817 -28736 -85579 -115106 -58337
26888 -58337 -53155 -15664 30317 -19147 -22890 -8291 -49691 -44874 -46956 -45113 -3737 52815 78048
26875 78048 80238 68746 9299 16537 -23823 -17418 39794 69049 -5995 -27552 -50394 -71231
26863 -71231 12165 44138 34017 24965 -35851 -104581 -111331 -44152 -102977 -132989 -74884 -17505
26851a7505J5925r1455l0002K723K670L5728O0328j8085K4561K373K1202q235
26839B28n3928K0163M1872n3768j4948K0041L2378k7308L06J8793m0718j2159
26827f9048l2983K4773j0713n7295L0243R426L5064M2609R083j4325L8142p545
26815b569m2092l7415L7434o081L2071j344K9030K1120l6437O9945J7270m1816
26803C9116K832k0995j1392m6094L368J8969j2703M8455M156m8889m5167N876
26791f2468L6524N0537J2183j3283m895Q301r307j2645k6606K1265J2997K4901
26779C7504K2088l9771l2381N6777p006j3581o6581M5136J8058k6585L6525M755
26767C4938N6313o1515J1602L4466N98r0489q4856K0858L4173O2164N1501n1226
$$ plain form
26851 -17505 -1580 -93035 -123037 -120314 -117644 -81916 -21588 -39673 -15112 -12739 8463 228
26839 228 -53700 -33537 8335 -45433 -60381 -40340 -7962 -35270 -34964 -16171 -56889 -69048
26827 -69048 -102031 -77258 -87971 -145266 -115023 -105597 -70533 -27924 -18841 -33166 4976 -2569
26815 -2569 -44661 -82076 -44642 -50723 -18652 -19996 9034 30154 -6283 63662 80932 39116
26803 39116 41948 20953 9561 -36533 -33165 -14196 -26899 21556 25712 -23177 -68344 -62468
26791 -62468 -25944 24593 36776 23493 18598 26899 17592 4947 -21659 -394 12603 37504
26779 37504 59592 19821 -12560 44217 37211 23630 -42951 2185 20243 -6342 30183 34938
26767 34938 91251 29736 41338 75804 76402 -14087 -98943 -78085 -43912 18252 69753 18527
26755A8527K6981j6995j9598O5655N8516n7631m5772m9743m177m9905L6734j949
26743c9357n359L6059J01455P3584k1844k2064o8584m6976p5837L8514P1785o0044
26731a8668M1375N7529m6116q328r692k1499J6130M8521j1598j2759k6531K8320
26719C6684M6862k7159l926L1509k5546j7896j7039O656L4085j9588p3792j0749
26707c9899J2854l5772K8369j6384K1060K1319l5435k4457m241P484L9682L8640
26695A3220l0108Q851j3629M0758k7061n656R023M7473L4760n2644r4918k4815
26683i4746J8634J1205K4585J5414J1634M3801m5858k5425J9453J2669m4813K5176
26671b8271n171P5552O4589l0534l8301m9113k8162Q018M8143N754j5693R392
$$ plain form
26755 18527 45508 28513 8915 74570 133086 75455 29683 -20060 -24237 -74142 -37408 -39357
26743 -39357 -44716 -8657 92798 166382 144538 122474 53890 6914 -68923 -30409 41376 -18668
26731 -18668 22707 80236 34120 25792 16100 -5399 10731 59252 47654 34895 8364 36684
26719 36684 83546 56387 52461 83970 58424 40528 23489 30145 64230 44642 -29150 -39899
26707 -39899 -27045 -62817 -34448 -50832 -29772 -8453 -43888 -68345 -72586 -65102 -25420 13220
26695 13220 -16888 -8037 -21666 19092 -7969 -13625 -4602 42871 77631 24987 -69931 -94746
26683 -94746 -76112 -64907 -40322 -24908 -13274 30527 -15331 -40756 -21303 -8634 -53447 -28271
26671 -28271 -33442 42110 106699 76165 37864 -11249 -39411 -31393 16750 22504 6811 16203
26659A6203k8300K8631j6052m6524K2934K6338L5573L1443J0192m6107M7792J448
26647H3571j11495j16088J1789Q1504j9783P7489L6061n1023M8571P1008J2499
26636A24103k3374j3767m1476Q202M002j6989j2143K341K617o394m872k9455L0522
26623B3317p828l6660K2839M3211j4126k3430p9739k6835J8564l5221J7504K7895
26611g0509N8253R25p021N841o2494L465O5851O1403Q466m7165j242M4861K5500
26598H6134m1819O207K737J3968j5771n3507n9753K8930Q4711P160M0612J2769
26586A12378j3044J67m9380l5441m5172M2190K0758n1160K0701K795J5771O74
26574B1237j678J166m9582k1029P6476J8897o1107m6497Q588J7645j8055m0317
$$ plain form
26659 16203 -12097 16534 482 -46042 -23108 3230 38803 70246 80438 34331 82123 83571
26647 83571 -27924 -144012 -132223 -50719 -70502 6987 43048 -7975 40596 111604 124103
26636 124103 100729 86962 45486 53688 57690 40701 28558 30899 33516 27122 22250 -7205 23317
26623 23317 15489 -21171 1668 44879 30753 7323 -72416 -99251 -80687 -115908 -98404 -70509
26611 -70509 -12256 -11331 -18352 -12511 -75005 -71540 -5689 55714 64180 17015 15773 60634 86134
26598 86134 44315 50522 53259 67227 51456 -2051 -61804 -32874 51837 58997 99609 112378
26586 112378 99334 99501 50121 14680 -30492 11698 32456 -18704 1997 4792 20563 21237
26574 21237 19559 20725 -28857 -49886 26590 45487 -15620 -62117 -53529 -35884 -53939 -94256
26562i4256M2466L6941J878m0198k2366l8481J5490J6768N5203J9805N9610J4885
26550F7745L180j2022m9741p8278j9024k0213J1703L9404K4839J7904J8587m1548
26538c7464l317n308J2697r889k6089m6366K3256K8474K3861N4450L7104O286
26526E7695n6448p2770N3220n032L7947m2680o969K5422l3745j5595q775M6695
26514b1035Q16K758O6204O4915N7903l8887n3856m2009N7559J4301n2151o712
26502D9806q905k5110K8521K2029K7932m4933k3043K557O5037j3626o329O954
26490H0890R523l8854k4810j5218j0700n8275J2663N4876M7303K170l4086q407
26478A7075M588q6800K364k0173k6341K3775L1406M5523M2663l0204l7013l1082
$$ plain form
26562 -94256 -51790 -14849 -12971 -53169 -75535 -114016 -98526 -81758 -26555 -6750 52860 67745
26550 67745 70925 58903 9162 -69116 -88140 -108353 -96650 -57246 -32407 -14503 4084 -37464
26538 -37464 -40781 -46089 -33392 -43281 -69370 -115736 -92480 -64006 -40145 14305 51409 57695
26526 57695 1247 -71523 -18303 -23335 14612 -28068 -35037 -9615 -43360 -58955 -67730 -21035
26514 -21035 -20219 -17461 48743 113658 171561 132674 78818 36809 94368 108669 56518 49806
26502 49806 40901 15791 44312 66341 94273 49340 26297 28854 93891 80265 73936 80890
26490 80890 90413 51559 26749 11531 831 -57444 -44781 10095 57398 59568 25482 17075
26478 17075 21663 -65137 -62773 -82946 -109287 -85512 -54106 -8583 34080 3876 -33137 -64219
26466f4219J09771J8920p2080K379M8163m286j8496p094J6202j6276k849l3493
26454b3358k2587k5939l2033K7295K9911p9499M3014O3899K1330m2728j9782j3650
26442g4127K9980P089j8511J6808j7013P3135n102l6657K1563J0297k9821N545
26430a6814k2937k3686K3019K4610L6394R44p103M085l1442L2068m100l3587l1782
26417e0331K8422L9557n366L2901J893k7900l1745q013k3702l8482M2044j0460
26405e1182K8806K8041M790j9831M2603l6566p670K8140J7095m5307J5139J6316
26393B0374J9739m1335L1394M0904q752n9000K3627L533l731l9118j5537L7580
26381I678J1884J7103j0456l4802K3879l3459P732N0412l2554m9808k1159M5445
$$ plain form
26466 -64219 45552 64472 -7608 -5229 42934 38648 20152 13058 29260 12984 10135 -23358
26454 -23358 -45945 -71884 -103917 -76622 -46711 -126210 -83196 -19297 2033 -40695 -60477 -74127
26442 -74127 -44147 -37058 -55569 -38761 -55774 17361 12259 -24398 -2835 7462 -22359 -16814
26430 -16814 -39751 -63437 -40418 -15808 20586 21530 14427 18512 -12930 19138 15038 -18549 -50331
26417 -50331 -21909 17648 12282 45183 47076 19176 -12569 -20582 -44284 -82766 -40722 -51182
26405 -51182 -22376 5665 10455 -9376 33227 -3339 -11009 17131 34226 -11081 4058 20374
26393 20374 40113 -1222 30172 71076 62324 3324 26951 30484 26753 -12365 -27902 9678
26381 9678 21562 38665 28209 -6593 17286 -16173 -8441 41971 9417 -40391 -61550 -16105
26369a6105M9889K7536K1649p1475m4644L436L887M7536R795j5397j7488N4097
26357E2716k0438k7824k6298m1149K0987J1195k4370p9122J9995N6389l4774L1689
26345f1004j241O840k3253j1066J7102Q3744J2487l3190p3795n9717J3246M9547
26333h0300k2046j8492Q918P4275J9387o8034j4807L3161j97M4650Q624q434q539
26320c1834m213Q870N7098k6422j7134J6288j5505k0301l993N1098R085q32m3979
26307b1774k1589M0906k7458J9996L567J2226o0756J6105m77N1308N2149p2869
26295h666j3912N9126L7509o2145l8795K4232k1151k8984M1999j386k1783k7791
26283f1747J7334J7731L0127N8055k5357J0584K3701l5568p0477j9845r2576N2147
$$ plain form
26369 -16105 33784 61320 82969 11494 -33150 -29714 -25827 21709 31504 16107 -1381 52716
26357 52716 32278 4454 -21844 -62993 -42006 -30811 -55181 -134303 -114308 -57919 -92693 -61004
26345 -61004 -62245 -55405 -78658 -89724 -72622 11122 23609 -9581 -83376 -143093 -129847 -80300
26333 -80300 -102346 -120838 -111920 -37645 -18258 -86292 -101099 -67938 -68135 -23485 -14861 -23295 -31834
26320 -31834 -36047 -27177 29921 3499 -13635 2653 -12852 -33153 -37146 13952 23037 22205 -21774
26307 -21774 -43363 -2457 -29915 -9919 -6352 5874 -54882 -38777 -39254 12054 64203 -8666
26295 -8666 -22578 36548 74057 11912 -26883 -2651 -23802 -52786 -10787 -12173 -33956 -61747
26283 -61747 -44413 -26682 3445 61500 36143 46727 70428 34860 -35617 -55462 -148038 -95891
26271i5891P7286L8990n150K7811Q514q8353m7375K4183N2758m1449L0931l5317
26259e3062r828P330K3177l2680o344J6386m1499J2543M0101J06715J0816k0663
26247E2992k0137l3555K3922M670l820o637L6200n3695m697M7080l644m4317m1788
26234d7426j7025M3308j7714J9423M0002m9031l9936L9760j6000p8146K7288O8164
26222b7333L2333J9511l419L7807n0338k6301O627K4499J7703j0522p0331l8988
26210h8752k5171k1422L4203q41K6495M2974J6814K750Q974J7666J1162j979M518
26197B7391J5761N7377l8620k7037M0152L891n4382m0154m5411J839K0829m9367
26185h7731j2756Q0405J9592M3457K5112J6796J4257k2156k1286N001P954m7858
$$ plain form
26271 -95891 -18605 20385 15235 43046 51560 -36793 -84168 -59985 -7227 -48676 -17745 -53062
26259 -53062 -62890 -55560 -32383 -65063 -71407 -55021 -96520 -83977 -43876 62839 73655 52992
26247 52992 32855 -700 23222 27892 24072 17435 53635 -60 -4757 42323 38679 -5638 -47426
26234 -47426 -64451 -21143 -38857 -19434 20568 -28463 -68399 -28639 -44639 -122785 -95497 -27333
26222 -27333 5000 24511 21092 58899 8561 -17740 -11113 13386 31089 20567 -49764 -88752
26210 -88752 -113923 -135345 -101142 -101983 -75488 -32514 -15700 -12950 -3976 13690 24852 22873 27391
26197 27391 43152 100529 61909 34872 75024 78915 24533 -15621 -61032 -59193 -38364 -87731
26185 -87731 -100487 -20082 -490 42967 68079 84875 99132 76976 55690 60691 68645 20787
26173B0787j061M4221j7622j4729j15263l7248J49266M4579k6911n7092n1199
26162f2272J0585L363j2932L3956J7851J86m0702m6295l7403J1975L6365L3306
26150e2017J8840Q092l4248j1512j4085o657M6898M1687K3096N0031K0876k2349
26138F8652j9190j4202P3291o4228k4149k8860J967K0779n5838K43O519M142J3144
26125a7730k5846J8080P2630K1988k7438J9787o2273j675N9270K6917J1545K7233
26113A22488p0107m5218j0225m2285P167L9192R129N0629m637k265j4874m4330
26101e336J7569M151k1661N9151k2907j2822p638k819n6888j6521J1563K1962
26089c2196K158m704M6857K0789m8988q1000n0016M012J7359J1278L6783Q6689
$$ plain form
26173 20787 19726 63947 46325 31596 -83667 -120915 28351 72930 46019 -11073 -62272
26162 -62272 -51687 -48324 -61256 -27300 -9449 -9263 -49965 -96260 -133663 -121688 -85323 -52017
26150 -52017 -33177 -25085 -59333 -70845 -84930 -91587 -44689 -3002 20094 70125 91001 68652
26138 68652 49462 35260 108551 44323 20174 -8686 -6719 14060 -41778 -41535 -35016 -30874 -17730
26125 -17730 -43576 -25496 47134 69122 41684 61471 -802 -2477 56793 83710 95255 122488
26113 122488 52381 7163 -3062 -45347 -38180 1012 10141 60770 56133 53868 38994 -5336
26101 -5336 12233 16384 -5277 53874 30967 18145 10507 7688 -49200 -65721 -54158 -32196
26089 -32196 -30038 -34742 12115 32904 -16084 -97084 -147100 -143088 -125729 -114451 -77668 9021
26077I021N1475j2480K009k5089j1171N533N012N0091Q324j4210L2782k8555K0839
26064I3581M9709j2550q2261o6230k0357M7390N36j3413j847n891k2481K2615
26052a1199J380j8152N3371j6996m8688P0260O5498J8186J4296l5876l3140k6702
26040C2238m2810n3629K4189N9403n175L314J4501j6770j2621J6450N914m615
26028B0389J0782k9082k346K704j8735J1122k737L2361k2900o6964K7238j7517
26016e5685o014K1401L4567j4247k311M2770j4001m3186m7229O1791M8735K379
26004B8970k4340m5694m4586j6651M4731K7143J9471J1308N1352n9030q010j778
25992a7114k2710K0266P4o550J3938k1842J3181J408m2311N448O1428j4991r648
$$ plain form
26077 9021 60496 48016 50025 24936 13765 19298 24310 74401 82725 68515 101297 72742 93581
26064 93581 143290 130740 48479 -17751 -38108 9282 9818 -3595 -5442 -11333 -33814 -11199
26052 -11199 -9819 -27971 25400 8404 -40284 29976 95474 113660 127956 92080 58940 32238
26040 32238 -10572 -64201 -40012 19391 14216 17530 32031 15261 2640 19090 25004 20389
26028 20389 31171 2089 -257 2447 -16288 -5166 -7903 24458 1558 -65406 -38168 -55685
26016 -55685 -61699 -40298 -5731 -19978 -22289 20481 6480 -36706 -83935 -22144 26591 28970
26004 28970 4630 -41064 -85650 -102301 -57570 -30427 -10956 352 51704 -7326 -15336 -17114
25992 -17114 -39824 -19558 -19484 -26034 -12096 -33938 -20757 -19349 -61660 -56212 5216 -9775 -19423
25979a9423n691L3870N3177l8619l6363n175K1058J4363J5472J4567l5268m0745
25967b8777N7238K7658n386k6982n8920l5610N786j4592K7637k6397L5310M6634
25955C599K5888k3824k2047R652K6106J6160N1494l4322q5360q228R7375Q890
25943F5383m8841m23K279J2235k0806j9099k5557j0244P1233o889n3439l5157
25931f9325M7134L9354O084n9749j5685K0984O8628m57o4148n6258R787L4416
25919c9235J9822M96m7141j1906k8168J3654n263m980M5487N8332R287l938M1378
25906D7825L5618o0505M587N897m2884k1086P080n775l38K4442M9005l4189M0563
25893E0240M0446M59j5538j4767O438r780o6794J49j8090M7294K1727L2136l9442
$$ plain form
25979 -19423 -25114 8756 61933 23314 -13049 -18224 2834 17197 32669 47236 11968 -28777
25967 -28777 28461 56119 50733 23751 -35169 -70779 -64993 -79585 -51948 -78345 -43035 3599
25955 3599 29487 5663 -16384 -6732 19374 35534 87028 52706 -32654 -40882 56493 65383
25943 65383 16542 16119 18398 30633 9827 -9272 -34829 -45073 26160 19271 -34168 -69325
25931 -69325 -22191 17163 23247 -36502 -52187 -31203 37425 36968 -27180 -83438 -73651 -39235
25919 -39235 -19413 -18917 -66058 -77964 -106132 -92478 -97741 -102721 -57234 1098 10385 6447 47825
25906 47825 83443 22938 27525 33422 -9462 -30548 -23468 -29243 -29581 -5139 43866 9677 50240
25893 50240 90686 91145 75607 60840 67278 57498 -9296 -9147 -27237 20057 41784 73920 34478
25880C4478l7770q223N950J6581l7446J092R664j770Q871k193J2633k7588j1177
25867c6898k4760M1514J3820r3719N0285N9694r203j5264J7128k4028n0802P059
25855f5174L7168J5402M7469J0030j720k5999K2507k4686K8607r763j2844j2413
25843H584J0411j2776k8638M2427N364j8801m2950j773M041M012N8584M0239m4396
25830B4328m4485r640r627j3061L1885J3819J4161k493m0056M5329j3529k2659
25818b6028J175l221O6940O1992l6414l2496l3252l0237J0511K1546M0883m5435
25806d036n5372O1265N3956q667n180O8459k0212N813J5539Q813q9983l4788l8690
25793d3083j6629K4165O4230K6707L5258l7619l1345p097N236J2024k9541n3565
$$ plain form
25880 34478 -3292 -11515 -5565 11016 -26430 -25338 -15674 -17444 -8573 -10766 1867 -25721 -36898
25867 -36898 -61658 -20144 -6324 -100043 -49758 9936 733 -14531 2597 -21431 -72233 -65174
25855 -65174 -28006 -12604 34865 44895 43175 17176 39683 14997 43604 33841 20997 8584
25843 8584 18995 6219 -22419 20008 25372 6571 -36379 -38152 -34111 -30099 28485 68724 24328
25830 24328 -20157 -29797 -39424 -52485 -20600 -6781 7380 4887 -35169 10160 -3369 -26028
25818 -26028 -24853 -28074 38866 100858 64444 31948 -1304 -31541 -21030 516 41399 -4036
25806 -4036 -59408 1857 55813 47146 41966 110425 90213 96026 111565 120378 30395 -4393 -43083
25793 -43083 -59712 -35547 28683 55390 90648 53029 21684 14587 19823 31847 2306 -51259
25781e1259k6253j038q47L7987J4114L2862j6476L5837n906r4029l4264M2568
25769f6704N0215k9741l5153O3156Q3369m589m5082m5142K8579j4576k0729L8090
25757A693l5609j1142n4455j5098j16K7941L5780O6392j4840L6265L0849p4281
25745f621o061P322L2379L0358K1902l2353P209K4284j5740j3014n2966m0078
25733d3379K7233N3482K3559K4057r153K7855L1193m534J2833m6470k8582K0734
25721H8828L0481o2980k006L2283m1143m99j7797L238n5213k846r077L2338J6325
25708A1932O675m0860J8266p061j5494O7916j3725l5785J0244j3577L9976n1826
25696b3319j8845K7507J8926M6526k318j4435m5872O757j0256J9136L3569J3670
$$ plain form
25781 -51259 -77512 -78550 -79397 -41410 -27296 5566 -10910 24927 19021 -75008 -109272 -66704
25769 -66704 -16489 -46230 -81383 -18227 65142 60553 15471 -29671 -1092 -15668 -36397 1693
25757 1693 -33916 -45058 -99513 -114611 -114727 -86786 -51006 15386 546 36811 67660 -6621
25745 -6621 -12682 -5360 27019 57377 79279 46926 54135 78419 62679 49665 -3301 -43379
25733 -43379 -16146 37336 60895 84952 75799 103654 134847 130313 143146 96676 68094 88828
25721 88828 119309 56329 54323 86606 45463 44964 27167 30405 -24808 -27654 -36731 -4393 11932
25708 11932 18607 -22253 -3987 -11048 -26542 41374 27649 -8136 2108 -11469 28507 -23319
25696 -23319 -42164 -14657 4269 50795 48477 34042 -11830 -5073 -15329 3807 37376 51046
25684E1046j02825p4387L5460O8054k0413o3683R752R6973L9795J6226l1954k920
25672B1124l8433k9932R746Q069k7721K0572r08J4228M1420j476O9969M2148m8587
25659H0219r0642n1869p891K2761K0655l898J0937J6484k367m423l7462J0711
25647c6785l0525l1053J400N042j419M8190M7272L2483j7346J9579k1l9180j8092
25634b0455L1832J0414L7046l7425n6251o040l1710L488J9667J2819L1120J987
25622c508j9148k6485M450L356l5926L7771J0792k1385M7533l6528M5693R561
25610A6176l8990p8085K7119N8082L3970L0501k0445m4774m6584l989n119Q332
25598f3806J0944P2750n2161p2075O737P9250O0538j5154o0131j6802L2211L4543
$$ plain form
25684 51046 -51779 -126166 -90706 -22652 -43065 -106748 -96996 -23 39772 55998 24044 21124
25672 21124 -17309 -47241 -37495 -29426 -57147 -36575 -37483 -23255 18165 16689 86658 128806 80219
25659 80219 -10423 -62292 -70183 -47422 -26767 -30665 -19728 -3244 -5611 -10034 -47496 -36785
25647 -36785 -67310 -98363 -96963 -91921 -93340 -45150 2122 34605 17259 36838 36817 -2363 -20455
25634 -20455 11377 21791 58837 21412 -34839 -40879 -72589 -69101 -49434 -36615 -5495 -3508
25622 -3508 -22656 -49141 -44691 -41335 -77261 -39490 -28698 -50083 -2550 -39078 6615 16176
25610 16176 -22814 -100899 -73780 -15698 18272 48773 28328 -16446 -63030 -67019 -72138 -63806
25598 -63806 -52862 19888 -32273 -104348 -97611 -18361 42177 27023 -33108 -49910 -17699 16844
25586A6844J1520L8058L4771k3281j7507j7866R779l4094J3009J037J2478r045
25574C5703m7610L7112J3339l6757l0770k1557L1276N192o8941k9911K8871K5846
25562e8207k541m9249j5726J7667L1746Q6148J7867K8965l513q4985p1177N4841
25550d8164L1656J0673L6217k1884n4377R226k0803R969m3480M1172J4611Q4752
25538D9568k8930j5445L1451J6315j8652M9527k708m7563l7279L3390L684O4844
25526I8202J9580k7108m4502k6607n1779Q583L4406M34n1218j0356L6522j5930
25514b9773q831j7049M1096O5731j0961K0817l213j1K2413Q712n9673l4509O035
25501G84k5273j7117R0369J5373q6848j884K4773k1478r048j3689O6207M1964
$$ plain form
25586 16844 28364 66422 101193 77912 60405 42539 52318 18224 31233 32270 44748 35703
25574 35703 -11907 25205 38544 1787 -28983 -50540 -19264 -14072 -83013 -112924 -84053 -58207
25562 -58207 -60748 -109997 -125723 -108056 -76310 9838 27705 56670 53157 -31828 -103005 -48164
25550 -48164 -16508 -5835 30382 8498 -45879 -36653 -57456 -47487 -90967 -49795 -35184 49568
25538 49568 20638 5193 36644 52959 34307 83834 81126 33563 -3716 29674 33358 98202
25526 98202 117782 90674 46172 19565 -32214 -23631 10775 11209 -40009 -50365 -13843 -29773
25514 -29773 -38604 -55653 -14557 51174 40213 61030 57817 57806 80219 88931 29258 -5251 784
25501 784 -24489 -41606 48763 64136 -22712 -24596 177 -21301 -30349 -44038 22169 64133
25489F4133j8141k1093k3955n4771J1681L5781P03O0118J3514k0211K5421J3291
25477H6471l1145q174L1794o3409p0545N0203R0j8625O280n7326p989N6098J4389
25464a1888k0301j1527J0549K2013q131O2639P324J0966M984J944p9397m005j8384
25451c3214L0884M4388J5436l1785L3021N1629k4183n7638m2774n7358l0813K3888
25439g8519k8422n904Q6386O103k74M4067J4917N96j2793j2513R604j9368k9046
25426b5166n3853K9401J770l4754N9056Q0547M7244J6016l1159p4212K0248q480
25414B6658n3920L9361M2969p8947q4433K0485P1687O5376K6061n6692p995K9757
25402D0367k496l6816p793k820j681R072k8179j1545J582O6506K1809n1349l5675
$$ plain form
25489 64133 45992 24899 944 -53827 -42146 -6365 -5662 54456 67970 47759 73180 86471
25477 86471 55326 47152 78946 15537 -55008 -4805 -4715 -23340 -17060 -74386 -82375 -26277 -11888
25464 -11888 -32189 -43716 -33167 -11154 -19285 43354 50678 61644 66628 68572 -10825 -14830 -33214
25451 -33214 -2330 42058 57494 25709 58730 110359 86176 28538 -14236 -71594 -102407 -78519
25439 -78519 -106941 -112845 -26459 -20356 -20630 23437 38354 38950 26157 13644 23248 3880 -25166
25426 -25166 -79019 -49618 -47848 -82602 -23546 57001 104245 120261 89102 14890 35138 26658
25414 26658 -27262 12099 55068 -23879 -108312 -87827 -16140 49236 75297 18605 10610 40367
25402 40367 37871 1055 -6738 -9558 -11239 -2167 -30346 -41891 -40309 26197 48006 -3343 -39018
25389c9018j5786K1277M8782R894p0225M4998N4800k3182n4634k4586o0243L748
25377a04175L1424N777M4008K0095K135O0196q266m5321n209n774r0721k3522
25365a19353k215j2850N6830N8381J6881J5350J1607M9168K783L7646k7914l2466
25353E3848m4808n1320J2608l572N8555k0038m2256K6049N200L4329k3085m1298
25341c5788m1329m5523P065l873N7907J2713l223O370m6778j7195J1915J5562
25329h2177R734L2806m1656L2602M7706K4875l837M643J44885M0660j21306r8591
25317i656J2092O830J8084j9639L4640k0778j4249j5330m5490m009k4823O5450
25305a6878p043m639L9566j2525n9383p625M1959j6158J0353L5940j3077n5913
$$ plain form
25389 -39018 -54804 -33527 15255 25149 -45076 -78 54722 31540 -23094 -47680 -107923 -104175
25377 -104175 -72751 -66974 -22966 -2871 -736 59460 51194 5873 664 -5110 -95831 -119353
25365 -119353 -121568 -134418 -77588 -19207 -2326 13024 24631 73799 76582 114228 86314 53848
25353 53848 9040 -42280 -29672 -33244 25311 5273 -36983 -10934 -5734 28595 5510 -35788
25341 -35788 -77117 -122640 -115575 -119448 -61541 -48828 -52051 -45681 -92459 -109654 -97739 -82177
25329 -82177 -72443 -39637 -81293 -48691 -985 23890 20053 24696 169581 210241 88935 -9656
25317 -9656 2436 9266 27350 7711 42351 21573 7324 -8006 -53496 -57505 -82328 -16878
25305 -16878 -23921 -28560 11006 -1519 -60902 -68527 -26568 -42726 -32373 3567 -9510 -65423
25293f5423l1992L5083M0563k03J4980J812l0457k9629n159M771K3424Q5083J970
25280D4823j7627j7708m3696J1131Q7936k6814n5353K86L2486O1037Q064q7155
25268b590m9495M03M3556K5416R4178l4465l1980l6607j08890l4865Q7289q233
25256e6283J2215k7135l1207K6925m5079O581Q6736L9897m6534J2391N2492K7404
25244E8403k0984k3763o2515m7840R416N9104N9105j0230j6308J4062M2987k6472
25232C4965l7413k0660l1495k0000J5241M8771j0492l6252l636K8436o0537l5214
25220a28286j6724j2891P9027N5763J4111n920m8659K3415j3188j8899p154Q9963
25208A0558Q2734J4100J5890n511q1923o1523L9995Q929J0379k4262q619J8k3624
$$ plain form
25293 -65423 -97415 -62332 -21769 -21972 -6992 -5180 -35637 -65266 -70425 -65654 -42230 42853 44823
25280 44823 27196 9488 -34208 -23077 64859 38045 -17308 -17022 15464 76501 84565 -2590
25268 -2590 -52085 -51682 -8126 17290 111468 77003 45023 8416 -100474 -135339 -48050 -56283
25256 -56283 -44068 -71203 -102410 -75485 -120564 -113983 -27247 12650 -33884 -21493 30999 58403
25244 58403 37419 13656 -48859 -96699 -87283 -28179 30926 20696 4388 18450 61437 34965
25232 34965 -2448 -23108 -54603 -74603 -59362 -10591 -21083 -57335 -60971 -32535 -93072 -128286
25220 -128286 -145010 -157901 -78874 -23111 -9000 -14920 -63579 -40164 -53352 -72251 -79405 10558
25208 10558 93292 107392 123282 117771 35848 -25675 14320 23249 33628 9366 747 765 -22859
25195b2859m893M7236M0358K6769j9633r6509L5490L9623k0943m1206j8634n6619
25183i1820k396L0696K4425P0699l2650l6511R973K1064K5411j1261l3923m8968
25171g5261J5912O3486j4276j9982K0042p6104R67N3876M2081L3645N1385M7859
25159A43630l08n2591m4108j7138m4364j8373K7700K3601l2895l3866O7145R004
25147B7437j3635k5898l5479J1089J9158l2184N1617K556n2632J842j671J8801
25135b8999K5764K8714k6219J9731M8468j684m0155m9642m8980J2351M3583k5303
25123d2371J5421j2022L2998L8733M5285J1997p2645J4610L319o405k594m8039
25111b1713k453K2718p66k704j1234L6117L6341K361q022j5281k2045o464J7863
$$ plain form
25195 -22859 -27752 19484 59842 86611 66978 -29531 5959 45582 24639 -16567 -35201 -91820
25183 -91820 -94216 -63520 -39095 31604 -1046 -37557 -27584 -6520 18891 7630 -26293 -75261
25171 -75261 -59349 4137 -10139 -30121 -10079 -86183 -85216 -31340 10741 44386 95771 143630
25159 143630 143322 90731 46623 29485 -14879 -33252 -5552 18049 -14846 -48712 18433 27437
25147 27437 13802 -12096 -47575 -36486 -17328 -49512 2105 4661 -47971 -46129 -47800 -28999
25135 -28999 -3235 25479 -740 18991 67459 65775 25620 -24022 -73002 -60651 -17068 -42371
25123 -42371 -26950 -38972 -5974 32759 78044 90041 17396 32006 35325 28920 26326 -21713
25111 -21713 -24166 -1448 -2214 -4918 -16152 19965 56306 58667 50645 35364 13319 6855 24718
25098B4718j4456K7835M8548K221n8096p9320m1940L7799N360k0610R853K6904
25086c1184j9017J7667K9146k1206o0633N4327J7061l2394q346k8579P2450k1266
25074c1974K1001R2477K9678m178p9819j3862j1849j3227j126j3309K7314N0950
25062E2076J6653J5969n1560m6744j7622L2670Q016J625K6380j8085j363n743
25050A2272k920m3992O7806M7996k4436j7746o0177o024P553l2498l5998N817
25038h2347P662L5605K4690r000j4461N3737J1403o2674m7774L3514R5469J5053
25026F0877j9118j4343k6656l290M79q64L0629q132K4350K5201K587j2844l8016
25013B0860p7859j01910j8550L3474M3412N8669J1311k8386j9585J5333J780k7783
$$ plain form
25098 24718 10262 38097 86645 88866 30770 -48550 -90490 -52691 -47331 -67941 -58088 -31184
25086 -31184 -50201 -32534 -3388 -24594 -85227 -30900 -13839 -46233 -54579 -83158 -10708 -31974
25074 -31974 -10973 81504 111182 107004 27185 13323 1474 -11753 -12879 -26188 1126 52076
25062 52076 68729 84698 33138 -13606 -31228 1442 9458 11083 37463 19378 18015 12272
25050 12272 9352 -34640 33166 81162 56726 38980 -21197 -27221 -19668 -52166 -88164 -82347
25038 -82347 -74685 -39080 -14390 -23390 -37851 15886 27289 -35385 -83159 -49645 45824 60877
25026 60877 41759 27416 760 -2530 -2051 -2915 27714 19582 43932 69133 71720 58876 20860
25013 20860 -56999 -158909 -177459 -143985 -100573 -41904 -30593 -58979 -78564 -63231 -61451 -89234
25001h9234m1839L0089M3454J0509L9026P3719K4927l4937j6638K942j7540l2254
24989g776k1517m7730N937J7275j6688j939J4863l3286j2813O7820K0912K7385
24977A2443J07082j9111l9934m7910l2655l3650k1183N3479M4999j5574r841j7589
24965a9444k8427k2367j573N279j6917m137k5433j7315L5924j3313J1565k2096
24953a18254N881O5627L3120j3859M1402n4436N5169M4388l2668j8353J0155j616
24941A6556m126k5932l8741m4496L6053L7080K3181L9612K5105l0368R512n419
24929C8017l6175L798p2478J2352R7198J046k9809k8939k116m1066l2103p327
24917i7602O8780L7020n0406J0162J544l8122m3268K0746O1800R290L0613J720
$$ plain form
25001 -89234 -131073 -100984 -57530 -47021 -7995 65724 90651 55714 39076 42018 24478 -7776
24989 -7776 -29293 -77023 -71086 -53811 -70499 -72438 -57575 -90861 -103674 -35854 -14942 12443
24977 12443 119525 100414 60480 12570 -20085 -53735 -74918 -21439 23560 7986 -1855 -19444
24965 -19444 -47871 -70238 -71811 -66532 -83449 -87586 -113019 -130334 -94410 -107723 -96158 -118254
24953 -118254 -112373 -46746 -13626 -27485 13917 -40519 14650 59038 26370 8017 18172 16556
24941 16556 12430 -13502 -52243 -96739 -60686 -23606 -425 39187 64292 33924 43436 38017
24929 38017 1842 5640 -66838 -54486 42712 43758 13949 -14990 -17106 -58172 -90275 -97602
24917 -97602 -28822 8198 -42208 -32046 -30502 -68624 -111892 -91146 -29346 -20056 10557 12277
24905A2277m6265l4659j0198q879L0783L1013j7435N5186P8194m700n6410j2087
24893A6820L6799o310k9684m2091m9630L4740M9502J3781M0914r672J9718L0815
24881A05702l0186k3471k2114j9848M5974Q274Q028L4628n6193n0167j3531l5468
24869d8372J7206l9843l6015M3507R4433J901l2653K267q527l0727j6531Q733
24857d4621K9351O809m789M8166J2881J3145k6266m5217n6878M1391L3830M5698
24845E3500o9740r2850k1699K5271K6823L6409J3027k916M3736N6224p473R511
24833F9823K1669k1746k2175k099j8768n245J5544m3164j7204P119l5309k4455
24821g6010O3984L5004j7252L222M4881k3805m9006K42k1375j4178O3268M0211
$$ plain form
24905 12277 -33988 -68647 -78845 -87724 -56941 -25928 -43363 11823 90017 85317 28907 16820
24893 16820 53619 47309 17625 -24466 -74096 -39356 10146 23927 64841 55169 74887 105702
24881 105702 75516 52045 29931 10083 56057 64331 72359 106987 50794 627 -12904 -48372
24869 -48372 -31166 -71009 -107024 -63517 30916 32817 164 2431 -6096 -36823 -53354 -44621
24857 -44621 -15270 -8461 -13250 34916 47797 60942 34676 -10541 -67419 -26028 7802 53500
24845 53500 -16240 -109090 -130789 -105518 -78695 -42286 -29259 -32175 11561 67785 60312 69823
24833 69823 91492 69746 47571 45472 26704 21459 37003 -6161 -23365 -16246 -51555 -76010
24821 -76010 -12026 22978 5726 8948 53829 30024 -18982 -18740 -40115 -54293 8975 49186
24809D9186l5451l0063M2114K9148k1035j180L09j30454n5781N7293M5123j8175
24797f8966P503n783M6877l6919k5709J1347J3765K4273r431J8746J3672J8985
24785H360k1971k7896L395J464L9118L3990j1487l5200r193p889J2676N0093L500
24772C8960K3353l7580l6929k0266k1512Q273Q128K3096K3432J3818P923K9523
24760F0219l8277n6147k2188J3707P589J5700J643j4584K3505N9M2950k4685M4981
24747E4472K0792o3094j9520J027R376K639P168M0074r389n0425K0115K3627K4843
24734F1705L4260p870M366q8019q3838k7919m708O3084n0331n0167L7811L0983
24722h0643K3083K5799M1933m5400q8559K8029O2026M6475J7960K9488K3468m2761
$$ plain form
24809 49186 13735 -16328 25786 54934 33899 32719 33028 -97426 -153207 -95914 -50791 -68966
24797 -68966 -61463 -67246 -20369 -57288 -82997 -71650 -57885 -33612 -43043 -24297 -10625 8360
24785 8360 -13611 -41507 -38112 -36648 2470 36460 24973 -10227 -19420 -27309 -14633 35460 38960
24772 38960 62313 24733 -12196 -32462 -53974 -45701 -37573 -14477 8955 22773 30696 60219
24760 60219 21942 -34205 -56393 -42686 -35097 -19397 -17754 -32338 -8833 -8774 34176 9491 54472
24747 54472 75264 12170 -7350 -6323 3053 5692 12860 52934 43545 -6880 13235 36862 61705
24734 61705 95965 88095 92461 4442 -79396 -107315 -112023 -48939 -99270 -149437 -111626 -80643
24722 -80643 -57560 -31761 10172 -35228 -123787 -95758 -33732 12743 30703 60191 83659 40898
24710D0898p9772K3803j9777L255r223K6050J1111l3365r6694k4018M2561M3114
24698g2057J4822j1544j4293M4148K4909r704N2426P3823o3568j03017q102K6599
24686d5558o192R02N901k8020k8294P460M6954J3096M9034J6149k1053p5798j1444
24673g6863J9751k6503k6203K3151K9434J8679M4441N3472o3851n1261q14q971
24661f5538K7498m1132k4502k0104J3478J3145j6412J478J43L4031Q8771l8333
24649b7477l046Q022J5222N250N0818k650j9747M5195P540p9235l4894n1916j5416
24636a02334L7838O835p238L5965j6433j4674k7608J2761j7775K6216k87k7003
24624i3737L7327K3450P1702l3043Q336m1310k6291n479l5659P402k261L1751
$$ plain form
24710 40898 -38874 -15071 -34848 -31593 -40816 -14766 -3655 -37020 -133714 -157732 -115171 -72057
24698 -72057 -57235 -68779 -83072 -38924 -14015 -23719 28707 102530 38962 -64055 -72157 -45558
24686 -45558 -51750 -50848 -44947 -72967 -101261 -93801 -46847 -33751 15283 31432 10379 -65419 -76863
24673 -76863 -57112 -83615 -109818 -86667 -57233 -38554 5887 59359 -4492 -55753 -56567 -65538
24661 -65538 -38040 -79172 -103674 -123778 -110300 -97155 -113567 -112089 -111946 -77915 10856 -27477
24649 -27477 -30523 -22501 -7279 -2029 48789 46139 26392 71587 79127 -108 -35002 -86918 -102334
24636 -102334 -64496 -57661 -64899 -28934 -45367 -60041 -87649 -74888 -92663 -66447 -66734 -93737
24624 -93737 -56410 -32960 38742 5699 14035 -27275 -53566 -59045 -94704 -87302 -89563 -57812
24612e7812J0129M5127L0948j7825k5357r484n088p749l5508P3072Q5988R4323
24600A80764k6859m7539n8606N29k0230j44665p2380P1385r322k0129N893R500
24588a31659j2900O9583P3601n1122k3573m9237J6013P8841J9913k7311l2580
24577g0431j6218K0530N1703L3777m446j1916L803o834o743J5761K679j7456p0725
24564g6516p1492Q1280J17356j2091p5252M119N134j588m5647K6724P6223N171
24552C3421K0144j0218K4637l8376p2244O8757L5694k3891K1284o1080l3508J4681
24540b0699M0417N9638P550k2819n2860j6690J7605k8624K1635P695j6149q4222
24528h7523n1995N3858O6102j190k152j4156k058j1117L4427L3457K2393o473
$$ plain form
24612 -57812 -47683 -2556 28392 10567 -14790 -24274 -29362 -37111 -72619 453 86441 180764
24600 180764 153905 106366 47760 48289 28059 -116606 -188986 -117601 -126923 -147052 -141159 -131659
24588 -131659 -144559 -74976 -1375 -52497 -76070 -125307 -109294 -30453 -10540 -37851 -70431
24577 -70431 -86649 -66119 -14416 19361 14915 2999 6802 -32 -6775 8986 11665 -5791 -76516
24564 -76516 -148008 -66728 50628 38537 -36715 -32596 -27462 -29050 -74697 -47973 28250 33421
24552 33421 53565 43347 67984 29608 -42636 26121 61815 37924 59208 -1872 -35380 -20699
24540 -20699 19718 79356 86906 64087 11227 -5463 12142 -16482 5153 12848 -3301 -87523
24528 -87523 -139518 -85660 -19558 -20748 -22900 -37056 -39114 -50231 -15804 17653 40046 33573
24516C3573O555L0304K4972n7984k3711M604M0608j2390r9193m9121N7250M6479
24504A946R631o3152k957J2550J0930l3317n2515j3955L5379L484j1051M5157
24492e7870O6069n6064J3941n566j6406J269L6284K8560J1597M5345k7403q6476
24480d6720k7513K9310O0770q088j5491K4298j5703j7526L9101K98n2106k9610
24468e8980j7134m4670r3560N1286P7759N0645L8552k6491J5315J9146l0698k0671
24456c9501P639j6711l5423k2478N2824M927l344L6123n402n0238L5884O0087
24444B4387L9300n3443k3705l852J2649m1647p684o666Q781J262j5423L7033j0889
24431c9897N0533J4985M741l2375l9128j7148N3213K7588M679K4807j8381m721
$$ plain form
24516 33573 40128 70432 95404 37420 13709 18313 58921 46531 -52662 -101783 -44533 1946
24504 1946 11577 -51575 -54532 -41982 -31052 -64369 -116884 -130839 -95460 -91976 -103027 -57870
24492 -57870 8199 -47865 -33924 -39490 -55896 -54627 -18343 10217 21814 67159 39756 -46720
24480 -46720 -74233 -44923 15847 7759 -7732 16566 863 -16663 22438 22736 -29370 -58980
24468 -58980 -76114 -120784 -214344 -163058 -85299 -34654 3898 -22593 -7278 11868 -18830 -39501
24456 -39501 -31862 -48573 -83996 -106474 -53650 -48723 -52067 -15944 -21346 -71584 -35700 24387
24444 24387 63687 10244 -13461 -17313 -4664 -46311 -53995 -60661 -51880 -50618 -66041 -29008 -39897
24431 -39897 10636 25621 30362 -2013 -41141 -58289 -5076 22512 27191 51998 33617 28896
24419B8896j0604o3822n0069L870K0670j0310M8332J6012M9104J8290n0697j8096
24407a8424l7742m584K4237K4627N0609J7229J3994J2002k3100l7718j884J347
24395B0593J1046n593L82Q82j7201k9044r3041k6528O2783k4340N86o392J6312
24382h9555L9986M1250n413N942J8028l3827j2102J6008k9674k7044j0773l1776
24370a18950M3891N7566K6108l2232L1231j5254K2328N4582n7030n716K2765n7721
24358b8432m2321j9671k5743q513j9592O6086j2092j835L1970n495M7933N313
24346a2392o010j5348L2878l0036l400m1614M3544P043K1409L4060l8438m3384
24334e1688K6785P6644o2579m0445J8659j5143n1622l9997N9244M172K2212L952
$$ plain form
24419 28896 18292 -45530 -95599 -91729 -71059 -81369 -33037 -17025 32079 50369 -328 -18424
24407 -18424 -56166 -60750 -36513 -11886 38723 55952 69946 81948 58848 21130 19246 20593
24395 20593 31639 26046 26428 27310 10109 -18935 -111976 -138504 -75721 -100061 -99475 -105867 -89555
24382 -89555 -49569 -8319 -13732 -7790 10238 -23589 -35691 -19683 -49357 -76401 -87174 -118950
24370 -118950 -75059 -17493 8615 -23617 7614 -7640 14688 69270 12240 6524 29289 -28432
24358 -28432 -70753 -90424 -116167 -124680 -144272 -78186 -90278 -92113 -60143 -65638 -17705 -12392
24346 -12392 -18402 -33750 -872 -30908 -34308 -75922 -32378 -25335 -3926 30134 -8304 -51688
24334 -51688 -24903 51741 -10838 -51283 -32624 -47767 -99389 -139386 -80142 -75970 -53758 -49806
24322d9806k363L4168n9239q537N2708K8790J1780J8794j592J9288N1405k4353
24310G1043l6598l519l1811j01307K4918K3821k0205L2471L6555r170J090l3796
24298d6508K3622N9536j3982l3206o479N1425j4674m6564o4087j5245O4876K4001
24286a7285N178k5905j5459K3565j6635J577R1184J1919j2245k0195l0196Q811
24274D314M6682j5575M149P825l5411m4434M830N175J7350L1670Q4446N1444o0131
24261A02334l2724j3610m7316j7183L9810O7936o2035k5511j6092n1281J6297
24250c9375j3474L72O8432N578k0210K3124L715J3173l8903K2244o0773q451R915
24237c4633L2656l3356k466l0249j8689L4838M2667J9113k9355k0421n5254k1760
$$ plain form
24322 -49806 -52169 -18001 -77240 -85777 -33069 -4279 7501 26295 24703 43991 95396 71043
24310 71043 34445 30926 -885 -102192 -77274 -53453 -73658 -41187 -4632 -13802 -12712 -46508
24298 -46508 -22886 36650 22668 -10538 -17017 34408 19734 -26830 -90917 -106162 -41286 -17285
24286 -17285 -12107 -38012 -53471 -29906 -46541 -44964 46220 58139 45894 25699 -4497 4314
24274 4314 50996 35421 39570 47395 11984 -32450 -27620 -22445 -5095 26575 111021 162465 102334
24261 102334 69610 56000 8684 -8499 31311 99247 37212 11701 -4391 -55672 -39375
24250 -39375 -52849 -52477 15955 21533 1323 24447 28162 41335 2432 24676 -36097 -44548 -34633
24237 -34633 -1977 -35333 -37799 -68048 -86737 -51899 -9232 9881 -19474 -39895 -95149 -116909
24225a16909L9633L1474P8931M0809l414l2596n4472j2800J0884K6459J4531k0180
24213B350k4841J30j620N6753J0375j12592K3677L4496J1261J2917k2132j0951
24201b0177k0175L0701j3286J5537K2441R773m191j2217q836m0606m2080n6446
24189a39562O6760J05356L5652K8173p4058p8066n9710K7744P1830J3984j4317
24178a6214P2936M6841o0362J8135m3424j26726J5687P1974m3029p833L2569j4848
24166e4294n1142K3805j4639Q2306J1690k8358k8450m9585m658N7340P5166K7498
24154D6679j8285K9944m549J9319j3531l7276m171j6010o4288l58R1513L9897
24142F8884j49948m9711P6698O0898J342L2193j6279m44k3908q3269j8137P4894
$$ plain form
24225 -116909 -77276 -45802 33129 73938 70524 37928 -16544 -29344 -18460 7999 22530 2350
24213 2350 -22491 -22361 -23981 32772 43147 -69445 -45768 -11272 -11 12906 -9226 -20177
24201 -20177 -40352 -9651 -22937 -7400 15041 24814 20623 8406 -430 -41036 -83116 -139562
24189 -139562 -72802 32554 68206 96379 22321 -55745 -115455 -87711 -15881 -1897 -16214
24178 -16214 56722 103563 43201 61336 17912 -108814 -93127 -21153 -64182 -72015 -39446 -54294
24166 -54294 -105436 -81631 -96270 -13964 -2274 -30632 -59082 -108667 -113325 -55985 19181 46679
24154 46679 28394 58338 53789 73108 59577 22301 18130 2120 -62168 -62526 28987 68884
24142 68884 -81064 -130775 -54077 6821 8163 40356 24077 23633 -275 -83544 -101681 -26787
24130b6787m242J8548J0891p296N519J3987R145k4424m5493J3994l6978m487K5867
24117e1756J1053q120k2077o2799j874K8077j6638k1582L1379M5824K3037L86
24105d5090P0889N9081K3821p94k4216J7069m58p477m4413q6102o3612L0860N1551
24092a8891j8818k2087L7748K3410n3455L188l0395j3543Q3627k9872o506K8777
24080a6817j691K533L5871J6224o8o7259l792k8306L5794K4379j4220K1784r11
24067C521J5417o6533j5059Q0348M6695p815n6835m0191O8084j0538m8725m5495
24055g7126l5914K645M7646L2316j5554l6929J6620j51L4420N8635j3663k0752
24043g807m6807m5133j9890N9328j8185l349M1592J4031L3411M9663l7887r468
$$ plain form
24130 -26787 -31029 -12481 -1590 -8886 -3367 10620 19765 -4659 -50152 -36158 -73136 -77623 -51756
24117 -51756 -40703 -48823 -70900 -133699 -135573 -107496 -124134 -145716 -114337 -68513 -45476 -45090
24105 -45090 25799 84880 108701 107907 83691 100760 100302 92825 48412 -37690 -101302 -70442 -18891
24092 -18891 -37709 -59796 -22048 1362 -52093 -48905 -79300 -92843 -9216 -39088 -45594 -16817
24080 -16817 -18508 -15975 19896 36120 36052 -31207 -34999 -63305 -27511 -3132 -17352 4432 3521
24067 3521 18938 -47595 -62654 17694 64389 56574 -261 -40452 27632 17094 -31631 -77126
24055 -77126 -113040 -110395 -62749 -30433 -45987 -82916 -66296 -66447 -32027 26608 12945 -7807
24043 -7807 -54614 -99747 -119637 -60309 -78494 -81843 -40251 -26220 7191 56854 18967 9499
24031I499K5174L1264J1621l9868j2431k5331m7950k0539j0938K2823J0336m4176
24019i0516j7147j0792J796n03K2880O5235N3945J092o6229J4961L7096J549q0622
24006f7255K8070O5733m15L72k5905K855L6160M3256K6556K6395m8976o5997m8267
23993b7418l3191l8993M9767Q4718J1836L5084K3631o2315k5254k733j3625K9719
23981C1226o0099j4940K8283L0678m041k3788N3580N4381p6767m0737j9809j5911
23969e7944k598o6593l2795j3003K6460M2500N1051M5460j3630j0636k3136n7921
23957a12785Q333M595N0450N7935L4390j9029P13l3625l5604l4105m513N9223
23945b4022J9653L2660l5664l9698M7314K1533K9821k5208k5729O0199j4245m1373
$$ plain form
24031 9499 34673 65937 77558 37690 25259 -72 -48022 -68561 -79499 -56676 -46340 -90516
24019 -90516 -107663 -118455 -116659 -117162 -94282 -29047 24898 25990 -40239 -25278 11818 13367 -67255
24006 -67255 -39185 26548 26133 26505 600 3455 39615 82871 109427 135822 86846 20849 -27418
23993 -27418 -60609 -99602 -49835 34883 46719 81803 105434 43119 17865 15132 1507 31226
23981 31226 -28873 -43813 -15530 15148 11107 -12681 40899 95280 18513 -22224 -42033 -57944
23969 -57944 -60542 -127135 -159930 -172933 -146473 -103973 -52922 -7462 -21092 -31728 -54864 -112785
23957 -112785 -104452 -99857 -49407 8528 42918 23889 24602 -9023 -44627 -78732 -83245 -24022
23945 -24022 -4369 28291 -7373 -47071 243 21776 51597 26389 660 60859 46614 5241
23933E241j5006k2558n7575j7072R6796K46q3883J7966N3969j133J2456K0984
23921A0431J7978l996k0350j7457K7229R988o9046r711j2038O9666j7044M390
23909i960K8940J5139l5989L392O63m7295n6650L3262p8q957L56J4825o3147K4623
23895a00876J20154R148r6409n4319J6654J7359p074K3835M2510J1557n1225q144
23883g6830M8998n611J9633K4038N7835K8346m978Q345l358n5032m4820o8840
23871g2274K2351Q5003L0431N665J607L210j8826M270l6706k9944J6235L8424
23859D9446j6254m7740L0153j860J1659j2103n9014J3665K0185j0333q5938N1083
23847e7051Q4760L9829l6310l5010L5569L8258J1767K6912k2818j3469m1801n6022
$$ plain form
23933 5241 -9765 -32323 -89898 -106970 -10174 -9928 -93811 -75845 -21876 -23009 -10553 10431
23921 10431 28409 24413 4063 -13394 13835 23823 -45223 -54934 -66972 2694 -14350 -9960
23909 -9960 18980 34119 -1870 1522 2185 -45110 -101760 -68498 -68576 -77533 -77177 -62352 -125499 -100876
23895 -100876 19278 28426 -67983 -122302 -105648 -88289 -95363 -71528 -29018 -17461 -68686 -76830
23883 -76830 -27832 -33443 -13810 10228 68063 96409 91431 99776 96418 41386 -3434 -72274
23871 -72274 -49923 35080 65511 71176 72783 75993 57167 61437 24731 -5213 11022 49446
23859 49446 33192 -14548 15605 13745 25404 13301 -45713 -32048 -11863 -22196 -108134 -57051
23847 -57051 27709 67538 31228 -3782 31787 70045 81812 108724 85906 72437 30636 -25386
23835b5386l874K248P351P536l7382p040Q941R6666L4831j9399o0505n5730m3710
23822i5453N4876l3806l1038M2633K3390N8922K1991k2707m1371n6037j0978K5152
23810f4426l377n1900J4978O8008k1506P535K0945J5323L9562K3640j0177J6578
23798E5183j0874m6255k0492k622j3237m9089m6723k1360N1068Q204m2384K7678
23786a10903M1032N8902N9348l5001p264o3593j4584j9676M5537R4643M7655l6753
23774E9343n7808q1718P046q46K9812l881p0826L2580N9885N9685J4794p5244
23762b7178l0249n2375J9144O1362L9462j9905K9175k1662j6078J0331R170R619
23750A0816m2304j7884p237m712l0148O1128r376k1703K0727j5548M0722n3253
$$ plain form
23835 -25386 -29260 -27012 -19661 -12125 -49507 -56547 -47606 49060 83891 64492 3987 -51743 -95453
23822 -95453 -40577 -74383 -105421 -62788 -39398 19524 41515 18808 -22563 -78600 -89578 -64426
23810 -64426 -67803 -119703 -104725 -36717 -58223 -50688 -29743 -14420 25142 48782 38605 55183
23798 55183 44309 -1946 -22438 -25060 -38297 -87386 -134109 -155469 -104401 -96197 -138581 -110903
23786 -110903 -69871 -10969 48379 13378 6114 -57479 -72063 -91739 -46202 48441 96096 59343
23774 59343 1535 -80183 -73137 -73983 -44171 -48052 -118878 -86298 -26413 33272 48066 -27178
23762 -27178 -57427 -109802 -90658 -29296 10166 -9739 19436 -2226 -18304 -7973 1197 10816
23750 10816 -31488 -49372 -56609 -61321 -91469 -30341 -39717 -61420 -40693 -56241 -15519 -68772
23738f8772n4113P3907Q6546R915m0558L380j2621K756k2145R116O74m900j267
23725a8082l8851l5714p152N4637j6186l4798L1260N2241J37j5231K2127j780
23713g392j8631o791m7212K2789L3923N479J87M3600k450l8252N0734Q473M514
23700D8971n2301J1734L5595l4210j8820k926L9936J8930p256o0562O501n578
23688a9986K2183J1453n2651K0309L3559J9826l1849K4170O351n8307J3417R191
23676b334L7209l0123p0057n645L4056N4732p460n9843p254j712J7028k6585l8790
23663a06778J4342M9734O6983L9622m7375o0831L6916K8780L8082m133j4187j0688
23651C0467J2699K5316O9868K0507n1851j2514L6092O799k2331m7466J6293o078
$$ plain form
23738 -68772 -122885 -48978 37568 47483 6925 10305 -2316 440 -21705 -12589 -11915 -16815 -18082
23725 -18082 -56933 -92647 -99799 -45162 -61348 -96146 -64886 -12645 -12508 -27739 -5612 -7392
23713 -7392 -26023 -32814 -80026 -57237 -23314 -17835 -17648 25952 23502 -14750 35984 44457 48971
23700 48971 -3330 8404 43999 9789 -9031 -11957 27979 46909 39653 -20909 -14408 -19986
23688 -19986 2197 13650 -39001 -18692 14867 34693 2844 27014 33365 -24942 -11525 -2334
23676 -2334 34875 4752 -65305 -70950 -36894 17838 10378 -49465 -56719 -58431 -41403 -67988 -106778
23663 -106778 -92436 -42702 24281 63903 16528 -44303 -7387 21393 59475 55342 41155 30467
23651 30467 43166 68482 138350 158857 107006 94492 130584 137383 115052 67586 83879 77801
23639G7801k8714K5249N988K2404R209n114P9299P0512L2393J545L1487j094K4742
23626C45707J13849J62467K73254L98541M24487M53918K16772k24756n15562n15443
23616A133234l73244k45260j73344j52220o0368j9416l0362K5595k109m5749j8025
23605C8732k1419L2696M0929k1492m2333j0829k7337J4178J5425p5375k1558m321
23593h2704J9957K8005J6095j476J4544j090j6384P2210M2480O9431k6407m3824
23581I0837o5613j3423L027O7614m6335l946k5592m0183P650L3095J7591k8838
23569d116l8665k6083J7335N5768k3485N5017M1269J3604o9091l5808q40k5590
23557d0685p6188n392J1058r78n990p535M767P2272j2941k7843j3510M6774K5302
$$ plain form
23639 77801 49087 74336 80324 102728 111937 106823 186122 256634 289027 290572 322059 320965 345707
23626 345707 459556 622023 895277 1293818 1718305 2172223 2388995 2164239 1648677 1133234
23616 1133234 759990 514730 341386 189166 128798 109382 79020 104615 102506 56757 38732
23605 38732 17313 50009 90938 69446 27113 16284 -11053 3125 18550 -56825 -78383 -82704
23593 -82704 -62747 -34742 -18647 -20123 -5579 -6669 -23053 49157 91637 161068 134661 90837
23581 90837 25224 11801 14828 82442 36107 32161 6569 -33614 -25964 7131 24722 -4116
23569 -4116 -42781 -68864 -51529 4239 -19246 35771 77040 90644 21553 -14255 -15095 -40685
23557 -40685 -116873 -122265 -111207 -112185 -118175 -125710 -120943 -48671 -61612 -89455 -102965 -56191 -30889
23544c0889j3945j0164Q0037Q0251m9150o7075j480K9337k9947K1024L6433j1867
23532C2565m2529m0602L1324N3588l9221J5073J3956n048j4436o8126j8987l3464
23520a15907l1481K5177J2508O4183Q2765R7256j3547j4869j7199p58n5018M200
23508C7310N4407M6502q2272l9345k274j3604N0224m886p0511j75J5799N765j1271
23495a4331J055K5346N2978J3579n4819J0382K7294l8278l9781j8771J6909N0294
23483C1857J7256j882M163J2180m6255l6836N0614K7092l6004J4559L2562l3726
23471C5580j6020L6216M9568l1062j924k4603j0358L75K259k6130J6968L8913
23459F9782j0901L353N483n376j046N212o2927p9923M5768L1329k4930J4052P9859
$$ plain form
23544 -30889 -44834 -54998 25039 105290 56140 -10935 -12415 16922 -13025 7999 44432 32565
23532 32565 -9964 -50566 -19242 34346 -4875 10198 24154 19106 4670 -63456 -82443 -115907
23520 -115907 -147388 -122211 -109703 -45520 37245 134501 120954 106085 88886 88128 33110 37310
23508 37310 91717 138219 55947 16602 14328 724 50948 46062 -24449 -24624 -8825 -3060 -14331
23495 -14331 -13276 12070 65048 78627 23808 34190 61484 23206 -16575 -35346 -18437 31857
23483 31857 49113 47231 51394 63574 17319 -19517 31097 58189 22185 36744 69306 35580
23471 35580 19560 55776 105344 74282 72358 47755 37397 37772 40031 13901 30869 69782
23459 69782 58881 62234 67717 62341 61295 66507 3580 -76343 -30575 754 -24176 -10124 69735
23446F9735J6365o1741o7196L2855P5850m6988n6312m7420k5884K5438J5587J1138
23434e8573m7544K7829M0837n5778O993Q7671K6663k4037J3181M3880M7343l9036
23422F9429L237k419n318l9461j0558K6404l6771p4358l2126K9011N1393J8552
23410b985L1783K7667j3134l7585j1654l97l2935l756K4028K1271L8512k839o8709
23397c0733k5561j2434l1800j4323O0684K3129L771l5320Q171O6487N7173k9283
23385C9961l9630J056N772l8579n0542J2966M3478K5269j2307J3359p856j7464
23373b4517O023Q9646L5401n0010m4025j0661j980l0257m1406L3091K4647O0143
23361D6095M2859k6335K2284o074O932L9245j9027k7916L1922j055q3336K1399
$$ plain form
23446 69735 86100 24359 -42837 -9982 65868 18880 -37432 -84852 -110736 -85298 -69711 -58573
23434 -58573 -106117 -78288 -37451 -93229 -86236 1435 28098 4061 17242 61122 108465 69429
23422 69429 72666 70247 64929 25468 14910 41314 4543 -69815 -101941 -72930 -21537 -2985
23410 -2985 28798 56465 43331 5746 -5908 -6305 -39240 -42996 -18968 2303 40815 37976 -30733
23397 -30733 -56294 -68728 -100528 -114851 -54167 -31038 -27267 -62587 -54416 12071 69244 39961
23385 39961 331 1387 7159 -31420 -81962 -68996 -25518 -249 -12556 803 -7053 -24517
23373 -24517 -18494 71152 106553 56543 12518 1857 -123 -30380 -71786 -38695 -14048 46095
23361 46095 88954 62619 84903 78829 85761 125006 105979 78063 109985 108930 25594 46993
23349D6993L1154m3566l273n6420l4111J5906J8075M183M4910M0099j1313K2350
23337G4987k2043j4103J6243n981j2683l4831k2897P711o762M6758K2459L4747
23325H3605L802J0208N1102P3763P9872l5162l9387o1500o6596k1507r031k255
23313F6914L2651l1435o7991l3843n5508N436O8031K9514O7907K4499j7806m4824
23301D3545j919N056l777O196m7877o6941K1087O988J3595L2148q5427J8081J7000
23288d2245n780l343J1738M1356l231J0789N1223l7867m6746J4428O9661L1966
23276I1949k1977p7223N4191O4971m5930n9025P785K3837K2453R781o6020o8469
23264f3677K2126J3557J4683l5296j8234J2765o8905J0586Q6103O5709L7953p0682
$$ plain form
23349 46993 78147 34581 31308 -25112 -59223 -43317 -25242 -21059 23851 63950 52637 74987
23337 74987 52944 38841 55084 49103 36420 1589 -21308 -13597 -20359 26399 48858 83605
23325 83605 87407 97615 148717 222480 302352 267190 227803 166303 99707 78200 69169 66914
23313 66914 99565 68130 139 -33704 -89212 -83776 -15745 13769 81676 106175 88369 43545
23301 43545 41626 46682 42905 49101 1224 -65717 -44630 -37642 -24047 8101 -77326 -59245 -42245
23288 -42245 -48025 -51368 -39630 1726 -1505 9284 60507 22640 -24106 -9678 59983 91949
23276 91949 69972 -7251 46940 111911 65981 6956 14741 38578 61031 70812 4792 -63677
23264 -63677 -41551 -27994 -13311 -48607 -66841 -54076 -122981 -112395 -26292 39417 77370 6688
23252F688J2819j6382J4616n12o7905j8107J4329M723J6194M7643M2938L6876
23240I3920j6272N9672K8635J0886r3181o7817j7397P1370L0167l1578l2909o5095
23228b9599M6701O554j06881l2764N7855M4323j6214p1346M7634P3914M2481K6302
23216H8960k7201j2878J7257M438l4453K908M1472R02K9603m606l7964l229J1440
23203G6649Q484M8213m9990J9131R303m0802l3002m2516m1152N3730N2854K5204
23191H6106L2758m8726p8682K5402P7501J7299l2867p3748k0638L0790M687N0720
23179G0602O3277M013J3014k8180m9918J4599R014O825j2375k3974k7197M6142
23167H5842J9668O4364K1137j5070K2056M6059J6620J4071J9934K8497m3996o754
$$ plain form
23252 6688 19507 3125 17741 17229 -50676 -68783 -54454 -49731 -33537 14106 57044 93920
23240 93920 77648 137320 165955 176841 83660 15843 -1554 69816 99983 68405 35496 -29599
23228 -29599 17102 23656 -83225 -115989 -58134 -13811 -30025 -101371 -53737 20177 62658 88960
23216 88960 61759 48881 66138 70576 36123 39031 80503 81405 111008 106402 68438 65209 76649
23203 76649 85133 133346 83356 102487 111790 70988 37986 -4530 -45682 8048 60902 86106
23191 86106 118864 70138 -8544 16858 94359 111658 78791 5043 -15595 15195 19882 70602
23179 70602 133879 137892 150906 122726 72808 87407 96421 103246 90871 66897 39700 85842
23167 85842 105510 169874 191011 175941 197997 244056 260676 274747 294681 323178 279182 272428
23155B72428O9908K7707R4431J13797J6380K4807O4276J75024K58035M51047N92877
23144B160717M18002J6510l79622n88813n42203l21331j78930m6144o6935j15448
23134C55803l4808M4276P7051J2079k5023m209k8780n6114K0329J915N3092J14490
23122E30101J08369J00876J01773J2553n2336M8022R6194M2135K3648O9101P5336
23111A155772J01448J08850M8642P2310J59588J07278J44591J38218J72004K34675
23101B443376K51704L09229M67149N14986N10145N64713O48256P91406R59143
23092G460107J139339J308895J515512J588487J768523J975574K126613K210984
23084B1094034K154087J897516J923849K420560L284668M206869N020848O025692
$$ plain form
23155 272428 342336 370043 464474 578271 594651 619458 683734 858758 1116793 1567840 2160717
23144 2160717 2578719 2595229 2215607 1626794 1084591 763260 584330 538186 471251 355803
23134 355803 320995 365271 442322 454401 429378 425169 396389 340275 360604 362519 415611 530101
23122 530101 638470 739346 841119 853672 801336 849358 945552 987687 1011335 1080436 1155772
23111 1155772 1257220 1366070 1414712 1487022 1646610 1753888 1898479 2036697 2208701 2443376
23101 2443376 2695080 3004309 3471458 3986444 4496589 5061302 5709558 6500964 7460107
23092 7460107 8599446 9908341 11423853 13012340 14780863 16756437 18883050 21094034
23084 21094034 23248121 25145637 27069486 29490046 32774714 36981583 42002431 48028123
23076D8028123P450483R889834J4507813K2944163L8122682O2681834R3040447
23069B96665379R5799369N0945293l2212251r3058578j06801254p7190991m5400530
23062H8746437k6439925j6460608j0815311p246621n037401l523002k424032j600045
23054A5199492j182014j132921j296255j503881j455826j114326q40855p35928
23046E937486o01668n18396n02346m28900l69478l94036l55329k71911j81217
23037B314205r9866r8546q7666j00727r1359j42831j14582p9964r7909r8987j19172
23026A182596L5619q308l8497l7105l2193n2845j4311m6906o9985n4037j7426
23015H46602m119j961o421r814Q0610j4465j486J9278l18j16600p3302p507N3492
$$ plain form
23076 48028123 55478606 65368440 79876253 102820416 140943098 203624932 296665379
23069 296665379 392464748 443410041 411197790 318139212 211337958 134146967 88746437
23062 88746437 62306512 45845904 35030593 27783972 22746571 19223569 16799537 15199492
23054 15199492 14017478 12884557 11588302 10084421 8628595 7514269 6673414 5937486
23046 5937486 5335818 4817422 4315076 3886176 3516698 3122662 2767333 2495422 2314205
23037 2314205 2214339 2115793 2028127 1927400 1836041 1693210 1578628 1498664 1400755 1301768 1182596
23026 1182596 1218215 1209907 1171410 1134305 1102112 1049267 1034956 988050 918065 864028 846602
23015 846602 842483 840522 834101 824287 904897 890432 888946 908224 907906 791306 718004 710497 763989
23002G63989N9064j1864o0942k6567K1699Q5406J14411J68097K16581M40189N55218
22991B325281L98001Q3725m16943n79171n56564l56477j73756j30286j21176J336
22981D73970J4147o4831m6757p030O7386K2559j6757l6597j633J2023p112k1550
22969C87818o932j7241o8426n8198Q2824O5958p9382J360l5915n1474n7694Q5051
22957B47749K3170l2682o517M5799L0629r1326m1833L4946L01J5311P8321N4011
22945C57879L4334n6509l0336P515Q1502P0014p6111q2425m5997K1427k8383p0273
22933A82637n8035j1420j7774O7594Q1166k2708r4608n3811J1511q14L2693N7680
22921A74111N52l9915m4879J6412Q4636R102K2995L9782j9029k8085j7471L644
$$ plain form
23002 763989 823053 811189 750247 723680 745379 830785 945196 1113293 1329874 1770063 2325281
22991 2325281 2723282 2807007 2390064 1810893 1254329 897852 724096 593810 472634 473970
22981 473970 488117 423286 376529 369499 436885 459444 442687 406090 404457 416480 409368 387818
22969 387818 380886 363645 295219 237021 319845 385803 306421 307781 271866 220392 162698 247749
22957 247749 270919 238237 231720 277519 308148 216822 174989 209935 210236 225547 303868 357879
22945 357879 392213 335704 305368 312883 394385 464399 388288 305863 259866 281293 252910 182637
22933 182637 124602 113182 95408 163002 244168 221460 126852 73041 84552 83738 116431 174111
22921 174111 174663 134748 89869 106281 190917 200019 223014 262796 243767 215682 198211 201855
22909B01855n299n2739n5949l0690l2349Q615J8687l4586k5769R66J8348n90l7351
22896b6851n1349N3292M8048M2860J6429K5700K5403r951j5664k1995n731p8452
22884A739J749K1589J486o3101l1057R3414R3826P8961p965m0723o2391k9374
22872E8153Q379j7269L4363L0800r59j6976O0915m3960p3137K1774M1085K1746
22860A24914j8801l0836J3180k7541k7824m7566n978K7536K5360L1427L5170M7278
22848A46319j3906o6958m8277l9195J3341N2449K5363k655J5973J1044M8004J795
22836A43297o9047n6157k4132K6365O449K2046k6445l3005L2608q607n569k0501
22824a2698L1687K4037O6544k0015q7285J1741N1418k5596Q434k353J035M1015
$$ plain form
22909 201855 196556 143817 87868 57178 24829 33444 52131 17545 -8224 -7258 11090 10500 -26851
22896 -26851 -78200 -24908 23140 66000 82429 108129 133532 123581 107917 85922 80191 1739
22884 1739 3488 25077 26563 -36538 -67595 25819 119645 198606 190641 149918 87527 58153
22872 58153 66532 49263 83626 114426 113467 96491 157406 113446 40309 62083 103168 124914
22860 124914 106113 75277 88457 60916 33092 -14474 -20452 7084 32444 63871 99041 146319
22848 146319 132413 65455 17178 -22017 -8676 43773 69136 66481 82454 93498 141502 143297
22836 143297 74250 18093 -6039 20326 26775 48821 22376 -10629 21979 13372 7803 -12698
22824 -12698 18989 43026 109570 89555 2270 14011 65429 39833 48267 45914 46949 87964
22812H7964R14q0523j8971M6002N237q721l4379k1017r44L6186J1017j2351J1145
22799B1559J4740l7063q0568l90m910M9425M1573k0581o031K9680k3493L41O6177
22786E0459J2836j4197j01216l5749J8742R5583N5735k6058l650L7061k3162j2995
22774E3389O7370K0428k2070o18l7010k2179j5111l6254K6720K0408K2390k1220
22762E6243K7922J125k1590k9888j9842n9073j7440M3454M8844J049k6611M2115
22750D6308O3960o8963j2470K9692j5622r168L9695l4577m1455P1092K6026m5180
22738D9338o5786l8806K933l619O4961O6608K0240k6526m3591K9194o653m5305
22726B988j5293J3014M7049k3674m4408j1567k8812J4024j883K0727j8010M704
$$ plain form
22812 87964 88878 8355 -10616 35386 40623 31902 -2477 -23494 -24438 11748 22765 10414 21559
22799 21559 36299 -764 -81332 -81722 -86632 -37207 4366 -16215 -22246 7434 -16059 -15718 50459
22786 50459 63295 49098 -52118 -87867 -69125 26458 82193 56135 52485 89546 66384 53389
22774 53389 120759 141187 119117 118499 81489 59310 44199 7945 34665 55073 77463 56243
22762 56243 84165 85290 63700 33812 13970 -45103 -62543 -19089 29755 30804 4193 46308
22750 46308 110268 41305 28835 58527 42905 33737 73432 38855 -2600 68492 94518 49338
22738 49338 -16448 -55254 -52321 -55940 9021 75629 95869 69343 25752 54946 48293 2988
22726 2988 -12305 709 47758 24084 -20324 -31891 -60703 -46679 -48562 -27835 -45845 -41141
22714d1141K0776K6124J6604p350K6699J1731o3546J7652K9663j2475l7875j11772
22702a24910J3987K8684l764J1795O2335M6305p52K2609r878L089n7376r753O3969
22689D6340M2335l6042o0988Q687n0267K8628r180r404k6775j6556J102P2423
22677i697K0265J3574l0933r6809m2083O2620P2058J8316j3090j4199L1079m1438
22665c0337K0754k5853L758M2939M2815r647o2293p6672L5961N5514l9267k2502
22653f4830N082O25K6058O3006K8117L6572m4648j6970n8431j4005O9314O1857
22641I1747K9775j3291k5733L6001K2653o5566k7369J207r493q650P2245J0277
22629A13803m7526l9108o9434j4921L4463J4682K894n7009j435N2070J174n6735
$$ plain form
22714 -41141 -20365 5759 22363 15013 41712 53443 -10103 7549 37212 24737 -13138 -124910
22702 -124910 -110923 -82239 -86003 -74208 -11873 34432 33680 56289 46411 49500 -7876 -17629 46340
22689 46340 88675 52633 -8355 332 -49935 -21307 -30487 -39891 -66666 -83222 -82120 -9697
22677 -9697 10568 24142 -6791 -103600 -145683 -83063 -11005 7311 -5779 -19978 11101 -30337
22665 -30337 -9583 -35436 -31678 11261 54076 44429 -17864 -94536 -58575 -3061 -42328 -64830
22653 -64830 -59748 -59123 -33065 29941 58058 94630 49982 33012 -25419 -39424 29890 91747
22641 91747 121522 108231 82498 118499 141152 75586 48217 49424 39931 31281 103526 113803
22629 113803 66277 27169 -42265 -57186 -22723 -8041 -5147 -62156 -63591 -11521 -10347 -67082
22617f7082j0285O5453j6717J0480J2658L707J3575M8706n5671m6339O411q21
22605c5925K6571k1949N9046k2182o9478l123M2693L2025N7203K3957o507n210
22593G7121Q882J5733n1668l1628l4978M3983K2177J9250j7320m0552m5007l642
22581c7649M6659l1968n6001j4873N9025P3537J9115k2559J8795P515N300n377
22569F1519k9268j9805k0353l4135R408M0779P3266J2875j06363l4930m7118O2719
22557c1406P0998m2749N560r294j5453O058Q9343L9442j2047n532P801p8522o322
22544A7877n761K1049O3561Q671p2513p7373L5916K1072k3339o048M1156J001
22532B5269M9865m937n2280K3161k0774J1444J3559m1191J2015L6757N1894L3775
$$ plain form
22617 -67082 -77367 -11914 -28631 -18151 -5493 -1786 11789 60495 4824 -41515 -35104 -35925
22605 -35925 -9354 -31303 27743 5561 -63917 -67040 -24347 7678 64881 88838 82331 77121
22593 77121 86003 101736 50068 18440 -16538 27445 49622 68872 51552 11000 -34007 -37649
22581 -37649 9010 -22958 -78959 -93832 -34807 38730 57845 35286 54081 61596 66896 61519
22569 61519 32251 12446 -7907 -42042 -32634 8145 81411 94286 -12077 -47007 -94125 -31406
22557 -31406 39592 -3157 2403 -6891 -22344 -16286 73057 112499 100452 94920 102721 24199 17877
22544 17877 12116 33165 96726 105397 32884 -44489 -8573 12499 -10840 -16888 24268 25269
22532 25269 75134 70197 17917 41078 20304 31748 45307 4116 16131 52888 104782 138557
22520A38557J0745J2389M1167J27555N8846k2469N365N8751M1973R1860K70421
22509H35160L71021N23976M52526J34832k52645n31325n09792l32504k23199j24060
22499C43990j47923n1189l4107K8265p117l0180l1188O016k6261j6111J0120p537
22487C6778L9732K1650m3083k1305n0969l9255J2002k6487k8744j1648L7695N0695
22475b2939p746k9212k0994J7410O897J1125J00855L8921j6225R773n5864o225
22463B5776j9778k3477n7156n719Q3986M4727k3489N858k5414j0976m463r428
22451a9553M4075M4172J3189J4812m2724m3018j01879j8858L3026K048L6252Q9820
22439E1362k4580l8929M6797J07681K375l6763p5918l3185j5404l7626k1665M9421
$$ plain form
22520 138557 149302 161691 202858 330413 389259 366790 372155 430906 472879 564739 835160
22509 835160 1206181 1730157 2182683 2317515 2064870 1533545 1023753 691249 468050 343990
22499 343990 196067 144878 110771 139036 131919 101739 70551 76567 50306 34195 44315 36778
22487 36778 76510 98160 55077 33772 -17197 -56452 -44450 -70937 -99681 -111329 -73634 -22939
22475 -22939 -30685 -59897 -80891 -63481 -56584 -45459 55396 94317 78092 87865 32001 25776
22463 25776 5998 -17479 -74635 -80354 3632 48359 24870 30728 5314 -5662 -10125 -19553
22451 -19553 24522 68694 81883 96695 53971 10953 -90926 -109784 -76758 -74710 -38458 51362
22439 51362 26782 -12147 34650 142331 144706 107943 32025 -1160 -16564 -54190 -75855 -26434
22427b6434P330k6244K5460L0693j2783m2458o0419r244P0826L5059j8343k9516
22415e6073n1554O6425P4997j3697k5262Q620Q6588k5375j16398k8252J1751r740
22403g7970L6899K4122j4993o782N959Q4504M8291k7448n9588m9533K7827L4313
22391B5601k8774M1954K1406p2636l4534L3478m067L5057L4268M2112R628K5956
22379A29449p6819m7550l6742l652M6270j251n403o6624J3639P2285N5057l9386
22367C9273p0090l4534L9057L1688j944J7585j3311P18j01926J1835R2453m132
22355F672l3454r590K9666R146m0712J2091M2586P788m935l9894k0580K3702R626
22342g888j5914J4696k9861M0438O5508q660k4970J3419K4455n066o320l8919
$$ plain form
22427 -26434 -19104 -45348 -19888 10805 -1978 -44436 -104855 -114099 -43273 -8214 -26557 -56073
22415 -56073 -107627 -41202 33795 20098 -5164 3456 90044 64669 -51729 -79981 -68230 -77970
22403 -77970 -41071 -16949 -31942 -38724 -32765 51739 100030 72582 12994 -36539 -8712 25601
22391 25601 -3173 38781 60187 -12449 -46983 -13505 -17572 17485 51753 93865 103493 129449
22379 129449 52630 5080 -31662 -35314 10956 9705 4302 -62322 -48683 23602 78659 39273
22367 39273 -30817 -65351 -26294 5394 3450 21035 7724 8442 -93484 -81649 10804 6672
22355 6672 -26782 -36372 -6706 2440 -38272 -26181 16405 24193 19258 -20636 -41216 -17514 -7888
22342 -7888 -23802 -9106 -38967 1471 66979 58319 33349 46768 71223 66157 59837 20918
22330B0918l5192K6371j3359m7752R017L0271j9373j17509j1385N0293N2210J6388
22318c9102m910k0673J0896L0440l5037k5761M7391r724j6422N47q8803m7544
22306a98702L4891K1755N0561j9493L0879K1465N0281L0460M7321M1039k7683
22295H2774j6379P906O68k7970k4772K5543q256l9366j1977k0191r38O9597K3459
22282F0098m3846l734p641K1992j8181M435n6714j7209j3273M6503n1245k264
22270h1079N4738M376J4103k4764m1174K522K2270O091N8662K0016J6637l1120
22258B1278k2728l3594k0415K1556P06m823K0198j0125J0346O311R031r800L0555
22245A8496P4403M0112p2048o1768l2633R656j2391J4731P2961N174l7795N0784
$$ plain form
22330 20918 -14274 12097 -1262 -49014 -39997 -9726 -29099 -146608 -157993 -107700 -55490 -39102
22318 -39102 -44012 -64685 -53789 -23349 -58386 -84147 -36756 -46480 -62902 -62355 -151158 -198702
22306 -198702 -163811 -142056 -91495 -110988 -80109 -58644 -8363 22097 69418 110457 82774
22295 82774 66395 74301 74969 46999 22227 47770 39514 148 -11829 -32020 -32958 36639 60098
22282 60098 16252 12518 4877 26869 8688 13123 -43591 -60800 -74073 -27570 -78815 -81079
22270 -81079 -26341 -21965 -7862 -32626 -73800 -71278 -49008 -42917 15745 35761 52398 21278
22258 21278 -1450 -35044 -55459 -33903 -33197 -38020 -17822 -27947 -17601 -11290 -2259 -12059 18496
22245 18496 92899 133011 60963 -805 -33438 -23782 -36173 -21442 51519 56693 18898 69682
22233F9682K7240m5407L409P772l4504l8271J9528j0245m2213M4707P5294P401
22221H4393k2808m1633m4094J5660j400J8190L8240o5407m2961P468l9139K3P527
22208h5941O0952o4783l01J03125j9367m6408M1188M3741n1603m6731j432J6541
22196e1019L0368j8074k1074O9073P7874J8218l4136o6564M6785L4088m7939l6561
22184A039j7699K0229L5584L5917o5100J6128O0046j0700m6359n0782m6367M1762
22172b6302O1718k1528m939l8044l0395k019N1984P1234k7342r9458k1847L6326
22160e0612N6128j983k2267j0027N3016N1123m0464n516M7237K4379K2089j1121
22148A11982m4620L4638R3730N6439M0666K1454M4788j5332o7270j06927r2373
$$ plain form
22233 69682 96922 51515 54924 62696 28192 -10079 9449 -796 -43009 1698 76992 84393
22221 84393 61585 19952 -24142 -8482 -9882 8308 46548 -18859 -61820 -54352 -93491 -93468 -85941
22208 -85941 -24989 -89772 -90073 13052 -6315 -52723 -11535 32206 -19397 -66128 -67560 -51019
22196 -51019 -20651 -38725 -59799 9274 87148 105366 71230 4666 51451 85539 37600 1039
22184 1039 -16660 3569 39153 75070 9970 26098 86144 75444 29085 -21697 -68064 -26302
22172 -26302 35416 13888 8949 -29095 -59490 -61509 -9525 61709 34367 -65091 -86938 -50612
22160 -50612 5516 3533 -18734 -28761 24255 75378 34914 29398 76635 101014 123103 111982
22148 111982 67362 102000 195730 252169 292835 314289 359077 343745 276475 169548 77175
22137G7175M337P2593O579j12104k0907K8029j4458k2746j5766j2657P1380Q4207
22125A45662N4542j128r225l3000J9950L3162M4478J5002k4616J8804K4170p002
22113B80799k8365l311L3599P7385J25034J42846J48582J76061K26423J49427
22103A328480Q454l1030m2581M0418p9692j68484j33360j90964k18684j70628
22093C41929m7131k7594o4206k4819j3885J2845p3855q8032J3305k3534L8936
22082D3959k1925l5438j5421N7731m022j4410P5333L6147j9167l0225m443m0657
22070B7462j6443M2546Q6710K6811o5326j30371j8336M3749r556J4409M4880O6678
22058A13213N9028m1963J0584j6304J1357m4699o2820k8483K1656J9244o4648
$$ plain form
22137 77175 81512 154105 160684 48580 27673 55702 41244 18498 2732 -9925 61455 145662
22125 145662 200204 199076 189851 156851 176801 209963 254441 269443 244827 263631 287801 280799
22113 280799 252434 249123 282722 360107 485141 627987 776569 952630 1179053 1328480
22103 1328480 1336934 1305904 1263323 1303741 1224049 1055565 922205 731241 512557 341929
22093 341929 294798 267204 202998 178179 164294 177139 103284 15252 28557 5023 43959
22082 43959 22034 -13404 -28825 28906 24884 10474 85807 121954 102787 72562 68119 27462
22070 27462 11019 53565 140275 167086 101760 -28611 -46947 -3198 -12754 1655 46535 113213
22058 113213 172241 130278 140862 124558 135915 91216 28396 -87 21569 40813 -23835
22047b3835j0129m308N9268j5936l3805m243K7924O4606K3818N5345J3211O038
22035A57954Q303m1724k8610J9409m5803q0900n0886O7164L6380M461k5919m014
22023A5815n572j0241n7290p7231J2224O1517k3465n430K0158J2110j0686k1l0131
22010i8243L2069K4637l815J1823o538J0237K2188J0289L848n154m9631l3917
21998h2207Q2986N2834j1210J306l3082m0954M0942n346K9575J6954k4747j3745
21986A3306K6226l1712n0446P435j1037L528J3048L2931k7068n904M5939q36k9851
21973a4441J2967k3481K0399Q774K9604m270l3016j1950M7373J7162j6183k0349
21961A2589j9298j1747n406L0256l9763l8360q65l498K9618K8304m3678m7008
$$ plain form
22047 -23835 -33964 -38272 20996 5060 -28745 -32988 -5064 59542 83360 138705 151916 157954
22035 157954 166257 124533 95923 115332 69529 -11371 -62257 4907 41287 45748 19829 15815
22023 15815 10243 2 -57288 -134519 -122295 -60778 -84243 -89673 -69515 -57405 -68091 -68112 -98243
22010 -98243 -66174 -41537 -45352 -33529 -40067 -29830 -7642 2647 6495 1341 -48290 -82207
21998 -82207 779 53613 42403 43709 10627 -30327 10615 5269 34844 51798 27051 13306
21986 13306 39532 7820 -42626 -35191 -46228 -42700 -29652 3279 -23789 -29693 16246 15410 -14441
21973 -14441 -1474 -24955 -4556 4218 33822 29552 -3464 -15414 31959 49121 32938 12589
21961 12589 -6709 -18456 -23862 6394 -33369 -71729 -72594 -76092 -46474 -18170 -61848 -108856
21949a08856N4492J8962k2474m982N4032k5721k0693J0721q224O061K6876M6751
21937B6945O8760M497o1313P361r800o217L0807m7468j18122j9226N0769K5440
21925d7567j3369K8317L096L794q620m7855L3742J763J4305J8164M2285q200j9494
21912C61J769q816o6702M1123L7610k8287N957M2158n909M153R187J4621j9177
21899B8048k5653l179K0291M8935o076K1350p7217q7995N2003L992l9556K0068
21887d4989Q174K3629O3212K6107k7267m4885N352j1922J816N439J8822M8613
21875G2101K6451n9080k9849p872J0971j6746j8871L7719P4789K3543n0708K0568
21863H3016k1296j22434m1852K1050N6793l08m385m1608L9742M8595k4018m3414
$$ plain form
21949 -108856 -54364 -35402 -57876 -62858 -8826 -34547 -55240 -44519 -52743 -46682 -19806 26945
21937 26945 95705 100202 38889 46250 36450 30233 61040 13572 -104550 -123776 -73007 -47567
21925 -47567 -60936 -32619 -29523 -25729 -34349 -82204 -48462 -46699 -32394 -14230 28055 19855 361
21912 361 2130 -6686 -73388 -32265 5345 -22942 -16985 25173 19264 23417 32604 47225 28048
21899 28048 2395 -784 19507 68442 62366 83716 6499 -81496 -29493 -25501 -65057 -44989
21887 -44989 -36815 -13186 50026 76133 48866 3981 9333 -2589 -773 4666 23488 72101
21875 72101 98552 39472 9623 1751 12722 -4024 -22895 14824 89613 113156 62448 83016
21863 83016 61720 -60714 -102566 -81516 -24723 -25031 -29416 -71024 -31282 17313 -6705 -50119
21851e0119j7880k7054m1164M5307M1720J4191L0856N4613M1529j404j3408n1121
21839B6066J4822J4438l78j7399j1122K3347l7142L6981Q3221l141l8175j7701
21827G3817j0966M142l5128n2978M160L0107l2156L2119O4831j1452j1341j5725
21815C9430r776K3435j9096N822Q073J7008j918P735j0438m88K305j7944m6013
21802a865K2190K3405K6886N0283r307L802P7958N5806J7779n3014r6304l233
21790A14386O425L2543j8228k8993k4999L853P3728k4102o1641p891M986L4160
21778A04227l9230L042R560J6608j1070Q133j2928k9888J7323L3532L3814p799
21766A25324m0530r129J1292j7055j3920q1929M801J07331q319k0458k2383O847
$$ plain form
21851 -50119 -67999 -95053 -136217 -90910 -49190 -34999 -4143 50470 91999 90595 77187 26066
21839 26066 40888 55326 54948 37549 26427 49774 12632 49613 132834 129693 91518 73817
21827 73817 62851 66993 31865 -21113 -16953 13154 -19002 13117 77948 66496 55155 39430
21815 39430 29654 53089 33993 39815 47888 64896 62978 70713 60275 59787 62092 44148 -1865
21802 -1865 20325 43730 70616 120899 111592 115394 193352 249158 266937 213923 117619 114386
21790 114386 120811 153354 135126 106133 81134 84987 158715 134613 72972 65081 70067 104227
21778 104227 64997 68039 77599 94207 83137 91270 78342 48454 65777 99309 133123 125324
21766 125324 84794 75665 86957 69902 55982 -25947 -21146 86185 77866 57408 35025 41872
21754D1872J6413K9665M6491L2824K1530o6830j3746N8525K9O8735J925K8302
21742B65735J1301O0474J1137J0963J334N3985M7125J7335O832N347K7731K8324
21730E47623M9159L1233m4749n7189o1763p2369o7254r7801j05697j06740l2268
21719a7815J2062M0393L7631k4884n0380J1468M6314j152J8511J7606j355N2688
21707A41087q132J4963N8463k3059l4057J7215k8070J729n5560m8147L3322L5001
21695A04755J6538j8434L3440L9922O729L558O1921O3549Q5926J0420k6848J8758
21683D00234J13035R2613J8463m6759j9243J5821o317L8808P6953k6864q9050
21672E67694q5178p6052j01729k4584J9127l5725r0786o4507q0643J674M3963
$$ plain form
21754 41872 58285 87950 134441 167265 188795 121965 108219 166744 166773 235508 237433 265735
21742 265735 277036 337510 348647 359610 360944 414929 462054 479389 486221 491568 519299 547623
21730 547623 596782 628015 583266 526077 464314 391945 324691 226890 121193 14453 -17815
21719 -17815 -5753 34640 72271 47387 -2993 8475 54789 53637 72148 89754 88399 141087
21707 141087 132955 147918 206381 183322 149265 166480 138410 140139 84579 36432 69754 104755
21695 104755 121293 102859 136299 176221 182950 186508 248429 311978 397904 408324 381476 400234
21683 400234 513269 605882 624345 577586 558343 574164 567847 606655 683608 656744 567694
21672 567694 482516 406464 304735 280151 299278 263553 172767 108260 27617 29291 73254
21661G3254m7887q0339j7439Q3189Q3654L5014J8742m1732J4254L92M2534N7958
21649B21594k070j1760n2780K5615K2703L8275N993q2011m5071J9037J5154R892
21637A64571l3203L8141Q9024J2391n1275k8245K9061K080L0794L2513M8110M516
21625C38478m5889k5791J2190P0596K910K9504n600r824m0075j5075L1514K6437
21613C69375j1637l4537l7782P4815N0305M1457J8278k9399L7029O6003l0054
21602E13853L9134K9614j6514N0863N4297R5247O2505O5715J03778Q0691O3189
21591A142372J25755M0398Q4490R5865J41074J71264J79025K52626L30082K83356
21581B846307K50075K38726J87437K06347K46540K34072K26931K21474K30064
$$ plain form
21661 73254 25367 -54972 -72411 10778 94432 129446 148188 106456 120710 121102 163636 221594
21649 221594 219524 207764 154984 180599 203302 241577 247570 165559 120488 139525 154679 164571
21637 164571 131368 169509 258533 270924 219649 191404 220465 222545 253339 285852 333962 338478
21625 338478 292589 266798 278988 349584 352494 381998 376398 366574 326499 311424 342938 369375
21613 369375 357738 323201 285419 360234 410539 451996 470274 440875 477904 543907 513853
21602 513853 552987 582601 566087 616950 671247 766494 828999 894714 998492 1079183 1142372
21591 1142372 1268127 1308525 1393015 1488880 1629954 1801218 1980243 2232869 2562951 2846307
21581 2846307 3096382 3335108 3522545 3728892 3975432 4209504 4436435 4657909 4887973
21572D887973K37859L65645N17421N48384N62560N19371O05670P05599Q84850
21563I835332R64314R98028J048725J292273J526100J704396J861092J994041
21555B1224301K219496K583693L080518L395889L754934M431564N441105P196688
21547E3328188R902875J4400657K1026370K9578689L6884112L5961201K4330559
21540B25412651Q460099l153724l984737J628250k09931j2979877k9295274m0095993
21532A45781464l9251273k9918014k0169503j3293422q864487o090416m352109
21525B3842240l322169k654023k198584j838619j443793j187134j056861j008780
21517I132277r23570p40162n81077m88823l48721k03469k28975k68969j33243
$$ plain form
21572 4887973 5125832 5491477 6008898 6557282 7119842 7639213 8244883 8950482 9835332
21563 9835332 10799646 11797674 12846399 14138672 15664772 17369168 19230260 21224301
21555 21224301 23443797 26027490 29108008 32503897 36258831 40690395 46131500 53328188
21547 53328188 63231063 77631720 98658090 128236779 165120891 201082092 225412651
21540 225412651 233872750 230719026 226734289 228362539 228152608 215172731 185877457 145781464
21532 145781464 106530191 76612177 56442674 43149252 34284765 28194349 23842240
21525 23842240 20520071 17866048 15667464 13828845 12385052 11197918 10141057 9132277
21517 9132277 8208707 7468545 6887468 6398645 6049924 5846455 5617480 5348511 5215268
21508E215268j38620q9759q7465k07724k25864k18207j21818m9169j08088k40526
21498C728028k32396k09774j69078j50851k56412l64227l25869k52451j32329
21489A634641r7968p3191n8332m2938n8949q3156o6147p5591n2497m2035m0668
21478I43169L2372m1257P589q291j9349q1648o3975M0963j032l8558m3992l2016
21466F93975R621p0683K0751R3296L9287l2351N490p9872N805m7791l7140M665
21454F05053j7810k0244O710R134K3520K9588l267k6878l9659k542l6915k569
21442E24121k868k4507k8124k977R410o0271k3236J2725k127P035Q642j6999k2404
21429C78420n5965m233N7750K0714m9670j4482J3027k6431M9007J05318m2237
$$ plain form
21508 5215268 5076648 4986889 4899424 4691700 4465836 4247629 4125811 4076642 3968554 3728028
21498 3728028 3495632 3285858 3116780 2965929 2709517 2345290 2019421 1766970 1634641
21489 1634641 1536673 1463482 1405150 1362212 1303263 1220107 1153960 1078369 1025872 983837 943169
21478 943169 975541 934284 941873 933582 914233 832585 768610 809573 808541 769983 725991 693975
21466 693975 703596 632913 653664 746960 786247 753896 759386 679514 685319 637528 600388 605053
21454 605053 587243 566999 573709 582843 606363 635951 632684 605806 566147 563605 526690 524121
21442 524121 521253 496746 468622 465645 475055 414784 391548 404273 402146 409181 417823 400824 378420
21429 378420 322455 318222 375972 396686 347016 332534 345561 319130 368137 473455 431218
21418D31218l7546J1218m341K1685j0367j4271N1355R3437Q6887N115j7668m371
21406F12351L8833o056k4009n4600o9774n8310n7662l6403k9471m3694j9204K6306
21394B78307J3112r792k2596m9264o3986P4665Q2058K5967N4972m2301O66o504
21382C35304j8187o1809L47o4649l3586m1894J6044M6409J34806l7325R597J05484
21370C90541j9479o4317m4822j2234o0056l7057j9166k3611j9969L7333M3361
21359A70524P2935L1464n1064l2522k8792q7967k7655L2201N3571n4112J6451
21348I5034N7054N5199M0573M4171L6430l271N5647J3679l4879j8195L0521o3304
21336C08659q170K364J8814N0439R4706J05659J56025J54533K26581K55487K80513
$$ plain form
21418 431218 393672 404890 400549 422234 411867 397596 448951 542388 629275 634390 616722 612351
21406 612351 651184 645128 621119 566519 496745 438435 380773 344370 314899 271205 252001 278307
21394 278307 291419 281627 259031 209767 145781 220446 302504 328471 383443 341142 341808 335304
21382 335304 317117 255308 255655 191006 157420 115526 131570 177979 312785 275460 285057 390541
21370 390541 371062 306745 261923 249689 189633 152576 133410 109799 89830 127163 170524
21359 170524 243459 274923 223859 191337 162545 74578 46923 79124 132695 78583 95034
21348 95034 152088 207287 247860 292031 328461 325190 380837 394516 359637 341442 371963 308659
21336 308659 300489 302853 321667 372106 466812 572471 728496 883029 1109610 1365097 1645610
21325A645610K79638P9340j65561k85290k39291k91971k73982j11124p5203j04280
21315D57886l5167n6910n0864l150q5322p6101K6797J02626l1294m3873m5528
21304A59100M28k0874M643J3878k3541L7830M8270K8592j06494k5867P8696M8581
21292B43242p0046m4850j3518K9298L1087N9066m683O5666l7221K294n4703m0061
21280A65571L1160P5714P4210L2498j2779n601K8481O9353N5333J9000Q0887M6057
21268F59884L4352K418j8758j4725n4778n0256N8496K9933K5422n9297l3717m3442
21256E35532m5596L0628L4672M6128N9204j5812M2873M1248N7585O8550K6577
21245H81589Q7794J30900Q1354Q7311J20421K20882J75242J65786J90378K45131
$$ plain form
21325 1645610 1925248 2004588 1839027 1553737 1314446 1022475 748493 637369 562166 457886
21315 457886 422719 365809 314945 311795 226473 150372 177169 279795 248501 204628 159100
21304 159100 159528 138654 143297 157175 133634 171464 219734 248326 141832 115965 194661 243242
21292 243242 173196 128346 114828 144126 175213 234279 229596 295262 258041 260335 205632 165571
21280 165571 196731 272445 346655 379153 366374 360773 389254 458607 513940 532940 613827 659884
21268 659884 694236 696654 677896 663171 608393 558137 616633 646566 671988 612691 578974 535532
21256 535532 489936 520564 555236 601364 660568 644756 687629 728877 786462 855012 881589
21245 881589 969383 1100283 1181637 1268948 1389369 1610251 1785493 1951279 2141657 2386788
21235B386788K88549L95150L92625M23472L97220L81308N57365O45668O58545
21226F526690N81787O51348P64146R31544J051894J159711J325333J618303K117002
21217A6727758K898406M150126O098937Q160868Q607404N903253L017303M483905
21209F0047960R882340J3243474R450727J666238l604767l649722n07237K578793
21201H9107806K267057l093007j0550874j4235610j0711029m917970l154694n992879
21193C8718800q733336p975921n428901l451519k287428j463596j026668o85589
21185G665842n38565l83000k01879p5092R7257J77741R5966R4551J40548K33648
21175G307017M25098N83995M63624M00428N00758O35027Q35431R53452J088094
$$ plain form
21235 2386788 2675337 3070487 3463112 3886584 4283804 4665112 5222477 5868145 6526690
21226 6526690 7108477 7759825 8523971 9455515 10507409 11667120 12992453 14610756 16727758
21217 16727758 19626164 23776290 29875227 38036095 46643499 52546752 55564055 60047960
21209 60047960 69930300 83173774 92624501 94290739 90685972 87036250 86529013 89107806
21201 89107806 91374863 88281856 77730982 63495372 52784343 47866373 44711679 38718800
21193 38718800 29985464 22009543 16580642 13129123 10841695 9378099 8351431 7665842
21185 7665842 7127277 6744277 6542398 6467306 6564563 6742304 6838270 6932821 7073369 7307017
21175 7307017 7732115 8316110 8779734 9180162 9680920 10315947 11151378 12104830 13192924
21166A3192924J241688J529696K130217K936066M179565N971931Q248244R257972
21158D8688303O562700L021859L853711R522672J4409796J1516309K886408m161713
21150I6300045m898808j279236K841434L179661j965466j0061625j5259553j2530981
21142E6325471o132811l070205n345554q845239r060307o563094m179590k623710
21134A0504961j744353j255125r13669p72271o54009m61513l92764k35722k60892
21125C814643k27920k92639l50061k38030j41919q9718j32710k26141k86129j85891
21115A643485j07729j02530r9587q4182j30635n5156j8565m5317p6748o4025m3172
21104H15839l4938j6891r900J304K4466N7249m0044o9323L4468R4356K3016k7409
$$ plain form
21166 13192924 14434612 15964308 18094525 21030591 25210156 31182087 39430331 48688303
21158 48688303 55251003 58272862 62126573 71649245 86059041 97575350 100461758 96300045
21150 96300045 91401237 90122001 92963435 96143096 94177630 84116005 68856452 56325471
21142 56325471 50192660 47122455 41776901 32931662 23871355 17308261 13128671 10504961
21134 10504961 8760608 7505483 6591814 5819543 5165534 4704021 4311257 4075535 3814643
21125 3814643 3586723 3294084 2944023 2705993 2564074 2474356 2341646 2115505 1829376 1643485
21115 1643485 1535756 1433226 1333639 1249457 1118822 1063666 1045101 999784 923036 859011 815839
21104 815839 780901 764010 754110 755414 779880 837129 797085 727762 762230 856586 879602 852193
21092H52193n7307k5967j9504k4250J3502n0131m8908J6763m8913o3400m0671
21081E03407o4181j3426O8976L0471o1582k7729J7606N2735k2334p389R920o49
21069D85825L7244K0541k9425n4942o1729L7552k7224j264J2687K9795j5111k5318
21057D08631n4664j26269o3864N1749O6905k716K2207r288R32l2962L5470K4922
21045C21053m4384k6957N761O015j0237N1476j6479O219R720j9120j22449n2672
21033A07946J6645O22L1036O0966L5083j1160l2902L8793R8032N9938l9687j2387
21021C52925R567J575j403j4228k8212n549o695m7876j2688N5312L0657P396j7740
21008C23041j0090m6602l0712k232l6495M503Q801p0860R404M5624l119J7358
$$ plain form
21092 852193 794886 768919 749415 725165 738667 688536 639628 656391 607478 544078 503407
21081 503407 439226 425800 494776 525247 463665 435936 453542 506277 483943 476554 486474 485825
21069 485825 523069 543610 514185 459243 397514 435066 407842 406578 419265 449060 433949 408631
21057 408631 353967 227698 163834 215583 282488 279772 301979 292691 293623 260661 296131 321053
21045 321053 276669 249712 255473 261488 251251 302727 286248 292467 302187 283067 160618 107946
21033 107946 124591 125213 156249 217215 252298 241138 208236 247029 345061 404999 365312 352925
21021 352925 362492 364067 362664 348436 320224 314675 307980 260104 247416 302728 333385 340781 323041
21008 323041 312951 266349 235637 233405 196910 201413 210214 139354 148758 194382 191263 208621
20996B08621k567k246J9700n3061J3494M2476N2774M0953p089o323J6959L0984
20984C54675k7130M5168l7941j0929K5297R8605R6772N7085k0510O2245J03148
20973G46485J24139J85633K41796J11671P1743J5291n7522j5712J0756p6066j36858
20962A221356j97398j73207k04733k14878q7635o6383m8044r552M9662J8765j0644
20951B77309m0666k6582j5412l0517k7141p0852j8535N6116M5322q4581J137p830
20939E7768K8003M3321K7595K7910o522j3592j7756j5638k0074j799N7981O9484
20927B36681m7826k5704L5594L1725O0766j3971k1346k1889k5066l4094j9597
20916A55273K4771J1252P865k7784P912k8734K6372O4371J8046k1254K3426K1659
$$ plain form
20996 208621 206054 203808 223508 170447 183941 226417 279191 320144 313055 306732 323691 354675
20984 354675 327545 372713 334772 323843 349140 447745 544517 601602 581092 643337 746485
20973 746485 870624 1056257 1298053 1409724 1481467 1496758 1439236 1423524 1434280 1358214 1221356
20962 1221356 1023958 850751 646018 431140 343505 277122 229078 219526 269188 287953 277309
20951 277309 236643 210061 194649 164132 136991 66139 47604 103720 149042 64461 65598 57768
20939 57768 85771 129092 156687 184597 178075 164483 146727 131089 111015 109216 167197 236681
20927 236681 188855 163151 198745 230470 291236 277265 255919 234030 208964 174870 155273
20916 155273 180044 191296 199161 171377 179289 150555 176927 241298 259344 238090 261516 283175
20904B83175l3198m1250p5965J4578L8519o2616l6314m2489l2867K4452R255n5551
20892a0271j5854k1713M9147J17996O5806o494n0372o9382m331P0398O510o56
20880A30784O3215P9476n307o033J4459J0044p5699o289j4180p4935r735J9228
20868A25028k6358q516O5428j171P0499O1387l5499K9226m5675m390M8385k237
20856B76107m3516K938p0232k9302L5760Q7753J7560L8522L7813P733L8250L6429
20844D35815j5420J0332o9669j08416N8784J68864N3528l630K2623L258l4603
20833E21466R891l2984N7315M5950J859P3460O6221L0139L7242Q462K1530l2620
20821H07931J8306L0199M4899R2266J07115J50003P2399P4793J4694p064O9854
$$ plain form
20904 283175 249977 208727 132762 147340 185859 123243 86929 44440 11573 36025 45280 -10271
20892 -10271 -26125 -47838 1309 119305 185111 178617 128245 58863 54532 124930 131440 130784
20880 130784 193999 273475 268168 262135 276594 286638 210939 204650 190470 115535 105800 125028
20868 125028 98670 90154 155582 154411 224910 286297 250798 280024 234349 229959 278344 276107
20856 276107 232591 235529 165297 135995 171755 259508 277068 315590 353403 361136 399386 435815
20844 435815 420395 430727 361058 252642 311426 480290 533818 530188 552811 556069 521466
20833 521466 531357 498373 555688 601638 603497 676957 743178 773317 810559 819021 840551 807931
20821 807931 826237 856436 901335 993601 1100716 1250719 1323118 1397911 1412605 1405541 1475395
20810A475395J04697J35767J73494J94226K82645K21547K40590K73677L17487
20801C419525M42260O84356P06474N65581M60715L18224K05699J90664J92589
20792G186087L38570N83605Q85737J122315J448957J786599K203446K442693K561655
20783B0559664K242998J709231J268673J139503J433723K011824K877832L765704
20775C7009152M734961N843841P345623R699723J3824354K0601961L0963415M4526670
20767A74549700N7053482N9337352M3467015R949259k9077080n7113144o5076866
20760A93089718n6340397m0989509k7149929j7613547j1508722p791317n475111
20753B6221186l896287k814548k036954j415142r87251o01803m35833n23633p13481
$$ plain form
20810 1475395 1580092 1715859 1889353 2083579 2366224 2587771 2828361 3102038 3419525
20801 3419525 3861785 4546141 5252615 5818196 6278911 6597135 6802834 6993498 7186087
20792 7186087 7524657 8108262 8993999 10116314 11565271 13351870 15555316 17998009 20559664
20783 20559664 22802662 24511893 25780566 26920069 28353792 30365616 33243448 37009152
20775 37009152 41744113 47587954 54933577 64633300 78457654 99059615 130023030 174549700
20767 174549700 231603182 290940534 334407549 344356808 315279728 258166584 193089718
20760 193089718 136749321 95759812 68609883 50996336 39487614 31696297 26221186
20753 26221186 22324899 19510351 17473397 16058255 15071004 14469201 14033368 13509735 12796254
20744A2796254j062934j230360j351645j286617j085094q66487n59859m55416
20736D897842k95793j28310J07444J44042K26058J63720p8716l57428n11431n75335
20726C592093n79436m30772l12887k62121j98054p6431p4167j55946r3909k457
20716A405913j21175j33600j8187k0477J140O633m4255m3280K5585k8213j6996
20705A013088m9297p8747n5266l7047L7997K9528n2048o276n0112k4587o8004
20694F59229m4381N2566L3274n9725m3477M8357J955l0657k7608P364k1576O17
20682E75938K4134L7553O1523K4098L0471q652J5404N1719O3172O0164l7281j8397
20670H79846K3889k19m0978m0656K930l3826n0948j2581m5903j6097o777m3973
$$ plain form
20744 12796254 11733320 10502960 9151315 7864698 6779604 5913117 5353258 4897842
20736 4897842 4602049 4473739 4581183 4725225 4951283 5115003 5036287 4678859 4167428 3592093
20726 3592093 3012657 2581885 2268998 2006877 1808823 1732392 1658225 1502279 1408370 1405913
20716 1405913 1284738 1151138 1132951 1112474 1113614 1120247 1075992 1032712 1058297 1030084 1013088
20705 1013088 963791 885044 829778 792731 830728 860256 808208 801932 751820 727233 659229
20694 659229 614848 667414 700688 640963 597486 645843 647798 617141 589533 596897 575321 575938
20682 575938 600072 637625 699148 723246 753717 745065 760469 812188 875360 935524 898243 879846
20670 879846 903735 903516 862538 821882 824812 790986 740038 727457 681554 665457 658680 614707
20658F14707n9008o2308n0079l935k9121q9356o4039k8043K7632M7229K5242k2619
20646C06302K8454L0558L3198O2318K5027Q38k4619m2374N2229P583q3033o1243
20634C35238j6529P0892L3813N725j6135l4329K5545R0285N5614K3400N1265n3270
20622E71514k0665L4567L9679O4884O1232r9300k8500o861J9279O4700M5125r7177
20610F48477j08535p6202o0406K4099n5235k6019j2518M999l8626n2636j3637
20599B33761Q493k1481N055m7940p5796j2430J5082K1163k9423k6913L5798L4603
20587A39972L4460l0609l4436l6594K1508o987j4264m830K5433Q1492M1310R265
20575B25720M296m7824k6470k9017J9600K4102J0343q2174K7570L0612j9552l0833
$$ plain form
20658 614707 555699 493391 443312 439377 410256 320900 256861 228818 256450 303679 328921 306302
20646 306302 334756 365314 398512 460830 485857 486695 462076 419702 471931 479514 396481 335238
20634 335238 318709 389601 423414 429139 413004 378675 404220 494505 550119 573519 624784 571514
20622 571514 550849 585416 625095 689979 751211 651911 623411 616550 635829 700529 745654 648477
20610 648477 539942 463740 403334 427433 372198 346179 333661 338660 300034 247398 233761
20599 233761 242254 220773 225828 177888 102092 89662 104744 125907 96484 69571 105369 139972
20587 139972 174432 143823 109387 72793 94301 87314 73050 68220 93653 175145 216455 225720
20575 225720 230016 182192 155722 126705 146305 170407 180750 98576 126146 156758 137206 106373
20563A06373Q852k4644K3781K4039m0820l6473m9733M772K1500M0416N4661M7073
20551A79797n3808o6455l052K3491L4600m2975n4896N79m2130K3551P2174K0541
20539I1417l1155M3355M5409n8736m6012j5628K8224m3214k95m8838l6692L1068
20527d1097j8230j7669J7019L1757L5105P5523L5009M0212K1391j1954K4036J839
20515A92941m252J9244k5320n6620o2219j719J9525o419j7565l3674q14J12537
20503A35645J6789o3855l2700L9744n1448p7781J8465M3395Q3950L6614l6605
20492A12213m2129o3546p2555Q9646N4016j5047k6292p1095l5613O6646P5438
20481G1682J2376l4113Q2297K6284k6157j0059m2968k3046K0830K400L0021r872
$$ plain form
20563 106373 115225 90581 114362 138401 97581 61108 11375 16147 37647 78063 132724 179797
20551 179797 125989 59534 56482 79973 114573 71598 16702 17281 -24849 -1298 70876 91417
20539 91417 60262 103617 149026 90290 44278 28650 56874 13660 13365 -35473 -72165 -41097
20527 -41097 -59327 -76996 -59977 -28220 6885 82408 117417 157629 179020 167066 191102 192941
20515 192941 188689 207933 182613 125993 63774 62055 81580 75161 57596 23922 23108 135645
20503 135645 152434 88579 55879 95623 44175 -33606 -15141 28254 112204 148818 112213
20492 112213 70084 6538 -66017 23629 77645 62598 36306 -34789 -70402 -3756 71682
20481 71682 84058 49945 132242 158526 132369 122310 79342 56296 77126 79526 109547 99675
20469I9675l103o393M2385N3678k3629j06833K3593O5362L9040j1860k2900p1711
20457G7304m7471J0837m1424O121K8946k0457J3514K1255l9121J122l7475J4639
20445a2210L0210M0045R287L2952r111j8588r03J0761K5678j0857J4961l3376
20433G8849l9248j7895J3457K5433n5270j8975L0289l0332k6647O692K8489L7849
20421C2691K6185J5895l8572j6635L6922M401J0853J7254K9113J5972L42p2536
20409F1885j1528L1359n111n5634k4692j9402N8085R5719K2888j7763l2116k7648
20397G6042j2527O510p5697l1636r315K3719M9549J8281j970l4805m6148k6243
20385f4240L8468j2034K6834L004o222R8330J7702l7375m4278l6479L2115O2774
$$ plain form
20469 99675 96572 90179 132564 186242 162613 55780 79373 144735 183775 171915 149015 77304
20457 77304 29833 40670 -754 5367 34313 13856 27370 48625 9504 10626 -26849 -12210
20445 -12210 18000 58045 67332 100284 91173 72585 71682 82443 108121 97264 112225 78849
20433 78849 39601 21706 35163 60596 5326 -13649 16640 -13692 -40339 -33647 -5158 32691
20421 32691 58876 74771 36199 19564 56486 60887 71740 88994 118107 134079 134421 61885
20409 61885 50357 81716 76605 20971 -3721 -23123 34962 130681 153569 135806 103690 76042
20397 76042 63515 70025 -5672 -37308 -46623 -22904 26645 44926 42956 8151 -37997 -64240
20385 -64240 -25772 -37806 -10972 -7968 -14190 84140 101842 64467 20189 -16290 15825 78599
20373G8599M983l0366j2439J7051l9771l8003j1514L3006r995o5457K0055L298
20361e0553m5058K2403M7232M3313K1165j9355L277p873j3333L3986O9459K3827
20349A28490l2488k4346L5804j1244q2026n7506L5155N8633l4630L304L7227L654
20337F0027k564n6556o1179l541J7765M6545L7541L3808k9450k1217l9558j7354
20325c5733l5151k0219L1044k1927j6573P3049J1519j5158M131m850j5104N6596
20313A1624j0973k8055m0126M0132j4204J0792R614O9707p328j2985m5652L5682
20301A8228K4782P450j7714k2234l3404O1165J7835l2887n8258N460M3952P6469
20289I0844l5550n960L694M3094j3964m0803L4759M4383m1887K724m3302m3469
$$ plain form
20373 78599 83582 53216 40777 57828 18057 -19946 -31460 1546 -8449 -73906 -53851 -50553
20361 -50553 -95611 -73208 -25976 17337 38502 19147 22424 14551 1218 35204 104663 128490
20349 128490 96002 71656 107460 96216 14190 -43316 -8161 50472 15842 19146 56373 60027
20337 60027 57463 907 -60272 -63813 -46048 497 38038 71846 42396 21179 -18379 -35733
20325 -35733 -70884 -91103 -60059 -81986 -98559 -25510 -13991 -29149 -25018 -29868 -44972 11624
20313 11624 651 -27404 -67530 -27398 -41602 -30810 -21196 48511 41183 28198 -17454 18228
20301 18228 43010 50460 32746 10512 -22892 38273 56108 23221 -35037 -29577 14375 90844
20289 90844 55294 49334 53028 96122 82158 41355 76114 120497 78610 81334 38032 -5437
20277e437J2158L030L8826Q269q832n5937j2280K4147O7362k7055q0842j3408
20265d9999k795J1963M7071N715m4139R6709l7098m6882j7242L6022P0744k6593
20253D3476l7065p137j6993o051l921N1235Q6977l3061j2407k6965L2657l5899
20241C4846p5154J3095l9316k5629J7M7111P985M1743K0523K9206N0780l0887
20229G4320K307j815J5005K7186j3876j5394K6451L0607M798r0661K3265M4835
20217A27028K3498l3231J765K8747K7986M7950J1939K0044N6168M399p3717J6273
20205B58849R1764J27667J59930J82235K87599L80402K78781J83421j5673k26240
20195A708735l32089l19741k27304j69066q2631n1992J493P376m7276q2581q9182
$$ plain form
20277 -5437 6721 9751 48577 56846 48014 -7923 -20203 3944 71306 44251 -36591 -49999
20265 -49999 -52794 -40831 6240 11955 -32184 64525 27427 -19455 -36697 -675 70069 43476
20253 43476 6411 -726 -17719 -23770 -27691 23544 110521 77460 65053 38088 70745 34846
20241 34846 -40308 -27213 -66529 -92158 -92141 -45030 -37045 4698 25221 54427 105207 74320
20229 74320 76627 74812 89817 117003 103127 87733 114184 144791 149589 58928 82193 127028
20217 127028 150526 117295 119060 147807 175793 223743 235682 255726 311894 316293 242576 258849
20205 258849 350613 478280 638210 820445 1108044 1488446 1767227 1950648 1934975 1708735
20195 1708735 1376646 1056905 829601 660535 577904 525912 527405 534781 487505 404924 315742
20184C15742j18609o0929N3965j1103m1512J5963J5652L1421j5887m3179m9108
20173I2416k3740R505K0076Q1012m0026o5983l3293K521m093K754L9732N9255
20161A40136K1752J581p0523q3328k601L6712J3555j5581L6017J4865j0854K8409
20149A10140J8139J3073p4816o3327o028K2896K405K5379j9064R510O5750M9758
20137A53815q953l802q7177N9456N4530k8995k1747J3218P593Q2331O9607J5855
20125C05731j11318r0285l1126J66L7265J1743l9048p525K3979n2175K4199j3071
20113E8535k3375o456N2900Q677K4690n183j23883m0157L708Q946k546O7474M3149
20100F6479r289K3287Q6152L4581J762L89j0528O4423O8483N1800L9670q9059
$$ plain form
20184 315742 197133 136204 190169 179066 137554 153517 169169 200590 184703 141524 92416
20173 92416 68676 78181 98257 179269 139243 73260 39967 42488 38395 41149 80881 140136
20161 140136 161888 163469 92946 9618 7017 43729 57284 41703 77720 92585 81731 110140
20149 110140 128279 141352 66536 3209 -2819 20077 22482 47861 28797 38307 104057 153815
20137 153815 144862 141060 53883 113339 167869 138874 117127 130345 137938 220269 289876 305731
20125 305731 194413 104128 73002 73168 110433 122176 83128 75603 99582 47407 71606 58535
20113 58535 35160 28704 81604 90281 114971 109788 -14095 -54252 -50544 -41598 -44144 23330 66479
20100 66479 57190 80477 166629 201210 202972 203361 192833 257256 325739 377539 417209 328150
20088C28150o9831r4635m1995k0987o2039k4138n2518J7623j0179j9854j3083
20077f3486j40j0389q500N443p588O307P2498N0691K1138q0850r938R3289N5738
20064A24213j6229k8515j4447k4779j0222k344N4358j7723r1229m5336K3434L1248
20052a7571N648L1872j1063k3217o2061O6687O1884j1338l6085P999M1442j1299
20040D2898m6831j0992N0766L056L557j03573q1846M7993N1279J6887l9446m4736
20028a10988j5902K0311O2694m930k8439L5602j2262q974l2452J3512M602L0038
20016d7188J8260n2014p1770K5017J1382k638M8463L7836J8992K7765m6869K842
20004b9922n685j1218K2636J3084J876L3812M8955K3974M900k6364m5823k884
$$ plain form
20088 328150 258319 163684 121689 100702 38663 14525 -37993 -20370 -30549 -50403 -63486
20077 -63486 -63626 -74015 -82515 -77072 -84660 -78353 -5855 44836 65974 -14876 -24814 68475 124213
20064 124213 107984 79469 65022 40243 30021 27677 82035 64312 -26917 -72253 -48819 -17571
20052 -17571 -11923 19949 8886 -14331 -76392 -9705 52179 40841 4756 12755 54197 42898
20040 42898 -3933 -14925 35841 38897 42454 -61119 -142965 -94972 -43693 -26806 -66252 -110988
20028 -110988 -126890 -106579 -43885 -48815 -77254 -41652 -53914 -62888 -95340 -81828 -77226 -47188
20016 -47188 -28928 -80942 -152712 -127695 -116313 -118951 -70488 -32652 -13660 14105 -32764 -29922
20004 -29922 -35607 -46825 -24189 -11105 -9229 24583 73538 97512 102412 76048 30225 27341
19992B7341K7654J6110N3409L8930m1869j8443q302L305L0262l6343j19326O0519
19980C3247M5369q7186p5634M1229P4182J5473J1352k9401k7924L9984M9159N3747
19968A43597n9722J4907L763n7953j8100L1280l9825k4255J1482J1152M472J9727
19956D0525M6356q338q672k3930K3472p139N8719M6888N1466O1992P2193K9069
19944C82601L9138P1623J0395M1104n3856l0927N1375M9003j749j06620j33825
19933C18262o8022o3639n6178L3600k433K6962R204j580M878j0362l9063l0676
19921A20953R434q919p063l0733j3294J2752m8773L3952P6255j12767j0780O4333
19909H5350J1173J4044K1917M3855K0349k1612M5439J0692o1950J7992J5788l1370
$$ plain form
19992 27341 54995 71105 124514 163444 121575 103132 94830 98135 128397 92054 -27272 33247
19980 33247 78616 -8570 -84204 -42975 31207 46680 58032 28631 707 40691 89850 143597
19968 143597 83875 98782 102545 44592 26492 57772 17947 -6308 5174 16326 20798 40525
19956 40525 86881 78543 69871 45941 69413 62274 120993 167881 219347 281339 353532 382601
19944 382601 421739 493362 503757 544861 491005 460078 511453 560456 558707 452087 318262
19933 318262 250240 186601 130423 164023 161590 188552 197756 196176 201054 190692 151629 120953
19921 120953 130387 121468 114405 83672 70378 83130 34357 68309 144564 31797 21017 85350
19909 85350 96523 110567 132484 176339 196688 175076 220515 231207 169257 187249 203037 171667
19897A71667M0759J13973J02280Q5004L9974j9785L4914O3887P4983P299l1755
19886F83200n9710n7841K2256J3566j11052j3248l4632j6900p4738j43250r5274
19875A12377n0752l920l8472Q2807Q4274j1458n9350j8971J1548Q2n9274l813
19863D5078P252l1736p266K0852M222k2469j9911L2902N2028m3015m5208J5281
19851H010J8189L45K324n01N773k3770j0346K9385L4545j1360K8370j7571k7861
19838C5532L1323j1656k1132p1710n9928L1836K3016M510o4572K8329O1960N7552
19826D5060O525N875j8698k7532l536l7055N2092J5749m2722n193L7998J6171
19814D4734O759n9266k2351n913R5071L9561o8219p6577l0218J1084K3065M8612
$$ plain form
19897 171667 212426 326399 428679 513683 553657 533872 568786 632673 707656 714955 683200
19886 683200 623490 565649 587905 601471 490419 477171 442539 425639 350901 207651 112377
19875 112377 61625 57705 19233 102040 186314 174856 115506 96535 108083 108165 48891 45078
19863 45078 52330 20594 13328 34180 38402 15933 -3978 28924 80952 37937 -7271 8010
19851 8010 26199 26544 28868 28367 34140 10370 24 29409 63954 52594 80964 63393 35532
19838 35532 66855 55199 34067 -37643 -97571 -65735 -42719 -38209 -102781 -74452 -12492 45060
19826 45060 51585 57460 38762 11230 7694 -29361 22731 38480 -4242 -9435 28563 44734
19814 44734 51493 -7773 -30124 -36037 59034 98595 30376 -46201 -76419 -65335 -42270 6342
19802F342N0893k6149m7623j0813L4455j2909Q89J2429R13O200K2591P2812M9626
19789A59656m9241n4541r683N1376r825m1833j9825n3231l3352K8124K9959l5259
19777c7675L6121P0497j9746r028m9130k08K0165J6596O9842j6885j5358K704
19765F7895P056O1994j6797j4540k2723l0831R318M1137j8635n9295l4298R031
19753f88k5949k4721k9664L3372Q329j2925O0585K6069j0118m5449j6032O725
19741c0466N8744K5194m5186L7329J0815l6059J0072O9865P5167l9554l0502M9517
19729A54936j2161q4171n7020j7786N3897K7973n835l0296k7711j2410R0308N9597
19717A39321K1782j8678J3916j3811j9171o4747k1599M5233J8133J5127M0445
$$ plain form
19802 6342 57235 31086 -16537 -27350 7105 -5804 -4915 7514 8427 14627 37218 110030 159656
19789 159656 110415 55874 46191 97567 87742 45909 26084 -27147 -60499 -32375 -2416 -37675
19777 -37675 -1554 68943 49197 40169 -8961 -9169 10996 27592 97434 80549 65191 67895
19765 67895 74951 136945 120148 105608 82885 52054 61372 102509 83874 24579 -9719 -688
19753 -688 -26637 -51358 -81022 -47650 -39321 -52246 8339 34408 24290 -21159 -37191 -30466
19741 -30466 28278 53472 8286 45615 56430 20371 30443 100308 175475 135921 105419 154936
19729 154936 142775 58604 1584 -16202 37695 65668 59833 29537 1826 -10584 79724 139321
19717 139321 161103 142425 156341 142530 123359 58612 37013 82246 100379 115506 155951
19706A55951J9813L0279O5429K8561j8173l8862L553J2347n7899K4280J09447
19695C34726N0407p7292q986k9938J8003k8576k7131l1354l4171Q759N5915p5628
19683A54734O621L1131o2515J3199N6642o564J7013J4929m9808k8261K0224O7279
19671B34624l9223l8450J7670p723k8341K476K3320o075N9817J52185J43175N4239
19659E67694n0589j13642o8687L8157O7164L3732J6767N9586L6578K5746r2875
19648E19631j01692q0759m5578K1376J7691J2941N0082O4879o0346p3455m647
19637C20123j0494k6207n484m9247k2018m2623L9991L9274N5063k658q1378K2823
19625B37165P584n1017l0511l6275L0411n651m127k0469O49K4182k0309j7611
$$ plain form
19706 155951 175764 206043 271472 300033 281860 242998 246551 258898 200999 225279 334726
19695 334726 385133 307841 298855 268917 286920 258344 231213 199859 165688 174447 230362 154734
19683 154734 161355 192486 129971 143170 199812 193248 210261 225190 175382 147121 167345 234624
19671 234624 195401 156951 174621 166898 138557 141033 164353 158278 218095 370280 513455 567694
19659 567694 517105 403463 334776 372933 440097 473829 490596 550182 586760 612506 519631
19648 519631 417939 337180 291602 312978 330669 343610 393692 458571 398225 324770 320123
19637 320123 309629 283422 277938 228691 206673 164050 204041 243315 298378 295720 214342 237165
19625 237165 244749 193732 163221 126946 157357 151706 147579 127110 127759 151941 131632 114021
19613A14021L5604K977l1308M4098L7179R2396P5903M4770l8742o6530l3829O074
19601B82613M2831R280P6398N1643L5184n2634j18491p0175o9939k3434L0564
19590A93840J6530j9917j3354K715n3665m6485j3106k5096l6365q5780K3379N8850
19578A546n766j4609M9574O7218n167k4436J8363N4952j7233K7385R430q4522
19566G6735l3373M9056M8158K1277n418J1667J8816p2849l6133R663Q0465l2926
19554A35138R581M5189n326Q754m108j9417p9425m5726o605J7936Q2590K2937
19542A61518K7917n2254p5906P44M0329j1998j0425N8801R14j4517K5971l9433
19530A11661J5185M9547K3989l8462k5437R168L9475M3485J4528m0021n0047J5488
$$ plain form
19613 114021 149625 152602 121294 165392 202571 294967 370870 415640 376898 310368 276539 282613
19601 282613 325444 334724 411122 462765 497949 445315 326824 256649 186710 163276 193840
19590 193840 210370 190453 177099 179814 126149 79664 66558 41462 5097 -80683 -57304 1546
19578 1546 -4220 -18829 30745 97963 92796 68360 86723 141675 124442 151827 161257 76735
19566 76735 43362 92418 140576 161853 156435 168102 186918 114069 77936 87599 168064 135138
19554 135138 144719 189908 184582 193336 189228 169811 90386 44660 38055 55991 138581 161518
19542 161518 189435 137181 61275 62019 102348 90350 79925 138726 139640 125123 151094 111661
19530 111661 126846 176393 200382 161920 136483 145651 185126 228611 243139 203118 153071 168559
19518A68559J2866O0404m0113n4059l4662n735L6526J5499J0828l8163J3207L8702
19506A83859O254j2156k0501J0791N9602N823k9721k7612m7853k558O779K9386
19494A62093k4788j3362J6274M7174O9622J5877N4836J04761K5877K1967L9050
19483E19381M7395J4852J3697L3676o65M3804M2178j7451K037L8154J40073N6428
19471I33559K4570L6270O6910J64293J47362J80349K30948K34933J76895K09341
19461B405430L02963L15276L28660M16392M62179M75625N98733O13061N03456
19452F421775N85079P12660P32870Q70733R79210J040758J186440J534562K017090
19443A6081177K595354L628912N431665P897783J0348610J0434191P790267L925983
$$ plain form
19518 168559 181425 241829 201716 147657 112995 107260 143786 159285 170113 131950 145157 183859
19506 183859 190113 177957 157456 168247 227849 233672 203951 176339 128486 125928 132707 162093
19494 162093 137305 123943 140217 187391 257013 272890 327726 432487 458364 480331 519381
19483 519381 566776 581628 595325 629001 628336 672140 714318 696867 698904 737058 877131 933559
19471 933559 958129 994399 1061309 1225602 1372964 1553313 1784261 2019194 2196089 2405430
19461 2405430 2708393 3023669 3352329 3768721 4230900 4706525 5305258 5918319 6421775
19452 6421775 7006854 7719514 8452384 9323117 10302327 11343085 12529525 14064087 16081177
19443 16081177 18676531 22305443 27737108 35634891 45983501 56417692 64207959 68133942
19435F8133942J784414K138565L312955L282985J985653J005734l75323j900055
19427G9368870l819567m392988l179661j990335l444046p369200j0692789j1374871
19419C3105413r112634o020441l732987k312722j462085r93955n89416l99881
19411H481292k31914k8190K79577L02721K42634J27598J97341L53848M60860N38272
19401A0724039M47672L55202M68473O51049Q15490R65452J145123J440174J839202
19392A8851876K409670L314277M816218P146251J0182046J2602375J2067319Q700302
19384H0090334M283743K247037K839115L851981L202222J531910N55699p49740
19376I7852301k188203m295059m874521l702183l242974n762950j0505879j3703562
$$ plain form
19435 68133942 69918356 72056921 75369876 78652861 80638514 81644248 81268925 79368870
19427 79368870 75549303 71156315 67976654 65986319 62542273 55173073 44480284 33105413
19419 33105413 23992779 17972338 14239351 11926629 10464544 9470589 8881173 8481292
19411 8481292 8249378 8221188 8500765 8803486 9046120 9173718 9371059 9724907 10185767 10724039
19401 10724039 11171711 11526913 11995386 12646435 13461925 14427377 15572500 17012674 18851876
19392 18851876 21261546 24575823 29392041 36538292 46720338 59322713 71390032 80090334
19384 80090334 84374077 86621114 89460229 93312210 96514432 98046342 98602041 97852301
19376 97852301 95664098 91369039 86494518 82792335 79549361 73786411 63280532 49576970
19368D9576970j3454502j0129608o637480m255884k818913j942360j357955j042506
19360G937762q13578o93757o00031n26165m45609l79863l65153l83072l18776
19351C411758k33025k57940k73370k81890j62284j04876j21119k26010j79346
19342A571898j15229j08545r5115j37233j04309l9687P310P815K0060j0594m8527
19331I47844q0864k7539R566o6933l9736M7863L6785k9013j07090m6656l893J6889
19319F57223M6027j4915m862R032o0817l7244Q751J246K527j6155k3502O541P288
19306E81140m691M7154o0409o9227k2671j6807p912j5873J3624k3628o4516n5177
19294C01007P4872Q3667j2829o4029L1778P150j4093j7500J431j2017k9156n0040
$$ plain form
19368 49576970 36122468 25992860 19355380 15099496 12280583 10338223 8980268 7937762
19360 7937762 7124184 6430427 5830396 5304231 4858622 4478759 4113606 3730534 3411758
19351 3411758 3178733 2920793 2647423 2365533 2203249 2098373 1977254 1751244 1571898
19342 1571898 1456669 1348124 1253009 1115776 1011467 971780 979090 986905 1006965 996371 947844
19331 947844 866980 839441 849007 782074 742338 790201 826986 797973 690883 644227 640334 657223
19319 657223 703250 688335 683473 692505 631688 594444 603195 604441 606968 590813 567311 573852 581140
19306 581140 576449 623603 563194 493967 471296 454489 446577 430704 444328 420700 356184 301007
19294 301007 375879 459546 446717 382688 414466 421616 407523 390023 391454 379437 350281 300241
19282C00241O3136O1379r273l3335K9576j2304M9509N2475m3805n7292J8328L051
19270D21686M1919j106k5589M9280J876k9072K9361L733l0203L2348J747N746
19258E01726k7481K5825O5594L0906o1140J2920K9738k0593j401M2157n7234j7805
19246E23212J4213q694N3635L5979N0936K9222o311M5614O881k3338K6631K6298
19234G74278Q5039J0996L3624O6614R7283J33928J54304J47915R676J00736J73581
19223A787974K20305K43138J82605J45151K07579L03882L08725K51616K60422
19214C911397L51176L24381M43102N84415O54696P01012P79352R28785J079164
19205I757480J632102K399877L775550O101104R240302J2465791J1270988p91072
$$ plain form
19282 300241 363377 424756 415483 382148 411724 399420 448929 501404 457599 400307 418635 421686
19270 421686 463605 462499 436910 486190 488066 458994 488355 492088 461885 494233 495980 501726
19258 501726 474245 500070 565664 596570 535430 548350 578088 557495 556094 598251 541017 523212
19246 523212 537425 528731 582366 618345 669281 698503 692192 737806 744687 721349 747980 774278
19234 774278 859317 870313 903937 970551 1067834 1201762 1356066 1503981 1513657 1614393 1787974
19223 1787974 2008279 2251417 2434022 2579173 2786752 3090634 3399359 3650975 3911397
19214 3911397 4262573 4586954 5030056 5614471 6269167 6970179 7749531 8678316 9757480
19205 9757480 11389582 13789459 17565009 23666113 32906415 45372206 56643194 55852122
19197E5852122j1488042j0811604n906420j211682L043695P016667J0527534Q576833
19189E5599103m133632j3836173j2340601p708152m342220k541242j641966j094378
19181G960739q18989m88507k62790j01666M3811J67905K05529K32634K81467K60293
19171G480426L40180L60825M79912O39019Q29592J003603J160509J313121J401874
19162A5009061J627789K163200L183032M950778P885458J2020492J6824465J7637572
19154H1301847M336187j3177689j5534537q835395j595382N162306J2275693J9695814
19146H3628844K2655971R871658j4330324k6177126k1484980j2773669n838884
19139C5551490o02912L854570P833498Q352290j312528j2354913j2695172q357008
$$ plain form
19197 55852122 44364080 33552476 27646056 26434374 29478069 36494736 47022270 55599103
19189 55599103 51465471 37629298 25288697 17580545 13238325 10697083 9055117 7960739
19181 7960739 7141750 6653243 6390453 6288787 6332598 6500503 6706032 6938666 7220133 7480426
19171 7480426 7820606 8181431 8661343 9300362 10129954 11133557 12294066 13607187 15009061
19162 15009061 16636850 18800050 21983082 26933860 34819318 46839810 63664275 81301847
19154 81301847 85638034 72460345 56925808 48090413 46495031 51657337 63933030 83628844
19146 83628844 106284815 116156473 101826149 75649023 54164043 41390374 35551490
19139 35551490 34948578 38803148 46636646 54988936 53676408 41321495 28626323 20269315
19131B0269315m987096k898536j787037j197296q69140o97290m32112j69451r7385
19122G133972p7986n550N1076N4506N1978R3322J44352K70071K82948M92998P35753
19111I227440Q91973J013004J149492J340026J713527K592132M246124O937423
19103B9111141J0703998J5268680J6972416N751381j2354067j6676428j0928187
19096C7848934m459860J121617O152619J0856817J2592920K870533j3264920j7121663
19088C6596997j2262505p373697m458911k793387j896523j441807j045387p84353
19080D540427o21339m33673l33642k84083k47056j11016q2828j09779j63551j75243
19070A978217n5083l5746n3056j02143r9934l3411o2937j89856j77110q6228j13154
$$ plain form
19131 20269315 15282219 12383683 10596646 9399350 8530210 7832920 7400808 7231357 7133972
19122 7133972 7055986 7050436 7101512 7156018 7207996 7301318 7445670 7715741 7998689 8491687 9227440
19111 9227440 10119413 11132417 12281909 13621935 15335462 17927594 22173718 29111141
19103 29111141 39815139 55083819 72056235 77807616 65453549 48777121 37848934
19096 37848934 33389074 34510691 40663310 51520127 64113047 66983580 53718660 36596997
19088 36596997 24334492 16960795 12501884 9708497 7811974 6370167 5324780 4540427
19080 4540427 3919088 3485415 3151773 2867690 2620634 2509618 2426790 2317011 2153460 1978217
19070 1978217 1923134 1887388 1834332 1732189 1632255 1598844 1535907 1346051 1168941 1082713 969559
19059I69559n7809k5191o3289n8272l5508J1704m7042j9233Q689p2237j8758n417
19047E87196l295M4347O0048m2220j366J2074q3541j21918n1562P1933L0467J452
19035E03615K0348K085M0635Q973L020r854k5566n356J849O5827K9504m9440m9998
19022E35642K1585J7483J482r513r104o9215l7037n469K9790q31q0457l3580k1269
19009C39507j1637O0364Q2149Q494l6891m4063k3424J8094M5981N7573M7954l2302
18997E11799j10598m6589l772J1951j1364L015m2208J2367R0397J473j7758o2402
18985C36311j1530J03579J2932K1424P4680P5858K6479j5925K6458L9412L186
18974F92864o804O283j3399p68k0725l9044N9464J4928k2316l6158N357N8924
$$ plain form
19059 969559 911750 886559 823270 764998 729490 741194 694152 674919 683608 611371 592613 587196
19047 587196 583901 628248 688296 646076 644710 656784 573243 451325 399763 471696 502163 503615
19035 503615 523963 526048 566683 575656 578676 568822 543256 537900 539749 605576 635080 585640 535642
19022 535642 557227 574710 576192 566679 557575 488360 451323 445854 475644 474813 394356 360776 339507
19009 339507 327870 388234 470383 478877 441986 397923 374499 392593 438574 496147 544101 511799
18997 511799 401201 354612 350840 362791 351427 354442 312234 324601 414998 416471 398713 336311
18985 336311 324781 428360 441292 462716 537396 613254 639733 623808 650266 689678 692864
18974 692864 686060 692343 678944 678176 657451 618407 677871 692799 670483 634325 639682 698606
18962F98606M5708j2758k1816n6583m0158J3549R6930J7703j5513O3521J22113
18951I11302N1148l5162P7174Q2657N5809J72443J45253J80395K12595K55563
18941B109177L06212K71974K91630L06348M14710L87424L33478M16907L87327
18932E225187M84593N04614N21435O08140P41953Q64905J047681J163382J363042
18923A2524932J667997K324203L436725N292457Q231012J2171266J5511556J3051523
18915G4211671L538279o844892j1428952p173637Q94933Q193617J0474850L753505
18907G5619374p246233j5740267j6177088j1324614o942119m292857k685413j726919
18899I483864j042729n83123l74952j26013M4889J86295K73355L95106N14036
$$ plain form
18962 698606 744314 731556 709740 653157 612999 626548 723478 741181 725668 789189 911302
18951 911302 962450 927288 1004462 1087119 1142928 1315371 1460624 1641019 1853614 2109177
18941 2109177 2415389 2687363 2978993 3285341 3700051 4087475 4420953 4837860 5225187
18932 5225187 5709780 6214394 6735829 7343969 8085922 8950827 9998508 11161890 12524932
18923 12524932 14192929 16517132 19953857 25246314 33477326 45648592 61160148 74211671
18915 74211671 77749950 70905058 59476106 52302469 53197402 61391019 71865869 75619374
18907 75619374 68373141 52632874 36455786 25131172 18189053 13896196 11210783 9483864
18899 9483864 8441135 7858012 7483060 7357047 7401936 7588231 7861586 8256692 8770728
18890H770728N16516K67875J64616K65245N39343O79198P19005O83998O17043
18881A3223567P46715R89032J320216J795594K672809M028717O102061Q992993
18873C9871704J2022488J1795739N913404j570566n465800k123873O087570J4921824
18865H1452490J9772238J2964332k645539j6977706k0616984j2982137l053325
18858E7913369M370310N447856j009515r590151j4501941j2739832q431959n133333
18850A6324804l159728k021201j446638j062527p28424m94036l49808l00052k07655
18841F554735j32438l2277K1829j5335j0067M9871j0109K4168J69715L52628L82366
18830G355086M24650N03587P03442R41339J284572J989616L174405M980797P430040
$$ plain form
18890 8770728 9287244 9555119 9719735 9984980 10524323 11203521 11922526 12606524 13223567
18881 13223567 13970282 14959314 16279530 18075124 20747933 24776650 30878711 39871704
18873 39871704 51894192 63689931 69603335 68032769 62566969 60443096 66530666 81452490
18865 81452490 101224728 114189060 111543521 94565815 73948831 60966694 57913369
18858 57913369 62283679 67731535 66722020 57131869 42629928 29890096 21458137 16324804
18850 16324804 13165076 11143875 9697237 8634710 7906286 7412250 7062442 6762390 6554735
18841 6554735 6422297 6390020 6411849 6396514 6386447 6436318 6426209 6450377 6620092 6972720 7355086
18830 7355086 7779736 8283323 8986765 9928104 11212676 13202292 16376697 21357494 28787534
18821B8787534R646068Q224262K267801m383987p375956m682337L29884M738428
18813C7551697N866260J616972m990598r794510r601817o592159m058947k479862
18805G517036j565776j007869p29080n70744l31135j96852k23870k12065k33629
18796B446016j88269j27349j16042j980j05114j72735j04384p0140m1098n1953
18786A466952j76600j03721n6724j17645j07864q4502l4206k7997k850k397m5765
18775G06681j9362m0195o4882P466N6757L199Q2259J40169J83354K6673j24447
18764I57672j58263j51301m5966l6767j02379j1155L1976M0866q83m4239J6700
18753D96261N7193R687L3928M1594m4636q0755l6725M4410N9953O9391k0948n497
$$ plain form
18821 28787534 38433602 46657864 48925665 44541678 37165722 32483385 32813269 37551697
18813 37551697 43417957 45034929 40044331 30249821 20648004 14055845 9996898 7517036
18805 7517036 5951260 4943391 4214311 3643567 3312432 3115580 2891710 2679645 2446016
18796 2446016 2257747 2130398 2014356 2012376 1907262 1734527 1630143 1560003 1518905 1466952
18786 1466952 1290352 1186631 1129907 1012262 904398 819896 785690 757693 754843 752446 706681
18775 706681 687319 647124 582242 589708 646465 649664 731923 872092 1055446 1082119 957672
18764 957672 799409 648108 602142 565375 462996 451841 483817 524683 523800 479561 496261
18753 496261 553454 563141 597069 638663 594027 513272 476547 520957 580910 650301 629353 623856
18741F23856L6021k965m8381j1355L3498p537n2186j2206l9603m3179j1013l194
18729D61756r1204n6923l364J3873p09M6419l7404k8830j8660q6191j3437R278
18717A94604J8504j7633O4944M8433j842M7840L2157j2316N3279K3319R969l0202
18705D31056K3738K0981Q7255M2350p409j9585r0355k4327N2893N3844l81k9965
18693E40095j04574p7309l9824j2667j4424O3422L5879o948K5595N1860L4869
18682D95974P2696n0993j05906J8231j6972l59Q440R5104M2621K9414k0368q3113
18670D84769q0835k5840m6291r7957j7954n6137K5719O3973q377L0884M6274K409
18658C20637K0640l7602p1081m6721K7715Q0444o709j7747Q1159K7232j9433k2771
$$ plain form
18741 623856 659877 656912 608531 597176 630674 623137 570951 558745 519142 475963 464950 461756
18729 461756 370552 313629 310265 324138 323429 369848 332444 303614 284954 198763 185326 194604
18717 194604 213108 195475 260419 308852 307010 354850 387007 374691 427970 451289 461258 431056
18705 431056 454794 475775 563030 605380 597971 578386 488031 463704 516597 570441 570060 540095
18693 540095 435521 358212 318388 305721 291297 354719 390598 383650 409245 461105 495974
18682 495974 568670 517677 411771 430002 413030 412671 421111 516215 558836 588250 567882 484769
18670 484769 403934 378094 331803 233846 215892 159755 185474 249447 241070 271954 318228 320637
18658 320637 341277 303675 232594 185873 213588 294032 287323 269576 350735 377967 358534 335763
18646C35763J6764Q6041j4516k7013M6828k1064N0777L6522K3424k0557k1311
18635D91658j9329j9732m0852K2103O6082M7159P2466L5248n6657j13187p2825
18624D12134n4069j0778j8301O9815K9395N8654k7127j07825n3526r6172k365
18613A99835r644o333l5773o990n1312m3975M8583K4631j2906M1082M7391L6225
18601B30814J2050n6325l2130n2281o439k0522K5727O0676J4899K0715M2856L7158
18589B77198Q999n95L786n3310L6766P5101n9605n2883m4970k2574m770J7765
18577A80908N7110K9285L1221j1540q9764m5800J6503p6193m4595j1937N958L239
18565D4395K8355L8622K6098J0371p3420j3291l3807L6927N542N367K7376L382
$$ plain form
18646 335763 352527 438568 424052 397039 443867 422803 473580 510102 533526 512969 491658
18635 491658 472329 452597 411745 433848 499930 547089 619555 654803 598146 484959 412134
18624 412134 358065 347287 328986 398801 428196 486850 459723 351898 298372 202200 199835
18613 199835 190191 183858 148085 141095 89783 45808 94391 119022 106116 147198 194589 230814
18601 230814 242864 186539 154409 102128 95689 75167 100894 161570 176469 197184 240040 277198
18589 277198 286197 285602 289388 236078 272844 347945 288340 235457 190487 167913 163143 180908
18577 180908 238018 267303 298524 286984 197220 151420 167923 91730 47135 35198 41156 44395
18565 44395 72750 111372 137470 147841 74421 61130 27323 64250 69792 75159 102535 105917
18553A05917O281K7964O796M5686J1273o2762n6212p4214J8590J9370J3116L3918
18541I5723M469M456m076k6632n8311M0650j092k8076N6496K9252L148o1469L913
18528E8451M7669L8484p362n216k2263J2899N27o1655n2642J0609l636l703J8681
18515C0843k8539M0321L2669p428R071j1551k8372m1675N303O1985k2132m824
18503C5671N814q589K5278K4857K3174l6220k5403q5808L7534L6228J1971k2535
18491B1972P9654J059j5952j0049j3862o9850k0986J5857O6979r464n5760K2223
18479A1821M3112R875J4818K192L5601j4810l9255j0670j7420k4959O509J8343
18467C5157j7929o4735J5655O1319j5164N1568M7483M5047J4630J3862m0597j08552
$$ plain form
18553 105917 112198 140162 146958 192644 203917 141155 84943 10729 29319 48689 61805 95723
18541 95723 100192 104648 100572 73940 15629 56279 55187 27111 83607 112859 116007 54538 58451
18528 58451 106120 144604 137242 132026 109763 122662 123189 61534 8892 19501 15865 12162 30843
18515 30843 2304 42625 75294 67866 76937 65386 37014 -4661 642 62627 40495 35671
18503 35671 41485 32896 58174 83031 106205 69985 44582 -41226 -3692 32536 44507 21972
18491 21972 101626 102685 86733 76684 62822 -7028 -28014 -12157 54822 45358 -10402 11821
18479 11821 54933 64808 79626 81818 117419 102609 63354 52684 35264 10305 16814 35157
18467 35157 17228 -47507 -31852 29467 14303 65871 113354 158401 173031 186893 146296 37744
18455C7744o7249P878O9508K8073j6158m1344k9502M2614L8656L5761J7466j42996
18443a9549l60O5225K429j5469K0124o5415l4689J1721M3338N1488K6099n2681
18431C2261q8246k1303K254k5799J5623Q7705M0796l2623L8132M9224p251l1696
18419E9077j6165K4280m60j1541l5635l4860O1751P4741n5225m898L4168J8734
18407A13967J8326J0808K7031N2121Q8909O0452K5130L3035k7938o2076k0288
18396C19477N81m1395M4822R3405L9732n7316j12095o4984o2206l6069K5239O9687
18384B18878r273l9817m9591K9547L8244M1010l8808N1116L5229l7078n6902J6059
18372A98614p8762l1045l2508J2148J7835J9085M2866m38J7889l8739N1733N2745
$$ plain form
18455 37744 -29505 -21627 47881 75954 59796 18452 -11050 31564 70220 105981 123447 -19549
18443 -19549 -19909 45316 47745 32276 52400 -13015 -47704 -35983 7355 58843 84942 32261
18431 32261 -55985 -77288 -75034 -100833 -85210 2495 43291 10668 48800 98024 90773 59077
18419 59077 42912 67192 66732 55191 19556 -15304 46447 121188 65963 61065 95233 113967
18407 113967 132293 143101 170132 222253 311162 371614 396744 429779 401841 339765 319477
18396 319477 320058 278663 323485 416890 456622 399306 287211 222227 160021 123952 149191 218878
18384 218878 209605 169788 120197 149744 187988 228998 190190 241306 276535 239457 182555 198614
18372 198614 119852 88807 56299 68447 86282 105367 148233 147795 165684 126945 178678 231423
18360B31423L2590O210P1653N0919K2598Q749p2393m0701L3255O0588P4266J13380
18348E92537Q0078n9933j63783j19996k5735o035p647m3595j3204J8323k3967
18337B27043K1746J4697j33798q5843Q286p538o071J6242K1359K8997O0384O44
18325A66148j8320k9555j7984m0788m746o4750Q345O2995M8038J435P227o229
18313A11816n6799N2K1777K444L1164L7535K6924J6001N4043M3420L1280J2125
18301C31782k9840k4148M1500k2439n483K950k8789n6980o6959j15641m1953m7810
18289f3810N1576R4796L2408j6744q0396o112K6600P8497k9022l1133k4940K2417
18277E4137l1986K1640L5091J3201j5254J4895j1940N366K717J4121L837j8833
$$ plain form
18360 231423 264013 270223 341876 392795 415393 424142 351749 311048 344303 404891 479157 592537
18348 592537 672615 612682 448899 328903 303168 297133 289486 245891 232687 251010 227043
18337 227043 248789 263486 129688 43845 52131 44593 38522 54764 76123 105120 165504 166148
18325 166148 147828 118273 100289 59501 54755 -9995 -1650 61345 109383 110818 118045 111816
18313 111816 55017 55069 76846 79290 110454 147989 174913 190914 244957 288377 319657 331782
18301 331782 301942 277794 319294 296855 291372 294322 265533 208553 141594 25953 -16000 -63810
18289 -63810 -12234 82562 114970 98226 17830 11718 38318 116815 87793 56660 31720 54137
18277 54137 22151 43791 78882 92083 76829 91724 79784 85150 87867 101988 105825 86992
18265H6992n5992N7174L3617n060l3882j3279N550j9845o2020j6769M4151L7839
18253E8476N0653n4848o838j6754O619j4167m466P4306q171k1958J9616j466n4327
18240B6675K6556J4539N192l8384n2181k0852L8110P7436J8297n8262j5998K6529
18228D7657M0708K3882K9611p394j1180k4075m4211k782O7793o946q5825o166
18216B1072K5109o4765k013L4798R7298P3405L6599n8046o3518k8271J6821p5470
18204A3019Q187M027m7441R448L3502Q466N3950M8422k5115N753Q432j7978m5011
18191E7661j7751N1450l1648l9204p69J7731n744M3554L2457K5652O632p7706
18179F2315j8835K3506L2525L4080K7651K2428M3519j3660k3269l7737l969j6003
$$ plain form
18265 86992 31000 88174 121791 116731 82849 69570 75120 55275 -6745 -23514 20637 58476
18253 58476 109129 54281 47443 30689 37308 23141 18675 92981 84810 62852 82468 81002 26675
18240 26675 53231 67770 72962 34578 -17603 -38455 -345 77091 95388 37126 21128 47657
18228 47657 88365 112247 141858 134464 123284 99209 54998 52216 120009 113063 27238 21072
18216 21072 46181 -18584 -20597 14201 111499 184904 221503 163457 99939 71668 88489 13019
18204 13019 21206 25233 -22208 -12760 20742 29208 83158 131580 106465 112218 120650 102672 57661
18191 57661 39910 91360 59712 20508 19739 37470 31726 75280 107737 133389 140021 62315
18179 62315 43480 66986 99511 133591 161242 183670 227189 213529 190260 152523 148554 132551
18167A32551K0053m010K2913N3545L519K9991K6847J8444K4566l6374n1192l2277
18155B08576k5732O155M9996Q7402K3329P059K1551K0479j4940L4587M354q853
18143D13963O3753J15432J03135N9720Q5664J28626J11429J24294J35007K09132
18133A550155K47224L10122L26683K91281L93377M72359M02125M28686M00940
18124D822952L71216M85995O35602P47270R16408J074911J200544J403041J673429
18115A3331368K100480L162732N364212R680317J6784454K6912794L7196818J5793905
18107A30327080l4702075l8313806k2973995j2299922o934903m091102k566881
18100H444396j729763j209784r19571o55360m63529l90971l96459l62796l19623
$$ plain form
18167 132551 152604 148594 171507 225052 228571 258562 285409 303853 328419 292045 240853 208576
18155 208576 182844 188999 238995 326397 349726 356785 378336 398815 383875 418462 422816 413963
18143 413963 477716 593148 696283 756003 841667 970293 1081722 1206016 1341023 1550155
18133 1550155 1797379 2107501 2434184 2725465 3118842 3591201 3993326 4422012 4822952
18124 4822952 5194168 5680163 6315765 7063035 7979443 9054354 10254898 11657939 13331368
18115 13331368 15431848 18594580 23958792 33639109 50423563 77336357 114533175 130327080
18107 130327080 95625005 57311199 34337204 22037282 15102379 11011277 8444396
18100 8444396 6714633 5504849 4585278 3929918 3466389 3075418 2678959 2316163 1996540
18091A996540k40506k09649o0305o8061j04371j52722j11824l4023j31143j94146
18081F89790o3431o139n6819n0952m1069J0211M0557R563o5482o966J829n8485
18069D02607n9847k2054M353j169l6927o858k6849j0831L0491L2579k8197k7892
18057B49406j5955L9529J4514l5912k6533j8055o1621L1345n165N2010N0955o4538
18045B09980q1876m1768J7397O6612M740N352j5451J0974K6515N826J1786J1581
18033B31668K5466J874k4338j8599O976n4170o8653j4860p774j3620q155n1991
18021C824K4759M8990l5904j3154P9742P20j6744L5481k545k2954p4382Q622L4814
18008G1269Q6109N1k0297K6587J68l4045l4681K2720L1375n7233q0766L3038N4129
$$ plain form
18091 1996540 1756034 1546385 1486080 1418019 1313648 1160926 1049102 1015079 883936 689790
18081 689790 626359 620220 563401 512449 471380 481591 522148 531711 466229 459263 461092 402607
18069 402607 342760 320706 325059 323890 286963 280105 253256 242425 272916 305495 277298 249406
18057 249406 233451 272980 287494 251582 225049 206994 145373 176718 171553 223563 274518 209980
18045 209980 128104 86336 103733 170345 175085 180437 164986 175960 202475 208301 220087 231668
18033 231668 257134 259008 234670 216071 223047 168877 100224 85364 77590 63970 55815 3824
18021 3824 28583 77573 41669 28515 108257 108977 92233 127714 125169 102215 27833 36455 71269
18008 71269 157378 157429 137132 163719 163887 129842 95161 117881 149256 92023 11257 44295 98424
17995I8424N298k6302p5787l0700j5265K1086K8026O1488K231k326j6545l6941
17983A2687K1208P1077Q4760K086k9031k3571k4022L6890l1463l5631K390k4636
17971F2744M1738O2369m600n4125k3804l6699j9458o9970K051K057k724K621M6329
17958H529M4531J526L9729O0089M1217o6726n7468k9125k1620R4668j5592j969
17946I7789j1501n6204k7088J3991P2128o2862n3313L9624o77J7075L4681N1574
17934A15217l1170k0511l3403L100N6784j3017j5767q356J049j9057p9803k4171
17922f9105P0296k3086J5540R635l5534K6581l4724K0901J9864j2950n0146Q590
17910e4138O7104R5417K874l2366l4753m1261m470L6116p998o2183o3895m4892
$$ plain form
17995 98424 103722 77420 1633 -29067 -44332 -23246 4780 66268 68499 66173 49628 12687
17983 12687 33895 104972 189732 191818 162787 139216 115194 152084 120621 84990 87380 62744
17971 62744 104482 166851 162251 108126 84322 47623 28165 -41805 -39754 -37697 -40421 -37800 8529
17958 8529 53060 54586 94315 154404 195621 128895 71427 42302 20682 115350 99758 97789
17946 97789 86288 30084 2996 16987 89115 26253 -27060 12564 11887 28962 63643 115217
17934 115217 84047 63536 30133 33233 90017 77000 61233 52877 53926 34869 -44934 -69105
17922 -69105 1191 -21895 -6355 3280 -32254 -5673 -40397 -19496 368 -12582 -62728 -54138
17910 -54138 12966 108383 111257 78891 44138 2877 -1593 34523 26525 -35658 -99553 -144445
17898a44445O8562Q8834R2733P8182J6469o5790o2623p183k2505m6843L8904K2608
17886E6903L8214M1112k4737l0890q9535m3034L1174Q6025m4053J7097K8510M4390
17874A11176k9081m8697l0038J1097J698N135N102J558k3462J2087k1500k7258
17862c2183J0408j5864m7442K9476N4639K4544k373k2699N832J8541J0692K1647
17850E5218j2006j3219p845J2821P5716j901r3245j8301K1840l8621K690J165
17838a5688k340P7248M0463m2791k0589J4320l2294M089J3560n8369p121J01987
17826G2475R483k7969J7660M1551l7395k1558M1009l0405j994p186p799K5661
17814G3533l5480j7693J4971n2867R469q452l6497N0565K4555l9819q4346m5272
$$ plain form
17898 -144445 -75883 12951 105684 183866 200335 134545 71922 64739 42234 -4609 34295 56903
17886 56903 95117 136229 111492 80602 -8933 -51967 -20793 65232 21179 38276 66786 111176
17874 111176 82095 33398 3360 14457 16155 21290 26392 27950 4488 16575 -4925 -32183
17862 -32183 -21775 -37639 -85081 -55605 -966 23578 21205 -1494 4338 22879 33571 55218
17850 55218 43212 29993 22148 34969 110685 108784 15539 -2762 19078 -19543 -16853 -15688
17838 -15688 -18028 59220 99683 56892 36303 50623 18329 22418 35978 -22391 -29512 72475
17826 72475 81958 53989 71649 113200 75805 54247 95256 64851 62857 55671 47872 73533
17814 73533 38053 20360 35331 -17536 -8067 -16519 -53016 -2451 22104 -17715 -102061 -147333
17802a47333O2718N0345J466l2017l3471M9265M8322k1606j3780l1927l3429O5620
17790c5827j2823k6212j7389J5770M4727P908N5310N752Q852j138k6342m9230
17778c0642o5016l1542Q2923m813N1491O6337J7397m8739k870M7275r40k0838
17766F0023L5644j2214j11413M944L4763k7653J1745O1630K3899J0821r2034l4722
17754c4567N365K8205P4024k7553q323P864K734J7216m6221j7889L3044j8085
17742A5814n973M5993M431L767p8031k3042P614L4099M0387j9372k6144L0155
17730B9698L1550j8412j1861n472k0088q601J5775O5232J3030n7122p6652K3422
17718a9501J2829m6605q694J0687j7924J6510j4215j0349L581k8606J3366M2898
$$ plain form
17802 -147333 -84615 -34270 -32804 -64821 -98292 -49027 -705 -22311 -36091 -68018 -101447 -35827
17790 -35827 -48650 -74862 -92251 -76481 -31754 -23846 31464 37216 46068 44930 18588 -30642
17778 -30642 -95658 -127200 -44277 -49090 2401 68738 86135 37396 34526 81801 80861 60023
17766 60023 95667 83453 -27960 -23016 11747 -15906 -4161 57469 81368 92189 155 -34567
17754 -34567 -29202 -997 73027 45474 37151 45015 47749 64965 18744 855 33899 15814
17742 15814 9841 55834 60265 64032 -13999 -37041 -29427 4672 45059 25687 -457 29698
17730 29698 61248 42836 30975 25503 5415 -3186 12589 77821 90851 33729 -42923 -19501
17718 -19501 -6672 -53277 -61971 -51284 -69208 -52698 -66913 -77262 -73681 -102287 -88921 -46023
17706d6023L8611j7312k3042n0904J1599J6137J9529K0778j99R37l8486J5476
17694e2899N7675O1864m2380j4403K323j2638J8235j5201k7941q999M3927k155
17682G408P427K3177L0006k7332m6985k8866P2630K8199o1415m2841Q39Q826k9220
$$ plain form
17706 -46023 -7412 -24724 -47766 -98670 -87071 -70934 -51405 -30627 -30826 -29889 -68375 -52899
17694 -52899 4776 66640 24260 9857 12180 -458 17777 2576 -25365 -34364 9563 7408
17682 7408 14835 38012 68018 40686 -6299 -35165 37465 65664 4249 -38592 -37753 -28927 -58147
$$ [...]
##END NTUPLES=NMR SPECTRUM
##END=
