##TITLE=Analysis number 330456
Compound Code cc 04926
Book Reference 546/66
Project Code adrs
Chemist Name craigr
##JCAMPDX= 6.0         $$ Bruker NMR JCAMP-DX V2.0
##DATA TYPE= NMR SPECTRUM
##DATA CLASS= NTUPLES
##ORIGIN= Bruker BioSpin GmbH
##OWNER= nmr
$$ XWIN-NMR		Version 3.5
$$ Tue Nov 27 12:28:05 2007 GMT Standard Time (UT+0h)  MAYBRIDGE\nmr@NMR_250MHZ
##.OBSERVE FREQUENCY= 250.131544655141
##.OBSERVE NUCLEUS= ^1H
##.ACQUISITION MODE= SIMULTANEOUS (DQD)
##.ACQUISITION SCHEME= undefined
##.AVERAGES= 16
##.DIGITISER RES= 18
##SPECTROMETER/DATA SYSTEM= dpx250
##.PULSE SEQUENCE= zg30
##.SOLVENT NAME= CDCl3
##.SHIFT REFERENCE= (INTERNAL, CDCl3, 0, 16.522)
##AUDIT TRAIL= $$ (NUMBER, WHEN, WHO, WHERE, WHAT)
$$ ##TITLE= Audit trail, XWIN-NMR		Version 3.5
$$ ##JCAMPDX= 5.01
$$ ##ORIGIN= Bruker BioSpin GmbH
$$ ##OWNER= nmr
$$ C:\u/data/dgb/nmr/ADRS/2320/pdata/1/auditp.txt
$$ ##AUDIT TRAIL=  $$ (NUMBER, WHEN, WHO, WHERE, WHAT)
(   1,<2007-11-27 12:27:22.26 +000>,<MAYBRIDGE\nmr>,<NMR_250MHZ>,
      <created by zg, POWCHK disabled, PULCHK disabled
       configuration hash MD5:
       76 6E 9A 78 1E 09 19 81 EC 84 63 8F B0 6A 59 2D
       data hash MD5: 64K
       35 29 CF 22 D8 EE FD 30 CC CF 11 6E 5B 6B 08 71>)
(   2,<2007-11-27 12:27:51.87 +000>,<MAYBRIDGE\nmr>,<NMR_250MHZ>,
      <Start of raw data processing
       ef LB = 0.3 FT_mod = 6 PKNL = 1 SI = 32K 
       data hash MD5: 32K
       A6 61 AB 3D C2 17 23 19 A4 B9 AB EF B1 38 55 20>)
(   3,<2007-11-27 12:27:53.67 +000>,<MAYBRIDGE\nmr>,<NMR_250MHZ>,
      <apk 
       data hash MD5: 32K
       4A 9F 03 B4 38 6F 99 F9 49 49 1A CD 6E F6 43 42>)
(   4,<2007-11-27 12:27:54.64 +000>,<MAYBRIDGE\nmr>,<NMR_250MHZ>,
      <abs ABSG = 5 
       data hash MD5: 32K
       52 90 8C CC 42 4F 0B B3 4E 89 63 5F E0 D4 6A 91>)
$$ ##END=
$$ 
$$ hash MD5
$$ F9 99 F4 82 F9 AF B9 FD A0 E3 C6 F7 48 97 B4 8B
##$RELAX= 
##$RELAX= 
##$RELAX= 
##$RELAX= 
##$RELAX= 
##$RELAX= 
##$RELAX= 
$$ Bruker specific parameters
$$ --------------------------
##$DU= <C:\u>
##$EXPNO= 2320
##$NAME= <ADRS>
##$PROCNO= 1
##$TYPE= <nmr>
##$USER= <dgb>
##$AMP= (0..31)
100 100 100 100 100 100 100 100 100 100 100 100 100 100 100 100 100 100 
100 100 100 100 100 100 100 100 100 100 100 100 100 100 
##$AQSEQ= 0
##$AQ_mod= 3
##$AUNM= <au_zg>
##$AUTOPOS= <4 >
##$BF1= 250.13
##$BF2= 250.13
##$BF3= 250.13
##$BF4= 250.13
##$BF5= 500.13
##$BF6= 500.13
##$BF7= 500.13
##$BF8= 500.13
##$BYTORDA= 1
##$CFDGTYP= 0
##$CFRGTYP= 5
##$CHEMSTR= <none>
##$CNST= (0..31)
1 1 145 1 1 1 1 1 1 1 1 1 1 1 1 1 1 1 1 1 1 1 1 1 1 1 1 1 1 1 1 1 
##$CPDPRG= <>
##$CPDPRG1= <>
##$CPDPRG2= <>
##$CPDPRG3= <>
##$CPDPRG4= <mlev>
##$CPDPRG5= <mlev>
##$CPDPRG6= <mlev>
##$CPDPRG7= <mlev>
##$CPDPRG8= <mlev>
##$CPDPRGB= <>
##$CPDPRGT= <>
##$D= (0..31)
0 1 0 0 0 0 0 0 0 0.06 0 0 0 0 0 0 0.0002 0 0 0 0 0 0 0 0 0 0 0 0 0 0 
0 
##$DATE= 1196166434
##$DBL= (0..7)
120 120 120 120 120 120 120 120 
##$DBP= (0..7)
150 150 150 150 150 150 150 150 
##$DBP07= 0
##$DBPNAM0= <>
##$DBPNAM1= <>
$$ [...]
##$SUBNAM7= <"">
##$SUBNAM8= <"">
##$SUBNAM9= <"">
##$SW= 20.6930455092707
##$SWIBOX= (0..15)
0 0 3 0 0 0 0 0 0 0 0 0 0 0 0 0 
##$SW_h= 5175.983436853
##$TD= 65536
##$TD0= 1
##$TE= 295.16
##$TE2= 300
##$TE3= 300
##$TEG= 300
##$TL= (0..7)
0 120 120 120 120 120 120 120 
##$TP= (0..7)
150 150 150 150 150 150 150 150 
##$TP07= 0
##$TPNAME0= <>
##$TPNAME1= <>
##$TPNAME2= <>
##$TPNAME3= <>
##$TPNAME4= <>
##$TPNAME5= <>
##$TPNAME6= <>
##$TPNAME7= <>
##$TPOAL= (0..7)
0.5 0.5 0.5 0.5 0.5 0.5 0.5 0.5 
##$TPOFFS= (0..7)
0 0 0 0 0 0 0 0 
##$TUNHIN= 0
##$TUNHOUT= 0
##$TUNXOUT= 0
##$USERA1= <user>
##$USERA2= <user>
##$USERA3= <user>
##$USERA4= <user>
##$USERA5= <user>
##$V9= 5
##$VALIST= <valist>
##$VCLIST= <CCCCCCCCCCCCCCC>
##$VD= 0
##$VDLIST= <DDDDDDDDDDDDDDD>
##$VPLIST= <PPPPPPPPPPPPPPP>
##$VTLIST= <TTTTTTTTTTTTTTT>
##$WBST= 1024
##$WBSW= 4
##$XGAIN= (0..3)
0 0 0 0 
##$XL= 0
##$YL= 0
##$YMAX_a= 166018
##$YMIN_a= -219094
##$ZGOPTNS= <>
##$ZL1= 120
##$ZL2= 120
##$ZL3= 120
##$ZL4= 120
##$ABSF1= 16.522
##$ABSF2= -4.171173
##$ABSG= 5
##$ABSL= 3
##$ALPHA= 0
##$AQORDER= 0
##$ASSFAC= 0
##$ASSFACI= 0
##$ASSFACX= 0
##$ASSWID= 0
##$AUNMP= <proc_1d>
##$AZFE= 0.1
##$AZFW= 0.1
##$BCFW= 0
##$BC_mod= 0
##$BYTORDP= 0
##$COROFFS= 0
##$CY= 12.5
##$DATMOD= 1
##$DC= 0
##$DFILT= <>
##$DTYPP= 0
##$F1P= 14.0000005364418
##$F2P= -0.99999901652339
##$FCOR= 0.5
##$FTSIZE= 32768
##$FT_mod= 6
##$GAMMA= 0
##$GB= 0
##$INTBC= 1
##$INTSCL= 1
##$ISEN= 128
##$LB= 0.3
##$LEV0= 0
##$LPBIN= 0
##$MAXI= 10000
##$MC2= 0
##$MEAN= 0
##$ME_mod= 0
##$MI= 0
##$NCOEF= 0
##$NC_proc= -5
##$NLEV= 6
##$NOISF1= 0
##$NOISF2= 0
##$NSP= 0
##$NTH_PI= 0
##$NZP= 0
##$OFFSET= 16.522
##$PC= 1
##$PHC0= 170.0456
##$PHC1= 15.80004
##$PH_mod= 1
##$PKNL= yes
##$PPARMOD= 0
##$PSCAL= 4
##$PSIGN= 0
##$REVERSE= no
##$SF= 250.13
##$SI= 32768
##$SIGF1= 0
##$SIGF2= 0
##$SINO= 400
##$SIOLD= 32768
##$SREGLST= <1H.CDCl3>
##$SSB= 0
##$STSI= 32768
##$STSR= 0
##$SW_p= 5175.98343685301
##$SYMM= 0
##$S_DEV= 0
##$TDeff= 65536
##$TDoff= 0
##$TI= <Analysis number 999999
Compound Code 99
Book Reference 9
Project Code 9>
##$TILT= no
##$TM1= 0
##$TM2= 0
##$TOPLEV= 0
##$USERP1= <user>
##$USERP2= <user>
##$USERP3= <user>
##$USERP4= <user>
##$USERP5= <user>
##$WDW= 1
##$XDIM= 32768
##$YMAX_p= 476090809
##$YMIN_p= -893478
$$ End of Bruker specific parameters
$$ ---------------------------------
##NTUPLES= NMR SPECTRUM
##VAR_NAME=  FREQUENCY,     SPECTRUM/REAL,   SPECTRUM/IMAG
##SYMBOL=    X,             R,               I
##VAR_TYPE=  INDEPENDENT,   DEPENDENT,       DEPENDENT
##VAR_FORM=  AFFN,          ASDF,            ASDF
##VAR_DIM=   32768,         32768,           32768
##UNITS=     HZ,            ARBITRARY UNITS, ARBITRARY UNITS
##FACTOR=    0.157963299565203, 1,           1
##FIRST=     4132.6476996994, 0,             0
##LAST=      -1043.33573715361, 0,           0
##MIN=       -1043.33573715361, -893478,     0
##MAX=       4132.6476996994, 476090809,     0
$$ Real data points
##PAGE= N=1
##DATA TABLE= (X++(R..R)), XYDATA
$$ [...]
26826a52265j5442k3992j4161P5842r4016m7290N92836K26161j60299J00615j99553
26815B88436k47522j46560K8924J63923J72516k13249M797O4652K086L946n0897
26804G1052l8149O6068Q0996p8458k31289r4991k6951j09685J69529K04326J01374
26793A13822q398j24729j00071L8396j41689j46841J53223J07123P0934j68574
26783b06804l0880K63243r493J08860j6047J73502n473l0834k63252k44448o9867
26772c31493O6849Q4773J21572M3639k56891j52816J69014K47858P5445k08435
26762a40485l6624p098K6113k333K34730N5263p4935L0498j24266J75990n8383
26751G8470R3584O9579P4406j62171M514j0483q4178k1308J80477L5325k00014
$$ y = [-152265, -167707, -191699, -205860, -130018, -224034, -271324, 321512, 547673, 387374, 487989, 288436, 40914, -105646, -76722, 87201, 259717, 46468, 51265, 115917, 118003, 121949, 71052, 32903, 98971, 179967, 101509, -129780, -224771, -251722, -361407, -191878, 12448, 113822, 105424, -19305, -119376, -80980, -222669, -369510, -216287, -109164, -38230, -206804, -237684, 25559, 16066, 124926, 108879, 282381, 276908, 246074, -17178, -261626, -331493, -264644, -179871, -58299, -14660, -271551, -424367, -255353, -7495, 67950, -140485, -177109, -184207, -158094, -160427, 74303, 129566, 54631, 85129, -39137, 136853, 78470, 172054, 241633, 316039, 153868, 158382, 147899, 63721, 42413, 222890, 258215, 58201]
26740E8201p5014P8563J38138r5086j91772j12422o566l4187j45635J16263K31024
26729c8493n2290l12344k09252K74636K62469r1925J01455l293P1605q0052Q0164
26718B680J38827Q4482n6031p9541J8368k03194j0605M3058o9622J2222M5339
26707g4017R4079l8205j15444O7367P1201k27662k00242J58567R6520O9259J69514
26696G0937j95593K3152N9850j3061j1015R203J06404K21861j58102j65242K6740
26685b4866J58064J66772o6174j60192j15124j01452L9126O7677M5383L9458m614
26674D4058K31365L43292m1339j93544j88753j58757J2057O0041p417K39888n2226
26663B88665k31377j14913L4598p0718O5886K60184N6696m6381P0146q4813j14905
$$ y = [58201, -16813, 61750, 199888, 104802, -86970, -199392, -205958, -240145, -385780, -269517, -38493, -90783, -403127, -612379, -337743, -75274, -167199, -65744, -69037, 2568, -77484, 2680, 141507, 225989, 169958, 90417, 108785, -94409, -105014, -61956, -131578, -119356, -74017, 20062, -18143, -133587, -66220, 4981, -222681, -422923, -264356, -167836, -98577, 70937, -124656, -101504, -41654, -54715, -65730, -56527, 49877, 271738, 113636, -51606, -24866, 133198, 299970, 233796, 73604, -41520, -142972, -103846, -36169, 9214, 48672, 44058, 275423, 618715, 577376, 383832, 195079, 36322, 48379, 108420, 101003, 340891, 288665, 57288, -57625, -23027, -93745, -27859, 232325, 289021, 242640, 312786, 227973, 113068]
26652A13068J05221J26836k7914k08145p8066j98768J34154J30967O2395J31930
26642B91678j07983O4855k13220j36258K34100N2154R7434o3423j9801j28256
26632G1280r3702n0631K37006J92750n6715P384j63857j85387q0298j25964o3560
26621c11694K7448K52153K13270k11896O4416M5807O758M596k4761j03125j79697
26610b16725P1395L2811O3698J74097n9586k11120J17384K65378J72964j45601
26600B64695j98861l0300L1075p2078j86635K1821j01869q4094J93029J9671k5052
26589a68598K959j62956j40864j5126L1186J93875N8465q7147M2257j61085J30465
26578b76569K4975J53057J16968K43900J17097l52772k06825M3960L752J15242
$$ y = [113068, 218289, 345125, 317211, 109066, 31000, -167768, -33614, 97353, 159748, 291678, 183695, 248550, 35330, -100928, 133172, 185326, 282760, 219337, 199536, 71280, -22422, -73053, 163953, 356703, 299988, 307372, 143515, -41872, -122170, -248134, -311694, -284246, -32093, 181177, -30719, 33697, 79504, 86262, 90858, 66097, -37028, -216725, -145330, -112519, -48821, 125276, 65690, -145430, -28046, 237332, 410296, 264695, 65834, 35534, 66609, -5469, -192104, -170283, -272152, -356246, -163217, -143546, -168598, -165639, -328595, -469459, -484585, -453399, -259524, -201059, -288206, -245949, -407034, -276569, -251594, -98537, 18431, 262331, 379428, 26656, -180169, -136209, -132457, -17215]
26568a7215k38961j42233J4657M2145K30012k3499N1871J2419J82149j2528k10338
26557a11521r7629J21308K8017p1327J43293q7495L0223k36748k55250L3429K24773
26546b78927K36918J11141j25524j44979j2729l3548J52637K84522q445k19649
26536c8583j42360o0883j0522J85501L3575Q0747n5354k6368N4689J47651J9606
26525A87699J03713K865L3538j10372n4281J07481m4768j47293j26568M0143l6235
26514d4078R8016L37506n4868k00439j66395O0691j1884R0143j10888k5832J1917
26503a6111L4829P7783R5j42422p2102j70900R7503Q7900J10634R5621J73795
26492B76625J1441l36649j41687j4242o54j03675J4251K34768J55008j73313k56888
$$ y = [-17215, -256176, -398409, -383752, -341607, -111595, -135094, -83223, -70804, 111345, 98817, -111521, -209150, -87842, -59825, -131152, 12141, -75354, -45131, -281879, -537129, -503700, -278927, -42009, 69132, -56392, -201371, -214100, -247648, -95011, 189511, 181066, -38583, -180943, -241826, -252348, -66847, -33272, 47475, -7879, -34247, 20442, 168093, 187699, 291412, 294277, 327815, 217443, 163162, 270643, 225875, 78582, -47986, -7843, -44078, 53938, 391444, 336576, 136137, -30258, 30433, 18549, 108692, -2196, -28028, -16111, 18718, 96501, 96596, -45826, -117928, -288828, -191325, -103425, 7209, 102830, 276625, 288066, -48583, -190270, -204512, -205166, -308841, -294590, -59822, 95186, -78127, -335015]
26481c35015k29760P8222N9034K95296J48565k4179j86751o8124q0962q3140J08558
26470c18256K04707r8534j96274p5555K04604L36560J42366Q3512l5477j21084
26460A26569j14749r8959K902j21582P3705J93468L3452j50273j32572j3896P161
26449a94774n7277l8188J33674M4010J97902r7433k56951N6139K29114K3755K8722
26438F8693q8826p1081K04264K12781J27798L2609k07633k85253k39456m7547
26428b93651J19903M4375J20194j3376L3908n1243o9532O9208J04837O7124J82074
26417C13821j17805o2632J85745l1555j93767r2190k42676j74272J05191M12338
26407A02198J99111k08080j09110L8975j68836J32588K19120J53461P1621j56242
$$ y = [-335015, -564775, -486553, -427519, -132223, 16342, -7837, -194588, -262712, -343674, -426814, -318256, -113549, -212083, -408357, -483912, -279308, 57252, 199618, 283130, 247653, 126569, 11820, -87139, -84237, -205819, -132114, 61354, 94806, -55467, -188039, -201935, -194774, -252051, -290239, -156565, -112555, 85347, -12086, -269037, -212898, 16216, 39971, 68693, -20133, -91214, 113050, 325831, 453629, 486238, 278605, -6648, -246104, -293651, -173748, -129373, -9179, -22555, 11353, -39890, -109422, -40214, 64623, 131747, 313821, 196016, 133384, 319129, 287574, 93807, 1617, -241059, -415331, -310140, 102198, 301309, 93229, -15881, 23094, -145742, -13154, 205966, 359427, 431048, 274806]
26397B74806l21951J54218o440j87675j15180J49085R3992o6090L830k9701j92825
26386b43931R6632J26918j11116M5238J67234q3934j05998j0118O6976J0572J31135
26375H9608M1215l3719l8107p7533R415K4664Q4799K9522j91491l2555Q0824O9817
26363E6459k96044k5025L03990K71851j2619j13745l0828N4531J53189p0505k56582
26352C4672j73037j41523J081R593l7170K11431o0804j08661K28482K54493J02520
26341C21077k09233j91501p9525J31807n6951j30069P6327K40480o9442j30136
26331i7166R9052j41161j0570K58334p886J7046o4685k29042r8105J2768K05736
26320e5679K08250K0001j64733J4332Q4906o9920J4725l0538Q2381Q7290M4625
$$ y = [274806, -47145, 107073, 100633, -87042, -202222, -53137, 40855, -25235, -21405, -51106, -243931, -147299, -20381, -131497, -86259, 80975, -2959, -108957, -119075, -52099, -41527, 89608, 130823, 97104, 58997, -18536, -9121, 15543, 100342, 129864, -61627, -94182, -13358, 56459, -239585, -264610, 39380, 311231, 298612, 184867, 154039, 208570, 361759, 291254, 34672, -138365, -279888, -278807, -269214, -306384, -94953, -155757, -264418, -35936, 218557, 321077, 111844, -79657, -159182, -27375, -84326, -214395, -138068, 102412, 32970, -97166, 1886, -139275, -149845, 108489, 100603, 117649, 52964, -176078, -274183, -261415, -55679, 152571, 172572, 7839, 22171, 107077, 37157, 51882, 21344, 103725, 191015, 235640]
26309B35640J36549j19553j91260J6435j5149L550j52192J29929J07880J00999
26299B52828M5820j83745j77573J01497o5814K3488q5984p7931k21062r235r5168
26288d92879n9910R7702n2731J53740J66248K27923J01509P0871j64294K9097
26278G7276n2531L0281o8779j35430K66686r6220j63240M2070j05892o8199J99529
26267g4449R7823n5073k48479j87055j94846K10337J49955J49520k1343L5796
26257a37814K04987J14764r7631j14583O1955M2497j67914k23m0142O4602K6350
26246d3152m6492J74550J90577J19933M9651j32565j22881J220j9690p1505R1937
26235A91583J9346q263p3893O0227n7384l28836j40918J00020p4789r8135j8829
$$ y = [235640, 372189, 252636, 61376, 77811, 62662, 66212, -85980, 43949, 151829, 252828, 298648, 114903, -62670, 38827, -26987, -3499, -89483, -167414, -388476, -397711, -492879, -552789, -455087, -507818, -354078, -187830, 40093, 141602, 212473, 48179, 77276, 24745, 55026, -13753, -149183, 117503, 21283, -141957, -99887, -205779, -273978, -74449, 23374, -31699, -280178, -467233, -662079, -451742, -301787, -152267, -173610, -137814, 67173, 181937, 84306, -30277, 31678, 74175, -93739, -93962, -134104, -69502, -43152, -89644, 84906, 275483, 395416, 445067, 312502, 189621, 190841, 171151, 99646, 191583, 210929, 202666, 128773, 189000, 131616, -197220, -338138, -238118, -312907, -411042, -429871]
26224d29871J79700j8901N4286J31153J50192R1915P5552q021r4151m3314q2759
26213E781M3216O1518L3089k19402j24846Q9662L933K34397K8417N5425k21137
26202i947q337L4065Q3611j35020L544J0594O7667L0853j82214k21267J63550
26191a62901K58721J19161n9922J09277j33730N5902l5460j80458k38871o264
26181b74545K88828J03746k15948j68065O3376J72819K6544N1966K5624k9361
26171D4984j61033J95936l518M575J79517k71160R4838J11635j49659j62495M5341
26160g1039N4778l9864J41120J62571N3466k20895j02644k8166l9518L2617j9770
26149g7344j38847J21230Q4899k9818k57851k9069K1574J00349K6438O1122R0710
$$ y = [-429871, -250171, -269072, -214786, -83633, 66559, 158474, 234026, 226005, 131854, 88540, 5781, 48997, 110515, 143604, -75798, -200644, -110982, -107049, 127348, 155765, 211190, -9947, -18284, 15781, 99392, -35628, -32084, -21490, 46177, 77030, -105184, -326451, -162901, 95820, 214981, 155059, 264336, 130606, 186508, 151048, -29410, -268281, -274545, 14283, 118029, -97919, -265984, -202608, -29789, -3245, 48721, 74345, 44984, -116049, 79887, 76369, 80944, 260461, -10699, 84139, 195774, 46115, -116380, -71039, -16261, -56125, 84995, 247566, 301032, 80137, -22507, -50673, -90191, -57574, -77344, -216191, -94961, -10062, -39880, -297731, -326800, -305226, -204877, -178439, -117317, -26607]
26138b6607O4178k9415j08408J68195J75296L1682j07357j26164l5899l5726j39199
26127a69424r5590L8350P7175J53847N4893L1787j83882k05527J81658P2151J3993
26116c0569j07992J51023N4400J0166n0676k4254j76171k01555K01730K54474
26106H0576J1491J14027m4917q2964o1105J7008k64599R7804K7816j67376J97104
26095g5135J41194j20385q4138J40837m9291L969K00386K1503p5545J03389J64435
26084C71219m3229q6103R840l732M4008k2221q9371p3266j27497j62346l5474
26073b18172o8695o7928J9871R5239q60J08275J14051K4457q1542k24764j2244
26062c12312J35651N1687K0174p6054O1391M3529J18600J81521L2813j60290l32507
$$ y = [-26607, 37571, 8156, -100252, 67943, 243239, 274921, 167564, 41400, 5501, -30225, -169424, -265014, -226664, -149489, 4358, 59251, 91038, -92844, -298371, -116713, -44562, -30569, -138561, 12462, 66862, 77028, 26352, 2098, -174073, -375628, -173898, 80576, 92067, 206094, 161177, 78213, 17108, 34116, -230483, -132679, -104863, -272239, -75135, 66059, -54326, -138464, 2373, -46918, -42949, 157437, 178940, 103395, 206784, 371219, 327990, 241887, 251727, 247995, 292003, 269782, 180411, 107145, -20352, -182698, -218172, -286867, -354795, -334924, -239685, -240545, -132270, -18219, 6238, -75304, -300068, -312312, -176661, -124974, -104800, -180854, -119463, -75934, 42666, 224187, 257000, 96710, -235797]
26051b35797j10117J04710J64327J13559J21510J8142k60057n7799l0836Q1216
26041i1142K4888O2769j09358j19743p2160n0598l4621K2217j13600J05113L19958
26030e6277J29658k24465j80468J84194J69465o4435q3337j7241L2250Q3694N6415
26019B9453n2062J81307J49561l3046k12683J5935q8064O5469r0640k2734R683
26008d7821K2667K61023l1555p8970K0967n3502L7204J53677k23774l41912J1050
25997b70946j15598J60767J87766k7768Q5882J21057J89652l910p6920j43228
25987A06754k2422K03990J65899l15809m34961O8566J9406J31673M8217l9842
25977f8529j18837P6059O7723M7288J70198M2197Q3837p2344K1467L2349j23221
$$ y = [-235797, -345914, -241204, -76877, 36682, 158192, 176334, -83723, -141522, -172358, -91142, -66254, -3485, -112843, -232586, -304746, -355344, -389965, -367748, -481348, -376235, -56277, 73381, -151084, -331552, -147358, 22107, -42328, -125665, -142906, -110656, -26962, 29453, -22609, 158698, 308259, 275213, 62530, 78465, -9599, 55870, -34770, -57504, -47821, -25154, 235869, 204314, 125344, 146311, 92809, 130013, 283690, 59916, -281996, -270946, -386544, -225777, -38011, -65779, 20103, 141160, 330812, 326902, 249982, 106754, 84332, 288322, 454221, 138412, -296549, -227983, -208577, -76904, -28687, -68529, -187366, -111307, -43584, 3704, 173902, 216099, 299936, 227592, 249059, 281408, 158187]
25966A58187p6642P2370k1183N3270J44990j02325K9387P3288k2291j85499J4349
25955A37901K00532j7840o3072J13347n969l4727j24534j15698m9899K8016M6148
25944A14205k2014K480k3139k3242J01212J82713M688p2907j85941m4798M2727
25933G5984J0065P6128k35124j35116N472J0663J54853J70780R9245n0146l864
25922A78940r6399j23525J12857O7710j58057j94180J6142K57786K44802J54123
25912D60199k84737k97873J8289K68550K08369j79310o0247m9775j61144l143
25902h0822q1149M1413j84891k9690Q8022J89416J32287j56795k3402K4477j69251
25891b50385J0533J37867l5556j03244O4385J12377L5271k48874n8445K03120
$$ y = [158187, 81545, 153915, 132732, 186002, 330992, 228667, 258054, 331342, 309051, 123552, 137901, 338433, 320593, 257521, 370868, 364899, 330172, 205638, 89940, 40041, 68057, 114205, 92191, 94671, 71532, 48290, 149502, 332215, 336903, 263996, 78055, 33257, 75984, 86049, 162177, -72947, -208063, -202591, -191928, -37075, 133705, 232950, 182804, 178940, 82541, -40984, 71873, 139583, -18474, -212654, -196512, 61274, 306076, 460199, 175462, -122411, -104122, 164428, 372797, 193487, 133240, 83465, -77679, -80822, -161971, -120558, -305449, -335139, -247117, -57701, 74586, -82209, -105611, -81134, -250385, -239852, -101985, -137541, -240785, -176400, -64023, -28752, -277626, -336071, -132951]
25881a32951p38q7120r82J75755J80903j9485j08439P1251j8922p1886j39696
25870a52310P5537K03591O86q9932J42237J41951r239l4860R0918M24r3334K5848
25858C01517j15172j74936Q4705J13197n50k33451m1190M4405J21381l4732p8095
25847a2921k1766r7013J37058M5986P6190k9341l75999j00822K01383J34207J44547
25836A01509j3066n3029J8122r3477k87897R2090K53498J77937J11623J69313
25826D76623R8085j47277j34686j74399r7299k20245N9211P4076j38768r1565
25816b96244p8031K72946P4918r949p3146K64316L2260j26729j64715N4940J06267
25805E6833R1435J37843n2497k23523j64723L9605J78951j18131k9193J12244
$$ y = [-132951, -133689, -220809, -221791, -46036, 134867, 115382, 6943, 78194, 59272, -12614, -152310, -76773, 126818, 127504, 37572, 179809, 321760, 312521, 277661, 368579, 369003, 275669, 301517, 186345, 11409, 96114, 209311, 208761, -24690, -65880, -21475, 99906, 65174, -12921, -34687, -131700, 5358, 51344, 127534, 98193, -277806, -378628, -177245, -43038, 101509, 88443, 35414, 53536, -39941, -327838, -235748, 17750, 195687, 307310, 476623, 574708, 427431, 292745, 118346, 21047, -199198, -139987, -65911, -204679, -296244, -374275, -101329, -26411, -36360, -109506, 154810, 187070, 60341, -104374, -49434, 56833, 148268, 286111, 233614, 10091, -154632, -115027, 63924, -54207, -83400, 28844]
25795B8844k86500k13568K49547J40274O427j46362J27844K17117K0207j35915
25785G915n1921K4232J05359r2067M2135l7780J03872o6389L6434N5512l9938
25774H7364j39213r3965Q1147J54077P9018J21068J71555j75492O313k3745n252
25763B62875O2504j6661m6605r2493n4264j66919j6445J13306M7321m360j07745
25752a9486p0507j51347p9959j15986n5047K09963J54845J34306K0118P3720j57642
25741e7022j20411o7115J80160K25088O1807k24590j26741j71502L5129K31758
25731c3439J07604j00735N5453j18656l28643j07860K99177K0391P109n5597K23091
25720c2105K0633J31689M0618o1236Q4787L4378n2539j84957j57701M1468j30447
$$ y = [28844, -257656, -471224, -221677, -81403, -74976, -221338, -93494, 123623, 143830, 7915, -44006, -19774, 85585, -6482, 35653, -2127, 101745, 35356, 71790, 127302, 87364, -51849, -145814, -64667, 89410, 168428, 289496, 461051, 285559, 291872, 268127, 262875, 325379, 308718, 262113, 169620, 115356, -51563, -68008, 45298, 92619, 88259, -19486, -89993, -241340, -321299, -437285, -492332, -282369, -127524, 6782, 26900, 100620, -57022, -177433, -244548, -64388, 160700, 222507, -2083, -128824, -300326, -265197, -33439, 74165, -26570, 28883, -89773, -418416, -526276, -227099, -206708, -199599, -255196, -32105, -11472, 120217, 160835, 99599, 184386, 218764, 166225, -18732, -176433, -134965, -265412]
25709b65412j3149N7579R3096J18697O0661j91537K64563o2946j68944k8773L6366
25698i9799m7372J00711K33730J30595j01005j91384j22634K6550J95806J27963
25688B53161n5354p6030k91728j34969j30528j09651J99360K69678L2609j21580
25678a65032J66065J89833o3965q8660j00631j0419m4038J08606J30830j50635
25668b8046J8539J29934q458j12873P3400p447R7695K42075k662j64106r0808
25657A47243K5586J0003r7829J29057J71287o4476r0404N5519n1854k57818o4041
25646h7727L00717J72476l05738j25502j4590N8516J3837j68941J17416p5181
25636a14717j20284K2751K0057J30374l5696r2059K68454N2597j64632r5930j45759
$$ y = [-265412, -278561, -220982, -127886, -9189, 51472, -140065, 124498, 61552, -107392, -136165, -99799, -147171, -46460, 187270, 317865, 216860, 25476, -97158, -70608, 125198, 253161, 197807, 121777, -169951, -304920, -435448, -545099, -345739, -76061, -43452, -165032, 1033, 190866, 126901, 38241, -62390, -72809, -116847, -8241, 122589, -28046, -9507, 120427, 111969, -904, 72496, 65049, 162744, 404819, 402157, 238051, 147243, 172829, 182832, 85003, 214060, 385347, 320871, 230467, 285986, 234132, -23686, -87727, 212990, 385466, 79728, -45774, -60364, -1848, 11989, -156952, -39536, -114717, -235001, -212250, -192193, -61819, -97515, -189574, 78880, 131477, -33155, -129085, -274844]
25625b74844o0371o537J90732M9239j34345j43747J37267O2419L1735n6835N9054
25614a46233k0872J32521j8407j44074n9961K0716Q6246Q6131K5889J6271J5701
25603f072j32768n5881P7300J30011R9960M9906j39743J59494J12755j15831L3637
25592B12768j73773j92836j37938J43163K1408p121O7054R6541p6689m0918N4714
25581c3627K93603r8447j86515m9962j0710J06705j22592k04592j3467l3175N0265
25570c02514O8451K914L01705p338j60642K18214K55314j77664j53311j70442
25560a25313L5197K60611K20935p6516k01341P7786j9925k00117O4063J17802
25550A53182j75622j86546J00782o2466m057Q8821K59204J22095O519r2936j07163
$$ y = [-274844, -335215, -341752, -151020, -101781, -236126, -379873, -242606, -180187, -148452, -205287, -146233, -167105, -34584, -52991, -197065, -257026, -236310, -150064, -63933, -38044, -21773, -6072, -138840, -194721, -117421, 12590, 112550, 162456, 22713, 182207, 294962, 179131, 212768, 38995, -153841, -291779, -148616, -127208, -134329, -67275, 29266, -47423, -88341, -33627, 259976, 161529, -24986, -74948, -85658, 21047, -101545, -306137, -319604, -352779, -302514, -234063, -231149, 70556, 63218, -97424, 120790, 376104, 198440, 45129, -125313, -90116, 170495, 391430, 314914, 113573, 191359, 171434, -28683, 35380, 153182, -22440, -208986, -108204, -170670, -174727, -85906, 173298, 295393, 301912, 208976, 101813]
25539A01813O9383j59468N0510p5866l7918J43252J74941j27903o3264j1819k7994
25528C5667p8911p8071O6804P850M3211q0202j46306j55134k74313J55147K36768
25517b67490N5088j06256K0722M5003K06087J47144m7629J1879J25183q8601J251
25506A02381j14935k34800k1715K48767J23137K44290j65673p3824j09028O6774
25496F5374Q0985K14586K35353m6980l72137k77737k05683O770J16735j31675
25486c14409j0438J50231J35752R6635J06502j08337k38946j23751l9631k5700
25476c72092l0686n7239J64575L9995q5073J5827J39432m5960n9639J44704M786
25465a41370J41087j42970j22445q8898J10435j88668K9005L07884J31515J16865
$$ y = [101813, 171196, 11728, 62238, -13628, -51546, 91706, 266647, 138744, 75480, 63661, 35667, -43244, -121315, -54511, -46661, -3450, -83652, -229958, -385092, -659405, -504258, -267490, -212402, -318658, -297936, -252933, -46846, 100298, 52669, 64548, 189731, 101130, 102381, -12554, -247354, -269069, -20302, 102835, 347125, 181452, 107628, -1400, 65374, 146359, 360945, 596298, 549318, 177181, -100556, -306239, -299469, -182734, -314409, -324847, -174616, -38864, 57771, 164273, 55936, -183010, -306761, -346392, -372092, -402778, -460017, -295442, -255447, -340520, -324693, -185261, -231221, -290860, -146156, -141370, -283, -143253, -265698, -354596, -244161, -432829, -403824, -95940, 35575, 152440]
25455A52440P3092m2955k0792N28J03302l1576j49315k2937k24300k0761R1418
25444i1856j60923k77391J58824K27246J35510o3503N7604L7855P1078j60935
25434f6491q5163R3137K04157K8879l08267M6725q06p2179l9286K34077O5924
25423A00707r5906P1149q7281o085o9913r6331J30500j2878j51766J9803K10584
25412A2583P3229L5781P2702p6616k6717Q4556P5205k06785l59778j54759J26150
25401c44449K78547J89458p6609p4119J1451j98448o2848L3451J40692J10107
25391G233j23958L6903K51878j63091l6911l526j18628l1216K53288j3806p6363
25380a8197P7175O2035L9157j20160r8218k5084K27465J08726l6003K9658j47228
$$ y = [152440, 225532, 182577, 161785, 162313, 265615, 234039, 84724, 61787, -162513, -183274, -91856, -252779, -530170, -371346, -144100, -8590, -72093, -14489, 23366, 94444, -66491, -151654, -58517, 145640, 174519, -133748, -87023, -87829, -160008, -199294, 34783, 100707, 4801, 75950, -11331, -17416, -87329, -183660, -53160, -66038, -217804, -198001, 12583, 85812, 121593, 194295, 117679, 90962, 175518, 250723, 43938, -315840, -470599, -344449, -65902, 123556, 46947, -27172, -15721, -214169, -277017, -243566, -102874, 7233, -116725, -79822, 172056, 8965, -27946, -31472, -150100, -181316, 71972, 58166, -18197, 58978, 121013, 160170, 40010, -58208, -83292, 144173, 252899, 216896, 246554, 99326]
25369I9326j77086J12649L32066J6492J89737Q0099k13773l07096J3983K00104
25359C46501K2942k4539l1038o4571k16236J1197p6143o1300k97392M3101M04605
25348E7127J51225k89371K8881J06196l23897M6082R721P0534j53062J3101O7833
25337b15630R0246J8349O6017J28039j93586J2209L5378J43655O882k1414j53140
25326h2995r409Q0480J31326j5283p9960k8619P3985K09099J28402J34818m3515
25315D98329q1115J15410j2353P5349q8842j55442k13795P8276K02124j81273
25305B36668k01070p6957p0815j02313j28885J66860j49135j67402P8199J14305
25295c00545J02138K6474J12764L4847m2720l8538J41384j40329k2225o676J46864
$$ y = [99326, -77760, 34889, 366955, 383447, 573184, 653283, 439510, 132414, 146397, 346501, 369443, 344904, 313866, 249295, 33059, 44256, -31887, -93187, -390579, -347478, 57127, 208352, -81019, -52138, 54058, -269839, -223757, -214036, -143502, -296564, -283463, -215630, -125384, -107035, -41018, 87021, -106565, -94356, -58978, 84677, 91559, 70145, -82995, -92404, -11924, 119402, 104119, 24159, -4460, 69525, 278624, 407026, 541844, 498329, 417214, 532624, 520271, 595620, 506778, 351336, 137541, 215817, 417941, 236668, 35598, -41359, -112174, -214487, -343372, -176512, -325647, -493049, -414850, -300545, -198407, -171933, -59169, -24322, -67042, -105580, 35804, -104525, -126750, -133426, 13438]
25284A3438L7941k0860J3295j32098j30802Q714K95463O7416p3310m6499q8654
25273e5956j74285q099L2539Q0782q2612J3668J40446j68786j18099J67797K37603
25262F4998M6893j42580k4077K7782N5452J51479J56871P8915k4688O8554r9335
25251C60264j37724Q5806k1241k39690j73765P0555p7039L2273n905K5855k877
25240h3488J68871J88173M2826K5240k1464j45693j19557j59497K69459J02196
25230B67066k95636l1419K3519P7811j7349J18031J24728k80914P7013j6392l94266
25219c47808L934J07777k79691q3184K05372N35336J42170o5322K8646o9981q8892
25208H8357k1443J50570q4706M9445j65822k03815J63056J34184R0485O2037j18490
$$ y = [13438, 51379, 30519, 43814, -88284, -219086, -210372, 85091, 152507, 79197, 32698, -55956, -230241, -238340, -205801, -125019, -207631, -193963, -53517, -222303, -340402, -172605, 64998, 111891, -30689, -54766, -26984, 28468, 179947, 336818, 415733, 391045, 459599, 360264, 222540, 308346, 287105, 47415, -126350, -55795, -132834, -100561, -106466, -80611, -83488, 85383, 273556, 316382, 341622, 320158, 174465, 54908, -104589, 164870, 267066, -28570, -59989, -36470, 41341, 23992, 142023, 266751, -14163, 62850, 46458, -347808, -343874, -236097, -515788, -598972, -393600, 141736, 283906, 218584, 247230, 177249, 88357, 66914, 217484, 132778, 182223, 16401, -187414, -24358, 109826, 200311, 262348, 143858]
25197A43858k97225j52521K52061K39243l0336k14182m3218j93259r415L67445
25187F2451P0052k38558j6357K15159J17368j63446j41554J68482l9573l451J0875
25176D1448J69089O045k46671l64919m7107O0080K05735n6562n8055l43N8058
25165b33202j39093M1662K11018N4382K04624P7718j68175p6989Q9738M3606j09136
25154c847j06151J85782r8727J04452m8745J0318j15784k27465J8633L0605J5842
25143b35087K13426r7878P4902P0953j50262k1780Q6980K57101j3686j11196j29306
25132e5833j55675O5153K08530J82161j22507j42388k6913j75831j01404R9960
25122b24747J22291j49057j93482O9788j11727K21559K52842K6492O7358K27586
$$ y = [143858, -153367, -305888, -53827, 185416, 155080, -59102, -102320, -295579, -304994, 62451, 132503, -106055, -122412, 92747, 210115, 46669, -94885, 73597, 34024, 30573, 41448, 210537, 216582, -30089, -395008, -442115, -382035, -176300, -232862, -290917, -291260, -233202, -372295, -330633, -119615, -65233, 139391, 217109, 48934, -28055, 61683, 105289, -3847, -109998, 75784, -22943, 81509, 32764, 43082, -72702, -300167, -281534, -250929, -235087, -21661, -119539, -44637, 26316, -123946, -145726, -58746, 198355, 184669, 73473, -55833, -211508, -146355, 62175, 244336, 121829, -20559, -47472, -223303, -324707, -224747, -102456, -251513, -444995, -375207, -486934, -265375, -12533, 13959, 81317, 308903]
25112C08903p0415p4745N7395r3032r8096l4610J08577K14991N0009k7769J9j26703
25100B14524o0560J24294k2230j37894k75762p9192K06091Q3241o2055J32080
25090A22537j03872k82909l9974J00268k5010n1588J39299O2888P6320k6324k70604
25079b98969J12566Q4326J2958P6556l1128J01544r7282J4069k22347L4722J86454
25068b6531K94535k2547j3073j41930j03344O886K4974j06343p5406P1081L5484
25057e6214r7912J3480J7928K08983J03098k0816J557N342k19736k08194R7824
25046a54660J65856J2835j02829O3862j5861r0585j18801K0597N9706L2832M3488
25035h3560o9577r2R1414j8896k6170K00808Q3811M7524l1224l8385j577L727
$$ y = [308903, 238488, 163743, 221138, 128106, 30010, -4600, 103977, 318968, 368977, 341208, 341227, 214524, 153964, 278258, 256028, 118134, -157628, -236820, -30729, 52512, -9543, 122537, 18665, -264244, -304218, -203950, -228960, -280548, -141249, -78361, -2041, -28365, -298969, -186403, -102077, -89119, -12563, -43691, 57853, -39429, -25360, -247707, -212985, -26531, 268004, 245457, 232384, 90454, -12890, -6004, 18970, -87373, -162779, -91698, -56214, -154126, -140646, -122718, 86265, 189363, 168547, 170104, 175446, -44290, -252484, -154660, 11196, 24031, -78798, -14936, -30797, -121382, -240183, -219586, -159880, -127048, -83560, -153137, -153229, -61815, -80711, -106881, 93927, 177738, 225262, 194038, 155653, 154076, 157803]
25023A57803j3210m0405p8723o9071q5217O4071R0585L6453Q2425k11831j40149
25012b07269J45841Q1531j24256Q5733K13645M8405r43j62438o697r5388L9387
25001A7551q8049L0949J91375R029j93551j4807q5082q9885L5468J68300l0313
24990d9015r0904P0805m0271J83013J11923j33781j79901k08279R4832O7521k31026
24979d05083M7719R0036j53399m1853J48087J92529Q2353n6670J50039J40914
24969A94672n4099L1813k43361j19588J88408j39950r9405j0705o0189R2580J29854
24958h9970L2664l8744Q9438j12018p6363j8932K90067J25510j77036M8815o6515
24947F916j8422j60890L0050J91372K03346J76225j73574k93303j15989P6349
$$ y = [157803, 144593, 104188, 25465, -43606, -128823, -64752, 25833, 62286, 144711, -67120, -207269, -61428, 20103, -104153, -18420, 195225, 243630, 242687, 80249, 73552, -21836, 17551, -70498, -39549, 151826, 160855, -32696, -47503, -132585, -222470, -187002, -18702, -49015, -139919, -69114, -109385, 73628, 185551, 51770, -128131, -336410, -241578, -174057, -405083, -357364, -267328, -420727, -462580, -314493, -121964, -39611, -96281, 53758, 194672, 140573, 172386, -70975, -190563, -2155, -142105, -241510, -252215, -312404, -219824, -89970, -57306, -96050, -6612, -118630, -194993, -213925, 76142, 201652, 24616, 73431, 6916, -11506, -172396, -142346, 49026, 252372, 428597, 255023, -38280, -154269, -77920]
24937g7920J18329K3312j8641q626n8862J27968r3029l09014j12622J35865Q0660
24926a92580K1663N4203j5078p5318o2083P8033Q7704j2607k2270j15303M510
24915b49126J59905J2289J70326L6692j67111M9327K05552o4149j71963k33894
24905b52152O8926m7151O9702J79828j3608j3257J01459J31222p0536j48611j25042
24894a19220l7835j47282j97373Q7587M379J79416J68940j2961K0112J16983N2091
24883A14837k7960Q143Q0170j7660j48105M8567P8622j69665j40392J32290k639
24872d3792k04882q1368M1326J80023P8328P6876j34811L2082M946j059J56746
24861A04415k3248j453J54137o2289k31827j58217P0915m151J49703O3461K8593
$$ y = [-77920, 40409, 63721, 45080, 36454, -22408, 105560, 12531, -296483, -409105, -273240, -192580, -170917, -116714, -131792, -207110, -269193, -191160, -103456, -116063, -138333, -253636, -249126, -89221, -76932, 93394, 130086, -37025, 12302, 217854, 153705, -18258, -252152, -183226, -230377, -160675, 19153, 5545, -7712, 93747, 224969, 154433, 5822, -119220, -157055, -304337, -501710, -414123, -409744, -230328, -61388, -74349, -54237, 62746, 114837, 86877, 95020, 175190, 157530, 9425, 57992, 136614, -33051, -173443, -41153, -43792, -248674, -330042, -288716, -108693, -30365, 46511, -88300, -56218, -51272, -52331, 104415, 81167, 79714, 233851, 171562, -60265, -218482, -147567, -151718, -2015, 61446, 90039]
24850I0039k40624J2052j22604j26218q6312P4440K55460J48508J36390l6555
24840A04576p8403K16992K59374p3263j48448n2903k94722k21625K48375J09911
24830F9864o4140M5291p5019J039J51078k1175R0831m5465k25101M0151R5976
24819F3330J35042n5429j90563j06216k7954J42344K69665k9991j96937j38481
24809a35190j34967J06448J82525K94387o0615j51649j14439O0157j27129j25189
24799b05661j18153K2581K28740O5025q7854J4283m758J42067p6036j03654K50958
24788A27538n6839m2339k32347o1796O5896R9165J21994n7398j50181J2840J44380
24777b9087j13255j40019M2093J40091O0667r5209q16J73567L44960O3836j02096
$$ y = [90039, -150585, -138533, -261137, -387355, -473667, -399227, -143767, 4741, 141131, 104576, 26173, 243165, 502539, 429276, 280828, 227925, -66797, -288422, -40047, 69864, 5724, 51015, -24004, -22965, 128113, 106938, 197769, 152304, -72797, -32646, 63330, 198372, 142943, -47620, -153836, -181790, -39446, 230219, 200228, 3291, -135190, -270157, -163709, 18816, 313203, 252588, 100939, -13500, 46657, -80472, -205661, -323814, -301233, -72493, -7468, -95322, -81039, -85797, 56270, -19766, -123420, 127538, 70699, 28360, -203987, -265783, -199887, -100722, 21272, -36126, -186307, -173467, -29087, -142342, -282361, -240268, -100177, -39510, -134719, -135535, 38032, 382992, 446828, 344732]
24766C44732n6632k89704j62206j51877n692O9111m7636p6367L7433J35683n6819
24755b59974R2385k53794m2237L45329J10484j37233l8820p3079Q1938J46301
24745b8700J33059r5630L7975L6536l5739K8174q1765Q1881m113J28009J1702
24734B11389K7962k05671p237o2600J80489J74449m9129j06087J2093J25736n7672
24723B43722k96917q9364J803R1769j51872J87165m1417K6203R173p7630k85072
24712c82437j05386J89258J75417J18591n4441K8595j04865J44052L30209O0181
24702C99174j50403j53486J02444K4492j11031N1519j5356l83626j19744k6056
24692c82073Q8961J6995J0429J36446K38646j08668J63179J5133N8613m2485k34534
$$ y = [344732, 288100, -1604, -163810, -315687, -321379, -252268, -299904, -376271, -338838, -203155, -259974, -167589, -421383, -463620, -118291, -7807, -145040, -183860, -256939, -175001, -28700, 104359, 8729, 46704, 83240, 47501, 75675, -6090, 75791, 71678, 199687, 211389, 239351, 33680, 26443, -36157, 144332, 318781, 269652, 163565, 175658, 301394, 243722, -53195, -142559, -140756, -48987, -200859, -13694, -55111, -28908, -19735, -97365, -382437, -487823, -298565, -123148, -4557, -58998, -30403, -135268, 8784, 338993, 399174, 248771, 95285, 197729, 222221, 111190, 162709, 147353, -236273, -356017, -382073, -293112, -276117, -265688, -129242, 109404, 736, 163915, 179048, 237661, 195176, -39358]
24681c9358r244o9952j54709l2207K42470L63234k6290K8607J4921j28584O5960
24670B54848o50q4197j74739J43609r6859j12591N0680L5253J38218J04834K4720
24659B83126j1924j04889P9756r2645q9994J21143k5551k23432R5257r0079j01974
24648a61206J78363J62759j83073Q4701J04823N173o7379k65291j29214L14486
24638D4142K08526j9933l10684m0979P6119J20607m11J10942J20415k5179j42573
24627A40992k89374l6886n235K6309n6023L6596N0927n730j5824j06689L6671
24616b24266K05311P0896j82443N7499l3549n9585J8755J6947J5637J49097L7134
24605G1433K50219K10390m0758l44103k42247r0949j31153M8389K57211J72725
$$ y = [-39358, -48602, -118554, -273263, -305470, -63000, 300234, 273944, 302551, 317472, 188888, 254848, 254198, 170001, -4738, 138871, 42012, -70579, -19899, 15354, 153572, 258406, 283126, 271202, 166313, 246069, 153424, 63430, 184573, 159022, -64410, 30847, -59232, -161206, 17157, 179916, -3157, 81544, 186367, 191540, 124161, -141130, -270344, 44142, 252668, 232735, -77949, -118928, -42809, 77798, 77387, 188329, 308744, 283565, 140992, -148382, -185268, -190503, -164194, -220217, -183621, -132694, -138424, -154248, -260937, -224266, -18955, 51941, -130502, -73003, -106552, -166137, -147382, -130435, -114798, 34299, 71433, 321652, 532042, 491284, 147181, -95066, -186015, -317168, -268779, -11568, 161157]
24595A61157J50949j86055o0044R9188j69731R0744l50Q0343j74415n6566J6736
24584d8044P9969Q2927J11499k6494M6486j8512K3953O9647m2521J19874j16563
24573B82221k91563r4212l7693j01197J1485J57805P3773j48932q1868R6497k9116
24562a62800j07394J00296Q7731o7075O6561R5100J82487m6008j14408q6971M0805
24551a1676J33852J2983k26337j53341J67373K87653K8309j33600j12701J98338
24541A90853j37341j9651k13219k3815j1037M6020K51728Q8217L2615J53165j56769
24530B00766P9951l8630j87554j75059j638j28586l5077J79978J52452q0985N6071
24519B1689j06961q2256j28930p2824P403J17952J83266k860q8420m5413j1226
$$ y = [161157, 312106, 126051, 66007, 165195, -4536, 86208, 85858, 166201, -8214, -64780, -48044, 31925, 114852, 226351, 199857, 246343, 227831, 251784, 321431, 278910, 398784, 282221, -9342, -103554, -141247, -242444, -230959, -73154, 619, -148313, -230181, -133684, -162800, -270194, -169898, -82167, -149242, -82681, 12419, 194906, 148898, 34490, -52481, -11676, 122176, 135159, -91178, -244519, -77146, 210507, 238816, 105216, -7485, 190853, 53512, 33861, -179358, -203173, -214210, -168190, 83538, 171755, 204370, 357535, 200766, 280717, 242087, 54533, -120526, -122164, -250750, -285827, -105849, 46603, -34382, 21689, -85272, -167528, -296458, -369282, -361879, -243927, -60661, -63521, -151941, -197354, -208580]
24508b08580O9095l9105j84807M0660l5897J59293J49896J37393j35413o9721
24498a17186m2815N3439J65511K02598k5871k39239k46732q071r9389K18382K51927
24487A12554j05468O4879J5392J81437m3127j91549j90146J68511J54414K5672
24477A92569J04870J64609j04459n5335K0068r9673o7822m4982j46322j08072
24467a44549K14541J58186j35996K64325m7625j20466M111p2807Q4935L923j52551
24456E6027J25816j65280j29107p1488o9526p7625J54796J71294K84511K540k44744
24445C7214k2850l9568R368r7586M6871J34470J06649j03634j91842J4122J8428
24434h8358m2173J52430R242j27669J73620L9899k2746j76439p9792L15497L0729
$$ y = [-208580, -139485, -178590, -363397, -322737, -358634, -199341, -49445, 87948, -47465, -117186, -160001, -106562, 58949, 261547, 235676, -3563, -250295, -258366, -357755, -139373, 112554, 7086, 71965, 87357, 268794, 225667, 34118, -156028, 12483, 166897, 192569, 297439, 462048, 357589, 302254, 322322, 222649, 154827, 109845, -36477, -144549, 69992, 228178, 92182, 356507, 308882, 188416, 192527, 119720, 204655, 208578, 56027, 181843, 16563, -112544, -184032, -253558, -331183, -176387, -5093, 279418, 281958, 37214, 14364, -25204, -15836, -113422, -66551, 67919, 174568, 70934, -120908, -106786, -88358, -130531, 21899, 31141, -96528, 77092, 116991, 94245, -82194, -161986, 153511, 184240]
24423A84240j50656j17799n3497J45860O2280m4723J95964j43283j72055L3200
24413f0469N141N6138J02649q18J28375p6970L6839J56663l6469L5692q0504q1132
24401A85135j7224J6096j6633R8397K5497j13900O5400M0109r9423L7413l2384
24390A88483j48286k49052O7848Q7353J18246n2282j84960k8545Q529L5468o4837
24379b22035j1173J38479J6121M5996L0203J7788j11052O0079J41903o2404K2402
24368F6307J17638q4643j48627m3362q0015M4581J66057M4940j79987N0909J9649
24357b6553n607K7749n1922l1169J5041m7248P3079j18077R6584J6075p1065j18987
24345b42100J33611M8966r4859k5210L5374K8647Q3306K1651n5771P7704R3780
$$ y = [184240, 33584, -84215, -137712, 8148, 70428, 25705, 221669, 78386, -93669, -60469, -55328, 810, 103459, 102641, 231016, 154046, 190885, 347548, 311079, 346771, 266267, 185135, 167911, 184007, 167374, 265771, 291268, 177368, 242768, 282877, 183454, 220867, 188483, 40197, -208855, -141007, -53654, 64592, 12310, -172650, -201195, -192666, -157198, -222035, -233208, -94729, -78608, -32612, -2409, 15379, -95673, -35594, 106309, 43905, 66307, 183945, 99302, -49325, -92687, -172702, -128121, 37936, 82876, -97111, -46202, -26553, -32160, -4411, -56333, -87502, -72461, -119709, -46630, -164707, -68123, -52048, -123113, -242100, -108489, -59523, -154382, -179592, -144218, -115571, -32265, -10614, -66385, 11319, 105099]
24334A05099j28377j32739Q0982r2334j36716M8583J84484N0122j06457P4871
24324e2482J02592j63401M5422J08267K48116m1899o9557m6850o8913P7817j06563
24313C2549P5424J84926J46772m6226j20455j32556k54384r6500l5279R9N3473
24302a92157Q286O6052J14311J06728n9637n1284J40267p4243j09001j45258L95
24291a95541j27033j6906J64607K52861O3950Q8513j00312K1838N4069M3636k0698
24280B28984j12443R1118n6523k21957k08855j14999J83605K30088J8223k6681
24270A0560j65287q3160K2094J79191o4880k49270n5963K64871K74602j11453
24260B1305L9299R2671n151P4989J60508j55791J36756J99516k92922j53511j02771
$$ y = [105099, -23278, -156017, -75035, -167369, -304085, -255502, -71018, -20896, -127353, -52482, 50110, -113291, -67869, 40398, 288514, 246615, 177058, 130208, 61295, 139112, 32549, 107973, 292899, 439671, 393445, 272990, 140434, -113950, -210450, -245729, -245630, -192157, -183871, -117819, -3508, 103220, 43583, -7701, 132566, 58323, -50678, -195936, -195541, -322574, -339480, -174873, 77988, 141938, 230451, 130139, 151977, 206046, 249682, 228984, 116541, 207659, 151136, -70821, -279676, -394675, -211070, 19018, 37241, 10560, -154727, -237887, -215793, -36602, -101482, -350752, -406715, -141844, 132758, 21305, 60604, 153275, 148124, 223113, 383621, 227830, 364586, 564102, 271180, 117669, 14898]
24249A4898J22194J42373j88886j10801j30028R5609J75508M0687n5388M0576
24239A46742j87716j67274K00834M6983J30576r1348q0206r8941R78K28049K6725
24228A55402j48579j92775q401r0759j41148k4810R3321J50334J32437J1883l06778
24217c69873J19273L48608M0503k5385R1618k76640l07606N6594J43190k3803
24207b03521j4696j4108q7192k31104k3119K33689L35703J81786j64312r4431
24197h1305p9251O3709m7960Q6491j9371J31656o1630j50348l1771Q9278J15265
24186A4763j0207q0008J45488O9760k32758k8450J76686n0973K6603P0468J12327
24175B13699p7305q9350k7763R6812j7005k31332J99888q4429j0825K03217j02934
$$ y = [14898, 137092, 279465, 90579, -20222, -150250, -54641, 120867, 161554, 106166, 146742, -40974, -208248, -7414, 39569, 170145, 78797, -1409, -100350, -99372, 128677, 155402, 6823, -185952, -194353, -285112, -426260, -451070, -357749, -207415, -74978, -63095, -369873, -250600, 98008, 138511, 113126, 204744, -71896, -379502, -322908, -179718, -203521, -218217, -232325, -319517, -550621, -573740, -340051, -4348, 177438, 13126, -81305, -160556, -96847, -144807, -58316, -77687, 53969, -7661, -158009, -189780, -100502, 14763, 4556, -75452, 70036, 139796, -92962, -121412, 55274, 4301, 30904, 101372, 213699, 136394, 47044, 19281, 116093, 99088, -132244, 67644, -16785, -27610, 175607, 72673]
24164G2673K7752J5197J82623Q3668P142L1415j42067p7500J75826K2888j76743
24153B22874j53925j49482j9791n643j19580j73894M6351J79032j12724o2247
24143c49029m3562K57290j4353n5425j8766N1320K7816J55144q6164Q0034j61985
24132a57680K0627m30q0891K80329m950l74792j87527Q4462Q2041j77294j318
24121e17423L00191J14625J11184P7849j5628k72925o4684J7339J43555L3397
24111g2520q6757K23232J7909q2017R0460J97498j09969k01826j17268K16173
24101G4915j1750j79836j90029O70P8960j21200j31882R8195J01440J2731K36935
24090c0851R7957n4306m5077j53118J54021J28854P4097k30683m1135l3239j00408
$$ y = [72673, 100425, 115622, 298245, 381913, 389055, 420470, 278403, 200903, 376729, 399617, 222874, 68949, -80533, -100324, -105967, -225547, -399441, -353090, -174058, -286782, -349029, -392591, -135301, -149654, -205079, -223845, -172525, -144709, 10435, -75729, 4305, -157680, -137053, -137483, -218374, 61955, 57005, -317787, -505314, -420852, -338811, -516105, -517423, -217232, -102607, 8577, 86426, 70798, -202127, -266811, -249472, -105917, -72520, -159277, 63955, 81864, -153, 90307, 287805, 177836, -23990, -141258, 74915, 63165, -116671, -306700, -306030, -227070, -348270, -480152, -381957, -280517, -267786, -30851, 67106, 12800, -32277, -185395, -31374, 97480, 171577, -59106, -100241, -133480, -233888]
24079b33888O5375J45083n1696N5072j01808R3774l869M1734p6490r1134r9146
24068b56993j07293J74964K37531j11176l2078M3191Q4939O3836l1726J09703
24058A74898J19592j22753j34833j56931M4065K3124J56209j04568o4805K3321
24048d2681l2088r7440j29609q4210R8725J86000J46984O6038p0629J07235R892
24037A58217m6479k0944K14756p3570k97595k5875l6963K7371J12169j1178o6481
24026f6572M6826K3428l5602J52040n8894R9796L4378o6910j64149P0731m5451
24015a0379R486M9713n9217j96569K1677Q9671P4008P2111p9954j40126M4666
24004a24913j44390Q9420J72139O2717j41467K7363J2776J07449J03656Q697k17621
$$ y = [-233888, -168513, -23430, -75126, -20054, -121862, -28088, -31957, 9777, -66713, -157847, -256993, -364286, -189322, 48209, -62967, -95045, -51854, 33085, 96921, 65195, 174898, 294490, 171737, 36904, -120027, -75962, -52838, 103371, -1197, -66002, -42681, -74769, -172209, -301818, -386028, -287303, -101303, 45681, 111719, 41090, 148325, 158217, 111738, 90794, 305550, 231980, -65615, -91490, -128453, -101082, 11087, -91, -66572, -19746, 3682, -31920, 120120, 61226, 161022, 195400, 128490, -35659, 35072, -10379, -893, 48820, -10397, -206966, -185289, -95618, -21610, 50501, -29453, -169579, -124913, -269303, -179883, -7744, 54973, -86494, -59131, -46355, 61094, 164750, 173447, -44174]
23993d4174j00840J76378j9412k3903m5809K78188J27094j15254j3783k766j80851
23982C4868M7919j5085K0570J7332R6784L9064k13870n4088K27111K60074j81410
23971B79269l09442o5156K4400q055p1424M630J18487j2848q6841p227m8735m3980
23959b26922J4272K25924j18580n6694K13315J42842j9856j30361k06308j27426
23949b89794Q4889K59760J81988p623N1661k5561p6046m5179r9088m0566J59738
23938A54179J54495J61613P3707k34369O843l2234j56936k39359L4472k3743J07667
23927F335K7571K76364Q2281j5101O0917k10615j20068K4812k9640J6407j11896
23916G367p7010J02265P8205n8089j16281l8863m906J78932Q4354k6481J67999
$$ y = [-44174, -145014, 31364, 11952, -11951, -57760, 220428, 347522, 232268, 218485, 215719, 34868, 82787, 67702, 88272, 105604, 202388, 241452, 27582, -26506, 200605, 460679, 279269, -30173, -95329, -70929, -78984, -150408, -145778, -27291, -40139, -126980, -134207, -182942, -226922, -212650, 13274, -105306, -162000, 51315, 194157, 174301, 43940, -162368, -289794, -204905, 54855, 236843, 229220, 280881, 255320, 179274, 134095, 35007, -5559, 154179, 308674, 470287, 543994, 309625, 316468, 284234, 127298, -112061, -77589, -101332, 6335, 33906, 310270, 392551, 377450, 438367, 227752, 107684, 132496, 102856, 119263, 7367, -69643, 32622, 110827, 52738, -63543, -102406, -107312, 71620, 155974, 129493, 297492]
23905B97492P8464O4921j14645k04011P9962Q4334j05412j54748r9425p3118k542
23894a48728P4930R764m9966J80424j10779k86368J90778J9632j81610l9078R5873
23883b45128J00892K07469J93037J17403o1703o1874j80254q5300J05998J01838
23873A92378j0567n8158P7307q5358p5717L6275r895n3853j44010j24273j52386
23862d08257m8239J39862O3375j6942m8278J66040K7953Q8013r1723N705J64771
23851D2280K29623J4856N3530j64716j58039k23013m8966p2721J20657R7837o7223
23840a75895l5807m9885K07897l1291O7118N0680p2014J87676J08620j28749J11014
23829B39364j06308L8227P2778j52539k20139n9041K029l5636M4574j92863J02738
$$ y = [297492, 375956, 440877, 326232, 122221, 202183, 286517, 181105, 26357, -73068, -146186, -148728, -73798, -64034, -114000, 66424, -44355, -330723, -139945, -120313, -301923, -341001, -245128, -144236, 63233, 256270, 373673, 311970, 250096, 69842, -15458, 90540, 192378, 181811, 123653, 200960, 115602, 39885, 76160, 66265, 12412, -131598, -255871, -408257, -456496, -316634, -253259, -270201, -318479, -152439, -124486, -36473, -128196, -122491, 42280, 271903, 286759, 340289, 175573, 17534, -205479, -254445, -327166, -206509, -108672, -175895, -211702, -261587, -53690, -84981, -17863, 32817, -39197, 148479, 257099, 128350, 239364, 133056, 171283, 244061, 91522, -128617, -187658, -185629, -221265, -176691, -369554, -266816]
23818b66816J85889j5358J27632J6549J52892J39454j98275j00194K11657J3921
23808B67351q1401k3382J16969j3745n6354j34356J5282J19089J32756j01919
23798B40290j9968P4919k8513N0220p6351j41077j66315q9012J20499P971k18862
23787b46199O9627n5J16206m0150j82296l96901N7891L11668J81936O7784J9341
23776d1148L428Q4386K7654l959k39667j76269r5219j43927l4496K25686K118
23765c91413J16180O3654m4265R3184K06834l0657o6162j43874L02942J56164
23755B62587o3143k39416J47835O6077j31336L1292L2636K4331k1428q340j40818
23744c9723o7167K8009Q6245j59118K6469L2566J21724n8117j4477N6074j55904
$$ y = [-266816, -80927, -96285, 31347, 47896, 200788, 340242, 141967, 41773, 253430, 267351, 185950, 162568, 279537, 265792, 209438, 75082, 90364, 209453, 342209, 240290, 220322, 295241, 266728, 316948, 240597, 99520, -66795, -155807, -35308, -27337, -246199, -176572, -176627, -60421, -100571, -282867, -679768, -621877, -310209, -128273, -60489, -41148, -37720, 46666, 74320, 70361, -169306, -345575, -440794, -584721, -619217, -393531, -391413, -275233, -211579, -255844, -162660, 44174, 13517, -52645, -196519, 106423, 262587, 199444, -39972, 107863, 173940, 42604, 73896, 106532, 130863, 109435, 101095, -39723, -106890, -78881, 7364, -151754, -125285, -92719, 29005, -29112, -43589, 12485, -143419]
23733a43419l5716n7148N0689J74022N2330N0291m8485j48052o1845j84383K5288
23722c26428L54793O4858J5167J1982J66542j31102Q5998j01621j07350j59977
23712a27138j05974m7088n6163k5818J23435j00384N9159J39855J11842Q0857
23702E2583k22162M7414J91640N6319J13132n808j78976j06702P842j10954k28035
23691c83707k6921J66976K7509l6220J4018o7421J58356M1170j15485M6238N8611
23680a16876j98402j85762R0428K15268N6026K7625L0607k5078m2063J48690O1864
23669F2327r3070K565Q0568R1959k83139r4664J51385J20979O8389J73650J05092
23658C86041j18610r6590j79579j04045J40400L1813r6283r8671J7526J02968
$$ y = [-143419, -179135, -236283, -185594, -11572, 40758, 91049, 42564, -105488, -167333, -351716, -326428, 28365, 93223, 108390, 120372, 286914, 155812, 241810, 140189, 32839, -127138, -233112, -280200, -336363, -362181, -238746, -339130, -279971, -140116, -28274, 52583, -169579, -122165, 69475, 125794, 238926, 233118, 54142, -52560, -44718, -155672, -383707, -410628, -243652, -216143, -252363, -238345, -305766, -147410, -106240, -221725, -175487, -116876, -315278, -501040, -410612, -195344, -139318, -111693, -81086, -106164, -148227, 463, 62327, -30743, -28178, 52390, 144349, -138790, -233454, -82069, 38910, 107299, 280949, 386041, 267431, 170841, -8738, -112783, 27617, 59430, -36853, -135524, -117998, -15030]
23648a5030k3241j79575L6706J01232J6506j21387r647N1573R1103O3941j57748
23637a45567J58853K493m9900M2352j43641J30146k4306o5955M5262J62117m1468
23626G0386q564M0677J9050L3634M6746j82781j32094P674J14352R9612o9075
23615C9617p3147N0372j2895O960j03973j09721J63616p0837j54940j48849J88643
23604b25154K47804n7390j0N3554r4178k24825K4015K18731O6038J24264J54394
23593B87243k6587j35709Q3366J13951O1053r5693j232j9872q8695Q8587l95531
23582a29119k21979K9153n5559J26608K31135M4453K521k91992j57275J23946
23572b98108K10482J21092J723o1136J58889M5103k01497J69636j4995j27667
$$ y = [-15030, -38271, -217846, -181140, -79908, -63402, -184789, -194436, -142863, -51760, 12181, -145567, 13286, 15779, -34121, 8231, -135410, -5264, -29570, -95525, -50263, 111854, 70386, 61822, 102499, 121549, 155183, 201929, 19148, -112946, -105272, 9080, 108692, 39617, -33530, 16842, 3947, 10907, -93066, -202787, -39171, -110008, -264948, -413797, -225154, 22650, -34740, -34750, 18804, -75374, -300199, -276184, -57453, 8585, 132849, 287243, 260656, 124947, 208313, 322264, 383317, 287624, 286392, 266520, 177825, 266412, -129119, -351098, -321945, -377504, -250896, -19761, 24692, 27213, -264779, -422054, -298108, -87626, 33466, 35189, -25947, 132942, 178045, -23452, 146184, 131189, 3522]
23562C522o6761N5901j31059j07930o857M4243K41554J98864k69652j26930o9434
23551b34539R6225J91459L3097L0225Q5152j3517l0494p3023j79743J67195K25998
23540B98035n6000j69157k53927j90012K48270q4170n4010k3995J01465R4589
23530h8912p2775p1637J98960N7194J8077k05951j07071n5871J01138L9103J70664
23519a7081Q3342J41474J02490k68657j5836L2719j1344K8674O6378q248j59099
23508b5188l41115R005J71255O110j49026R3299J18367j8859N4013p307P6428
23497a3018N6769j35386O7587K4076j30330M7624q1447p5545m8583k95259J05270
23486d78242J83485K2283N1816L02369J24289k53090p4237j11413J00475J49590
$$ y = [3522, -63239, -7338, -138397, -246327, -253184, -208941, 32613, 231477, -38175, -165105, -234539, -138314, 53145, 86242, 116467, 201619, 188102, 157608, 84585, -95158, 72037, 298035, 242035, 72878, -181049, -371061, -122791, -206961, -260971, -284966, -183501, -88912, -161687, -233324, -34364, 22830, 40907, -165044, -272115, -327986, -226848, -187745, -17081, 66261, 207735, 310225, 41568, 25732, 58451, 47107, 75781, 142159, 133911, -25188, -366303, -357298, -186043, -179933, -328959, -235660, -117293, -136152, -82139, -89446, -13018, 43751, -91635, -24048, 28, -130302, -82678, -164125, -239670, -288253, -583512, -478242, -294757, -272474, -220658, 81711, 206000, -47090, -121327, -232740, -132265, 17325]
23476A7325l0627j97266l0906o0742k5319K32945k3641o4268K75848L06512J75333
23465E75194j26729k21197j51988M4319N8290N9589k7501j5153M6571K2958k42354
23454B1999l2594J18574J48252K0212k10042j39447M4321k9622j1481Q9039J45911
23443A65122j37493j08634J0876k8020o3283j46607p1920P7484O1927K56203M9417
23432F5072j7901L7463K4379m1733r9240j97281j49247J55818N3923R0767n4104
23421a32084p4753M4209P180K34549p3365J0059J22257j85989J81585k8671j76515
23410g1538J03644r426J79923J87769P2917k53015m67507j43035K05926K06899
23400A2557J303j60441Q8715k7967p0063j00405o8521k568q495Q009j1089J50759
$$ y = [17325, -13302, -210568, -241474, -302216, -327535, -94590, -118231, -182499, 93349, 399861, 575194, 448465, 227268, 75280, 119599, 177889, 237478, 209977, 194824, 241395, 264353, 21999, -10595, 107979, 256231, 276443, 66401, -73046, -28725, -58347, -69828, 19211, 165122, 27629, -81005, -70129, -98149, -161432, -308039, -379959, -302475, -240548, 15655, 65072, 47171, 84634, 109013, 67280, -31960, -229241, -378488, -222670, -168747, -77980, -132084, -206837, -162628, -155448, 79101, 5736, 15795, 138052, -47937, 133648, 104977, -71538, 32106, 22680, 202603, 390372, 463289, 210274, -257233, -400268, -194342, 12557, 13860, -146581, -57866, -85833, -155896, -256301, -324822, -327390, -335885, -327876, -338965, -188206]
23388a88206L7782m1078j54737J35519J84733Q8980R9285K0290j83931j51147
23378a52510K23426J30694j84583k3377p5333q000J96105Q8490j53492J12943
23368A54363M6892n3367r1631M4550m2869q1569L6311j90096k25718l43432J31543
23357f15023J96220L1314N3180o1960R3838J52249r55p2196o6681J12843R7258
23346g9913P2109Q5478n7541j22851K69483J47675j09082j88772j2578J3796k4953
23335g149o2712K2521J492k15725q5136L49600J57700j95439p5544r9914L0021
23324a80285k5510J92180J73533J97612p2261k51632o791j47906J5716J01486
23314c858R9054q0788J74811L14207L2650j71346j03929k01070K6972q8084r9654
$$ y = [-188206, -150424, -191502, -346239, -210720, -25987, 62993, 162278, 182568, -1363, -152510, 70916, 201610, 17027, -6350, -81683, -89683, 106422, 194912, 41420, 154363, 201255, 147888, 56257, 100807, 57938, -23631, 12680, -177416, -403134, -746566, -615023, -418803, -387489, -334309, -396269, -302431, -150182, -151137, -223333, -290014, -177171, -79913, -7804, 77674, 20133, -102718, 166765, 314440, 205358, 16586, 4008, 17804, -7149, -69861, -47340, -45848, -261573, -346709, 2891, 160591, -34848, -110392, -210306, -180285, -205795, -13615, 159918, 357530, 285269, 33637, 26846, -121060, -105344, -3858, 95196, 14408, 189219, 503426, 536076, 364730, 260801, 59731, 86703, -1381, -101035]
23303a01035j258j4888m530K05035j19574k10928r1475j2190R3178j5970J62696
23292a10939J22498j22631m9878J35558j95335q8324J2226J84391J34953l0600
23282h081m278k28267J58482J8985j95991j27770K11218J38918J24979P6901j72543
23271g447p8900J1409j4850J3245k4744M7794l433j79719o3131J53061M0946p7365
23259a83134j0922J39214J31607j9925l5030R0047J3155k74343r1937N2297j9391
23248b08362J2352M5683O7205q9793k1822N1741l1440j746L4558j2995j51346
23237c05965K1616J29482J16977M4373j11351N5258J86516J08316K7818o3126
23227B09914r1774j06288O482L10263J46870m17371k05117Q5434J37954M1697
$$ y = [-101035, -102293, -117181, -121711, 83324, -36250, -247178, -338653, -350843, -257665, -273635, -110939, 11559, -111072, -160950, -25392, -220727, -309051, -296825, -112434, 22519, -8081, -12359, -240626, -82144, -63159, -259150, -386920, -175702, -36784, 88195, 165096, -7447, -86347, -74938, -89788, -76543, -101287, -53493, -56926, -236645, -299776, -146715, -105769, -183134, -194056, -54842, 76765, 56840, 21810, 111857, 125012, -149331, -241268, -188971, -208362, -196010, -150327, -83122, -172915, -194737, -142996, -174436, -176182, -141624, -154619, -305965, -284349, -154867, -37890, 6483, -104868, -49610, 136906, 245222, 273040, 209914, 118140, 11852, 18334, 328597, 475467, 58096, -147021, -61587, 76367, 118064]
23217A18064q1833l27521o1297J18735N2816R4369K08765O9794k82870m0669k5558
23206a57205Q9147K7271q9425N9279J65225K12851o1731L9755j46722j68002J88359
23195A58802J32755q8637p1302J47362q198j82514l9097O1017j75140q7663J95962
23184D3347J88448o9297m8211j60494J6390q1908J72367K10481j6258l480j3399
23173B37986j5599p1851o5953M3873j29534k64786k5252J45636m5170j69815K75089
23162h5376J54261O2721R2447K9119M0207M0795m76178k20373J50730J36986L2120
23151d2541j60760j41925J90682N2454l6667j35223J7744L8193J47593P7956M5622
23140E3128j93094n9384K73870j2851N782o7281K3829m4161r9419k00347J06387
$$ y = [118064, 36231, -291290, -352587, -233852, -181036, -86667, 122098, 191892, -90978, -131647, -157205, -68058, -40787, -130212, -70933, 94292, 307143, 245412, 285167, 138445, -29557, 158802, 291557, 202920, 131618, 278980, 270782, 88268, 49171, 110188, -64952, -152615, 43347, 231795, 162498, 114287, -46207, -29817, -111725, 60642, 271123, 254865, 251385, 237986, 222387, 150536, 84583, 128456, -1078, -265864, -291116, -145480, -190650, -360465, -85376, 68885, 131606, 224053, 253172, 293379, 334174, -142004, -362377, -211647, -74661, -42541, -203301, -345226, -154544, -102090, -138757, -273980, -256236, -218043, -70450, 7506, 53128, -139966, -199350, 74520, 61669, 67451, 170, 23999, -20162, -119581, -319928, -213541]
23129b13541L725K24177J16936l2358o7970J08137q6238k54259L2053r281K54624
23118G6005J15160k31214j49645j83685J42035K89841P1808M565j44825l3426
23108d3381m7632J00480J7867o7519O2014M4682N7328j57501k5689J60282P8893
23097A79824j11469l58593j05080J64908J14900k18979r2815J56711K65317J75284
23087A70008k4657N1818r8275r2470J2508k3633j51820j55009n2014J73472J31069
23076e9003Q9735K24173J59292Q0239r3197j51086j82499k23605n7522J20271
23066i3202q5876j34499P7317R4084j25286J06383K79886J1332K4719l3945l1502
23055H9411M3133j7408n955J06939j017j03532j5971j91114j05494L1045m1761
$$ y = [-213541, -209816, 14361, 131297, 98939, 30969, 139106, 52868, -201391, -169338, -178619, 76005, 191165, -40049, -189694, -373379, -231344, 58497, 130305, 134870, -9955, -43381, -91013, 9467, 27334, -40185, 21829, 66511, 123839, -33662, -59351, 100931, 179824, 68355, -290238, -395318, -230410, -115510, -334489, -427304, -270593, -5276, 170008, 145351, 197169, 98894, 6424, 18932, -4701, -156521, -311530, -363544, -190072, -59003, 30732, 254905, 414197, 494436, 401239, 250153, 67654, -155951, -213473, -93202, -179078, -313577, -236260, -142176, -267462, -161079, 118807, 130139, 154858, 120913, 89411, 132544, 115136, 109181, 216120, 215103, 111571, 95600, -95514, -201008, -169963, -211724]
23044b11724K13988O8086l4587J12562J64915J02765q3476m6349K52192n4734
23034D83638k14781n0705p0968J26889O5044N8051M4373L2573k98565q2485J169
23023I4233K070p911j17576j71146M3904O5630P3445L6327k6275N6596N157k9809
23011B4645O9328L77565j6031n2905J7434k04953j43110J7638q3648P3423J20413
23000A99799j07920J72574K33763p4907r6386k77489j42690l0505M2716k196k8774
22989a12015j33766J67625j1754J35177J30942Q2627q298r8984j46649j17062
22979a12157K65363K17569J31974k10896k01308L5969R7874R658N5422K16715
22969E06183k03312l60560m7586P6395l1825Q9505K01958n5318k19535l74679
$$ y = [-211724, 2264, 70350, 35763, 148325, 313240, 416005, 332529, 286180, 538372, 483638, 268857, 218152, 147184, 274073, 339117, 397168, 441541, 474114, 175549, 93064, 94233, 96303, 88392, -29184, -200330, -156426, -90796, -17351, 18976, -7299, 49297, 54454, 24645, 93973, 471538, 455507, 402602, 420036, 215083, 71973, 89611, 5963, 79386, 199799, 91879, 264453, 498216, 423309, 326923, 49434, -93256, -123761, -81045, -83241, -112015, -245781, -78156, -89910, 45267, 176209, 258836, 250538, 151554, 4905, -112157, 153206, 370775, 502749, 291853, 90545, 126514, 224388, 234046, 289468, 506183, 302871, -57689, -105275, -28880, -60705, 28800, 230758, 175440, -44095, -418774]
22959d18774j61978L8182K38706K60346J27793J32025j43213q8308j53466k01040
22949c69727l8341Q6919J54304j49169K1394K99078R9653P3744k36713k72206
22939c31064J2010J21218L9922j17500j23413O9466P9874r6252K1493L8385O6708
22928b19153O4827J46498R0789J04072j71969n4181K17558m87m8592L9079n374
22917A63067J5531R8373k18082k34210j00063N0071P9449j20904J27807J51990
22907A3029L8099M9965j72769p1050j13488m7986L2226L6497j44518k17950p8410
22896f76355J68263L55302Q3177N4247J50088l5781J37835p1231j66521j22591
22886a23567p8401m293J39670L8678R2686k0277j0603m8581r890n9181L3715q794
$$ y = [-418774, -580752, -542570, -303864, -43518, 84275, 216300, 73087, -15221, -168687, -369727, -408068, -321149, -166845, -316014, -294620, 4458, 104111, 177855, -58858, -331064, -319054, -197836, -157914, -275414, -398827, -329361, -249487, -345739, -324246, -285861, -219153, -154326, -7828, 82961, 187033, 15064, -39117, 178441, 177954, 129362, 168441, 163067, 178598, 276971, 58889, -175321, -275384, -225313, -145864, -266768, -138961, 13029, 51128, 101093, -71676, -142726, -256214, -304200, -271974, -235477, -379995, -597945, -676355, -508092, -152790, -69613, -15366, 134722, 98941, 236776, 165545, -976, -123567, -201968, -206261, -66591, -27913, 64773, 44496, 33893, -14688, -24578, -83759, -50044, -58838]
22874e8838Q4868l8660K52218j11224J14272q3004j55343q8987J5449p9542k4133
22863a72924P5979O360J24575L0922J7688j11888k11847k4878K63943k4001k51030
22852b77101k07105m263L22325L75480R2455k59287m47074j51067L355K00987
22842c51295J70708K4646J44319J23436K5185l3147k51908r3323L9028p1736k5904
22831b99991K49481K67186j74819o8573r553p809N2234j40429m336J60528j90481
22820a66562j73535P4818L37181n8226M4373J98675m0628k43186r4432R2005P548
22809b1969O905m6719K937L9806p214p2161J94756J88134P7195J18389L5072m86337
22797B8794j66200Q5612M0367Q7187K00157M6318j56268j08762j45578Q3634j9163
$$ y = [-58838, 26030, -12630, 239588, 128364, 242636, 159632, 4289, -84698, -69249, -148791, -172924, -96945, -90585, 33990, 64912, 82600, -29288, -241135, -266013, -2070, -26071, -277101, -484206, -488469, -166144, 209336, 301791, 42504, -404570, -555637, -552282, -351295, -180587, -155941, -11622, 111814, 136999, 103852, -148056, -241379, -202351, -274087, -299991, -50510, 216676, 41857, -26716, -36269, -44078, 8156, -132273, -136609, 23919, -166562, -340097, -265279, 71902, 13676, 58049, 256724, 216096, -27090, -121522, -29517, -21969, -15064, -61783, -58846, -19040, -26254, -98415, 96341, 284475, 361670, 480059, 515131, 28794, -137406, -51794, -11427, 75760, 275917, 322235, 165967, 57205, -88373, -4739, -23902]
22786b3902o9458J8638R6317J77448K46087L819r5497k75567j2708J85719K2313
22775B73209j26837k37747K36363J01248j93294r0374k29944o8394m4245O039
22765c73976L5786J98843J39511L6005j52600j8041J4284j22771K293K09216O2964
22754C1514J78409k7639j4013k09129j48583j09K1860o7634J28124K0682J17816
22743C1298J23727n8357k9882J577q4893j83410j59575Q9294J56479j23354j80030
22732d17126p1963J66191R5919K15001J56385j7366N2370j55068j54312K44090
22722A14121O1647q9611p0718j3276J27526l8962r1084j15208J39681J91664j22383
22711I3397O3969j35643k88280N0793R0268K06083K63815J25361j92628l61055
$$ y = [-23902, -93360, -74722, 21595, 199043, 445130, 448949, 353452, 77885, 65177, 250896, 273209, 146372, -91375, 144988, 246236, 52942, -37432, -267376, -335770, -380015, -373976, -338190, -139347, 164, 36169, -116431, -134472, -120188, -242959, -240666, -31450, 31514, 209923, 182284, 168271, -40858, -189441, -189550, -167690, -235324, -107200, -86518, 31298, 155025, 96668, 66786, 68363, -16530, -199940, -359515, -270221, -113742, -237096, -417126, -489089, -322898, -226979, -11978, 144407, 127041, 179411, 24343, -129969, 114121, 175768, 86157, 15439, 2163, 129689, 90727, -357, -115565, 24116, 215780, 93397, 157366, 21723, -266557, -215764, -125496, 80587, 344402, 469763, 277135, -83920]
22701h3920j41402R0544o9736O5035j01760J11058J65730J40145O9102p5196q4225
22690H5375j14401Q4947K25585o1965j48102n6711Q478J13632j54449M8250j8962
22679A1677J0056p0046j48101l2301K1542J00503J90688j6094o3044r2916j2241
22668a00277R2002m0567K6487j21299j46495O5546N2699k17566L3945K51172J41551
22657C7198J45521J09523p3063l36865o6824K59615K8454l4752J57623j40044
22647H6386Q4957l8172N542O3978j67616Q6347j63206j00409J02803k69941p0074
22636c79405K20191l6629k53691L7949M6274m8164J63781M4359m1472j3486J16739
22625a43554J08663j9863j35126j5931k5248R9446N7112q5658J76P5798Q2621
$$ y = [-83920, -225322, -134778, -204514, -139479, -241239, -130181, 35549, 175694, 244796, 169600, 85375, -29026, 55921, 281506, 219541, 71439, 14728, 23206, 136838, -17611, 30639, 11677, 21733, -48313, -196414, -228715, -207173, -106670, 84018, 67924, 4880, -88036, -100277, -8275, -48842, -22355, -143654, -290149, -224603, -171904, -389470, -355525, -104353, 37198, 182719, 292242, 219179, -117686, -184510, 75105, 103559, 68807, 226430, 86386, 171343, 133171, 138713, 202691, 35075, 121422, -41784, -142193, -39390, -309331, -379405, -159214, -195843, -449534, -411585, -365311, -413475, -249694, -205335, -246807, -260293, -143554, -34891, -54754, -189880, -205811, -231059, -131613, -74501, -160159, -159983, -84185, -1564]
22614a564M6265m8224M8852k3748j25170l6861k10141J24335J67072J55918j23139
22603b6405j63731m3884J42584J61155K813j03002K0970m9675o2101K02997k008
22592G9713J8215Q8290N7858K619j5519k2974K6298J6320j61075J3984l07196
22581b03467j26658Q5989l0517Q9328m4722K92200J45776k88766r2682O8407M2846
22570f2266O7862Q8382j1366m6952R4638O3761p698J01810J18595k67914j75187
22559c6335O8696J11582R9465j6072j36712J28105K00825N6120n9319n3446J79834
22548E42743n1507l84738j62610N2283L6612R7172j52889l51452R1786K48383
22538c4217o2417k76432q4565J09314J80255J65740L1469j81898O0826J13743
$$ y = [-1564, 44701, -3523, 45329, 21581, -103589, -140450, -350591, -226256, -59184, 96734, -26405, -190136, -234020, -91436, 69719, 72532, -30470, -9500, -59175, -121276, 81721, 79713, 97928, 186218, 244076, 246695, 231176, 208202, 234500, 250820, 89745, 103729, -203467, -330125, -244136, -274653, -185325, -230047, 62153, 207929, -80837, -173519, -105112, -62266, 5596, 93978, 82612, 35660, 130298, 194059, 186361, 288171, 406766, 138852, -36335, 32361, 143943, 243408, 227336, 90624, 218729, 419554, 475674, 416355, 362909, 542743, 491236, 106498, -56112, -3829, 32783, 129955, -22934, -374386, -282600, -34217, -96634, -373066, -457631, -348317, -168062, -2322, 29147, -152751, -91925, 21818]
22528B1818J04168l6788J28051n2186k29293r4452J20945K86249k2689R8664L0107
22517C54594j27990r6359m7071O4063j8374m4593n3586p3145K08227J22978J3725
22506C02469j43553k09128O3603J1529M4239R4354J4012j37877p8375j6961J7321
22495c8367j69828j35310J49884J65057r4590J57204o7191j20041P5652N6723
22485b0807p1846j33647P492J25883R3398O3425n8019N4564L0810R2434K04325
22474C88012M8760k09191k08820l4416R7724K40098N975k13769O0361p5622o3449
22463C5663m1624J37489j54523p6575K13773j65316l9695L42757J10794k30285
22453A32458J27054n0930l0249O9467l1545n3699K04843J02500l64252k55760
$$ y = [21818, 125986, 89198, 217249, 165063, -64230, -158682, -37737, 248512, 225823, 324487, 354594, 226604, 130245, 83174, 147237, 128863, 84270, 30684, -42461, 165766, 288744, 302469, 158916, -50212, 13391, 24920, 69159, 163513, 177525, 39648, -38727, -55688, -38367, -208195, -343505, -193621, -28564, -123154, 34050, -33141, -153182, -77530, -20807, -92653, -226300, -218808, -92925, 473, 63898, 5879, 60443, 91253, 183687, 388012, 436772, 227581, 18761, -15655, 82069, 322167, 328142, 114373, 174734, 99112, 35663, -5961, 131528, -22995, -99570, 114203, -51113, -90808, 251949, 362743, 132458, 259512, 208582, 178333, 247800, 216255, 162556, 367399, 469899, 105647, -150113]
22443a50113N2574l9945Q2163L983n3462r1067o1475J95023J83209J52894q1589
22432A92195J8532N3816j68582r2523r9553J22903L3285j54735K8606L9500j04405
22421a30961p44r0925k9607J41470M6161L2912l7569r7565k068Q2569r967J13721
22409A7427J56171j02793k7596N6559J4025M2472j91499l6837Q2288j0535m8538
22398d8856n2460n9886K2849J4458K48936N3252p2590j25820j67762J73444r156
22387b3591p2151q8274o727M9571j64345L3284J85979P1077n2365O7233R5088
22376I4779Q506j26285k781J6463N3919J07212j40344j14667J20128K11147k4977
22365B03100J48981J63337j44453j43810N8912j06758r8836L6436n7236q3483
$$ y = [-150113, -97539, -137484, -55321, -51338, -104800, -195867, -257342, -62319, 120890, 273784, 192195, 210727, 264543, 95961, 3438, -96115, 26788, 60073, -94662, -66056, -26556, -130961, -131705, -222630, -252237, -110767, -64606, -31694, -69263, -166828, -168896, -86327, -96294, 17427, 173598, 70805, 43209, 99768, 113793, 156265, -35234, -72071, 10217, -318, -48856, -101316, -161202, -138353, -123895, 125041, 178293, 105703, -20117, -187879, -14435, -23591, -95742, -184016, -190743, -141172, -305517, -272233, -86254, -15177, -67542, -309, 94779, 103285, -23000, -25781, -9318, 44601, 151813, 11469, -103198, 16930, 228077, 203100, 352081, 515418, 370965, 227155, 286067, 179309, 80473, 116909, 59673, -23810]
22355b3810j97557o4870q7931J13570L66028K01685n9688k00920j5635n3524P3467
22344E0815R7870n13M2864j5042j15036j21266j41093J71190J08683k8037l073
22333D7362k51798m1677Q9289K35017L18531J07761l6326L6032R1170k21230j82098
22322A92033J16009p5952p5447l2524K5762P4145J13592o408j71962j94890k5106
22311f0748j8807j03715P7695J05886J3186j51006n657L11310P0968o3855J21087
22300B96344j64268j51824N7948K01944J72534J26671J8311n9342k80056l33104
22290a14842o5013N6876N8255J49940j94003k33504J02366J66525J83658k0599
22280H9659J66153Q861K86017J36443j83899k5375J49234j28088l13523q997J2395
$$ y = [-23810, -221367, -286237, -374168, -260598, 105430, 307115, 247427, 46507, 30872, -22652, 50815, 148685, 148172, 191036, 175994, 60958, -60308, -201401, -30211, 78472, 50435, 47362, -204436, -246113, -156824, 78193, 396724, 504485, 468159, 504191, 595361, 374131, 192033, 308042, 232090, 156643, 124119, 149881, 224026, 337618, 331210, 159248, -35642, -60748, -79555, -183270, -105575, 311, 13497, -137509, -143166, 168144, 239112, 175257, 296344, 132076, -19748, 38200, 240144, 412678, 539349, 557660, 498318, 218262, -114842, -179855, -122979, -64724, 85216, -108787, -342291, -239925, -73400, 110258, 89659, 255812, 264673, 550690, 687133, 503234, 477859, 627093, 499005, 185482, 176485, 188880]
22269A88880Q4405j9277k1033m8785J49958M7618k64072k65120J70319J68575
22259A91468q966J2046J3133L0170k24724O0474N5482Q9230r710p2694O4906o5743
22247A35072J28653K7495m873J088j42743j01846l426J20913K73925j44944k16049
22236G3265J06723M00271K68099J73439K53041M7019K92975L65644M71449M60798
22226B912723L91826K41339R1527p3989k78935m72811o41115l06378n10937l46517
22216A006733l60301l7150k05736k79224j9115M3652j48831P571R4693K0978N6560
22205A79830o2256n722L4606j34494k9680K0054m5180m8006P6402o832J25100
22194A03822Q4560J81097J55078j20477o5449M3102j49074J8437p6760R4581l366
$$ y = [188880, 273285, 254008, 232975, 184190, 334148, 381766, 117694, -147426, 22893, 191468, 182502, 194548, 207681, 237851, 13127, 73601, 129083, 218313, 208603, 135909, 200815, 135072, 263725, 291220, 286347, 287435, 144692, 42846, 39420, 160333, 434258, 289314, 73265, 179988, 580259, 848358, 1021797, 1274838, 1321857, 1614832, 1980476, 2451925, 2912723, 3304549, 3545888, 3637415, 3563426, 3284491, 2811680, 2170565, 1864187, 1353250, 1006733, 646432, 609282, 403546, 124322, 105207, 148859, 28, 7599, 102292, 123270, 179830, 117574, 111852, 146458, 11964, -17716, 2338, -42842, -90848, -14446, -21278, 103822, 188382, 369479, 524557, 404080, 338631, 381733, 232659, 251096, 174336, 268917, 265551]
22183B65551J1368j79067j43255J27731J6334j07411j09099R9487q4328J64972
22173F2283N1970p0520l624j79700R2694n9898J6821N4797m0678K04921O316j96761
22161f1379J35340J45556k598j86900j42564k1166K4636R7905l1539r3401J75483
22150C9373L19389j47498j17673J13063j97611k80732M8515J80333J49672q1219
22140B5612k83739r4998K92092J02533J15111j36482j08325j29812K4414J55735
22130c7859q6967j11257O0928J90188K96909J83422k37562k43093M2690j39062
22120h1663k07998L2122L39088K52716K3506j60226p3698k27853o7776K16593
22110D4811n530p1213j07894l30J896L55604J46390p9378L673n9226l4922o7363
$$ y = [265551, 276919, 97852, -45403, 82328, 98662, -8749, -117848, -18361, -102689, 62283, 114253, 43733, 40109, -139591, -46897, -106795, -89974, -35177, -75855, 129066, 135382, -61379, 73961, 219517, 216919, 30019, -112545, -133711, -109075, -11170, -42709, -136110, 39373, 358762, 211264, 93591, 206654, 9043, -271689, -223174, -42841, 106831, 25612, -258127, -353125, -61033, 41500, 156611, 20129, -88196, -218008, -193594, -37859, -124826, -236083, -175155, 15033, 311942, 495364, 257802, 14709, 57399, -81663, -289661, -257539, 81549, 334265, 357771, 197545, 123847, -104006, -171782, 44811, 39281, -31932, -139826, -140156, -138260, 217344, 363734, 284356, 288029, 228803, 193881, 126518]
22098A26518k15336r2708J40560J48505j7412j8033N692j46525j75513K1208K67495
22087D4451J30099k18569p435J3936j83517Q9064K00370L9451j8100J3214J18200
22076B21164J7377l74596l41455J64432O6323L4903K03370J00561J93878R1568
22066C77525J36209q5527j21889j25119J02393K50693R719K3450k02099p6209
22056B89146O0075j30324J3213P7941Q0876n9863n4585j96972l7429M3947k039
22045H3986J8969P5586j61388K36288r7016k03135P9825J46364P6340j17164p6223
22034F2432p6409m8002L9433K20534O6769j4954p943j57549P9228J30393K18335
22023E12267O2397k91781l02689L7579K3254j23420n4936J18659P9897o1247P3776
$$ y = [126518, -88818, -181526, -40966, 107539, 90127, 72094, 77786, -68739, -244252, -223044, 44451, 174550, -44019, -51454, -37518, -221035, -131971, 68399, 107850, 89750, 102964, 221164, 238541, -136055, -477510, -313078, -246755, -211852, -8482, 92079, 285957, 377525, 513734, 428207, 306318, 181199, 283592, 534285, 544004, 567454, 365355, 289146, 349221, 218897, 232110, 310051, 390927, 331064, 276479, 79507, 42078, 86025, 83986, 102955, 178541, 17153, 253441, 156425, -46710, 33115, 179479, 255819, 138655, 62432, -13977, -61979, -22546, 197988, 264757, 249803, 241860, 84311, 163539, 293932, 512267, 574664, 282883, -19806, 17773, 41027, -82393, -137329, -18670, 61227, -20, 73756]
22012G3756Q1892n8028o4664j1398K2666q5748j32548j00520q2949J54253J49944
22001e3344N1275K7219K9240j16310j92412k427K56089J98887O8995j64595j13509
21990a0892J06170K6521J5395l782R277J23150J14917J71020N6334j65300m2760
21979D00050L831q3016r951J20324k48897l7698J74242j23550j95232J30249J1783
21968A42135j0836q629J24330M3416j52098J22429M4361j44188l16880J45441
21958a0519R1863p7229l9965n9295j02923o484n6429K51504J26502J34265K0673
21947B71963k39275J12746L08417J26114j3733k5242l2883k30140q9123o5473
21937A23371J85577m2877k98313p9115N4796j23026J51043J75282K39888j45515
$$ y = [73756, 155648, 97620, 32956, 21558, 44224, -41524, -174072, -274592, -357541, -203288, -53344, -2069, 25150, 54390, -61920, -254332, -256759, -670, 198217, 267212, 102617, -10892, 95278, 121799, 137194, 133412, 142689, 265839, 380756, 551776, 608110, 442810, 400050, 403881, 320865, 310914, 431238, 182341, 144643, 318885, 195335, 103, 130352, 142135, 131299, 122670, 247000, 290416, 138318, 260747, 305108, 160920, -155960, -10519, 81344, 4115, -35850, -95145, -198068, -204552, -260981, -9477, 117025, 251290, 271963, 32688, 145434, 453851, 579965, 566232, 540990, 508107, 277967, 188844, 123371, 308948, 266071, -32242, -111357, -56561, -179587, -28544, 146738, 386626, 241111]
21927B41111j35402k15741K25855J74412M6388q7896L8574J76091J7851L6395
21917E17638n0318j77966R9481J56377k5679j59939j5754N3220o7432N28j53743
21906A76413J7090K76178O9511j5123q227j12457J20929N3064K2711j56287k29633
21895B14169o4566k6658M646P1547l8352J18355m2156j41181J00198J79280J39838
21884E15120j66780l09811q8202K09902J44772M7339j73322p9574m4780j51102
21874i6438o0232J38281J0214Q8598r0922J7185K8478l2418l2040L7366O5238
21863G3310K9857j38617O5372K21347j8185K3676j55029j8419J93680J94832m7196
21852D24628j76655m6699Q4726K54241J15273l0240l06829j15536J41942J60539
$$ y = [241111, 105709, -110032, 115823, 290235, 336623, 248727, 287301, 463392, 481243, 517638, 467320, 289354, 388835, 545212, 519533, 359594, 343840, 397060, 329628, 330156, 176413, 193503, 469681, 539192, 524069, 515842, 403385, 524314, 577378, 600089, 443802, 214169, 149603, 122945, 127591, 199138, 160786, 279141, 236985, 95804, 196002, 375282, 515120, 348340, 38529, -49673, 160229, 305001, 352340, 179018, 99444, 54664, -96438, -156670, -18389, -8175, 80423, -10499, 6686, 35164, 2746, -29294, 8072, 73310, 103167, -35450, 29922, 251269, 233084, 256760, 101731, 83312, 276992, 471824, 424628, 247973, 201274, 286000, 540241, 655514, 625274, 318445, 202909, 344851, 505390]
21842E05390j43219j20317j33046O2086j72257j29416j310J02319L20451J73397
21832D64078J47125m6776k3928j44220J07598R8992j01482k99683k22578L58761
21822C37887L24114J60647k38527m0378J31386j06502j42116J33517J26003J13983
21812H00014j35835k09431P5922M0515k29267K17137J11590j95805j08540j68559
21802A97741N1899J46315J00371j99084r7451M4730j19370K259J10986M20586
21792F58982J73330k55000J8179J89559o6705p6241m7180j37968o0627j20761
21782B75568J62666J53098n0926k3748p858L9889j18493O578J46709k31419L460
21771C55524J14998q9167P7785J51250R5250K2163P2885j0566j80174j26316J62788
$$ y = [505390, 362171, 241854, 108808, 170894, -1363, -130779, -132089, -29770, 290681, 464078, 611203, 564427, 540499, 396279, 503877, 602869, 501387, 201704, -20874, 337887, 662001, 822648, 584121, 543743, 675129, 568627, 426511, 560028, 686031, 800014, 664179, 454748, 530670, 571185, 341918, 559055, 670645, 474840, 366300, 197741, 249640, 395955, 496326, 297242, 199791, 244521, 125151, 127410, 238396, 658982, 832312, 577312, 595491, 785050, 718345, 642104, 594924, 456956, 396329, 275568, 438234, 591332, 540406, 516658, 508800, 548689, 430196, 436774, 583483, 352064, 355524, 470522, 381355, 459140, 610390, 705640, 727803, 800688, 790122, 609948, 483632, 646420]
21760F46420J31054L3469J09696q3703o8996K83428J9521p5647J7818l33987j31750
21749E47323j18741q2680L23963M40505J44967L2914m2303j73585K28765J37562
21739A438690j00942O6706N8101K4017J46157p6777q3510k9656p919j07967j6325
21728A310575L61270J82396L4027q2888j61301M1612K56188K02296j62368o6388
21718A915419R1618J31802j20902p7799J90186K28453J14779J30333l6645j10519
21708B456725L01567L67435L27354K81608K47940M66707K45179K54272J20864
21699E069651O9174L69790N70621M95019M26202L76986J51995O1041J39016M26339
21689H155834L19240J32477K57959M54105P01576O32626O08571Q18393R88424
$$ y = [646420, 777474, 810943, 920639, 836936, 767940, 1051368, 1070889, 995242, 1013060, 679073, 547323, 428582, 345902, 669865, 1110370, 1255337, 1288251, 1245948, 1072363, 1301128, 1438690, 1337748, 1404454, 1462555, 1486572, 1632729, 1555952, 1472442, 1442786, 1434867, 1326900, 1310575, 1671845, 1854241, 1888268, 1805380, 1644079, 1685691, 1941879, 2144175, 1981807, 1915419, 2007037, 2138839, 2017937, 1940138, 2130324, 2358777, 2473556, 2603889, 2567244, 2456725, 2758292, 3125727, 3453081, 3734689, 3982629, 4449336, 4694515, 4948787, 5069651, 5138825, 5508615, 6079236, 6574255, 7000457, 7377443, 7529438, 7590479, 7729495, 8155834, 8475074, 8607551, 8865510, 9319615, 10021191, 10653817, 11262388, 12080781, 13069205]
21680A3069205J423067J953664K407920K551576K645471K909500L590118M142595
21672C4693116N050225O301217Q326590J1027705J5793485K3781960L5926781
21665A40901079M7911969N0592043M0564816K2928364P513896L584278Q747156
21658C22743601R200495k587069k0862816l6292983m1782091l5664531k5704487
21651A69050119j5997536o009769N662835K1238420M2363515O7836386Q4561842
21644C68705812P4567833L2817164k1883670o3015679p6716098p0709076n7865005
21637A85901281m5094700l3425650k3627215j6356358j1496005q579647o739672
21630D0582034n222138l879755k861811k009052j648992j506104j468296j900464
$$ y = [13069205, 14492272, 16445936, 18853856, 21405432, 24050903, 26960403, 30550521, 34693116, 39743341, 46044558, 54371148, 65398853, 81192338, 104974298, 140901079, 188813048, 239405091, 279969907, 302898271, 310412167, 313996445, 322743601, 331944096, 329357027, 308494211, 272201228, 230419137, 194754606, 169050119, 153052583, 147042814, 152705649, 173944069, 216307584, 284143970, 368705812, 443273645, 476090809, 454207139, 391191460, 314475362, 243766286, 185901281, 140806581, 107380931, 83753716, 67397358, 55901353, 47321706, 40582034, 35359896, 31480141, 28618330, 26609278, 24960286, 23454182, 21985886, 20085422]
21622B0085422k292004k052824j574947j378030j299038j245943j021026q51735
21614H369875o92572k53193j94064j13173J32977J67271N7299p02874q18731q35533
21604E117282p82120m91697l44723m13905k81370k26106j28631k17979l12218
21595A918533K6113N1443l9315q6684l15109N77J20475J19125r7259k13979K4895
21584A508815P7676j23373j25979J32060q7344l27202l36865J6202J3120Q6670
21574H33780l52376l5145J31813J21339k351j59392N9274l9595K38287j06625
21564F89009p0332k6226j6962j42784n8414L2388p5659J74161n9492r6169o7607
21553B81913m9117o6529j44049j3797J06395L0198q4960m8336K16250K35932j8518
$$ y = [20085422, 17793418, 15740594, 14165647, 12787617, 11488579, 10242636, 9221610, 8369875, 7677303, 7424110, 7230046, 7116873, 7249850, 7417121, 7474420, 6771546, 5952815, 5117282, 4335162, 3843465, 3498742, 3084837, 2803467, 2577361, 2448730, 2230751, 1918533, 1944646, 1996089, 1956774, 1870090, 1554981, 1555558, 1676033, 1795158, 1697899, 1483920, 1508815, 1586491, 1463118, 1337139, 1469199, 1381855, 1054653, 717788, 733990, 747110, 833780, 481404, 446259, 578072, 699411, 697060, 537668, 596942, 557347, 795634, 689009, 618677, 592451, 575489, 432705, 374291, 406679, 331020, 505181, 445689, 349520, 281913, 232796, 166267, 22218, 8421, 114816, 145014, 60054, 11718, 227968, 463900, 445382]
21542D45382j47013j69340J60906J5137k11042N4649O08j84384J08444J3866Q3535
21531A70748J22331j08942k5072Q3251j06292L0510L2070L2856K51946m4162j52047
21520B87197r5835J23825J6454k44655m9036K32670q4470r489j84547j16595J22655
21509a826K29669R8725L6729J18133j69628j89449J377j00607k24449L7889J23540
21498c9897R8612j09325j77158J07064K99072J13620K5238M0855M8735L5356j8370
21487D23802p8059k34794n2527P5791J89026l2977l5181k17101m18136k4696k9839
21476d34691k3601l0542Q2206J38943O4986J19827j6874j73336Q5355J99907J10157
21465A22337J33415k3448N143J54605k1076j25015n0355m7676J04870n1735J3907
$$ y = [445382, 298369, 129029, 289935, 305072, 94030, 148679, 149287, -35097, 73347, 87213, 170748, 293079, 184137, 159065, 242316, 136024, 166534, 198604, 231460, 483406, 439244, 287197, 191362, 315187, 331641, 86986, 37950, 270620, 186150, 176661, -7886, -124481, -1826, 227843, 326568, 363297, 481430, 311802, 122353, 123730, 23123, -201326, -163437, -39897, 58715, -50610, -227768, -120704, 178368, 291988, 317226, 358081, 406816, 442172, 423802, 345743, 110949, 58422, 134213, 323239, 290262, 255081, 37980, -380156, -404852, -434691, -458292, -488834, -406628, -267685, -202699, -82872, -99746, -273082, -187727, 12180, 122337, 255752, 232304, 237447, 392052, 370976, 245961, 195606, 147930, 252800, 201065, 214972]
21454B14972j94927K8032J69524l3181j14099J1408P5383j80604j19220j27926
21444b70638j38821J0031j8001j59002R4193J09375Q3709L8863K90577j67139
21434a26853j62166L0152N5010o3338k89539j05494J30688K20047k155J71475
21424a42173L52364P7329m9180n8167N4395r7774p7950K4539J1198j91299O0874
21413c5844j34803j16748q3469J24369J28106J09785k8992K2790m0326J36335
21403H1203J78100k8424p0232k25622p8832N6490N4097K8854p1409j6264l2486
21392a24525q0555j48754L3332L4049r1640K09199J91150K69517Q2468j3127j89123
21381A71991M5639j7450P9465j35841j05431p8824R14K751O6050J3942l28673
$$ y = [214972, 20045, 48077, 217601, 184420, 70321, 81729, 157112, -23492, -142712, -270638, -409459, -399428, -417429, -576431, -482238, -372863, -289154, -250291, 40286, -126853, -289019, -258867, -203857, -267195, -556734, -662228, -531540, -311493, -313648, -142173, 210191, 287520, 238340, 180173, 234568, 136794, 58844, 83383, 94581, -96718, -35844, -170647, -287395, -370864, -246495, -118389, -8604, -37596, -14806, -55132, 81203, 259303, 230879, 160647, -64975, -143807, -87317, -33220, -4366, -75775, -92039, -124525, -205080, -353834, -320502, -286453, -378093, -168894, 22256, 291773, 374241, 361114, 171991, 217630, 200180, 279645, 143804, 38373, -40451, -39537, -36786, 29264, 43206, -285467]
21370b85467K1632J85957K8032n9585M793r68j86373J01701J26857p461k31867
21359c02749m4935l9728r2204O3109R4603J7756J73873J14159l6344R5718j73127
21348a29869l43596m20013J77087K03731J79717J93680K34205L8302j53723k12015
21338b32494j78399P1529L86890J28030l8215K1911j39124k01894J11402J12865
21328D2501J4509K85035p0706k16042o2046J03939R0019n3299L083m6295P3951
21317A64649P8446K60362N7030m2510J2861r6783R1775o9669j29582Q3711Q1868
21306D92158j18983j5146j80421j50427P6106N7856J37809O2698j44639O6480
21296B83491L38497J09363j06438l00982l23017j76713L583j09095J57617J74640
$$ y = [-285467, -263835, -77878, -49846, -109431, -104638, -105606, -291979, -190278, -63421, -70882, -302749, -347684, -387412, -479616, -416507, -321904, -304148, -130275, -16116, -52460, 43258, -129869, -473465, -893478, -716391, -512660, -332943, -139263, 94942, 133244, -20479, -232494, -410893, -339364, 47526, 175556, 137341, 159252, 20128, -181766, -70364, 42501, 57010, 342045, 271339, 55297, -6749, 97190, 187209, 133910, 136993, 90698, 164649, 243095, 503457, 560487, 517977, 530838, 434055, 525830, 456161, 326579, 410290, 492158, 373175, 358029, 177608, 27181, 103287, 161143, 298952, 361650, 217011, 283491, 621988, 731351, 624913, 323931, 914, -175799, -172216, -281311, -123694, 50946]
21286E0946Q796o8103J31331L02268l34919j10307n6249L6047J8921J27381j03034
21275C078j0497K6555M4902k3015N0550j57301M2537L52303r8937R6639k2463
21264C04351m0492j14534k9841M1447Q0368N0924M6023j09764l7894J01533j01104
21253A91017P9923O7594L7291O9677K3017M1520l82893l91420q942Q314K11964
21242e2938R1915k28301J35610K2086o1901L6514K2036J28533L5283j9596O1206
21231A70447o1085k35543q6566Q5156m3154k8518K12559J02112q0109j12401M3810
21220c3292L1680m8246j44546k2137M6237L3133k54022Q9083J86935M9700k4231
21209h9706K4308j59661P5831K20731J83155j30262j14239K6463L694J38774m3633
$$ y = [50946, 59742, -8361, 122970, 425238, 90319, -19988, -76237, -40190, -21269, 106112, 3078, -7419, 19136, 64038, 41023, 91573, -65728, -23191, 329112, 230175, 326814, 304351, 263859, 149325, 119484, 160931, 241299, 292223, 338246, 228482, 190588, 292121, 191017, 270940, 338534, 375825, 445502, 468519, 510039, 127146, -264274, -273216, -264902, -52938, 38977, -189324, -53714, -31628, -93529, -57015, -34979, 93554, 128837, 109241, 170447, 109362, -126181, -212747, -127591, -170745, -199263, 13296, 115408, 35299, -77102, -33292, -1612, -49858, -194404, -216541, -170304, -137171, -391193, -302110, -115175, -65475, -89706, -65398, -225059, -149228, 71503, 254658, 124396, 10157, 36620, 40314, 179088, 135455]
21198A35455j98318N529j03060j0975k5329l3993q843k12164l7636Q6287o044
21187d09091J32489O1399j19202K93167K39050j85505k49573J48960R4637j42194
21177a35863J24242K78613n1158k37508R5507L1760K6869j36820l5234l9468k65401
21166c44461q64P6925J68579j53153N4751J61162M2503j29051j17969N9300j24267
21155c06545j7315L48169J00625j63419J17809K04776p4184k83827q0750J72157
21145A7496j27428k36208Q2189n1107j969J03880J21699p8617n9062J44079K62180
21134A77132k00913k07501R8492M5076L8792R1879j9168j21949j22593P094J09643
21123a04016M4748o5390J77167Q9158k69874r5464P6552j06793J77699j42649
$$ y = [135455, -62863, -57334, -160394, -171369, -196698, -230691, -239534, -451698, -489334, -403047, -409091, -276602, -215203, -334405, -41238, 197812, 12307, -237266, -88306, 6331, -135863, -11621, 266992, 215834, -21674, 73833, 105593, 132462, -4358, -39592, -79060, -344461, -345325, -268400, -99821, -252974, -198223, -37061, 5442, -123609, -241578, -182278, -306545, -323860, 24309, 124934, -38485, 79324, 284100, 209916, -73911, -154661, 17496, -109932, -346140, -263951, -315058, -317027, -213147, -91448, -170065, -229127, -85048, 177132, -23781, -231282, -132790, -87714, -48922, 42957, 23789, -98160, -220753, -213659, -104016, -59268, -124658, 52509, 141667, -128207, -223671, -147119, -253912, -76213, -218862]
21113b18862M0385P7815m2451O0011j41084J4919K80238K36438J5377j99271m2907
21102H0608Q3237J12928J0183j34250O3391R6088K99591p4382R324K11706L79115
21091A137539N7499K4520L70100O9811J35615o5994k09849j18933k12013l48165
21081H40130n3894M4523j47576m10360k59079n1959J07240l5910L9437m729J4938
21070H2761j10618N3489R9607M5553j8123k4124J92312K34436K4174J8161J32542
21059G30170L99662M07862M11746M05338m8410k52441l13647m46520m40061k8635
21049H25064M8569k58892k12520n3324n5416P1561J27404P0113q0159j00492j65097
21038B16811J03981J0882R3695k25506r1480o4499k2963J2332Q4673j19444R669
$$ y = [-218862, -178477, -100662, -143113, -83102, -224186, -209267, 70971, 307409, 322786, 123515, 80608, 163845, 276773, 286956, 152706, 216097, 312185, 611776, 537394, 546718, 758424, 1137539, 1195038, 1219558, 1589658, 1659469, 1795084, 1729090, 1519241, 1400308, 1188295, 840130, 786236, 830759, 683183, 272823, 13744, -38215, 69025, 33115, 72552, 67823, 82761, -27857, 25632, 125239, 170792, 152669, 128545, 320857, 555293, 579467, 597628, 730170, 1129832, 1537694, 1949440, 2354778, 2306368, 2053927, 1740280, 1293760, 853699, 825064, 873633, 614741, 402221, 348897, 293481, 365042, 492446, 562559, 482400, 381908, 216811, 320792, 331674, 425369, 199863, 108383, 43884, 20921, 33253, 117926, -1518, 8151]
21027H151j39600Q9570L44169J6801j40895j11089J31300O8511j69269j14336
21017a6687k79555N567K16715J34927j14317Q3857o0457l70076O7215M9497j9508
21006c02822M160j62420J539J72111Q8414P2954N3284Q93j92126J24614J13430
20995b5969l92097J5324K30695J49516J21545J2695q1639L9219O1207o1424p3349
20984d277M3132P8614j09140L696j9287M6809m5744k21099Q4702J45272J84879
20973A87557o0341j35761O9335j36847R6345J78442K3178p6066j71254J55586
20963A30174K05956l3049j80063j06652J10663N396R0065n4616j71019K41777
20953B38632J88925n9385j31115k96098l60753J02199K19169J45744j25691P4213
$$ y = [8151, -131449, -41879, 302290, 319091, 178196, 67107, 198407, 266918, 97649, -16687, -296242, -290675, -73960, 60967, -53350, 30507, -29950, -400026, -332811, -283314, -302822, -298662, -461082, -459543, -287432, -199018, -126064, -72780, -71887, -264013, -139399, -25969, -418066, -402742, -172047, -22531, 99014, 111709, 30070, 69289, 130496, 69072, -4277, 38855, 117469, 8329, 12025, -7262, 39547, -6197, -227296, -142594, 2678, 187557, 127216, -8545, 60790, -76057, 20288, 198730, 221908, 145842, -25412, 130174, 336130, 303081, 123018, 16366, 127029, 132425, 222490, 167874, -3145, 238632, 427557, 368172, 237057, -59041, -419794, -317595, -98426, 47318, -78373, -4160]
20943d160Q4043J48617P5966j43669n9040K1641O9131j17498k7990l7249p3482
20932f3690O4122N709Q3979Q7779r0872o0232l1594l1909j74420Q8925J76343
20921E4140Q7835J09722n0604j23596k7335M1341J19162J1753k85166J34279J10498
20910A82029Q409k4917n6105k6498J28746J57438R0544N636j19198l4063q8331
20899B23690n4405J6469L4314J13681k6354K7373j91170q9166r3301p0253l1897
20888a41019J16601J71904K3628o905o753J05432K11078n5798k16053O2113K07645
20877D71873m0793j8140p0642k10262j6214Q7743N122L4830J51447L0201j10752
20866C14413r0401j10594r4430L665M8781O3727N7006J80387P6541l2859q6089
$$ y = [-4160, 79883, 228500, 304466, 160797, 101757, 123398, 192529, 75031, 47041, 9792, -63690, 432, 6141, 90120, 177899, 87027, 26795, -4799, -36708, -211128, -122203, 54140, 141975, 251697, 201093, 77497, 50162, 91503, 210665, 222418, -62748, 71531, 182029, 190438, 165521, 109416, 82918, 211664, 369102, 459646, 465282, 346084, 312021, 223690, 169285, 185754, 220068, 333749, 307395, 334768, 143598, 54432, -38869, -109122, -141019, -24418, 147486, 171114, 164209, 157456, 262888, 473966, 418168, 202115, 264228, 471873, 431080, 412940, 342298, 132036, 115822, 203565, 208687, 243517, 394964, 425165, 314413, 224012, 113418, 18988, 22653, 71434, 135161, 192167, 372554, 449095, 416236, 330147]
20855C30147K6403J07380m9518j35312j30031J59377k7618j1124K39571J63562
20845F72837k69465o0473J36763O9461L0797J70384k25231j52740J55341J6571
20835E44245R1692j20214J28358J75624j44885K5887J29537o8167k8229O4487
20825G98335K83931R5148K9519r8929m5967L44042M40244J78300j20620J05630
20815B009633Q2142M67907N20693L50479L32344O2045L50187K33627L12749L50083
20805E071889N24606Q11114M74955P59119Q77598R56531J301862J768819K507891
20796A5054384L572750M734233O960568R475247R782748P444215N696399Q094273
20788G0814817J3135149J5430641J1955850M818810p33817j272742K175003M692739
$$ y = [330147, 356550, 463930, 414412, 279100, 149069, 308446, 280828, 269704, 509275, 672837, 403372, 342899, 479662, 549123, 579920, 750304, 525073, 372333, 527674, 544245, 635937, 515723, 644081, 819705, 674820, 700707, 830244, 762077, 733848, 798335, 1082266, 1177414, 1206933, 1108004, 1062037, 1406079, 1846323, 2024623, 1904003, 2009633, 2091775, 2559682, 3080375, 3430854, 3763198, 3825243, 4175430, 4409057, 4721806, 5071889, 5596495, 6407609, 6882564, 7641683, 8519281, 9475812, 10777674, 12546493, 15054384, 18627134, 23361367, 30321935, 39797182, 49579930, 57024145, 62720544, 70814817, 83949966, 99380607, 111336457, 116155267, 115421450, 114148708, 116323711, 121016450]
20780A21016450J812131n508945j1984006j3667462j0187413p018787p554164
20773F6907804r777225j0806341r229788p117273n587177m587397l315137k395220
20765A4092246j602504j240639r09877n18901l56476m81981n65235k99624k94086
20756G822923J0991O744j7746R9362R1937K46105J94584K28409L47615P03432
20746I734356J012733J075901J555507J953227K734213L613427N184865Q002639
20738C4866868J0626548J0130388P056081N659581R622718J5549615J7415910
20731A10927709J1804939K687853k743963j511932L323986N189408J152406p208804
20723A23621602j3968911j4734499j0570503p406078q144951j0517235j1199681
$$ y = [121016450, 122828581, 117319636, 105335630, 91668168, 81480755, 74461968, 66907804, 57130579, 46324238, 37094450, 29977177, 24390000, 19802603, 16487466, 14092246, 12489742, 11249103, 10339226, 9820325, 9463849, 8981868, 8416633, 8117009, 7822923, 7833914, 7840658, 7822912, 7922274, 8014211, 8260316, 8454900, 8683309, 9030924, 9734356, 10747089, 11822990, 13378497, 15331724, 18065937, 21679364, 26864229, 34866868, 45493416, 55623804, 62679885, 68339466, 77962184, 93511799, 110927709, 122732648, 125420501, 122676538, 121164606, 124488592, 129678000, 130830406, 123621602, 109652691, 94918192, 84347689, 76941611, 68796660, 58279425, 47079744]
20716D7079744r371049p314600n822533m596162l564486k664981k180353j656554
20708I909026j132683r57414p11307o44424p61435m19748m58903m92491l21642
20699D008979m13593j12464m13441m11650l93412j45479j18774j55853l19078
20690A525235l44681m9090j37846p4643j25626L9172m351k54677K6920J33184
20680G33597o3516K6850L117j19553N1655R6188P7897k86629l61001j73804J43986
20669A28787k1699O3705J38414p1381j21296j37292J25335J85032J06635J08709
20659E04949k71017M4915K08428J29106j78540n2968j56227k25045O79K51752
20649B56032J45542j23715k1970k60098j05007P3140J28208p9272n0792J39845
$$ y = [47079744, 37708695, 30394095, 24571562, 19975400, 16410914, 13745933, 11565580, 9909026, 8776343, 7818929, 7107622, 6463198, 5701763, 5282015, 4823112, 4330621, 4008979, 3595386, 3482922, 3069481, 2657831, 2264419, 2118940, 2000166, 1844313, 1525235, 1180554, 1131464, 993618, 918975, 793349, 832521, 828170, 573493, 600413, 733597, 670081, 696931, 700048, 580495, 632150, 728338, 806235, 519606, 158605, -15199, 128787, 107088, 170793, 309207, 237826, 116530, -20762, 104573, 289605, 396240, 504949, 233932, 278847, 487275, 616381, 437841, 384873, 228646, 3601, 4280, 256032, 401574, 277859, 255889, -4209, -109216, -36076, 92132, 12860, -37932, 101913]
20639A01913M2513m1877o1929j28969K1605K01303l0167r5489J39482J35179Q6717
20628C70281n8379k59713k08482Q3089K55233K1905p3363J86550k7483j97302
20618I2336k48118j03655K7179K56807k2504k17929j28416R057K52255J45721
20608F2733j0752j72927q9295J12631K31208N6634j18106m2358p6833N0313J48811
20597A52059M395o9711N9900m7987J2296j64251p5960J4120O3274J688N5686Q9936
20585I5445J19931l3916j0342p1066J15692K09154k06006j57913j43118M2724
20575c9415o2945k51080J15744K2079p7207j19356r7075L5086J38230Q0298N625
20564b50016R1856j13295Q1905N721k7978o9316O3392K50381M4142j77348j66285
$$ y = [101913, 144426, 102549, 40620, -88349, -66744, 134559, 104392, 8903, 148385, 283564, 370281, 311902, 52189, -156293, -73204, 182029, 203934, 130571, 317121, 289638, 92336, -155782, -259437, -232258, 24549, 2045, -215884, -344300, -335243, -82988, 62733, 51981, -120946, -210241, -97610, 133598, 190232, 72126, 29768, -47065, 3248, 152059, 156454, 86743, 146643, 98656, 110952, -53299, -129259, -115139, -51865, -50177, 5509, 95445, 215376, 181460, 171118, 100052, 215744, 424898, 218892, 60979, -82139, -39415, -102360, -353440, -237696, -215617, -292824, -412180, -509255, -474169, -335939, -255641, -250016, -158160, -271455, -189550, -183829, -211807, -281123, -217731, 32650, 76792, -100556, -266841]
20553b66841J75434j815j44517q857Q9982R2911L8355r317J38353J94334J16976
20542D14998p5283j78414j23661j55313O1090J05753L6416M2397j90348j93086
20532b55451n0142J09265J02835L6328k2316K8858q4657L7979J25456P4316j80853
20521g8382j57763J14579n0481q4344J49809J32975n9844k78902P9395N9968P5574
20510i7416J84160N4186j8347k52870j15889L12127O5060j96560J28873P4085
20500A37409o5355l6971k46410k6557K4418l4651L10241J31103l0197p0190J2772
20489A05612j28447P1202Q7264K3802l266k00401q8027N0102J31480M9381p274
20478I1428n0348j6253p4854J6114k7630j5810o340q4707O0737K2384l5817J82908
$$ y = [-266841, -91407, -93222, -237739, -246596, -156614, -63703, -25348, -34665, 103688, 298022, 414998, 339715, 161301, 37640, -117673, -56583, 49170, 85586, 127983, -62365, -255451, -305593, -196328, -93493, -57165, -79481, -50623, -135280, -97301, 28155, 102471, -78382, -236145, -121566, -172047, -256391, -106582, 26393, -33451, -312353, -232958, -172990, -97416, 86744, 140930, 122583, -130287, -246176, 65951, 131011, -65549, 63324, 137409, 72054, 35083, -211327, -237884, -213466, -248117, 62124, 193227, 163030, 92840, 105612, -22835, 48367, 135631, 159433, 156167, -44234, -132261, -82159, 49321, 98702, 91428, 41080, 24827, -50027, -33913, -61543, -77353, -83693, -168400, -107663, -85279, -121096, 61812]
20466F1812L06663j23244k59746p9012j90019k40641K4909K31416P3896k12662
20456d06628J4130K10423m6972J21477Q8658M3605q4772J16973M3929J12006Q9443
20445C02272N1181N3953j58940k92981k8514j19835j10282Q7872J69694L7839
20435g741o4084l15710j27923J40018J12242L00294n563j96228m7870J75267p6152
20424a13450j77861o1329K9383J7188q0197j42721j8694J020l7815L9152l2374
20413e77698o166J49362J20127N5512K06914J09502L6165P9358j9311M1554j66394
20402B8925l8461J25315K10540j39014k90805J41391O5726N5520K9045j05108
20392H3074m9503q3359j65339J09045L3604r0133J93568K9196j84759R9267L6535
$$ y = [61812, 368475, 245231, -14515, -93527, -283546, -524187, -499278, -267862, -193966, -406628, -392498, -182075, -229047, -107570, -18912, 24693, -60079, 56894, 100823, 212829, 302272, 353453, 407406, 248466, -44515, -73029, -192864, -303146, -215274, -45580, -7741, -71825, -387535, -515458, -375440, -263198, 37096, 31533, -164695, -212565, -37298, -113450, -291311, -352640, -323257, -306069, -386266, -528987, -547681, -546661, -584476, -545324, -577698, -583864, -434502, -314375, -258863, -51949, 57553, 93718, 173076, 153765, 195319, 28925, -9536, 115779, 326319, 187305, -103500, 37891, 103617, 159137, 188182, 83074, 33571, -49788, -215127, -106082, -72478, -162611, 30957, 60153, -124606, -25339, 11196]
20381A1196o4389m6778M1076K09955O9283k14795N7254N6728m0643k41448j99215
20370c61776O1942O5610q2708J2514K37039Q0194l2842o0994J11818L049n1176
20359a7330j98500j04308m6570n9795m2285n5794J81524O6925J09860J8073k58027
20348d06227N6672q3951J76880K23996J23085j45385J63870K46019j27786j52090
20338G5083j50872J17124j0127r9654j1424M9748J28621k4730j34337q5494J46105
20327D3l3543j84519M2559K49914K59249m3464k13832j34255R0827J5300j09453
20316f1174q7510l1853n4500J99595k8104j51649k07341J64146O3482J12330L30729
20305B48151r1481q4551o3475J289j65893r9582k5457j32063P1166K5189K6900
$$ y = [11196, -53193, -99971, -58895, 151060, 220343, 5548, 62802, 119530, 78887, -162561, -361776, -299834, -234224, -316932, -304418, -67379, 12815, -20027, -81021, 30797, 33846, -17330, -215830, -320138, -366708, -426503, -468788, -524582, -343058, -276133, -166273, -148200, -406227, -349555, -433506, -256626, -32630, 90455, -54930, 108940, 354959, 227173, 75083, -75789, 41335, 31208, -68446, -79870, -30122, 98499, 73769, -60568, -146062, 43, -33500, -218019, -175460, 74454, 333703, 290239, 76407, -57848, 32979, 48279, -61174, -148684, -180537, -235037, -35442, -63546, -215195, -422536, -258390, -194908, -82578, 248151, 156670, 72119, 8644, 9933, -155960, -255542, -280999, -413062, -341896, -316707, -289807]
20294b89807o945M1212J06303J48029J46655J0033j78796O9228J21132K64052
20284D31096O6964r5564j67509k6794L2021r3463j00133j57542j29000O9549J97636
20273B7261n5061Q3238M9817k52835Q9767P7618j27709J20521Q0485J75191J67246
20262D35539M6859j44272r8298J45091O9692m4110K66712L2304j6407j24286n1797
20251E17027K13398J60996o7513l5808j87059k45304k7943l2277j05923K1422
20241B11016j53102K1566j08848k02175P0783J28326J3357L951j41369n3663K11243
20230A085R5935j42913k84689k9072q8664P2618K93441J6972j54083J00365P7717
20219d1288j18306l530J15259M0262l2019n8571O868j96145k8958J35530j92817
$$ y = [-289807, -296752, -255540, -149237, -1208, 145447, 155480, -23316, 45912, 167044, 431096, 498060, 402496, 234987, 208193, 240214, 146751, 46618, -110924, -239924, -170375, 27261, -27800, 55438, 105255, -147580, -57813, 19805, -107904, 12617, 93102, 268293, 435539, 482398, 338126, 239828, 384919, 454611, 410501, 677213, 709517, 693110, 568824, 517027, 730425, 891421, 823908, 788100, 601041, 355737, 327794, 295517, 189594, 211016, 57914, 79480, -29368, -231543, -160760, -32434, -19077, -15126, -156495, -210158, 1085, 97020, -45893, -330582, -359654, -448318, -375700, -82259, -65287, -219370, -119005, -41288, -159594, -163124, -47865, -7603, -39622, -98193, -91325, -287470, -316428, -180898, -373715]
20208c73715O2684K76064J30171N5148j38915j34209J6484J62875J32341J52016
20198C40944J64184O290o868J2043R3053L7186j84474r9174p988J26065j75687
20187C05574r5594N6192J4179r9063j0087l1505l3544n9108j904j38528Q099K211
20175h3078L8949J91100J45331j66138P1795L1807k5259j29836j90582j07185
20165b23096j7885k887j57469j47085L25238K73168m2983k13192L8595K75571
20155A07975R996k15255k7875M5528N3222Q522J33644Q2278j23452j19629J039
20144d4007q6400N0497J4080l525j21668j6001L1518J11508O7600j08999R8923
20133f474Q1334O856J4799p5425L1422m2249Q814j45282p0482j00566K3751R8441
$$ y = [-373715, -311031, -34967, 95204, 150352, 11437, -122772, -106288, 56587, 188928, 340944, 505128, 511418, 504550, 516593, 609646, 646832, 462358, 363184, 355196, 481261, 305574, 209980, 266172, 280351, 181288, 171201, 139696, 106152, 47044, 45140, -93388, -85289, -83078, -44129, 146971, 292302, 126164, 197959, 229766, 204507, 74671, -115911, -223096, -240981, -243868, -401337, -548422, -223184, 49984, 7001, -206191, -167596, 107975, 117971, -97284, -125159, -79631, -26409, -17887, 115757, 198035, 74583, -45046, -44007, -130407, -79910, -65830, -69355, -191023, -207024, -175506, -63998, 3602, -105397, -6474, 74860, 81716, 96515, 21090, 52512, 10263, 19077, -126205, -196687, -297253, -273502, -175061]
20121a75061K20661J82240j04952l85868o4552j3607L3579P7389K11796J41764
20111A23389K6877r6682j69250k19925J2175J17174j501K8220K4797r9006j542
20100b55274N4167J82828M6928M7013j42260m8537o1140N5235J0356o4562P6938
20089i8308J70081J55223l7215l16628k72353l9989J23500n5022k6067L00365
20079i6413M376L670J27576k98108k3861L8977O3613j2408R6567r6672j16376
20068c09059P7301j49561j03287J23426K92871K20847J85290m7679M0263q5907
20058B44505j61103N8107n5664j66242q5921J51617M0379p6492q2019o372l1141
20047a70346j2098J22683K18914J23101M8318k9092r6436q0223l1109M4448M8379
$$ y = [-175061, 45600, 227840, 122888, -262980, -327532, -341139, -307560, -230171, -18375, 123389, 150266, 53584, -115666, -335591, -323416, -206242, -207743, -179523, -154726, -253732, -255274, -201107, -18279, 28649, 75662, -66598, -115135, -176275, -121040, -110684, -175246, -98308, 71773, 226996, 189781, -126847, -399200, -439189, -315689, -370711, -396778, -96413, -92037, -88367, 39209, -258899, -282760, -243783, -180170, -192578, -96011, -192683, -309059, -231758, -381319, -484606, -361180, -68309, 152538, 337828, 290149, 330412, 244505, 83402, 141509, 85845, -80397, -166318, -14701, 25678, -50814, -132833, -139205, -170346, -182444, -59761, 159153, 282254, 330572, 301480, 205044, 124821, 93712, 138160, 186539]
20036A86539j84754n0729P6334K2514M9321k12792O8189Q8631M8920P7975j87774
20025a7626J83028J50732J8771k12788P7169J74376K51426o2757k72639j39290
20015A50402J44849K10048K4861M4029r3139n6708o7519K13327R9947j37613k62687
20004B69797J22303P7091j24263j07077J02773p955k78807r5352O4190J01780
19994A24480J2964l8954m8891J1958j29788j16271J91436R9641N6054j09523L894
19983E7000q6250L3548R0066M126R4271j41819q8929o6878J28413J05551p5881
19972E3218R937N2503k1035R2251J09944j504K6679j37785n5074J22464j018O1406
19960C11986P9773k0577J92076r897o7869j17943k42567k11J47779p7212K12560
$$ y = [186539, 1785, -48944, 27390, 49904, 99225, -113567, -45378, 43253, 92173, 170148, -17626, 165402, 316134, 334905, 122117, 199286, 373662, 625088, 562331, 289692, 150402, 295251, 505299, 530160, 574189, 481050, 424342, 356823, 570150, 670097, 532484, 269797, 392100, 469191, 344928, 237851, 340624, 332669, 53862, -41490, 22700, 124480, 137444, 98490, 49599, 61557, -68231, -184502, 6934, 106575, 162629, 53106, 57000, -29250, 4298, 94364, 98490, 192761, 50942, -37987, -104865, 23548, 129099, 53218, 63155, 115658, 94623, 186874, 296818, 295314, 321993, 184208, 129134, 251598, 250580, 311986, 391759, 371182, 563258, 553361, 485492, 367549, 124982, 124771, 272550, 195338, 407898]
19949D07898k5250k35239q84l0415J36142J3017r3604j11994N5401M3287j77314
19938a8955r2728m1040P8812m080j27867k01125M7114K64249K19439k8033j23708
19927b7922L2517n7121j87868k9732o5166J28862j26938p7031M1502K06111J19140
19916d3646L4924R1755j10202Q4144P3564L2419j54366P4519N8338r040J2324
19905A44733M3807J8600j18491k25311q5817n9701j9208j50760O888J39954l3049
19894c38355J12909J37733K701q3071L17681J31532j98996k62902j03256R3112
19884a90912J4058o8059J10493L9960k42372j34468L56891L23920j55297P7223
19874A31437n5986k34872k8416J75090P9886r5500k38788j3628J13071m9319o0967
$$ y = [407898, 382648, 147409, 146525, 116110, 252252, 265269, 171665, 59671, 115072, 158359, -18955, -111683, -152723, -73911, -77991, -205858, -406983, -359869, -95620, 123819, 95786, -27922, 4595, -52526, -240394, -270126, -335292, -206430, -333368, -410399, -368897, -162786, -43646, -8722, 83033, -27169, 56975, 130539, 162958, 8592, 83111, 141449, 132409, 144733, 188540, 207140, 88649, -136662, -222479, -282180, -301388, -452148, -445260, -305306, -338355, -225446, -87713, -85012, -168083, 149598, 281130, 82134, -180768, -284024, -190912, -176854, -244913, -134420, -94460, -336832, -471300, -114409, 209511, 54214, 131437, 75451, -159421, -187837, -12747, 67139, -28361, -267149, -280777, -167706, -217025, -277992]
19863b77992r3118K461J12718J28934J0853K6045Q1854J33085j22780k43469O5633
19852a75776J50298n01k1570J96798o4805N6092J90008j72986m14622k46721k4357
19841e28142J01667J66288K49579J72367j6516J0443J3127k12582r9244K33546
19831I0533J08144q0150q690k86017m5775O2494k4332r7012j73338J66571J09201
19820a78371j79700k30628K10380K21837N1269J64758P393k62468O6308J18968
19810a0254p5159R6115k5180K1031k43389n4770J38888J1517j3716L9082N7952
19799e7883K3803j69494m6209j96153o1936p2849J05150K95352J47821p4073o2270
19788a68741R2355J20542L492j73108O8336J52285r729j31747j91731m4006J07513
$$ y = [-277992, -371110, -368649, -255931, -126997, -116144, -90099, -8245, 124840, 2060, -241409, -175776, -25478, -25979, -47549, 149249, 84444, 140536, 330544, 157558, -257064, -503785, -528142, -426475, -260187, -10608, 161759, 145243, 155686, 168813, -43769, -143013, 90533, 198677, 118527, 109837, -176180, -221955, -159461, -183793, -280805, -454143, -287572, -178371, -358071, -588699, -378319, -156482, -105213, 59545, 66938, -195530, -129222, -10254, -85413, 10702, -14478, 6553, -236836, -291606, -152718, -141201, -154917, -115835, -57883, -34080, -203574, -249783, -445936, -507872, -580721, -475571, -180219, -32398, -106471, -168741, -76386, 44156, 47648, -125460, -57124, 95161, 85432, -46315, -238046, -282052, -174539]
19777a74539P8921q4767l9702R9349p8987n1832N2762j04892K2503l4246m5437
19766c60867J1326j5782O6924J18236J24473j57710j002K47187O9873N0447j1916
19755A41189j9833J44359k74939o4665J56129j35394n9276Q6092R1074m2610K01972
19744B24098J28562j76448N0238N6880m04159j41275J09508j46042P306L22431
19734C1099J51485n8348O4820J34548o8028j0084P2613o8727L7607K2128K4778
19723C33891j76619k26664J61907K99064M4917k11277j04736j62662m2478j30344
19713b15001l2287o6912Q5250K81510J89314l5834j28925j31638J31237j72939
19703i6225L5274p1241P4924J20991j26741p0307L9985R5033r8015L0866J01204
$$ y = [-174539, -95618, -180385, -220087, -120738, -199725, -251557, -198795, -303687, -281184, -315430, -360867, -349541, -365323, -298399, -180163, -55690, -213400, -214402, 32785, 102658, 153105, 141189, 121356, 265715, -9224, -73889, 82240, -53154, -112430, -26338, 64736, 22126, 224098, 352660, 176212, 226450, 283330, -120829, -262104, -152596, -298638, -291332, 31099, 182584, 124236, 189056, 323604, 255576, 245492, 318105, 249378, 286985, 309113, 333891, 157272, -69392, 92515, 391579, 436496, 225219, 120483, -42179, -84657, -215001, -247288, -314200, -228950, 52560, 241874, 206040, 77115, -54523, 76714, -96225, -60951, -132192, -57268, 63723, -63018, -133325, -93340, 1693, -96322, -65456, 35748]
19692C5748K20875n8041m4525L6306r3926r2146J27438N6043J48247P5758R4249
19681E06026l1777j8683j50542O3189N7229Q3379r618j1805M1138O9980J26077
19670G24593P4623k96614j84354O5487Q3402j15254j79699j01345J6063N8018
19660A44920Q1835Q9484L3685J1672k33584j40465q1189K1653K04254j45297k904
19649a5936L4585K8983J08825J15527L7895j91151o4837j42594k00864O0334J21579
19638a07654P0004J551q0459J36008J05346k4420n2663J08496J18392m6151J00153
19627C28603O121J50929j81653j03514N6041o9096M0331M70590K01670j44407
19617G55615j93180j98714j7041K7601k9456j49920r9684J3122L3830j17902n014
$$ y = [35748, 256623, 198582, 154057, 190363, 96437, 4291, 131729, 187772, 336019, 411777, 506026, 474249, 455566, 305024, 368213, 425442, 508821, 499203, 487398, 528536, 598516, 724593, 799216, 502602, 318248, 383735, 467137, 351883, 172184, 70839, 86902, 144920, 226755, 316239, 349924, 361596, 128012, -12453, -93642, -71989, 132265, -13032, -15936, 18649, 47632, 156457, 271984, 309879, 118728, 53891, -88703, -289567, -229233, -107654, -37650, -36099, -116558, 19450, 124796, 100376, 47713, 156209, 274601, 228450, 328603, 334724, 485653, 304000, 200486, 256527, 187431, 227762, 698352, 900022, 755615, 562435, 363721, 346680, 374281, 344825, 194905, 95221, 108343, 142173, 24271, 19257]
19606A9257O7754J25134j16120l4736K2056O0470j898J06822O579o0285j12535
19595H2498q1284P7737J94576q3418O2498J1318j00531J20519J14693P2917m0481
19584D31042k8294P5828P6959j03821k70506k34028J25331R6340J3766K0978K11328
19573D14923Q8347m4157k0079j18857k3121K4696m5585J50687R1369L0004R9963
19562F48190l7663l07043r8629q6172P9555K68542j80012j84935J25439J55402
19552C82674K04948k31311j21389o3725j36769K1111K03458J23759K27344J87580
19542G97680j2242N598M3333J34228J65995Q2908J21636m1717k99500N7760J77910
19531A233589J55214K19778K30409L06162J6465J51349L79751K20118M43767M96593
$$ y = [19257, 87011, 212145, 96025, 61289, 83345, 143815, 141917, 248739, 255318, 195033, 82498, 1214, 78951, 273527, 190109, 252607, 263925, 163394, 283913, 398606, 471523, 431042, 402748, 478576, 555535, 451714, 181208, -52820, 72511, 168851, 182617, 203595, 414923, 503270, 459113, 439034, 320177, 297056, 321752, 276167, 426854, 518223, 548227, 648190, 610527, 303484, 204855, 118683, 198238, 466780, 286768, 101833, 227272, 382674, 587622, 356311, 234922, 171197, 34428, 55539, 258997, 382756, 610100, 797680, 785438, 791036, 834369, 968597, 1134592, 1217500, 1339136, 1297419, 997919, 1055679, 1233589, 1388803, 1608581, 1838990, 2145152, 2161617, 2312966, 2692717, 2912835, 3356602, 3853195]
19521C853195J91518L36704N04967N94363N06501P22613R74397J112388J246903
19512A0043549J806973K207494L041423M345546O119902R171049J2863022J3141858
19504F2740816J0276163P145819M799625N601862N701368L900571K937878K632682
19496A05736784J643804r90977k891845m809726k966501j547169m756067q575668
19488H0842635j2603953j3366697j1095496q728635p220198n309415l780193k832805
19480A5905243j937126j421655r11098m77892o70638m66300k93523L85q8118m15225
19470I224053N521R0516J65124M21822M32071N72935P80870J206800J368433J609754
19460A5877899K182555K570556L461476N036645P888812J1962924J5663253J5218300
$$ y = [3853195, 4044713, 4381417, 4886384, 5480747, 5987248, 6709861, 7684258, 8796646, 10043549, 11850522, 14058016, 17099439, 21444985, 27564887, 36735936, 49598958, 62740816, 73016979, 80162798, 84962423, 90564285, 96265653, 100166224, 103104102, 105736784, 107380588, 106389611, 103497766, 98688040, 95721539, 94174370, 89418303, 80842635, 68238682, 54871985, 43776489, 35047854, 27827656, 22518241, 18738048, 15905243, 13968117, 12546462, 11635364, 11157472, 10486834, 10020534, 9727011, 9727396, 9639278, 9224053, 9229574, 9320090, 9485214, 9907036, 10339107, 10912042, 11692912, 12899712, 14268145, 15877899, 18060454, 20631010, 24092486, 29129131, 37017943, 48980867, 64644120, 79862420]
19452G9862420J2095836Q575673N682486O865076O300612M334072K116367J194180
19444A27026722R06699j112767l411500n359902l332245l643572p029675j1904509
19436I2139251j6155398j5594612j2720796r660046p575405n726676m404185l211762
19428A7090371k473190j784303j274073j093807q53493p34405q08489o95103l63137
19419G010371n64939o71937n28474l52543m05316n37881l33636l18160k80093
19410C017392m69356l47727j9230j72878j13475r9510k09162m22118o3693J97559
19400A297802j00826M9220J2807M2362j17417j05762L2491j33396k2389n9466
19390H95426l5791M9419J2213K6143r7366J6355Q5923j01293j13193r0042q4710
$$ y = [79862420, 91958256, 100533929, 106216415, 113081491, 119382103, 123716175, 125832542, 127026722, 127933421, 126820654, 123409154, 118049252, 114717007, 111073435, 104043760, 92139251, 75983853, 60389241, 47668445, 38008399, 30432994, 24706318, 20302133, 17090371, 14617181, 12832878, 11558805, 10464998, 9611505, 8877100, 8068611, 7373508, 7010371, 6445432, 5773495, 5245021, 4892478, 4487162, 3949281, 3615645, 3297485, 3017392, 2548036, 2200309, 2181079, 2008201, 1894726, 1795216, 1586054, 1163936, 1100243, 1297802, 1196976, 1246196, 1259003, 1301365, 1183948, 1078186, 1110677, 977281, 954892, 895426, 859635, 909054, 921267, 947410, 850044, 866399, 952322, 851029, 737836, 647794, 563084]
19379E63084L746K66553j1368k37218j80081k32590P1958J61829p8725j84810
19369A42378J19208J31933M0804P152K2948K4896O4941p8615k98660M3113j53943
19358F6155K2298J29179j03793Q2840J4586j16032r08J91760J7042m445J87560
19347D86242J20882L522l0026j52102p0273J75807k20559k13754q8091r8515k3827
19336a10694R7092J77917J26958o5065O2208k28898j39265o1078J48682J48011
19326A55868J97837p1045k28368o4522l9862K4912K33633J51489j4847q2188k00280
19315F2627o8699J93337R7835j407j31858K4259R5299P5325K6046J97032O1458
19304F31254q0627L7605j60249L9068m6320o058N177L825p4375L7438J16799j58042
$$ y = [563084, 566830, 833383, 822015, 584797, 404716, 172126, 244084, 405913, 327188, 142378, 261586, 393519, 434323, 441475, 464423, 489319, 554260, 475645, 176985, 220098, 66155, 88453, 217632, 113839, 196679, 211265, 95233, 94325, 286085, 303127, 298682, 486242, 607124, 610646, 580620, 428518, 358245, 534052, 313493, 99739, 11648, -86867, -110694, -13602, 164315, 291273, 226208, 288416, 59518, -79747, -140825, 7857, 155868, 353705, 282660, 54292, -10230, -50092, -25180, 208453, 359942, 345095, 262907, 62627, -6072, 187265, 285100, 283693, 151835, 176094, 271393, 346718, 372764, 569796, 631254, 550627, 588232, 427983, 467051, 420731, 414673, 419850, 423675, 349300, 386738, 503537, 345495]
19292C45495J04833k6540j70311r336P4678J77636q2339R4947M5242k37804m5180
19281B71321J5088J05564j10278r7179l5247l0564K97182L9237r1051Q5963J09683
19270E59719K4337P2228n562j09424n529O588J02397l4220P298p0728K12376J57437
19258I16917j68965j71560j79596j37957K14327J59641J53577K25500R6996Q1599
19248A190479J6223p633K00233J51018m4659J61940L35666J75921J03207J74210
19238B456605M27902L96918M5267M67806P03116N72459O64482J521657J575680
19229H831892J761909K376322L531321N359869Q889374J3518643J4862086N233639
19221F4365055n928908q171554n946209l723249n32846L878258R449660J1550931
$$ y = [345495, 450328, 423788, 253477, 244141, 318819, 496455, 414116, 509063, 554305, 316501, 271321, 286409, 391973, 281695, 184516, 149269, 118705, 415887, 455124, 364073, 450036, 559719, 584056, 656284, 650722, 541298, 535769, 542357, 644754, 610534, 617832, 547104, 759480, 916917, 747952, 576392, 396796, 258839, 473166, 632807, 786384, 1011884, 1108880, 1190479, 1206702, 1199069, 1399302, 1550320, 1505661, 1667601, 2003267, 2179188, 2282395, 2456605, 2884507, 3281425, 3326692, 3794498, 4497614, 5070073, 5734555, 7256212, 8831892, 10593801, 12970123, 16501444, 21861313, 30750687, 44269330, 59131416, 64365055, 58436147, 50264593, 44318384, 40595135, 40062289, 43940547, 53390207, 64941138]
19213F4941138K096900r346985j1301403r123960p603396o076179m432064l363428
19205A5790623k696344j833301j496277j000978n54237n19845l86812j37394o160
19196G159275j19250K2703K48188M92396L10169L30539P24691R25524J318935
19187A1413170J799515K169817K473994L226135N110526P757776J2187777J9062010
19179F5200720K1782774R257672p199535j1341403p855383m343923J92744O962749
19171G2656415J5888257K2074217J5875671J265846j2144330j8409456j7270313
19164G9936307j3366552r178363m709633M33645O560773Q564494R9981r874943
19156E8465709j0979164q782030p596352o087560m566996l303936k657616j978913
$$ y = [64941138, 67038038, 57691053, 46389650, 37265690, 29662294, 23586115, 19154051, 15790623, 13094279, 11260978, 9764701, 8763723, 8209486, 7689641, 7302829, 7165435, 7159275, 7040025, 7062728, 7310916, 7803312, 8113481, 8444020, 9168711, 10094235, 11413170, 13212685, 15382502, 17856496, 21082631, 26193157, 33950933, 46138710, 65200720, 86983494, 96241166, 89041631, 77700228, 69844845, 65500922, 65693666, 72656415, 88544672, 110618889, 126494560, 127760406, 115616076, 97206620, 79936307, 66569755, 57391392, 52681759, 53115404, 59676177, 68240671, 68340652, 58465709, 47486545, 38704515, 31108163, 25020603, 20453607, 17149671, 14492055, 12513142]
19148A2513142j197879j034349o70988m67650m04375o28151l65944k06336n9354
19139G478116j86435M8094J99038K24283P94608J066959J411731J464645J524649
19130A4025688K389459L398893M821235P659765J2672642J9074017J9198957M659596
19122H7900252r684313j1852129q427365n385600j552419M265975J1056944J3554382
19114G9875727K571916j1581947j4391413j1753363r670382q061969n846698m368222
19106A6773649l299271k310384j679517j389509j218203q09202p45502n98380
19098D723681k79486k59205l90658m11591l15979j67754r9720k49476k73725n3274
19088B222813L0523M1832j5472j47116k08365k76618l05105k30738j09556j7747
$$ y = [12513142, 11315263, 10280914, 9609926, 9142276, 8737901, 8109750, 7743806, 7537470, 7478116, 7291681, 7339775, 7538813, 7763096, 8557704, 9624663, 11036394, 12501039, 14025688, 16415147, 19814040, 24635275, 32295040, 44967682, 64041699, 83240656, 87900252, 78215939, 66363810, 57936445, 52550845, 50998426, 55264401, 66321345, 79875727, 82447643, 70865696, 56474283, 44720920, 35050538, 26988569, 21141871, 16773649, 13474378, 11163994, 9484477, 8094968, 6876765, 6067563, 5322061, 4723681, 4444195, 4184990, 3794332, 3382741, 3066762, 2899008, 2799288, 2549812, 2276087, 2222813, 2253336, 2295168, 2279696, 2132580, 1924215, 1647597, 1342492, 1111754, 1002198, 984451]
19078I84451l2725L4246j81138j71892P1173J16781n3799j73270K0982J71626
19068G86435M5676R603R1739j17958l9512P9442n92r6805k6030m4875J9313k27664
19056D78772k6289J49931O7518k53153k18983r9125m2040Q7540K00293k00969
19046A43495j42843K19509K35368J39704q6981J23382P7188L5420k1843r9061
19036F23338R7064j44340j48378j65127k10909p5554K44314Q2492l2558J60772
19026D31114M8681J4678M4496P2633j51392j74554n0824O4225l0933r6353j23346
19015D8425k902O3570K55521K0870k2341J17850o4435Q846J18474J20667J9475
19004F84020O3590J11692j14927l1228l1947J8766K25584L7362o1231j8067J72456
$$ y = [984451, 951726, 985972, 804834, 632942, 704115, 820896, 767097, 593827, 614809, 786435, 832111, 841714, 933453, 815495, 775983, 855425, 854833, 758028, 731998, 687123, 706436, 478772, 452483, 602414, 669932, 416779, 197796, 98671, 56631, 144171, 344464, 143495, 652, 220161, 455529, 595233, 508252, 631634, 708822, 744242, 722399, 623338, 720402, 576062, 427684, 262557, 51648, -23906, 220408, 302900, 270342, 431114, 479795, 494473, 538969, 611602, 460210, 285656, 234832, 299057, 268124, 171771, 48425, 45523, 109093, 364614, 385484, 363143, 480993, 416558, 425404, 543878, 664545, 684020, 747610, 859302, 744375, 713147, 681200, 699966, 925550, 962912, 901681, 883614, 1056070]
18993A056070K85673m7797k05244k3715R3563J67300K27772K37468K60481K05600
18983B257171M1893K61962K23052J54733R094J15325L15493R2572J30783L19408
18973C921486L61506M32206O53899Q55727R40925J343126J551219K133609K629558
18964A4823261L512356N131006P457583J1616401J6522113J7225934J1325816
18957H7614470K289317m995110n773163q30583N986983R004790M374596m079512
18949I3591788j2404352j5425702j3551178j0993959q754221o355807m677722
18942B1428847l451829k377858j745271j220135r76978q59440n06952k18792Q1018
18933A0152610n9166j99433k24992j28648j58211O0765K75819M32080N79676Q66990
$$ y = [1056070, 1341743, 1293946, 1088702, 1064987, 1158550, 1325850, 1553622, 1791090, 2051571, 2257171, 2299064, 2561026, 2784078, 2938811, 2947905, 3063230, 3378723, 3471295, 3602078, 3921486, 4282992, 4715198, 5369097, 6224824, 7165749, 8508875, 10060094, 12193703, 14823261, 18335617, 23466623, 30924206, 42540607, 59062720, 76288654, 87614470, 89903787, 84908677, 79135514, 78304931, 84291914, 93296704, 97671300, 93591788, 81187436, 65761734, 52210556, 41216597, 32462376, 26106569, 21428847, 17977018, 15599160, 13853889, 12633754, 11656776, 10797336, 10290384, 10071592, 10152610, 10093444, 9894011, 9669019, 9540371, 9382160, 9442925, 9718744, 10150824, 10730500, 11597490]
18923A1597490J137589J403870J794884K519019L829513N824711Q763527J2714850
18915D9585453J3947135J0488245M502084q03854o71960M850465J3176003J9151318
18907A14224889J5836461N045004p575163j4764407j3136122o746431j32123J647198
18899I4399306k247113q726295j3591063j3814606j1480202q835980p132583n410519
18891B3160945m095448l022933k134487j490409j198309r47922o71882n45965
18883I053590n29806n99223l79441j95463j89734k78825j70720R1383J47427R8680
18873G047868L58485N48742O30656J025357J492272K200077L140218M689006P529391
18864B8662072J0760914J0489638O474593M85946m012180l752938l77183L338180
$$ y = [11597490, 12735079, 14138949, 15933833, 18452852, 22282365, 28107076, 36870603, 49585453, 63532588, 74020833, 78522917, 77719063, 77047103, 81897568, 95073571, 114224889, 130061350, 135106354, 127531191, 112766784, 99630662, 92884231, 92752108, 94399306, 92152193, 83425898, 69834835, 56020229, 44540027, 35704047, 28571464, 23160945, 19065497, 16042564, 13908077, 12417668, 11219359, 10271437, 9599555, 9053590, 8523784, 7924561, 7545120, 7349657, 7159923, 6881098, 6710378, 6801761, 6949188, 7047868, 7406353, 7955095, 8585751, 9611108, 11103380, 13303457, 16443675, 21132681, 28662072, 39422986, 49912624, 56387217, 56873163, 52860983, 49108045, 48730862, 52069042]
18856E2069042M019111Q25066m301598q265600q841099p637562o203494m798551
18848A6865315l768204k603970j899660j273819j035638q82149p40206m88543
18840D173126l90758l03654j94588r2897j63193k71359k10877j48695p5596l64344
18830A957165l45048P77j15008j19561j58063j87267Q6750j0120k26531j62641
18820G20453j1368J29432M3538q8519J65755J24310J8169k04392J9228j28531
18810G88075j79759j44454q8434J03494O1944J58437R6927O2091k29938K0798
18800F49181j24822J49272n027j45725r7449k36056J35927Q8154j9982n0522m4093
18789B98858J41879K33364k02317j4734J21452j9204o2041j12269k4326M6923
$$ y = [52069042, 56088153, 56913219, 52611621, 44346021, 35504922, 27867360, 21663866, 16865315, 13097111, 10493141, 8593481, 7319662, 6284024, 5401875, 4661669, 4173126, 3782368, 3478714, 3284126, 3191229, 3028036, 2756677, 2545800, 2397105, 2321509, 1957165, 1612117, 1612894, 1497886, 1378325, 1220262, 1032995, 1119745, 1109625, 883094, 720453, 709085, 838517, 882055, 793536, 959291, 1083601, 1101770, 897378, 916606, 788075, 608316, 463862, 375428, 478922, 540866, 699303, 796230, 858321, 628383, 649181, 524359, 673631, 668604, 522879, 425430, 189374, 325301, 413455, 393473, 342951, 298858, 440737, 674101, 471784, 457050, 578502, 559298, 497257, 384988, 360662, 407585]
18779D07585J37790J28194O9851j90323j6960l3585j14484P0065K01494J69416
18769H29043N78465P56673L31056m04054n10431k03995j92738k46086k71889j50232
18759E15812j09634p922m3607K1811l7317l6087K49865K31323K0031l08134k63941
18748B32200j22385m9423K4089J0079K36974J22207q5699l7598l4113P5512R9611
18737D71454J3559j74863p9992N9781N2823M8741l6348r7235n9885o4017J12316
18726B46334K1595j64739n0284L1582J06565q3511k1391j08985J6453p3555q4208
18715a64144J43022J05124j58116L3899J77552j05185N295J20314R6330j5901
18705B38190J77648M8314J52605J80666j64392L0614R3259j85905j16122r342
$$ y = [407585, 545375, 673569, 743420, 553097, 536137, 502552, 388068, 458133, 659627, 829043, 1407508, 2164181, 2495237, 2091183, 1580752, 1376757, 1184019, 937933, 666044, 515812, 406178, 398256, 354649, 376460, 339143, 303056, 552921, 784244, 804275, 496141, 232200, 109815, 60392, 84481, 94560, 331534, 453741, 368042, 330444, 296331, 371843, 471454, 485013, 310150, 230158, 289939, 342762, 391503, 355155, 257920, 198035, 134018, 246334, 267929, 103190, 52906, 84488, 191053, 107542, 86151, -22834, -6381, -79936, -164144, -21122, 84002, -74114, -40215, 137337, 32152, 37447, 157761, 254091, 238190, 415838, 464152, 616757, 797423, 633031, 663645, 756904, 570999, 454877, 445535]
18695D45535k19957m8972J78941q4343o7953J20183O8654q7517j32896J2375m6287
18684A37763K4945j03716N0070k1856J06171K9066j52412P7747l2479j34797j26084
18673a45582m6342J30118K94153J88871j14939r0791j83735j35224j26026L01542
18663G2045L00817Q5680k78644j43908K9616J74440L2966l1071K09387j4093J59092
18652E96327Q5415j41051M4211M6645r3421n7966j3754k01368j33838r7686J73813
18641B07327J55627r7464k3269j07845O8249O6812k10741J5409J49126N9922p5710
18630B07443r2292J22780j91486R193J45629r5023J66183j96740k18102m5636
18620a88051p8477L58500K3500n8009q0911j17980N7837K3033j32664l4556J84577
$$ y = [445535, 225578, 176606, 355547, 271204, 203251, 323434, 392088, 304571, 171675, 184050, 137763, 162708, 58992, 109062, 87206, 193377, 222443, 70031, 147778, 115299, -19498, -145582, -191924, -61806, 232347, 421218, 306279, 215488, 31753, -103471, -229497, 72045, 372862, 458542, 179898, 35990, 65606, 240046, 273012, 241941, 451328, 437235, 596327, 681742, 540691, 584902, 631547, 538126, 480160, 466406, 265038, 131200, 33514, 207327, 362954, 265490, 242221, 134376, 202625, 269437, 58696, 74105, 223231, 283153, 207443, 115151, 237931, 46445, 55638, 201267, 106244, 272427, 75687, -142415, -188051, -266528, 91972, 115472, 57463, -23448, -141428, -83591, -60558, -193222, -227778, -43201]
18609d3201J77847L20020j5591o5193p7738k6245q8184k14826Q2713K40790R2786
18598C83178l819m2112r1382K4473l7445l6168p4687J172n5666N626J9034m3231
18586D8973J26301k4165N1946J30626m4440l1294j59531j82292J26993J52547
18576A95664j12714N6499k0792M487j75876j88358M96j31523J78558Q0776L0152
18565h2631J47917J377j29135J48194P5695M4076l552j44263j75306R5712M5650
18554B3734r422Q1124k0412K5183j17595j08003j2172J68683J93508M1419k35392
18543C0655j03180O100j55088K0972L12124K8302J37664j07605k65032J2426Q4961
18532B299n1449L3520J21714k2630J223l7446R2696R6782J632o288L5683j82669
$$ y = [-43201, 134646, 454666, 439075, 373882, 296144, 269899, 181715, -33111, 49602, 290392, 383178, 379359, 337247, 245865, 270338, 232893, 196725, 122038, 123210, 67544, 73170, 92204, 48973, 175274, 151109, 203055, 333681, 289241, 257947, 98416, -83876, 43117, 195664, 82950, 139449, 118657, 123144, -52732, -241090, -240594, -372117, -193559, -112783, -82631, 65286, 66663, -62472, 85722, 161417, 205493, 201941, 57678, -117628, -21916, 23734, 14312, 95436, 75024, 100207, -17388, -125391, -137563, 31120, 224628, 266047, 30655, -72525, -66425, -221513, -200541, 111583, 139885, 277549, 169944, -95088, -82662, 2299, -49150, -15630, 106084, 83454, 84677, 47231, 139927, 236709, 238341, 232053, 267736, 85067]
18520H5067n6775j25874r4059j62577j5401K34150J54246j02746J31092J75878
18510B23001M9609o6066j17165j07392N4118r3103j71549n5289K53029M3585p3420
18499f0642J93753j21653j60990J1j15077J09108J21684M1279p6854J04456Q9477
18488A24552o0317j05478L4228P2063J08567l5272N5248p0534J922K1472P294
18477A53745N7742k45309j99797Q3941o594J39046J84131J2813o9184K0480j11520
18466A9494j96659l0849M1554j13964l4695J8193J47529Q0551q8332L3074M8037
18455g6067M939J21447n4095r0650k07462K3848K47175K28456o5506j05080J12395
18444A39400K48802o4860q0086k07525j55248l3408K23579J33400J61182K9492
$$ y = [85067, 28292, -97582, -191641, -354218, -369619, -135469, 18777, -83969, 47123, 223001, 272610, 206544, 89379, -18013, 36105, -56998, -228547, -283836, -30807, 12778, -60642, 133111, 11458, -149532, -149521, -264598, -155490, -33806, 7473, -69381, 35075, 124552, 64235, -41243, -7015, 65048, 173615, 138343, 193591, 123057, 124979, 146451, 153745, 211487, -33822, -233619, -149678, -156272, -17226, 166905, 179718, 110534, 131014, 19494, -177165, -208014, -166460, -280424, -315119, -296926, -149397, -68846, -157178, -124104, -76067, -71128, 50319, -3776, -94426, -301888, -278040, -30865, 197591, 132085, 27005, 139400, 388202, 323342, 243256, 35731, -119517, -152925, 70654, 204054, 365236, 394728]
18434C94728l2080R9553n5126J47361N4995j00566j21813p1999L8639K3085k3309
18423C53468j06010l2010j86720M528Q0550K4055J40114r2856M8914o5200J03897
18412B72730k5775p2509o625j31309j06847j14907K01792J42340J27911o2661
18402B24140K4664J21388O4346k44930j2878J1215p457Q7448J10582J34401k54251
18391B58668O1515K96988k53522k17937K9158J97327K27206J5333J07696m8506
18381F73926j44294o6081J51997j08707j10676q3220j49468K3126J52859M2940
18371C82402M1781J09230R1157J1092k34954j83284N4381P4473K6050L4117j02957
18360C03488k34724l3931j42071q3794n0831M1212O8455K07785J51952J05205
$$ y = [394728, 362648, 462201, 407075, 554436, 609431, 508865, 387052, 315053, 353692, 376777, 353468, 247458, 215448, 28728, 33256, 113806, 137861, 277975, 185119, 234033, 168833, 272730, 246955, 174446, 167821, 36512, -70335, -185242, 16550, 158890, 286801, 224140, 248804, 370192, 434538, 189608, 176730, 187945, 180488, 267936, 378518, 512919, 258668, 320183, 617171, 363649, 145712, 174870, 372197, 599403, 614736, 722432, 673926, 529632, 463551, 615548, 506841, 396165, 312945, 163477, 186603, 339462, 382402, 424183, 533413, 624570, 635662, 400708, 217424, 271805, 346278, 372328, 406445, 303488, 68764, 34833, -107238, -191032, -241863, -200651, -132196, 75589, 227541, 332746]
18350C32746O477M0249r8226K6708K22600J47558j43298j44817K7496n7203O8315
18339D28605J9022k04677M2536j24978k24918j51188o8180k303J28726J234J3392
18328a42729l0367J0966j08756k7190r7621R7195J0354L8204n7067p3025o8871
18317d48907n9558J68908J98496k166M6694o9573o8549j09706P9508j01808j50703
18306e17364J78490L23760R6351l21366k58470N128k7006L6293J05817Q0055J76258
18295a22054l6840j4735J49688j10472n4686J39805K01044n3976k075l689j30907
18284c8897J1285J17124l4081N0561N0103l07843k73264J47915J10330q8663j24183
18273c79613L9281L3783N6424J5423o695J50775M76391j97597l45319J6891R8228
$$ y = [332746, 339223, 379472, 281246, 307954, 530554, 678112, 534814, 389997, 417493, 360290, 428605, 447627, 242950, 285486, 160508, -64410, -215598, -283778, -286081, -157355, -156121, -142729, -173096, -162130, -270886, -298076, -395697, -298502, -288148, -249944, -307011, -380036, -448907, -508465, -339557, -141061, -143227, -96533, -166106, -234655, -344361, -264853, -366661, -517364, -338874, -15114, 81237, -240129, -498599, -493471, -520477, -484184, -378367, -298312, -122054, -158894, -173629, -23941, -134413, -189099, -49294, 151750, 97774, 95699, 92010, -38897, -27612, 89512, 55431, 105992, 156095, -151748, -425012, -277097, -166767, -255430, -379613, -340332, -306549, -250125, -234702, -241397, -90622, 385769, 188172, -157147, -140256, -42028]
18262d2028L58155O7503k05175p9361J35512k18228l9636j41833o1431P8740P7091
18251g0691O7879J20475N8320j31864k71579J53022J83051k88070r3559L4494
18241b38522K66435K73235q3751j47588K5153N9289N8285J14051r2512J3981r5543
18230A52513o4433J76714m4238p1164r9310N0353J02888l721l2585q4040L9824
18219A22801K2458k12273k39M2979N5867k6316J57351J34958q7332j00620j2284
18208I7350J39030J30060j05098k00164q3867J76296K6802J76051p5892m9049
18198B31519J93017Q5329j05424N5659j1058k04905j18225m7716r1498K6186J57823
18187A70707P7424k7828r5805K9147j78326j2753J39602J78939Q4908o2502k30023
$$ y = [-42028, 316127, 383630, 178455, 99094, 234606, 16378, -23258, -165091, -226522, -147782, -70691, -2812, 117663, 175983, 44119, -227460, -74438, 108613, -179457, -273016, -238522, 27913, 301148, 217397, 69809, 94962, 154251, 212536, 326587, 234075, 248056, 152513, 88080, 264794, 220556, 149392, 50082, 100435, 203323, 199602, 167017, 82977, 122801, 145259, -67014, -67253, -24274, 31593, 5277, 162628, 297586, 210254, 109634, 97350, 236380, 366440, 261342, 61178, -22689, 153607, 180409, 356460, 280568, 231519, 424536, 509865, 404441, 460100, 449042, 244137, 125912, 78196, -13302, 12884, 170707, 248131, 220303, 124498, 153645, -24681, -37434, 102168, 281107, 366015, 303513, 73490]
18176G3490r3387K41581P9773l2296k9425K18591k64579k33451L23730M8365N3507
18165C85899j64454N9129L11561J69194k61938j43183J7981J24781R8414L8329
18155F35713m1571P5859K20205R3604n4166k43000j32947p9315J10627L4325J57745
18144G77079K67766K26889P5733K07358N4315J44561j76738K1505J88749K28811
18134B016028L49154K30157L26424K35239L93043M32266M96722N56426N20856
18125E556315Q31140J377269J812603K265424K645360L588237M946690N823110
18117B8846148O411341P404410J0333289J5835277K6421033M9091814R4963039
18110B39306351J36705906K8969004q9969335q0370431n2981300m5539319l8272704
$$ y = [73490, -19897, 221684, 301457, 269161, 239736, 458327, 193748, -39703, 284027, 332392, 385899, 221445, 280574, 592135, 761329, 499391, 356208, 374189, 498970, 597384, 635713, 594142, 670001, 890206, 983810, 929644, 686644, 553697, 474382, 585009, 619334, 777079, 1044845, 1271734, 1347467, 1554825, 1609140, 1753701, 1576963, 1598468, 1787217, 2016028, 2365182, 2595339, 2921763, 3157002, 3550045, 3982311, 4479033, 5035459, 5556315, 6387455, 7764724, 9577327, 11842751, 14488111, 18076348, 23023038, 28846148, 35257489, 42661899, 52995188, 68830465, 95251498, 144343312, 239306351, 376012257, 404981261, 315011926, 234641495, 181660195, 136120876, 97848172]
18103I7848172k7277272j7906994j1784373q100536n687901m381373l652028k789263
18095A6268432k422723j802480j531286j302283q93593p62451p82897r74389p05181
18086E091149n46918l24175r6880k90276m01153l75660j04300j92341l61618j50923
18076B246905N7409j62793M1739j72331k59118l03306q6596j57205J70095R4763
18066A469562J7535l09699j4531Q5604j98889j64271l3434P3369J34654l6542
18056A023358j14763M7236J60265l36537j87741J93997R8365o7215r152N4941
18046H62754j98080j08244j72223j23946q7212j00863K24316M4100n9775l7755
18036B43072k2108O9071j22189K6873M8823o359Q0602j63565J98103n0454n2988
$$ y = [97848172, 70570900, 52663906, 40879533, 32778997, 27091096, 22709723, 19057695, 16268432, 13845709, 12043229, 10511943, 9209660, 8316067, 7553616, 6770719, 5796330, 5091149, 4544231, 4220056, 4123176, 3832900, 3431747, 3056087, 2951787, 2759446, 2397828, 2246905, 2304314, 2141521, 2183260, 2010929, 1751811, 1448505, 1361909, 1204704, 1374799, 1469562, 1487097, 1177398, 1162867, 1248471, 1049582, 885311, 851877, 925246, 1059900, 1023358, 908595, 955831, 1116096, 779559, 591818, 785815, 884180, 816965, 807813, 862754, 664674, 556430, 384207, 260261, 173049, 72186, 296502, 340602, 280827, 243072, 220964, 290035, 167846, 194719, 243542, 237183, 317785, 154220, 352323, 301869, 248881]
18025B48881O939j67170j05134m7668O7152Q2156N6260L0353j42752K1805M5545
18014I6367K09335J06831j0681j66844k10017k5566P4507J05043M9321J281j8578
18003B10999N032q3179N6919K62858j49307k55902j74561N9146J97011r0680Q5144
17992A23480n4287j3183j15122j58359K00528L71613L302j16294j26309P1250
17982A86619K12409j09405j33436J08968L3786J3018j15889k47749K6063j0752
17972c6368m7222O6946J62607j18815j71609j24542l8859m1619K02834K85692
17962A39045j3430j79075O2388m7313K14758J11577q8316n9069p7579l602P8301
17951A37685r0031m6787K2546J102M5263m4947j75702p3011P4196m451J22023
$$ y = [248881, 255820, 88650, -16484, -64152, 3000, 85156, 141416, 171769, 29017, 50822, 96367, 305702, 412533, 401852, 235008, 24991, -575, 73932, 178975, 228296, 229577, 210999, 216031, 132852, 189771, 452629, 303322, 47420, -127141, -67995, 129016, 38336, 123480, 69193, 56010, -59112, -217471, -16943, 354670, 357972, 241678, 115369, 186619, 399028, 289623, 156187, 265155, 298941, 311959, 196070, -51679, -25616, -36368, -83590, -16644, 145963, 27148, -144461, -269003, -307862, -349481, -146647, 139045, 125615, -53460, 8928, -38385, 176373, 287950, 199634, 140565, 62986, 59384, 137685, 47654, 867, 23413, 24515, 69778, 24831, -150871, -223882, -149686, -154137, -32114]
17940c2114J58097n6593m5542J23200R7016l0655j25539j30455j20203J03236
17930e9552J84555o1162p8720J62688m0455p6953l7929m9669M2695K31198P5759
17919B92455J44622p863j22674j00541J70137q3893j91840p121P5477P4000K135
17908B44894Q8379m6479j65660j49079L2393J33085R6938O2217R0651n6241P4510
17897D05608r30k0789n9098j54852r2339L4849J35548J92814j7518l38367p4366
17886A0560r0190P2225K0915M6893Q5927q549R95j33080N1958j28638r7339K78495
17874A10172l2884n8384M0301K61770j5431n9186o2161J48376M3032o4538r2345
17863B18722j10580j51372L0600N4675K10590M8773M5363J8486J77063l4167k45981
$$ y = [-32114, 125983, 69390, 23848, 147048, 244064, 213409, 87870, -42585, -162788, -59552, 125003, 63841, -14879, 147809, 107354, 30401, -7528, -57197, -14502, 216696, 292455, 437077, 429214, 306540, 205999, 376136, 292243, 100403, 93282, 168759, 242759, 244894, 333273, 286794, 121134, -27945, 4448, 137533, 234471, 296688, 387339, 331098, 405608, 404678, 383889, 324791, 169939, 77600, 112449, 247997, 440811, 423293, 84926, 10560, -79630, -7405, 13510, 60403, 146330, 137781, 138776, 5696, 57654, -70984, -168323, 110172, 77288, 18904, 59205, 320975, 305544, 246358, 184197, 332573, 375605, 311067, 218722, 108142, -43230, -12630, 42045, 252635, 301408, 346771, 365257, 542320, 508153, 262172]
17852B62172l9436J7628n5383j28196K9723q5640P0929R9569j57488j01307M4144
17841d3285r6125j63918R0612O5675J5653O0236J29848K7233n657p0815p1929
17830f2472P2849N9505N5710j3945K01413K9204l6765o8532k68179j30080Q7842
17819g3450M7183N1959J2104p7070o9903j60591j3420j2730K46840K81062o3888
17808A68096k0893p4725o6759O3925j06205l2576K9301n1214M338J16246o3526
17797c3992k31917J9295r5525J58097J93473j23126j18305L881J76727k6909j30555
17786b08856j32314J75347J52457P1808J59552M3549M7056j46789j00122P01L8685
17775A01074k54354k67015N6576L06369k10427j69766J88197J38742J65724J03163
$$ y = [262172, 222736, 240364, 184981, 56785, 86508, 868, 71797, 171366, 13878, -87429, -43285, -139410, -303328, -212716, -147041, -131388, -71152, 58696, 85929, 80272, 9457, -62472, 10377, 69882, 125592, 111647, 313060, 342264, 305499, 236967, -31212, -161292, -73450, -26267, 25692, 37796, -39274, -109177, -269768, -283188, -295918, -49078, 231984, 168096, 147203, 72478, 5719, 69644, -36561, -69137, -39836, -91050, -86712, 29534, -33992, -265909, -246614, -342139, -184042, 9431, -113695, -232000, -228119, -51392, -78301, -208856, -341170, -165823, -13366, 58442, 217994, 261543, 308599, 161810, 61688, 62389, 101074, -153280, -420295, -363719, -57350, -267777, -437543, -249346, -110604, 55120, 158283]
17765A58283j26544j26515k9802R8230r8495j77506K18522K79465L723M6330N5210
17754C00901n0j02253n4192N2983N4709k85953o8919L78934l0235j14892K01890
17743C32923R3239j89660k17647j9572J0473M7364J09380J01374j70181j77508
17733g9815N4051K07448J17940o6304k41384O443J04294r2844j76531P446m7277
17722b06533J35404Q6577j31192n7943J89935L0132l7234r693q6266j29053o8313
17711b84179J52674K29272J3606j63386m8214R3337L558k4498n5618j64803p6014
17700c24265J2293j3745J29483L50055J83911q5376J3210Q8940k34399q7792R762
17689D2077r9340q1871n5132j20172q3855L02905k4345k64714j12100K66627R5151
$$ y = [158283, 31739, -94776, -124578, -26348, -124843, -302349, -83827, 195638, 199361, 245691, 300901, 300851, 198598, 144406, 197389, 252098, -33855, -102774, 276160, 245925, 131033, 332923, 426162, 236502, 18855, -717, 9756, 57120, 166500, 267874, 97693, -79815, -25764, 181684, 299624, 233320, -8064, -1621, 102673, 9829, -166702, -159256, -206533, -71129, 15448, -115744, -173687, 16248, 46380, 9146, -547, -86813, -215866, -284179, -131505, 97767, 111373, -52013, -100227, -6890, -3332, -27830, -83448, -248251, -324265, -311972, -325717, -196234, 153821, 337732, 252356, 265566, 354506, 120107, 32315, 42077, -57263, -139134, -194266, -314438, -398293, -95388, -119733, -384447, -496547, -229920, -134769]
17678a34769J7629J65140M5056K9269j68795q5261r7819J0329L5215K97002J61102
17667B74098p6683k20890K1324n9306r8381j0114l350J61424l7555j3123o3322
17656a25878j89089Q7536n5677J09305K5061K60752J23604M1367q2384n9443k35
17645A34919J55667K3443j90017k8900K0033n6135j87605p7727n7037J53219J16397
17634F257m4872j78354j45177J10889L0985r3450J8639K0950m0779P4323M23814
17623A83225K69525j05693k07072o9790q3383n3903j38432j63570J7595p6218
17613d27716r7279J8662K6097L66772M2054j50285j13204J11224J95552m1567
17603f9690k4810L8132Q9338N9075J5828k10281j93441M0561J38221n1641R1759
$$ y = [-134769, -117140, 48000, 93056, 122325, -46470, -131731, -229550, -219221, -184006, 112996, 274098, 197415, -23475, -2151, -61457, -159838, -169952, -173302, -11878, -49433, -62556, -125878, -314967, -227431, -283108, -173803, -148742, 112010, 235614, 276981, 194597, 135154, 134919, 290586, 314029, 124012, 95112, 115145, 59010, -128595, -206322, -263359, -110140, 6257, -38615, -216969, -362146, -251257, -220272, -313722, -295083, -274133, -314912, -240589, 183225, 452750, 347057, 139985, 70195, -13188, -67091, -205523, -369093, -351498, -427716, -524995, -506333, -480236, -113464, -71410, -221695, -334899, -223675, -28123, -69690, -94500, -56368, 32970, 92045, 107873, -102408, -295849, -255288, -117067, -168708, -76949]
17592g6949n5753K385m8808l2309k4587q9735q461J01930K81653J16810j04864
17581F1312j04560j36516j10143M9628Q392K14088R048n0299j69605J29586L48587
17570B49518M9564j86057l0538j9811M8144m6791k653J31386K1986q264j51811
17559E4673k75557r1844K9006j62895K5113O5568J29320M6508N0996n8259j36963
17548c24334p4121j1258J47774J41765K18565j23138j64994n9141N8231J97348
17538F697K4851m7185K66533n6232j24669j29613q9127j9253L4654j91944L9308
17527b85980L60330J15267Q9362j56830k58555K5334L5283J54308N9898o3946
17517G4471m3915k7309m5578j3944J74336o688Q9138q1945j63213L759L8526L7187
$$ y = [-76949, -132702, -130317, -179125, -211434, -236021, -325756, -334217, -232287, 49366, 166176, 61312, -43248, -179764, -289907, -240279, -231887, -17799, -8751, -59050, -228655, -99069, 249518, 299082, 113025, 82487, 62676, 110820, 64029, 61376, 192762, 214748, 206484, 54673, -220884, -312728, -283722, -446617, -421504, -355936, -226616, -180108, -129112, -187371, -324334, -398455, -409713, -261939, -120174, 98391, -24747, -189741, -248882, -190651, 6697, 31548, -15637, 250896, 194664, 69995, -59618, -148745, -167998, -133344, -325288, -285980, 74350, 189617, 278979, 122149, -136406, -111072, -75789, 78519, 138417, 74471, 30556, 3247, -42331, -56275, 118061, 111373, 200511, 118566, -44647, -40888, -2362, 34825]
17505C4825L1325q6329o0301J88920J58324J05937m910k08046k48564k34997j40846
17494d64662J20062K18098J14719r6673n7087p9873J50448P5391j9590j50074
17484a89241r1858p5025l6402Q3931L70943r372N6565p8329p5377L3657j33749
17473a44257J9805n219Q0149k9582j8265n0740J05283j8826J22796J34957q097
17462A88004k79928j08275M5798j01146J32141J81353J24285j22210j12589j13916
17452a66483J44796K63586N7799j43624l9205P5613N45413L07255M72420L88344
17442A905914k88703n65916l39628j19881k69643p813j31315p7875n9960o9026
17432b3846p4164K5776J20589j23235N6531J29302j63666j45695p3386j9351K29788
$$ y = [34825, 66150, -20179, -80480, 108440, 266764, 372701, 367791, 159745, -88819, -323816, -464662, -344600, -126502, -11783, -108456, -165543, -245416, -94968, -19577, -39167, -189241, -281099, -356124, -392526, -308595, 62348, 52976, 109541, 31212, -44165, -10508, -144257, -124452, -129671, -49522, -79104, -97369, -148109, -42826, -61652, 61144, 196101, 188004, -91924, -200199, -154401, -255547, -123406, 57947, 182232, 60022, -52567, -166483, -21687, 241899, 299698, 156074, 116869, 192482, 737895, 1045150, 1517570, 1905914, 1617211, 1051295, 711667, 591786, 322143, 314330, 183015, 105140, 45180, -23846, -98010, -72234, 48355, -74880, -18349, 110953, -52713, -198408, -271794, -291145, -61357]
17421f1357J54242M7033j01640j77064J00057R4723k1613o8397o8597J61395l2072
17410B6710M6653R3113j7424q6580m0531k18128l5371J83052J82462J0097n7734
17399H6319N994l1283j42093n8749p5238p6878n3085J41225l8838n5356O1892
17388b36090J17787K09581R1634l02557k48307j1547K46495j4839J4545K7484
17378a05814K5933k26762j00494J49835J97106l7672j07110j37010j09391l8650
17368d90029K24221K39665j10195O4131K7131J52402m1101j34532K0577J45387
17358I7657L4752r7842k874K3404j50226P3009K6336j0709j2809l1252j09210
17347a59764J23879J89740J04031o7870j15071q3204L8609j30553j5895J48439
$$ y = [-61357, 92885, 139918, 38278, -138786, -38729, 55994, 34381, -34016, -102613, 58782, 26710, 73363, 166476, 149052, 62472, 21941, -196187, -231558, -48506, 133956, 144053, 86319, 92313, 61030, -81063, -139812, -215050, -291928, -345013, -203788, -242626, -297982, -236090, -118303, 91278, 182912, -119645, -367952, -379499, -133004, -147843, -133298, -105814, -79881, -306643, -407137, -257302, -60196, -97868, -204978, -341988, -451379, -490029, -265808, -26143, -136338, -72207, -45076, 107326, 66225, -68307, -47730, 97657, 132409, 34567, 31693, 55097, -95129, -22120, 4216, -6493, -19302, -50554, -159764, -35885, 153855, 257886, 190016, 74945, -8259, 30350, -100203, -116098, 32341]
17337C2341r2859M8810K69027j44307k78716j86249Q5048K62146m4222k55237
17327c04218r2960L8618J43589J72440J99082j55853O8707J75580Q6565j30828
17317B00722k46955p8776O5653n8619j2441P713J72186L0318q6161Q6486K7984
17306A08110N6626R5245j25945k0686n4164n2463k04824P2977N1170j56223j83594
17295d13771j30827l7978J81805Q2671P7187J53449j6848j28396p417J69773p3510
17284a43862j50304j31727o361j22012J37309L89965K75437j07345j51707n5197
17274f5804j42109K4142j8472K02537J23268m2727l8726m3147o9945j04884j05197
17263b81064l8354J03832J7811Q5817J6710K31438N1024o4410p954l2867l26693
$$ y = [32341, -60518, -11708, 257319, 113012, -165704, -351953, -266905, -4759, -48981, -304218, -397178, -358560, -214971, -42531, 156551, 698, 69405, 244985, 331550, 200722, -46233, -125009, -59356, -117975, -130416, -122703, 49483, 79801, -6360, 80126, 108110, 164736, 259981, 134036, 113350, 59186, 6723, -198101, -125124, -73954, -230177, -413771, -544598, -582576, -400771, -318100, -240913, -87464, -104312, -232708, -240125, -70352, -143862, -294166, -425893, -432254, -554266, -416957, -26992, 248445, 141100, -10607, -65804, -207913, -183771, -202243, 294, 123562, 80835, 42109, -1038, -70983, -175867, -281064, -319418, -215586, -197775, -111958, -95248, 136190, 187214, 122804, 114850, 81983, -244710]
17252b44710j7259L34447m100p2962r1103M7534n00R7262j4288q9872r2619Q8572
17240e9598k6402R7226O842p9959j01565J24384n3436J2465K05157j2101k01787
17229h8774p1621l54462j43086J14780K01800J40435J81057j26184n9617j14201
17219c19873j87371J82124K50539J22936Q8060k25207j20152K3922P1071J48379
17209C4428O4912n5092k74003j51081K9103J41390L17975n8399j54501J06052
17199G84J43409N5538p6552k35282k46211j35574Q7813K73544m5165k31562k11576
17188f20834R3522J80162J71138k9870j06603K43698p9265k21072l6713R6667
17178c09170o9094O0763J00930J51342K21016j13404j31160j50071n5890n5375
$$ y = [-244710, -261969, 72478, 68378, -4584, -95687, -48153, -48653, 48609, 34321, -55551, -148170, -59598, -86000, 11226, 18068, -61891, -163456, -39072, -92508, -80043, 125114, 113013, -88774, -160395, -514857, -657943, -543163, -341363, -200928, -19871, -146055, -205672, -319873, -507244, -325120, -74581, 48355, 136415, -88792, -208944, -185022, -113951, 34428, 99340, 44248, -229755, -380836, -351733, -210343, 107632, 49233, -105268, 784, 144193, 199731, 123179, -112103, -358314, -493888, -406075, -132531, -177696, -409258, -620834, -527312, -347150, -176012, -205882, -312485, -68787, -148052, -369124, -405837, -309170, -378264, -317501, -216571, -65229, 155787, 42383, -88777, -238848, -294738, -350113]
17168c50113l8433j50580J53459K17231J10201j8309j27081P0382J37906n2934
17158d8271N7294k0810j86029j09420p3677J7017j43250R7116L46223m7612r1283
17147b02702K23230P048l7326j1365O5325l7491K02306k2710R80R6345j9799m4450
17135B19391m9321j05131M7328K38429j09897k18231J47383R6807j27940o763
17125A32055j29298q5077R5338N2885o0325k18390j7124l0900q8948R2310J585
17114b55889k1631o7780O1694q5033o1559J39770K18909j2275m7132J22538L2088
17103B3700Q3290J36312k88444k8545j646J4074o5711N8661J06437j67261j07840
17092b36973M6190K3374J10057l073r4895O6230r73P5202L5051M5420p0028j39088
$$ y = [-350113, -388546, -539126, -385667, -168436, -58235, -76544, -203625, -133243, 4663, -48271, 9023, -11787, -197816, -307236, -380913, -363896, -507146, -410030, -63807, -111419, -202702, 20528, 27576, -9750, -21115, 44210, 6719, 209025, 186315, 187295, 283640, 263841, 219391, 170070, 64939, 112267, 350696, 240799, 22568, 169951, 266758, 138818, 132055, 2757, -82320, 13018, 65903, 5578, -212812, -229936, -260836, -349784, -257474, -255889, -277520, -345300, -283606, -368639, -430198, -290428, -71519, -83794, -130926, -8388, 23700, 106990, 243302, -45142, -73687, -75333, -61259, -126970, -68309, 38128, -129133, -236973, -190783, -167409, -57352, -60425, -155320, -89090, -90063, -14861, 20190, 65610, -4418, -143506]
17080a43506k40451j36248m825N4317j10607J91695K02084j33116m4823R0080
17070b75400J54217J41511j22029p1241K1628L8216m073k91074J15755K87539
17060d951k1190q9175j56166j47661J64677J00899J38474L3263m6495j83915j14282
17049c26522L7392R4229J86012Q2293p7813k2416O3152J18539M9726J16128k4234
17038B96486j74208O318J47033q4931k04977l3389J8968J29158J49071q4347j73709
17027h527q8188j14517R4473Q5679n367K1981J66443r8639k16571l9134j16536
17016c18903p1595o2001k7215j2768P6951J06331J82215P4614R3026K6795N0786
17005A18236j65233j38637P7455K50466J07998p2851l2023O7414Q1617K2142o9122
$$ y = [-143506, -383957, -520205, -525030, -470713, -581320, -389625, -187541, -320657, -365480, -275400, -121183, 20328, -101701, -172942, -151314, -113098, -117171, -408245, -292490, -4951, -26141, -115316, -271482, -419143, -254466, -153567, -15093, 18170, -28325, -212240, -326522, -289130, -194901, -8889, 73404, -4409, -26825, 36327, 154866, 204592, 320720, 296486, 122278, 128596, 275629, 190698, -14279, -47668, -28700, 100458, 249529, 165182, -8527, -96715, -211232, -116759, -31080, -36447, -14466, 151977, 53338, -163233, -202367, -318903, -390498, -452499, -479714, -492482, -415531, -309200, -126985, -52371, 40655, 67450, 118236, -46997, -185634, -108179, 142287, 250285, 177434, 145411, 212825, 294442, 316584, 247462]
16994B47462j9984j60278O3374j35690k77282j23460J31873j06252M3180K34179
16984a02878N68L8163Q6229m4442N6606J69123J22832l82289j97126J04465J67883
16973A9134k8130j42171j09320K1992r6547P9176n8441K06551P3446n8532j50929
16962b43771o308J19709K30868M8769q9295J12203k4397k66415n6061m0673j9437
16951b34808Q3247Q0138l3999m4517J02028q7099J7401J64380R6857j87778k04595
16940b48745L753J63132O6247K14146L4866K8110p1533j68389j39098O7821m1750
16929i1440N941J72933K58357M0610j04895J17006j29376j28169j11997o0159
16919c1189j02368J73512P7914k4356k29644j18748n9836N4038n8024P3087J04796
$$ y = [247462, 227478, 67200, 130574, -5116, -282398, -405858, -273985, -380237, -337057, -102878, -102310, -64147, 22082, -22360, 34246, 203369, 326201, -56088, -253214, -148749, 19134, -8996, -151167, -260487, -238495, -335042, -255866, -314307, -107756, -34310, -92842, -243771, -250079, -130370, 100498, 149267, 59972, 172175, 147778, -118637, -174698, -215371, -234808, -151561, -71423, -105422, -149939, -47911, -135010, -117609, 46771, 143628, -44150, -248745, -244992, -81860, -15613, 198533, 233399, 261509, 189976, 21587, -117511, -49690, -91440, -85499, 87434, 345791, 386401, 281506, 398512, 269136, 140967, 28970, -31189, -133557, 39955, 117869, 93513, -136131, -254879, -314715, -260677, -318701, -245614, -140818]
16908a40818Q8681r1463P1533J606Q6284m8038j94639r0515J67737J98435j5752
16897C3051k2631j01660P8552j3127R5479K4534l5907N1677J0328Q1449R8759
16886C00504k35026k07236n2344k12915p6246o8669J80871K95186M8060j49229
16876a77044j10210r9188P8331j68462K4218K73259j3368j18942J41720R6471
16866g3215L913k6340o4560j11480k086L1947n7910n5648j19842m7468K58581
16855b64108J08425K01357J78592R3625o5017j38190r0544R1524J43820k6217
16845B33267j41966J54847q343J13366p7629k23036j46036J14121m0829l0560
16835e2798r4819J160K8066K0031J256j19063j60523J88081K28130K1712q6593
$$ y = [-140818, -52137, -143600, -72067, -70461, 15823, -32215, -226854, -317369, -149632, 48803, 33051, 10420, -91240, -12688, -25815, 69664, 94198, 58291, 109968, 120296, 201745, 300504, 65478, -141758, -194102, -407017, -483263, -551932, -371061, -75875, -27815, -177044, -287254, -386442, -308111, -476573, -452355, -179096, -192464, -311406, -169686, -73215, -69302, -95642, -160202, -271682, -273768, -241821, -299731, -355379, -475221, -522689, -264108, -155683, 45674, 224266, 317891, 252874, 114684, 24140, 115664, 259484, 233267, 91301, 246148, 237805, 351171, 273542, 50506, -95530, 18591, -22238, -52798, -147617, -146457, -118391, -98360, -97104, -216167, -376690, -188609, 39521, 61233, -25360]
16824b5360l3633m5386J08206o92j63161J6512J68403p0471M4963j75784M0326
16813a36077J81734Q3970o5790j28133l5455k925j34882O3509J61046O2910J76938
16802B26845j50302R3209m5077q8305p42L6230j01736Q3263o9781m6421j12875
16791a75692L9183m9108j84949k8037R0839J1320j34428R4970P659K9356P7929
16780b20958j09320p8520J86631L38028J05934p7785k19910K3806O038L1817J48589
16769A34350n9159m1848j43000N042J4284J07396J10359K7103k11979j77513j01908
16758c36873K38442J44585j21855L2052k0283j06673J4839N0980K45949o2333
16748G8830k28901k8685n5230J69311J20454R2777M238k67261n4269K22694k02314
$$ y = [-25360, -58993, -104379, 3827, 3135, -160026, -143514, 24889, -45582, -619, -176403, -136077, 45657, 129627, 63837, -64296, -99751, -102676, -237558, -174049, -13003, 49907, 226845, 76543, 169752, 124675, 36370, 35628, 71858, -29878, 53385, -16396, -62817, -175692, -136509, -185617, -370566, -398603, -307764, -296444, -430872, -335902, -328243, -298887, -220958, -330278, -408798, -222167, 115861, 221795, 144010, -75900, -52094, -46056, -14239, 134350, 75191, 33343, -109657, -104615, -90331, 17065, 127424, 154527, -57452, -234965, -336873, -98431, 46154, -75701, -43649, -63932, -170605, -155766, -104786, 141163, 78830, -150071, -178756, -233986, -64675, 55779, 148556, 152794, -114467, -168736, 53958, -148356]
16737a48356m4654K87188K30530k06755o7008j05352n5961l0471L3594O3367j21687
16726a65565J26616J10216r5862j33621j78641M2504J3650o1440J43487J26058
16716g2598J17144p353K46495O9811q3588l5986l3506O328M1762j83684k46052
16705a81227N7302K18963J18025j93864r6477j00222j24358J57481J26634j07598
16695a25341m5587L7994M5320J01555K3983r265O8579M6998r4853l5541q7673
16684g3831q1534j85390n6396j0135J51667R1000o3120j27027l4439J51738l4677
16673b72144L5739L4865J7314j00851m6522r7898l7808k3801J25410K75215K97208
16662B06727m0188k31667k81015j22225j4196j3678k4048J66428O0242R1760Q2858
$$ y = [-148356, -193010, 94178, 324708, 117953, 50945, -54407, -110368, -140839, -107245, -43878, -165565, -38949, 71267, -24595, -158216, -336857, -294353, -280703, -342143, -198656, -72598, 44546, 37193, 283688, 353499, 269911, 233925, 200419, 206747, 248509, 64825, -181227, -123925, 95038, 213063, 19199, -77278, -177500, -301858, -144377, -17743, -125341, -170928, -132934, -87614, 13941, 37924, 28659, 97238, 144236, 49383, 13842, -73831, -155365, -340755, -397151, -407286, -255619, -164619, -227739, -354766, -389205, -237467, -272144, -236405, -201540, -184226, -285077, -331599, -429497, -467305, -491106, -365696, -90481, 206727, 166539, -65128, -346143, -468368, -482564, -496242, -520290, -353862, -293620, -201860, -119002]
16651a19002J19866N6914r4731l80j14308k9731J54751J83084r0016r559j55578
16640i8690N4984o943j77907P3103K60386Q7359J4162k74811J2552J55781J1479
16629A11455j6266N0323j83392j38188j05879J61906R550J29917M4451j44414
16619h0537R2532J35849j23475k37322L2741m6976J42827k1067P0557q8344k29327
$$ y = [-119002, 864, 57778, -36953, -37333, -151641, -181372, -26621, 156463, 66447, 56888, -98690, -43706, -50649, -228556, -155453, 104933, 192292, 206454, -68357, -55805, 99976, 111455, 95189, 145512, -37880, -176068, -281947, -120041, -110491, 19426, 63877, -80537, 11995, 147844, 24369, -212953, -180212, -227188, -84361, -105428, -34871, -123215, -352542]
$$ [...]
##END NTUPLES=NMR SPECTRUM
##END=
