##TITLE=Analysis number 329956
Compound Code cc 09501
Book Reference 537/62
Project Code adrs
Chemist Name howarde
##JCAMPDX= 6.0         $$ Bruker NMR JCAMP-DX V2.0
##DATA TYPE= NMR SPECTRUM
##DATA CLASS= NTUPLES
##ORIGIN= Bruker BioSpin GmbH
##OWNER= nmr
$$ XWIN-NMR		Version 3.5
$$ Tue Oct 16 09:10:43 2007 GMT Daylight Time (UT+1h)  MAYBRIDGE\nmr@NMR_250MHZ
##.OBSERVE FREQUENCY= 250.131544655141
##.OBSERVE NUCLEUS= ^1H
##.ACQUISITION MODE= SIMULTANEOUS (DQD)
##.ACQUISITION SCHEME= undefined
##.AVERAGES= 16
##.DIGITISER RES= 18
##SPECTROMETER/DATA SYSTEM= dpx250
##.PULSE SEQUENCE= zg30
##.SOLVENT NAME= TFA
##.SHIFT REFERENCE= (INTERNAL, TFA, 0, 16.522)
##AUDIT TRAIL= $$ (NUMBER, WHEN, WHO, WHERE, WHAT)
$$ ##TITLE= Audit trail, XWIN-NMR		Version 3.5
$$ ##JCAMPDX= 5.01
$$ ##ORIGIN= Bruker BioSpin GmbH
$$ ##OWNER= nmr
$$ C:\u/data/dgb/nmr/ADRS/780/pdata/1/auditp.txt
$$ ##AUDIT TRAIL=  $$ (NUMBER, WHEN, WHO, WHERE, WHAT)
(   1,<2007-10-16 09:10:20.01 +100>,<MAYBRIDGE\nmr>,<NMR_250MHZ>,
      <created by zg, POWCHK disabled, PULCHK disabled
       configuration hash MD5:
       76 6E 9A 78 1E 09 19 81 EC 84 63 8F B0 6A 59 2D
       data hash MD5: 64K
       47 AE A7 26 C1 08 92 E6 3E E2 31 BD CD F0 E6 37>)
(   2,<2007-10-16 09:10:33.85 +100>,<MAYBRIDGE\nmr>,<NMR_250MHZ>,
      <Start of raw data processing
       ef LB = 0.3 FT_mod = 6 PKNL = 1 SI = 32K 
       data hash MD5: 32K
       79 95 84 18 3E 87 B5 93 5E 83 58 EB 00 3D 61 F0>)
(   3,<2007-10-16 09:10:35.51 +100>,<MAYBRIDGE\nmr>,<NMR_250MHZ>,
      <apk 
       data hash MD5: 32K
       A7 91 DA 8A 13 A4 57 C3 E4 BF C7 8A 58 60 B8 8D>)
(   4,<2007-10-16 09:10:36.35 +100>,<MAYBRIDGE\nmr>,<NMR_250MHZ>,
      <abs ABSG = 5 
       data hash MD5: 32K
       60 BD 4A EA 4D 08 E3 DB CB 6A 1C 23 FB C5 DC 45>)
$$ ##END=
$$ 
$$ hash MD5
$$ 1E 5C 96 55 42 67 7F 6E D7 A6 F6 FE DD B5 E9 33
##$RELAX= 
##$RELAX= 
##$RELAX= 
##$RELAX= 
##$RELAX= 
##$RELAX= 
##$RELAX= 
$$ Bruker specific parameters
$$ --------------------------
##$DU= <C:\u>
##$EXPNO= 780
##$NAME= <ADRS>
##$PROCNO= 1
##$TYPE= <nmr>
##$USER= <dgb>
##$AMP= (0..31)
100 100 100 100 100 100 100 100 100 100 100 100 100 100 100 100 100 100 
100 100 100 100 100 100 100 100 100 100 100 100 100 100 
##$AQSEQ= 0
##$AQ_mod= 3
##$AUNM= <au_zg>
##$AUTOPOS= <6 >
##$BF1= 250.13
##$BF2= 250.13
##$BF3= 250.13
##$BF4= 250.13
##$BF5= 500.13
##$BF6= 500.13
##$BF7= 500.13
##$BF8= 500.13
##$BYTORDA= 1
##$CFDGTYP= 0
##$CFRGTYP= 5
##$CHEMSTR= <none>
##$CNST= (0..31)
1 1 145 1 1 1 1 1 1 1 1 1 1 1 1 1 1 1 1 1 1 1 1 1 1 1 1 1 1 1 1 1 
##$CPDPRG= <>
##$CPDPRG1= <>
##$CPDPRG2= <>
##$CPDPRG3= <>
##$CPDPRG4= <mlev>
##$CPDPRG5= <mlev>
##$CPDPRG6= <mlev>
##$CPDPRG7= <mlev>
##$CPDPRG8= <mlev>
##$CPDPRGB= <>
##$CPDPRGT= <>
##$D= (0..31)
0 1 0 0 0 0 0 0 0 0.06 0 0 0 0 0 0 0.0002 0 0 0 0 0 0 0 0 0 0 0 0 0 0 
0 
##$DATE= 1192522218
##$DBL= (0..7)
120 120 120 120 120 120 120 120 
##$DBP= (0..7)
150 150 150 150 150 150 150 150 
##$DBP07= 0
##$DBPNAM0= <>
##$DBPNAM1= <>
$$ [...]
##$SUBNAM7= <"">
##$SUBNAM8= <"">
##$SUBNAM9= <"">
##$SW= 20.6930455092707
##$SWIBOX= (0..15)
0 0 3 0 0 0 0 0 0 0 0 0 0 0 0 0 
##$SW_h= 5175.983436853
##$TD= 65536
##$TD0= 1
##$TE= 296.16
##$TE2= 300
##$TE3= 300
##$TEG= 300
##$TL= (0..7)
0 120 120 120 120 120 120 120 
##$TP= (0..7)
150 150 150 150 150 150 150 150 
##$TP07= 0
##$TPNAME0= <>
##$TPNAME1= <>
##$TPNAME2= <>
##$TPNAME3= <>
##$TPNAME4= <>
##$TPNAME5= <>
##$TPNAME6= <>
##$TPNAME7= <>
##$TPOAL= (0..7)
0.5 0.5 0.5 0.5 0.5 0.5 0.5 0.5 
##$TPOFFS= (0..7)
0 0 0 0 0 0 0 0 
##$TUNHIN= 0
##$TUNHOUT= 0
##$TUNXOUT= 0
##$USERA1= <user>
##$USERA2= <user>
##$USERA3= <user>
##$USERA4= <user>
##$USERA5= <user>
##$V9= 5
##$VALIST= <valist>
##$VCLIST= <CCCCCCCCCCCCCCC>
##$VD= 0
##$VDLIST= <DDDDDDDDDDDDDDD>
##$VPLIST= <PPPPPPPPPPPPPPP>
##$VTLIST= <TTTTTTTTTTTTTTT>
##$WBST= 1024
##$WBSW= 4
##$XGAIN= (0..3)
0 0 0 0 
##$XL= 0
##$YL= 0
##$YMAX_a= 563765
##$YMIN_a= -577656
##$ZGOPTNS= <>
##$ZL1= 120
##$ZL2= 120
##$ZL3= 120
##$ZL4= 120
##$ABSF1= 16.522
##$ABSF2= -4.171173
##$ABSG= 5
##$ABSL= 3
##$ALPHA= 0
##$AQORDER= 0
##$ASSFAC= 0
##$ASSFACI= 0
##$ASSFACX= 0
##$ASSWID= 0
##$AUNMP= <proc_1d>
##$AZFE= 0.1
##$AZFW= 0.1
##$BCFW= 0
##$BC_mod= 0
##$BYTORDP= 0
##$COROFFS= 0
##$CY= 12.5
##$DATMOD= 1
##$DC= 0
##$DFILT= <>
##$DTYPP= 0
##$F1P= 14.0000005364418
##$F2P= -0.99999901652339
##$FCOR= 0.5
##$FTSIZE= 32768
##$FT_mod= 6
##$GAMMA= 0
##$GB= 0
##$INTBC= 1
##$INTSCL= 1
##$ISEN= 128
##$LB= 0.3
##$LEV0= 0
##$LPBIN= 0
##$MAXI= 10000
##$MC2= 0
##$MEAN= 0
##$ME_mod= 0
##$MI= 0
##$NCOEF= 0
##$NC_proc= -3
##$NLEV= 6
##$NOISF1= 0
##$NOISF2= 0
##$NSP= 0
##$NTH_PI= 0
##$NZP= 0
##$OFFSET= 16.522
##$PC= 1
##$PHC0= 147.5607
##$PHC1= 5.176899
##$PH_mod= 1
##$PKNL= yes
##$PPARMOD= 0
##$PSCAL= 4
##$PSIGN= 0
##$REVERSE= no
##$SF= 250.13
##$SI= 32768
##$SIGF1= 0
##$SIGF2= 0
##$SINO= 400
##$SIOLD= 32768
##$SREGLST= <1H.TFA>
##$SSB= 0
##$STSI= 32768
##$STSR= 0
##$SW_p= 5175.98343685301
##$SYMM= 0
##$S_DEV= 0
##$TDeff= 65536
##$TDoff= 0
##$TI= <Analysis number 999999
Compound Code 99
Book Reference 9
Project Code 9>
##$TILT= no
##$TM1= 0
##$TM2= 0
##$TOPLEV= 0
##$USERP1= <user>
##$USERP2= <user>
##$USERP3= <user>
##$USERP4= <user>
##$USERP5= <user>
##$WDW= 1
##$XDIM= 32768
##$YMAX_p= 292493425
##$YMIN_p= -1180526
$$ End of Bruker specific parameters
$$ ---------------------------------
##NTUPLES= NMR SPECTRUM
##VAR_NAME=  FREQUENCY,     SPECTRUM/REAL,   SPECTRUM/IMAG
##SYMBOL=    X,             R,               I
##VAR_TYPE=  INDEPENDENT,   DEPENDENT,       DEPENDENT
##VAR_FORM=  AFFN,          ASDF,            ASDF
##VAR_DIM=   32768,         32768,           32768
##UNITS=     HZ,            ARBITRARY UNITS, ARBITRARY UNITS
##FACTOR=    0.157963299565203, 1,           1
##FIRST=     4132.6476996994, 0,             0
##LAST=      -1043.33573715361, 0,           0
##MIN=       -1043.33573715361, -1180526,    0
##MAX=       4132.6476996994, 292493425,     0
$$ Real data points
##PAGE= N=1
##DATA TABLE= (X++(R..R)), XYDATA
32767 4858 17601 4083 7071 4305 -14730 -14718 -9454 -14291 -35013 -61729 -67512 -67387 -62402 -48835
32753 -48835 -22992 -20827 -25153 -10399 -14646 -25952 -25070 -20738 -16545 -14038 -15527 -18207 -24876 -27002
32739 -27002 -37530 -13504 -9378 -35473 -18239 -9008 -12450 -25682 -31611 -20365 -7037 9226
32727 9226 11883 985 17643 39907 33092 18480 6983 9523 12050 -6396 -10047 6662 -2612
32714 -2612 1489 9267 -2758 -15974 -28880 -45733 -52836 -41429 -12863 904 -17098 -19750 -21917
32701 -21917 -22601 -16075 -1228 -6069 -15229 -28042 -30585 -22162 -35963 -38432 -33074 -22485 -12270
32688 -12270 -3180 -8138 -22224 -28564 -32114 -53630 -52796 -30020 -3958 -8018 -25062 -10416 -4306
32675 -4306 -6218 -2577 -798 4257 -3899 5406 11974 8691 642 -517 -158 23778 20003 13831 27711
32660 27711 12199 -10829 -28463 -38786 -28822 -27776 -32188 -27870 -10112 -12112 -47948 -58112 -38508
32647 -38508 -22319 -11955 -11547 -16687 -16305 -6596 27352 22481 1220 -50 -6929 -38848 -41930 -10735
32633 -10735 -2552 -27572 -19618 15082 -5477 -32412 -35630 -29477 -38282 -23187 -22322 -31939 -35910
32620 -35910 -23099 -38618 -33690 -46086 -45342 -56026 -30304 -26485 -27682 -27619 -16079 -11538 -18528 -7850
32606 -7850 -8349 -21294 -18582 6451 5651 4212 3685 1977 -22939 -41601 -36642 -35089 -49157 -35762
32592 -35762 -28168 -26218 -21689 -29575 -15796 2675 -11650 -32420 -36684 -23985 -18782 -29692 -34378
32579 -34378 -36117 -32087 -24187 -38622 -39671 -21448 -4535 -11873 -17476 -15816 -15637 -11235 9960 -6721
32565 -6721 -25188 -7007 13371 34547 19312 -8041 -3280 -9954 -8902 1316 -11182 -4440 2138
32552 2138 8174 15550 3668 8105 10930 5511 2864 -9099 -10038 8037 3500 -2796 -1438 2793
32538 2793 -3756 -7456 -43075 -40522 -48887 -32152 -7482 -17965 -16333 -12630 846 9376 -11325
32525 -11325 -38005 -41378 -17231 -33994 -21836 -23541 -26325 -9024 19188 20288 17882 16885 20122
32512 20122 5869 -5253 -13230 -9319 -23142 -27933 -12933 200 -13782 -32461 -41802 -28068
32500 -28068 -16466 -12554 -9421 -20211 -9638 -8162 -21186 -16904 -29311 -46459 -39862 -8046 17867
32487 17867 666 -22246 -38273 -52232 -35348 10236 30227 16034 -18815 -48272 -28386 -13621
32475 -13621 -22523 -45570 -58591 -40146 -15642 -12828 -22904 13702 11506 -12847 -24502 -23884 -5232
32462 -5232 13263 7021 6845 5909 19091 -2032 2583 1780 1368 -18343 -43938 -59300 -40310 -8878
32448 -8878 3094 9388 6278 33280 39966 -7026 -46618 -68593 -53306 -42554 -28636 -28121 -24371
32435 -24371 -27073 -4969 1194 -10122 -23878 -28760 -13180 -32004 -26151 -19995 -13395 -15019 -6496
32422 -6496 5842 -253 -9331 -11740 -32229 -46137 -35216 -12893 -22292 -5081 -495 -13345 -18222
32409 -18222 -4091 -28664 -37103 -44553 -51251 -43186 -31085 -8411 -10680 -32319 -50134 -47999 -23681
32396 -23681 -24909 -22770 -28651 -31151 -25125 -21391 -8000 -20299 -15210 -8320 -557 2609 9842 12149
32382 12149 824 -10809 -18081 -25926 -39367 -64958 -83637 -64714 -24835 -21361 4043 12071
32370 12071 14820 13195 638 -18797 -9679 -25797 -24579 -19985 -29451 -34353 -35519 -3085 17293
32357 17293 2840 1478 23160 13916 -7765 22501 22975 17204 43499 48963 42364 15919 3338
32344 3338 5433 2720 3161 12283 -15350 -63631 -83342 -73623 -45489 -44707 -40113 -27227 -22744 -17599
32330 -17599 -10736 -28844 -27139 -41356 -45521 -37707 -51014 -59917 -50696 -14392 -763 8223 -8253
32317 -8253 -14519 -38874 -51660 -49137 -41290 -15590 3432 -344 -2478 -9470 -13515 -27194 -29169
32304 -29169 -28981 -40469 -45896 -52558 -13335 32777 29156 3958 -2973 -11374 -17789 10948 31801
32291 31801 37982 4741 -969 31372 35523 28925 12876 6714 -3175 -46718 -35829 6854 13579
32278 13579 16940 -4340 -42541 -55416 -63215 -61825 -40528 -228 25428 29114 -12478 -39211
32266 -39211 -20610 -9759 5881 14604 15445 22135 -14686 -21907 -36796 -48205 -52214 -41343 -42181
32253 -42181 -58117 -43957 -37515 -33348 -38046 -30877 -12811 6837 5577 1191 26332 32715 23152
32240 23152 -6450 -8452 8283 684 4421 8867 9208 30319 38013 22419 17551 2241 -10359
32227 -10359 -36353 -52901 -30282 -10703 -6411 8509 18718 27869 20301 -11418 -2273 -14089
32215 -14089 -9589 12214 -7685 -21996 606 -13279 -43423 -38999 -12257 -20433 -19081 -18890 -58364
32202 -58364 -27498 19986 2327 -12624 -17244 -2373 9457 24645 30327 -5091 -37620 -57159
32190 -57159 -39941 -39448 -32040 -20631 -13371 -26995 -41199 -25886 -117 24041 6104 -2285 -3221
32177 -3221 3555 -25387 -26151 -1244 -1522 24807 263 -19918 -15717 -18124 335 9822 -11142
32164 -11142 -33816 -53500 -61453 -33300 -8707 20859 13683 -620 -9220 -12286 -29529 -12015
32152 -12015 -2633 -11482 -40551 -57011 -17803 1446 -16332 -40657 -46430 -23824 -18189 -32766
32140 -32766 -24240 3591 -3998 -9500 -41508 -65943 -51254 -37848 -60866 -81153 -64859 -41555
32128 -41555 -59304 -69748 -71447 -41343 -36863 -51383 -51026 -41238 -30738 -37321 -32284 -39763 -48018
32115 -48018 -18707 626 -16114 -9765 -12543 4928 15429 -9075 -35637 -39150 -31913 -31013 -11344
32102 -11344 -4159 -8032 -223 14761 22867 43510 20848 -9101 -31291 -33074 -41164 -31811 -21702
32089 -21702 6281 298 5113 8486 -15958 -29717 -7523 9901 24154 21544 14658 5003 3479
32076 3479 -31248 -20687 19028 11164 -6670 13071 18636 20058 35815 -116 -33706 -3079
32064 -3079 -13567 -31804 -31196 -18501 14913 22699 11159 10209 594 -1938 -4077 -9435 -6098 -5959
32050 -5959 -36289 -32162 -30912 -21872 -31086 -28124 -26972 222 13484 -3852 -32218 -51058 -29442
32037 -29442 -18309 -14704 -5587 -7159 -9459 5812 17387 5379 -22370 -29383 -67824 -53478 -19249
32024 -19249 -24610 -33515 -19684 6451 17073 6169 -16043 -40991 -21213 -7180 -28358 -46044
32012 -46044 -14711 -11053 -5611 -2068 3575 14035 2557 -3685 -19603 -24470 -26677 2381 25679
31999 25679 4304 40888 23593 -15078 -31656 -30096 -15151 25029 21737 -1811 -7592 -23473
31987 -23473 -22741 -28317 -25375 -40418 -9537 23361 12837 -26382 -41076 -37770 -24232 -47013 -37085
31974 -37085 -10374 -27302 -27844 -623 -3274 -10204 -2893 5996 12843 17916 -23285 -64276 -43306
31961 -43306 -22099 -41717 -38489 -17271 -9306 -16936 -43963 -23173 -1319 -3181 12622 11855 -1137
31948 -1137 -29730 -43486 -54715 -77872 -69829 -35682 -35226 -9530 -15045 -17092 -614 14727 13717
31935 13717 1908 -14836 -2759 8586 -2510 10601 19584 6037 -10631 325 -230 -3892
31923 -3892 -26427 -31741 -34178 -27795 -43373 -46835 -25250 -18516 -41974 -13741 -30581 -26106 -16602
31910 -16602 -33765 -37208 -14968 8439 16624 3528 -23193 -6226 -220 -4158 -293 -2527 1160
31897 1160 -24496 -41238 -40773 -40866 -8800 15439 22746 -9242 -23474 9267 -123 -9145 -917 16346
31883 16346 13178 -16564 -29054 -34071 -8379 -22326 -12469 10991 28377 23034 4747 9931 17238
31870 17238 -5861 -23127 -7097 -21856 -34076 -3394 -7420 -8354 -4848 19422 47820 43402 56180
31857 56180 68063 52379 55539 41407 -8026 -26850 -25245 -4032 19719 40377 28703 23428
31845 23428 5697 -8411 -2441 -28109 -50311 -41668 -27636 -29802 -44232 -31585 -29567 3366
31833 3366 10283 36083 40794 46368 32794 30318 8837 14890 14621 7914 8655 -23353 -26932 22667
31819 22667 36574 8030 -3898 10793 18711 6257 12469 9265 21152 39817 9551 -49437
31807 -49437 -39346 -7730 -17260 -27284 284 -11879 -31682 -19685 -22670 -48407 -42540 -7721
31795 -7721 3938 -4409 -25288 -45191 -61796 -34606 -12004 27150 13487 -16801 -15236 -33204
31783 -33204 -37150 -7876 9170 14784 27551 44079 43157 25404 19655 31510 47402 86926 85570
31770 85570 54421 47792 -122 -19201 -8425 -2955 24803 31686 13277 32292 46414 31497
31758 31497 10913 -17355 -5088 -17452 -15426 -1232 -5936 -10771 -11764 -6876 6492 1678 2927
31745 2927 23100 5701 -32898 -50528 -31353 -41973 -21800 24742 27945 25433 22916 1959
31733 1959 -4560 -6428 -20149 -9578 21530 3995 -22853 -44929 -29239 -61732 -35236 -5948
31721 -5948 -9346 -38784 -30312 -8235 4434 3720 27276 38103 19584 16499 4454 -7772 -726
31708 -726 -8098 23549 30171 11853 11877 3985 4397 20271 24457 25460 3101 7860 15837 24574 34901
31693 34901 41833 10334 -4194 2674 19714 33433 25611 11877 25675 28091 -2987 -26571
31681 -26571 -24700 -12786 -25222 20684 26018 7401 -4726 -15378 -9823 -16514 -15181 -4892 -27832
31668 -27832 -32956 -27004 3668 -781 8086 36661 -7473 -25816 -14321 -31894 -23433 -19541 -2993
31655 -2993 -660 15318 12716 2881 -4947 -17294 -5557 24277 1076 24488 31962 -10077 -14387
31642 -14387 1951 -18827 -38756 -7831 16840 19128 23238 27163 36454 36244 49486 44000 61960
31629 61960 40027 21792 24844 14748 -20197 -61073 -63958 -55924 -39566 -23824 4707 15980
31617 15980 43126 8662 -13312 308 6980 20893 6004 -5833 2642 -2534 7953 18770
31605 18770 24701 29387 16630 27107 22641 3106 -13059 21766 55429 26270 -5877 -449
31593 -449 15183 -16288 -37563 -22876 -6553 20056 13473 -6449 -21566 -22467 -25630 -22649 -2372
31580 -2372 4667 -4790 -2060 4468 -2036 -14518 -16268 -19423 -3574 -803 8682 14568 22969 11405
31566 11405 10808 17035 -7958 -37705 -11648 13525 15812 22455 10399 8335 10631 41452 65828
31553 65828 51977 36053 15858 -2245 -17215 -27803 -37463 -9796 20406 -2019 -4404 17855
31541 17855 6856 -13386 -26061 -33539 -56992 -38952 -15994 -18629 -5558 18673 -1478 -14575
31529 -14575 -21026 -16029 -29963 -449 5150 5937 39146 44813 -1101 -33569 -71824 -70284 -76088
31516 -76088 -76989 -54409 -40999 -49432 -58066 -49495 -54959 -60398 -61157 -37467 -17663 -13793 5150 -5843
31502 -5843 -21028 -11303 13635 15651 42814 36125 23489 -9533 28994 40114 26155 37166
31490 37166 35630 21263 -6135 -9612 117 3508 -10289 -15559 -13091 1646 40335 35684 33730
31477 33730 8175 -4642 -16437 -41027 -25980 -35580 -62772 -54604 -30954 5437 -18802 -49166
31465 -49166 -54496 -37270 -5056 -6926 11470 18804 10154 -19512 -36869 -12298 13627 2843
31453 2843 -12388 -34664 -48222 -25833 -10489 -13016 -36140 -28619 10214 1235 6454 2817 -11370
31440 -11370 -16524 -7263 -5107 -5359 -765 9651 10400 14960 -4383 -47781 -30352 25206 57724
31427 57724 49656 19752 1525 12490 15614 15064 -13880 -7399 -11159 -10565 -16202 -13532 -5980 2871
31413 2871 -2903 5042 11886 -12612 -35416 -18143 -11264 -948 7921 4125 -639 -14159 -8546
31400 -8546 33438 32062 5551 7365 -12142 -12831 -7041 -39604 -65082 -49316 -33128 -7548 -4062
31387 -4062 6140 12824 43116 44095 21814 23956 -6975 -21594 -2302 -6406 -19055 -21048 -19741
31374 -19741 -2731 -19953 -21894 -17560 10513 9792 -14511 -6209 -1172 13602 39346 62266 44486
31361 44486 33490 -20083 -38004 -52130 -55793 -37074 -12388 -990 -17353 -15003 3815 1202
31349 1202 -5646 14517 17465 -5046 22514 35431 7888 577 5849 20475 57307 56788 40083
31336 40083 41592 13438 -929 7513 20981 21159 -16809 -45580 -38365 -34877 -36521 11912 9184
31323 9184 9427 15935 -835 -11658 -1393 -30792 -43919 -19262 -3963 -10047 -10798 -27928 13078
31310 13078 9948 4426 203 24114 47034 28258 19991 17208 55719 53034 33684 15734 9761
31297 9761 -8227 -27520 -12609 23277 36866 13663 -5144 2215 15493 17037 12303 -7566
31285 -7566 -9167 -4529 22706 24569 12013 14339 11547 20629 13416 -6748 -20074 2643 4083
31272 4083 19307 30022 27720 21586 -10268 -33306 -49939 -51309 -48735 -36260 14260 20718 8317
31259 8317 -14091 -48728 -28269 -17647 -32479 -45323 -64640 -56478 -45122 -33682 6936 26356
31247 26356 21704 11323 11863 51706 46401 5312 241 13685 18955 -10571 13803 29487 24419
31234 24419 17935 -13357 -22543 -5576 31059 13691 -34497 -47312 -10324 3692 -10411 -2488
31222 -2488 -2151 1862 12227 6594 -12765 -9657 -37152 -38309 -31886 -37765 -26491 -10933 -17835 -41534
31208 -41534 -24666 -40691 -69255 -66434 -65826 -23826 6226 23725 32063 20110 -11440 8536
31196 8536 48561 31076 -28309 -61083 -66502 -27214 -44700 -62471 -66205 -33045 32478 31964 24822
31183 24822 10645 629 -1316 16068 18347 12236 -545 5013 21419 69658 56612 25919
31171 25919 42175 18207 -8265 20542 54550 41893 30906 51545 47843 45789 26591 34295
31159 34295 28218 17851 2008 12587 -1410 -17343 -21204 -40557 -49065 -51005 -40654 -25204
31147 -25204 -16924 -16882 -13135 -7106 -23752 -19924 4045 39213 40765 47610 34832 3653 -408 30659
31133 30659 44876 39047 47041 46931 18554 10879 -18509 2717 1360 13023 54400 54718 33042
31120 33042 36627 23173 7400 12836 -6164 -24243 -57229 -47917 -3491 29794 25765 11279
31108 11279 16540 21926 5831 6163 -13614 -12968 38 7539 13571 7964 18207 24744 9748 17470
31094 17470 37535 40256 11028 -30830 -45969 -38738 -41654 -36466 -19492 20279 16271 18339 -4241
31081 -4241 -25766 -38961 -51076 -38573 -15196 -10752 8736 -15396 -11517 -12629 185 9803 14084
31068 14084 14963 42235 62748 47036 -4199 -44299 -42115 -36619 -36591 -43110 -51356 -48546 -22307 -18414
31054 -18414 -47628 -58300 -50998 -34764 -20421 5113 23714 9113 3650 4009 -27507 -30556 -22495
31041 -22495 -18201 -3846 26160 25818 26882 28519 42410 35083 5478 -5657 -6351 14916 14747 1113
31027 1113 4480 30778 47847 40291 19762 -22647 -29713 -25273 -33993 -28825 -24656 -8084 -8557 -14175
31013 -14175 -10671 -19232 -24207 -3181 -15 -77 -920 -25237 -15179 5411 37931 36013 42109 21660
30999 21660 -13060 -7061 -21502 -42194 3879 49302 57737 56596 58435 55852 38365 40104 10448
30986 10448 17030 49669 46921 3052 -5548 11488 35833 16299 12540 16748 42036 61524 42150
30973 42150 20259 33543 28917 20927 12910 -3127 -42600 -32319 -20770 -31411 -38342 -27418
30961 -27418 -21590 -15835 -25623 -48691 -47166 -37886 152 38121 57028 54752 46210 48024 55270
30948 55270 43979 14230 4247 14606 16338 9078 17409 28951 36296 24556 19946 -8988 -32782
30935 -32782 -45712 -37336 -19934 12935 -2657 9800 9168 13438 -8257 -1762 22522 2499 -27038
30922 -27038 -32761 -31201 -394 1011 11370 -2501 8064 5999 23778 47875 20551 -2090
30910 -2090 -16778 -3134 10532 31880 36386 39129 38665 32579 21308 6455 -18203 -10888 -2062
30897 -2062 -23553 -27948 -34865 -22030 4270 -10498 -1850 5856 7920 9445 15301 -4823 -6304
30884 -6304 25429 56808 29717 14588 23509 15442 12456 30026 21752 23814 35325 54007 39236
30871 39236 5021 -40771 -32765 -2930 28499 23392 29337 27694 21916 14063 22939 18752 3851
30858 3851 -11798 -20318 -17488 -18158 -19810 -34419 -57065 -38634 -37215 -31481 -11394 26864 18640
30845 18640 -17741 -18867 -8455 -1901 5550 13293 45151 63352 66630 37550 10318 11082 11412
30832 11412 18652 7029 -28673 -55121 -58640 -34038 -17426 -13654 -3650 2068 -2917 8877 24398
30819 24398 8604 17982 27244 19816 -20286 2473 5818 -11777 -11186 2095 -6794 -28390 -53559
30806 -53559 -59977 -43525 -40871 -35301 -30376 -47512 -26363 -16497 -10591 -13092 -11993 -32099 -31083
30793 -31083 7718 -6668 -2945 -1268 -3738 -6704 -28098 -15445 13617 19473 40490 48517 3309
30780 3309 -6090 6367 183 9647 3767 1041 16149 27297 17355 -9155 -24057 -10690 -15439
30767 -15439 5961 7132 -18366 -22994 19968 26404 4237 -13865 -6205 -4103 -7895 -32116 -53474
30754 -53474 -42333 15476 34063 31358 20292 11168 -8086 -28396 -33265 -17337 -22124 -9652
30742 -9652 -11262 -1844 -10388 -13564 4973 41996 47656 31295 -346 -11222 -2279 -4540 -1064
30729 -1064 15971 25828 -4961 -9811 -16284 -19499 -13639 -11585 -10317 -16796 -17716 -6836 1918 5548
30715 5548 7477 -6569 -5645 6811 -16168 -30515 -7693 3107 -8865 23834 40771 55204
30703 55204 67241 70164 46013 10032 5982 21898 48280 46102 20565 15238 -1955 -1268 -19939
30690 -19939 -11637 6494 -10645 -7294 9010 25428 37205 48238 48919 52183 36487 14461 9496
30677 9496 -3833 -25206 -8490 8771 13399 32015 39040 26763 33277 32847 9228 24434 33504
30664 33504 33908 55503 56926 24260 -3787 -26609 -11057 -13495 -8653 12662 27554 19619 8758
30651 8758 20799 14247 -13426 -15781 -34529 -40220 -13562 16797 431 -2287 10102 29970 41231
30638 41231 48874 27126 10771 31160 -10863 -7795 25284 12554 19545 14894 -7872 -5137 24787
30625 24787 54461 43384 28199 29102 48927 35298 24234 16844 21478 16042 28223 15527 20992
30612 20992 60821 37730 31680 21927 22262 6118 -312 6189 -100 -6012 3927 9991 31247 42662
30598 42662 25346 33125 23493 2706 21662 18236 -13951 -32016 -17197 26941 34185 31754 49401
30585 49401 42985 41172 25681 28014 10203 10696 26324 12667 28193 38836 57906 25281 27177
30572 27177 27114 35813 8841 21385 22765 27058 41175 20418 5820 15945 15603 9507 -7508
30559 -7508 -5903 -23061 -51522 -56026 -47429 -27481 -25459 -14132 -33768 -43287 -30153 -24317 -14577
30546 -14577 -10048 -11609 13138 -8685 -33204 -22920 -31036 -38572 -32559 -12891 -16201 -23771 -16438
30533 -16438 -22243 -38003 -28075 -16337 -8153 -15917 -35625 -19560 -17057 -2681 30966 47506 65394
30520 65394 44004 33280 34387 31547 24639 8809 32511 36979 44331 29014 11027 12075 8
30507 8 -15391 -29367 -25229 -17255 5286 4330 -6442 4325 21185 15165 -5345 -29049 -23223 1624
30493 1624 15337 35287 66560 61453 33530 31163 57431 34269 -1439 -26681 -7741 7013
30481 7013 25132 39064 -1931 -5837 -3799 -15051 -38636 -59174 -43590 -28140 -28621 -37534 -51549
30468 -51549 -49119 -27049 -16796 -29539 -43446 -22831 -30143 -23762 860 8758 -9321 -13401 2682
30455 2682 21578 27878 23123 -3049 -3389 -28243 -46069 -51820 -37673 -18553 -8088 -20348 -6427
30442 -6427 -2440 -18685 -15337 3631 -13002 -42098 -50848 -60981 -51497 -29674 7843 16603 -4499
30429 -4499 18887 28637 36610 34923 2152 -31331 -54982 -26475 -20673 -15206 -10827 -29169 -26251
30416 -26251 -33257 -17241 -36676 -49309 -36015 -39407 -43981 -19301 12173 23179 12727 -2313
30404 -2313 17271 533 3993 21859 34350 20515 9248 6549 -432 -9177 -12416 -22399 -11244
30391 -11244 46250 72393 41922 5938 -10358 2824 12873 -18573 -28369 -36605 -29959 -12830
30379 -12830 -19415 -14267 -20400 -678 16422 44 6606 625 -12437 -43742 -47185 -38493 3034
30366 3034 8548 9533 19666 39968 49176 46843 15822 -24987 -19402 -12699 -14029 6583 6539 -3423
30352 -3423 16812 8439 6922 14860 -6588 -34349 -47923 -33230 -7774 18210 49197 27273
30340 27273 6461 -5336 -25810 8416 15273 16381 25821 4317 127 15227 27979 13495
30328 13495 -15536 -251 32997 16760 8997 22554 -2922 -30299 -38153 -29281 -30783 -53924
30316 -53924 -18526 30765 56312 22649 -6689 -22437 6532 31952 27622 38206 43886 58041
30304 58041 33765 7787 4834 -23363 -31165 -19683 -17278 8337 20835 -4192 -5973 -41122
30292 -41122 -27041 -7303 -19615 -10771 -18552 -22444 -26646 -40908 -30837 -32882 -24283 -19450 2315
30279 2315 23221 25859 24330 50961 58414 36954 19236 7637 7648 -23513 -38533 -46874 -37052
30266 -37052 -17956 -28064 -10754 2060 12496 15135 -1876 -46157 -52426 -23693 -16009 -8866
30254 -8866 29047 37757 49938 80006 38978 34930 43912 55492 64028 37999 -2475 -33753 -37984
30241 -37984 -15707 -22767 -20672 13950 37568 36635 10297 655 -13783 -25004 -28115 2114 2510
30228 2510 -1444 -6584 -2382 3147 12295 29473 32663 23977 7234 8783 -8695 -16776 -38058 -33148
30214 -33148 -24814 -1901 24364 11104 -1021 41 -42289 -67795 -55154 -33401 -2430 14231
30202 14231 1002 8791 10956 14029 9516 18120 30141 44225 41328 27214 10402 -6370 27314
30189 27314 29008 23829 11453 9109 7745 17646 4210 -780 -11290 -13933 -14934 -6210 -16125 -34977
30175 -34977 -33793 -41921 -36920 7383 8022 13045 3581 -26899 -25424 -42164 -40583 -40241 -41070 -13068
30161 -13068 13727 4025 -41098 -67213 -42690 -17178 135 11408 -1496 -27176 -22885 -26916
30149 -26916 -29034 -25711 -12367 -1664 18544 9534 26397 23551 31332 43239 4894 -18682 -17317
30136 -17317 -5853 19316 15007 -2595 -20932 -16245 -4147 -7670 -22171 -33321 -18711 -20232
30124 -20232 -20473 -33467 -35721 -18865 -4 -27920 -47180 -55111 -48439 -25638 16674 13950 10233
30111 10233 -2276 -27175 -37692 -4438 6468 2391 -9850 -58499 -66948 -27576 -9244 -48552
30099 -48552 -60475 -45367 -23523 -12499 2004 13709 21606 21879 8655 -14286 -20130 -9755
30087 -9755 -192 -24239 -20936 -48181 -47648 -53504 -63138 -54439 -39446 -20059 -5305 -687 -53101
30074 -53101 -81019 -51668 -23628 -35636 -25941 -31940 -45016 -39795 -3896 11627 -18976 -19937 -18373
30061 -18373 -16434 -21696 -13272 7203 15963 -3307 3624 19489 6451 15738 -3612 -10523 -17391
30048 -17391 -28096 -27118 -9441 6286 20124 39504 49453 53359 58621 35329 41436 66581 54563
30035 54563 9446 -12628 -6308 15343 -3794 -25622 -32082 -43909 -38920 -42638 -31185 -19919
30023 -19919 -17419 -27501 -28876 -22985 -39549 -28368 18570 44916 3040 -29686 -25199 -3708
30011 -3708 386 -7581 -3955 -194 -13425 -7832 -23707 -28410 -28734 -30617 -37101 -107 37732 2011
29997 2011 -8843 7031 -2985 -53 -20055 -20562 2221 16979 2004 4764 24239 12012 1651
29984 1651 -13407 -12800 6936 43959 31983 1368 -7241 7643 6119 1835 -4699 -10861 12521
29971 12521 29029 -9509 -27669 4278 41165 22861 -2423 7902 5413 -11267 10295 27142
29959 27142 11816 20355 21559 6592 7068 28779 35334 27949 41630 17279 -11571 -39780 -7725
29946 -7725 15530 11163 17467 -1978 -12585 -15320 608 11784 16720 65 -7706 -990 1751
29933 1751 11792 -2066 -7967 -15730 14080 16122 9993 -6735 -325 41437 33575 33159 19907
29920 19907 11786 -21756 -38807 -22241 -34533 -33959 -8943 11311 3456 -7997 -5733 6362 10621
29907 10621 -11258 -8533 14212 35644 20256 36559 25159 24929 30248 26310 17568 -1213 -40694
29894 -40694 -38354 -31745 -34173 -12618 2717 21425 39395 43936 34780 21958 31462 46341 51234
29881 51234 32121 -21802 -31696 -1126 21759 36091 33484 19671 -23 -14241 -22746 -7167
29869 -7167 11476 27781 2683 -12883 -10707 -2486 -106 8992 17145 12608 14462 1568 -3337
29856 -3337 -14966 50 25119 24078 -2031 2757 1478 32677 35965 57463 76220 64810 34094
29843 34094 13088 -2181 -7905 -37619 -29861 9929 38677 47622 37530 39813 38519 13508 -31668
29830 -31668 -15867 3710 7536 12468 -11457 -19789 -16400 -17740 -3406 11853 10295 36937 24375
29817 24375 -6142 -500 29621 21989 -8486 -5693 -7082 -16652 14574 28014 22053 15974 1790
29804 1790 -10564 -4894 -9464 -17817 -34367 -35818 -26153 -19366 1247 2910 -12939 2296 44365
29791 44365 61503 24431 15287 30416 9359 -13609 -19796 -42413 -40788 -34390 -18364 26457
29779 26457 23536 13802 -887 12373 8766 -841 -2598 -10328 -39810 -25943 -12314 -2581 -6229
29766 -6229 -8580 -11145 -11526 -2599 10884 -17109 -53554 -37983 -46103 -50823 -43471 -35601 -8619 6216
29752 6216 18039 34343 30360 8120 17342 3323 -1681 -14778 -30199 -39604 -32511 -15300 22341
29739 22341 44940 40637 37548 7806 -23049 -29648 -18730 19298 14364 -8930 23016 49347
29727 49347 23041 -13228 -21146 -18805 -13661 -11802 4935 14646 29957 35374 13507 8818 2722
29714 2722 -15122 -44311 -55077 -22303 13973 41518 47574 22158 18002 -3277 9 -27173
29702 -27173 -31202 2528 10165 37515 62603 92043 85196 72270 44875 5779 -23925 -17581
29690 -17581 15067 37332 20718 -14205 -3626 1264 4789 24935 31115 11805 -22867 -16797
29678 -16797 1254 -3496 -25299 -27486 18047 -9432 -26000 -4456 4604 -1979 -43967 -62735
29666 -62735 -56842 -21071 -30773 -18316 4346 20651 1316 1701 -3967 583 13471 13453 -31159
29653 -31159 -38523 -36364 -8020 18543 7370 -6560 21084 47134 23216 1421 -13420 -13286
29641 -13286 -10647 -26138 -24449 -18778 -32858 -19873 -34449 -40048 -23339 -317 4731 -21569 -5554
29628 -5554 -15322 -12738 4240 22517 23349 32279 25218 26426 26551 22850 -19014 -308 -17365 -16941
29614 -16941 -799 -2543 11309 12800 7535 19182 44864 45520 32327 12648 -1834 3586 -699
29601 -699 1092 18880 4590 7945 9128 24502 3859 727 -7687 7257 40428 38835 15486
29588 15486 -12811 -5816 -27114 -40623 -17481 -12362 -29241 -11533 -10226 -13911 -20922 -33766 -41496
29575 -41496 -50117 -17079 -4949 13270 26703 -12045 -15719 -35357 -47023 -53959 -60409 -55622 -37969
29562 -37969 -25591 -21933 -10140 8632 3777 6848 -17379 -21668 15892 23720 36912 55056 55210
29549 55210 14377 -10204 -22012 -1415 55218 75669 35986 -6427 9781 2125 -3617 -13401
29537 -13401 2816 41449 44063 29980 -2740 5300 20474 9652 -7784 17202 36667 46805
29525 46805 38556 16389 6501 -8554 -20011 -21832 -13854 14194 30344 56741 60791 30844 -20505
29512 -20505 -35471 -36083 -30839 -39286 -23872 -14551 -8862 6038 -3572 -4463 23438 6841 -7865
29499 -7865 -22239 -8872 -4432 -27049 15004 -3264 -13946 -9839 -15526 14405 31486 15684
29487 15684 6116 -5654 -10298 -28933 -13768 -11763 -17735 -34711 -43421 -30885 -36770 -46910 -34753
29474 -34753 -35629 -21456 2484 20844 40161 56318 54970 45823 36772 33752 35145 43017 24761
29461 24761 6367 10412 -2066 -19532 -8266 -6059 -11871 6733 20569 40038 43353 37758 35835
29448 35835 31773 28163 21994 -11639 -6321 6451 -5388 -21452 -36203 -19659 -7587 9827
29436 9827 37466 4810 -3933 23345 -10043 -15600 -19200 -45833 -40425 -26875 -4747 -11272 -30454
29423 -30454 -3267 -15289 1969 11055 23851 43883 33276 32360 26066 24266 -6113 -17341 -17922
29410 -17922 -32662 -31368 -4793 3657 6737 -8903 -17976 -11104 10674 28403 29615 17174 23072
29397 23072 44326 6686 -10040 3658 24738 21144 12156 39428 27932 8777 30204 64499
29385 64499 46920 12082 -11225 -6872 -18093 -41297 -34131 -29600 -499 -9292 -33920 -36475 -18720
29372 -18720 -14829 -30567 -15551 10189 2753 -8621 -24839 -20538 -514 5171 8826 31522 4814
29359 4814 -1482 -7484 -4941 14704 12025 25105 32247 26811 5243 -5134 -3572 3950 5538 -3926
29345 -3926 -15635 -22986 -38798 -22811 -21690 -31333 -26622 -23977 -39196 -2009 15148 1248 4193
29332 4193 40053 44561 37629 32335 44519 33767 2986 -14067 -16267 -11398 -11418 -18329 -17331 -14068
29318 -14068 -2326 -46996 -56731 -41889 -6615 21989 31703 46706 38558 37042 35946 56542 40298
29305 40298 33404 -10312 -17012 -44785 -63318 -32536 -14519 -32369 -33433 -13102 10300 8534
29293 8534 1990 -19428 -25503 746 13190 -29894 -18292 -6227 -21462 -15078 169 16037
29281 16037 18240 28489 27582 28312 33719 2023 -7613 -32876 -75273 -62129 -51695 -41432 -8756
29268 -8756 22065 21817 -826 -17496 -17072 5826 4512 -32592 -41480 -60347 -52551 -31374 -30152
29255 -30152 -26107 -52729 -60005 -56750 -47377 -18330 -6197 -18605 -42282 -53828 -10928 5036
29243 5036 -1802 -5158 -30441 -12750 13020 34367 23617 -7894 -8608 699 -20447 -32867 -36547
29230 -36547 -38784 -33577 -9849 2748 31261 11160 -2842 -3905 -20217 -45308 -49065 -27480
29218 -27480 15721 816 7765 -8940 -26261 -18783 -8597 -17836 -27126 -30409 -27268 -361 -2146
29205 -2146 642 27935 21398 37877 18916 -8194 -12568 -6762 -10070 -3205 -13775 -38069 -21891
29192 -21891 -18014 7330 35573 12200 -12737 -28542 -15449 -522 16123 16521 23244 17056 21781
29179 21781 -2172 -31927 -8517 1905 -39254 -47894 -27572 23394 46525 53756 54478 48230 18338
29166 18338 -11446 2597 17631 11584 5756 22440 7213 77 14809 29786 41897 28801
29154 28801 49931 5264 -29904 -33372 -34662 -44341 -38277 -45233 -54051 -56770 -22315 -7147 -22479
29141 -22479 -43269 -35020 -14354 -7548 -17885 -18350 -29549 -52900 -25205 -23499 -23369 -45108 -48735
29128 -48735 -44344 -42909 -15249 -5951 -34925 -48685 -54784 -46257 -36366 -38224 -40609 -33266 -28382 -4417
29114 -4417 17497 22239 14117 7760 17214 -14990 -29894 -24558 -4247 17331 16789 18495 29432
29101 29432 2919 -20187 -22086 -40690 -55626 -40866 -37574 -46851 -36181 -21737 -31263 -24169 -1555
29088 -1555 -1490 -17443 -2143 24964 18452 -6242 -33999 -48185 -53596 -34241 -23348 -3766 -299
29075 -299 -11809 -5032 -17087 -9891 -1953 26817 36791 36064 38910 30936 21600 23508 28689 38100
29061 38100 53054 24522 14083 5188 1060 -8202 7637 34032 53069 45645 24805 -12116
29049 -12116 -37869 -54927 -49300 -25678 15138 59096 57204 24478 -2223 -3221 -13980 -29422
29037 -29422 -8197 35682 21560 -8905 -7816 714 6811 29232 20854 31358 26761 30772 35013
29024 35013 26760 -4372 -44228 -24696 -11794 11871 13083 -4082 -8483 8091 10043 7716 5807
29011 5807 -21111 -29756 -8761 -7187 -7001 19349 22226 18468 29328 39554 35452 21913 40249
28998 40249 38403 29981 33478 27994 20706 15831 -3154 -12422 -33418 -14696 2048 1762 -3333 -13407
28984 -13407 -20388 -14409 10176 1948 3853 3653 -10191 2124 11493 16957 14126 24543 25339 9676
28970 9676 -482 926 -10392 -27453 -25671 -9682 13935 34051 23073 33183 37042 43571 39265
28957 39265 31407 31169 25379 6067 -32248 -39004 -53872 -31100 -17948 -8760 -16744 115 19576
28944 19576 10145 -2915 -12603 -12734 1639 -9155 -3509 -22217 -11641 19246 38132 32305 -1008
28931 -1008 -6823 -1881 42051 55486 42485 44217 3392 -22541 -25441 19803 35341 8206 28951
28918 28951 24087 -8352 -6593 33125 58831 44449 18407 -6322 -4211 -10678 -4398 6685 1947
28905 1947 -6803 -3627 -25062 -52227 -51319 -40361 -55924 -57499 -19892 5294 -18892 -30326 -19740
28892 -19740 -20090 -13160 -30424 -35620 -54824 -61969 -43575 167 21522 16536 13897 -18629 -28058
28879 -28058 -30997 -24161 15828 33290 17506 11073 12525 3839 12638 21734 12804 8337 39649
28866 39649 51247 27465 -9190 -28567 3081 20144 15360 23515 28543 9090 -12820 -14561
28854 -14561 -15916 20144 36824 15093 -21767 -49436 -52716 -61292 -61461 -40872 -35542 -12468 -6892
28841 -6892 -8454 -26436 -27981 -10874 4657 4471 -16525 -44196 -38547 -33772 -20755 -16254 -20919
28828 -20919 -4148 -7984 5596 1214 -14513 -10253 -15692 16458 18137 18679 9626 7726 36261
28815 36261 35025 -7138 -26725 -19001 7060 14362 14575 16690 -2043 -22188 -19389 11791 34896
28802 34896 14863 754 14966 6808 -4466 2491 26781 -759 -30634 -10510 103 -25186
28790 -25186 -44514 -42998 -25861 -185 -20646 -22729 -3617 11726 6400 -5184 7955 34952
28778 34952 30431 -3759 -20575 -11872 26600 42626 64392 55570 53679 33466 679 12270
28766 12270 3690 13697 25048 30127 23268 16567 11368 3977 8717 21936 7290 -5089 7111
28753 7111 22077 -15911 -36316 -44624 -39871 -17605 12143 11978 8795 16648 -969 -19889 -8680
28740 -8680 -12242 -12352 -26109 -6275 26231 36219 3003 -8442 -3951 -12024 -7839 11302 7672
28727 7672 7069 -6821 -9545 11663 10227 8725 16853 21267 24368 13649 9227 28306 26319 15250
28713 15250 -7247 -17118 -4520 4968 34830 46798 1700 -2599 13768 27774 30769 46120
28701 46120 24221 -17493 -20684 -27006 -17559 -5073 284 13147 9192 -303 3226 7512 4634
28688 4634 24696 12715 -26050 -32444 -16790 5819 11889 -15319 -12494 -4026 -6563 9857 4485
28675 4485 5127 2656 -1075 28812 34879 44053 20324 29494 24282 7856 19333 40777 13142
28662 13142 -14918 -4277 -23717 -1100 31543 36198 7084 28537 20259 -9351 -8951 2216
28650 2216 14302 4370 24209 38187 47394 21482 -13912 -6717 9832 22747 46235 54971 13180
28637 13180 -12508 -8936 -2219 -23804 -53461 -55279 -44154 -33862 -40319 -37904 -13172 -21217 -33859
28624 -33859 -8982 322 -25200 -53808 -40483 -10145 21156 38086 30168 38241 23310 17450
28612 17450 14324 944 -43462 -12308 3195 -3167 8297 32215 38992 27728 -8558 -15644
28600 -15644 -11037 -3972 -273 15160 21618 -2907 1145 27494 45761 54305 24348 13875 8562
28587 8562 8347 867 -26229 -51557 -34200 -29896 -71459 -72150 -40559 -13489 22546 17381 -43932
28574 -43932 -44380 -32122 -24532 1547 -12364 -17142 -15370 -20628 -18315 -18824 -9966 -25522 -34193 -11840
28560 -11840 21182 18211 18336 16689 12447 6102 5950 -1296 -2753 -25250 -12479 -16085 -8578 -3107
28546 -3107 -27542 -15508 6319 27924 13368 13498 6311 -16381 -29327 -14862 2157 38840
28534 38840 30129 18219 -9099 -51330 -26548 20762 24008 -14128 -30009 -22863 -9243 -7070
28522 -7070 -19194 -2673 31095 43461 18900 -15612 -19996 -5817 -10038 -21137 -46203 -29132
28510 -29132 -7110 -2087 7553 24958 4404 -25435 -1744 10063 17810 17405 19018 17879 16858
28497 16858 68735 59692 38134 17242 -12845 -1027 24739 23605 33871 29811 14731 12283
28485 12283 18878 10926 2599 -7700 -17539 -5752 -9864 -1775 3506 -2864 4937 8008 1869 -8769
28471 -8769 -18306 -25353 -38074 -22465 5014 33629 30718 32892 6320 -9143 2833 4460 -4482
28458 -4482 -26446 -44660 -73411 -43723 -18304 -10979 -12395 -15637 -22094 -21866 -18126 15623 39158
28445 39158 7967 9699 21781 7582 -7116 5913 -897 -9787 -35860 -46112 -22687 3079
28433 3079 14941 27086 33601 33172 36798 46672 19084 24105 25194 -10578 -3653 86 356 7356
28419 7356 3545 4250 9870 17508 37898 34767 -2776 -10559 -10512 -23095 -43861 -49674 -27349 -33261
28405 -33261 -42150 -22498 -16735 -6650 -752 1390 7422 23805 8521 -10806 -6129 -8377 -12302
28392 -12302 -7149 5358 -11103 -24753 -8807 -32485 -66704 -26513 -6054 -1278 -5098 34296
28380 34296 64262 48207 15216 9181 -1163 23743 39768 31459 15131 31435 32586 4057
28368 4057 -5655 -26320 -36621 -40005 -39745 -32193 -16712 42 -4421 -1199 -5513 -8487 -17805 -20334
28354 -20334 19175 21862 4079 16675 25755 14907 17738 7547 28831 43204 33508 6425
28342 6425 -14215 -21152 -16878 8736 -17493 -15988 14674 17893 -9989 -35280 -42386 -51959 -29064
28329 -29064 8064 11590 -18232 -19950 -22733 -3176 7295 -3579 -785 -4755 23189 37486 21932
28316 21932 19143 -864 2747 8974 -4555 1187 -3867 -35768 -60441 -18306 -10311 -3845 -5325
28303 -5325 -1557 -9755 -18883 -37318 -22629 1527 19757 45755 28752 -17526 -40353 -49503 -30676
28290 -30676 3575 19206 29859 -10383 -33314 -10307 -2011 -14269 6687 20749 28058 59150
28278 59150 66523 50078 32553 32175 21422 -3709 -30968 -23776 9344 26969 14041 17669 21046
28265 21046 48194 64081 57234 29086 13567 2036 -26747 -37372 -27505 -34807 -28964 -93
28253 -93 19869 8491 -15203 -17520 -14754 -29199 -9953 -17038 -53510 -60017 -47002 -41055 -40121 -24236
28239 -24236 -13147 -3276 15464 34881 33352 26500 179 10804 13384 -736 10756 31541
28227 31541 53021 47897 30404 -2929 -9146 9797 24698 12604 1466 6826 5166 2823 4110
28214 4110 -15008 -31106 -34799 -33224 -28186 -40721 -8264 5154 -1433 -25251 -43100 -40810 -39599
28201 -39599 -26538 3730 23222 27440 -30557 -74245 -84118 -59317 -13868 11780 253 5983
28189 5983 2171 31641 33362 15211 15398 9011 -6602 -27093 -17609 -15322 -16336 3934 -14595
28176 -14595 -17862 -14129 -7327 10479 8636 23632 19804 -18834 -7979 -12922 -9848 7749 2086
28163 2086 -10090 5724 7489 3516 36806 66303 50909 40020 12587 3926 507 -16373 -33634
28150 -33634 -5140 -10815 4298 20741 5498 -14928 -30530 -34209 -21467 -8851 -1287 36493
28138 36493 67819 37076 10872 8526 16251 27842 35602 30208 21356 6156 17650 18405 17698
28125 17698 18143 -7627 -24399 -28633 4878 18726 14261 33511 39215 -7054 8811 30970 23642
28112 23642 2670 10999 21934 18982 10539 -4120 -21287 -580 -2155 30777 74168 64240 7237
28099 7237 -12801 -27512 -23156 5707 -6218 -15581 -8052 2350 -6190 4885 8619 -21379 -23421
28086 -23421 -22518 -33304 -33792 -40345 -58461 -56434 -34181 6594 3027 -8089 -8097 -18442 -21876 -11821
28072 -11821 8882 8895 5417 -153 -3857 -43541 -62273 -43267 -27871 -20534 -54792 -47988 -34202
28059 -34202 -37932 -20790 -945 19913 11399 9282 22847 35506 17248 23830 22881 16393 4706
28046 4706 -390 -14555 -14332 -3357 11797 3200 -19326 -38608 -42848 -35585 -24180 -20168 -35370
28033 -35370 -17299 -22086 -5371 8517 12451 6201 17168 29402 20179 -5534 -18464 -1739
28021 -1739 15372 34040 19363 8521 24826 19493 -6063 -12991 -7492 14392 5624 -22954 -36390
28008 -36390 -12927 7359 30128 31724 28968 11906 19157 30318 34132 27203 30753 5008 -39705
27995 -39705 -46233 -44095 -52187 -27356 -32354 -23711 -17498 -21266 -19470 -19226 -19308 -23088 -39759 -31750 -26252
27980 -26252 -39342 -38709 -26626 -25859 -16799 -2505 -6450 -13894 -1592 13021 -10777 -47660 -29298
27967 -29298 -13490 -11489 -22788 -16158 9341 -11567 -27692 -4686 15095 8303 14469 21717 -3692
27954 -3692 -4016 -25887 -10930 9233 28255 31259 14444 3264 -2393 -4980 -1685 1861 23997
27941 23997 31478 8658 -14797 3351 17604 -13243 -26885 8322 -8011 -12449 -32499 -29765
27929 -29765 -20739 -28224 -4843 13905 -985 5489 -547 -18078 -31489 -26155 -15679 -9774 10729
27916 10729 30135 46705 27541 4777 -13283 1230 18962 25297 13066 -880 -9317 -17231
27904 -17231 -21330 -41563 -74182 -68689 -29756 -22320 -28710 13306 10996 -6764 21807 43629 53927
27891 53927 52153 34078 15209 2608 -20678 -3796 -5098 -25776 -18555 -7275 1135 -4965 12553
27878 12553 -10584 -17515 -16310 -47680 -49785 -46490 -22849 17308 12110 -17043 -51906 -67047 -82629
27865 -82629 -78166 -53009 -22354 -8052 8780 -8334 659 22926 30955 11275 5881 40252
27853 40252 57009 23578 -11929 -10984 14648 41429 42419 12648 1058 20401 44166 21212
27841 21212 -1189 -7317 -3978 -12241 -3785 -5409 -11618 -27670 -40094 -60803 -57582 -37775 -14644
27828 -14644 13167 -5009 -32184 -16813 6600 17831 23013 21452 8954 -18561 -39885 -28502
27816 -28502 -14008 11459 10579 7709 14620 -18479 -31473 -10202 -25719 -6681 -16935 -20143 -23057
27803 -23057 -16662 -11365 -30367 -13804 3262 33357 25947 -4180 -8929 -30491 -27336 -39926 -7310
27790 -7310 -10112 -12866 1086 12826 -11650 -13461 -15548 -6144 -29382 -49210 -22740 -8253 8998
27777 8998 24681 31455 38256 10396 -4471 -30002 -37102 -22840 -2544 4790 30991 9281 11759
27764 11759 38796 49626 34980 6249 -568 -43695 -48085 -41142 -30994 -32850 -20929 -21337 497
27751 497 -143 -13826 -18383 5872 39050 54951 34999 35360 12438 545 -27172 -10002 -9212
27738 -9212 8852 -615 -15351 -13234 -25702 -24929 23874 28190 48112 16306 -5781 -23663 -730
27725 -730 -11555 -38031 -27697 -23584 -20189 -17979 8891 12644 12203 5824 10855 -6046 -25935 -6180
27711 -6180 19001 6298 -13227 -44790 -23475 3774 -598 -4389 16700 13289 30614 51374
27699 51374 46602 4972 1038 7503 19269 28546 56658 19347 -14286 -7208 26891 3728 -21672
27686 -21672 -20953 -19912 -21992 -15647 4311 20605 18249 8761 3182 -19080 -7511 32532 30440
27673 30440 -2429 14195 35923 33861 20914 4869 29885 41383 19522 25150 9036 -23777
27661 -23777 4564 6518 13420 -17589 5726 8822 -12562 -18665 -10017 -13914 -24200 -9508 7043
27648 7043 10774 8738 -10746 -46460 -50848 -50105 -21632 -1086 739 -2801 4009 4324 -11480 -17069
27634 -17069 24431 26763 21703 -3461 -8129 -24807 -42832 -32358 -27283 -36853 -42794 -52011 -23074
27621 -23074 11465 6897 -28957 -75348 -75807 -49614 -27589 -2464 16024 30269 45412 53282
27609 53282 30063 9561 -22758 -43061 -17415 -2232 -1035 -12768 -44592 -19683 34528 55524
27597 55524 45471 40853 27661 -27201 -38061 -29858 -18084 797 19705 46254 44991 17409
27585 17409 8454 21706 16200 6951 -1798 -25078 -20027 7785 20285 19412 -6676 -44115 -37092
27572 -37092 -26919 -7898 -27158 -53799 -72120 -51071 -16672 -4718 4812 -3817 -6945 -2418
27560 -2418 -8767 -8279 21363 8892 -28229 -25754 -8405 23178 47744 39057 59102 31936 -4254
27547 -4254 11392 41140 36505 6135 -19089 -13971 -3554 -17050 -306 -433 -11144 -6557 -13541
27534 -13541 -32671 -43103 -45707 -49207 -40033 -28896 -18604 -17519 -20940 -16359 16610 25439 20356
27521 20356 39168 34796 35772 40381 28014 23165 33699 28748 -983 17158 7919 -15248 -30442
27508 -30442 -18924 -6646 16606 8754 7293 -4276 -9302 -20669 -27799 2444 36304 47171
27496 47171 35632 20001 -3089 -15893 -11688 -1230 -9108 -12678 -30024 -13033 -2928 -31440
27484 -31440 -56586 -43181 -19740 -14868 23460 35517 26027 3966 5697 6760 6329 4657 1174
27471 1174 -19566 -42122 -24663 1396 -3443 -10551 5995 17405 -20024 -14291 -3769 15280
27459 15280 -19540 -21725 -10533 -10666 4411 1206 6161 -15108 -45610 -48111 -12427 8487 6604
27446 6604 -56 -21074 -10842 -4726 -23111 -1291 -5477 -4328 36104 42192 13399 13713 14158 14386
27432 14386 28633 18233 19582 40331 14889 -7074 17739 29172 22149 18410 29096 27771
27420 27771 35886 20623 -11733 -6122 7846 13171 20348 38254 21830 -10697 -32615 -28979 -10846
27407 -10846 -13085 -10822 -7180 1185 32615 34391 21121 26220 13036 2799 -26533 -37969 -32750
27394 -32750 -30613 -12996 -17265 -26001 -15817 -12957 -32468 -27397 -43324 -52300 -5660 -15078 -42226
27381 -42226 -48739 -9952 1311 -231 24533 37292 56689 54880 63738 53974 -1044 -12890 7135
27368 7135 -1848 2311 34426 40057 48946 42342 30513 8139 1948 17981 -5543 -17050 17143
27355 17143 32155 29647 -7722 -48139 -30044 10286 39244 15124 -13750 -33724 -49488 -42108
27343 -42108 -34659 -34320 -71590 -59840 -16113 -20493 -26348 -15781 -12547 -1888 6222 9975 2784
27330 2784 -26731 -46908 -56563 -25881 -11995 -33063 -28531 -16486 10384 20909 5291 6214 -13567
27317 -13567 -28696 -40175 -50754 -64126 -44148 -23770 -20229 -12252 -5661 8008 -1772 -24893
27305 -24893 -45135 -27221 -26899 -45972 -44034 -35842 -16676 -21347 -9894 -18291 -33447 -18986 -989
27292 -989 15160 33396 58252 47831 57333 49983 15667 32654 27366 -2554 -28411 -46472 -38335
27279 -38335 -36363 -56496 -22778 -1915 8761 46244 60888 59874 42651 39023 25006 8987
27267 8987 -11197 3579 14972 29641 18754 -17572 -24609 -10542 -10503 917 4512 -3134 -15085
27254 -15085 -6030 3306 -14195 -22631 13176 57217 62824 67903 40821 30089 15600 -14455 -16467
27241 -16467 -20400 5807 32006 24761 9288 10752 30958 10256 -1839 -4052 -11375 -3768 17462
27228 17462 21323 20712 2557 -14312 -2963 8125 14766 2479 -9070 6755 4109 19738 31251
27215 31251 21958 16500 8934 3634 -4098 -2186 3861 12959 8133 -420 50884 61172 34380 27752
27201 27752 -4151 -31399 -31676 -5218 7720 4283 -75 19352 8764 1063 -18600 -19415 -23894
27188 -23894 -18121 11638 17266 21477 -9729 11572 -4099 -33485 -51053 -29131 17133 24582
27176 24582 2768 -9877 15546 24105 -915 -31814 -3343 11336 -16589 -10819 -914 7665
27164 7665 16511 11782 7904 9207 6043 22090 3436 -20934 -5326 -1072 8837 21283 10417
27151 10417 -2334 11664 -1428 -23532 -24392 -12965 -6441 -13981 -27098 -34817 -19735 14232 52160
27138 52160 58792 38314 -6152 -9533 -646 -30343 -61502 -31326 -7990 11240 -1467 -8700
27126 -8700 19040 23981 -1115 -19802 -37929 -39371 -23127 -26915 -17793 -22616 -32684 6894 14144
27113 14144 12646 27555 18322 4597 -7768 -10649 4701 7904 2592 -1419 -26561 -22127 -489
27100 -489 5429 -20165 -34054 -15874 -4582 6045 15949 -3763 -23077 -31146 -45664 -45002 -19140
27087 -19140 15745 10890 22490 26890 44939 36717 20630 23331 37891 23628 8525 24153
27075 24153 1172 -47330 -41062 122 12988 23754 38296 42535 34225 20707 -13716 -11739
27063 -11739 -20136 -28114 -29082 -18829 296 -202 -10565 3316 3104 -3289 6990 21272 24815 3574
27049 3574 -41243 -41678 -35681 -21894 -1981 -24096 -18845 16062 16881 -9259 -29584 -15378 10596
27036 10596 32565 24568 25879 7871 26 16237 17902 26391 12953 12551 10890 23363 17807
27023 17807 6863 6138 4409 -8527 7743 4830 -7339 12738 13044 -2918 -1482 -964 6832 8602
27009 8602 18182 18461 20808 38495 50616 37340 1611 -975 -4219 -22495 -57940 -66326 -63334
26996 -63334 -14150 -1078 -17179 -9071 -2228 -14342 -10798 17215 30958 35912 29943 24317 18615
26983 18615 27867 32104 12518 -16489 -27117 -33668 -25864 -21232 8175 46909 56481 65427 50567
26970 50567 39653 31040 44578 46197 19579 36794 29671 18405 11890 9722 -1439 -1768 -5560
26957 -5560 -28534 -29492 -40408 -49970 -43709 -29284 -24456 -31379 3208 365 -13230 9668 1544
26944 1544 -19303 -15966 -24947 -19459 7667 31320 39037 40539 26863 29860 13239 2630 -38934
26931 -38934 -42832 -25924 -33091 -1512 41646 36014 -1514 16117 37255 47504 23879 13328
26919 13328 20234 7044 -9185 -984 -1780 -11 20272 26837 40223 62804 32638 5079 13812
26906 13812 11084 43542 58588 43094 14456 10084 -7941 -14807 -13245 -39245 -21936 -7370
26894 -7370 -3484 9512 20215 4696 8964 18185 33869 50567 27936 11476 20661 21205 -8943
26881 -8943 -6062 11158 12658 40392 54972 71419 80542 91347 84744 43112 16132 20448 -6289
26868 -6289 -10057 -15237 -3830 10218 21967 424 8141 13889 12274 30016 17716 23764 46447
26855 46447 55382 58863 54548 25755 33886 -3378 -15845 278 15040 23363 23961 31111 49598
26842 49598 61882 46796 40790 12456 -4124 -6698 -8435 587 -1314 15491 25116 4093 711
26829 711 9166 -6221 -24412 -17028 2359 -10525 -18088 -34030 -53785 -12145 17742 18969 25223
26816 25223 44376 40791 41429 67758 68374 67880 55077 37233 7407 6811 -2790 2056 9794 14892
26802 14892 22914 8913 -3608 35973 33059 -7478 -33613 -28466 12719 20595 25251 35205 21203
26789 21203 42257 24479 1631 -1314 -1345 -2597 26650 38130 20944 -6383 -16373 -34731 -49619
26776 -49619 -50007 -21319 4347 19878 37556 43571 42813 26484 26171 -6454 -25127 -37490 -38342
26763 -38342 -8000 18348 14603 15953 50446 70931 82404 61236 29187 41626 48671 49277 55905
26750 55905 44989 46418 38636 27401 22197 36953 56430 63317 20594 -20064 -37257 -24135
26738 -24135 -22474 -59716 -37396 -19539 -27243 -11754 10532 27614 26510 22719 39686 22044
26726 22044 18237 -2280 -4655 -22725 -357 9468 25175 13009 14660 8193 -13715 -15996 -7261
26713 -7261 -4523 29454 51293 35039 25026 27136 18452 -10871 -1293 -2397 27416 11169 -11573
26700 -11573 -25991 -26510 3237 28077 -7878 -22980 -22919 -21579 -10258 -6959 3232 -15071 -31876
26687 -31876 -24767 -37966 -24268 -34892 -17096 19514 25831 12179 24414 31459 11194 8334
26675 8334 28458 22008 16964 5567 -6027 -23757 -15563 -18470 2543 18651 -3254 -12799 -3911
26662 -3911 3997 -9390 -9562 -20381 -15809 7624 36850 24086 -7052 -22656 24547 59908 51983
26649 51983 45957 47028 59236 44320 17143 9765 13639 3819 -1857 -6381 808 1706 -3065 11132
26635 11132 45776 31931 28638 53344 50200 2379 -40621 -34850 -28049 -42879 -50303 -43404 -43871
26622 -43871 -20513 -14408 16952 23765 7907 17320 27776 39502 34080 32880 49408 52941 44479
26609 44479 52153 78200 75353 36518 45055 47514 41875 30145 32126 32970 45971 47773 64689
26596 64689 58732 51571 66512 37531 25269 19963 18631 32249 12109 16459 63597 70186 54807
26583 54807 29529 32255 35529 42717 45419 32386 44988 31396 17543 -6919 -33081 -23418 -5422
26570 -5422 -21927 -29334 -17795 -4883 17642 23340 13400 9084 525 5898 -825 14984 22987
26557 22987 17802 29636 35217 9339 -1854 -20860 -13688 15740 19936 35007 11998 1729
26545 1729 45454 28187 1134 -3394 271 -27289 -40218 -23242 -21712 -4742 1855 -1076 8368
26532 8368 3598 -19070 -24753 -2675 4508 7794 -7743 -17535 -10941 -10190 -14340 -29137 -26136 -33397
26518 -33397 -41786 -31443 -50846 -40277 5467 13414 -4403 -27852 -3944 30276 45564 -5423
26506 -5423 -14145 4326 8385 -17201 -28356 7376 18065 -13206 17074 36351 39402 35513 11810
26493 11810 -13660 -7764 801 11750 8293 19062 13548 -2209 -25440 -15791 -6886 -5224 -23630
26480 -23630 -12474 31169 20346 -9737 -16597 -28862 -18993 -17210 -12128 -4958 -12394 -22071 -31309
26467 -31309 -23054 5753 30865 39601 23724 2622 -9775 -6013 -6671 9703 43905 37958 12579
26454 12579 75 5296 26908 59098 50041 34592 16967 13884 -1315 -101 13030 31278
26442 31278 43247 25521 2897 -2457 -2376 -9251 19328 28686 51029 72352 78592 67580 50541
26429 50541 31680 29450 5406 9519 4993 5192 30495 25158 49500 38512 35143 55712 31239
26416 31239 14411 34656 31938 40947 41000 59918 50908 31894 36740 58322 54087 -4857 -47192
26403 -47192 -31517 5160 9497 34165 41031 27184 26619 -4114 -30150 -52455 -44878 -43542 -50459
26390 -50459 -42126 -8249 -4213 -14784 -6160 7763 -19484 -13627 5587 21209 -18296 5696
26378 5696 52743 51045 33241 18863 30860 42476 30629 35397 52822 54382 61332 33543 23655
26365 23655 66442 90364 62545 42433 27160 36002 50774 44402 43465 22171 10081 7780 14167
26352 14167 14710 21857 14999 19482 23241 47038 59081 86887 109821 101569 64516 2474 -9635
26339 -9635 64 -4033 6897 44537 54556 38792 27612 3358 10994 7601 -8275 -21934 -34387
26326 -34387 -59988 -60840 -65743 -64165 -25670 -45333 -70532 -80962 -78425 -64951 -57502 -69652 -60689
26313 -60689 -70949 -91308 -86696 -92158 -107663 -100421 -80412 -65159 -50169 -31782 -61192 -84031
26301 -84031 -79362 -52104 -30018 -38788 -71398 -63924 -50358 -5586 -14715 -26745 -31112 -44477 -19300
26288 -19300 -3749 -236 17056 34475 19426 2771 -7450 4408 34244 50087 22552 -1267
26276 -1267 5557 -2967 -4774 4837 12933 66102 77057 55987 35927 14521 8781 20115 21094
26263 21094 19606 -12572 -7851 3711 21800 -9836 -19596 -13552 -19405 -9826 12411 48771 45925
26250 45925 16643 11551 -10499 -40210 -25702 2033 -1698 -16155 -33065 -30356 -16106 -14642
26238 -14642 -2946 -12533 -29487 -24914 -40058 -32999 -47800 -76469 -76079 -53778 -9784 6296 13145
26225 13145 22336 5700 1065 4536 3407 4441 27334 6059 -3051 -9470 -37233 -19239 -27871
26212 -27871 -6681 19514 21514 4112 -3681 -28784 -38233 -9389 -4081 -11412 -34673 -45110 -39040
26199 -39040 -53664 -42129 -40550 -24188 -31083 -7333 -2681 -23518 -6121 8720 886 -19990
26187 -19990 -36900 -22485 -44032 -62678 -63287 -61153 -61936 -66476 -74999 -53451 -42399 -42110 -45759 -3703
26173 -3703 3280 -14163 -16663 -25006 -28518 -18615 -31050 -24609 -21767 -366 -7704 -25615 -25554 -37884
26159 -37884 -27975 -24260 5506 -1493 -27796 -49283 -57465 -48253 -55734 -40356 -8407 9614 18486
26146 18486 17617 13878 10214 -13276 -38367 -36744 1599 40785 45404 47223 26619 4683 -11334
26133 -11334 -27209 -46964 -38555 -25657 -20054 -9681 -3968 19727 15864 -37 5558 10862 4468
26120 4468 -21770 -10048 -28195 -21080 4768 -3820 -33892 -36436 -38419 -54376 -43161 -27240 -39084
26107 -39084 -28779 -32117 -42786 -43848 -21748 -40474 -28675 -28681 -32670 -30101 -43684 -46353 -55274 -37225
26093 -37225 -25206 -29165 -25205 -29695 -45681 -46490 -44058 -45181 -55713 -53599 -41384 -41649 -22848 -11564
26079 -11564 -49720 -41810 -31502 -29572 -31463 -40051 -58069 -59094 -58036 -65645 -41841 -22734 8136
26066 8136 11158 77 15372 9022 11653 6002 -13577 -20033 -30041 -42314 -32330 -2139 10485
26053 10485 18769 19437 32352 9760 4737 7464 20175 40672 24924 43419 48425 20131 9153
26040 9153 4338 -2128 -22264 -36730 -13647 -3186 -4666 -20271 -16785 8478 46873 15725 -16396
26027 -16396 8497 3726 -23221 -15355 -4096 2831 -2298 18102 38966 14913 12837 27074 17771
26014 17771 4174 32896 15395 7322 14782 28181 18356 2827 10238 23327 35319 43396 53787
26001 53787 69218 53680 57441 56192 46941 37254 3933 -14002 -13963 12993 44095 44154 57402 100727
25987 100727 85003 65339 69758 56650 24576 20762 13995 46180 83516 69941 63493 50335
25975 50335 49856 30306 26034 22848 4008 21806 58162 90939 80176 68195 41939 44324 53442
25962 53442 42586 21320 7176 26508 32052 27756 23555 23964 18851 24493 18680 -9991 -35635
25949 -35635 -15505 8645 18432 29779 30549 38281 57786 97525 122672 124347 97539 105993 84616
25936 84616 73091 56999 39603 18426 25045 68426 97126 76232 30940 11584 23190 10932
25924 10932 15697 3088 -21233 -14653 15017 43038 58884 56732 29073 13432 6181 2250 -4146
25911 -4146 25903 48209 37692 18399 12689 19473 27389 26670 -459 -22573 -20463 -29982 -51920
25898 -51920 -57043 -33599 2352 -1762 -16115 -41708 -7142 28156 25788 33238 14741 392
25886 392 -17117 -17893 -23881 -23123 10284 30867 22843 2166 -4141 -1542 19935 33797 30536 10706
25872 10706 -19678 -32806 -38457 -12648 -3841 -4794 -3795 -34074 -70331 -92414 -106024 -111842 -118556
25859 -118556 -99335 -100130 -92137 -31931 -19987 -24585 -27258 -23876 -50803 -34916 -24694 -30651 -40207
25846 -40207 -35811 -29666 13582 21412 10373 18094 2022 -31091 -42362 -21630 -24281 -42198 -20329
25833 -20329 -18946 -29563 -24936 -58342 -86354 -58195 -35993 -33683 -44476 -22843 14183 11338
25821 11338 6195 4174 -18043 -14115 3035 -28978 -62217 -86939 -98714 -112011 -125294 -119369
25809 -119369 -106024 -69300 -39524 -34330 -31671 -24242 -22018 2945 1062 -23894 -29715 -6791 -7798
25796 -7798 -14267 -25578 -15443 2066 -35383 -51836 -54136 -45033 -14321 -231 -42674 -62610
25784 -62610 -58977 -54947 -59480 -48558 -28572 -34862 -61281 -48111 -50978 -96991 -115925 -119839 -139541
25771 -139541 -101246 -55022 -12389 29695 26613 18520 29517 34548 26465 -18398 -17251 29650
25759 29650 91763 88507 88112 90811 101749 104912 109679 76466 75531 92280 117265 101078 105622
25746 105622 140178 162554 144165 116206 82013 72501 84460 89867 72008 73783 66793 46455
25734 46455 68505 79233 74035 101580 113092 91480 76699 112641 137116 98210 61536 52877
25722 52877 57778 29984 14031 -7980 -42666 -25050 7279 -5257 -21067 -4824 17588 28674
25710 28674 -3366 -3896 43079 65089 71416 53645 30597 50083 46075 70487 91740 102722
25698 102722 88701 80384 68405 61712 87830 101634 139634 158318 150709 141314 128492 129424 166099
25685 166099 190184 181924 162877 162064 126120 91479 93530 140554 163246 144309 133365 128607
25673 128607 103409 104434 133024 136401 103232 74677 66710 49773 26304 55457 77763 88135
25661 88135 88011 66269 52077 58367 46949 41023 -9642 -52828 -28753 5424 -3311 -29409 -33276
25648 -33276 -13285 -23807 -8902 -1459 13577 26454 23638 -1258 -10755 28107 53429 65106
25636 65106 75748 92135 113744 161965 192255 184944 191946 178068 156833 109522 64082 47173
25624 47173 32417 12057 4881 23076 -5567 -47813 -78027 -103161 -102857 -79818 -59783 -59283 -82791
25611 -82791 -89412 -66091 -50185 -62579 -93704 -99729 -70291 -87687 -99087 -69132 -9691 6262
25599 6262 8371 11194 10831 31181 55129 58472 82265 86344 52347 32281 46713 115468 109522
25586 109522 95940 90962 90818 71188 73976 72412 51878 19536 37622 81638 132176 189153
25574 189153 230651 234014 265024 269635 253319 214227 184906 163278 170756 135421 122797 101523
25562 101523 65648 22094 -19194 -23539 -26631 -37155 -18407 -151 5671 -25653 -26971 11827
25550 11827 43380 42618 55112 97094 129587 175045 194430 203769 176226 161674 141717 112904
25538 112904 65841 25740 -210 -819 4267 -1078 14062 11674 1904 -22958 -62660 -115332 -148328
25525 -148328 -157276 -157054 -165680 -169443 -170732 -140341 -60280 -1508 60756 131908 201508 249428 250632
25512 250632 268572 263478 276583 296093 261557 226476 219841 204357 173205 155458 150321 119816
25500 119816 136741 176046 206292 221051 214051 201143 196084 219330 259065 243490 212106 221168
25488 221168 209133 194066 187619 192459 175551 149999 109173 43797 -20791 -55003 -52827 -49039
25476 -49039 -51130 -26188 -13337 -1132 11720 48287 60659 61161 42269 4033 -58987 -99499
25464 -99499 -113262 -94636 -94080 -114895 -139427 -128126 -174796 -210619 -255654 -290084 -317317 -340812
25452 -340812 -342062 -323481 -350632 -388836 -423502 -411385 -378409 -299250 -222565 -180152 -103178 -40433
25440 -40433 6783 29946 57835 97419 146575 147543 149915 162612 175897 144236 97136 111558
25428 111558 152140 149253 151627 126229 85930 59179 24346 17869 33412 42668 83063 136388
25416 136388 147024 151112 164549 184235 184848 199959 246152 250390 234822 224906 231129 282811 337117
25403 337117 356663 414965 473751 516387 575819 660349 704858 749399 789060 732297 643383
25392 643383 607695 574040 531751 504532 524102 509659 470019 438375 417635 442680 480782
25381 480782 548671 568479 622849 699235 717286 725603 713593 729277 712692 654170 604514 565104
25369 565104 571013 609380 613763 541490 481355 443391 399099 385428 383511 365393 366918 362782
25357 362782 317177 263169 223894 169044 187009 198107 177186 206656 239319 281979 315752
25346 315752 308731 290776 203434 123476 88400 59924 48502 55023 68848 60477 46261 42769
25334 42769 69733 96480 82394 67750 87871 99575 161710 232259 309542 366895 410887 526541
25322 526541 641979 793431 925946 1010290 1059312 1139996 1208656 1218049 1189004 1096261 957828
25311 957828 858707 881193 949219 984186 1021372 1074686 1073910 1036174 1004940 957953 898360 817174
25299 817174 714105 632986 560187 543554 584294 646672 692953 687289 662942 667860 712548 682304
25287 682304 590303 417363 261673 210388 307739 424350 537982 629906 734099 809599
25277 809599 810627 815677 820326 780998 752789 753922 772811 781627 759421 744274 768680 832696
25265 832696 889007 948168 962385 919740 913494 945879 1001927 1068999 1188936 1307823 1382594
25254 1382594 1403778 1363344 1288966 1170091 1018608 846774 665336 455873 246458 148560
25244 148560 163220 201168 178023 151281 189132 249655 286523 254480 163575 88074 50814
25233 50814 112397 193776 274573 374413 606983 857672 983516 976121 899517 736075 589962
25222 589962 533422 514661 523467 581712 722276 869146 919765 960916 1011649 1006938 1059314
25211 1059314 1276138 1584898 1801906 1853575 1869825 1917144 1946134 1987734 2067844 2187275
25201 2187275 2335353 2454176 2549325 2745763 3037864 3291489 3458920 3515919 3391830 3134871
25191 3134871 2853228 2606643 2425071 2229482 1890712 1420128 972428 568939 335583
25182 335583 341043 278676 -66659 -490559 -728263 -647990 -341269 -154212 -248526 -656265
25172 -656265 -1034708 -1180526 -1052859 -750702 -353673 35912 285981 495178 813442 1238093
25162 1238093 1688519 2202321 2858835 3544453 4153313 4672885 5086650 5183848 4925542 4352945
25152 4352945 3985898 4097110 4413098 4743607 5081894 5426467 5661467 5886871 6081638
25143 6081638 6373354 6666919 7101051 7894759 9111502 10449264 11576307 12385628 13349591
25134 13349591 16145927 22262858 31239408 41703721 54045037 70965018 97549533
25127 97549533 134938903 178040186 219132674 254529593 281446168 292493425 284648287
25120 284648287 267300373 252561684 244566086 240817173 236443431 228554790 218284114
25113 218284114 207407087 196066846 184792984 174347671 163906750 152482882 140615512
25106 140615512 129835336 121006880 113358866 106332545 100293214 94910758 89862246 85010101
25098 85010101 79960551 74945946 70722660 67267744 64002020 60711594 57455095 54145873
25090 54145873 50696188 47451193 44747079 42431890 40029530 37332755 34488167 31530259
25082 31530259 28739151 26377256 24405791 22761600 21328292 19843197 18284968 16913754
25074 16913754 15849344 15068889 14489819 14124095 13916143 13703942 13209280 12504284 11772271
25065 11772271 11158963 10621668 10161221 9830804 9548749 9310073 9075034 8766405 8420007
25056 8420007 8053746 7602866 7119917 6598140 5965721 5251289 4612374 4114246 3644178
25047 3644178 3134635 2657169 2275598 1967418 1839540 1977123 2133288 2150519 1927939 1580372
25037 1580372 1279850 1130878 1019391 747448 427307 148779 -42182 -121369 -145441 -85404
25027 -85404 8686 12839 -19770 59629 165799 193468 155072 84459 -4568 -85338 -171311 -266202
25015 -266202 -268718 -130806 82037 249021 363531 504470 656829 814052 887121 836721
25005 836721 737806 648249 583585 504630 426548 397372 461363 528587 571970 558411 495687
24994 495687 406990 311854 205325 122769 49854 12018 -34710 -111564 -200958 -233537 -168670
24983 -168670 -148139 -136757 -98295 -29556 12552 -11179 -54997 -81962 -101772 -94087 -154594 -283953
24971 -283953 -382728 -395817 -351187 -277691 -161572 -53583 -8981 76950 137345 175840 184858
24960 184858 203413 176270 176210 222998 334945 429647 488711 509656 512939 505603 472340 442434
24948 442434 430053 328042 214959 151025 48614 -92762 -187026 -221567 -251118 -274592 -315487
24937 -315487 -394375 -476245 -494674 -492322 -503275 -583743 -690820 -769038 -855076 -897039 -1002124
24926 -1002124 -1122637 -1161183 -1111091 -1048730 -955611 -853041 -770390 -699675 -626375 -567879 -463108
24915 -463108 -351704 -218710 -87425 -28347 -19758 -76277 -98029 -136905 -177828 -153177 -106658
24904 -106658 -63283 -14136 52813 81431 119776 189336 229467 229307 198446 165526 144914 124918
24892 124918 118117 133896 164637 213940 264341 277998 298865 292993 262666 212506 143122 122130
24880 122130 106614 100352 99886 89433 73586 67011 67200 49161 -12092 -99450 -194313 -263464 -327647
24867 -327647 -342960 -359521 -382262 -385312 -411378 -409948 -363992 -307396 -279078 -293290 -333849 -311841
24855 -311841 -304287 -328042 -333723 -348014 -380590 -399382 -421800 -414048 -419830 -395161 -366464 -371172
24843 -371172 -403332 -433115 -427049 -453491 -459923 -441502 -410737 -398280 -405586 -419880 -392597 -348554
24831 -348554 -297253 -280441 -247704 -189312 -133442 -61520 -64 44379 72535 64987 38093 -12699
24819 -12699 -76168 -134227 -189372 -288360 -393228 -447339 -472556 -502446 -512016 -548173 -530014 -464206
24807 -464206 -383231 -285192 -205752 -142161 -91964 -47720 -4225 49818 159248 259462 303894
24796 303894 351358 387339 372247 349858 366582 381450 399874 387087 358125 360607 368553 377020
24784 377020 403464 412042 413216 375695 328396 313395 269800 216978 224704 242785 220982 181695
24772 181695 222293 247747 285684 333893 366803 364801 368066 368385 337186 333702 334282 320815 264413
24759 264413 231823 203957 170577 166062 159766 162983 163600 170493 171301 117101 50614 20411 3972
24746 3972 -10029 -1349 -15687 -50782 -66415 -107531 -117032 -110992 -89004 -79346 -69820 -81517 -80285
24733 -80285 -78933 -64640 -78312 -92427 -133581 -131780 -109074 -66084 -15556 54773 82294 111633
24721 111633 103823 98074 119360 179449 223085 247921 239702 228523 208553 207740 182466 160950
24709 160950 179832 171786 138629 132257 137426 119072 76807 56457 43530 3152 -5302 26502
24697 26502 78130 61837 19061 -18872 -34785 -22992 -8221 1821 16680 38834 21488 15060
24685 15060 6557 13783 11007 1539 15133 -10633 -48852 -67727 -83515 -90459 -80273 -106902 -118790
24672 -118790 -105054 -91842 -75274 -75837 -76663 -80467 -83870 -40684 -14708 14136 16185 -12501 -28645
24659 -28645 -3636 26978 29462 32230 52832 54932 46133 25735 6791 14189 19926 51013 51192
24646 51192 29705 65916 97395 78346 26174 23726 34831 21743 27681 -3971 -12960 -3206
24634 -3206 725 3633 27411 38909 53055 56786 54700 55418 71994 96216 79985 65659 62691
24621 62691 53851 35346 36703 61126 73356 88075 86816 74408 83522 80786 57895 45367 21163
24608 21163 -5049 -50995 -68896 -81561 -112654 -80762 -56682 -54438 -44964 -28669 276 39223
24596 39223 59243 79622 66295 56530 42617 34522 19526 29286 42777 27369 27813 93016 113910
24583 113910 149107 150488 126144 134318 115474 71604 53431 71951 89936 64776 35726 62204
24571 62204 57862 38960 40084 36352 25539 -1318 -23751 -41270 -59399 -88174 -61046 -72448
24559 -72448 -84623 -56723 -37345 -27109 -6487 -16742 -40986 -81276 -88768 -115417 -142379 -150595
24547 -150595 -158593 -166253 -174673 -161950 -144462 -134834 -127924 -136620 -133080 -101588 -80385 -94046 -100185
24534 -100185 -85810 -70513 -117469 -127131 -89032 -65120 -46979 -42265 -38140 -29089 -12374 -24878
24522 -24878 -14392 -19814 -26533 -25569 -42977 -28396 -3960 10330 12867 12205 -10056 -27186 -36672
24509 -36672 -41541 -34762 -23156 -50512 -83446 -108394 -112056 -133745 -140982 -165524 -161629 -138052 -149234
24496 -149234 -125039 -100394 -101695 -92752 -97524 -94529 -126872 -154809 -156801 -128345 -91053 -111819
24484 -111819 -157470 -157137 -143859 -119576 -71536 -37953 -14128 4062 5622 13444 -14611 -48136
24472 -48136 -62528 -57498 -35280 23528 41969 59811 38066 35304 46121 50354 46401 39009 36414
24459 36414 33053 60875 25443 13345 14856 34302 56761 66378 44755 21629 33949 14860
24447 14860 11998 15892 6444 7444 20775 39362 39015 43996 44350 30181 -1976 -11945 -2351 -4412
24433 -4412 -2158 33499 60099 48750 17505 16468 39951 46228 29994 55103 64941 55289 45486
24420 45486 68050 94132 66300 39180 48031 67042 70491 95118 100309 114994 132008 104103
24408 104103 77441 57879 48941 44929 52646 59069 84019 84860 76520 63682 66888 78757 87327
24395 87327 98357 88958 86882 88631 74466 28435 44040 49486 41119 59252 49617 56314 64539
24382 64539 49915 64100 69782 60265 32588 24783 25693 40458 46770 24487 17743 36281 25986
24369 25986 51128 33655 12168 -1706 7245 11625 -6656 20901 41792 50727 37199 31283
24357 31283 26212 35121 36067 24567 24216 41220 62247 77806 86908 101220 96130 104039 140207
24344 140207 120852 86689 62548 51172 9924 -11621 9289 30382 52936 56321 25898 8331
24332 8331 -1769 -9846 7183 27717 14102 6619 -12709 -14805 4637 9688 533 3542 14367
24319 14367 25362 30908 22354 23244 21043 293 -16577 -8750 -14019 -46532 -65109 -47955 -30817
24306 -30817 -17665 -24058 -3909 -14795 -41025 -69595 -54714 -38565 -31097 -30167 -29695 -36653 -50217
24293 -50217 -58123 -56547 -46305 -23743 -37171 -57095 -49562 -9414 -1042 11966 -1130 -42025
24281 -42025 -38441 -26047 -34193 -73518 -92354 -98539 -108185 -92142 -70163 -72622 -83227 -101781 -102294
24268 -102294 -77549 -66210 -86727 -78090 -69651 -45951 -38582 -36794 -52158 -35742 -19688 -26662
24256 -26662 -68889 -64115 -77073 -77560 -78115 -73034 -81756 -73173 -69526 -57472 -40399 -12296 -4182 3711
24242 3711 11593 -21537 -24448 -25768 -66090 -72995 -41852 -29468 -23221 -34462 -46676 -42736 -30307
24229 -30307 -14830 -4021 32707 36345 16607 4596 -586 21260 36880 42048 32066 31237 46658
24216 46658 70379 56951 47866 42612 10874 22906 25293 37490 28815 34298 28777 20775 -31411
24203 -31411 -31614 -46864 -33610 -51953 -46758 -20870 -29208 -43760 -50786 -73524 -41764 -11257 -8109
24190 -8109 -24914 -28578 -55731 -75480 -98341 -100033 -70441 -66044 -45228 -49972 -56484 -45398 -48734
24177 -48734 -29111 -46019 -50311 -35760 -13851 14407 51783 51567 36817 -6119 8967 30556
24165 30556 36432 35951 28030 -13084 -16015 -4358 22096 42444 50885 49179 31789 17682 16933
24152 16933 29035 28422 18707 8134 22543 31071 25131 12264 48508 48690 46322 51079 24712
24139 24712 803 -17132 -12058 -1681 -11399 -336 25891 17938 -5842 -26194 -47634 -44641
24127 -44641 -33166 -30240 -24940 -28969 -44817 -24013 9436 7666 -10425 -24223 -9253 5582
24115 5582 472 17645 33823 29495 31383 19889 27836 29229 10018 4023 -16019 -27032 -938
24102 -938 45952 55670 83676 82080 40266 22847 26802 24491 10092 24855 24484 31570 35733 31196
24088 31196 47929 85986 52372 31900 37257 23419 18185 -4542 -28451 -24848 -13629 6382
24076 6382 16642 17548 1389 537 4303 -14174 -7138 31082 42426 52593 45829 23744 11188
24063 11188 19455 49589 54209 37085 1179 -10372 -2053 9096 17543 15877 24560 35793 53192
24050 53192 38020 29478 28069 33727 35120 46556 40685 34970 56650 63451 58772 53557 45202 17106
24036 17106 1529 15082 5985 -512 1166 4195 -3731 -29967 -22466 -13486 -18390 -29062 -48732
24023 -48732 -12698 20327 21578 23538 10183 -10655 20590 35741 48536 72268 69501 63664
24011 63664 49152 30286 4776 7826 3310 -13011 1158 14599 23418 2255 -7394 21894
23999 21894 35366 30267 35694 57826 52661 32459 54414 48554 44277 67073 67144 36003 30370
23986 30370 36458 37427 26737 6991 6755 26985 37535 46685 30783 -10231 -16123 -19466 -15010
23973 -15010 30557 21192 -20283 -11970 -29563 -68596 -73632 -39450 -20742 -43253 -68530 -67870 -42008
23960 -42008 -28081 -32965 -37548 -50723 -11438 -8174 -16954 8373 49063 72159 62334 29486 -2039
23947 -2039 -7149 -14549 -23701 -25838 -36220 -29479 -20446 -34350 -21627 38859 60526 40156 39424
23934 39424 8639 -6992 -1304 -17644 -19288 -27838 12436 18189 22313 53653 66952 60600 53489
23921 53489 43581 82770 88602 61850 41101 63915 89238 76475 74380 59294 60561 47291
23909 47291 21313 45143 79180 78071 53037 43905 44327 67997 49385 33520 27903 16505 8486
23896 8486 -7869 -17267 -21838 -10111 -8818 12727 2014 -32454 -37421 4966 6541 -6907 -31999
23883 -31999 -32251 -25525 -34600 -52331 -54768 -87350 -75774 -46528 -72507 -94305 -93381 -87222 -56808
23870 -56808 -34845 -36491 -45225 -56519 -55159 -44900 -21588 -16917 -20587 -15030 3006 2350 841
23857 841 15442 33593 39775 39952 60795 44961 7672 6255 3142 20514 34441 13531 18902
23844 18902 23709 916 -16222 16518 39118 28897 4455 16478 27908 3131 31758 16353
23832 16353 8703 -29189 -28266 -21868 -16775 14437 14148 21728 10193 -1892 2227 5967 -30671 -34339
23818 -34339 5386 5531 -21126 -36927 -43703 -42924 -20400 -15115 -16627 -25749 -10050 40054 -3323
23805 -3323 -11018 -42636 -51503 -17406 14415 17276 9620 538 6631 16643 -2852 -33259 -13360
23792 -13360 -45917 -72710 -83307 -71611 -36833 -18017 -25440 -29847 -56394 -34077 3409 44070
23780 44070 45811 26724 14309 -11030 -43542 -37862 -34490 -18542 -8682 3858 21362 29124 31224
23767 31224 19266 15322 -10613 -32928 -25735 -14207 -9026 -6275 -5637 -8491 -20233 -38112 -27745
23754 -27745 -24095 11672 36329 27861 26104 13108 -9989 -27291 -47125 -47999 -13923 -4401 -1118
23741 -1118 -2193 -15227 -3637 19037 20620 16540 6062 -1017 -3202 -678 -4042 -22459 -49655
23728 -49655 -64445 -37209 -5588 -1580 9443 9469 1690 10542 42579 8154 -14634 -12282 8581
23715 8581 19221 12737 15046 4048 2416 18543 38970 30328 -13732 -40332 -37055 -46225 -40052
23702 -40052 -34465 -33570 -15820 -6466 -30231 -67237 -42942 -33940 -33933 -55491 -58290 -35466 -26515 -9596
23688 -9596 162 10519 19552 6334 -14814 3545 9716 -11216 34280 67160 63826 14309 -10948
23675 -10948 -31132 -1676 41753 51840 43347 42272 11609 -18044 -6240 -34272 -40138 -38763
23663 -38763 -24753 -17801 -9780 -5172 13140 45432 39692 49116 77173 56747 11546 7572 14062
23650 14062 26204 48596 40464 10469 20627 27472 18190 48478 50410 39799 24459 30148 22168
23637 22168 -3745 -14598 -25367 -15508 -8951 -8657 -37385 -35701 -17971 -22138 -25907 -31907 -24836
23624 -24836 -34771 -31239 -28906 -33289 -60280 -58326 -57890 -31684 8282 31505 22577 -3691 -8145
23611 -8145 -178 5739 3790 -24924 -13204 -1636 1252 -13725 -19841 -15837 -15833 -22248 -18513 15468
23597 15468 -2889 -29911 2662 10906 -5868 13205 27515 28211 24635 29212 29163 9994 -21763
23584 -21763 3886 24902 30747 31519 47763 13408 -29379 -15499 -27487 -9942 -5589 7004
23572 7004 28189 21687 877 11871 8107 9965 3673 -27689 -34813 -18768 -30324 -27998 5666
23559 5666 8605 9982 4662 -413 -17716 -24743 -5669 -8272 -26596 -11347 1264 -9210 -1057
23546 -1057 6736 -3923 -1836 20604 59144 62161 48808 13420 7840 18603 24396 23416 516
23533 516 -30465 -20295 -2764 -59 -48808 -88705 -34869 -13454 -26728 -36015 -44297 -39741 -16598
23520 -16598 5086 -20010 -22526 -6922 -9252 -12161 -16697 -44439 -17290 -14740 -3809 5741 19845
23507 19845 5739 -15159 -43538 -22947 -21173 1939 -7537 -18526 -37163 -12507 -21036 -42693
23495 -42693 -41346 -30340 -6733 -14544 -23306 -38497 -58990 -13530 21910 38335 3110 -31007
23483 -31007 -18585 -18526 -7402 16341 18555 28228 17029 14218 22339 -2592 -12405 -8808 -33249
23470 -33249 -54828 -38395 -13710 7074 -6202 15880 22231 9913 -11806 -27027 -41279 -51346
23458 -51346 -37482 4157 -12682 -16755 17957 13380 -29279 -30710 -6981 14764 42086 46216
23446 46216 29640 3504 -20901 -24044 -27990 -1561 9967 20023 33909 16179 66 -10002
23434 -10002 -5902 809 18789 20020 -11148 -40896 -37227 -14008 33137 52127 45254 11698 -8809
23421 -8809 10337 14463 -18995 -24040 -26884 -44126 -57338 -32668 -24394 -1225 -8263 3550 -15553
23408 -15553 -20494 -22342 -30817 -34499 -16772 -15776 2455 2035 -46470 -71479 -55517 -40586 -24259
23395 -24259 10459 46418 54258 38025 4720 3603 12494 22212 28240 23872 -11403 -40650 -27794
23382 -27794 -25025 -31372 864 19529 -10941 -34641 -15813 -17942 -10898 -1687 -7707 13441 5273
23369 5273 10880 6578 -22081 -44990 -58906 -52221 -57457 -29683 -19077 -18459 2523 10908 2339
23356 2339 -3331 -7834 -15324 -15399 -8564 23371 43239 43103 18170 -8998 -3557 3891 10679 9515
23342 9515 27194 44947 56810 53313 26688 -26704 -51107 -40474 -13495 11724 20409 11593
23330 11593 -10853 -12958 -20777 -19614 12020 17905 -1805 -21873 -18046 -7242 2477 -15100 -41967
23317 -41967 -60234 -34276 -9179 -25711 -6846 -400 -4520 -6088 7011 3874 573 -7342 5751
23304 5751 22644 20996 -4304 -23073 -13940 -10993 446 -15656 -8883 11585 -4009 4015 1481
23291 1481 13270 11879 -959 19555 14691 -3744 7130 37972 25169 4171 548 -9668
23279 -9668 2010 4151 7625 26170 -4610 -16630 -51289 -61986 -77186 -78605 -62407 -42221
23267 -42221 -27975 -19270 -6936 13136 14736 30354 34148 48564 57095 38903 7354 737 7779
23254 7779 11812 10425 -7030 24426 29737 37746 28362 12183 -5874 -12486 -39211 -19572 20820
23241 20820 38977 -3004 -14264 -12626 -1678 -20025 -33625 -23650 -6257 28515 8921 2102
23229 2102 -8218 15035 16133 18989 18926 18337 1405 11249 -7451 -1985 -19897 -38551 -25715 -23209
23215 -23209 -10197 15 -4208 -21077 -18368 9917 9896 -5377 -20076 -26217 -31374 -38058 -24816
23202 -24816 3438 8798 -3318 -7786 -11288 9126 26679 -138 -35987 -15724 7667 -2903
23190 -2903 -18481 -31513 -32746 -52346 -83505 -82915 -44551 -30614 -27884 -12173 5110 10382 -10452
23177 -10452 -53840 -70325 -48623 -40346 -18868 -9392 3352 8841 647 3955 -2276 16089 21761
23164 21761 55706 62040 30674 35034 14175 -11762 -48664 -28417 -10030 3863 13228 9879
23152 9879 16535 -3312 -922 -14554 -24075 -26447 -20340 -31500 -37201 1656 1669 12740 41173 25556
23138 25556 22284 14652 39819 61090 29680 29484 6528 -9511 -20938 -11193 6780 17662 -7378
23125 -7378 -38840 -40183 -47771 -33817 -10754 -3706 13953 22245 32079 14618 48256 56801 22938
23112 22938 -24190 -38051 12873 51303 41941 56730 24655 18930 25163 -11494 -34725 -41513
23100 -41513 -30064 -17528 5192 3335 4500 -15029 -11971 -8156 -12109 -687 -20876 -21649 -998
23087 -998 -14156 -2821 12300 29531 35394 28223 12925 -822 -10684 -19383 -8619 18082 19128
23074 19128 13841 31219 26674 4322 11873 -15060 -6561 14893 9661 25832 17971 16692 19259
23061 19259 -6061 -27132 -20155 -2372 2911 -9913 6830 54785 48322 10129 -1903 13215
23049 13215 9524 13525 -16007 -7051 4792 11053 25605 2258 -9796 -24615 -30287 -58063 -91257
23036 -91257 -91737 -50128 3875 10018 3078 21364 26015 -3658 -2527 19661 15711 -3876 -13328
23023 -13328 -16352 -29651 103 33849 39493 44520 31812 -2730 -21379 -10412 -2856 -9105 -10038
23010 -10038 13149 27803 11979 19439 57603 55074 30069 51749 65908 8554 -9603 26013
22998 26013 14294 11039 5109 16264 25644 16167 10638 -12820 17817 62119 66448 43661 11752
22985 11752 -18813 -30096 -18476 17117 42095 16964 -23975 -37606 -20011 -12126 -24405 -33843
22973 -33843 -33850 530 -2006 -17612 -25037 -11014 6609 27926 -11093 -48869 -36703 8451 25201
22960 25201 29820 23081 7163 -13807 -14914 -11947 -21925 -15708 -22763 -45322 -59370 -55944 -14172
22947 -14172 -3053 -3256 -2915 -261 11212 36958 20743 23276 10518 8718 12296 12487 9021 -5010
22933 -5010 6063 2592 -31457 -32845 -23357 -12417 -1631 858 -145 13714 -9854 -4170 -26992
22920 -26992 -47004 -44503 -1531 8642 7960 13546 8327 23470 39765 39703 35257 40698 72630 51535
22906 51535 27209 8210 -5594 -5187 5227 -8604 -21281 -15301 1777 -15734 -40801 -22185
22894 -22185 -21343 -10535 -8369 3064 14631 14363 15942 33062 28214 19790 23471 2528 -19883
22881 -19883 -30751 -44415 -60108 -33976 -24563 -41035 -44267 -18699 7633 14506 14383 22792 -127
22868 -127 12241 23262 26976 17051 317 -12570 -33141 -46571 -7044 -24945 -52180 -27593
22856 -27593 12322 33744 30736 -8589 -22661 -13313 -8480 -41253 -58049 -24122 -11774 -6492
22844 -6492 5751 27414 28555 11983 5120 -6192 -17614 -5857 8026 1879 1491 -8688 182
22831 182 1183 22587 5154 -11067 -12892 23602 66175 60320 35827 20691 9855 -4999 -22716
22818 -22716 -46771 -39589 -1164 29948 54227 24261 5009 10363 2137 14995 16042 5334
22806 5334 12010 21737 -1574 2786 -23889 -33683 -23350 -5055 -11294 -23785 -14472 19812 14043
22793 14043 13127 24026 12289 17124 3092 -18594 -37305 -32519 4485 -13074 -15449 25214 74637
22780 74637 64676 12017 -26036 -11835 -3702 -4682 -19264 -31374 -44062 -36333 7516 7476 -6795
22767 -6795 -24673 -13833 -8229 -49231 -51230 -41070 -40854 -34402 -24745 -16208 -11555 -36112 -42397 -5398
22753 -5398 -21990 -26146 9238 2468 9990 18847 31625 44453 39947 30636 40843 45900 39695
22740 39695 43843 43349 31658 18132 15706 31598 32478 12085 -2544 -16856 -4007 -5947 -32876
22727 -32876 -27480 -851 3077 -1058 -30994 -31528 17261 20321 -2155 -14015 -38962 -20178 9039
22714 9039 15748 9016 -20398 -42956 -11374 -6270 -22036 -31090 -31088 -21783 -1513 20943 3680 -7521
22700 -7521 17242 39214 20660 -4205 -20804 -35626 -26084 -5010 5409 -3042 4624 14598 695
22687 695 -14858 -20375 2013 32291 22998 10326 -2598 -69270 -72130 -46554 -42791 -23986 9489
22674 9489 16185 43742 40841 29856 734 5303 31955 34903 40451 17591 20146 33196 26815
22661 26815 -17100 -69712 -65223 -36751 -40562 -12759 -11910 -9311 -18015 -19918 -4806 -3127 4095
22648 4095 -24374 -61215 -51013 -48976 -60038 -44973 -39345 -40363 -28659 -13583 17570 35335
22636 35335 -12157 -19517 -36078 -48422 -10855 6400 22549 464 -50690 -82215 -41959 -28965
22624 -28965 -26879 -808 -2360 -18647 -1552 29998 30464 5211 -4739 -18731 -23573 3473 14510
22611 14510 29377 31173 20662 11368 33288 27398 13287 5291 -9079 -21903 -26794 -20056 -31714
22598 -31714 -42573 7014 57587 57636 38722 38556 1595 -44499 -26158 -9021 6239 71727 72775
22585 72775 34987 2654 -25807 -36524 -51567 -38250 -40491 -40462 -26554 -44432 -40471 2577 -1024
22572 -1024 8408 -12300 -21580 -25381 -32040 -36852 -33586 -27081 -10876 -30274 -23960 6007 -2961 -39138
22558 -39138 -35518 -11421 -9178 -24240 -7049 22514 -813 -20281 -25254 -22267 -28871 -26375 -27227
22545 -27227 -52759 -28191 -11702 2310 -8089 2591 -7159 -8238 11521 36940 22628 -20038
22533 -20038 -28633 -16746 -23802 -18511 -26080 -22634 11285 17473 18093 34121 22530 -2948 -10093
22520 -10093 2278 -5763 4877 13861 4102 -6283 -136 20993 33270 19965 41712 21218
22508 21218 4320 -4891 1619 24865 6646 5481 15041 -1204 -34579 -56481 -27486 -17423
22496 -17423 -56467 -57787 -46650 -50255 -86446 -92859 -30548 21375 34280 23613 -4719 1384
22484 1384 -9283 -12040 -10948 -37170 -26751 20657 42135 34594 32752 14466 31761 39029 41319
22471 41319 34888 11226 6345 20533 19710 9528 10973 16195 15162 30913 21716 -11032 -26558
22458 -26558 -4333 4404 43032 60753 20770 22986 32117 22297 13677 45393 45348 37335 43144 18585
22444 18585 -8596 -21670 -6170 2991 19395 24531 21592 15158 8157 1177 -11801 -11893 7637
22431 7637 23094 5559 -7979 -10774 26734 14190 27979 37769 38260 41599 29640 8796 13347
22418 13347 8763 1902 14322 4270 5539 -20876 -49348 -11396 6597 -8862 3266 -5166
22406 -5166 4024 -2286 -681 4739 11798 20092 25146 24097 21798 37379 52403 50500 43362 51109
22392 51109 10779 -18010 -38891 -35801 -20473 -13665 -12586 -7967 34119 28402 -23496 -58178 -25562
22379 -25562 -15903 -20681 -4755 7579 6653 10272 6839 17864 2076 969 9688 -869 -15578
22366 -15578 -18428 -12440 4464 22626 9524 -11107 -1395 -19044 -16563 45364 69499 69022 47430
22353 47430 16832 10123 9425 29985 33642 43219 56863 30779 30348 -13373 -37525 -32805 -10870
22340 -10870 535 15314 18301 24895 9619 -2987 -17750 -6874 -10287 -19938 -33487 -33245 -34754
22327 -34754 -10288 -11161 -6072 31785 13676 -24926 -22984 -9113 -14629 -22437 -30415 -23104 -21160
22314 -21160 -37740 -64787 -54996 -29601 8341 18409 22365 26237 -4169 -19150 -42608 -57510
22302 -57510 -50544 -27575 -17640 -38319 978 32464 19482 11695 -918 -8111 -24528 -14728 17529
22289 17529 41479 66651 56070 36144 31409 6974 -18900 -18876 8525 14235 15197 7901 -3998
22276 -3998 -2370 6540 10406 10608 21897 25325 -27957 -23099 -6949 16716 16090 -5636 -48078 -46871
22262 -46871 -21531 -2366 -15664 -35891 -2129 -4111 -14396 -23491 -40737 -37101 -46101 -63412
22250 -63412 -46220 -38002 -35087 -33200 -2137 30372 35165 23195 16179 21685 35183 18981 31116
22237 31116 49761 36313 43149 30781 46804 56958 37014 981 -26341 -7845 7081 11384
22225 11384 -1875 15436 270 -21493 -13598 -22371 -17923 5953 4793 -18788 -8543 -39270
22213 -39270 -55688 -38976 -43464 -46427 -24137 -6996 872 4837 -20903 -22072 5845 340 -4941
22200 -4941 -9373 -49267 -44036 -70145 -77835 -59528 -7218 20050 31594 5158 4330 169 -14083
22187 -14083 -27150 -29980 964 35264 25421 16412 -13875 -39447 10551 35956 25958 18704 8259
22174 8259 10740 -5675 -23081 -11005 -19437 -41441 -34334 -6679 8488 -14789 -24876 -28285 -32390
22161 -32390 -42105 -61778 -47200 -6653 -25578 -31583 6224 7159 -45215 -71208 -54512 -50701 -50838
22148 -50838 -50361 -36730 -9133 -17572 -12788 -5049 -28229 2416 -254 324 13826 3044 2337 -20342
22134 -20342 -25693 -10299 -14554 -7687 -3646 -10510 8515 -15993 -22983 -18334 -22232 -20816 -16239 -5847
22120 -5847 -9772 3525 25686 18922 -2742 -9864 -16312 -13187 7026 11354 7935 -1455 5325 9306
22106 9306 -1576 -13257 11695 33288 39446 53298 70298 37976 -16368 -27235 -19985 -7657
22094 -7657 21820 47521 48696 59764 73953 61793 45991 54536 69696 43336 5458 -4895
22082 -4895 -8274 -27895 817 16317 18990 25299 27383 43328 63664 31000 16250 25168 26935
22069 26935 41992 47924 36263 26826 37753 26714 2677 30058 64298 99242 116251 119473
22057 119473 126940 113522 85799 92220 103817 136833 136939 148391 156121 133572 126148 128235 107971
22044 107971 91920 105414 103660 105750 97311 70938 63073 51497 44262 40495 24507 21308 26365
22031 26365 52123 80107 40236 5307 -10397 -13464 -23345 -14238 36327 51714 65345 75377
22019 75377 47547 16950 -1344 -9016 -843 30364 34086 10112 16343 34623 34613 14073 5204
22006 5204 17266 25151 27838 43289 7735 -23927 -29908 -15638 350 -7237 26189 35113 28013
21993 28013 -4121 -27731 -15886 -18654 -49811 -55848 -34417 -13097 -14455 -16443 -11826 -38059 -38634
21980 -38634 -23458 15891 10726 127 -12435 -15281 -8918 -9178 12884 7482 18423 23306 30956
21967 30956 -8437 -37390 -6700 20312 10823 13036 10560 26714 33487 16377 1415 19474
21955 19474 33767 44571 14085 -14176 -962 21674 12422 24378 22926 -9208 -11524 -3250
21943 -3250 -22648 -25948 -33711 -21435 -1167 10687 21908 23477 3304 21284 -6011 -48943
21931 -48943 -53361 -37356 -13202 195 710 -1552 11077 19496 -798 -10920 5634 -28388 -51220
21918 -51220 -50822 -37445 -10903 3448 9634 11273 17331 6061 -830 -15330 -22097 -15251 -9818
21905 -9818 126 6209 14240 18444 10480 6830 -1828 7682 49036 22893 43827 69295 59695 50128
21891 50128 47147 37838 29087 30804 33133 18446 10837 -28692 -19582 -11630 -18754 -51780 -19643
21878 -19643 15084 15943 14664 -7692 -19598 -24522 -38073 -31916 -22115 -37960 -60005 -68773 -28822
21865 -28822 -19320 -6492 -11551 -46576 -38658 -36104 7568 15047 11499 6413 -15474 11604 7403
21852 7403 482 -9343 8532 10186 -75 -22496 -18805 -2318 19268 18323 28588 22816 8028
21839 8028 28870 23469 25395 19459 30106 18783 13403 -4517 -253 -24161 -63664 -68294 -70534
21826 -70534 -45153 -13434 18240 22590 13806 15848 5017 -5264 -19706 -16831 -32668 -47545
21814 -47545 -34952 -20249 -1531 16377 13631 43103 27445 24683 7676 -32720 -53552 -32130
21802 -32130 -19792 -6144 -717 2068 -22201 -23358 -18111 -27826 -22908 7128 26660 19769 20614
21789 20614 30919 -2220 -34887 -42684 -37675 -10295 28155 21285 -4536 6794 29394 39387
21777 39387 22525 31932 50451 38922 19066 -25131 -57991 -64286 -42222 -38371 3216 18342
21765 18342 -2806 -5303 17115 5993 22981 19558 -828 -6064 1219 5158 6274 24881 41145
21752 41145 36615 38495 1483 -31810 -33897 -22452 2093 -5697 -28473 -18130 16585 68794
21740 68794 59038 36497 44261 39713 39991 15516 17346 32258 12629 -26553 -46002 -3403 8221
21727 8221 -28349 -29229 -14232 -9768 8804 34881 3617 19722 45977 44687 55935 67599 50744
21714 50744 34955 -13634 -6406 -6733 -10455 6907 14598 6939 16541 3821 16270 36158 22044
21701 22044 -7768 -3956 -11583 19460 22324 14763 26770 23850 24220 7110 8531 6055 16797
21688 16797 35918 41894 28353 43641 30540 2850 -8566 23612 38108 54045 60386 73667
21676 73667 50468 6614 88 16537 8364 27392 19657 3659 -2341 -40149 -40237 9053 20451
21663 20451 20173 22373 11038 6008 -13874 -46591 -45550 -31682 -27072 -32328 -13476 5782 10571
21650 10571 6345 -2920 -17396 -26116 -25520 -18194 -5865 -7668 2998 32105 29763 48276 37085
21637 37085 27422 -9205 -39923 -28918 -3749 16414 9407 29243 40792 34272 19384 13345
21625 13345 4051 1728 9285 -11694 -6031 1786 4095 1723 -950 -4869 -12342 -18672 1857 17514
21611 17514 -3936 -2990 -6237 -3173 8159 8389 -5491 -11275 -13537 -5773 11032 10760 -11125 -17463
21597 -17463 -680 -6788 -304 -3179 -17886 -26226 -9496 19839 29843 24152 48411 60401 26631
21584 26631 -10897 -22960 -18400 -13905 -5841 10811 36304 40296 26542 25102 53151 56966 30656
21571 30656 38849 48143 36802 43753 49376 20981 21617 -13341 -22178 -19463 -36307 -20183 -21341
21558 -21341 -18683 -3178 4421 -2546 15719 36732 25067 8201 -3886 15710 21376 -6020
21546 -6020 10159 -15688 9238 36353 24754 10463 10618 31468 60477 58539 28135 -2974
21534 -2974 -34509 -19596 6060 -3779 -7632 14173 -5298 11371 30134 48896 52056 32006
21522 32006 18359 27498 56168 53842 30241 26701 4628 -6011 5617 -834 -6677 -12573 -14134
21509 -14134 9477 22159 12293 -23460 -6694 7215 39750 40534 44898 56879 29877 -683
21497 -683 14999 12245 5330 16930 36989 44262 17687 5262 -7605 -22855 -10981 7264 24710
21484 24710 31206 11099 2108 24052 32103 34978 25123 27081 12292 14571 10376 -9624 -38885
21471 -38885 -18230 -17183 -32613 -27297 -28754 -18291 -1444 -15101 9634 54714 44771 51292 52414
21458 52414 17368 -23319 -37587 -15979 -31457 -14475 28132 58824 66262 46896 15975 2272
21446 2272 -15352 -3217 -950 -14502 3647 8696 -6350 -8900 -23529 -28064 -17967 1211 26487
21433 26487 36006 58543 63675 40362 21704 -3500 -23202 -21891 -23917 -5022 10198 -4521
21421 -4521 -9190 -7592 -6073 15936 25551 5616 -20079 -24440 2835 23471 36987 44174 37650
21408 37650 30668 54798 73750 26246 -13943 -53820 -57700 -34341 13510 32519 39910 46534
21396 46534 5340 4396 7335 -5967 -16323 -11440 -13166 6353 19786 16536 -8878 -18051 -22929
21383 -22929 -33266 -21250 -8231 -10933 -12110 -710 21015 28735 22028 17702 -2711 23462 20997
21370 20997 933 -57 29391 60952 58099 40037 28315 13652 -37131 -38281 -1767 5172 -16548
21357 -16548 -8087 -5375 28192 35169 31723 36935 31182 29896 43347 59213 60496 33373 26153
21344 26153 24537 29620 40096 38820 36178 27165 5542 1104 15122 28126 11798 -20322 -19668
21331 -19668 -5642 -19178 -15542 1907 -11652 -14291 26755 44590 21899 12059 -10365 -1696
21319 -1696 29471 28072 19020 -5904 -18358 -22861 -25919 -19890 -42552 -37213 -2073 2577 2970 24084
21305 24084 29243 34933 32666 32379 12825 -543 -34058 -32083 -6483 4754 14475 -7063 -32258
21292 -32258 -58688 -40770 -15438 1125 18857 30670 36168 34925 42519 40912 14295 3262
21280 3262 -17927 -12655 7446 22526 35509 16074 24457 21233 -592 6073 11589 18680 2497
21267 2497 -11806 -661 -11390 -12967 -27010 -24850 -7076 6607 42211 61250 56206 28214
21255 28214 38089 23713 11684 6541 2375 19502 -2706 -10534 -7829 -21056 -35652 -5229 -598
21242 -598 -29904 -25026 5867 30081 52996 51907 16113 1651 20102 31012 27279 14172 4777
21229 4777 15785 3017 19851 30012 37299 11875 -13095 -38189 -52031 -31022 -11373 4956
21217 4956 -4404 2506 14340 3619 10288 50234 43524 31633 41917 61661 76678 67262 65144
21204 65144 40245 25994 18078 9057 27101 24317 -3101 -10253 -47933 -41875 -20428 -16806 -512
21191 -512 653 11406 -3206 -23258 4183 26248 44777 38483 44562 15646 12192 8447 430
21178 430 -25386 -34122 -15929 -3086 -7584 -8566 8036 -370 8164 -336 13594 -3224 20903
21165 20903 36328 27741 14804 -25035 -56646 -54858 -35819 -58946 -78930 -70131 -65419 -44634
21153 -44634 -25162 -22210 -44271 -69334 -85147 -79667 -35838 -18976 -7154 -10984 -19444 14383
21141 14383 22980 13111 10696 -12811 -38000 -32826 -18816 -32774 -20624 -1922 -15517 -51976
21129 -51976 -47212 11871 14003 -3906 -27039 -9984 5833 24602 47032 34267 11668 206
21117 206 -17973 188 17137 30375 20675 27198 37099 47305 13523 30634 48777 38404 120
21104 120 10017 22753 13935 -1216 17132 15429 4855 -4278 -5517 15914 19241 3986 -8603
21091 -8603 -4281 -36254 -24644 12824 52855 61297 49568 35325 25157 31864 22963 6180 -24293
21078 -24293 -6767 22884 -4712 -21867 11594 50312 57386 24484 9928 17620 25861 26509 31046
21065 31046 41949 67618 47686 21365 -9872 -13734 -27562 8344 26899 16555 37670 49812
21053 49812 27128 14491 -5095 20579 28404 51309 61263 54662 16500 18426 25348 8532 1146
21040 1146 -16108 -1631 2081 -540 50473 46764 30841 28181 2453 -25366 -13001 -4690 -11525
21027 -11525 -9313 14196 6879 -26223 -36661 -14644 -11008 -10834 12941 7592 2258 4903 -1473
21014 -1473 26433 29575 43584 55324 54926 58300 56004 51347 68075 53063 54243 67970 63304
21001 63304 51016 45192 6407 -9296 13348 30147 26144 15925 7916 17959 15140 24220 42951
20988 42951 72286 83148 84113 74652 64766 62360 42624 34144 29933 440 -4319 27962 34807
20975 34807 22839 33902 32428 10744 21024 32379 19992 4250 -27492 -21554 -16646 239
20963 239 4031 -6981 298 5272 16420 2460 -18086 -22293 2666 9500 7512 3360 32279
20950 32279 30191 9293 -11295 -12522 -3692 36190 32736 34002 26990 29667 23482 9822 -11669
20937 -11669 -28418 -37692 -35653 -31576 15462 20849 9596 -23546 -43040 -5143 18354 20553 29919
20924 29919 57468 73641 50243 34494 18020 8039 6327 16595 -954 -26599 -23995 19536
20912 19536 45387 48405 40771 50392 51827 71641 75400 34274 -14641 -22557 -22512 -23109 -12005 10998
20898 10998 8802 16359 47628 23673 -31803 -50974 -55297 -32771 -1592 -6674 -8336 49482 33662
20885 33662 14726 9127 4760 14558 13011 -2018 -15141 -9354 -16422 -25697 -41230 -62499 -63131
20872 -63131 -45177 -52161 -74075 -69620 -46407 -15848 4180 3156 20711 3955 -15521 -24791
20860 -24791 10808 12696 9674 20652 18444 23703 28992 7676 -5997 -12741 -14760 -11233 -16898
20847 -16898 -8808 9045 71 -15740 -38766 -56978 -52652 -42427 -43956 -46640 -47291 -50994 -57389
20834 -57389 -51134 -35934 -48382 -73897 -73128 -59155 -55561 -30692 -26329 -47230 -38601 -11549 8743
20821 8743 27447 20836 -22327 -39395 -35282 -21496 14933 14618 -22034 -42316 -60876 -85669 -82328
20808 -82328 -62932 -14526 21544 21954 -17145 -22143 -6711 -15013 -38167 -34951 -25760 -22582 19386
20795 19386 -6924 -31017 -38591 -34872 -23218 -18008 -27191 -37695 -51428 -54855 -49775 -28709 18721
20782 18721 24977 -7111 -4083 -10167 8655 8509 -6281 8525 23280 26313 24185 16835 20077
20769 20077 28608 23427 1577 -26627 -29796 -52908 -47578 3424 26518 11990 12043 24546 28765
20756 28765 17916 14793 -2224 -4847 -27016 -65491 -43772 -6794 24847 16738 14375 12136 31820
20743 31820 31644 1094 18596 30704 36936 20104 12725 6415 2962 -6534 -24425 -48665 -49247
20730 -49247 -1235 14663 29320 28169 25474 18650 -36727 -49685 -51546 -53280 -88116 -82704 -78508
20717 -78508 -60833 -14320 4847 13569 -2562 -10744 -37405 -41164 -52153 -63867 -49328 -22002
20705 -22002 -35856 -72471 -82776 -68726 -55146 -70408 -50049 -11072 -7078 -36539 -39496 -19543
20693 -19543 1621 18543 13010 -24335 -14359 4513 1519 -17912 -17750 -14508 -16383 770 -479
20680 -479 -4870 4280 -4348 -9096 11905 -3259 -25571 -60481 -27249 -12736 -14880 10679 44883
20667 44883 61886 14636 -10584 -7120 7704 6459 -18516 -11902 25574 59778 33792 33860 41501
20654 41501 26816 470 -311 86 4858 -6292 -16667 12272 23410 24693 26899 26343 30854 32039
20640 32039 28560 32185 39021 25935 12882 5619 -4287 3055 22817 47440 38745 563 5326
20627 5326 38254 56081 52766 72403 76853 37558 21922 26618 43328 45187 50790 70149 55675
20614 55675 28865 45448 65414 104160 93176 83326 87266 71715 71265 88913 98728 108615 92501
20601 92501 62588 41255 84968 109491 95817 86073 84855 108118 100307 85187 95280 74130
20589 74130 73083 87615 102899 81733 59114 13009 39352 95389 119885 122617 130572 135575
20577 135575 149947 146499 116464 111246 117548 111063 120908 76938 79391 95946 115174 90748 107400
20564 107400 124856 112127 94329 92396 98053 61947 59747 80640 89538 68221 67647 56058 33274
20551 33274 36830 46753 55077 60709 44345 36013 37112 48560 27068 26739 32723 57334 108366
20538 108366 102750 87352 86910 93303 88537 74207 59207 42357 24674 21364 25176 20313 -3264
20525 -3264 30413 52307 25558 -26502 -40966 -43346 -50113 -68261 -31265 -2254 -11133 17392
20513 17392 26940 20132 40222 14666 45987 83963 57605 11093 23654 46092 66495 69570
20501 69570 45173 58393 40475 4548 -5990 -19959 -18645 -35533 -32143 -19607 4394 -629
20489 -629 -32914 -55489 -38282 -25141 -30588 -45866 -44785 -53481 -46026 -32734 -8008 10064 -8120
20476 -8120 -18474 -22720 -22750 -11763 -4915 19915 -6907 -25918 -24260 -30168 -43614 -56087 -58581
20463 -58581 -53142 -29631 -4091 -3478 -7676 12669 4042 17365 40282 29110 33012 32537 28260
20450 28260 26207 9235 -5781 21004 22619 30297 36778 44543 58401 20221 5079 14955 15404
20437 15404 2665 1450 6409 6777 4744 35669 56091 98251 93169 99266 116056 123631 150721
20424 150721 191928 227470 278838 330176 429219 465288 477407 502653 524892 558818 585865
20413 585865 592681 543721 498347 440592 436533 414546 419944 423582 461902 482532 490292 506311
20401 506311 535618 568182 620134 638143 625060 646328 681638 724132 744034 780691 820605
20390 820605 815130 803303 817777 810256 822774 864433 941797 974765 1007345 1020230 1048684 1074671
20378 1074671 1026932 983930 935498 906885 865510 833691 776988 749071 737358 751898 781616
20367 781616 797850 793290 800047 820231 841629 885913 928659 972274 974157 979153 997780 994362
20355 994362 963443 935485 887115 859480 811414 751049 706244 661056 655923 657469 649057 653392
20343 653392 660494 663279 631764 614757 583255 534880 519517 486460 469146 439866 406479 385822
20331 385822 379487 361150 339093 327937 318268 289188 280194 271205 306056 333734 320953 303974
20319 303974 300606 287308 285449 303019 300069 252696 214680 184922 221413 264988 298809 300532
20307 300532 264121 248908 248075 206624 212007 216956 199436 162487 191528 179063 174419 179374 167150
20294 167150 172299 186252 185934 161257 158735 154833 144519 144071 138095 144645 142707 103327 96284 121857
20280 121857 123169 120280 112964 127370 119963 98324 108487 94056 76266 69446 80467 85234 105265
20267 105265 119301 111296 114449 130832 116096 93927 97064 89108 56427 43556 36856 33842 23953
20254 23953 44091 56310 57344 31824 25741 25642 27335 34298 68089 75117 68268 58298 72188 63048
20240 63048 26594 1393 -17545 -1819 21677 45651 92972 105295 110113 109956 100663 101089 94020
20227 94020 80252 63473 60007 59149 77426 77142 71494 40449 12821 -16949 -10105 19225 7521
20214 7521 12777 28425 35558 41183 38886 86888 107322 121151 132309 159186 222643 252149 259397
20201 259397 249970 242570 226362 209955 177250 141853 85192 19929 -12419 -9490 17578 40993
20189 40993 83991 131402 147202 145215 165332 182282 204703 207576 185073 179849 195877 163521
20177 163521 167148 176889 164477 146770 138670 117030 110759 123248 79994 73008 111655 131024
20165 131024 118597 94492 85999 93999 95242 84063 83963 90598 88733 70353 32779 45957 69882
20152 69882 95967 111661 145144 152637 170232 178781 185922 219261 245828 221340 183915 152311
20140 152311 111426 92885 81796 49126 18812 -10630 -2575 25378 55556 104178 151473 194074
20128 194074 235559 279418 298705 315715 311369 294360 315060 292598 263275 244783 217800 208417
20116 208417 181722 134615 58214 -9241 -19972 -6455 -21837 -50616 -21585 24842 62512
20105 62512 87653 101303 103932 113499 131869 126289 90465 54334 65854 98454 112904 92072
20093 92072 49051 -1703 -46153 -63556 -82939 -89733 -108586 -134177 -99103 -94144 -109164 -111883
20081 -111883 -134678 -163291 -173525 -175019 -180039 -145575 -108314 -51940 -18085 -17464 9404 -14814
20069 -14814 -44832 -57454 -63976 -63371 -49450 -81717 -105001 -97023 -56354 -24892 -13780 -8746 3936
20056 3936 -28381 -23080 36583 104953 142772 168731 193046 205484 218512 246467 257506 234177
20044 234177 213808 206956 230571 236524 249796 259171 254283 255175 301570 362060 394976 443020 528044
20031 528044 595782 641889 680872 709062 704571 672784 657530 649784 649437 625020 599895 570671
20019 570671 562925 592560 612167 623947 643625 707824 765538 813839 863468 905179 957168 985038
20007 985038 983374 953780 906020 873160 844846 821601 769475 736529 672876 616340 592068 606846
19995 606846 622272 643672 677059 711455 755548 778729 808093 831441 805961 798198 776888 777682
19983 777682 788847 800904 803920 811203 827397 813313 771560 703618 684773 657886 659279 678431
19971 678431 671070 617531 579664 582669 608744 636969 648494 621543 592558 601714 637979 667789
19959 667789 708164 723860 732588 759506 783329 810133 832446 890808 944965 984167 1004535 1000331
19947 1000331 973648 922900 908188 874139 863146 843095 850000 899720 960792 1049652 1116352
19936 1116352 1161476 1181663 1201424 1210307 1222795 1198986 1194750 1229471 1287367 1327669 1335143 1265503
19924 1265503 1236252 1268307 1260757 1215246 1189764 1141249 1091074 1088832 1111348 1165510 1206235 1267930
19912 1267930 1323234 1366394 1379206 1373114 1337182 1306764 1302155 1333873 1334910 1278558 1222687 1218071
19900 1218071 1236050 1208361 1129528 1081606 1090298 1148448 1200532 1263571 1352529 1426134 1470563
19889 1470563 1533302 1560926 1560635 1545586 1540690 1509063 1459024 1370424 1272698 1154329 1055665 977001
19877 977001 979947 990999 1009666 1024806 1079236 1153038 1213631 1211916 1223803 1298556 1406426 1503132
19865 1503132 1567511 1566418 1581272 1614705 1665774 1647773 1544315 1425283 1355045 1341923 1337537
19854 1337537 1369331 1434382 1522107 1651935 1706442 1678205 1624202 1566854 1548632 1639710 1806931
19843 1806931 1953619 2048772 2119885 2208420 2267312 2252689 2160216 2094181 2058619 2085300 2162666
19832 2162666 2268463 2412070 2552123 2667450 2737187 2797584 2808497 2792024 2820048 2839890
19822 2839890 2898483 2942133 2933668 2852018 2776010 2819927 2939915 3117995 3317046 3373365 3378337
19811 3378337 3432844 3578377 3809574 4075684 4170823 4099152 3939509 3846328 3863286 3931155
19801 3931155 4041384 4159422 4216654 4287061 4432854 4698909 5201055 5813006 6396830 6897430
19791 6897430 7590020 8887458 10793074 12980296 15375593 18218355 22365814 28387690
19783 28387690 35723923 43185344 49932606 55445401 58778671 59268568 57607929 55560617
19775 55560617 54278847 53839636 53861537 53739228 53273240 52517189 51642887 51088397 51676127
19766 51676127 53840925 57300963 61899225 68379675 78321423 93256857 112773505 134264321
19758 134264321 154588944 171873390 183945725 188184565 184742867 177749541 171611791
19751 171611791 167823407 165325432 162352692 158120778 153348296 149304058 146728374 145608854
19743 145608854 145836639 147589046 152094642 161289626 175397731 191926193 207647004 220653953
19735 220653953 228829805 229648154 223287661 213563816 204452548 197582178 192317797 186890666
19727 186890666 180249177 172668807 164653774 156406898 148529834 141552142 135313792 129332331
19719 129332331 123739160 119316156 116987798 116855613 118276935 120204092 121761820 122376116
19711 122376116 120949339 116674754 110617892 104789048 100115705 96392847 92912493 89182196
19703 89182196 85053242 80715514 76358393 72151943 68247097 64463404 60538436 56455926
19695 56455926 52532197 49067156 46066325 43398489 40990751 38704483 36456452 34278985
19687 34278985 32221419 30301245 28596633 27100789 25794516 24566134 23316869 21987988
19679 21987988 20634960 19374892 18295010 17375675 16582200 15842024 15067284 14234304 13388738
19670 13388738 12538279 11778293 11048700 10302014 9553858 8796955 8090093 7446733 6870520
19661 6870520 6350686 5939450 5555896 5160883 4851149 4601503 4426776 4301681 4168519
19652 4168519 3976331 3671599 3330862 3061670 2919964 2820458 2652377 2466215 2276336 2128419
19642 2128419 2028519 1962693 1892646 1755334 1577858 1435756 1327686 1241335 1119908 1000585
19632 1000585 937701 935599 917379 826050 692380 621264 575683 580706 603671 612834 626295 623000
19620 623000 586929 546100 536442 510763 490971 462691 410797 409411 445520 463987 468926 468551
19608 468551 439396 378182 259808 145000 56746 31634 16505 35861 37798 33430 63734
19597 63734 127101 196056 223666 197126 183455 168895 198938 212347 215343 219709 213093 196080
19585 196080 185993 109981 40042 25153 13447 -12748 -2921 -5629 -38699 -62470 -57416 -71769
19573 -71769 -64192 -86831 -121729 -146482 -132119 -95068 -71441 -58297 -85260 -153706 -185949 -233322
19561 -233322 -280383 -315207 -382749 -482415 -534314 -521670 -496721 -479104 -484979 -463811 -433005 -406622
19549 -406622 -362675 -310932 -234394 -179427 -172033 -196032 -243587 -326975 -405999 -432435 -463755 -514145
19537 -514145 -540058 -519084 -484436 -437197 -395675 -315033 -289951 -288666 -265107 -241124 -216569 -196301
19525 -196301 -166218 -133608 -108563 -85686 -112596 -137410 -121209 -130159 -145331 -176679 -181469 -142277
19513 -142277 -97466 -65229 -31300 -46543 -48416 -47241 -70225 -125667 -145828 -142085 -185126 -205574
19501 -205574 -192594 -198243 -206700 -204759 -209723 -233056 -238701 -211562 -201539 -198371 -207488 -223182 -231815
19488 -231815 -214703 -207258 -249885 -265464 -283720 -331626 -389989 -426474 -437216 -443353 -456239 -471964
19476 -471964 -545610 -583633 -555386 -540380 -534684 -539227 -569403 -558611 -531780 -516667 -486028 -428319
19464 -428319 -387068 -384289 -380366 -377356 -395899 -364817 -352251 -309005 -282878 -285617 -321443 -361121
19452 -361121 -374898 -405394 -421084 -440581 -462083 -486028 -474387 -474305 -472735 -450539 -428746 -349370
19440 -349370 -258281 -206835 -165421 -116820 -94804 -82577 -62829 -39867 -12796 24416 11788
19429 11788 -24841 -72539 -137580 -151995 -120621 -132548 -105868 -82749 -60558 -5296 34738 61320
19417 61320 86552 144259 186522 212533 207815 240140 295799 315905 318756 315417 303654 309248
19405 309248 316911 315100 334286 335958 359391 345155 320321 333726 369349 359985 342655 299456
19393 299456 256179 208469 200652 227590 245049 248181 292035 319955 331728 320442 313276 310565
19381 310565 338840 320838 310459 310252 307922 267654 244940 260339 228418 192607 192550 181007 148271
19368 148271 119547 98358 108875 109446 102654 101599 102510 71419 17569 2538 31869 34072 60287
19355 60287 94958 80333 78727 88022 119887 131464 130485 118732 121445 91896 89199 91797 90976
19342 90976 93784 80132 38181 42069 48820 33415 13233 46980 78267 31713 38635 61916
19330 61916 79657 79077 83939 83348 82363 96810 58523 52571 80454 98403 77065 59077 45600
19317 45600 44877 27367 8330 22939 45225 41245 36851 40491 41232 45892 24560 8935 15494
19304 15494 35124 35255 65548 75689 64567 66445 68243 96771 97181 69053 43480 47484 68537
19291 68537 73296 48515 29865 43085 37167 46030 45521 43186 27145 39843 55446 63994 59838
19278 59838 27714 -446 1755 28960 61955 69513 76611 82576 113331 107168 128804 103286 81929
19265 81929 62075 61496 54711 36731 51690 68651 72077 48124 39614 50198 75266 78954 100036
19252 100036 134493 124723 118454 104781 89945 107604 94173 77590 75441 57854 42231 18026
19240 18026 25990 32220 43518 75314 111901 106824 72256 71216 94870 104614 110349 128994 124534
19227 124534 87382 79900 83024 74516 79779 59120 64523 56143 45627 36782 26260 11777 13235
19214 13235 22283 4331 16948 73272 64815 69569 103204 122075 125817 115697 91023 50700
19202 50700 3239 -9932 28866 22064 37634 29854 -4062 14725 28282 -2415 -32283 -50118
19190 -50118 -16952 25257 49918 65039 42144 36353 14632 -6947 -13279 -9417 5781 -3994
19178 -3994 -11566 -38677 -83351 -67857 -98125 -110897 -94716 -70827 -61181 -45154 -60855 -85810
19166 -85810 -46222 -1929 5943 -4049 -32225 -28538 -24785 -55754 -50962 -34795 -45922 -74347 -56293
19153 -56293 -63507 -77403 -42119 -9621 -16570 -23694 -44317 -13701 23190 36163 24852 30610
19141 30610 29246 18442 30259 61660 56072 57944 94296 123956 155101 211866 270673 345198
19129 345198 406606 432416 454942 451912 423978 405842 409595 435308 440689 435424 456846 444512
19117 444512 438077 409171 355522 331176 371676 418039 434435 485360 530916 566613 589707 606490
19105 606490 647768 686718 711773 691269 675417 679595 654702 643310 688400 708518 681203 712315
19093 712315 743334 742608 768886 807574 859153 926182 883023 850437 812631 772146 767394 770495
19081 770495 786812 789520 766630 737287 713738 688859 683214 668976 641196 610489 625084 658217
19069 658217 697969 737530 785452 790630 786669 814025 820257 788892 728731 717923 726564 691800
19057 691800 676607 657506 626391 627924 618779 581964 564850 511206 495828 475673 469139 438761
19045 438761 386751 332027 325005 335172 322687 272344 264391 269769 279004 246666 234650 247200
19033 247200 251476 226665 232734 226948 197596 189832 174133 159943 163523 169184 169144 160288 168375 167384
19019 167384 151154 161996 163604 145251 116966 99442 99261 93511 77798 81700 82255 102155 101527
19006 101527 98615 118085 107903 107670 70921 55785 85056 92594 114780 109043 114922 122815 87624
18993 87624 93220 91690 81126 89385 96706 89437 77096 74600 72656 31006 24697 54395 55084 66959
18979 66959 97273 101602 55663 35686 31023 35223 27603 37092 22621 10392 28265 40689 40855
18966 40855 42785 50970 44146 54814 59985 50896 55110 85068 86022 44128 24214 -1616 -6587
18953 -6587 -27559 -26550 -14480 16368 41058 48373 27308 9495 -2853 15091 23104 19494 37388
18940 37388 27225 501 17424 39152 15445 -23828 -3922 21985 20796 4374 -17795 -21374
18928 -21374 -12447 -45575 -27311 -9487 -29266 -46160 -35111 -31965 -25783 -9518 -37123 -64185
18916 -64185 -57144 -40348 -35042 -19598 -18689 -16018 -43270 -59319 -106510 -138388 -134063 -94305 -81521
18903 -81521 -69279 -59098 -64448 -59053 -48840 -45495 -21606 -18926 -40126 -61197 -60693 -59194 -40840
18890 -40840 -47493 -65132 -44196 -34274 -54503 -75039 -102330 -111251 -108939 -87644 -83051 -81944 -78225
18877 -78225 -90786 -91239 -68915 -8743 -12796 -34281 -35217 -31078 -44527 -54737 -61899 -68219 -45107
18864 -45107 -56326 -74738 -81289 -86179 -89441 -57410 -51565 -33629 -26469 -4406 -24584 -17929 -1593
18851 -1593 1881 1253 -13053 -15839 -25116 -45727 -54751 -39204 -28835 -46702 -69266 -58892 -52483
18838 -52483 -53272 -24308 -26861 -14816 -26696 -26857 -28043 -12857 -5483 1007 2728 6415 -7653 4787
18824 4787 3592 3994 -5385 -27294 -32583 5295 25785 24909 3482 -13452 -30033 -46318 -73707
18811 -73707 -58652 -46845 -53208 -50771 -77549 -44943 -32795 -32235 -23992 -25143 -1834 21499 14840
18798 14840 -547 -12980 -33789 1746 14424 -25874 -55266 -38565 -2555 28684 40814 46313
18786 46313 4981 -21559 9595 34059 30756 53970 43430 22674 -159 11400 5784 14466
18774 14466 -5738 14975 18254 3885 15933 39341 51886 54441 82802 90643 46642 25443
18762 25443 19119 6193 8155 -6697 20615 38610 55584 77111 87533 74503 70743 64449
18750 64449 52023 34794 31629 -16392 -22593 -9273 654 21756 15154 20180 8816 -15505 -24654
18737 -24654 -1267 8163 18422 6049 -19278 -6977 11499 18366 24733 14271 -11130 -27958
18725 -27958 -26957 3079 29393 25057 5432 5512 13552 -10740 20791 26861 2305 4794 10312
18712 10312 15052 13207 40464 58102 44003 32476 6438 10563 31038 40872 46056 25378 8750
18699 8750 23261 59755 83373 58765 2222 -11596 -11774 17227 27175 12750 13933 34980 34829
18686 34829 37850 36939 59437 59039 46901 16821 7374 20439 53064 57928 45246 66416 83896
18673 83896 89091 76778 46759 36808 58095 52327 39560 36203 20952 45094 52154 20613 18494
18660 18494 36698 29427 62936 73434 73792 64258 81095 87550 85937 84813 103477 82535 61382
18647 61382 64467 59147 29611 21876 15872 46347 57821 58386 35607 7732 20297 33792 56252
18634 56252 50236 45917 61764 49350 60372 51118 36451 43916 16306 14875 36146 35516 14539
18621 14539 12358 15275 11035 14722 1478 29370 31065 -4147 14423 46366 68505 41451 42038
18608 42038 49378 4142 18253 46615 50781 37389 23011 1870 7872 7584 19666 -9011 -10339
18595 -10339 3463 -755 -39487 -22749 -7016 1030 8278 32881 38447 66294 61085 64955 67778
18582 67778 45216 47108 63658 49849 45955 53682 56799 28585 -12097 -25067 -13627 1732
18570 1732 15832 19000 9221 24378 35015 22613 30837 28540 5433 -4324 -13677 -51 14567
18557 14567 -16850 -18178 -24067 -30834 -40520 -32386 -8283 21140 27036 -10170 -29828 -72639 -59204
18544 -59204 -17958 -2640 9920 20785 9395 17051 2089 -25685 -35800 -29128 -48324 -33489
18532 -33489 -27681 -34625 -29753 -10563 8589 23099 42953 40558 51664 60421 71675 29431 -20609
18519 -20609 -28239 -28222 -33098 -27798 3649 12897 20771 27473 22181 23759 17205 -23041 -40344 -12027
18505 -12027 14349 11325 10477 14103 17654 4771 -22778 -33573 -24737 -14921 -13948 -20340 -18710 -20430
18491 -20430 -19770 -3052 -12802 -37489 -35192 -32261 -19637 -20444 -40699 -38146 -40050 -39438 -47019 -61946
18477 -61946 -38535 -3960 20060 7278 -9708 -12182 -6834 -49194 -53172 -40177 -25482 -14445
18465 -14445 6711 -2136 -31503 -8226 8360 -15127 -61862 -60995 -47477 -20440 -21735 -45753
18453 -45753 -45730 -46451 -38786 -46829 -56942 -43125 -40131 -33290 -21960 2080 22927 -12767 -55893
18440 -55893 -49449 -31186 -35339 -52308 -66022 -60616 -68134 -53135 -28847 -40816 -27204 -12919
18428 -12919 15922 3578 -44947 -24558 -10112 13001 10184 -26389 -27323 -7527 -39826 -50880
18416 -50880 -18716 14289 -2878 -31988 -38408 -21596 -18245 -15868 598 8928 -23860 -30575 -19237
18403 -19237 -7606 7559 9121 -477 -23537 -23005 -7191 11242 3884 -22254 -36188 -4181 -10965
18390 -10965 -14536 -31114 -30192 -30584 -10925 785 -13477 -5579 6133 -9714 530 32203 38462
18377 38462 57507 76524 35720 11083 10092 51175 64097 49126 57571 39121 35528 42550 13622
18364 13622 14740 6038 2435 28151 7822 5915 19948 9994 6840 7302 23232 16380 6847 -7207
18350 -7207 -22241 -21582 12385 38965 60529 60738 45141 41007 27466 16529 9221 5415 11101
18337 11101 43865 55822 37750 14047 8351 -2299 5417 49941 45257 20174 23573 39972
18325 39972 70149 82234 60328 27159 -15148 -6547 -9561 4194 24921 27037 26692 27608 27948
18312 27948 6777 -15031 -8057 60 -3940 4096 25004 17304 2354 12305 24160 18672 -10957
18299 -10957 -10804 16350 20530 18415 29833 19144 4083 -11490 -12417 -12732 4870 26119 18877
18286 18877 21933 -4530 1784 5464 -30206 -60021 -55519 -21174 954 -3556 -6645 -5415 15828
18273 15828 25538 53507 49807 3352 -34297 -25384 -17952 -46326 -49502 -40479 -12977 14839 44707
18260 44707 37945 17652 -1790 -8870 6710 36155 17256 -23796 -10145 14845 -9378 -29110
18248 -29110 -31133 -19275 -21238 -47818 -45255 -38136 -55703 -53285 -53610 -50881 -28924 -26989 -20241 -14200
18234 -14200 -24565 -45873 -25361 -12060 -30631 -29055 -13907 718 -6382 -16252 -16034 -52321 -56341
18221 -56341 -58748 -78599 -73757 -76657 -96049 -79026 -59910 -14710 4830 6358 16623 14426 -9436
18208 -9436 -12955 -8731 -31420 -27823 -13103 21213 28602 -8390 -45016 -50637 -26340 -30462 -38397
18195 -38397 -27391 -16454 -14275 -17884 -5967 29293 41232 21053 9605 12386 -11555 -29815
18183 -29815 -17851 -5243 -28955 -58335 -45588 -53633 -35390 -31496 -46805 -23379 -4088 -13522
18171 -13522 -13813 -20754 -30765 -12837 -17103 2863 608 -16430 -22930 -20301 3295 -1786 4570
18158 4570 -16537 -42620 -42173 -51031 -25133 -30004 -54682 -19456 20763 13666 -25240 -27632 -15179
18145 -15179 10612 7987 7597 14162 -10100 -53176 -88470 -64615 -51270 -45242 -50710 -61981 -59577
18132 -59577 -36839 -37953 -13685 36 -29038 -29998 3860 -3542 -13508 -29184 -36688 -20528 -21883
18119 -21883 -29101 -25850 -2070 -2771 -2978 25550 12800 -17848 -32400 -13771 -14518 -11195 -23262
18106 -23262 -28708 -30645 -22999 -12873 -24239 -42050 -58864 -64583 -53106 -47949 -38338 -28309 -37471
18093 -37471 -27729 -23777 -35148 -32876 -32649 -34868 -11393 -22268 -48159 -58617 -11688 31370 25196
18080 25196 2784 -18888 -27012 -12943 -15117 -43241 -26026 8650 37404 24528 25812 19319
18068 19319 -4072 -14546 9957 17341 18716 20644 21711 48520 55652 72902 62262 -713 -42643
18055 -42643 -29872 -4992 -1767 -12350 -8250 -7498 -25327 -28104 -20204 -13738 12636 12327 10640 -12751
18041 -12751 -17828 8783 19449 4802 -307 -27042 -28535 12721 15452 7994 -21334 -35059 -26052
18028 -26052 -40472 -26244 -24691 -23273 8492 26974 -6702 -12331 -16598 -13716 -25669 -18640 16225
18015 16225 27139 20349 45188 58477 36638 3780 14473 -22348 -23614 -20865 -28530 -41666
18003 -41666 -43327 -22203 -28191 -9052 -10859 -28580 -43636 -57493 -32297 -40930 -9198 9271
17991 9271 7757 186 10300 30959 19600 -6139 -18937 -32255 -28395 -31597 -23957 -19359 2387
17978 2387 -9304 -39925 -46787 -51439 -37225 6088 29787 42296 41849 55104 50137 49170 64167
17965 64167 39645 6008 -10595 -44898 -53535 -51128 -38770 -18177 2137 5942 24150 10101
17953 10101 -18162 -27046 -43608 -52679 -59738 -48174 -28853 -8992 30741 33922 31295 20450 -23869
17940 -23869 -41342 -40676 -35239 -15460 -28611 -48802 -37696 -19167 -33535 -47810 -56007 -67181
17928 -67181 -26230 -9419 -25965 -21385 3985 3464 8100 10070 3221 -26906 -32969 -8320 -19643
17915 -19643 -28328 -10273 11600 4145 19246 22545 -4170 -48425 -26874 -23056 -30921 -34162 -23717
17902 -23717 -31149 -35003 -29149 -18455 -29986 -9723 15387 44233 48123 67719 88331 48777
17890 48777 -10651 -31643 -27761 -6815 -2179 -2175 -7241 -26493 -35135 -47486 -45952 -52976 -37221 -12614
17876 -12614 21359 26103 -13015 -30573 -23434 2717 12235 -5140 -25650 -5868 10343 11687
17864 11687 984 -17981 -30317 -44321 -16361 -22454 -11314 -13805 19403 13276 -9224 -3233
17852 -3233 9849 3391 -16313 -26800 -21643 -14921 2967 1632 4580 -3973 -6863 -4060 -14140
17839 -14140 -23591 -8370 1934 29580 32216 -1113 -29126 -34080 -35024 -13664 -17523 6453 7419
17826 7419 -27934 -33270 -33652 -46825 -49643 -49703 -54778 -29487 -8714 2057 26129 12219 -6410
17813 -6410 -17379 -21673 -30794 -18661 8516 11802 23432 22172 -11298 -11042 -24157 -42139 -47971
17800 -47971 -57290 -58507 -55436 -29279 -44077 -52200 -30767 -19109 -20393 -56446 -64368 -56834 -18047
17787 -18047 -10519 -11373 -32682 -58870 -48284 -41774 -17648 -5122 -8268 16641 34496 30428 6431
17774 6431 -23540 -7727 -26020 -33968 -40464 -46604 -56232 -57471 -42846 -32019 -13441 3323 13582
17761 13582 24091 10379 -12152 -4101 14959 10509 -16378 -41493 -55402 -21856 2673 31304
17749 31304 46177 24374 37701 24814 14750 8962 -6727 -8471 -9404 -2698 -6818 -3300 -3830
17736 -3830 -6137 -10322 -2598 21357 30154 38222 36724 44258 34426 3044 -13462 12514 36350
17723 36350 36728 7210 -8841 11614 7794 3948 10206 17420 15622 11597 -5916 -30022 -1040
17710 -1040 26464 11211 -9121 6463 -1109 -20800 -34601 -36335 -22187 -18142 -26854 -9053 -3989
17697 -3989 -619 -24565 -30679 -32537 -7530 -9295 -12252 -31299 -9168 22446 26185 46865 54176
17684 54176 41914 11029 13284 -6492 -38678 -32733 7893 16253 1294 -2494 -31185 -33495 5130
17671 5130 8299 -4403 25092 17100 13414 7258 -29082 -33602 -37693 -13577 -1690 -3098 -14891
17658 -14891 -36522 -51947 -74004 -68094 -64662 -27443 -11304 19290 21678 8148 -15604 -14028
17646 -14028 7354 4525 11135 3429 18026 11362 14527 7655 2996 9943 11264 32728 27238 30437
17632 30437 34997 15879 5484 1460 -3189 -15026 -8633 16239 24407 21331 -7411 -9908 18541
17619 18541 17861 25961 -466 -12430 -37982 -46410 -46437 -30818 -35220 -15124 -4941 -2436 -514 5616
17605 5616 8995 11887 9588 -19534 -14322 -14077 -13662 -4130 -3391 6343 16453 20270 -5007 -18030
17591 -18030 -40008 -33798 -37787 -7683 35821 40169 21728 165 -6765 12373 22036 32759 19375
17578 19375 24902 18132 -15721 -32284 -41362 -27348 -8536 -15835 -5496 14559 -10256 -27593
17566 -27593 1446 11682 9846 32845 46721 25472 -18140 -17151 -3691 4797 -7099 -761 -20756
17553 -20756 -19948 -18811 -31046 -38718 -31507 -33484 -28786 -13939 -37316 -52583 -57577 -23295 -49296
17540 -49296 -68871 -56806 -74901 -91025 -78298 -56712 -32526 -27739 -16034 6640 23633 -8342
17528 -8342 9957 18233 -2645 -29462 -44355 -32178 -8319 -10712 -33487 -37777 -12304 4802
17516 4802 8443 768 3372 8560 25237 20424 -2501 -5816 -9120 -37951 -62314 -54457 -26914
17503 -26914 -28797 -37963 -22763 -13603 -4708 26757 45560 56433 61314 36391 7927 -41081 -49397
17490 -49397 -39234 -38296 -60736 -40839 -7592 -14842 -8494 -32110 -55784 -26661 5799 -4123 -14791
17477 -14791 -20912 -8879 -3551 10252 25410 28323 9326 -9488 -11772 10012 10185 30237 53614
17464 53614 7138 -55995 -37377 -20452 16097 13149 5620 16923 -6074 -50538 -77703 -75419
17452 -75419 -55309 -57710 -39908 -28987 -24667 -10557 -11934 -54007 -50033 -49300 -17815 10796 6345
17439 6345 -15354 -47233 -29929 -12804 -38094 -74531 -49365 -34276 -19714 -19255 -34964 -35994
17427 -35994 -24755 -3484 -8343 -26729 -20118 -3049 28904 19742 -1814 -1770 19955 -7064 -18720
17414 -18720 -32269 -16128 8043 4558 11271 17118 15963 -2364 -19070 -33512 415 -8195 -33510
17401 -33510 -17810 -24303 -41170 -37436 -31964 -7865 -4305 -42083 -36782 -31717 -35599 -18591 -24835
17388 -24835 -10118 -2349 6069 -1658 -4466 -7898 -19073 2403 13129 -2556 -10311 8834 7935
17375 7935 5049 2221 3526 24498 50075 31845 39191 30800 27258 -1014 -3735 14258 11060
17362 11060 -4776 -4862 -25781 -56553 -60565 -72394 -43509 -5422 -9228 6460 32167 59740 36620
17349 36620 11593 17395 23360 3550 -3017 -3256 -7018 17715 43242 55138 29357 4425 11873
17336 11873 -11369 -23653 -40293 -52988 -57719 -20108 -4987 31836 66693 53196 27501 14131
17324 14131 18432 13401 16487 22317 -8777 -42518 -36861 -28748 -38549 -36409 -24192 -37747 -54419
17311 -54419 -39536 -9703 6752 -6248 -4814 1792 -3016 -2666 6173 9011 2810 10802 -9371
17298 -9371 -48405 -72335 -49035 -24724 -18634 -36208 -36494 -14869 -28802 -39195 -24655 4737
17286 4737 15673 -15016 -9587 10491 -21209 -27201 -31951 -20692 6483 18133 21991 28703 21856
17273 21856 -1549 -37790 -47726 -265 -9679 -27038 -19577 -3924 -22192 -36310 -12641 -3678
17261 -3678 12595 35576 16370 816 4208 12441 21215 29161 16949 37814 47245 32560 12779
17248 12779 -15842 -33676 -34486 -49968 -54588 -51081 -54410 -41425 -4940 16211 17439 9982 -454
17235 -454 -7953 -14178 -28765 -4748 20735 7542 -12048 3787 19197 27802 42708 26960 21462
17222 21462 35811 6137 -37914 -53784 -29894 -58118 -61416 -41619 -13063 -11917 -5189 -23898
17210 -23898 9374 57251 62357 18618 13136 17501 1272 14652 22681 9854 -4468 12486
17198 12486 9556 -10081 -14396 5208 -3612 -29803 -57386 -53953 -43581 -50855 -49417 -68058 -87019
17185 -87019 -90423 -31347 9782 377 -1013 24427 23953 17278 -5630 -18421 5058 6342 -9547
17172 -9547 -13212 -21508 -3234 -6620 1629 1495 -17353 -16769 -3797 5118 -15304 -22062 7174 33686
17158 33686 20442 1704 -9645 -11407 -29866 -19289 -18836 -19324 -19870 -17267 -33079 -43917 -28686
17145 -28686 -41995 -29875 -7388 6115 30490 21636 -1801 -9662 2913 -594 25762 26735 15984
17132 15984 10932 -10149 -35092 -52432 -53061 -35350 -8923 -13099 -43257 -65498 -55138 -62933 -76272
17119 -76272 -61307 -56626 -72583 -24317 19084 42239 27882 611 -5786 -8787 -23454 -12193
17107 -12193 24776 34719 2402 -7856 -13216 -9690 -16069 -21371 -32517 -55929 -41512 -42489 -39830
17094 -39830 -23102 -7517 -1311 -7583 -10098 -35271 -37507 -22936 -29101 -25905 2046 -14441 -4849
17081 -4849 5438 644 -10240 867 -1663 -7289 5407 14031 -2563 -11040 -9637 -18669 -15849
17068 -15849 2228 5825 11528 17201 31021 30079 -5431 9269 18377 -6711 -27140 -55224 -52223
17055 -52223 -27139 9706 5655 -25374 -20961 -11953 -28931 -14871 9494 2470 -13499 -11806 -13945
17042 -13945 -7430 -24780 -40934 -60198 -73421 -70814 -74613 -58060 -23165 -6753 -5988 14253 19056
17029 19056 10709 32357 16246 -5932 -28900 -39180 -53954 -50184 -35606 -22972 -25378 -8359
17017 -8359 20738 5550 -6134 6443 21729 5043 24 6015 -3028 -13444 -20463 -4941 -13508
17004 -13508 -26700 -51507 -19628 5091 -11162 -29578 -24756 -16654 7880 -11725 -13921 -210
16992 -210 8666 23202 2316 -9142 12862 8077 -33013 -20342 2623 37530 36001 17752 8904
16979 8904 17872 -14615 -27439 -14402 -8296 -20417 -12231 -4696 3760 -10960 -21698 -26690 -33260
16966 -33260 -8254 19249 38892 12250 -23438 -12594 -6556 -5687 -629 3511 -1128 -15600 -17578
16953 -17578 -41093 -66959 -72325 -28410 11394 8127 12866 4230 -2659 1768 -10198 -11340 1335
16940 1335 -2278 -23624 -32654 -48275 -27006 -1737 -7667 13782 13685 13389 -5345 -1138 1069 -10232
16926 -10232 -20063 -39554 -48936 -38129 -1734 -11561 -32665 -50529 -32034 -10484 15430 38650
16914 38650 26666 8761 -2625 -7985 -5825 1281 -9990 -33695 -22172 -3178 15251 53277
16902 53277 38248 -24668 -32448 -25704 15333 25020 17697 10831 -16224 -38686 -9671 22216 11699
16889 11699 -1537 720 -36236 -27793 -21632 -492 40104 38061 8656 -15469 -16772 4544 -7243
16876 -7243 -11953 -5978 2651 -13574 -43796 -51811 -28058 -2720 24 115 -13633 -10398 5944 -9602
16862 -9602 -37930 -30214 2316 11145 12781 22690 29206 27420 28714 26964 28085 11556 6705 -3291
16848 -3291 -39307 -65467 -55038 -50834 -49872 -22474 10830 16668 26429 -9674 -5374 -6658 -13378
16835 -13378 -17765 17351 -8699 -21345 -22756 -6558 -8586 -8670 -11975 9362 -115 -2352 -4156 -32081
16821 -32081 -52760 -27105 295 12294 35986 33906 23701 13896 6081 7104 3854 -3429 2921
16808 2921 32485 47147 21856 1253 -18739 -16148 4832 4953 -4318 -10775 -16882 -2043 -34922
16795 -34922 -60867 -69740 -58674 -61046 -23844 -8769 -10353 -26858 -13491 15162 15600 31039 30493
16782 30493 -4128 -13768 1328 7239 3508 -6465 -8823 -2281 -36136 -43651 -24967 2415 21899
16769 21899 23072 3702 29848 54547 15724 -31483 -20496 -24311 -39849 -16078 13781 -18697
16757 -18697 -41102 -55985 -35188 -16344 -23359 -16380 -14182 -8532 14242 -926 -16929 -9643 -3339
16744 -3339 -13895 -27302 -14986 8433 -13035 -16608 -11316 -31062 -34814 -4581 32303 56545
16732 56545 47023 3614 417 -19329 -22151 -10196 -9044 -21464 -13567 -22240 -28425 -1716 1207
16719 1207 -6084 -9833 -15525 -9932 -6093 -47161 -42366 12037 27967 65111 78989 46161 29293
16706 29293 17157 -8778 -48919 -74683 -70990 -66006 -55516 -30565 -22397 -26417 -54413 -51993 -36254
16693 -36254 -13679 764 14049 3771 -7938 -12414 -32232 -43820 -21181 -12396 -27830 -24018
16681 -24018 -20179 -10085 -12358 -33282 -45534 -35812 -28729 -49119 -58079 -65567 -68271 -56317 -46758
16668 -46758 -37359 -31955 -23006 -13734 -26330 -5086 10403 7571 -2523 -7466 181 -8438 -38451
16655 -38451 -49714 -49779 -76173 -57207 -31839 -35013 -51226 -15242 18073 15423 9949 8623 14036
16642 14036 7012 -2565 8934 24462 27083 30763 27738 1455 -7875 -13141 16411 4667 -7472
16629 -7472 -5197 -2545 -27516 -46990 -32893 -34020 -10594 -10265 -50296 -64109 -42651 -14632 -3447
16616 -3447 -17897 -24719 -41219 -24806 -15391 -16887 11301 19487 5077 -12970 -32703 -23389 -10010
16603 -10010 9031 -9571 -20148 -11612 1091 -15937 -28487 -61151 -47754 -58645 -71932 -54649
16591 -54649 -33488 -14797 5262 1008 10767 25044 -4536 -29693 -13315 -20094 12074 33872
16579 33872 41787 49398 39354 32795 13113 7811 -4358 -29563 -43813 -50896 -3406 2744 -25705
16566 -25705 -45897 -30044 -11438 1350 -11898 -20832 -11587 -23218 -32391 -34767 -58178 -80727
16554 -80727 -69993 -74912 -82097 -71030 -42052 -18513 18083 18415 12478 1894 10776 8462 -9493
16541 -9493 -43939 -65954 -61967 -31646 -4390 1317 -11054 -3847 -31441 -44658 -30548 -35092 -28061
16528 -28061 -26126 -14144 18981 58231 47658 10482 12665 -6115 -7048 6923 7812 -18006 -24035
16515 -24035 1611 9536 17472 -5948 7028 18589 -7051 -33803 -25778 -15544 195 896 -9310
16502 -9310 -32743 -44142 -33514 386 -1792 -28172 -26124 -30724 -9987 6 -10802 -18037 -7555
16489 -7555 -16039 -5654 -9323 -3667 -31527 -35557 -36685 -25274 -10918 23788 21616 7960 -11633
16476 -11633 9061 -3915 -4772 7348 -1549 -14133 9054 41939 61151 48802 26079 -15443
16464 -15443 7879 44592 56367 65742 42750 35994 40479 35360 16343 -871 -12607 -48183
16452 -48183 -72879 -73839 -58751 -62166 -46344 -33992 -46739 -20026 3251 15655 11550 -6331
16440 -6331 -2480 1053 14203 -16319 -28074 -1592 32973 18993 -1572 12929 35223 23437
16428 23437 9793 -1606 -5976 -5730 7762 -803 -25863 -16677 13141 15037 -11284 -37308 -54919
16415 -54919 -46845 -4631 -4776 2678 15383 23360 20184 7927 2732 73 -14416 -18747 2829
16402 2829 -3331 14189 12405 6805 5116 28653 12101 -24023 -29942 -21933 -15600 -10741 5449
16389 5449 28365 12911 -20626 -28446 -24709 -12149 -5016 -22046 -43656 -13539 1054 -1231 8667
16376 8667 -2391 23018 28006 25085 20379 27858 32220 31944 18185 19634 23737 23390 27794 6832
16362 6832 20409 8763 -5155 783 -2386 11556 -3805 -31443 -42527 -43893 -24189 -2470
16350 -2470 8985 12465 24215 9159 -7578 3660 13041 1403 -16463 -9604 -35007 -54654
16338 -54654 -40189 -36495 -61302 -58969 -35645 -17461 5817 51259 65482 54749 37600 16440
16326 16440 10592 -9094 -20236 -17565 -33450 -43619 -6542 -5731 -3870 25939 35849 18424 -2557
16313 -2557 -21647 -19431 -21472 8958 18714 -4724 -16847 -8900 5058 28079 49906 31359 14113
16300 14113 -8702 -10052 -206 -14617 -35776 -25172 -5631 12050 16432 -32096 -82754 -37530
16288 -37530 -1756 -12963 -4268 2617 -20079 -25737 -8656 -14290 -13818 -19830 -25911 -47311 -35939
16275 -35939 -16084 7861 -14939 -34760 -10068 -21450 -42372 -11640 -1877 -4218 -23171 -26296
16263 -26296 -6112 -3700 -113 18508 8925 -117 27697 8653 13136 21022 21743 15381 12175 2220
16249 2220 21689 6380 18529 300 -25617 -21121 -598 -9905 -5687 -22541 -49759 -48321 -43916
16236 -43916 -54404 -42007 -42438 -33105 16647 37835 50730 47102 37061 -2469 -28228 -17155
16224 -17155 -15997 -48253 -36144 -469 982 -1075 3229 12220 -9188 11804 15357 32665 34270
16211 34270 19177 29998 16531 3993 -5344 -2990 8756 3109 -12366 -26444 -32413 -55986
16199 -55986 -34087 -741 -6621 -18568 4274 28780 18233 -8788 -39182 -16142 -2166 16624
16187 16624 8910 37455 56833 43135 39942 43764 50655 11895 -25909 -41551 -66450 -57587 -40434
16174 -40434 -13267 17334 19547 5454 -10923 585 40738 64777 73983 26828 -699 6465
16162 6465 23566 20171 -1651 11481 11825 -10050 -22771 -37914 -37258 -40044 -30032 4906 25247
16149 25247 6627 -26608 -13595 -12480 -31575 -17494 -1527 -12668 -11178 13247 186 -4697
16137 -4697 -25446 -56100 -42791 -17133 1851 -2160 -2340 11790 -9285 1388 3644 923 -5057
16124 -5057 -31157 -40153 -63724 -62939 -73138 -75089 -42935 -32579 -27137 -24237 -41429 -51317 -21527
16111 -21527 -4412 -14008 -27092 -15495 -26019 -40125 -14564 2348 4835 -7551 -31405 -38631
16099 -38631 -42323 -34209 -26367 5673 7597 -7729 -32748 -43891 -26974 -19928 -23650 -19352 -12611
16086 -12611 -25426 -44923 -56492 -42892 -12670 -7081 -14193 -8082 22413 15574 17065 16336 16543
16073 16543 8434 -9589 -779 -8922 44 9295 9503 -5924 -21610 -20320 6735 -486 -12833
16060 -12833 -31227 -30106 -23939 -49530 -49061 -33672 -27851 -8100 -24274 -19922 465 -27964 -53832
16047 -53832 -44179 -26973 -44044 -56971 -25675 -14896 -7711 6316 20983 18368 -939 -10906
16035 -10906 7022 4130 32701 30130 26580 3983 -18130 -17141 -13242 -18997 -27375 -31496 -18493
16022 -18493 -34808 -12022 24222 28882 49771 45860 23641 41678 56235 47702 24069 -1178
16010 -1178 7388 4349 -12329 -19613 -8008 -20070 -20163 -10508 3473 14451 27325 11633 -11652
15997 -11652 -40692 -30264 -17383 1896 33692 35120 22355 20445 -10274 -29318 -41623 -51344
15985 -51344 -46065 -26681 -23817 -29215 -28934 -4737 1908 21579 14222 -4987 -6518 1118 12311
15972 12311 14378 9405 13562 -6364 -62104 -64701 -43674 -52276 -24931 -12295 -4840 -1757 -10374
15959 -10374 2945 14767 9132 -4502 -13869 -1972 12423 20779 5459 19216 7231 398
15947 398 5379 42660 48307 2907 -32860 -24584 -32208 -31312 -61273 -42932 -12435 3880 -13926
15934 -13926 -109 12180 1859 -21116 -23069 -23303 -32024 -33600 -22244 759 -1141 -15678 -11380
15921 -11380 -23432 -40026 -14072 -8605 2880 -10357 -16812 -34269 -56783 -53890 -56920 -34740
15909 -34740 4931 9639 2205 -2167 -16031 -23961 -13001 5467 16929 15285 22498 17795 9207
15896 9207 23655 23468 38857 36046 -10883 -20924 20984 33943 7977 -4647 -28185 -29287 -20475
15883 -20475 -6902 -18961 -36919 -69790 -53667 -74104 -72791 -40312 -36493 -33767 -26392 -16835 -12544
15870 -12544 -26036 1790 -4615 -14651 -11529 -14637 18667 24716 46998 69570 41601 41324 17144
15857 17144 -13976 -4755 589 -18973 -18493 -9987 -6504 1981 7448 3862 -6247 32247 44699
15844 44699 30669 10653 21510 28199 20218 10796 -5226 -17588 -30211 -37951 -13451 5109
15832 5109 -19734 -56333 -47549 -41225 2137 17509 9914 10900 5023 27455 18523 -1614 20814
15819 20814 33703 25486 33805 23412 25484 12075 9054 -25081 -29488 -48747 -70818 -40080 -8391
15806 -8391 17208 20094 2132 -9797 -6292 11739 15938 4347 -8538 -9385 5408 15675 4962
15793 4962 3015 -10824 -21822 -23755 -21677 -6481 -37446 -48257 -37578 -30810 -14507 2835 7129
15780 7129 15890 14193 -18787 -18373 -15457 -19357 4761 12344 -86 1698 -8024 -19567 -39715 -5245
15766 -5245 3699 25404 13449 -20972 -34942 -19235 15509 23849 15786 19383 11405 29340 20245
15753 20245 9466 22394 36919 30048 -2254 -45328 -26784 -30954 -26567 7722 36712 12102
15741 12102 -1090 -14248 -3773 8339 13237 -21611 -17658 19171 20281 23 -7041 11973
15729 11973 30936 4869 -17695 -4184 -7625 -33465 -6840 6859 -5139 -642 -1912 -1518 -3755
15716 -3755 23964 14995 -8080 -18084 -10472 1181 1314 11312 32049 15786 -1291 -3575 4684
15703 4684 -20581 -48648 -40375 -8922 -23408 -8238 747 -12816 -17830 -17110 -17707 -7554 -12738
15690 -12738 27008 41005 44293 20484 -1337 -15956 -30725 -20275 -5504 2547 18667 18871
15678 18871 34352 20303 -1835 -15028 -7697 19884 4729 -34317 -17295 583 -1350 -4313
15666 -4313 299 -9697 -20110 -16317 -33654 -32898 -20220 4528 16411 8515 -11186 28206 51700
15653 51700 13653 10473 -26928 -39622 -17605 5416 -4560 -21061 -47461 -35905 -42180 -35823
15641 -35823 -37173 -52560 -44263 -34027 -49582 -29022 -34845 -36434 -16140 1512 -9269 -16785 -16789
15628 -16789 -54258 -54941 -36947 -16285 8340 -816 9864 26776 26724 48838 47189 31844 53830
15615 53830 13113 -10340 -9529 6452 28692 27486 -7157 -32106 -36899 -25837 -32459 -31848 -49416
15602 -49416 -62198 -56233 -37043 -41272 -55557 -18079 11093 12241 8366 22964 31607 2056 -4200
15589 -4200 -7344 -6638 -16520 -28844 -24994 -40248 -2893 35402 17135 -24242 -31775 -16864 -28017
15576 -28017 -32328 -26072 -15203 426 18639 3733 9455 -4115 -2585 26179 48647 1259
15564 1259 -179 18628 27067 24175 48184 55141 21262 17 13236 -225 2509 27175 -9526
15551 -9526 -39033 -38308 -38981 -3214 41524 28345 16960 22848 33386 33747 23937 24131 15515 27848
15537 27848 25063 22572 2339 -17755 -35097 -45246 -38466 -18018 5807 9753 -708 -6587 11119
15524 11119 28446 24352 2680 -35085 -23677 -9858 -766 8438 19859 24677 4304 8347 -8670
15511 -8670 8027 24933 4190 -19326 3251 -5886 -32331 -42397 -40811 -22868 -31600 -13596
15499 -13596 -13740 -16595 -1569 12546 32412 2937 -4098 -9806 -12417 -2551 459 -17724 -7827
15486 -7827 -667 20792 -4435 -5507 4055 12114 33583 32420 2198 -39491 -27070 -14031 -294
15473 -294 16251 31308 50692 54561 44028 38537 17518 7713 2206 151 -15990 6585 29931
15460 29931 29958 -25194 -35261 -35494 -22308 -4184 13246 6162 -6163 -15690 -28583 -16546 -1414
15447 -1414 15688 9716 8157 -6248 -23158 -2665 23266 9554 -14162 -4081 1544 -11046
15435 -11046 -12429 -4354 -12989 24015 33449 12650 -4963 13217 27873 11487 1456 6437 -4292
15422 -4292 35788 21471 -4745 8146 -6949 2 -15524 -13854 -641 9181 9483 26049 42131
15409 42131 12714 -25450 -45234 -33826 -26726 -46980 -57922 -48535 -11812 17534 9356 -1458
15397 -1458 2680 10970 13804 29419 42879 23803 -5569 -38508 -37435 -6456 9760 18537 14238
15384 14238 -10272 162 -1998 3297 19168 16934 -17298 -34857 -33541 -37973 -28768 -9826 12944
15371 12944 21512 48750 50421 25706 7577 29256 48519 19035 -3552 13179 -3993 -14711
15359 -14711 3950 -5928 -22073 -40860 -23088 -13842 -11607 -7598 12385 11747 17119 30018 9919
15346 9919 -11973 -16915 -13868 26803 22966 1849 14863 25031 -2000 -2290 7944 5642 20790
15333 20790 25286 7904 15048 10630 -38628 -39160 -22264 -1490 -13469 -9981 -20740 -11536 16333
15320 16333 31563 45793 50374 41932 37709 35033 3014 15776 21587 27615 -1183 -3029 17121
15307 17121 41051 45885 49979 34948 9054 13395 14156 12854 11293 11575 44463 56831 49084 46991
15293 46991 37086 -6396 -5166 -5757 4784 -10469 -36484 -8785 13446 -13688 -26390 -21726 -26344
15280 -26344 -26027 -7639 -15101 -4881 -9457 -12258 -4122 -3871 -6745 3620 -343 -1097 -18446 2932
15266 2932 31210 17130 3541 -2889 -17625 -16844 -21725 -12154 -18338 -11875 2007 19182 519
15253 519 -1414 5865 -22323 -39868 -10869 18300 23741 -5288 -42583 -26369 -14850 -31863 -27734
15240 -27734 -35625 -27332 -32219 -38207 -51989 -68156 -35145 -9367 -6093 -3079 30022 46717 57524
15227 57524 38981 9954 9238 -5958 -18727 6341 1286 -22107 -10482 9506 734 -7990 -22741
15214 -22741 -11076 -6800 3615 12066 7345 10934 -1370 -2127 -3601 -18486 11353 26534 329
15201 329 -11408 -17522 -34464 -19429 -22009 -13504 7800 26010 35603 20463 7091 20337 26508
15188 26508 -5837 -587 -16227 330 16550 -1018 -20893 -15533 18326 31464 11430 23939
15176 23939 36290 20667 52173 32970 6896 34095 68125 47212 21501 22323 5771 -19678
15164 -19678 -29234 -12249 4502 27517 8871 12661 -7257 9675 35866 41274 32395 22927 -14358
15151 -14358 -18153 12863 19951 13799 37787 21362 4239 3555 24114 3261 -1114 17260 32655
15138 32655 9613 -11694 4167 10951 6640 12493 25780 13568 -38404 -13729 13138 12678 24268
15125 24268 29056 15050 11922 873 15741 25991 6333 9072 -20933 -17407 13580 8657 3010
15112 3010 -300 3602 9250 31596 16506 -12234 2135 -2403 -21669 -4088 1497 12653 38671
15099 38671 34138 19598 -156 -6700 -12013 -35354 -65469 -50475 -12858 -6165 -36561 -28880 -23034
15086 -23034 -32678 -32750 -10522 -5443 8828 16569 11243 10736 -3307 -584 -6566 11001 32530 36495
15072 36495 11340 -12525 -25135 -26527 -37516 -44086 -25305 -16492 -20487 -36240 -16908 -5876
15060 -5876 3608 6827 4604 -5899 -15780 -18163 -6550 4088 -14391 -31457 -17726 -5279 -6503
15047 -6503 -30497 -35401 -15761 25776 16112 7511 -3473 -27246 -38956 2487 8339 9569 -5369
15034 -5369 -15170 -2241 10047 30126 19882 1507 13500 17223 41520 27997 -47280 -106020
15022 -106020 -66433 -12626 29722 31132 15043 -16884 -24934 -46746 -44516 -38058 -43955 -21321
15010 -21321 -9795 -28818 -24832 8787 19529 13004 -9749 -34858 -17606 -31718 -39399 -3408
14998 -3408 41 9692 -49813 -95014 -72367 -54469 -42679 -51516 -32874 -2918 11407 -2145
14986 -2145 11416 -14777 -25021 -16558 4214 9312 25185 23353 8114 2047 -16360 -16659 -8563
14973 -8563 9018 12540 9391 -13971 -4083 7203 2767 -22608 -7557 23090 31147 31630 29744
14960 29744 11682 -23943 -38222 -31132 -31286 -48433 -53877 -56555 -31451 -22125 -28271 -24047 24322
14947 24322 50336 47954 22577 8613 -12056 -22227 -22916 -11204 -32259 -41024 -20829 4648
14935 4648 18842 30087 44985 57829 28752 22449 19529 15033 -21698 -15780 20844 7421 -5533
14922 -5533 -10071 -17439 -16902 -38277 -43186 -40484 -19784 9939 10365 25611 11569 -21361 -7146
14909 -7146 -4706 -9991 -15254 -20157 -5487 -5173 -16994 -11880 1719 14114 27617 34447 13036
14896 13036 -17419 -40237 -51623 -23002 21785 67531 55878 -6829 -23669 -15373 -7959 22227
14884 22227 18727 18955 15501 10249 18207 33470 14930 -14902 -5506 22107 18900 27835 61010
14871 61010 72558 58142 15478 10409 8123 11545 20215 3157 13307 51007 35189 36254 17616
14858 17616 17556 31539 59243 35178 20702 -3439 -26398 -15453 -6271 3213 12770 12894 21137
14845 21137 27019 25023 37972 40832 32354 32916 43867 27515 7164 24950 34476 37036 23370
14832 23370 -17990 -30703 -17703 -14174 -28216 -33494 -6959 16281 1686 -8185 -40977 -40868 -56291
14819 -56291 -40786 -40881 -23416 9778 4720 32058 25911 -10782 -45935 -41292 -19253 11241 30358
14806 30358 28197 -1662 -26687 -28403 -643 19258 17752 5935 17116 -10729 -40564 -41859
14794 -41859 -38999 -28552 -4608 4033 -396 1622 27223 22822 -4355 11374 44795 34351 42467
14781 42467 45456 56493 47627 31279 33144 33893 33301 16135 3852 39449 44357 58579 60282
14768 60282 54635 32066 38790 52604 47233 25255 17176 14009 4644 -24516 -8224 18393 40598
14755 40598 40935 30252 12903 6146 -13464 -10220 -6218 -13143 -22270 -10133 -32639 -43514 -37517
14742 -37517 -8576 25175 30425 22592 17529 22380 2360 -4268 2656 730 19399 20649 6020
14729 6020 7013 3318 -18498 -26079 -26487 -54120 -43529 -16223 -27965 -25669 -22233 -6022 -16579
14716 -16579 -17990 -19926 -16245 7619 28288 37958 13451 -14767 -7606 24667 12151 -7482 -22737
14703 -22737 -5223 8948 25124 11879 -11907 -3095 19774 1149 10333 23313 39727 24967
14691 24967 19798 10580 18266 11420 -15531 -50521 -45191 -11195 18766 30822 922 5622 11014
14678 11014 -8632 26236 39011 34936 37244 40555 44238 28179 31510 68403 65147 33610 3212
14665 3212 -12132 -2256 -12697 -20473 -28678 -10585 -6752 -17870 -28268 -5227 15728 17423 20995
14652 20995 -3735 1708 11893 16704 10923 34580 30566 10951 47500 32896 -2437 -8968 -17679
14639 -17679 -12045 -9089 -20228 4310 35190 47695 41234 18651 -3458 28133 32054 29764 33417
14626 33417 58654 45902 816 -9995 -29908 -990 696 5102 6820 11044 14957 25354 13747
14613 13747 -17309 7553 21934 26564 8853 9796 16835 1355 9439 39587 66707 72049 54580
14600 54580 58710 34410 2565 -14743 -2645 -20017 -37090 -32536 -23372 -31274 -35288 -8580 28188
14587 28188 43188 29960 -6855 -18575 5392 41075 44208 25893 26494 23148 29546 8850 -9539
14574 -9539 -9324 10834 26097 16593 -6811 -32276 -7106 30847 51699 27050 27851 33867 18145
14561 18145 7699 -11358 5101 24894 10947 -18356 -20381 30206 50068 16497 -28082 -48799
14549 -48799 -33760 -24099 -25173 -12640 -7385 -10424 -11142 -17001 -26578 -40327 -51909 -55888 -48345 -23582
14535 -23582 -18251 -39729 -36727 -27938 -14958 24761 15657 7919 22956 6267 2538 -10802 8110
14522 8110 10614 -11914 -13615 -32742 -37920 -36358 -11787 19728 27878 11258 18759 13283 33341
14509 33341 50631 53170 -1542 -18553 -7674 -9734 27067 35639 19921 -8700 -5487 -13979 -45911
14496 -45911 -48873 -40793 -1552 27204 43867 21173 -10870 -57344 -81072 -37828 -2100 -4764
14484 -4764 16680 50337 17950 -20233 -24015 11562 18947 25414 9297 -9014 2703 -13697
14472 -13697 -38494 -21797 -6613 11571 20450 27556 13432 -63 -6877 12494 17690 22213 7434
14459 7434 -27452 -24683 -11521 2228 -3191 4641 4804 -3606 21288 8760 3153 25881 23074
14446 23074 10145 10932 4603 6071 28823 25293 7901 10428 14355 38736 28940 5012 16337
14433 16337 24470 40699 34393 -1847 -17624 -5343 12154 -2987 39796 53636 37245 19717
14421 19717 46069 48788 32128 12179 18947 30882 46558 53943 35015 33820 24207 21207 36508
14408 36508 45628 35038 9438 26347 5388 -4078 27758 33046 19561 -1005 5253 30015
14396 30015 20259 11594 13450 27298 38796 51960 58098 28266 19170 15743 12299 17344 -3496
14383 -3496 -21199 -36577 -49051 -36297 -6239 14416 12786 8117 -13982 -24669 -21413 4330
14371 4330 33969 35519 15157 19718 9065 6426 13834 26582 16998 38229 53839 40325 15909
14358 15909 14375 19647 19485 6280 804 12434 5046 16590 15502 14282 27520 646 -11046
14345 -11046 22391 -216 -29090 -21217 -7224 -33020 -42055 -41616 -27423 -28001 -45426 -63530 -58171
14332 -58171 -34262 -39500 -17013 -1307 -3017 -10983 -11911 -19148 -4476 -1870 2786 -17636 3366
14319 3366 17592 16429 23640 17272 1226 10861 11520 -20855 -32630 -10084 18772 6838 431
14306 431 5972 25645 4939 -4080 -2109 -8950 17094 40526 43414 8780 11423 43238 47142
14293 47142 44705 38571 63388 57236 24213 47959 61156 70872 52581 58465 17799 -7043 15541
14280 15541 40655 19282 -8866 -8018 8067 -5326 -4950 301 1904 35133 26858 9608 -749
14267 -749 -130 31511 14953 19620 7480 -1435 4060 41736 62825 55420 48111 31326 3848
14254 3848 -8025 -16486 -1306 -35665 -55023 -56766 -28218 -23902 -23749 -21561 -22197 -53545 -60206 -38289
14240 -38289 -12742 5668 -18939 4899 43188 46790 29038 -11876 -21372 2580 25557 38636
14228 38636 41007 15884 24681 27411 13914 -3451 -10057 16160 44670 25770 36939 23380
14216 23380 -17997 -18456 -6496 8124 35057 41427 31887 3080 -916 2405 -6463 -13280 -2734
14203 -2734 -13514 -4586 -12440 -12531 -25916 -20649 12819 9400 11470 40865 40450 19134 43511 48002
14189 48002 54301 62507 38858 -17689 -24173 11569 13259 7237 -1258 -15394 484 21454 20291
14176 20291 4360 -9152 251 533 -28200 6801 39603 16646 -35114 -37971 -50426 -30527
14164 -30527 13595 41349 34680 17722 14724 13662 5111 -13546 -13471 -12306 -4726 15666 19170 12292
14150 12292 13904 30506 29947 -11399 -38162 -30811 -21599 -22113 -36497 -55301 -75673 -59109 -45108
14137 -45108 -12399 29990 16506 -18506 -8418 -5515 -277 -18188 -21248 -22088 -5544 8012 -4193
14124 -4193 -9465 -2102 8717 -12858 -29615 -19019 -1209 1635 -26868 1437 7383 26946 48131
14111 48131 51584 42554 10225 10372 42658 42738 28230 8691 -25964 -32526 -13507 8656 25823
14098 25823 66982 69623 25127 -21101 -27670 -21349 -14488 -3983 24144 40362 36237 25747 15258
14085 15258 18772 1344 623 4651 -10848 -15547 8163 6968 -8266 -6339 -10560 -17484 -34224
14072 -34224 -19601 -7163 -9683 -9006 -11983 -3739 15387 -3986 12856 21502 15201 -6207 -19260
14059 -19260 -28421 -25738 -8108 30914 56599 56340 53096 29511 28038 18962 -2516 39980 56575
14046 56575 34960 41236 38134 25847 1707 19391 34272 48261 46009 47822 49327 37072 17762
14033 17762 25238 59697 60757 22987 -1772 -9066 2920 10442 4721 30823 62610 42061 28693
14020 28693 13889 4892 19014 34197 39941 29268 28136 40322 52159 44912 12784 -18304
14008 -18304 -4893 -9010 -10985 1149 22359 30768 40535 54327 50535 31098 22985 48724 51915
13995 51915 21977 -9300 -16710 -19923 -29728 -26984 -2187 17974 22031 3797 -19170 -8769 -7056
13982 -7056 -3326 -1926 -19673 -24301 -35684 -24929 -23997 -28172 -17329 -7707 10597 8590 24292
13969 24292 22119 -5109 7453 5702 391 -4068 -22622 -27669 -39139 -39511 -13839 -3079 -21315
13956 -21315 -36189 -47120 -48240 -41434 -26287 -10624 -12865 -17062 -4169 13459 29587 21230 10082
13943 10082 -3461 -19862 -14964 387 2550 37860 36617 23239 12347 -5769 -6179 -16180 7878
13930 7878 -14026 -22611 -4088 -5810 -32493 -21043 4394 -10732 7027 19382 7204 9883
13918 9883 15543 -13293 -11400 -25485 -38794 -40338 -1843 44313 26232 14906 4294 -12254
13906 -12254 -18084 168 17757 4516 5887 157 -31790 -46438 -14219 -4993 -20511 -38379
13894 -38379 -27618 -12538 9401 1235 -5984 7711 30500 56859 41705 33293 30254 61533
13882 61533 39041 9170 1902 2709 -37065 -56190 -35677 -31694 -16820 -12249 -21297 -4108 -11908
13869 -11908 2564 -10134 -25974 -27461 -28912 -22043 -2727 15655 21918 9868 -16096 -27530
13857 -27530 -19292 -4306 44265 52825 24803 9625 30858 25644 -2660 -26527 9247 51717
13845 51717 48494 41426 44718 35781 20683 20305 45345 26717 5360 -21974 -30417 -36425 -21854
13832 -21854 1094 -1566 11996 12048 9223 -19166 -6101 4456 7667 15896 28776 22222 24587
13819 24587 30932 61590 85230 66882 29044 10482 26659 38805 64725 40178 16345 12329
13807 12329 11676 -2902 -30228 -45166 -8750 7375 -5911 -6648 2175 -6891 -27652 -26349 -11495
13794 -11495 -19238 -7744 3119 10410 1315 24958 37389 35819 31460 31288 39641 49353 31787
13781 31787 2958 1847 3048 2512 3721 -3576 -9508 -12608 -1425 14628 30776 45477 43405
13768 43405 45632 40402 17210 1239 -13360 -20217 -28168 -41088 -46570 -28457 -9000 -31087 -26471
13755 -26471 -30017 -27448 -42493 -35014 -20966 -30304 -38181 -37680 -15759 -14564 4480 13073 8445 16487
13741 16487 10264 57101 57650 39562 29004 21007 9913 -1588 -75 15725 18690 5987 -27142
13728 -27142 -35391 3650 32376 36593 25775 32621 29855 31194 23596 -5665 -2751 22260 42233
13715 42233 56928 25991 24939 30427 11714 -11935 -3088 -20742 -23387 4272 -2620 -10545 -9294
13702 -9294 7378 7709 18329 22546 8424 -8947 -16909 11029 33075 13179 6940 -10693 -26651
13689 -26651 -26139 -35050 -26870 5047 3889 -7017 13547 41306 23320 13344 -8953 -35113 -58284
13676 -58284 -40243 -16144 4004 8003 27988 12838 600 -16436 -23259 -29719 -16289 -8306
13664 -8306 -6918 -13291 -17312 -59725 -64294 -36585 -48283 -26779 -5791 15504 15750 7770 18479
13651 18479 24323 6793 -4838 -8681 -11633 16203 33479 49404 51231 43339 32685 17344 42566
13638 42566 34051 8054 -9663 -9242 8226 13580 15299 -2003 -30295 -22952 -11273 -20944 -21064
13625 -21064 -29543 -22519 -3876 -2323 918 10485 21014 18889 22261 19495 3644 -3708 27406
13612 27406 23628 -1651 -6373 9225 17400 19795 12503 -8324 -11334 -6967 -1727 -1082 -10440 -11200
13598 -11200 6981 -9096 -20767 -44545 -36326 4959 9555 -5324 3001 -10182 8348 14056
13586 14056 6524 -7775 -2069 22510 15809 36235 40450 -12085 -37537 -38952 -29280 -20341 -12904
13573 -12904 -14384 -23713 -10839 -14289 -11627 5808 7308 11914 16682 1453 -894 19297 25717
13560 25717 25182 28697 37796 28302 27328 10859 983 23045 17448 19659 16235 -12684 -19917 -5403
13546 -5403 -2799 -14759 -3123 20220 55102 44404 50687 58742 46564 36276 39232 37306 27073
13533 27073 12172 28273 43490 30842 51537 35995 42108 34366 21723 33144 17045 -2982
13521 -2982 -36300 -24112 -4465 23945 33186 47243 35934 6684 7915 28148 41406 59919
13509 59919 42306 27919 29564 12776 -6663 -33751 -25722 -1400 19926 47164 48587 63093
13497 63093 65753 68421 45093 26918 34271 41221 40073 -245 -23769 -2922 14888 51147 24378
13484 24378 -16364 -20864 -20925 -28080 -21833 765 -6502 -29854 -22358 3498 8133 5541 15453 23574
13470 23574 34447 27222 3312 18756 6479 14850 -3168 -1568 33965 81537 88932 50459
13458 50459 10916 -2619 -21729 -30489 -11094 -11429 -20122 -23292 -14219 -8710 3208 30440 28808
13445 28808 21800 23756 10308 25762 42285 62812 51492 10426 -15520 -6092 -8140 31704
13433 31704 53572 45455 20927 21071 27883 24348 19571 44224 17284 4961 -2797 -304 5887
13420 5887 8284 -4035 20064 3355 -16568 -12474 2409 16233 24023 29720 20146 -1789 -9492
13407 -9492 -30376 -24725 -8833 -10346 -6049 41 3950 -9440 6274 29540 23329 26395 43789
13394 43789 43853 14503 -9268 -33343 -27723 -21877 7982 6181 1970 -7707 8591 -31687 -44048
13381 -44048 -16105 4721 21930 12303 14254 -2039 -26147 -50671 -45850 -40368 -20511 -45922
13369 -45922 -56254 -53965 -55041 -36581 -13194 -6573 -33966 -28825 -11667 -15519 -24583 -26384 -12710
13356 -12710 -5970 -18395 -7450 -6368 -22218 -25785 -15101 -23873 -26903 -8186 2310 11754 -3838
13343 -3838 -13713 -16031 -12380 -13754 -26909 -37959 -27832 -13014 -9730 3454 13521 11673 -5194
13330 -5194 -17942 4166 -6087 -5534 30152 40977 29375 -5988 -7849 -687 -5702 -11570 -14248
13317 -14248 -5714 11003 16232 12827 7316 -585 20982 25279 12827 12596 37366 28732 5867
13304 5867 22236 35314 14889 -18875 -29770 -19975 -26959 -7048 -7524 5016 -11394 -8533 33658
13291 33658 54498 36198 17907 6207 -4092 -13822 -1064 -1324 -11531 39586 70524 54696
13279 54696 20975 -14504 -24786 8005 35752 24090 697 -12673 -6210 1508 1866 -8995
13267 -8995 -24319 -36138 -37350 -45283 -44251 -39213 -11137 -8876 -8373 -6688 -26949 -19420 -17258 -26374
13253 -26374 -8000 7022 25079 31101 31843 20953 -5975 6506 8296 -4255 -16609 -32637
13241 -32637 -10573 -8230 -1409 12755 21678 39642 28348 36445 27634 46897 49531 37961 20346
13228 20346 14430 30915 29734 12682 3596 -6839 -17443 -10781 4664 14365 35931 28350 23471
13215 23471 37704 36049 13140 -1849 -7131 -13981 -7836 -17515 -20383 -11340 -3308 -20633 -39519
13202 -39519 -49476 -53490 -71756 -44733 -26411 -12094 11794 8272 -25890 -29944 -3760 -7627 -7666
13189 -7666 -24579 -3813 10696 8237 -3015 11748 14142 2060 -18493 -12594 20171 15917 5272
13176 5272 -10957 -18366 -3589 1867 15463 5363 19097 10448 9465 -2888 3381 14941 16327
13163 16327 20243 24443 25589 42523 57888 56799 35184 -5852 -5047 3148 -14550 -36050 -37961
13150 -37961 -23453 -9626 -23667 -40856 -39086 23000 9921 8662 -8782 -24167 -33280 -42975
13138 -42975 -77214 -56303 -29022 10772 12843 -1817 13155 38272 53842 36564 26250 50096
13126 50096 55976 52688 25083 25347 10436 9919 9697 11954 19426 49223 42819 15748 16804 1219
13112 1219 -8103 -192 20941 22301 56 -8975 -3019 -10047 -33031 -16226 -8815 33733 37387
13099 37387 35145 29263 20309 11002 -3584 -14733 -9517 20209 63994 68579 50122 48295 58855
13086 58855 29797 16286 9975 22293 20577 29724 53629 57690 85008 74178 48985 33080
13074 33080 18379 26041 3224 19498 46364 51979 32343 64428 48108 29565 12023 15687
13062 15687 14424 5149 -7066 -3038 -12755 -6349 17852 9433 288 -26108 1691 4251 5011 -17128
13048 -17128 -20859 -14655 18711 11306 18247 29241 16072 20825 26734 21640 22537 39085 44223 41940
13034 41940 32573 36612 50656 28452 7104 -4081 806 10938 10221 -29322 -17125 -20556 -42757
13021 -42757 -23603 -10260 15893 10977 6788 14015 29988 28856 4922 8788 30173 28415 490
13008 490 -11261 -24848 -7032 -1054 -17882 -9125 -10761 11578 7308 11697 -7469 -29975 -42082
12995 -42082 5043 20728 29675 23596 30268 -3750 -38314 -29140 -22838 -41596 -15949 26538 35740
12982 35740 8355 -9855 -12391 -6243 -16399 -19677 -34160 2525 -702 -40583 -51278 -14197
12970 -14197 3490 -5604 -10302 -10036 4435 14772 32691 50314 47117 17812 -19034 -13518 12063
12957 12063 24546 9104 -19645 -13227 -23308 -10170 5705 16541 28833 12486 -12507 10313
12945 10313 19044 16725 25789 15025 -10003 -1363 27318 50084 44084 -1709 -8682 19255 -9107
12932 -9107 -44528 -28234 -19011 -9238 7966 11521 -9940 -31849 -44013 -31749 -5059 -1415 -2572
12919 -2572 -4187 -15086 -15901 -28455 -30437 4119 33907 29138 32481 38536 9281 -11399 18313
12906 18313 29555 45149 19028 15672 17657 14867 23678 17730 11714 38767 33507 12884 -3568
12893 -3568 -29368 -31863 -6742 12157 3383 -10147 -31185 -47644 -17239 179 -26570 -20837
12881 -20837 -23269 -14887 -4707 3735 27978 36894 22334 8660 24020 22398 32119 53661 46150
12868 46150 12160 27814 28118 15017 -9793 -7799 -8254 2197 16462 9843 10062 19860 7215
12855 7215 -338 10394 9051 27646 17419 7271 24598 17861 12953 27582 3234 -8238 -17088
12842 -17088 -11705 -5356 7470 12474 -15990 -8358 3720 18038 48602 24513 26706 34979 6878
12829 6878 -4292 256 6609 13146 -1831 -20486 14204 48311 46701 21700 10306 -6964 -34319
12816 -34319 -17937 -34971 -47019 -34578 -40866 -32704 -19758 -23469 -16341 -11591 -13399 -7791 12759
12803 12759 11233 -2801 8187 8065 23192 31112 39202 31084 24712 16691 10597 11587 12812 10227
12789 10227 14702 37656 44124 17269 46214 47680 81743 91142 59289 1935 -27985 -12933
12777 -12933 2264 -14336 -20330 23407 16519 -29534 -25805 -13965 -24770 18212 32511 11178
12765 11178 16980 26241 46276 64000 42764 23139 12827 6861 28089 56195 45036 24733
12753 24733 17915 11326 10441 11817 19460 45199 55618 20351 35554 74661 81468 71935 71585 54335
12739 54335 9360 -6580 -5853 -11882 -23181 -39268 -33929 -32119 -36937 -25236 3409 15352 23978
12726 23978 56063 55622 20392 19928 15699 24652 6280 37091 21103 -1141 6716 9067 10080
12713 10080 4028 -4183 25132 35926 57220 30333 -16874 -34310 -6242 1331 -14125 9490
12701 9490 -11132 -2653 26438 17968 10526 4538 -1301 -10460 -30128 -28853 -7224 26531 45650
12688 45650 44316 29388 17882 19839 17974 3663 -4335 16418 19715 -778 -1044 -9744 18751
12675 18751 31093 2329 -23161 -16710 11788 29205 29650 10731 14864 21664 -10252 -14266 5143
12662 5143 -2042 -17563 41180 63048 41484 21846 961 -18994 -25540 -37231 -16475 11669
12650 11669 12684 19882 12699 20944 16913 19747 16768 -2669 -21464 -26536 2464 23541 49077
12637 49077 62112 57110 28203 3021 17248 28549 50610 17331 22223 47238 50383 36551
12625 36551 8554 -9619 -9589 -21375 -10523 -1892 25009 30295 17624 7204 5312 11200 24170
12612 24170 7558 6471 2218 22050 29777 28802 26717 38275 37760 6593 -16389 -5228 22883
12599 22883 19379 -8018 -30233 -37564 -33578 -4894 -10066 -22892 4112 11745 12103 9084 198
12586 198 -49127 -67185 -42331 -5522 20368 15675 13349 4395 28496 75091 85180 45810 17944
12573 17944 15182 16356 -1693 -15605 -26440 -26915 -22103 -33467 -10775 25537 30089 26158 25276
12560 25276 19422 -1216 6094 16099 12029 5122 -9707 -20706 -16918 -25152 -15569 -8416 26409
12547 26409 41237 19731 832 -30752 -56400 -57014 -28863 -10250 -13649 7885 32555 39635
12535 39635 7264 -9642 -29035 -39803 -49879 -62261 -53174 -47432 -66292 -66893 -8355 5252
12523 5252 -11204 -20606 -25024 1935 -21645 -43841 -22689 6073 6621 7564 -4268 -20287 -35530
12510 -35530 -34958 -37543 -30822 -30714 -5479 -1712 -12951 -30307 -31869 -18160 -22573 -39379 -22708
12497 -22708 7034 13427 11273 7543 12046 39767 67024 31362 21890 43218 74708 59542 41570
12484 41570 18009 -13374 -5565 -11276 -14084 -7039 -25532 -24318 3393 24329 14107 -1854 -16578
12471 -16578 31565 45958 10219 7453 14897 3306 -10534 -13355 3178 -4834 8343 18558
12459 18558 25683 14334 -20806 -910 42401 12043 -3220 -16451 -11855 -2373 28175 15865
12447 15865 3503 -3263 -15538 -33345 -4014 -6404 -31983 -50035 -18646 -9661 5202 6567
12435 6567 11299 36272 36875 17643 12577 5306 -9781 5928 14215 3624 -21073 -28489 -31549
12422 -31549 -38233 -46475 -28412 -9561 2636 -6124 33665 57694 46886 45290 16448 21398 11382
12409 11382 -49955 -53758 -30347 -10810 -2284 -14180 -13825 -20807 -26376 10820 41131 35844 6139
12396 6139 -24633 2575 10718 11466 25080 11687 -8388 -20421 -8736 -17163 -4467 24934 10799
12383 10799 843 42296 34764 13818 -16826 -11518 19116 32437 10288 4083 -4958 -13466 -21895
12370 -21895 -6866 20476 9471 -5618 2772 3065 -11213 18645 51863 53435 32057 35202 22092
12357 22092 18118 35786 65767 66255 57158 13475 -986 -5185 -1376 -4000 7531 14096 9278
12344 9278 44053 42594 29686 24253 -1231 -11101 -2935 -8116 -23282 -35616 -25614 -14646 -32061
12331 -32061 19426 57516 65288 51105 6599 -187 -8646 5646 39128 30280 23588 11891 29173
12318 29173 48334 58173 27166 17792 17385 18911 -2645 -46214 -14298 20700 48624 17748 -16297
12305 -16297 -33362 -29223 -28023 -10687 39668 34568 1604 -18687 -44251 -49172 -4223 -2088 -1990
12292 -1990 -25900 -7005 14 -9756 559 -8692 -11688 -14567 -12994 -8960 830 -286 14722 31644
12278 31644 14087 27803 8500 -9512 -15036 -31897 -1937 18251 6625 -593 8995 5888
12266 5888 42920 37580 4113 16202 49451 46821 14611 8031 -7144 5369 -281 -4938 -10535
12253 -10535 -27495 -36418 -31699 -35443 -42158 -3327 26252 30463 8744 21820 11260 8339 -8044
12240 -8044 -23256 -19810 -26217 -33224 -50439 -22878 -3761 -7186 -13029 -35488 -22318 -27379 -43438
12227 -43438 -14097 -3188 -10221 -12850 -16333 6846 39618 21784 -36523 -57719 -45069 -21172
12215 -21172 -12867 -21844 -37927 -19119 -15047 -25219 -2078 22029 -6869 -14148 -24729 -15664 -28733
12202 -28733 -42370 -38407 -10920 35121 62336 38958 35852 4096 -24819 -5968 12575 21166
12190 21166 27304 13548 -3982 -10838 11757 37544 17492 25142 19823 4495 -11916 -15798 -19423
12177 -19423 -37224 -26911 -24314 -25275 18548 28398 24246 23620 43247 34577 -4576 -2488 13889
12164 13889 3109 -9056 24065 49603 27585 30757 51665 46506 67767 39318 23974 12121
12152 12121 -5132 -14220 -20781 -41439 -57382 -38049 -43961 -55508 -55919 -52512 -55835 -51370 -27378
12139 -27378 -7206 -16502 -33600 -50253 -41500 -42233 -25996 -19162 -25826 -3651 11855 12089 11912 -7855
12125 -7855 -30684 -18885 -14548 -17438 -1281 9273 16608 30878 33091 30327 30879 41743 30347
12112 30347 46065 13679 569 -25051 -45724 -23109 -10946 -11505 -21906 -21798 -5087 23173
12100 23173 19671 32410 23280 36597 25184 4326 -5339 -17893 18271 31058 20251 -11076
12088 -11076 -22831 17234 46398 38876 8485 -2916 -19476 -16463 3646 10625 12371 35771
12076 35771 26796 -574 -20547 -28825 -21673 -33854 -48103 -57911 -78229 -39014 15138 30907
12064 30907 33613 45708 20783 12295 37570 51774 38860 31791 28855 34808 42264 29911 30263
12051 30263 8894 -31215 -26189 -26782 15268 8340 -26053 -46242 -30490 -1234 25572 23107 11651
12038 11651 18556 34398 32824 10493 -9844 -26011 -19883 -22247 -15062 5947 5642 -17714 -13268
12025 -13268 -32620 -11424 1735 -6000 -34033 3115 27203 40568 25615 -7695 -6998 6278
12013 6278 38439 8336 -26400 -34396 -23242 -13775 -7355 -2151 -25659 -38516 -27339 -28784 -9510
12000 -9510 -5307 -16624 11766 22216 18087 -4109 -7326 -2820 -12759 10622 9546 -7055 3770
11987 3770 -328 -11334 -30443 -46440 -33223 -35505 -33644 4724 11627 -5128 -19477 -9476 10568
11974 10568 17055 10731 -4151 -3136 12510 32219 4709 13030 56685 42942 15202 -3068
11962 -3068 -5617 12668 43173 33033 16424 12787 21783 13338 -12461 -7293 7595 13507 19811
11949 19811 12468 -6115 -5524 -2548 28029 3629 1626 -12429 -15168 -5509 -3504 -23382 -31782
11936 -31782 -25513 -18829 -19181 4344 29409 40096 34512 19284 -8949 -24311 2281 16229 21930
11923 21930 33959 54013 33536 22098 33193 57144 31772 39091 60866 76106 61527 23366
11911 23366 -30404 -50860 -36847 -19860 -21208 -44231 -32504 -28487 -33662 -38348 -26956 -18522 15069
11898 15069 23204 32759 27767 -4686 -26624 -24898 -3801 26359 15705 14548 26435 22340 -12909
11885 -12909 -5953 677 -25446 -49049 -42682 -41461 -22019 -33993 -32701 -43376 -11831 28628 42365
11872 42365 28668 9199 -4046 -2495 -29397 -16925 -11926 -18343 -27330 -27925 915 12717 16583
11859 16583 29789 48573 51098 35423 13556 13245 14193 14436 11627 13312 15641 11243 -20849 -38693
11845 -38693 -19753 16300 33082 19937 20678 22239 3522 -1433 32426 1986 -14544 -14311 -38867
11832 -38867 -54512 -21024 -21822 -3858 2527 -13247 -6151 -4453 -13869 21133 39544 41917 53037
11819 53037 28789 969 -10077 -36658 -52498 -25241 768 1568 6894 -11541 -32470 -50527
11807 -50527 -51273 -28857 -28139 -35426 -8473 22543 24014 -2238 -15569 5866 18692 -7217 -15082
11794 -15082 -13351 3652 -21425 -30146 -12587 1555 44 -11287 6648 10731 3651 -4034 -9456
11781 -9456 9103 31743 17729 -10874 3598 11584 -3239 -36080 -45578 -58825 -31843 -13028
11769 -13028 -32509 -45033 -77882 -55801 -12490 5971 1824 -20851 -50385 -47560 -26165 -6256
11757 -6256 -16608 -613 12847 11302 -2012 -28511 -42959 -19984 -20169 -34555 -56322 -46758 -25897
11744 -25897 -31108 -28997 -12454 18430 40255 38038 16998 10101 6926 -11150 -27770 -8316 33816
11731 33816 46655 33056 54168 41413 49476 46881 25703 -7670 -9119 -20249 -23818 -13398
11719 -13398 -41209 -58772 -26637 3035 10183 -4569 176 9429 23007 42764 42085 2509 -24877
$$ [...]
##END NTUPLES=NMR SPECTRUM
##END=
