##TITLE=Analysis number 330272
Compound Code cc 12203
Project Code adrs
Chemist Name ugmt
##JCAMPDX= 6.0         $$ Bruker NMR JCAMP-DX V2.0
##DATA TYPE= NMR SPECTRUM
##DATA CLASS= NTUPLES
##ORIGIN= Bruker BioSpin GmbH
##OWNER= nmr
$$ XWIN-NMR		Version 3.5
$$ Mon Nov 12 11:15:06 2007 GMT Standard Time (UT+0h)  MAYBRIDGE\nmr@NMR_250MHZ
##.OBSERVE FREQUENCY= 250.131544655141
##.OBSERVE NUCLEUS= ^1H
##.ACQUISITION MODE= SIMULTANEOUS (DQD)
##.ACQUISITION SCHEME= undefined
##.AVERAGES= 16
##.DIGITISER RES= 18
##SPECTROMETER/DATA SYSTEM= dpx250
##.PULSE SEQUENCE= zg30
##.SOLVENT NAME= CDCl3
##.SHIFT REFERENCE= (INTERNAL, CDCl3, 0, 16.522)
##AUDIT TRAIL= $$ (NUMBER, WHEN, WHO, WHERE, WHAT)
$$ ##TITLE= Audit trail, XWIN-NMR		Version 3.5
$$ ##JCAMPDX= 5.01
$$ ##ORIGIN= Bruker BioSpin GmbH
$$ ##OWNER= nmr
$$ C:\u/data/dgb/nmr/ADRS/510/pdata/1/auditp.txt
$$ ##AUDIT TRAIL=  $$ (NUMBER, WHEN, WHO, WHERE, WHAT)
(   1,<2007-11-12 11:14:30.36 +000>,<MAYBRIDGE\nmr>,<NMR_250MHZ>,
      <created by zg, POWCHK disabled, PULCHK disabled
       configuration hash MD5:
       76 6E 9A 78 1E 09 19 81 EC 84 63 8F B0 6A 59 2D
       data hash MD5: 64K
       00 B0 CE C5 79 67 48 3E E2 16 CD 0D 07 8B 43 95>)
(   2,<2007-11-12 11:14:45.60 +000>,<MAYBRIDGE\nmr>,<NMR_250MHZ>,
      <Start of raw data processing
       ef LB = 0.3 FT_mod = 6 PKNL = 1 SI = 32K 
       data hash MD5: 32K
       72 41 43 DD 74 6F 48 2E 5D 71 D8 77 96 3F 0E BE>)
(   3,<2007-11-12 11:14:47.24 +000>,<MAYBRIDGE\nmr>,<NMR_250MHZ>,
      <apk 
       data hash MD5: 32K
       21 2C 07 BE 9A 95 90 32 C9 AA 94 DD F7 A3 AD 47>)
(   4,<2007-11-12 11:14:47.99 +000>,<MAYBRIDGE\nmr>,<NMR_250MHZ>,
      <abs ABSG = 5 
       data hash MD5: 32K
       01 53 18 9B BB 44 B7 FD 85 3C 3B 89 A4 E2 4C D1>)
$$ ##END=
$$ 
$$ hash MD5
$$ 90 CE F5 6D 65 D6 32 FD 9C 1F 78 D4 87 B0 F5 19
##$RELAX= 
##$RELAX= 
##$RELAX= 
##$RELAX= 
##$RELAX= 
##$RELAX= 
##$RELAX= 
$$ Bruker specific parameters
$$ --------------------------
##$DU= <C:\u>
##$EXPNO= 510
##$NAME= <ADRS>
##$PROCNO= 1
##$TYPE= <nmr>
##$USER= <dgb>
##$AMP= (0..31)
100 100 100 100 100 100 100 100 100 100 100 100 100 100 100 100 100 100 
100 100 100 100 100 100 100 100 100 100 100 100 100 100 
##$AQSEQ= 0
##$AQ_mod= 3
##$AUNM= <au_zg>
##$AUTOPOS= <18 >
##$BF1= 250.13
##$BF2= 250.13
##$BF3= 250.13
##$BF4= 250.13
##$BF5= 500.13
##$BF6= 500.13
##$BF7= 500.13
##$BF8= 500.13
##$BYTORDA= 1
##$CFDGTYP= 0
##$CFRGTYP= 5
##$CHEMSTR= <none>
##$CNST= (0..31)
1 1 145 1 1 1 1 1 1 1 1 1 1 1 1 1 1 1 1 1 1 1 1 1 1 1 1 1 1 1 1 1 
##$CPDPRG= <>
##$CPDPRG1= <>
##$CPDPRG2= <>
##$CPDPRG3= <>
##$CPDPRG4= <mlev>
##$CPDPRG5= <mlev>
##$CPDPRG6= <mlev>
##$CPDPRG7= <mlev>
##$CPDPRG8= <mlev>
##$CPDPRGB= <>
##$CPDPRGT= <>
##$D= (0..31)
0 1 0 0 0 0 0 0 0 0.06 0 0 0 0 0 0 0.0002 0 0 0 0 0 0 0 0 0 0 0 0 0 0 
0 
##$DATE= 1194866068
##$DBL= (0..7)
120 120 120 120 120 120 120 120 
##$DBP= (0..7)
150 150 150 150 150 150 150 150 
##$DBP07= 0
##$DBPNAM0= <>
##$DBPNAM1= <>
##$DBPNAM2= <>
##$DBPNAM3= <>
$$ [...]
##$SUBNAM7= <"">
##$SUBNAM8= <"">
##$SUBNAM9= <"">
##$SW= 20.6930455092707
##$SWIBOX= (0..15)
0 0 3 0 0 0 0 0 0 0 0 0 0 0 0 0 
##$SW_h= 5175.983436853
##$TD= 65536
##$TD0= 1
##$TE= 295.16
##$TE2= 300
##$TE3= 300
##$TEG= 300
##$TL= (0..7)
0 120 120 120 120 120 120 120 
##$TP= (0..7)
150 150 150 150 150 150 150 150 
##$TP07= 0
##$TPNAME0= <>
##$TPNAME1= <>
##$TPNAME2= <>
##$TPNAME3= <>
##$TPNAME4= <>
##$TPNAME5= <>
##$TPNAME6= <>
##$TPNAME7= <>
##$TPOAL= (0..7)
0.5 0.5 0.5 0.5 0.5 0.5 0.5 0.5 
##$TPOFFS= (0..7)
0 0 0 0 0 0 0 0 
##$TUNHIN= 0
##$TUNHOUT= 0
##$TUNXOUT= 0
##$USERA1= <user>
##$USERA2= <user>
##$USERA3= <user>
##$USERA4= <user>
##$USERA5= <user>
##$V9= 5
##$VALIST= <valist>
##$VCLIST= <CCCCCCCCCCCCCCC>
##$VD= 0
##$VDLIST= <DDDDDDDDDDDDDDD>
##$VPLIST= <PPPPPPPPPPPPPPP>
##$VTLIST= <TTTTTTTTTTTTTTT>
##$WBST= 1024
##$WBSW= 4
##$XGAIN= (0..3)
0 0 0 0 
##$XL= 0
##$YL= 0
##$YMAX_a= 259282
##$YMIN_a= -280826
##$ZGOPTNS= <>
##$ZL1= 120
##$ZL2= 120
##$ZL3= 120
##$ZL4= 120
##$ABSF1= 16.522
##$ABSF2= -4.171173
##$ABSG= 5
##$ABSL= 3
##$ALPHA= 0
##$AQORDER= 0
##$ASSFAC= 0
##$ASSFACI= 0
##$ASSFACX= 0
##$ASSWID= 0
##$AUNMP= <proc_1d>
##$AZFE= 0.1
##$AZFW= 0.1
##$BCFW= 0
##$BC_mod= 0
##$BYTORDP= 0
##$COROFFS= 0
##$CY= 12.5
##$DATMOD= 1
##$DC= 0
##$DFILT= <>
##$DTYPP= 0
##$F1P= 14.0000005364418
##$F2P= -0.99999901652339
##$FCOR= 0.5
##$FTSIZE= 32768
##$FT_mod= 6
##$GAMMA= 0
##$GB= 0
##$INTBC= 1
##$INTSCL= 1
##$ISEN= 128
##$LB= 0.3
##$LEV0= 0
##$LPBIN= 0
##$MAXI= 10000
##$MC2= 0
##$MEAN= 0
##$ME_mod= 0
##$MI= 0
##$NCOEF= 0
##$NC_proc= -4
##$NLEV= 6
##$NOISF1= 0
##$NOISF2= 0
##$NSP= 0
##$NTH_PI= 0
##$NZP= 0
##$OFFSET= 16.522
##$PC= 1
##$PHC0= 172.1295
##$PHC1= 16.10022
##$PH_mod= 1
##$PKNL= yes
##$PPARMOD= 0
##$PSCAL= 4
##$PSIGN= 0
##$REVERSE= no
##$SF= 250.13
##$SI= 32768
##$SIGF1= 0
##$SIGF2= 0
##$SINO= 400
##$SIOLD= 32768
##$SREGLST= <1H.CDCl3>
##$SSB= 0
##$STSI= 32768
##$STSR= 0
##$SW_p= 5175.98343685301
##$SYMM= 0
##$S_DEV= 0
##$TDeff= 65536
##$TDoff= 0
##$TI= <Analysis number 999999
Compound Code 99
Book Reference 9
Project Code 9>
##$TILT= no
##$TM1= 0
##$TM2= 0
##$TOPLEV= 0
##$USERP1= <user>
##$USERP2= <user>
##$USERP3= <user>
##$USERP4= <user>
##$USERP5= <user>
##$WDW= 1
##$XDIM= 32768
##$YMAX_p= 269841832
##$YMIN_p= -459621
$$ End of Bruker specific parameters
$$ ---------------------------------
##NTUPLES= NMR SPECTRUM
##VAR_NAME=  FREQUENCY,     SPECTRUM/REAL,   SPECTRUM/IMAG
##SYMBOL=    X,             R,               I
##VAR_TYPE=  INDEPENDENT,   DEPENDENT,       DEPENDENT
##VAR_FORM=  AFFN,          ASDF,            ASDF
##VAR_DIM=   32768,         32768,           32768
##UNITS=     HZ,            ARBITRARY UNITS, ARBITRARY UNITS
##FACTOR=    0.157963299565203, 1,           1
##FIRST=     4132.6476996994, 0,             0
##LAST=      -1043.33573715361, 0,           0
##MIN=       -1043.33573715361, -459621,     0
##MAX=       4132.6476996994, 269841832,     0
$$ Real data points
##PAGE= N=1
##DATA TABLE= (X++(R..R)), XYDATA
$$ [...]
25086A16646n7286j13969N5308M0652k4876j26644k2626J18430J14032l1624o1050
$$ 116646 59360 -54609 699 41351 16475 -110169 -132795 -14365 99667 68043 6993
25075F993L8903l5615j47135n0155O1355J0254O0824M7099m6487J4013K5901R820
$$ 6993 45896 10281 -136854 -187009 -125654 -115400 -54576 -7477 -53964 -39951 -14050 -4230
25063d230K3309j3542m2333N2174n9029n1341K7950O3629j4299n3966K06R930
$$ -4230 19079 5537 -36796 15378 -43651 -94992 -67042 -3413 -17712 -71678 -71472 -61542
25051f1542M6546q6092l7297L1992Q4795J20179j9451l1442K133q7233K3587r646
$$ -61542 -14996 -101088 -138385 -106393 -21598 98581 79130 47688 49821 -37412 -13825 -23471
25039b3471m1873l6746m5427K0283N8886K6090L4533Q278J170o0303K5649J1866
$$ -23471 -65344 -102090 -147517 -127234 -68348 -42258 -7725 553 1723 -58580 -32931 -21065
25027b1065J01058O270j42384j61104N2237j0501J6L5933Q7650L6p9062o3326
$$ -21065 79993 86263 -56121 -217225 -164988 -175489 -175473 -139540 -51890 -51854 -130916 -194242
25015a94242m9180J01299j5583j1952K3864O8720j6285n2013j5786N8773Q6161
$$ -194242 -243422 -142123 -157706 -169658 -145794 -77074 -93359 -145372 -161158 -102385 -16224
25004a6224L9353k3698q1389k9473R2594R8902L4683O5995o3175j67310l0883
$$ -16224 23129 -569 -81958 -111431 -18837 80065 114748 180743 117568 -49742 -80625
24993h0625n3278M7806J12633J44849j06024j51438j3414R5379L5259r5672k795
$$ -80625 -133903 -86097 26536 171385 65361 -86077 -99491 -4112 31147 -64525 -67320
24982f7320J28397r846j348O9019l8317j22367n9842J05116J44665Q6442j1375
$$ -67320 61077 51231 49883 118902 80585 -41782 -101624 3492 148157 234599 223224
24971B23224M2779M2334n4074j00141o0778m6493l9334l975m5583N5405p8949
$$ 223224 266003 308337 254263 154122 93344 46851 7517 3542 -42041 13364 -65585
24960f5585L4910R4184N7241o8260k6843l261M2979N790q830o352j4161q4164
$$ -65585 -30675 63509 120750 52490 25647 22386 65365 71155 62325 55973 41812 -42352
24948d2352N9374K5675k1475p5719l121J5440L2481m1943M3481R2627M8642K7686
$$ -42352 17022 42697 21222 -54497 -57618 -42178 -9697 -51640 -8159 84468 133110 160796
24936A60796r2383n0201j0197m2863J736O3601l5543O193P033n5404P377J1418
$$ 160796 68413 18212 8015 -34848 -33112 30489 -5054 1139 8172 -47232 -39855 -28437
24924b8437N6798k6683j4040P210n4698j36238l8939P9987N5282L5332J09380
$$ -28437 28361 1678 -12362 -5152 -59850 -196088 -235027 -155040 -99758 -64426 44954
24913D4954K1957M4710K2296j7672o6447j12474K274M3746N1947j17538m2040
$$ 44954 66911 111621 133917 116245 49798 -62676 -60402 -16656 35291 -82247 -124287
24902a24287J1941K9122k3145K4264R4378l4087k9430m6183P2111J33217j0721
$$ -124287 -112346 -83224 -106369 -82105 12273 -21814 -51244 -97427 -25316 107901 97180
24891I7180p2432j3217J4104l0378j4888l7251R1232Q118j8961k0251Q9576K97
$$ 97180 24748 11531 25635 -4743 -19631 -56882 34350 42468 23507 3256 92832 93129
24879I3129M8116M0063l4891j15744n0350N0659l1245J5438j02323O7038K1527
$$ 93129 141245 181308 146417 30673 -19677 30982 -263 15175 -87148 -20110 1417
24868A417n9535M5177p8818K0454J6356Q1675P0705m4622J8808R3383p8525N750
$$ 1417 -58118 -12941 -91759 -71305 -54949 26726 97431 52809 71617 165000 86475 92225
24856I2225j9854o3760l3251k4771n3281O2424K0715j04898m0333J7616J61447
$$ 92225 72371 8611 -24640 -49411 -102692 -40268 -19553 -124451 -164784 -147168 14279
24845A4279Q8629o375l2727L1486l2695q0861o3001M3815O0086J061j66432J8266
$$ 14279 102908 96533 63806 95292 62597 -18264 -81265 -37450 22636 23697 -142735 -124469
24833a24469P573P488p943Q9779M8824M2685L4004r5477m5634M3098K8836R8925
$$ -124469 -116896 -109408 -117351 -27572 21252 63937 97941 2464 -43170 -72 28764 127689
24821A27689J3403r205j31393r7994k8041R8444J11240J41636K2702p1985j95685
$$ 127689 141092 131887 494 -97500 -125541 -27097 84143 225779 248481 176496 -19189
24810a9189p5588j5950M7991J17664J11565k8709j05550m9174j0380J8319L2003
$$ -19189 -94777 -110727 -62736 54928 166493 137784 32234 -16940 -27320 -9001 23002
24799B3002m9278M627J12397p1634j6639k3233L2400o1814J1794k9257J6174j30271
$$ 23002 -26276 -21649 90748 19114 2475 -20758 11642 -50172 -38378 -67635 -51461 -181732
24787a81732o8513J15495R1578q875O6953K8374q4212N723o717N4917p3560j06118
$$ -181732 -250245 -134750 -43172 -52047 14906 43280 -40932 -35209 -41926 12991 -60569 -166687
24775a66687N8037J40856m6262q0578Q7434o7699m1260N1603K6957J28302J8865
$$ -166687 -108650 32206 -14056 -94634 -7200 -74899 -116159 -64556 -37599 90703 109568
24764A09568j31322J9345M6840m6114M7652n1660o7277O0916Q0994P0360l1582
$$ 109568 -21754 -2409 44431 -1683 45969 -5691 -72968 -12052 68942 139302 107720
24753A07720j16125n9468l8714Q5758M0749k293P7802L0818N9756q2477o1548
$$ 107720 -8405 -67873 -106587 -20829 19920 17627 95429 126247 186003 103526 41978
24742D1978L157l8121p697R459J34987l9895j00932j1869m8711R8216M8526J6573
$$ 41978 45135 7014 -683 8776 143763 103868 2936 -8933 -57644 40572 89098 105671
24730A05671P2270l3999j9404K6426K384k2176r0169m9994O8792j4276j10779
$$ 105671 177941 143942 124538 150964 153348 131172 41003 -8991 59801 45525 -65254
24719f5254o6459R9419n1987n1485j1140k4131J63195P0526r2351j42497M81R5885
$$ -65254 -131713 -32294 -84281 -135766 -146906 -171037 -7842 62684 -29667 -172164 -171683 -75798
24707g5798n4254m0409R2667O2500l2598L4394P0805k3032l2811K0195o4366j4711
$$ -75798 -130052 -170461 -77794 -15294 -47892 -13498 57307 34275 1464 21659 -42707 -57418
24695e7418P0811L5098j4454N946k8180o017l9302N103L8521J09871Q0832j2548
$$ -57418 13393 48491 34037 39983 11803 5786 -33516 -28413 10108 119979 200811 188263
24683A88263n0458J3250m036N8163j8781l6380j9481l0110r019r2007n0287J34006
$$ 188263 137805 151055 147019 205182 186401 150021 130540 100430 91411 -596 -50883 83123
24671H3123Q959m842o5293m5124j0843J6829K1430l7835O1024P319k6648K7329
$$ 83123 92082 87240 21947 -23177 -34020 -17191 4239 -33596 27428 34747 8099 35428
24659C5428K6988n9928k9657L093N5130M2307q1643o1420J2119R7926O2647j3069
$$ 35428 62416 2488 -27169 -24076 31054 73361 -8282 -69702 -57583 40343 102990 89921
24647H9921p1287j77912n5190J5690M1355J17441N5901j23219j2023N204K7231
$$ 89921 18634 -159278 -214468 -198778 -157423 -39982 15919 -107300 -119323 -114119 -86888
24636h6888M9958Q2113O6422l0668r610l4478j40755O0997K758n9469M7725N7119
$$ -86888 -36930 45183 111605 80937 71327 36849 -103906 -42909 -40151 -99620 -51895 5224
24624E224R789K19131P6832j43379n9941m5158K8973M6745n3629N889N4026r3311
$$ 5224 15013 234144 310976 167597 107656 62498 91471 138216 84587 90476 144502 51191
24612E1191p0966K3267m1499k1449O3389J21477M1761q584R7376J07029q8882
$$ 51191 -19775 3492 -38007 -59456 3933 125410 167171 158587 255963 362992 274110
24601B74110m2304m0774l2221j2453L4907l7501L9412P111j44654l8555M6888
$$ 274110 231806 191032 158811 146358 181265 143764 183176 190287 45633 7078 53966
24590E3966j1467m5858p2471k3797J5731L7782N1817k0443q9113K275L1409R0243
$$ 53966 42499 -3359 -75830 -99627 -83896 -46114 5703 -14740 -103853 -101578 -70169 20074
24578B0074K8597n944o0481j3188M5730n6823K3822L513L6968L4898J4360p0675
$$ 20074 48671 42727 -17754 -30942 14788 -42035 -18213 -14700 22268 57166 71526 851
24566H51j04263R0571J19651M2405n4665r786M8141l945k4972m0779p9525K0279
$$ 851 -103412 -12841 106810 149215 94550 84764 132905 128960 103988 63209 -16316 3963
24554C963M6191K8188R044k8004j7839m0166k2327l2905J0051Q8623L3072q4885
$$ 3963 50154 78342 87386 59382 41543 1377 -20950 -53855 -43804 44819 77891 -6994
24542f994l7289K3723R1364J3336o3234K1689l1760K7596M3750j8777O7904m591
$$ -6994 -44283 -20560 70804 84140 20906 42595 10835 38431 82181 63404 131308 126717
24530A26717n1885j00459p8435J27250N8291j29403K5560Q8391r718k9491j24600
$$ 126717 74832 -25627 -104062 23188 81479 -47924 -22364 66027 56309 26818 -97782
24519i7782N2831J00948o8932j2806j4111K4739L4008J2371J54K3249J5767k0480
$$ -97782 -44951 55997 -12935 -25741 -39852 -15113 18895 31266 31420 54669 70436 49956
24507D9956m6737O9999J0774m5385R3138L1446o808n0902n8332J02967k725o8750
$$ 49956 3219 73218 83992 38607 131745 163191 156383 105481 47149 150116 147391 78641
24495G8641q717l1841j1510l1836J0462m1859n9687j9492K6687J74582P5547J4841
$$ 78641 69924 38083 26573 -5263 5199 -36660 -96347 -115839 -89152 85430 160977 175818
24483A75818Q681P909p9660p6226M0668r7271j03146n3044j00582M0779J79078
$$ 175818 184499 192408 112748 36522 77190 -20081 -123227 -176271 -276853 -236074 -56996
24472e6996O0611N4296M3325k4111j02317L7111M1796j0942P5167J85018p7061
$$ -56996 3615 57911 101236 77125 -25192 11919 53715 42773 117940 302958 225897
24461B25897j628l8567o4048m3241o93m4919m3577J03777J34009j3488j46093
$$ 225897 224269 185702 121654 78413 77720 32801 -10776 93001 227010 213522 67429
24450F7429q541R2832M8774M5827q5398k4723k9902n9281l1628J1949Q8973l4980
$$ 67429 58888 151720 200494 246321 160923 136200 106298 47017 15389 27338 116311 81331
24438H1331L860M4039n1230o2474P562N2904k7988m4426q6443k8537o360L6823
$$ 81331 85191 129230 78000 15526 23088 75992 48004 3578 -82865 -111402 -117762 -80939
24426h0939o2898r0990R0149k8799J24402J85994L8800r689P0598l7398q6899
$$ -80939 -143837 -234827 -144678 -173477 -49075 136919 175719 166030 236628 199230 112331
24415A12331N9706L2821m1690m0648j06351n0512J9301M4382l24m9825J2371p1762
$$ 112331 172037 204858 163168 122520 16169 -34343 -15042 29340 29016 -20809 -8438 -80200
24403h0200l6451N9168K6811j939k1435o617K0957J5744r8356n5406q9571J44793
$$ -80200 -116651 -57483 -30672 -32611 -54046 -60663 -39706 -23962 -122318 -177724 -267295 -122502
24391a22502N4584K4379M8029l6996o5743o3670l8043L9973Q2318N5744m9637
$$ -122502 -67918 -43539 4490 -32506 -98249 -161919 -199962 -159989 -77671 -21927 -71564
24380g1564o0981K0885m9375M4933M9666M682O6266m509r0121m9534n6171N2673
$$ -71564 -132545 -111660 -161035 -116102 -66436 -61754 4512 3 -90118 -139652 -195823 -143150
24368a43150N0617j7713n7464L883m8847P2881J31292Q725J04M982k3871j4329
$$ -143150 -92533 -110246 -167710 -163827 -212674 -139793 -8501 224 328 5310 -18561 -32890
24356c2890Q3211O7485o3783k6743Q592P173Q5635J18567j70451r2900L2902l0958
$$ -32890 50321 117806 54023 27280 35872 43045 128680 247247 76796 -16104 16798 -14160
24344a4160n9897p3197R7746L056N8038m1782n0202O9535L3727M5602R603r4362
$$ -14160 -74057 -147254 -49508 -46452 11586 -30196 -80398 -10863 22864 68466 78069 -16293
24332a6293q1499p6310o9976O8181Q2506Q6221l2343o0381L1361j7109k3999O4944
$$ -16293 -97792 -174102 -244078 -175897 -93391 -7170 -39513 -99894 -68533 -85642 -109641 -44697
24320d4697P2634L574m7170N118J8822L2611n7854j54862p421Q0097K9916N1480
$$ -44697 27937 31511 -15659 -10541 8281 40892 -16962 -171824 -179245 -99148 -69232 -17752
24308a7752j4115M348N5886L8600j8155L8715o683K7814n4746j16041r9829O8013
$$ -17752 -31867 -27519 28367 66967 48812 87527 80844 108658 53912 -62129 -161958 -93945
24296i3945L012l6212N9701R6161l8920P406K8121j7476m3571n5520R740J46832
$$ -93945 -90933 -127145 -67444 28717 -10203 -2797 25324 7848 -35723 -91243 -81503 65329
24284F5329Q877N8061J4166j05167j14557L5901Q486K2125K1907m1688j20499
$$ 65329 74206 132267 146433 41266 -73291 -37390 -28904 -6779 15128 -26560 -147059
24273a47059N4885R4228P491j5975j5308K2683R2384o0241p2817m2176O3167O9008
$$ -147059 -92174 2054 9545 -6430 -21738 945 93329 33088 -39729 -81905 -18738 50270
24261E0270Q5557m7437n0973j1136M7173L789m1838p2849j9537J12036l0243l0831
$$ 50270 135827 88390 37417 26281 73454 77243 35405 -37444 -56981 55055 24812 -6019
24249f019r1699J165R821J4996n7613R5971m1506k6231O7K0821O3864N4584J539
$$ -6019 -97718 -96553 -86732 -71736 -129349 -33378 -74884 -101115 -101048 -80227 -16363 38221 39760
24236C9760j06113L5144L6034L4204O437j8927N9640J5468j24970P312k8364m7782
$$ 39760 -66353 -31209 4825 39029 45466 26539 86179 101647 -23323 -16011 -44375 -92157
24224i2157k587J5182j2333k0934M0192o415J9151L0059M9171k0711k5283j2365
$$ -92157 -94744 -79562 -91895 -112829 -72637 -79052 -59901 -29842 19329 -1382 -26665 -39030
24212c9030L9208J6790o8729l5967j957p079K0634L5658o3321J12662P568j8939
$$ -39030 178 16968 -51761 -87728 -89685 -96764 -76130 -40472 -103793 8869 16437 -2502
24200b502Q5492J6610n3065j9023J11291N2526j399l1173l4233k8785m5804k5636
$$ -2502 82990 99600 46535 27512 138803 191329 189930 158757 124524 95739 49935 24299
24188B4299j6001m0087M1695n2337M4444K3095o0599L0173K2988O24M315P4745
$$ 24299 8298 -31789 9906 -42431 2013 25108 -35491 -5318 17670 18294 22609 97354
24176I7354p260r5896J2125M3776K0867N9014j60250m7402P1922p4378M4421P7785
$$ 97354 90094 -5802 6323 50099 70966 129980 -30270 -77672 -5750 -80128 -35707 42078
24164D2078o480L8980K6876j891N5150k7427o6820O4828j3980n8577K133l5588
$$ 42078 35598 74578 101454 99563 154713 127286 60466 125294 111314 52737 54870 19282
24152A9282o0632k0335k962N3469q276n2572L1327N503J0123q7388K745M1510
$$ 19282 -41350 -61685 -64647 -11178 -19454 -72026 -40699 -35196 -25073 -112461 -109716 -68206
24140f8206L5034L6480o0136l0698O3754K9581n411O2935p593K5798k8017J4088
$$ -68206 -33172 3308 -56828 -87526 -23772 5809 398 63333 55740 81538 53521 67609
24128F7609n4960J02699j4956m4370j1327K0342j9276j01352j7624m7245l6204
$$ 67609 12649 115348 100392 56022 44695 65037 45761 -55591 -73215 -120460 -156664
24117a56664n5274J60873J05855m6403L9915N7014k6950q9372n2189M3040N2924
$$ -156664 -211938 -51065 54790 8387 48302 105316 78366 -11006 -63195 -20155 32769
24106C2769O9975p8308j07627J1671N9966L8595J3804l3960k314j6981o520K5316
$$ 32769 102744 24436 -83191 -71520 -11554 27041 40845 6885 4571 -12410 -18930 6386
24094F386N0663k3952R900k2602j39731k0786J13560P1834N0810j36865q6074
$$ 6386 57049 33097 42997 20395 -119336 -140122 -26562 45272 96082 -40783 -126857
24083a26857M4431K7222K1737k6250L5312Q5574K824p4259n9341j35758P1341
$$ -126857 -82426 -55204 -33467 -59717 -24405 61169 63993 -10266 -69607 -205365 -134024
24072a34024L0015P1791J1865j02089J9231M445n499L4857j4221j10250K7030
$$ -134024 -104009 -32218 -20353 -122442 -103211 -98766 -104265 -69408 -83629 -193879 -166849
24061a66849J30080M323O434P5728O4800R414N0847o929j08421r2634j00593O6816
$$ -166849 -36769 -32446 -26012 49716 114516 123930 174777 167848 59427 -33207 -133800 -66984
24049f6984O0414M8809M5205K1687M9130r610n3139j75001O862M8588O5661N2748
$$ -66984 -6570 42239 87444 109131 158261 148651 95512 -79489 -72627 -24039 41622 94370
24037I4370m8093p4816l5835R8337J6741j27917o5692J15776N7405l9844j8983
$$ 94370 46277 -28539 -64374 33963 50704 -77213 -142905 -27129 30276 -9568 -28551
24026b8551Q975K5712L7133N5955o8299r130l8200j06287l7199Q4778M8024o5488
$$ -28551 -19576 6136 43269 99224 30925 21795 -16405 -122692 -159891 -75113 -27089 -92577
24014i2577j06226L5614M7417O7792L6263k2360L0474j7820L157L1640N7240L1963
$$ -92577 -198803 -163189 -115772 -47980 -11717 -34077 -3603 -21423 -18266 13374 70614 102577
24002A02577l3285n8322l8440K1634O9155o24o426K8785M7611j1598n3911O9583
$$ 102577 69292 10970 -27470 -5836 63319 62695 56269 85054 132665 121067 67156 136739
23990A36739J5644J0027O4339j01359j11789m665M6426j6389R292o2906j6781
$$ 136739 152383 162410 226749 125390 13601 8936 55362 38973 48265 -14641 -31422
23979c1422N7503J18971j3034n3434p8216q2405l3002n220K9594R1082Q7141j4089
$$ -31422 26081 145052 132018 78584 368 -82037 -115039 -120259 -90665 417 87558 73469
23967G3469R208j7898o6177N1996J51468J0891n4613r2469n5237j07237q0404
$$ 73469 82677 64779 -1398 50598 202066 212957 158344 65875 10638 -96599 -177003
23956a77003n2504K4527M6116J4916J7021P7313N0602J1072q3881m427Q8103L4262
$$ -177003 -229507 -204980 -158864 -143948 -126927 -49614 988 12060 -71821 -76248 11855 46117
23944D6117q231K1489M661l1304j00310n2521J04615J24378l3297j01373o2503
$$ 46117 37886 59375 64036 32732 -67578 -120099 -15484 108894 75597 -25776 -88279
23933h8279Q6926l8992r1353O9670k1164M5288P491o9869j00034O4245k7611J9249
$$ -88279 -1353 -40345 -131698 -62028 -83192 -37904 -30413 -100282 -200316 -136071 -163682 -144433
23921a44433L8703J8800O5643N9313j6279p4508j8785J2912L868j30297l7502
$$ -144433 -105730 -86930 -21287 38026 21747 -52761 -71546 -58634 -54766 -185063 -222565
23910b22565J01931P2281Q7103q0251p3011O1136q449M3412J7982O1972l2283
$$ -222565 -120634 -48353 38750 -41501 -114512 -53376 -61825 -18413 -431 61541 29258
23899B9258j08452k6561n0123L6163L1064k5664o233L5636n4192r677K0384J17540
$$ 29258 -79194 -105755 -155878 -119715 -88651 -114315 -120548 -84912 -139104 -148781 -128397 -10857
23887a0857N0518n4662Q2345N6428k4346n0389l9771M2826M3120K1607K662j3978
$$ -10857 39661 -15001 67344 123772 99426 49037 9266 52092 95212 116819 119481 105503
23875A05503p1336n8801j2818P193k8397m4101N1943O762k9818l221k2440k3225
$$ 105503 34167 -24634 -37452 -30259 -58656 -102757 -50814 -44052 -73870 -77091 -99531 -122756
23863a22756J05517J51771L7280k8311n9145R098Q1304l8125M2945N7660p5333
$$ -122756 -17239 134532 171812 143501 84356 93454 174758 136633 179578 237238 161905
23852A61905j30206k3432k245L1631m4983L5761l7723r2448L1787P4028m3091
$$ 161905 31699 8267 6022 37653 -7330 28431 -9292 -101740 -69953 4075 -39016
23841c9016M3513m0398K0010l6367L8236J37300J4446K1962K4838k5568j32422
$$ -39016 4497 -35901 -15891 -52258 -14022 123278 137724 159686 184524 158956 26534
23830B6534j32195m586O2869n9329J12291J68611q3838j24573l1141l4235j8679
$$ 26534 -105661 -110247 -47378 -106707 5584 174195 90357 -34216 -65357 -99592 -118271
23819a18271N1962Q1356n3529o3694M5662J45843p9158K4742J7013r879p1434
$$ -118271 -66309 15047 -38482 -102176 -56514 89329 10171 34913 51926 42047 -29387
23808b9387L7974l9930K7840J23066K1801q6457q0412n3160n2633J0467K9614
$$ -29387 8587 -31343 -3503 119563 141364 54907 -25505 -78665 -131298 -120831 -91217
23797i1217N8484l4774k4478k2680J9467O5677J78850O9929K4374m5066j05021
$$ -91217 -32733 -67507 -91985 -114665 -95198 -29521 149329 219258 243632 198566 93545
23786I3545j39425O3094M8197M5402O6652k928j65951j8524L3948k1130Q6467
$$ 93545 -45880 17214 65411 110813 177465 174537 8586 -9938 24010 2880 89347
23775H9347n5804j19413m1405j0646K9635j9015m2413k4532K0444l3082l4620
$$ 89347 33543 -85870 -127275 -137921 -108286 -127301 -169714 -194246 -173802 -206884 -241504
23764b41504K01713N2967R3146l1777r9343j9519J5027J38811j3359j13719K5361
$$ -241504 -39791 13176 106322 74545 -24798 -44317 -29290 109521 96162 -17557 7804
23753G804J16677l846r1712k7024R8333k5940L538j50979j51270J69588O5487
$$ 7804 124481 120635 28923 1899 100232 74292 77830 -73149 -224419 -54831 10656
23742A0656k8557m6284l0085Q1094J00195P8827o6169r9629L2065j2464k143j3549
$$ 10656 -17901 -64185 -94270 -13176 87019 165846 99677 48 32113 19649 17506 3957
23730C957Q672O0986o8327j17095Q7788J26273j8742M1598N3082j4386q8163k8451
$$ 3957 12629 73615 5288 -111807 -24019 102254 83512 125110 178192 163806 75643 47192
23718D7192K2038N2131j67955q9148K1611k3322M2649M5792J55067M7816r2511
$$ 47192 69230 121361 -46594 -135742 -114131 -137453 -94804 -49012 106055 153871 61360
23707F1360n3290Q1693L7140N262j00758j17717J8284J91111L2594M0311q1256
$$ 61360 8070 89763 126903 132165 31407 -86310 -68026 123085 155679 195990 114734
23696A14734m6391Q360Q8741P1960p7136j22838l5433j9118j0762r943j06742
$$ 114734 68343 76703 165444 237404 160268 37430 1997 -17121 -27883 -37826 -144568
23685a44568J0972P908M2042N6051L6706k3020p9493L3089Q3160J0863l6125n5137
$$ -144568 -133596 -125688 -83646 -27595 9111 -13909 -93402 -60313 22847 33710 -2415 -57552
23673e7552o0985r0177l3503P614J44311J43740N882k8254M8577j11588l1154
$$ -57552 -118537 -208714 -242217 -234603 -90292 53448 59330 31076 79653 -31935 -63089
23662f3089J8253l1122M1752n6991n42J5809O1186p265r0239P6815O6215K4194
$$ -63089 -44836 -75958 -34206 -91197 -91739 -75930 -14744 -22009 -112248 -35433 30782 54976
23650E4976J08912m8726p3791L6000j0068p2305j33702R2241J07039J3589j12462
$$ 54976 163888 115162 41371 77371 67303 -5002 -138704 -46463 60576 74165 -38297
23639c8297o5069r544K2120O8218N2360l6918K4981K2070J21261j6002o1294n9699
$$ -38297 -103366 -112910 -90790 -22572 29788 -7130 17851 39921 161182 145180 83886 24187
23627B4187j47454m7962K4868J07127N4799l2884Q9446L0581L7136k3420j4743
$$ 24187 -123267 -171229 -146361 -39234 15565 -17319 72127 102708 139844 116424 101681
23616A01681P086L5424k8609j4973M4785L0543p233o3327N3415J2221j05404j57442
$$ 101681 108767 144191 115582 100609 145394 175937 168704 105377 158792 171013 65609 -91833
23604i1833R512Q6362J6950m9368l077Q4396n56m5460n2901j4880n4306l913J93223
$$ -91833 -82321 4041 20991 -28377 -31454 52942 52386 6926 -45975 -60855 -115161 -119074 74149
23591G4149J06804j4321j02708j10747M633p0204q6223j0934L4631l6245l5470
$$ 74149 180953 166632 63924 -46823 -42190 -112394 -198617 -209551 -174920 -211165 -246635
23580b46635J85859J67651N6074J4560m4309q1204n4152k9125k0002o370K5457
$$ -246635 -60776 106875 162949 177509 133200 51996 -2156 -31281 -51283 -57653 -32196
23569c2196L4623L7731N3953m0933N3987L5164q982N2944L8221J4894o5415j24856
$$ -32196 2427 40158 94111 53178 107165 142329 133347 186291 224512 239406 173991 49135
23557D9135k7292j31486K751N9539m595o1637j33967k2996M3065L3179P9020P3359
$$ 49135 21843 -109643 -106892 -47353 -51948 -113585 -247552 -270548 -227483 -194304 -115284 -41925
23545d1925l999J5116n4722N2340M2127j8318j6504J16516L7324n4865k844k4957
$$ -41925 -45924 -30808 -85530 -33190 8937 -9381 -25885 90631 127955 73090 70246 45289
23533D5289m7276Q8245Q7733n0234K4917L6768n9773r8497j7282L2459N2503k0791
$$ 45289 -1987 86258 173991 123757 148674 185442 125669 27172 9890 42349 94852 74061
23521G4061l6900K2107K2786j26658P247R4790l2765k8831p1827r5717r6957J5504
$$ 74061 37161 59268 82054 -44604 -37357 57433 24668 -4163 -75990 -171707 -268664 -253160
23509b53160J55429J60462k0512m3192M4328K3583l2140j0354p1006L1928k4546
$$ -253160 -97731 62731 42219 -973 43355 66938 34798 24444 -46562 -14634 -39180
23498c9180k7068k5693J8409L5448P9133L411L936M6705O773m7461J08430q5870
$$ -39180 -66248 -91941 -73532 -38084 41049 44460 48396 95101 101874 54413 162843 76973
23486G6973j32757q5399O2349K4880L6453l693L6944N1282l2858j21361m5871
$$ 76973 -55784 -141183 -78834 -53954 -17501 -21194 15750 67032 34174 -87187 -133058
23475a33058L3275J7421K3057M5452j3149j22652j13405J18174J39826P9654m722
$$ -133058 -99783 -82362 -59305 -13853 -27002 -149654 -263059 -144885 -5059 74595 69873
23464F9873m2549k36o413K5454q4905M0999R2297k780J7235M5992q7410o0881
$$ 69873 27324 27088 20675 46129 -38776 2223 94520 91740 108975 154967 67557 6676
23452F676j4418J24716P2463p6169j21027m7175K8787M1814l3412P7956L2944
$$ 6676 -7742 116974 189437 113268 -7759 -54934 -26147 15667 -17745 60211 93155
23441I3155n5482m6881j22600J1638J25554J1368l1965j1421J22814Q536j21556
$$ 93155 37673 -9208 -131808 -120170 5384 16752 -15213 -26634 96180 104716 -16840
23430a6840k040k0384M8091m1847J537k1174Q4812l908j2797J02925j2848J765
$$ -16840 -18880 -39264 8827 -33020 -31483 -52657 32155 28247 15450 118375 105527 107292
23418A07292k4522l8933J3973j062J610q235l2904p4660j07301J6057L3289J1239
$$ 107292 82770 43837 57810 56748 58358 50123 17219 -57441 -164742 -148685 -115396 -104157
23406a04157n0701L677J10901J08299r554L7943L7521j07879j4158J1081o1885
$$ -104157 -154858 -151181 -40280 68019 58465 96408 133929 26050 11892 22973 -38912
23395c8912K0058O6381j7793K3978j1876n0295m2889J5031j6573Q1556M4098o5993
$$ -38912 -18854 47527 29734 53712 41836 -8459 -51348 -36317 -52890 28666 72764 6771
23383F771P667k099j19362j6721l3598m2978J24839J16956r3448L3456O4696R6319
$$ 6771 14438 12339 -107023 -123744 -157342 -200320 -75481 41475 -51973 -18517 46179 142498
23371A42498n140R835M9281l5285r4917q9258J8686o1910p5461Q2507j18498K8747
$$ 142498 137358 147193 196474 161189 66272 -22986 -4300 -66210 -141671 -59164 -177662 -148915
23359a48915J84792l9125j6030j866q0127J31312o1551j18787n2343K8746N5056
$$ -148915 35877 -3248 -19278 -21144 -101271 30041 -31510 -150297 -202640 -173894 -118838
23348a18838L8962O2659K2431m8716k523o7770p7318M3584M8903j9300J12309
$$ -118838 -79876 -17217 5214 -43502 -46025 -113795 -191113 -147529 -98626 -117926 -5617
23337e617J28833j9101j37695q468P1814Q5120N6026n1826j04620p4314P9021
$$ -5617 123216 104115 -33580 -42048 29766 114886 170912 119086 14466 -59848 19173
23326A9173P541j24368K0283J22437o782k5061O7012j08691K9173M5980Q7415
$$ 19173 26714 -97654 -77371 45066 38284 13223 80235 -28456 717 46697 134112
23315A34112L2835k17L6210N8312p3166L519m2219o8108m9569r9306L2205J0652
$$ 134112 166947 166730 202940 261252 188086 191605 149386 81278 31709 -67597 -35392 -24740
23303b4740L298P9520n324l8740j8926l1455M5726o7114p1008O1733Q7299M4126
$$ -24740 -21442 58078 52754 14014 -4912 -36367 9359 -57755 -128763 -67030 20269 64395
23291F4395l1455N0751J03186m4274k2418j08499p8059m1444Q486R0961N3834
$$ 64395 32940 83691 186877 142603 120185 11686 -66373 -107817 -99331 -8370 45464
23280D5464j03912j3698M6704p2930J46694K2275j02270p548P688p606R758j9680
$$ 45464 -58448 -72146 -25442 -98372 48322 70597 -31673 -39221 -31533 -39139 -29381 -49061
23268d9061p5006l9355K1775O2115J03328O6495Q4037k5923j21722l7373N5248
$$ -49061 -124067 -163422 -141647 -79532 23796 90291 174328 148405 26683 -10690 44558
23257D4558P6741M5408j19401r7884J6385Q4202O6050J1343N975r0094l8947p4723
$$ 44558 121299 166707 47306 -50578 -34193 50009 116059 127402 133377 43283 4336 -70387
23245g0387n722P6726P1720P7234M2436l8956o0726l6297q0852m3763q979k4922
$$ -70387 -76109 617 72337 149571 192007 153051 92325 56028 -24824 -68587 -77566 -102488
23233a02488R4877j7300j03976k8920L8794N2963R5083m478m1659j1620q3926
$$ -102488 -7611 -24911 -128887 -157807 -119013 -66050 29033 24555 -17104 -28724 -112650
23222a12650L0492K6952J50074R3848j45144j42715k9726J04799N8375M3368n6417
$$ -112650 -82158 -55206 94868 188716 43572 -99143 -128869 -24070 34305 77673 21256
23211B1256M754j9258j54012J6895K3752L6470P5376Q5509K5887k2090o0828L1764
$$ 21256 26010 6752 -147260 -130365 -106613 -70143 5233 90742 116629 94539 33711 65475
23199F5475l980j07245J0750J1797o3012k6636N7510j0378o0288q9774K4285k0344
$$ 65475 61495 -45750 -35000 -23203 -86215 -112851 -55341 -65719 -126007 -215781 -191496 -211840
23187b11840P780K1203N4640k3398k1537O6493R1133J25852J039l4495q5116j45843
$$ -211840 -204060 -182857 -128217 -151615 -173152 -106659 -15526 110326 111365 76870 -8246 -154089
23175a54089j5955O9846q4001J5441L5015N3824R8737J05170M2052r9543n2957
$$ -154089 -170044 -100198 -184199 -168758 -133743 -79919 18818 123988 166040 66497 13540
23164A3540O577k1157O3613J2517Q4188p1202p6422l2244K2951N856l5655P5724
$$ 13540 20117 -1040 62573 75090 159278 88076 11654 -20590 2361 8217 -27438 48286
23152D8286M4837M1234N5893O1717j0441l9503m2625j4942l9379m7985q3216l6308
$$ 48286 93123 134357 190250 251967 241526 202023 159398 144456 105077 57092 -26124 -62432
23140f2432J21430N5683n2157o081J5670M3628j3775k4708m2449J211k9622j7649
$$ -62432 58998 114681 62524 56443 72113 115741 101966 77258 34809 36020 6398 -11251
23128a1251o0593K8220Q1688q5267q5848Q2909O7622k1530N3577J14809k8565
$$ -11251 -71844 -43624 38064 -47203 -133051 -50142 17480 -4050 49527 164336 135771
23117A35771o6160o0950j62797k4622J45811O0574N6290K1719J5443N5276K5599
$$ 135771 69611 8661 -154136 -178758 -32947 27627 83917 105636 121079 176355 201954
23106B01954j48392n1324l5341k2530j4841r1144o7433M4736Q5881P2106N5538
$$ 201954 53562 2238 -33103 -55633 -70474 -161618 -229051 -184315 -98434 -26328 29210
23095B9210n2920L6802J8514m7236J8018O1532M3699q9215m6836o5422j5820K7086
$$ 29210 -23710 13092 31606 -15630 2388 63920 107619 18404 -28432 -93854 -109674 -82588
23083h2588P5168P4613q3285o2110Q0386P6637n096o7661P076L7127M3587j07778
$$ -82588 -7420 67193 -16092 -78202 2184 78821 73725 6064 13140 50267 93854 -13924
23071a3924p7025J2394Q8838Q2114J6070k0668K6755M0056o5298J51901j354m2772
$$ -13924 -90949 -78555 10283 92397 108467 87799 114554 154610 89312 241213 239859 197087
23059A97087K5960p212q5176k6507o2541j02966L8919j9351q6651M7057O4073
$$ 197087 223047 215835 130659 104152 41611 -61355 -22436 -41787 -128438 -81381 -17308
23048a7308R5327n4468j26818L4136O4285K059l8327m7347j9782q131k4014j8780
$$ -17308 78019 23551 -103267 -69131 -4846 -2787 -41114 -88461 -108243 -116374 -140388 -159168
23036a59168Q6232M5572p02l5477Q0465j0659K2533j7697o6106p1385m8017q903
$$ -159168 -72936 -27364 -28066 -63543 16922 6263 28796 11099 -55007 -126392 -174409 -183312
23024a83312J47599l1291o6418K4237L8393J9794p9477m2622k5473L8420N3339
$$ -183312 -35713 -67004 -133422 -109185 -70792 -50998 -130475 -173097 -198570 -160150 -106811
23013a06811p0361q5356J35940J67099Q9217k9129N3246N4729p1145j29667r0895
$$ -106811 -177172 -262528 -126588 40511 129728 100599 153845 208574 137429 7762 -83133
23002h3133p2178R4499J3551P7486O9669p1885p8419J00164L1740j07362o0430
$$ -83133 -155311 -60812 -47261 30225 99894 28009 -50410 49754 81494 -25868 -86298
22991h6298P20m2824j31250j2439J61839M7128L5996o1693l0600N5925K9004m830
$$ -86298 -85578 -128402 -259652 -272091 -110252 -63124 -27128 -88821 -119421 -63496 -34492 -39322
22979c9322m5450j5054L5209J04975O2325L6447k0591J8541l8081N96j43421r8537
$$ -39322 -84772 -99826 -64617 40358 102683 139130 118539 137080 98999 99595 -43826 -142363
22967a42363R1331J05665m7461m3372n4705L710O8635M3499R0314Q0490j13755
$$ -142363 -51032 54633 7172 -36200 -90905 -87195 -18560 24939 115253 195743 81988
22956H1988r7264J05872m4801j02939l7289Q6464R6821n753o3377m2469P8725
$$ 81988 -15276 90596 45795 -57144 -94433 -7969 88852 83099 19722 -22747 55978
22945E5978j1502l0196P8797o1869j50418j8731P1745Q0590n0120l0022L8723
$$ 55978 44476 14280 93077 31208 -119210 -137941 -66196 14394 -35726 -65748 -27025
22934b7025o716o035J2258N513M3159j36857m3080R9920J01691J06277m1909j97707
$$ -27025 -33741 -39776 -27518 -22005 21154 -115703 -158783 -58863 42828 149105 107196 -90511
22922i0511n1277P4924K1409Q3989J36324j15418j47674j13968m4314J17363K2640
$$ -90511 -141788 -66864 -45455 38534 174858 59440 -88234 -202202 -246516 -129153 -106513
22911a06513O5806J4998r8339P3026J66820K4552m6861o2469m5395O256N0694
$$ -106513 -40707 -25709 -124048 -51022 115798 140350 93489 31020 -14375 -8119 42575
22900D2575j02282m6807J5872p933M0331Q7495p8613p3798J03182N8315q5306
$$ 42575 -59707 -106514 -90642 -98575 -58244 29251 -49362 -123160 -19978 38337 -46969
22889d6969P220J22167N4604r1521j03820l7179K5279j15632J4203L2402M7785
$$ -46969 -39749 82418 137022 45501 -58319 -95498 -70219 -185851 -171648 -139246 -91461
22878i1461l9474p371L8959J8565J7091N9332L1824j4557R841J6228q1088o8290
$$ -91461 -130935 -138306 -99347 -80782 -63691 -4359 27465 12908 22749 38977 -42111 -110401
22866a10401o816l8618Q9670N9723k9230o2024J7611Q3583j1665J0312J9413l2126
$$ -110401 -117217 -155835 -66165 -6442 -35672 -97696 -80085 3498 -8167 2145 21558 -10568
22854a0568q1416Q9352K5402K1480J2697l1346l1362L533N1888l7353m5626J9925
$$ -10568 -91984 -2632 22770 44250 56947 25601 -5761 -2228 49660 12307 -33319 -13394
22842a3394K378P0123N3314R059r148k7398o877r755r8058m6089K0333J0641O543
$$ -13394 -11016 59107 112421 121480 112332 84934 78057 68302 -29756 -75845 -55512 -44871 -38328
22829c8328K0217q2888L3144M9391O7243m0722N965k9316o1053O786m689M9138
$$ -38328 -18111 -100999 -67855 -18464 48779 8057 14022 -15294 -76347 -69561 -74250 -25112
22817b5112O6528L985K6113q8044m8749O3809o616p6186o8195j4426L3322o428
$$ -25112 41416 45401 71514 -16530 -65279 -1470 -8086 -84272 -152467 -166893 -133571 -139999
22805a39999N8394O3484L4354M6944q556l2030k6778K9250l8297M2301n0381q1300
$$ -139999 -81605 -18121 16233 63177 54621 22591 -4187 25063 -13234 29067 -21314 -102614
22793a02614O9243K2611m0583M4033M1243P5535N8502M4949j01148j08652n2309
$$ -102614 -33371 -10760 -51343 -7310 33933 109468 167970 212919 111771 3119 -49190
22782d9190k6278r51N8514K5204m8375l9520J6944K7589P8268Q8269l1090p4926
$$ -49190 -75468 -76419 -17905 7299 -41076 -80596 -63652 -36063 42205 130474 99384 24458
22770B4458m1634p89J2376j2190o9150l8144M7840n585j2583K3852N1535m3645
$$ 24458 -17176 -17965 -5589 -17779 -86929 -125073 -77233 -82818 -95401 -71549 -20014 -63659
22758f3659q558k171N6149r747O042j45R2073M8790m7678q5678l103N8047j24439
$$ -63659 -72217 -74388 -18239 -27986 -21944 -22089 69984 118774 71096 -14582 -17685 40362 -84077
22745h4077j32518K4170N6223J13370N8637M4456l8207r9796j15896k4144M2953
$$ -84077 -216595 -192425 -136202 -22832 35805 80261 42054 -57742 -173638 -197782 -154829
22734a54829K00278K5405k6024L997K519n9802k3050J6109N500j31435l4702N1707
$$ -154829 45449 70854 44830 48827 51346 -8456 -31506 -15397 -9897 -141332 -176034 -124327
22722a24327P546O0573j369r489P2556N8569n1338n0468M8782K7491M8605N547
$$ -124327 -116781 -56208 -57577 -67066 5490 64059 12721 -37747 11035 38526 87131 92678
22710I2678k8802J6505j5622K0683K691p5301M1735j2686K3930J8335j10281n8846
$$ 92678 63876 80381 64759 85442 88133 12832 54567 41881 65811 84146 -26135 -84981
22698h4981K7700j8414K9224J38629p937l086M6866J1420p7250q8394k1864Q9421
$$ -84981 -57281 -75695 -46471 92158 84221 81135 128001 139421 62171 -26223 -48087 41334
22686D1334J35936O0786q2659p1147j16891m6834N5160O6536m3102m0770r637
$$ 41334 177270 238056 155397 84250 -32641 -79475 -24315 42221 -881 -41651 -51288
22675e1288q265k4149Q9322J4820q9858l9475M4026K1567j3593L4579p3931o5751
$$ -51288 -59553 -83702 5620 20440 -69418 -108893 -64867 -43300 -56893 -22314 -96245 -161996
22663a61996P4510M8613k6467L5903P0736j05224m8279l1151J04959P0626r7098
$$ -161996 -87486 -38873 -65340 -29437 41299 -63925 -112204 -143355 -38396 32230 -64868
22652f4868r0749j5294L0853Q6940M7481m3827O7311J3291J1635q9862J6759P0001
$$ -64868 -155617 -170911 -140058 -53118 -5637 -49464 17847 31138 42773 -47089 -30330 39671
22640C9671N0098r839j19643j08701L7133N7838m7167j7343P4559J38358l1445
$$ 39671 89769 79930 -39713 -148414 -111281 -53443 -100610 -117953 -43394 94964 63519
22629F3519l5587N8084L2633j15826J14M3241R916r2153R2861K7378q5430Q0578
$$ 63519 27932 86016 118649 2823 2937 46178 56094 -36059 56802 84180 -1250 79328
22617G9328n944q7393m1204J9848P98J221L0200K7654j02909K377o8708q1109
$$ 79328 73384 -14009 -55213 -35365 -34567 -33346 -3146 24508 -78401 -76024 -144732 -225841
22605b25841M0105K3479J3779N6671P7015R410j16958q7751J48446J48268L2256
$$ -225841 -185736 -162257 -148478 -91807 -14792 -5382 -122340 -210091 -61645 86623 118879
22594A18879j47295m6777M4042j773n9955j4457K0235L2779K2545K5762R521Q0633
$$ 118879 -28416 -75193 -31151 -32924 -92879 -107336 -87101 -54322 -31777 -6015 3506 84139
22582H4139L6461m9069J1164L0897M3902n9252o1996l4545K4833Q740m544l7348
$$ 84139 120600 71531 82695 113592 157494 98242 36246 1701 26534 35274 30730 -6618
22570f618o6022k6188j4704l7519J3032L8075N1903k4264p2834P0437m482J11782
$$ -6618 -72640 -98828 -113532 -151051 -138019 -99944 -48041 -72305 -145139 -74702 -79184 32598
22558C2598J28318J7637k3350j3040q4057M5743M7461K9767n6134m7304R515l3496
$$ 32598 160916 178553 155203 142163 58106 103849 151310 181077 124943 77639 87154 53658
22546E3658j36827O60N9244m7865j0822M3301J51591P2929K6417j04360j08745
$$ 53658 -83169 -82509 -23265 -71130 -81952 -38651 112940 185869 212286 107926 -819
22535h19j4590r624J08526Q8052m2743p4501q9970M6655k5896q9274l9486J02223
$$ -819 -15409 -25033 83493 171545 128802 54301 -35669 10986 -14910 -104184 -143670 -41447
22523d1447O6431L0887L636j00584j79487Q2179N9526J0828k4191L8621M1662
$$ -41447 24984 55871 59507 -41077 -220564 -138385 -78859 -68031 -92222 -53601 -11939
22512a1939L5549m5396N1982N0431M1617k6888P287K4496L3536l6702m4102K462
$$ -11939 23610 -21786 30196 80627 122244 95356 102643 127139 160675 123973 79871 82333
22500H2333k0081J5193o3907k6145J09156J19743K9075k4164J5278o9855j28916
$$ 82333 62252 77445 13538 -12607 96549 216292 245367 221203 236481 166626 37710
22489C7710n9429J5106l0095Q8219J10036o3653p4461o9427K0116M821k8319R9773
$$ 37710 -21719 -6613 -36708 51511 161547 97894 23433 -45994 -25878 -21057 -49376 50397
22477E0397K5238P9681P1572m1052j07174j14506M9330N2655q1353l3130Q5243
$$ 50397 75635 155316 226888 185836 78662 -35844 13486 66141 -15212 -48342 36901
22466C6901P3760j71493q7683K8663L4795L2126O8661L9768n2448k8472l9734
$$ 36901 110661 -60832 -148515 -119852 -85057 -52931 15730 55498 3050 -25422 -65156
22455f5156M2678L8607p962O6943j4988K6198q8964m963O3330Q6214L8588j64075
$$ -65156 -22478 16129 8167 75110 60122 86320 -2644 -7607 55723 141937 180525 16450
22443A6450o0583j345r9423j2361N4944Q5161M4920o0131o0279m7401J1712N9648
$$ 16450 -44133 -45478 -144901 -157262 -102318 -17157 27763 -32368 -92647 -140048 -128336 -68688
22431f8688K8024J8357M6373k2814j05919p2575Q4892J35912j5327j09158m9239
$$ -68688 -40664 -22307 24066 1252 -104667 -177242 -92350 43562 28235 -80923 -130162
22420a30162J2075Q565j5860L518l2805O1846M2157J8174o6628M615J25586l04
$$ -130162 -118087 -109522 -125382 -121864 -154669 -92823 -50666 -32492 -99120 -94505 31081 30777
22408C0777M4071J5508K3992K8083l7607n791L0357J6347m9594n6863J2218L5112
$$ 30777 74848 90356 114348 142431 104824 99033 129390 145737 96143 39280 51498 86610
22396H6610o8121k1564j4203j842Q8622q9466j20122L9212o387P8178J05257L3358
$$ 86610 18489 -3075 -17278 -19120 69502 -19964 -140086 -100874 -107261 -29083 76174 109532
22384A09532q6306j8487Q6445l3414J09894r856j12345r8692K8450K4299k9610
$$ 109532 23226 4739 91184 57770 167664 157808 45463 -53229 -24779 -480 -30090
22373c0090q400R814j720K6472J8200k9323j3339N5314m9445k09778M3737L3918
$$ -30090 -38490 -28676 -30396 -3924 14276 -15047 -28386 26928 -22517 -232295 -188558 -154640
22361a54640J7971J18686N8884q8651M4830R2345m5231p4313n4984n5205K8942
$$ -154640 -136669 -17983 40901 -47750 -2920 89425 44194 -30119 -85103 -140308 -111366
22350a11366N7282J08628N8005m0547j07293j7017P2863K5575K1894L1376J6061
$$ -111366 -54084 54544 112549 72002 -35291 -52308 20555 46130 68024 99400 115461
22339A15461o8200j00836j15495N177J01406J03899P6378p0576k7474J24626L9533
$$ 115461 47261 -53575 -169070 -163893 -62487 41412 117790 47214 19740 144366 183899
22328A83899P1083l0569q7875m4033j4496m7336O8950n6516j09474k0272N9559
$$ 183899 254982 224413 136538 92505 78009 30673 99623 43107 -66367 -86639 -27080
22317b7080p878m7279n4254k088R7382N0361m9265J5586K3992n4506J0982Q3065
$$ -27080 -34958 -82237 -136491 -138579 -41197 9164 -40101 -24515 -523 -55029 -44047 39018
22305C9018l9810P6716j2414l9198p8200p1692m5645J2885M9273J34211R05Q830
$$ 39018 -792 75924 63510 24312 -53888 -125580 -171225 -158340 -109067 25144 26049 34879
22293C4879m2457K3132L4483M461o9557J5815L9311p3037n2545Q7115P8483L1351
$$ 34879 -7578 15554 50037 54498 -15059 756 40067 -32970 -85515 1600 80083 111434
22281A11434j1487m954r7882o5199J0701n2608N439M9249J05256j9652j96134
$$ 111434 99947 94993 -2889 -68088 -57387 -109995 -104556 -55307 49949 30297 -165837
22270a65837P051O0506l9520R936L9624J36018M6589r177n2014p390k3003J301
$$ -165837 -158786 -98280 -137800 -127864 -88240 47778 94367 85190 33176 25786 2783 4084
22258D084o8557l1734J35353K3696l0488k8244l3579J00172K583j7049n4423m2658
$$ 4084 -64473 -96207 39146 62842 32354 4110 -29469 70703 73286 56237 1814 -40844
22246d0844J2519q9290j2035N7745Q3317o2029m7315J5935N2083M4322K4189j7901
$$ -40844 -28325 -117615 -129650 -71905 11412 -50617 -97932 -81997 -29914 14408 38597 20696
22234B0696O5804L677O5143k1585j18169r5061r9730L9159J390N804M9477n2176
$$ 20696 86500 90177 155320 133735 15566 -79495 -179225 -140066 -138676 -132872 -83395 -135571
22222a35571J16281L8842J4513k4993K1052q0374j5921M9787O001q4566j1771
$$ -135571 -19290 19552 34065 9072 30124 -50250 -66171 -16384 -10383 -94949 -106720
22211a06720K203k9832O8975Q9241j012L4174J0439n6685j15351J11995R9379
$$ -106720 -104517 -134349 -65374 23867 22855 57029 67468 10783 -104568 7427 106806
22200A06806M4957p9189j03902l1198j09132L6735K9829k604L2478Q37R2540o302
$$ 106806 151763 72574 -31328 -62526 -171658 -134923 -105094 -107698 -75220 -74383 18157 11855
22188A1855p7732o588M7862J55308m0384r9030J7246J8899m8086K0211K0666o5312
$$ 11855 -65877 -72465 -24603 130705 90321 -8709 8537 27436 -20650 -439 20227 -45085
22176d5085k9896j34773q2841N9753J22929p1657P032Q3520K04977N7003p6020
$$ -45085 -74981 -209754 -292595 -232842 -109913 -181570 -174538 -91018 113959 170962 94942
22165I4942l4864m3771l5843P395k8047L6857j0008L0944k9439k0178n2869O8971
$$ 94942 60078 16307 -19536 -12141 -40188 -3331 -13339 17605 -11834 -32012 -84881 -15910
22153a5910P0247m8600p9492o9587M5912J02082R242l3556k1211n318n5740M9943
$$ -15910 54337 5737 -73755 -143342 -97430 4652 13894 -19662 -40873 -46191 -101931 -51988
22141e1988N2845l8430m5893q2211J0477J34860J05407Q1452q0870k7599k9721
$$ -51988 857 -37573 -83466 -165677 -155200 -20340 85067 166519 85649 58050 28329
22130B8329K3001P1485N520n7383K5008Q06m4076j8677j8012J1658j1135j18723
$$ 28329 51330 122815 128335 70952 95960 96766 52690 34013 16001 27659 16524 -102199
22118a02199j1919J1119J16888Q5371L9244k29748r849J63521R4709l2135r3751
$$ -102199 -114118 -102999 13889 99260 138504 -91244 -101093 62428 157137 125002 31251
22107C1251o940O634k9212P4089l4673l6254l784L0863R9884O733q7101M0308
$$ 31251 24311 30945 1733 75822 41149 4895 1111 31974 131858 138591 51490 91798
22095I1798p7945k9942O7882M3661J4830l5643J00742L8625l4942m6221k7042
$$ 91798 13853 -16089 51793 95454 110284 74641 175383 214008 179066 132845 105803
22084A05803j30329q9329Q2246J69474j06902p4951J26322M5246o2274N9448M5433
$$ 105803 -24526 -113855 -31609 137865 30963 -43988 82334 127580 65306 124754 170187
22073A70187K9441n0286j08120o0583N7648r881O5121j8316j61026P74P7114J2502
$$ 170187 199628 149342 41222 -19361 38287 28406 93527 75211 -85815 -85041 -7927 4575
22061D575j2225k6224M515L5792L9782l8283k0376n831j19120m3928M9100n369
$$ 4575 -7650 -33874 -29359 6433 46215 7932 -12444 -18275 -137395 -181323 -132223 -137592
22049a37592M1633m073J3356n3372j0870P9521N1167J62144m6455j85246p2502
$$ -137592 -95959 -100032 -86676 -140048 -150918 -71397 -20230 141914 95459 -89787 -162289
22038a62289M9367J08887J2785o0564n1337K5325n5039r885O7337l9555L8128
$$ -162289 -112922 -4035 8750 -51814 -103151 -77826 -132865 -142750 -75413 -114968 -76840
22027g6840P6907L4378j4989l4556O5422N2724J9837Q530o1780j7675P0n1136
$$ -76840 67 34445 19456 -15100 50322 103046 122883 131413 69633 51958 52028 892
22015H92M8208J59573m4124j25558Q766K4709L3447m9281j09694j9762M0352p691
$$ 892 49100 208673 164549 38991 47757 72466 105913 56632 -53062 -72824 -32472 -40163
22003d0163j6060J7394J23733N0324k2173L587m0810K25N9481J8480m7527j08251
$$ -40163 -56223 -38829 84904 135228 113055 116642 75832 76057 135538 154018 106491 -1760
21991a760J5844l4661k3578O283j5236K9288P1031L1997j61012r338n4319l9709
$$ -1760 14084 -20577 -44155 -37872 -53108 -23820 47211 79208 -81804 -91142 -145461 -185170
21979a85170k3391N5273M8250K3075P4290k2574m4975P8966Q0117L7289L7525
$$ -185170 -208561 -153288 -105038 -81963 -7673 -30247 -75222 3744 83861 121150 158675
21968A58675M6998j38831q7759q119L3555j8901j24m59n8146o9402o840l0983
$$ 158675 205673 66842 -20917 -29036 4519 -14382 -14506 -14965 -73111 -142513 -149353 -180336
21956a80336L3467J9473p1757J8044N8347O4826l55N541M5669m4889p8203N463
$$ -180336 -146869 -127396 -199153 -181109 -122762 -57936 -58291 -52750 -7081 -51970 -130173 -124710
21944a24710j28373O2168J21279M1591j6739O7387O545r0129q827J06792j3667
$$ -124710 -253083 -190915 -69636 -28045 -44784 22603 29148 -60981 -69808 36984 23317
21933B3317M4233l9094l1270r1871N6673J19889L6913j4291j28494j06175K863
$$ 23317 67550 28456 -2814 -94685 -38012 81877 118790 104499 -23995 -130170 -127307
21922a27307P9891o535p5695r5544r0299J04494Q3768o2803m6776J06842O6113
$$ -127307 -47416 -53951 -129646 -225190 -315489 -210995 -127227 -190030 -236806 -129964 -63851
21911f3851J33262r142j06178p52M7846K3888j16915m1679K0058K7259N4299J233
$$ -63851 69411 60269 -45909 -46661 1185 25073 -91842 -133521 -113463 -86204 -31905 -30672
21899c0672j01343J15963M3582l5732n4450q543o37K0655q861K4709m4616P5955
$$ -30672 -132015 -16052 27530 -8202 -62652 -71195 -71832 -51177 -60038 -35329 -79945 -3990
21887c990O7893M5681M245k8323N8019j11841n2424Q1469J0083j37111k3686q523
$$ -3990 63903 109584 113829 85506 143525 31684 -20740 60729 70812 -66299 -89985 -98508
21875i8508J26057Q1062p143j4814j09987L5465O6685n6551o1737R5265N535j59169
$$ -98508 27549 108611 101468 86654 -23333 12132 78817 22266 -39471 55794 61329 -97840
21863i7840p465M0642M8150J14742k5804j14423O281J09245m8027N559P6033J30868
$$ -97840 -105305 -64663 -16513 98229 72425 -41998 -35717 73528 25501 31060 107093 237961
21851B37961j5447p1497J3488k2923r4270l3836r3781L080J02863J31991k32j40469
$$ 237961 222514 151017 164505 141582 47312 13476 -80305 -77225 25638 157629 157397 16928
21839A6928m5544k4254L166N2485q871m193K2338P3285q7263N5325M9046o5217
$$ 16928 -28616 -52870 -49704 2781 -6090 -10283 12055 85340 -1923 53402 102448 37231
21827C7231k5398k2803j04637M7217J06764r4139o9949M2228N8201k62n775l968
$$ 37231 11833 -10970 -115607 -68390 38374 -55765 -125714 -83486 -25285 -25547 -31322 -35290
21815c5290m3204O5759J02598N9995N9159l272l1366m1700n6054o1139r8333K5243
$$ -35290 -78494 -12735 89863 149858 209017 205745 174379 132679 76625 15486 -82847 -57604
21803e7604J50262j7044j1171K919L126p5354Q5339P5595j7297N0864j47658m9400
$$ -57604 92658 75614 64443 67362 70488 -4866 80473 156068 138771 189635 41977 -7423
21791g423n466l089K0199l1337n0451L1006L3565K8397m3049M39O492o4191k1066
$$ -7423 -12889 -15978 4221 -27116 -77567 -46561 -12996 15401 -27648 -27209 -20717 -84908 -105974
21778a05974L7956j3500m2545R1617J00984k6902J2583j5656K8023J8961o1195
$$ -105974 -68018 -81518 -124063 -32446 68538 41636 54219 38563 66586 85547 24352
21767B4352L6199L2290J0170m1111j14933j22912P6075j7687p0625j991N5480
$$ 24352 60551 92841 103011 61900 -53033 -175945 -99870 -117557 -188182 -190173 -134693
21756a34693P5186M0121k2390m668p2915j6844P3018Q1277J5552k3125J5788k8903
$$ -134693 -59507 -19386 -41776 -46444 -119359 -136203 -63185 18092 33644 10519 26307 -2596
21744b596j23199J3489M7706J1494Q0731K2518j4928O7098l0327L2838N3566n7389
$$ -2596 -125795 -112306 -64600 -53106 27625 50143 35215 102313 71986 104824 158390 101001
21732A01001j12839m3240J47042L1206j93794r1180O0785L7787m6658J10223O8483
$$ 101001 -11838 -55078 91964 123170 -70624 -161804 -101019 -63232 -109890 333 68816
21721F8816R8671L5586n734k728l982k2821m8382k1110n2229l7931p0902p6275
$$ 68816 167487 203073 197339 194611 190629 167808 119426 98316 46087 8156 -62746 -139021
21709a39021J03331K23775o8216o3402k3522K4187q081l4510J0796J65804n8443
$$ -139021 -35690 188085 119869 56467 32945 57132 49051 14541 25337 191141 132698
21698A32698j70056j7295J27885J2859n7612j4441N7166J597j0548k0754M4322
$$ 132698 -37358 -54653 73232 86091 28479 14038 71204 72801 62253 41499 85821
21687H5821K5130L6822q8865k0970j3872O8346n5047o3623n8254R431M436J06774
$$ 85821 110951 147773 58908 37938 24066 92412 37365 -26258 -84512 -75081 -70645 36129
21675C6129n7799J2648L2511l1187j4398k0617q8512m224J03488j7183p8071L6104
$$ 36129 -21670 -9022 23489 -7698 -22096 -42713 -131225 -135449 -31961 -49144 -127215 -91111
21663i1111N2754j6053L0838J77646m4872k19584k0649M8976O2502O218r3927
$$ -91111 -38357 -54410 -23572 154074 109202 -110382 -131031 -82055 -19553 -13335 -107262
21652a07262J17577k3418j119p3802p77M7225J952l1797k8963K0066J8180J1826
$$ -107262 10315 -13103 -14222 -88024 -88801 -41576 -39624 -71421 -100384 -80318 -62138 -50312
21640e0312j8133j11153O5534Q3464n6114L7940K8483m4921K1916M3690k2392
$$ -50312 -68445 -179598 -114064 -30600 -86714 -48774 -20291 -65212 -43296 394 -21998
21629b1998J9253m9549j36717O5789N6563j6867L6558J6034k6326n3511L574Q1376
$$ -21998 -2745 -52294 -189011 -123222 -66659 -83526 -46968 -30934 -57260 -110771 -107197 -25821
21617b5821J40471M9234j13836P891J857q1999k8597L1142k3527Q1284M5476n9605
$$ -25821 114650 163884 50048 57939 59796 -22203 -50800 -19658 -43185 38099 83575 23970
21605B3970o8587R2811O4880J25022p728j28079m7198M3204J00810R3607k8907
$$ 23970 -44617 48194 113074 238096 230368 102289 55091 98295 199105 292712 263805
21594B63805l0186l3098l4396j68024o1868O485j3300Q3714p089m0916Q3515o6798
$$ 263805 233619 200521 166125 -1899 -63767 -57282 -70582 13132 6043 -34873 48642 -18156
21582a8156l6080M2462r466o4588J3016L6765P6768J9241j11281r0748M0808M5576
$$ -18156 -54236 -11774 -21240 -85828 -72812 -36047 40721 59962 -51319 -142067 -101259 -55683
21570e5683l8819J93800L7614j83043m6065P2494j28727K4247J21879J02615L2202
$$ -55683 -94502 99298 136912 -46131 -92196 -19702 -148429 -124182 -2303 100312 132514
21559A32514r249N870j00777O3692J9290q1374j06203o8521P9401J13833K1034
$$ 132514 123265 129135 28358 92050 111340 29966 -76237 -144758 -65357 48476 69510
21548F9510m6014N4104l016j55937r051k8396n6272J821M8231J36474M9653M3386
$$ 69510 23496 77600 74584 -81353 -90404 -118800 -175072 -173251 -125020 11454 61107 104493
21536A04493M2757q0447q6692J5620P1572k4841o0266l5159J5060O3515M2567
$$ 104493 147250 66803 -19889 -4269 67303 42462 -17804 -52963 -37903 25612 68179
21525F8179N1653K2390j23706q7754m6503Q0496P9638K1080M1166q1380j3044
$$ 68179 119832 142222 18516 -69238 -115741 -35245 44393 65473 106639 25259 12215
21514A2215J0490R5188m9841j34986j17663k5767J8587L6566J02533k5712j28518
$$ 12215 22705 117893 68052 -66934 -184597 -210364 -191777 -155211 -52678 -78390 -206908
21503b06908o2241J77624J11494o0427n4927N5676o3017M202J14965N9885J6281
$$ -206908 -269149 -91525 19969 -40458 -95385 -39709 -102726 -98524 16441 76326 92607
21492I2607k4047N7513J5592j13543k4524o584j5539j05224P7230M5888K1518
$$ 92607 68560 126073 141665 28122 3598 -2986 -18525 -123749 -46519 -631 20887
21481B0887o1367l7327J02149P568r5232R797K662M53M1552N188O7241m5424J0378
$$ 20887 -40480 -77807 24342 31910 -63322 -53525 -50863 -50410 -8858 -3670 63571 18147 28525
21468B8525k6455p3572k2015O1942O0238n1391k3113p5134o3584j0142J3303M1844
$$ 28525 2070 -71502 -93517 -31575 28663 -22728 -45841 -120975 -184559 -194701 -181398 -139554
21456a39554L8971N7143o0245p5131j7778Q1284k907P131O0686O2633L0147m3976
$$ -139554 -100583 -43440 -103685 -178816 -196594 -115310 -118217 -111086 -50400 12233 42380 -1596
21444a596j50618j18161L4304Q3306J04058K8333Q4390J24188j11720k9230L6016
$$ -1596 -152214 -270375 -236071 -152765 -48707 -20374 64016 188204 76484 47254 83270
21433H3270k7063l4626k3394l6057J5028k3434j05153n6938J37029J43151j5004
$$ 83270 56207 21581 -1813 -37870 -22842 -46276 -151429 -208367 -71338 71813 56809
21422E6809M3773k9808M0202m7012J5558J7007j21097r382Q2912L336J1180k2640
$$ 56809 100582 70774 110976 63964 79522 96529 -24568 -33950 48962 52298 63478 40838
21410D0838q683N4333l5375k4102j247L7255l362L1306L0382M4652j15052K8351
$$ 40838 32155 86488 51113 27011 25764 63019 59657 90963 121345 165997 50945 79296
21398G9296N895j00268n7642l0996J29470J41569j00447o3811k8321M6510k673
$$ 79296 85191 -15077 -72719 -103715 25755 167324 66877 3066 -25255 21255 18582
21387A8582o0893r4774p815P9529Q3721q7970p2341k9334L459r436J14217J31946
$$ 18582 -42311 -137085 -144900 -65371 18350 -69620 -141961 -171295 -167836 -177272 -63055 68891
21375F8891j9198N190R2872j28014o3734K4501l6847K9605q7029o6849K0094N5233
$$ 68891 49693 54883 147755 19741 -43993 -19492 -56339 -26734 -113763 -180612 -160518 -105285
21363a05285N5000O2833o0389O226L6439J3580N629n2199M2933N5437R1477l2737
$$ -105285 -50285 12548 -47841 -41615 -5176 8404 14033 -38166 4767 60204 151681 118944
21351A18944n1108p3115k5463P8961M2115q3314n5709m5512J1791o735R635Q1917
$$ 118944 67836 -5279 -30742 48219 90334 7020 -48689 -94201 -82410 -89145 -79510 2407
21339B407j8126J309Q3135M9586k4709n5280l3646m2418m4635r9989J1181J49991
$$ 2407 -15719 -14410 68725 118311 93602 38322 4676 -37742 -82377 -182366 -171185 -21194
21327b1194Q326j7097K2147n80k8622P747o834j07885k1802J6734l3983O2444
$$ -21194 -12868 -29965 -7818 -8398 -37020 -29273 -36107 -143992 -165794 -149060 -183043 -120599
21315a20599j7129l0155Q6103L5300P3907J37838Q476o8362J2337m2752j5191
$$ -120599 -137728 -167883 -81780 -46480 27427 165265 173741 105379 117716 74964 59773
21304E9773l3100m2202M9018p782n8569P6536R627J1977o4200J0149R3419L3906
$$ 59773 26673 -15529 33489 25707 -32862 43674 53301 65278 1078 11227 104646 138552
21292A38552l7691p0534k0454O7938Q4848L9245j22666j57606k8439P9143L8634
$$ 138552 100861 30327 9873 77811 162659 201904 79238 -78368 -106807 -27664 10970
21281A0970k1327P5814P3438j4419r597j19364q4690q562J6321J6488O402j4490
$$ 10970 -10357 65457 138895 124476 114879 -4485 -89175 -97737 -81416 -64928 -58526 -73016
21269g3016j13858O7005J02744K8056j8678n8941R7410o833M907J1689m4966J4148
$$ -73016 -186874 -119869 -17125 10931 -7747 -66688 30722 23889 28796 40485 -4481 9667
21257I667j563o3050j00715P4969O3381J12968m7008P339l0995j0533L0995m9728
$$ 9667 8104 -54946 -155661 -80692 -17311 95657 48649 55988 24993 14460 45455 -4273
21245d273j04119j54103J58443J34199k0907J3662j03801l1646l1788m7889K1893
$$ -4273 -108392 -262495 -104052 30147 9240 22902 -80899 -112545 -144333 -192222 -170329
21234a70329J50278P0658r3024M8161M2631M5063J30881j892k47401j61974p1139
$$ -170329 -20051 50607 -42417 5744 48375 93438 224319 222427 -24974 -186948 -258087
21223b58087l1965J14232K26952J04508m9032O2461L4924k1419j5018o1597m2870
$$ -258087 -290052 -175820 51132 155640 106608 169069 203993 182574 167556 105959 63089
21212F3089j9314k467j03497R889J63047L8242n0169m5775o9072o7714r7567J27619
$$ 63089 43775 41308 -62189 -52300 110747 148989 98820 53045 -16027 -83741 -181308 -53689
21200e3689k9090m1864M4458k8487r3985L1817Q8777P1232l3312j09013k1288
$$ -53689 -82779 -124643 -80185 -108672 -202657 -170840 -82063 -10831 -44143 -153156 -174444
21189a74444J32821N7940m5627L034k0313n381p5110N7584L0316o6422r2096P4803
$$ -174444 -41623 16317 -29310 -26276 -46589 -51970 -127080 -69496 -39180 -105602 -197698 -122895
21177a22895R4191J36365n5960j77739p974k440L6733J6692N3628R3139R694M9074
$$ -122895 -28704 107661 51701 -126038 -134012 -136452 -99719 -83027 -29399 63740 73434 122508
21165A22508O2425j6174l8689l2290m6595J0172o9286K1537l0362q4958j435Q8660
$$ 122508 184933 168759 130070 97780 51185 61357 -7929 13608 -16754 -101712 -103147 -14487
21153a4487Q8118M0037q181m7846j40239J6280j5707o50L6919L0079j5037k5527
$$ -14487 73631 113668 105487 57641 -82598 -66318 -82025 -82675 -45756 -15677 -30714 -56241
21141e6241O0131J1116n4782P9668K4311o7300n2979J13515J17124r9830n4475
$$ -56241 3890 15006 -39776 39892 64203 -3097 -56076 57439 174563 74733 20258
21130B0258L0876r810o4962M8373p7822k9614J2037M4252L5156P7638n2938J19100
$$ 20258 51134 41324 -23638 24735 -53087 -82701 -70664 -26412 8744 86382 33444 152544
21118A52544l2602j05009J1789R574p393n9781n8036K6473N0792L2834j39594
$$ 152544 119942 14933 26722 36296 28903 -30878 -88914 -62441 -11649 21185 -118409
21107a18409l5513J7456l0639k5415Q1193M0474M3658K4490l6021n2943Q7573
$$ -118409 -153922 -136466 -167105 -192520 -111327 -70853 -27195 -2705 -38726 -91669 -4096
21096d096K5997r632j6918L3863Q1373K5260r8959l4617J06302M1878K961k6897
$$ -4096 21901 12269 -4649 29214 110587 135847 36888 2271 108573 150451 153412 126515
21084A26515o0724J3020J44153n0452k1061M2795j24555r3773M313j7391r689
$$ 126515 65791 78811 222964 172512 151451 194246 69691 -24082 -19769 -37160 -46849
21073d6849j5449m324n3800P685J12216Q6308n4229n0418k3254p0877J56957L7988
$$ -46849 -62298 -66622 -120422 -112737 -521 85787 31558 -18860 -42114 -112991 43966 81954
21061H1954k9470J5179J5076m2846n5806n0543K7920N0834O7944l4084j9300l6359
$$ 81954 52484 67663 82739 39893 -15913 -66456 -38536 12298 80242 46158 26858 -9501
21049i501K1322Q2229p2737j854o8917j00166q3215L210K34820J13377j581p375
$$ -9501 11821 94050 21313 19459 -49458 -149624 -232839 -229629 5191 118568 116987 109612
21037A09612n6773l3311p2881l7707K7471L3937j9758k4200R598J2551K8591n7627
$$ 109612 52839 19528 -53353 -91060 -63589 -29652 -49410 -73610 -64012 -51461 -22870 -80497
21025h0497R094o6145P7997l1938o8737k6644J15221J47501O4614q1051k4691
$$ -80497 -71403 -137548 -59551 -91489 -160226 -186870 -71649 75852 140466 59415 34724
21014C4724Q9832P4481k5035p2370m3639n5974P8665M0674o9278j15877o7742
$$ 34724 124556 199037 174002 101632 57993 2019 80684 121358 52080 -63797 -131539
21003a31539L5304L0099L6719R665K2781k1677K5799J6420m801o1250M8869J09141
$$ -131539 -96235 -66136 -29417 -19752 3029 -18648 7151 23571 18770 -42480 6389 115530
20991A15530j0290n8290K701j262o980l0384R0002L0662j0662K2484k7066k7824
$$ 115530 105240 46950 49651 48389 41409 11025 101027 131689 121027 143511 116445 88621
20979H8621J1403k6243p9150k6187J0372L421r0181J5353K2887J8458o6502J5293
$$ 88621 100024 73781 -5369 -31556 -21184 -17763 -107944 -92591 -69704 -51246 -117748 -102455
20967a02455N4741m8074o6602j9761J68897M4825l8578o4473o24j5059O1474J10830
$$ -102455 -47714 -95788 -162390 -182151 -13254 31571 -7007 -71480 -72104 -87163 -25689 85141
20955H5141j6515q2355P347q216J242k1855Q7998j1753l5878R636L1780K3940
$$ 85141 68626 -13729 -6382 -14598 -13356 -35211 52787 41034 5156 14792 46572 70512
20943G0512k6097Q1790k9574r9069K3334j4818M6139K3173j17823J6554L6794
$$ 70512 44415 126205 96631 -2438 20896 6078 52217 75390 -42433 -25879 10915
20932A0915q9195O416Q9296J35294K0334q9875o9791N2327P857k2542m9800k5745
$$ 10915 -78280 -71864 17432 152726 173060 83185 13394 65721 73578 51036 1236 -24509
20920b4509j5722P8400k4802M1428m571o6960j22024n9662N8341n0090j10301
$$ -24509 -40231 38169 13367 54795 50224 -16736 -138760 -198422 -140081 -190171 -300472
20909c00472P1982J08981K9172M9916J8131K1332j03998j6575P7306K5562M4394
$$ -300472 -228490 -119509 -90337 -40421 -22290 -958 -104956 -121531 -44225 -18663 25731
20898B5731j6425N3544j1280m245r166j20487j8903J26930P5814k0426k0351k7703
$$ 25731 9306 62850 51570 47325 38159 -82328 -101231 25699 101513 81087 60736 33033
20886C3033N5720K5921j30828m3642k4057j6168P6389p0269q6705J8280k6066
$$ 33033 88753 114674 -16154 -59796 -83853 -100021 -23632 -93901 -180606 -162326 -188392
20875a88392M0823Q0146q0962o941l3644n1536k1268J5859R1184Q5246q2698p5216
$$ -188392 -147569 -67423 -148385 -155326 -188970 -240506 -261774 -245915 -154731 -69485 -152183 -227399
20863b27399m0450p391J60751R1566j1349r868l8929M5483K6107o6133J9823K0455
$$ -227399 -267849 -275240 -114489 -22923 -34272 -44140 -83069 -37586 -11479 -77612 -57789 -37334
20851c7334N6949K0798j12967j8212P2000L9427M3516J42679J2368j12789j04451
$$ -37334 19615 40413 -72554 -90766 -18766 20661 64177 206856 219224 106435 1984
20840A984p4234R9505J12583k4269q0666r965J5669n6321J9722K1975O0223o8027
$$ 1984 -72250 27255 139838 115569 34903 24938 40607 -15714 4008 25983 86206 18179
20828A8179o8109n92J1648K3827P422q0419r7975N6775m047J1198K251K5608L3423
$$ 18179 -49930 -50522 -38874 -15047 -7625 -88044 -186019 -129244 -133291 -122093 -119842 -94234 -60811
20815f0811j1504O9755J36817L4161o4496n4799J5722L8288k3978M18J08259n3220
$$ -60811 -72315 -2560 134257 168418 103922 49123 64845 103133 79155 79573 187832 134612
20803A34612j39925l482j09617K53O7299L7607l0181M1699l8771m5978n4919R2979
$$ 134612 -5313 -8795 -118412 -118159 -50860 -13253 -43434 -1735 -40506 -86484 -141403 -48424
20791d8424J24094j4269N4839R6122m8956n5239k2196p9077l0026L2879N10O149
$$ -48424 75670 61401 116240 212362 163406 108167 85971 6894 -23132 9747 10257 16406
20779A6406N2787J04558j8271p7321j0633j09138m2940k3675l8677K0060J55742
$$ 16406 69193 173751 155480 78159 67526 -41612 -84552 -108227 -146904 -126844 28898
20768B8898M0382K3529N185j4642J6126M4154J01650j10781m9678l9245J2900
$$ 28898 69280 92809 97994 83352 99478 143632 245282 134501 84823 45578 58478
20757E8478J49545J03113r0623j21548j21710K0206M8829O0984O8959O0960M6972
$$ 58478 208023 311136 220513 98965 -22745 -2539 46290 107274 176233 237193 284165
20746B84165q6868J2792K0655j15075j92179j3325n7011K1801O4656R5674O2688
$$ 284165 197297 210089 230744 115669 -76510 -89835 -146846 -125045 -60389 35285 97973
20735I7973l9015M994p0135j5290k431O4315Q1649j6046Q973k7350r8495N2802
$$ 97973 58958 63952 -6183 -21473 -23904 40411 122060 106014 114987 87637 -10858 41944
20723D1944n352m0562k3956K8026M7268K4300m2385j13112m9517J3582o8652O7273
$$ 41944 36592 -3970 -27926 100 47368 71668 29283 -83829 -133346 -119764 -188416 -121143
20711a21143J80082J3996n0752k7209o1146K450J7834J06081O7509m6830j23501
$$ -121143 58939 72935 22183 -5026 -66172 -63722 -45888 60193 127702 80872 -42629
20700d2629n4939k6955n9730J39384Q755j13191M8297M1662M7974K886P8772J19907
$$ -42629 -97568 -124523 -184253 -44869 -36114 -149305 -101008 -59346 -11372 -8486 70286 190193
20688A90193j1328o1480j1056q4407k0249m5166K2763l379m8056L2427n4393l5513
$$ 190193 178865 117385 106329 21922 1673 -43493 -20730 -24109 -72165 -39738 -94131 -129644
20676a29644o355K2814J92237J15203j00115o9633K0430o5862n0652k1061k9800
$$ -129644 -135999 -113185 79052 194255 94140 24507 44937 -20925 -71577 -92638 -122438
20665a22438K439j7158J734J07093K3064o4488r8678N3808J26497J10787P073
$$ -122438 -119999 -137157 -135423 -28330 -5266 -69754 -168432 -114624 11873 122660 129733
20654A29733q0579L9799M0218M3871N3362q1348p9988l1115m8276q0175K0967
$$ 129733 49154 88953 129171 173042 226404 145056 65068 33953 -14323 -94498 -73531
20643g3531M1335J15916L8600l2225j03023r8709n2503K9314L1155J52961P1317
$$ -73531 -32196 83720 122320 90095 -12928 -111637 -164140 -134826 -103671 49290 120607
20632A20607j9844j81783n538P7414N805N006j5222k4802M8068l0233J3091L3415
$$ 120607 100763 -81020 -86558 -9144 -3339 1667 -13555 -38357 9711 -20522 -7431 25984
20620B5984N1833o624l1115M75N9791o5289l5592j8950j4433K9112R8600n0315
$$ 25984 77817 71193 40078 40553 100344 35055 -537 -19487 -33920 -4808 93792 43477
20608D3477j87799j51420J71450J05119J5548P0046m0303q515o3095j1401l0059
$$ 43477 -144322 -295742 -124292 -19173 -3625 66421 26118 17603 -45492 -56893 -86952
20597h6952m7783M4640N7942J6662j5352k5097j3638n1204l6539o8914M7606J52101
$$ -86952 -134735 -90095 -32153 -15491 -30843 -55940 -69578 -120782 -157321 -226235 -178629 -26528
20585b6528q474M4084p537n4391j7071J5540J01730J7999r3556l8347m3851o319
$$ -26528 -35002 9082 1545 -52846 -69917 -54377 47353 65352 -28204 -66551 -110402 -116721
20573a16721P1193J0320Q851L1400J4041N4427j0799O7631M52J713l7502j37030
$$ -116721 -45528 -35208 -26357 5043 19084 73511 62712 130343 130795 132508 95006 -42024
20561d2024j7848m6266q9036L1724J74846J19031j6168k038o1504j16290L28j208
$$ -42024 -59872 -106138 -195174 -163450 11396 130427 114259 112221 50717 -65573 -65245 -66453
20549f6453J5021n5105J0652M8240J558m2761k3805n7594M3806L6762k7866j7109
$$ -66453 -51432 -106537 -95885 -47645 -46087 -88848 -112653 -170247 -126441 -89679 -117545 -134654
20537a34654J16365p347P9425l309j23791j00978K3709L7633L5995J09458J5058
$$ -134654 -18289 -25636 53789 50480 -73311 -174289 -150580 -112947 -76952 32506 47564
20526D7564m2948j7189p1185K5912K2476r3449n4733J41699J6201M9330q154j76789
$$ 47564 4616 -12573 -83758 -57846 -35370 -128819 -183552 -41853 -25652 23678 15524 -161265
20514a61265P0848J28802m9941k9363M0570M0244N4212m4450P7955m0047j10243
$$ -161265 -90417 38385 -11556 -40919 -349 39895 94107 49657 127612 87565 -22678
20503b2678J03365N254r1730o6279M3914M9842P2215k6814L5634M996o4910j16563
$$ -22678 80687 85941 -5789 -72068 -28154 21688 93903 67089 102723 107719 42809 -73754
20491g3754j06302M5341P7450J11196M7872Q3917J2033p0267j32375k0337N8339
$$ -73754 -180056 -134715 -57265 53931 101803 185720 197753 127486 -4889 -25226 33113
20480C3113j3661N0146n1268m0760P0340l8690k7620m3836Q0788M2145p5087J10196
$$ 33113 19452 69598 18330 -22430 47910 9220 -18400 -62236 18552 60697 -14390 95806
20468I5806J66653K0463o8965r899N2857l8090r5684n1268j7907L7818j828r1173
$$ 95806 262459 282922 213957 204058 256915 218825 123141 71873 53966 91784 89956 -1217
20456a217n9040J6535Q0657l6794j0253P7011Q655L2354O6186N3572j3508k7632
$$ -1217 -60257 -43722 36935 141 -10112 66899 75554 107908 174094 227666 214158 186526
20444A86526j22953K5379n7727r1796J5691K3105j9636O99K0792m2621q3527K4374
$$ 186526 63573 88952 31225 -60571 -44880 -21775 -41411 -40712 -19920 -62541 -146068 -121694
20432a21694J9774j268q2493J1158O0351l066N9371P3832O7849P4636L781j2320
$$ -121694 -101920 -103188 -185681 -174523 -114172 -117238 -57867 15965 83814 158450 162231 149911
20420A49911k8057k4336q653k5467O1112r877k9718l0107o7264j34507n8400N1403
$$ 149911 121854 97518 88865 63398 124510 114633 84915 54808 -12456 -146963 -205363 -153960
20408a53960R7332J2319M6117l261m2092Q093L0091m4310M8438K19J30505M9518
$$ -153960 -56628 -44309 1808 -1453 -43545 -35452 -5361 -49671 -1233 -1014 129491 179009
20396A79009j5322k4846J5087J35297o0202j4055k2117k4000l4811M0670j718
$$ 179009 163687 138841 153928 289225 229023 214968 192851 168851 134040 174710 172992
20385A72992o3886k2971j6153j7389J111L4036P770q2781m1302K582j2820o0579
$$ 172992 109106 86135 69982 52593 53704 87740 95510 12729 -28573 -25991 -38811 -99390
20373i9390J2961R7761R3514L3665K9517P5358J40118o3205j45045m1220j01097
$$ -99390 -86429 11332 104846 138511 168028 243386 383504 320299 175254 134034 32937
20362C2937n1122o8501K4494J0193K6338J31654j1941q2339r7952M2808J00671
$$ 32937 -18185 -86686 -62192 -51999 -25661 105993 94052 11713 -86239 -43431 57240
20351E7240M1222k946K364Q0635k0184m2680j02872q5753m9165J04343P827n1046
$$ 57240 98462 95516 97880 178515 158331 115651 12779 -72974 -122139 -17796 -9969 -61015
20339f1015l9701N3373n2517o7719M0039J04953Q3222Q3131l4575j34031l6128
$$ -61015 -100716 -47343 -99860 -167579 -127540 -22587 60635 143766 109191 -24840 -60968
20328f0968M031N5158J1240K6542l7351n786j296O8164p2754k0575n8237Q611
$$ -60968 -56937 -1779 9461 36003 -1348 -7134 -8430 59734 -13020 -33595 -91832 -83221
20316h3221Q3620j0909K5971O4597j00010j7176p211k3243L9892L5386o8557n7801
$$ -83221 399 -10510 15461 80058 -19952 -37128 -44339 -67582 -27690 7696 -60861 -118662
20304a18662R1710j5870J0106K9268K1715K4444P442l117O723k316M424N0215
$$ -118662 -26952 -42822 -32716 -3448 18267 42711 50153 47036 53759 51443 55867 106082
20292A06082q2583j20253L9407j674l9555O298M3352n943K4451J47560m8571r1520
$$ 106082 23499 -96754 -57347 -59021 -98576 -92278 -48926 -54869 -30418 117142 68571 -22949
20280b2949k040M1367O0885K751N7410j1229o8349p7536l2982m3750K9878M1866
$$ -22949 -24989 16378 77263 80014 137424 126195 57846 -19690 -52672 -96422 -66544 -24678
20268b4678l0333k943P6448O7016M2005M7754N7336k7670l5491j066L7677j69759
$$ -24678 -55011 -57954 18494 85510 127515 175269 232605 204935 169444 168378 206055 36296
20256C6296j11955N7456j5294l6642J01869P4116K5520M2076j35231n4553L0687
$$ 36296 -75659 -18203 -33497 -70139 31730 105846 131366 173442 38211 -16342 14345
20245A4345l0631L560m0832j9103j4687k5589M4431M480n3816J9450p7691k588
$$ 14345 -16286 -12726 -53558 -72661 -87348 -112937 -68506 -64026 -117842 -98392 -176083 -178671
20233a78671k3699j4737J19262L9451o921J2713J08377M7886K8956J15655J4025
$$ -178671 -202370 -217107 -97845 -58394 -65315 -52602 55775 103661 132617 248272 262297
20222B62297l4719k6669l7352P50k0723Q3229K5811j13971n712k953K0141l7557
$$ 262297 227578 200909 163557 164307 143584 226813 252624 138653 132941 129988 150129 112572
20210A12572j50559n1021M2296L7927N8287N8886J2577J9191n6636r9320j7368
$$ 112572 -37987 -89008 -46712 -8785 49502 108388 120965 140156 83520 -15800 -33168
20199c3168o713R7559Q1002r5232r6598O745o1028o7748J04134L7152k840j9160
$$ -33168 -39881 57678 138680 43448 -53150 -46405 -107433 -175181 -71047 -33895 -36735 -55895
20187e5895j4419j462j9623N0353J4481P2356N5676j5060n3522o7551P3216L9570
$$ -55895 -70314 -71776 -91399 -41046 -26565 45791 101467 86407 32885 -34666 38550 78120
20175G8120j8135j8949P3090K7963m7498M6690P0987J0338p3059j09073q5318
$$ 78120 59985 41036 114126 142089 94591 141281 212268 222606 149547 40474 -44844
20164d4844l3485j15M5502M7335n976L7906J857j05519l8278J5752P4197m1431
$$ -44844 -78329 -78444 -32942 14393 8417 46323 48180 -57339 -95617 -79865 -5668 -47099
20152d7099j32337k0555P3377l4453J40499J56015Q2468j19180j70856k5208J43112
$$ -47099 -179436 -199991 -126614 -161067 -20568 135447 217915 98735 -72121 -97329 45783
20141D5783M4708l5596q1875p1324N6431O3746M8540n3642p0142m951J9882k1630
$$ 45783 90491 54895 -26980 -98304 -41873 21873 70413 16771 -53371 -58322 -38440 -60070
20129f0070M2805N2041k076p929q5405M5857J28936J14686m8559j17188r613R8270
$$ -60070 -17265 34776 32700 24771 -60634 -14777 114159 228845 180286 63098 53485 151755
20117A51755k8600p8731j19125n4789J14828M4564N0192N9155n0674J3755L8678
$$ 151755 123155 44424 -74701 -129490 -14662 29902 80094 139249 88575 102330 141008
20106A41008J5298L57J17065p7638o7562N1397O5973k32462j5792M8797L5598
$$ 141008 156306 156663 273728 196090 128528 179925 245898 13436 -2356 46441 82039
20095H2039M437Q4568q54R2280J89224K55960L21679K19991R8172J4716O296j5100
$$ 82039 86476 171044 170190 262470 451694 707654 1029333 1249324 1347496 1362212 1368508 1353408
20083A353408m3606n0317j32022k00124k60740j96940j67823j28642R964L9343
$$ 1353408 1309802 1259485 1127463 927339 666599 469659 301836 173194 183158 222501
20073B22501O0860m9048j35229l014K3930q4711O0947o0818q4018k2224L9589
$$ 222501 283361 234313 99084 96070 120000 35289 96236 35418 -48600 -70824 -31235
20062c1235Q6691n1238M8938p800o951L9335n9924o3301r515Q0070P8121Q3881
$$ -31235 55456 4218 53156 45356 38405 77740 17816 -45485 -55000 25070 103191 187072
20050A87072j16662m0814L1500J0193q0340O0974O3932p8971k9381N707O4474
$$ 187072 70410 29596 61096 71289 -9051 51923 115855 36884 7503 13210 77684
20039G7684o701K6963l2067K2776K2151k0209o1514r0862N7555R694J00939j9975
$$ 77684 70983 97946 65879 88655 110806 90597 29083 -61779 -4224 5470 106409 86434
20027H6434j0458R3480p102M4909p9126J3786j0008N0698J8577m6730J5711m6855
$$ 86434 75976 169456 162354 207263 128137 141923 131915 182613 201190 154460 170171 123316
20015A23316K6689j01940L661J16656J5596k5450J4937J9066k508p3522K1583
$$ 123316 150005 48065 51726 168382 183978 158528 173465 192531 190023 116501 138084
20004A38084j48895r3104j2130R0385R328L1623k828l3604k1366J04719M1492
$$ 138084 -10811 -103915 -116045 -25660 -16332 15291 12463 -21141 -42507 62212 103704
19993A03704n0480p047P682m0489k5176L4381L9319L3569J0026Q8405j3158p8098
$$ 103704 53224 46177 53859 13370 -11806 22575 61894 95463 105489 193894 180736 102638
19981A02638j8671L5158R079j9810k4393R427k5785o867j2172L5705J1370J3176
$$ 102638 83967 119125 128204 108394 84001 93428 67643 60776 48604 84309 95679 108855
19969A08855K3514q2031K1605m5564M7484j8045p7747m7880k5631R7483J47711
$$ 108855 132369 50338 71943 26379 73863 55818 -21929 -69809 -95440 2043 149754
19958A49754M2986J8859m9279p2349J51k3105j15079j22484M8341O4517J0637
$$ 149754 192740 211599 162320 89971 90122 67017 -48062 -170546 -122205 -57688 -47051
19947d7051Q5689L6513L7990j4255o107K924J7216J09690j6619o6322j5175M1946
$$ -47051 38638 75151 113141 98886 92779 95703 112919 222609 205990 139668 124493 166439
19935A66439o8477l0262o0442O1258J9889k124l6766j7996m4502m4533K9350P4435
$$ 166439 97962 67700 7258 68516 88405 86281 49515 31519 -12983 -57516 -28166 46269
19923D6269P5077l6885n0564L0392J05409J1149n5274j26112r2789O8379J51429
$$ 46269 121346 84461 33897 64289 169698 180847 125573 -539 -93328 -24949 126480
19912A26480j0843j4109J11228j04858r0798Q4350O0672n9959q5726N4772L710
$$ 126480 115637 101528 212756 107898 17100 101450 162122 102163 16437 71209 74919
19901G4919J51570J55222j85778j79488o300P7002M0330r2119n9277K3555n5400
$$ 74919 226489 381711 195933 16445 10145 87147 127477 35358 -23919 -364 -55764
19890e5764P024N9107N5133m6574r5837J9386n41j5083r7410J3639R9339J45131
$$ -55764 -48740 10367 65500 18926 -76911 -57525 -58066 -73149 -170559 -156920 -57581 87550
19878H7550k5646k8178N4442j03921o951N4985J00423j4327j20523n0912M7347
$$ 87550 61904 33726 88168 -15753 -22704 32281 132704 118377 -2146 -53058 -5711
19867e711O117J31626J7545j1310J6401n495o0986k912O9964O159k0192K2771
$$ -5711 406 132032 149577 138267 154668 149173 88187 85275 155239 161398 141206 163977
19855A63977J17781j2442j96203j33466J8052O7987M3304l8834l6984J30335Q1863
$$ 163977 281758 269316 73113 -60353 -42301 25686 68990 30156 -6828 123507 205370
19844B05370K3918j3454l3646m4858M6130o932k5132K2447K99q0027j1702N3672
$$ 205370 229288 215834 182188 137330 183460 176528 151396 173843 174142 94115 82413 136085
19832A36085L9781K6938K0921k3481o7653r4630j2436M2566P1904l7237j69699
$$ 136085 175866 202804 223725 200244 132591 37961 25525 68091 139995 102758 -66941
19821f6941l2238J15364M9097M4228K6857l1999M3582Q4454J2693p6470L0784
$$ -66941 -99179 16185 65282 109510 136367 104368 147950 232404 245097 168627 199411
19810A99411M2528J771O0961J15061j5016N1235j0730L8831j2727L617R5635R4604
$$ 199411 241939 243710 304671 419732 404716 455951 445221 484052 471325 474942 570577 665181
19798F65181m683L031L4015R944j66050p8401n7770k6354K1335R749J17859p245
$$ 665181 660498 663529 697544 707488 541438 463037 405267 378913 400248 409997 527856 520611
19786E20611j20884n7333n903K9585n7230k208M717L656m2658j34491M0703N9210
$$ 520611 399727 342394 336491 366076 308846 306638 311355 315011 272353 137862 178565 237775
19774B37775l1034j16422j36433N5331J17513M4411j916K2356o5725r7834J44215
$$ 237775 206741 90319 -46114 9217 126730 171141 169225 191581 125856 28022 172237
19763A72237Q5908K9776J235P3843k8335k9221J37093J53566R1480Q2342J61428
$$ 172237 258145 287921 289156 362999 334664 305443 442536 596102 687582 769924 931352
19752I31352J49273R5352K6660J031J9175L1300j23506j65737j61383j20711K0567
$$ 931352 1080625 1175977 1202637 1203668 1222843 1254143 1130637 964900 803517 682806 703373
19741G03373O4543m5624q2686k1644j17514j19153j05811m3376O2888M2597k7779
$$ 703373 767916 722292 639606 617962 500448 381295 275484 232108 294996 337593 309814
19730C09814q0416r3970r4831j1022q055P7683L6235p517m5069L042j0955J29412
$$ 309814 229398 135428 40597 29575 21520 99203 135438 127921 82852 85894 74939 204351
19718B04351K08706J31629o796q962J6838N9359O0654M4682r5493j34806N0339
$$ 204351 413057 544686 537890 528928 545766 605125 665779 710461 614968 480162 530501
19707E30501K9404J09466O2348j0010N2423o9401o0792o1662p9539o9886J4630
$$ 530501 559905 669371 731719 721709 774132 704731 643939 582277 502738 432852 447482
19696D47482L125K4177n4592j31643r0854L864r895K1205m955r7228k0723K187
$$ 447482 450607 474784 420192 288549 197695 201559 191664 212869 207914 110686 89963 92150
19684I2150k7876K7185L4568l3398K2278L8218J02381Q3586j697k7861P5633j2025
$$ 92150 64274 91459 126027 92629 114907 153125 255506 339092 337395 309534 385167 373142
19672C73142P829K162m7743O5977J41014J71497N0342j60868m2832O3643O6919
$$ 373142 380971 383133 335390 401367 542381 713878 764220 603352 560520 624163 691082
19661F91082O4090j19606o01M4264K9607p191q2586o4849j7839n3272j0870l9562
$$ 691082 755172 635566 634965 679229 708836 701645 619059 554210 536371 483099 472229 432667
19649D32667j20001K9937J8260l9579R757r0510j5251m7989n6987J54116J104
$$ 432667 312666 342603 360863 321284 331041 240531 225280 177291 120304 274420 275524
19638B75524o4139j8087M5546o5709p3973m7341O4029J49209J6648M2893N4906
$$ 275524 211385 193298 238844 173135 99162 51821 115850 265059 281707 324600 379506
19627C79506O1999M8251L0037j7963n5060j07931j02843n1062L0525K9000M327
$$ 379506 441505 489756 519793 501830 446770 338839 235996 184934 215459 244459 248786
19616B48786k2438M9027k2011M749M8544O2598m5110O9852M7046N7684m1145m0905
$$ 248786 226348 275375 253364 258113 306657 369255 324145 393997 441043 498727 457582 416677
19604D16677N6093J62285n4650k5697M1788p7489j04335p8383j5720J18000o3459
$$ 416677 472770 635055 580405 554708 596496 519007 414672 336289 320569 438569 375110
19593C75110o3456l2316N0069J23384J13913k2236M5867J53975k8839j304J2024
$$ 375110 311654 279338 329407 452791 566704 544468 590335 744310 715471 714167 726191
19582G26191K3053M4109R6401o0965J9044J654M6565J22373P8481n6904k5671
$$ 726191 749244 793353 889754 828789 847833 849487 896052 1018425 1096906 1040002 1014331
19571A014331L6918J03503K50631K01732K09027J42302K00342L74185J96369J58892
$$ 1014331 1051249 1154752 1405383 1607115 1816142 1958444 2158786 2532971 2729340 2888232
19561B888232L4177M464J67373L7447O5596L7677J9598j2575J49335L13647L32379
$$ 2888232 2922409 2926873 3094246 3131693 3197289 3234966 3254564 3241989 3391324 3704971 4037350
19550D037350N25246O61412Q03513J034111J149360J330836J629559K227018K668903
$$ 4037350 4562596 5224008 6027521 7061632 8210992 9541828 11171387 13398405 16067308
19541A6067308L593865N244039Q080652J3667002K2835467L5856936M9783748
$$ 16067308 19661173 24905212 32985864 46652866 69488333 105345269 155129017
19534A55129017N3829354L6884969J8396823N74646j539937O566960m299985k1897934
$$ 155129017 208958371 245843340 264240163 264814809 263274872 269841832 265541847 243643913
19526B43643913m6120001n6859695m5723703l0286681j8228135j1109979p342568
$$ 243643913 197523912 140664217 94940514 64653833 46425698 35315719 27973151
19519B7973151n180168l795420k963076k331680j963916j658001j239454j173805
$$ 27973151 22792983 18997563 16034487 13702807 11738891 10080890 8841436 7667631
19511G667631j096705r38236o03659m94765l35369j63490j77611p028J05431J0775
$$ 7667631 6570926 5632690 5029031 4534266 4198897 4035407 3857796 3850768 3956199 3966974
19501C966974j84304j87547q6977j93418k33578l83398m97181l20924k68045k67022
$$ 3966974 3782670 3595123 3508146 3314728 3081150 2697752 2200571 1879647 1611602 1344580
19491A344580j82975k2586q4474o5690o1654k8900q8076j38422k14267j06454
$$ 1344580 1161605 1139019 1054545 988855 927201 898301 810225 671803 457536 351082
19481C51082J29745O7992j7741N6370J28126o941j36717L1712k153j85M9930P89
$$ 351082 480827 548819 531078 587448 715574 708633 571916 603628 601475 601290 651220 652009
19469F52009m0690j13071n7775l1552J3334K3999n8392R5707O8922p8679r7620
$$ 652009 611319 498248 440473 408921 422255 446254 387862 483569 552491 473812 376192
19458C76192l0484r4548O4140N5522J14826n127j3980L1310J06970P774K937L6297
$$ 376192 345708 251160 315300 370822 485648 480521 466541 497851 604821 612595 615532 651829
19446F51829j13403j02417N1397l2524j43239j84017r2987N1988Q9227O724j5997
$$ 651829 538426 436009 487406 454882 311643 127626 34639 86627 175854 182578 166581
19435A66581P820N2558k4354o3954J6372P8868j6160R9559k4998j09617p0232
$$ 166581 174401 226959 202605 138651 155023 233891 217731 317290 292292 182675 112443
19424A12443K3081J17970K1958q982J710m8370M3703n5252M6827O8457Q5882L1255
$$ 112443 135524 253494 275452 266470 268180 219810 263513 208261 255088 323545 409427 440682
19412D40682J1246o2728j61177m3261K3659J16484Q4894m8103m6645m1707J8748
$$ 440682 451928 389200 228023 184762 208421 324905 409799 361696 315051 273344 292092
19401B92092K4279M3093L216N9920P9723N5568p4615l0668o0767P5247k3475n8618
$$ 292092 316371 359464 362680 422600 502323 557891 483276 452608 391841 467088 443613 384995
19389C84995J1874j9354j11633k2049l5528m9087L3042J19473J12327l0217k8366
$$ 384995 396869 377515 265882 243833 208305 159218 192260 311733 424060 393843 365477
19378C65477Q1703o3475n7036Q0434L5014n693k1174j47913r4439m0346Q4661
$$ 365477 447180 383705 326669 407103 442117 436424 415250 267337 172898 132552 217213
19367B17213n735N4124l4382K1144M1140K5804Q1876J30253J5313o3863p5238
$$ 217213 211478 265602 231220 252364 293504 319308 401184 531437 546750 482887 407649
19356D07649r2413k283o268J11828J76791J90384n2348M602Q8731M4271n2118
$$ 407649 315236 312953 306685 418513 595304 785688 733340 737942 826673 870944 818826
19345H18826j52546j78132p7591K5668P7549j3126r4346k2777M5862J13042M7931
$$ 818826 666280 488148 410557 436225 513774 500648 406302 383525 429387 542429 590360
19334E90360l0294M0878N693J0671N3984J4195K5500m8058L7750N8320l7587Q3117
$$ 590360 560066 600944 606637 617308 671292 685487 710987 662929 700679 758999 721412 804529
19322H04529K7400N1423K0416L2932J30375Q5290P7626J81664R2438J67905L5092
$$ 804529 831929 883352 903768 936700 1067075 1152365 1229991 1411655 1504093 1671998 1707090
19311A707090J67669K11740K05433J74028P5734Q2094J0164J57959K43794L45377
$$ 1707090 1874759 2086499 2291932 2465960 2541694 2623788 2633952 2791911 3035705 3381082
19301C381082K84911L47867M93679M90340O27282J050191J708112K660708M160537
$$ 3381082 3665993 4013860 4507539 4997879 5625161 6675352 8383464 11044172 15204709
19292A5204709O589975R562487J2127558J0654999O784749M247709K123411M824407
$$ 15204709 21794684 31357171 43484729 54139728 60924477 65172186 67295597 72120004
19284G2120004M883866K949797J330726q99569k413074n013055o267967p783525
$$ 72120004 77003870 79953667 81284393 80384824 77971750 72958695 66690728 58907203
19276E8907203l878216J861186M659918r1593m123811j0094746j2455967r920349
$$ 58907203 55028987 56890173 61550091 61458498 57334687 47239941 34783974 24863625
19268B4863625o662885m127123k604390j676273j080286q54982p21986m41922
$$ 24863625 18200740 14073617 11469227 9792954 8712668 7857686 7135700 6693778
19260F693778l30955l29130j09378k9377J427J21532R599p4906J21381K14013
$$ 6693778 6362823 6033693 5924315 5894938 5896365 6017897 6027496 5952590 6073971 6287984
19250F287984M07271M88173N51777O98003J157428J813038K750527M343234O815684
$$ 6287984 6695255 7183428 7735205 8433208 9590636 11403674 14154201 18497435 25313119
19241B5313119J0282274J4427538J6136367J3324487J1063662O134653k92822
$$ 25313119 35595393 50022931 66159298 79483785 90547447 96682100 96389278
19234I6389278m378024p331291o460820k04122L672207J760851P75092k059219
$$ 96389278 92011254 84679963 78219143 78015021 81687228 83448079 84223171 82163952
19226H2163952l04044L31360m459231q613373j4787890j4772912j1066367p291331
$$ 82163952 81859908 82191268 77732037 69118664 54330774 39557862 28491495 21200164
19218B1200164m645736k968756j803876j172035q49252o34775n50679n09194j97657
$$ 21200164 16554428 13585672 11781796 10609761 9760509 9125734 8575055 8065861 7868204
19209G868204K21360N91143R41585J683188K814046M709137O744510Q568600P953882
$$ 7868204 8089564 8680707 9622292 11305480 14119526 18828663 25573173 34141773 42095655
19200D2095655L085530K667528O317349J0601518R786305R5971k089977K491825
$$ 42095655 45181185 47848713 54166062 64767580 74553885 74649856 72559879 75051704
19192G5051704P588706M548721k589989k798295k206494m319258p864909q917244
$$ 75051704 82640410 87189131 84599142 81800847 79594353 75275095 67410186 58492942
19184E8492942o489878o909007r683226r059617o826445m502162k904946k019194
$$ 58492942 52003064 45094057 35410831 26351214 19524769 15022607 12117661 10098467
19176A0098467j428760q62804o53746n05697l07813k89154k70914j55551r363
$$ 10098467 8669707 7806903 7153157 6647460 6339647 6050493 5779579 5624028 5614665
19167E614665L6008J8384R8141L15855M09570N07044P67742P74769N10974N69629
$$ 5614665 5650673 5669057 5767198 6083053 6492623 6999667 7767409 8542178 9053152 9622781
19157I622781J041859J978555L292955N093239P310405R488411Q124109J326514
$$ 9622781 10664640 12643195 15936150 21029389 28339794 37828205 45952314 47278828
19149D7278828K57519M617227J0815125J3981058R231338K310495m73827K848119
$$ 47278828 47536347 52153574 62968699 76949757 86181095 88491590 88017763 90865882
19141I0865882K115819K675138K670622J243765J104624r527172j6107723j2917142
$$ 90865882 92981701 95656839 98327461 99571226 100675850 91148678 75040955 62123813
19133F2123813o767982l261429p135813j0556567r376413o671437m129703k533237
$$ 62123813 55355831 52094402 44958589 34402022 25025609 18354172 14224469 11691232
19125A1691232j797925j435704j047468o91103m45360l86181l56168n46744n79733
$$ 11691232 9893307 8457603 7410135 6719032 6273672 5887491 5531323 4984579 4404846
19116D404846m83771l96882o0819q7220j88187l59496k78524k25517j94289j37945
$$ 4404846 3921075 3524193 3463374 3376154 3187967 2828471 2549947 2324430 2130141 1992196
19106A992196j52582j81881k90657j61847j169K167n0869j38447q3545J05917
$$ 1992196 1839614 1657733 1367076 1205229 1204060 1206227 1155358 1016911 933366 1039283
19096A039283J6225p0783J233N5064K4353R9758J58574K0284m7334j17966j12176
$$ 1039283 1055508 984725 985958 1041022 1065375 1165133 1323707 1343991 1296657 1178691 1066515
19085A066515L80J4870j4656O48J8316J90355J69397J98003K26240J77913K06591
$$ 1066515 1066895 1081765 1067109 1067757 1086073 1276428 1445825 1643828 1870068 2047981 2254572
19074B254572J56372k2419j40393j63402R7852Q2286k9886k11760k75410l57413
$$ 2254572 2410944 2388525 2248132 2084730 2182582 2264868 2234982 2023222 1747812 1390399
19064A390399l20011j97058k26109j2826l6477L7106m1050j58633k1593m4329
$$ 1390399 1070388 873330 647221 634395 597918 635024 593974 435341 413748 369419
19054C69419j04490Q8304M6017K5520m4478m3780J69752R0362j05039n9700R2249
$$ 369419 264929 353233 399250 424770 380292 336512 506264 596626 491587 431887 524136
19043E24136J89723L3047J29237j5200j03021j3815P4157N6885q1340j40164n042
$$ 524136 713859 746906 876143 860943 757922 744107 818264 875149 793809 653645 648603
19032F48603J39381J2965o4252j52053O3556L1604J10981K03572J64960P1395
$$ 648603 787984 800949 736697 584644 648200 679804 790785 994357 1159317 1230712
19022A230712r7180k71447k44687L0731J43839P102K925p1334j48023k0972n7427
$$ 1230712 1133532 862085 617398 648129 791968 799070 801995 730661 582638 561666 504239
19011E04239n4n1733p7869J00630J65216Q9489q438j46311k5416o3458j18354
$$ 504239 504185 452452 374583 475213 640429 729918 721480 575169 549753 486295 367941
19000C67941j41986J5131O4700K8616N1698n0334q0072Q8758M5874J31808R9416
$$ 367941 225955 241086 305786 334402 386100 335766 255694 344452 390326 522134 621550
18989F21550k5716K7819o5266J0824J28317O8856O5550r489j25050O3907m39m4732
$$ 621550 595834 623653 558387 569211 697528 766384 831934 822445 697395 761302 760863 716131
18977G16131O7582Q8740J56268J93787J44102Q5448J29835M3652O3386M4451j16060
$$ 716131 783713 872453 1028721 1222508 1366610 1452058 1581893 1625545 1688931 1733382 1617322
18966A617322k47132l10715l26319k20247p4958j55615J2324k3741j4917J20933
$$ 1617322 1370190 1059475 733156 512909 437951 282336 294660 270919 256002 376935
18956C76935n8224j35375j49783P4233P1492N8712m1997K0572Q4964K8118m3108
$$ 376935 318711 183336 33553 107786 179278 237990 195993 216565 301529 329647 286539
18945B86539O719n7171p1828L2400K4875l7753n3658o0051j9362O7559J8818M9261
$$ 286539 293258 236087 164259 196659 221534 183781 130123 70072 50710 118269 137087 186348
18933A86348j6298N7411r8012n6147J09426Q1659n2245P11l5825j26510m3759
$$ 186348 170050 227461 129449 73302 182728 264387 212142 212853 177028 50518 6759
18922F759L3371J31890M2101j0790J00064O5387n0188J733m0284m6219l5043j37124
$$ 6759 40130 172020 214121 203331 303395 368782 318594 320327 280043 233824 198781 61657
18910F1657R570K1786m279O2695p3672M169J55166m3670o6563Q339m2685O2249
$$ 61657 71227 93013 88734 151429 77757 81926 237092 193422 126859 135198 92513 154762
18898A54762p292n0034p9538n3765R4760j5238L3963J47169k1136q5466l7918
$$ 154762 147470 97436 17898 -35867 58893 43655 77618 224787 203651 118185 80267
18887H0267M8439j2978n4947J3272K4181P5014J13222n1203p5125m0599K7461
$$ 80267 128706 115728 60781 74053 98234 173248 286470 235267 160142 119543 147004
18876A47004j11717j47215M0203R4140M9521L9994j129L2429N8405m5793n8374
$$ 147004 35287 -111928 -71725 22415 71936 111930 110801 143230 201635 155842 97468
18865I7468l6484l1396J24061J61904N4021p2475j28206j44757j3915J02989L3964
$$ 97468 60984 29588 153649 315553 369574 297099 168893 24136 10221 113210 147174
18854A47174J01020J35303J7457j54711j57313J0642J58170K6510j04942o7697
$$ 147174 248194 383497 400954 246243 88930 99572 257742 284252 179310 111613
18844A11613K1831K3713L700M4063o5021j56699j13008k3276K14547P450r4229
$$ 111613 133444 157157 160857 204920 139899 -16800 -129808 -153084 61463 68913 -25316
18833b5316k3321p785L8432J60214L1132j11804j9859J4201J6868M1478J2725
$$ -25316 -48637 -56422 -17990 142224 173356 61552 41693 55894 72762 114240 126965
18822A26965o71j29179j3553j04265R8713k7317J9467P4425O4028o7959j9035
$$ 126965 126294 -2885 -16438 -120703 -21990 -49307 -29840 44585 108613 40654 21619
18811B1619J14206M8384o692j891o2880K7269O8671p480l1887n8236k1200O5218
$$ 21619 135825 184209 177517 175626 112746 140015 208686 201206 169319 111083 89883 155101
18799A55101P1255q285M0057l9599l8j847q792o0008o6947p2231n15K3362j3775
$$ 155101 226356 218071 258128 218529 218491 216644 207852 147844 80897 8666 8151 31513 17738
18786A7738P6899O4778J01620Q5941m5507k5215M766m7666J1608J25292m1904
$$ 17738 94637 159415 261035 346976 301469 276254 281020 233354 244962 370254 328350
18775C28350J4498O8102J5529J28026J34554K22577L71239K91496K11029j39307
$$ 328350 342848 410950 426479 554505 689059 911636 1282875 1574371 1785400 1646093
18765A646093k75928j49747j92716k08182o4176m0637K7118j5279n2445j6422
$$ 1646093 1370165 1220418 1027702 819520 755344 714707 741825 726546 674101 657679
18755F57679J19640J56317l54j9409m5578k780P9093J64157m6360J228q5595j18250
$$ 657679 777319 933636 933282 913873 868295 865515 944608 1108765 1062405 1063633 978038 859788
18743H59788J6886Q4790K9495M6889J79882J05894K7450R6325R0611J05663K26266
$$ 859788 876674 961464 990959 1037848 1217730 1323624 1351074 1447399 1538010 1643673 1869939
18732A869939L82559M58331N53251Q17606J383294K305177L686237N831818Q248952
$$ 1869939 2252498 2710829 3264080 4081686 5464980 7770157 11456394 17288212 25537164
18723B5537164R909431P293848k041220p684343p160040l798982K69984M251599
$$ 25537164 35446595 42740443 40699223 33014880 25854840 22055858 22325842 26577441
18715B6577441P983637J0131131O571170m520337j1064767j0626518p725123m817618
$$ 26577441 34561078 44692209 51263379 46743042 35678275 25051757 17326634 12509016
18707A2509016k890741j809638j290524q92007n17407l10314k83267l05418l33647
$$ 12509016 9618275 7808637 6518113 5626106 5108699 4798385 4515118 4209700 3876053
18698C876053k53716j76290l5123J11689K11399J82780J28457J56499K00752M07492
$$ 3876053 3622337 3446047 3410924 3522613 3734012 3916792 4045249 4201748 4402500 4809992
18688D809992M64114N03833P46152J141635J753870K669550M359337P156021J1576897
$$ 4809992 5274106 5777939 6524091 7665726 9419596 12089146 16448483 23604504 35181401
18679C5181401J6918620K1381487K0183161L658874j2725273j4034446p665747
$$ 35181401 52100021 73481508 93664669 97323543 84598270 70563824 62898077
18672F2898077o56403K372206O243460J1161820J0987111k292819j5763527j6385127
$$ 62898077 62241674 64613880 70857340 82019160 93006271 90713452 74949925 58564798
18664E8564798j0095621k960176J129623j628772p783489r229328p475730m991365
$$ 58564798 48469177 45509001 46638624 45009852 37226363 27997035 20521305 15529940
18656A5529940l179481k122214j362720q12420n83251n97205l75987k83385m08728
$$ 15529940 12350459 10228245 8865525 8053105 7469854 6872649 6496662 6213277 5804549
18647E804549k11034m682J33897J53967K57684K40513J82127O2871J71657L37876
$$ 5804549 5593515 5588833 5722730 5876697 6134381 6374894 6557021 6619892 6791549 7129425
18637G129425N02529P96058J199093J518374K324470L814829O408592J0583367
$$ 7129425 7631954 8428012 9627105 11145479 13469949 17284778 23693370 34276737
18629C4276737J5783188J9985321J8373088J183202j6305025j8965571j3872145
$$ 34276737 50059925 70045246 88418334 89601536 73296511 54330940 40458795
18622D0458795p027376j541278L322231Q540897J2892728J5274139Q764140q023634
$$ 40458795 33431419 31890141 35212372 43753269 56645997 71920136 80684276 72660642
18614G2660642j6321444j4505727q989159l404270J531315O643733J2491279J7849030
$$ 72660642 56339198 41833471 32844312 29440042 30971357 37615090 50106369 67955399
18606F7955399K0234267R331854j1967561j8707788j4732822p010026J265303
$$ 67955399 88189666 97521520 85553959 66846171 52113349 45103323 46368626
18599D6368626Q971586J5846454J9895562J3072856j0951065k3217791k1598944
$$ 46368626 55340212 71186666 91082228 104155084 93204019 69986228 48387284
18592D8387284j5255773r399284n702390l656682k437664j424131p69560p63975
$$ 48387284 33131511 23732227 18029837 14373155 11935491 10511360 9741800 8977825
18584H977825p71834o26227n42639m26883l35432l77178m08895l95367j17644
$$ 8977825 8205991 7579764 7037125 6610242 6274810 5897632 5488737 5093370 4975726
18575D975726J09063K37768K47644J11992P6582J22901K39383N30823R51170J557487
$$ 4975726 5084789 5322557 5570201 5682193 5758775 5881676 6121059 6651882 7603052 9160539
18565I160539K579125M262719O667788R394512J1799645J0875441L700731J969690
$$ 9160539 11739664 16002383 22670171 32064683 43864328 54739769 58440500 60410190
18557F0410190O756276J2474229J0963301k962102r394260n364250J770765L990595
$$ 60410190 67166466 79640695 90603996 87641894 78247634 72883384 74654149 78644744
18549G8644744N108186P798709L11823j6392548k0762745j7113685j1375385o892951
$$ 78644744 83752930 91551639 91863462 75470914 54708169 37594484 26219099 19326148
18541A9326148m368383k839664j986187j529786j114349q42871n40916m80451
$$ 19326148 14957765 12118101 10131914 8602128 7487779 6644908 6103992 5623541
18533E623541m32769l22238k79242r3213r0406n720o6368k34287k40840j47268
$$ 5623541 5190772 4868534 4589292 4496079 4405673 4399953 4333585 4099298 3858458 3711190
18523C711190j97409q2628J35976J46663J60364K70414N56164J057666J677515
$$ 3711190 3513781 3431153 3567129 3713792 3874156 4144570 4700734 5758400 7435915
18514G435915K950656M971068P292343R201998Q680723O04114o974928p127551
$$ 7435915 10386571 15357639 22649982 31851980 40532703 41136817 34161889 27034338
18506B7034338l848961L33452L919889N988321M193147m035416q463822p892406
$$ 27034338 23185377 23518829 27438718 33427039 37620186 33584770 25120948 17228542
18498A7228542n428803l293353k102504j431800r19985n77565m40887l65992k76885
$$ 17228542 11799739 8506386 6403882 4972082 4052097 3474532 3033645 2667653 2390768
18489B390768k61590k88180k14907q5238j7528p7332n1142k9869j728n4647K1361
$$ 2390768 2129178 1840998 1626091 1540853 1523325 1445993 1394851 1364982 1363254 1308607 1329968
18478A329968P9747k0651o6083p9023j76012j66642p0000k2446k4582O713j6132
$$ 1329968 1409715 1389064 1322981 1243958 1067946 901304 831304 808858 784276 790989 774857
18467G74857m8093j65704p9858R801Q1898J411k9468J247l1701p3452j11120p1826
$$ 774857 726764 561060 481202 491003 572901 574312 544844 546091 514390 440938 329818 257992
18455B57992m6242k1099K2991M65L9407n335l9907J30755O9652J22019K9795P597
$$ 257992 211750 190651 213642 214107 253514 248179 208272 339027 408679 530698 560493 568090
18443E68090k7203r0801K6523N0232M9073j20123Q990k379j01889R6785q1232
$$ 568090 540887 450086 476609 526841 575914 455791 464781 462402 360513 457298 376066
18432C76066J191m7051m1691j8626j4586m7115O5524P5699P7631L6958N5913R4850
$$ 376066 377257 330206 288515 269889 255303 208188 273712 349411 427042 464000 519913 614763
18420F14763L08517J88062K02612K37308J563k87424k28602k04525k17842j21750
$$ 614763 923280 1111342 1313954 1551262 1552825 1265401 1036799 832274 614432 492682
18410D92682l8644n2832k0531o166Q7031O530k6221r4971j43356p3856M0875O1808
$$ 492682 454038 401206 380675 374509 461540 468070 441849 346878 203522 129666 170541 232349
18398B32349L6611P7240q5498j7589L2384J0425J175j4916l2926K9378J57046
$$ 232349 268960 346200 260702 243113 275497 285922 287097 272181 239255 268633 425679
18387D25679J96465J74504M33397M45745K61362J96936Q201k67919m53059m90708
$$ 425679 622144 796648 1230045 1675790 1937152 2134088 2142289 1874370 1421311 930603
18377I30603l30457j75222k26387j09683r2474L6532M8689J0146N128q8382O7222
$$ 930603 600146 424924 198537 88854 -3620 32912 81601 91747 96875 8493 75715
18366G5715J6259R964J52241J0433q9475r6066k4508P2164K7597L4461j9214p1664
$$ 75715 91974 101938 254179 264612 175137 79071 54563 126727 154324 188785 169571 97907
18354I7907N1875l7649m8979J5585O5243O8463L7537o177p5060p4306L9368p6273
$$ 97907 149782 112133 63154 78739 143982 212445 249982 243805 168745 94439 133807 57534
18342E7534M8864N7060O3061o0913o915R9945n7742L0259m1687L6020J17269q8317
$$ 57534 106398 163458 226519 165606 158691 258636 200894 231153 189466 225486 342755 254438
18330B54438J6375J03098J607n1621q0003q7675j27263n2646L4573R5791O6396
$$ 254438 270813 373911 375518 323897 243894 156219 28956 -23690 10883 106674 173070
18319A73070J1449K8762K7057k1550j16186j11301L869J2142j21757Q7413J89543
$$ 173070 184519 213281 240338 218788 102602 -8699 -4830 7312 -114445 -27032 162511
18308A62511k245J7878M190k5236k8845l5148R0204P7624k0915K0053J5391j2798
$$ 162511 160266 178144 182334 157098 128253 93105 183309 260933 240018 260071 275462 262664
18296B62664N239K08397L68702R5770j81594j20230m7338j31856q6147M5446J30391
$$ 262664 267903 476300 845002 940772 759178 638948 591610 459754 373607 419053 549444
18285E49444J60499J31292K85347L34730J22599k066q3245k72995l20435k72141
$$ 549444 709943 841235 1126582 1461312 1583911 1581845 1498600 1225605 905170 633029
18275F33029j75244j02481J428K669m8767J12536J1474k2454p0547O4673J09416
$$ 633029 457785 355304 356732 359401 310634 423170 434644 412190 341643 406316 515732
18264E15732J09077K03820K71437N18291O05691N11978L12155r9763k19050k66043
$$ 515732 624809 828629 1100066 1618357 2224048 2736026 3048181 2948418 2729368 2463325
18254B463325k83859k77865m35348m48786l01581j97039j77848j43015n7219M5543
$$ 2463325 2179466 1901601 1466253 1017467 715886 518847 340999 197984 140765 186308
18244A86308r450j544m8560J1023K31940J81839J95866J72934K87641K16293o1566
$$ 186308 176858 175314 126754 137777 369717 551556 747422 920356 1207997 1424290 1362724
18233A362724j07750j39057j90467j37922n6513m0831m316K36834J97525J83642
$$ 1362724 1254974 1115917 925450 787528 731015 690184 685868 922702 1120227 1303869
18223A303869R6891M5147r211k082r6443k94425k10374m7738k00126j83401j02385
$$ 1303869 1400760 1445907 1436696 1434614 1338171 1043746 833372 785634 585508 402107 299722
18212B99722n7022P9108j15462j97666m7435J2130R1704J95636K6520k6124J6391
$$ 299722 242700 321808 206346 8680 -38755 -26625 65079 260715 287235 261111 277502
18201B77502J00310K7985p6888p2755p2454m772J15974N6048K14132P0126l0620
$$ 277502 377812 405797 328909 256154 183700 178928 294902 350950 565082 635208 604588
18190F04588l8395j45726Q524l1471o4106j31069L5190l5320l2130M4339l1410
$$ 604588 566193 420467 428991 397520 333414 202345 237535 202215 170085 214424 183014
18179A83014k1935p55o4400j4001K7693J31470J29482K9504j04064j02361m4994
$$ 183014 161079 160324 95924 81923 109616 241086 370568 400072 296008 193647 148653
18168A48653o6684k6841R6568O2300j4151l0743M1990O4799N8974O8474O4038
$$ 148653 81969 55128 151696 213996 199845 169102 211092 275891 334865 403339 467377
18157D67377N9998o268O4659P0459p7497L9384k3904n1679J03956K15509Q2969
$$ 467377 527375 521107 585766 656225 578728 618112 594208 542529 646485 861994 944963
18146I44963Q818n6382j49785j41297Q2243Q1245O3349j12462m0003K0913N350
$$ 944963 953781 897399 747614 606317 688560 769805 833154 720692 680689 701602 706952
18135G06952M5442J86411P1431J2064Q9104J41855Q4565J47613K93406K22998
$$ 706952 752394 938805 1010236 1022300 1111404 1253259 1337824 1485437 1778843 2001841
18125B001841K66747L53999L73270M25498N25272P10154J065169J559184K037502
$$ 2001841 2268588 2622587 2995857 3421355 3946627 4656781 5721950 7281134 9318636
18116I318636L177533N367697R486399J7007657K9539452M3917851N5471217M5776096
$$ 9318636 12496169 17863866 27350265 44357922 73897374 117815225 173286442 219062538
18108B19062538k6973514n6612400m9511307l2015593j7873994j0256588o571317
$$ 219062538 192089024 135476624 85965317 53949724 36075730 25819142 19247825
18101A9247825m490779l084690k155868j571124j193298j064392o86763n22318
$$ 19247825 14757046 11672356 9516488 7945364 6752066 5687674 5000911 4478593
18093D478593o35524n23260l64360k72510j80433j18338o4518k31102l52319k24747
$$ 4478593 3843069 3319809 2955449 2682939 2502506 2384168 2319650 2088548 1736229 1511482
18083A511482j01294j10052j62552j33598M554P6854o8850j27061j09042p7144
$$ 1511482 1410188 1300136 1137584 1003986 1008540 1085394 1016544 889483 780441 703297
18073G03297j71260j09012L2630Q3706M6612K5252r9907q2118m5222p9744m3462
$$ 703297 532037 423025 455655 539361 585973 611225 511318 429200 383978 304234 260772
18062B60772J6559M8129p0808L5931m7897L3921p4470j06830L9968L8797J62992
$$ 260772 277331 325460 254652 290583 242686 276607 202137 95307 135275 174072 337064
18051C37064J78573J07638R280N9468m8290p117J5058p2918k1608O2708J03511
$$ 337064 515637 623275 632555 692023 643733 636616 651674 578756 557148 619856 723367
18040G23367k5875j38284j89772o3490O1009O6943J9542j24178j08205m4183o046
$$ 723367 697492 559208 369436 305946 366955 433898 453440 329262 221057 176874 170828
18029A70828q228J922q9036l849p8723n3241L1192J14192R9500p6073k142k2679
$$ 170828 162600 164522 75486 71637 -7086 -60327 -29135 85057 184557 108484 106342 83663
18017H3663j11852n3688K3583j3092j5156j9826P8647m0190M3354Q7139Q2397
$$ 83663 -28189 -81877 -58294 -71386 -86542 -106368 -27721 -67911 -24557 62582 144979
18006A44979P6206o956N3093M4903k2546k2026L986m643k989J26024L1056m5049
$$ 144979 221185 214229 267322 312225 289679 267653 271639 266996 264007 390031 421087 376038
17994C76038j02035J7075k2077l2265k2215J49574o9949p5884J7882K1655l9579
$$ 376038 274003 291078 269001 236736 214521 364095 294146 218262 236144 257799 218220
17983B18220P8298o3521q7674j34590k3068N2974M739L9654l8070r6661P6921
$$ 218220 296518 232997 145323 10733 -12335 40639 45378 85032 46962 -49699 27222
17972B7222J21495M6392J7185J2727m6034J3265n2498o4286m8526q9626K5984
$$ 27222 148717 195109 212294 225021 178987 192252 139754 75468 26942 -62684 -36700
17961c6700P7332J11113O0845o7290r4626q8860J3151J8643p0569m7028M7833
$$ -36700 40632 151745 212590 145300 50674 -38186 -25035 -6392 -76961 -123989 -76156
17950g6156O245N1870J0171k9804q3292j378J8780P1837N5572L2536m6495j5592
$$ -76156 -69911 -18041 -7870 -37674 -120966 -122344 -103564 -31727 23845 56381 9886 -5706
17938e706o765k0342M904P1056Q0972K7644l2486j70419j18177J00180R2414J8334
$$ -5706 -12471 -32813 -27909 43147 124119 151763 119277 -51142 -169319 -69139 23275 41609
17926D1609Q6808n0577l4999N9239o056J0972O8814l645l9304j49468p7406K6874
$$ 41609 128417 77840 42841 102080 96024 106996 175810 172165 132861 -16607 -94013 -67139
17914f7139m6433Q5490O4125J12164k225m3079p4221j3516m3169q915l7277k103
$$ -67139 -113572 -28082 36043 148207 145982 102903 28682 15166 -28003 -36918 -74195 -76298
17902g6298R1597J870p743K0641j73487o3252J23510J88378O9427k9575L0879
$$ -76298 15299 17169 9426 30067 -143420 -206672 -83162 105216 174643 145068 175947
17891A75947J4412j829p0237j9369r2632j00293p8298l5035M1599J8531K902j2163
$$ 175947 190359 188530 118293 98924 6292 -94001 -172299 -207334 -165735 -147204 -144302 -156465
17879a56465M6453J4620l9497P4223O8683O7619n7658q388r2291m668J03190j7982
$$ -156465 -110012 -95392 -134889 -60666 8017 75636 17978 9590 -82701 -87369 15821 -2161
17867b161k0287k1055L3179K178K2991n648j40946j60217L7996R3881R8511J10492
$$ -2161 -22448 -43503 -10324 -8146 14845 9197 -131749 -291966 -253970 -160089 -61578 48914
17855D8914m1303n8586o7376o907m0013L8619m119o0036L2478J10019M2546L580
$$ 48914 7611 -50975 -118351 -125258 -165271 -126652 -130771 -190807 -158329 -48310 -5764 -2184
17843b184m595j6122N0033n8944j3967P5045O7202M476o6010k7496m553J6156
$$ -2184 -6779 -22901 27132 -31812 -45779 29266 96468 100944 34934 7438 2885 19041
17831A9041p1478K0608R3943L7454q0635m2424J6818l1184k6234l0322P690L6355
$$ 19041 -52437 -31829 62114 99568 18933 -23491 -6673 -37857 -64091 -94413 -86723 -50368
17819e0368L0174p787J3695M9298p2783l5326M9587J53374K2968j5566J7014q4684
$$ -50368 -20194 -27981 -14286 35012 -37771 -73097 -23510 129864 152832 137266 154280 69596
17807F9596m1051J6555M3903l4148m6640k1004K0338L8636P971j5217r6377j4925
$$ 69596 28545 45100 89003 54855 8215 -12789 7549 46185 54156 38939 -57438 -72363
17795g2363J4338J17993l6865k453L2644J5936r0746o8958j00391J25330K7636
$$ -72363 -58025 59968 23103 20650 53294 69230 -21516 -90474 -190865 -65535 -37899
17784c7899K5774Q128j7797k969P475K4798l4113j05975J8990J26608J02363N99
$$ -37899 -12125 -3997 -21794 -24763 -17288 7510 -26603 -132578 -113588 13020 115383 115982
17772A15982o1226m5772k9774N2105l9279k1236q4836p578l0883N5022L0263K3822
$$ 115982 54756 8984 -20790 31315 -7964 -29200 -114036 -121614 -152497 -97475 -67212 -43390
17760d3390n4802q2061L4081R6673k4136K5927K0482k7136J3454l4289o6514k6611
$$ -43390 -98192 -180253 -146172 -49499 -73635 -47708 -27226 -54362 -40908 -75197 -141711 -168322
17748a68322j9565o095j22197Q6859J43914N3991J00830M821K5767O3885j08860
$$ -168322 -187887 -193982 -316179 -229320 -85406 -31415 69415 74236 100003 163888 55028
17737E5028P965Q534l5054j0398r1420q2149N1442N7811N335j4875J0209L6392
$$ 55028 62993 71527 36473 26075 -65345 -147494 -96052 -38241 -32906 -47781 -37572 -1180
17725a180L8466L2844n2527k0400l7888K5265J4227j32157J0854P5503l3339k87
$$ -1180 37286 70130 17603 -2797 -40685 -15420 -1193 -133350 -122496 -46993 -80332 -80619
17713h0619o3430k021O396P057N0693O6211O5578j5358j9113J7656n8587L02J5806
$$ -80619 -144049 -146070 -139674 -132617 -81924 -15713 49865 34507 15394 33050 -25537 -25235 -9429
17700i429r8765J437K2057O4439M5089o7537l6650j1401p042n97k5080J29393
$$ -9429 -108194 -106757 -84700 -20261 24828 -42709 -79359 -90760 -97802 -98399 -123479 5914
17688E914L6066j064o1144p9533l2120m5050j4126N1148O3146J5915m8754o3032
$$ 5914 41980 40916 -20228 -99761 -131881 -176931 -191057 -139909 -76763 -60848 -109602 -172634
17676a72634J26678K3920J7031K3915K2595k7725l1664m575r716J25518n467j72655
$$ -172634 -45956 -22036 -5005 18910 41505 13780 -17884 -22459 -32175 93343 87876 -84779
17664h4779q1132j3403J16621L606l6417Q172O5188M5108J05954n143r5531q4720
$$ -84779 -165911 -179314 -62693 -59087 -95504 -87332 -22144 22964 128918 123775 28244 -56476
17652e6476O417J03451K1995j3385j333m5048k9731O1539J3593J01710k202j69096
$$ -56476 -50059 53392 75387 62002 60669 15621 -14110 47429 61022 162732 160530 -8566
17640h566L1619N2631j3846m2683M6723J6516M0963R562j0434k2167k4025o2403
$$ -8566 23053 75684 61838 19155 65878 82394 123357 132919 122485 100318 76293 13890
17628A3890o8934o5713k7992M9439M0486k6457N6525M5689m2961p225R606r4949
$$ 13890 -55044 -120757 -148749 -99310 -58824 -85281 -28756 16933 -26028 -33253 -23647 -118596
17616a18596K0981J9900q9867l0859k7773j59O1990J24947J31838k8208q1337
$$ -118596 -97615 -77715 -167582 -198441 -226214 -226373 -164383 -39436 92402 64194 -17143
17605a7143o7473q1623j7398J5515q655J85600L3237j2028q4896l5290K410L7912
$$ -17143 -84616 -166239 -183637 -168122 -176777 8823 42060 30032 -54864 -90154 -87744 -49832
17593d9832K272N48J05186N2913q3314r6945p5492J26484J08281j4103k5532l0235
$$ -49832 -47560 -47012 58174 111087 27773 -69172 -144664 -18180 90101 75998 50466 20231
17581B0231J4900n7509r4617m1890j0186J9850J33694J06982k6196r2663j12840
$$ 20231 35131 -22378 -116995 -158885 -169071 -149221 -15527 91455 65259 -27404 -140244
17570a40244O0651m2436k5622J31501J11363n5619o4346J6819K9520j03662k5270
$$ -140244 -79593 -122029 -147651 -16150 95213 39594 -24752 -7933 21587 -82075 -107345
17559a07345J26279J33308J5651j20130O2687m2762j32316l303L3540J19362k997
$$ -107345 18934 152242 167893 47763 110450 67688 -64628 -67931 -34391 84971 81974
17548H1974j18933J6626o7127L072R3884M6653m1431j7253q477J86q3514k7297
$$ 81974 -36959 -20333 -87460 -84388 9496 56149 14718 -2535 -11012 -10826 -94340 -121637
17536a21637J2707k7609n335l8144J04369N2024Q537o2814K8760J24847k3227
$$ -121637 -108930 -136539 -141874 -180018 -75649 -23625 -15088 -77902 -49142 75705 52478
17525E2478l0256o2573N7392j0520m6799m6307N522M4436l0697j00442J9389J25996
$$ 52478 22222 -40351 17041 6521 -40278 -86585 -81063 -36627 -67324 -167766 -148377 -22381
17513b2381j05808j26522Q2858R0670j0898N6045J8623j1928O2152n8891K9008
$$ -22381 -128189 -254711 -171853 -81183 -92081 -36036 -17413 -29341 32811 -26080 2928
17502B928n8249k9508j39867L7104P2055K735j1838O8054j2451l8043o0837k8902
$$ 2928 -55321 -84829 -224696 -187592 -115537 -112802 -124640 -56586 -69037 -107080 -167917 -196819
17490a96819R0731Q1171J04324n7550J28725p6308o1734o1918n6902M8696K4861
$$ -196819 -106088 -24917 79407 21857 150582 74274 12540 -49378 -106280 -57584 -32723
17479c2723L0321N9319k2718m7435j00559M8118M4915m631j8608o4235n6740K4279
$$ -32723 -2402 56917 34199 -13236 -113795 -65677 -20762 -25393 -44001 -108236 -164976 -140697
17467a40697j73j5248L8272L1736K3484j0425J8112q735o3415J5801J39881K9788
$$ -140697 -140870 -156118 -117846 -86110 -62626 -73051 -54939 -63674 -127089 -111288 28593 58381
17455E8381m8503k7495q741N4233j6031m7013O892J32433K21699J70186J09477
$$ 58381 9878 -17617 -26358 27875 11844 -35169 -28277 104156 325855 496041 605518
17444F05518J81857J94566k1503j82300k72703k28086j28991r9560k004J7734
$$ 605518 787375 981941 960438 778138 505435 277349 148358 48798 46794 64528
17434F4528m9803j03751q1255N0323R207l8832P3335Q7589J7669N4624m0912j21132
$$ 64528 14725 -89026 -170281 -119958 -110751 -149583 -76248 11341 29010 83634 42722 -78410
17422g8410j9170O7513M7760q7606Q0472N9763p8511N801p82M2777m8037M4970
$$ -78410 -97580 -30067 17693 -69913 10559 70322 -8189 -2388 -3170 39607 -8430 36540
17410C6540J20501j40485j26869J5614J31483M0354l5447q7423Q3206j03072r0964
$$ 36540 157041 16556 -110313 -94699 36784 77138 41691 -45732 37474 -65598 -156562
17399a56562J1915l7283Q0063J06390J8728j22125J9210M6820M8145K3259j5283
$$ -156562 -144647 -181930 -101867 4523 23251 -98874 -79664 -32844 15301 38560 23277
17388B3277Q2509N9612m7964q3229r0474l5855Q6606Q168o6843j01542R9357k87
$$ 23277 105786 165398 117434 34205 -56269 -92124 -5518 2650 -64193 -165735 -66378 -66665
17376f6665j1745O3610P7309l3545O4838J067l3560Q029M1693l9458n6202q1335
$$ -66665 -78410 -14800 62509 28964 93802 94869 61309 69338 111031 71573 15371 -65964
17364f5964Q631L6544J32709p5266j40053J1407p0606J24923R7052M7626q1583
$$ -65964 -57333 -20789 111920 36654 -103399 -91992 -162598 -37675 59377 107003 25420
17353B5420l2944l4367J5390o56o409J7403j9380J21408J5951m492n5358n5799
$$ 25420 -7524 -41891 -26501 -27157 -33566 -16163 -35543 85865 101816 97324 41966 -13833
17341a3833m6577m6233M7773R5328J11453n0385l8716M2640r5140j44408Q126
$$ -13833 -60410 -106643 -58870 36458 147911 97526 58810 101450 6310 -138098 -129972
17330a29972L1038Q9133Q0530N1518N185L0963J10463M740j83144j16088L8043
$$ -129972 -98934 -9801 70729 122247 127432 158395 268858 273598 90454 -25634 12409
17319A2409N5829k9976l6313N0372p4845n878J12848M0176m9434q2794l4327l5145
$$ 12409 68238 38262 1949 52321 -22524 -28402 84446 124622 75188 -7606 -41933 -77078
17307g7078l2026K1936K0384J39886J06972j8777L6171q1726j84729j32444Q2706
$$ -77078 -109104 -87168 -66784 73102 180074 161297 197468 115742 -68987 -201431 -118725
17296a18725M8983K6236K8338O9338J8294n1704P5054k6660p2703p6119L378K8338
$$ -118725 -69742 -43506 -15168 54170 72464 20760 95814 69154 -3549 -79668 -76290 -47952
17284d7952J8824R9795L224j51255n0538j0799N641J10730J7401L9154j9189o9119
$$ -47952 -29128 70667 73891 -77364 -127902 -138701 -133060 -22330 -4929 34225 15036 -54083
17272e4083K8610N9961n4345K2204p817k5865J183l9696o0085Q4498M0013J47120
$$ -54083 -25473 34488 -19857 2347 -5470 -31335 -30152 -69848 -129933 -45435 -5422 141698
17260A41698j7717j44817R3925n1790j05493K2509N8180k8823J4675J3383l6834
$$ 141698 123981 -20836 73089 21299 -84194 -61685 -3505 -32328 -17653 -4270 -41104
17249d1104K9115j7295j21420n7358m2553l1138J06270Q6745J21882N6409l3356
$$ -41104 -11989 -29284 -150704 -208062 -250615 -281753 -175483 -88738 33144 89553 56197
17238E6197j41464K8068R5932k0540o8800q5747r164j7520J8698L6849M1946J26656
$$ 56197 -85267 -57199 38733 18193 -50607 -136354 -145518 -163038 -144340 -107491 -65545 61111
17226F1111N6999k9036k3438j43403j16435R912O5518p247L363O3345L340O6248
$$ 61111 118110 89074 65636 -77767 -194202 -184290 -118772 -126019 -122656 -59311 -55971 10277
17214A0277L3831J5294J9659J1781m3334p4005k9821m7040k2111K6126J45092
$$ 10277 44108 59402 79061 90842 47508 -26497 -56318 -103358 -125469 -99343 45749
17203D5749J5522L5666q7708q690k4683K7610m5656p0896r1756K7306P9276p295
$$ 45749 61271 96937 9229 539 -24144 3466 -42190 -113086 -204842 -177536 -98260 -105555
17191a05555n5990O5632J8373m765n580K8999k3789L6465J38742J0172p1948m2662
$$ -105555 -161545 -95913 -77540 -82305 -87885 -58886 -82675 -46210 92532 102704 30756 -11906
17179a1906l3644o0131m5619L4424j3561L8846M0329o5064L7451J17701o1052
$$ -11906 -45550 -105681 -151300 -116876 -130437 -91591 -51262 -116326 -78875 38826 -22226
17168b2226k2135r6516j0040L2090K3371Q4693P452k6967p3474O8584J09549m4019
$$ -22226 -44361 -140877 -150917 -118827 -95456 -10763 -3311 -30278 -103752 -35168 74381 30362
17156C0362k2794Q7461J08277k5840o3574p197n7263j19131J1896q0255K6193
$$ 30362 7568 95029 203306 177466 113892 106695 49432 -69699 -57803 -138058 -111865
17145a11865O4813K7435j1512R291N559J4496P1110j3948j1757n2154K1543J5547
$$ -111865 -47052 -19617 -31129 -21838 -16279 -1783 69327 55379 43622 -8532 13011 28558
17133B8558o4823r5129K3932R8039R1223l1774k0343m3517k436R3343J5231K887
$$ 28558 -36265 -131394 -107462 -9423 81800 50026 29683 -13834 -16270 77073 92304 95191
17121I5191o2985r4784L5917P8815l7631n5553O2235N1195p681k9753K3372L63
$$ 95191 32206 -62578 -26661 52154 14523 -41030 21205 72400 64719 34966 58338 58701
17109E8701o4711m4003q065L9563m0360m0698k4418j9639m9344R615M0732P4736
$$ 58701 -6010 -50013 -58078 -18515 -58875 -99573 -123991 -143630 -192974 -183359 -142627 -67891
17097f7891O0978j9023m2913l6152m8583p0469K3167j6016J2635N0392j1796L6417
$$ -67891 -6913 -25936 -68849 -105001 -153584 -224053 -200886 -216902 -204267 -153875 -165671 -129254
17085a29254l552o6563j5872J8248L0898j3985k0070J6789K8536N5555R2170l9366
$$ -129254 -132806 -199369 -215241 -196993 -166095 -180080 -200150 -183361 -154825 -99270 -7100 -46466
17073d6466o8104L9596J0719N2023j8943L4451M0975J7954q3211p3148j0252N5307
$$ -46466 -114570 -74974 -64255 -12232 -31175 3276 44251 62205 -21006 -94154 -104406 -49099
17061d9099J9282o7954k4647L1164J25352Q5044k2269q1709k9696R2876J16427
$$ -49099 -29817 -97771 -122418 -91254 34098 119142 96873 15164 -14532 78344 194771
17050A94771m8904m8356N0533r0969L557k6534o57n7271j7521L2832N8676j4455
$$ 194771 145867 97511 148044 57075 60632 34098 33441 -23830 -41351 -8519 50157 35702
17038C5702j35221K2587J10854k1521j2241L985l5528L1339K7051j18473J2535
$$ 35702 -99519 -76932 33922 12401 160 4145 -31383 -44 27007 -91466 -78931
17027g8931J2952M8044O8434l2306N259K1963j8717m4518M5109j7638n2700M2501
$$ -78931 -65979 -17935 50499 18193 23452 45415 26698 -17820 27289 9651 -43049 -548
17015e48n0705o5726O2269L09J0340J21766p4741j17707p1900N4073L2602k1167
$$ -548 -51253 -116979 -54710 -54401 -44061 77705 2964 -114743 -186643 -132570 -99968 -121135
17003a21135p9270R1312L3129P5683M1625m5476m7563L828j5145l4459K675n5443
$$ -121135 -200405 -109093 -75964 -281 41344 -4132 -51695 -47867 -63012 -97471 -94796 -150239
16991a50239o437P5259Q1124k7612m2158J4427O7089J36083J20376l5750k44575
$$ -150239 -156676 -81417 -293 -27905 -70063 -55636 11453 147536 267912 232162 -12413
16980a2413P485O1225M9363k155k8591q5189k1112J8839o2551l0881L2191N4775
$$ -12413 -4928 56297 105660 103505 74914 -10275 -31387 -12548 -75099 -105980 -73789 -19014
16968a9014N2547N1406m1990j18991K2353J3286m4166O2541K2978L4535l5579
$$ -19014 33533 84939 42949 -76042 -53689 -40403 -84569 -22028 950 35485 -94
16957i4j2052n2585L8661M462q9037J00350p2419k42739m7609J05357L8873J6622
$$ -94 -12146 -64731 -26070 -21608 -110645 -10295 -82714 -325453 -373062 -267705 -228832 -212210
16945b12210N1845J8630R4236o178L0051J1860L8826j0889l4442p0252K2456k1906
$$ -212210 -160365 -141735 -47499 -53677 -23626 -11766 27060 16171 -18271 -88523 -66067 -87973
16933h7973q649j6928M4497p173l4806M6967n6798m9972Q2190l5608k0694J17019
$$ -87973 -96622 -113550 -69053 -76226 -111032 -64065 -120863 -170835 -88645 -124253 -144947 -27928
16921b7928O768j3124L4470o8212l8861P835Q7804l5949j09142L85O6924j5245
$$ -27928 -21160 -34284 186 -68026 -106887 -99052 -11248 -47197 -156339 -155954 -89030 -104275
16909a04275k5424j5615M9135R7402J8882j75834j3776O6018Q5115M7514J10475
$$ -104275 -129699 -145314 -96179 1223 20105 -155729 -169505 -103487 -18372 29142 139617
16898A39617j8807n4092n6523j845j3436k9340j3004r009O1757J32517M5796Q87
$$ 139617 120810 66718 10195 8350 -5086 -34426 -47430 -56439 5318 137835 183631 184518
16886A84518j08916j07399n0658J7898k835J55573L6715j06065r6422k7732j333
$$ 184518 75602 -31797 -82455 -64557 -67392 88181 124896 18831 -77591 -105323 -106656
16875a06656Q448J3320N086J40908R6694K3311J7243j20768k0875K5766j48405
$$ -106656 -98208 -84888 -79802 61106 157800 181111 198354 77586 56711 82477 -65928
16864f5928p0822K5016n5318O2846q1300J6897Q0165K3483l1507K5593K1452p401
$$ -65928 -136750 -111734 -167052 -104206 -185506 -168609 -88444 -64961 -96468 -70875 -49423 -56824
16852e6824M4834j4417L752q62l1107r5275o8452O3145N896p7241Q8852R7727
$$ -56824 -11990 -26407 -22655 -23517 -54624 -149899 -218351 -155206 -149310 -226551 -137699 -39972
16840c9972r783J6087J11681r0781j02650L0308j338k216j9016O8516k8925j1055
$$ -39972 -49755 -33668 78013 -12768 -115418 -85110 -86448 -88664 -107680 -39164 -68089 -79144
16828g9144q660n4060m6112J40517N6048j04302n6110K7857J8570N9852M3005
$$ -79144 -87804 -141864 -187976 -47459 8589 -95713 -151823 -123966 -105396 -45544 -2539
16817b539K6752r1908k3912k0865p931K2053M2157q919k7372j7001P8819N7672
$$ -2539 24213 -67695 -91607 -112472 -120403 -98350 -56193 -65112 -92484 -109485 -30666 27006
16805B7006M6617n4264m9474P801M1670M9602m7823L3966O8574j30015R174M8855
$$ 27006 73623 19359 -30115 -22314 19356 68958 21135 55101 123675 -6340 2834 51689
16793E1689l9549k9090l8272O409N7625p7602J9198k2299m5983r0374K988P1856
$$ 51689 12140 -16950 -55222 -48813 8812 -68790 -49592 -71891 -117874 -208248 -205260 -133404
16781a33404Q5269l2207j9243J15995J4251p3827p7988p1392l8011J60471J34211
$$ -133404 -48135 -80342 -99585 16410 30661 -43166 -121154 -192546 -230557 -70086 64125
16770F4125J28778O6440j39368k28492m6214K1544M8151M3955K6656p3158r8389
$$ 64125 192903 259343 119975 -108517 -154731 -133187 -85036 -41081 -14425 -87583 -185972
16759a85972o8493J47430J62350L7857J1536m4285r8153q5295J5156J07036O8234
$$ -185972 -254465 -107035 55315 93172 104708 60423 -37730 -123025 -107869 -833 67401
16748F7401j10829p1210L7827j107L5404Q0953q6106Q334j1254N1590K0747l5401
$$ 67401 -43428 -114638 -76811 -77918 -42514 38439 -47667 -39333 -50587 1003 21750 -13651
16736a3651k1655N0942P4635j1236j06932m0213n3575M1426k2205k0720q82K307
$$ -13651 -35306 15636 90271 79035 -27897 -68110 -121685 -80259 -102464 -123184 -124066 -121759
16724a21759P2802Q222n9398l6194N807L4326K3166o5463J307L7159J20680q0176
$$ -121759 -48957 -40735 -100133 -136327 -130520 -96194 -73028 -138491 -137184 -100025 20655 -59521
16712e9521J3049Q1242j09072m2114K5749P961n6846N3174M7774K6535R4586p694
$$ -59521 -46472 34770 -74302 -116416 -90667 -82706 -139552 -86378 -38604 -12069 82517 74823
16700G4823j13702n7132m1618K3130M1129N6060L0805M7782L8824q009k27N533
$$ 74823 -38879 -96011 -137629 -114499 -73370 -17310 13495 61277 100101 92092 91865 97398
16688I7398n8145L3412n2894n6653L6456p81l9996P0063j5079j4435L9721r9060
$$ 97398 39253 72665 19771 -36882 -426 -1207 -41203 28860 13781 -654 39067 -59993
16676e9993O485O2485j9383N5049J6015j36373O6028K05231k2384j24625N1331
$$ -59993 -53508 8977 -10406 44643 60658 -75715 -9687 195544 173160 48535 99866
16665I9866j04054o0470K0793N6229J0075O4948o4357p1576r6383n3104m4505
$$ 99866 -4188 -64658 -43865 12364 22439 87387 23030 -48546 -144929 -198033 -242538
16654b42538k554J09198J61150P30q4116L4134K8884N516M3586q1140m2910L9812
$$ -242538 -245092 -135894 25256 25986 -58130 -23996 4888 10404 53990 -27150 -70060 -30248
16642c0248M6047l4102p7490j0821N3477J6415l6878N2774j789j19046L0103R0822
$$ -30248 15799 -18303 -95793 -106614 -53137 -36722 -73600 -20826 -22615 -141661 -111558 -20736
16630b0736o1162l2726o5010O5189Q0344J11383j2370j06112O2278O2950j9591
$$ -20736 -81898 -114624 -179634 -114445 -34101 77282 64912 -41200 21078 84028 64437
16619F4437M1230p3179o5244N67J08506J22405k4929r1210o8488j1987K8001P828
$$ 64437 105667 32488 -32756 -32189 76317 198722 173793 82583 14095 2108 30109 37937
16607C7937q8127m7749l3707J08891Q8969l6642l6066J7568P7424p2630o9711
$$ 37937 -50190 -97939 -131646 -22755 66214 29572 -6494 11074 88498 15868 -53843
16596e3843p8622n328O4669r323r6603O9271P8303o6415j31017j6903P2113J35622
$$ -53843 -132465 -137793 -73124 -82447 -179050 -109779 -31476 -97891 -228908 -245811 -173698 -38076
16584c8076L2135L3583j32733j11217J26797J06530L8090o2120q0064J8706k05
$$ -38076 -5941 27642 -105091 -216308 -89511 17019 55109 -7011 -87075 -68369 -68574
16573f8574J5730P715l0672l0332Q2165J01533N3241k7501p81m7545j3228K8167
$$ -68574 -52844 -45129 -75801 -106133 -23968 77565 130806 103305 102524 54979 41751 69918
16561F9918K6240o6109Q8435q7696j5008l1121m2204o9604P5836J80334K9486
$$ 69918 96158 30049 118484 30788 15780 -15341 -57545 -127149 -51313 129021 158507
16550A58507r646J6771M7981k9860m2823J3066J0806Q6409k3129j2782M1467o6963
$$ 158507 148861 165632 213613 183753 140930 153996 164802 251211 228082 215300 256767 189804
16538A89804n6195p1264k20k9823l5748M3253o0147K9141l0007l4728Q671L2072
$$ 189804 133609 62345 62125 32302 -3446 39807 -20340 8801 -21206 -55934 -47263 -15191
16526a5191k5124n8939k2588m9887O4262J53914M8978J6893p5034M3352O9777
$$ -15191 -40315 -99254 -121842 -171729 -107467 46447 95425 112318 37284 80636 150413
16515A50413L9083J0182m6193m5229r2510j17554p2729j3514R7744j9102L9469
$$ 150413 189496 199678 153485 108256 15746 -101808 -174537 -188051 -90307 -109409 -69940
16504f9940K3539R8502j0657m0351k6624m7228p8920J4314K2518Q0232M3991L1414
$$ -69940 -46401 52101 41444 1093 -25531 -72759 -151679 -137365 -114847 -34615 9376 40790
16492D0790n0755J4888K1224r9090m2198l7362L6101O0828J6187l6690m7034N5602
$$ 40790 -9965 4923 26147 -72943 -115141 -152503 -116402 -55574 -39387 -76077 -123111 -67509
16480f7509J37668K0991J1648j3342m4945k1592j8635q6186k2572Q07l2355P3829
$$ -67509 70159 91150 102798 89456 44511 22919 4284 -81902 -104474 -103667 -136022 -62193
16468f2193J32817q6668j9164N3339j0937o9428J521o2005j529N4691M716j26459
$$ -62193 70624 -16044 -35208 18131 7194 -62234 -60713 -122718 -124247 -69556 -64840 -191299
16456a91299n8363J563l3859K6234M9284R304J9349l1233m156K8517m4948R5046
$$ -191299 -249662 -248099 -281958 -255724 -206440 -197136 -177787 -209020 -213176 -184659 -229607 -134561
16444a34561L3094K6708N8861K981j4068L1114p6799n1071l4818J3277J03349
$$ -134561 -101467 -74759 -15898 -12917 -26985 4129 -72670 -123741 -158559 -145282 -41933
16433d1933M1430l584K3972q443K208J4197n2906L1102M4085k756o319j7624m7264
$$ -41933 -503 -4087 19885 11442 13650 27847 -25059 6043 50128 47372 41053 23429 -23835
16420b3835P7312K8164m0731N0908l1985m1162p3968j1497L1015o3213R131N3361
$$ -23835 53477 81641 40910 91818 59833 18671 -55297 -66794 -35779 -98992 -89861 -36500
16408c6500p5532P9036R6620r4614j04942O9053M5597J94358J17702m9273j21140
$$ -36500 -112032 -32996 63624 -30990 -135932 -66879 -21282 173076 290778 241505 120365
16397A20365o7973J20437K5566n6684k9012k3543n3429q6376R053L2796j21009
$$ 120365 52392 172829 198395 141711 112699 89156 35727 -50649 -41596 -8800 -129809
16386a29809O3872J22456N8747j5681j15129m7203K3240r3961n9783q5392q4056
$$ -129809 -65937 56519 115266 99585 -15544 -62747 -39507 -133468 -193251 -278643 -362699
16375c62699r6922J49337J60148Q3835m3847j4069J08363O8491N7545m4680j49650
$$ -362699 -459621 -310284 -150136 -66301 -110148 -124217 -15854 52637 110182 65502 -84148
16364h4148p9490J21251N6338L1049n2330k3108Q2151j8412k8351K4290N647n2879
$$ -84148 -163638 -42387 13951 45000 -7330 -30438 51713 33301 4950 29240 34887 -17992
16352a7992j6368R768j0752J8448K9512l902n2701J4358l3318J157M0801m9685
$$ -17992 -34360 -24592 -35344 -16896 12616 8714 -43987 -29629 -62947 -61790 -20989 -70674
16340g0674P7423J6911k4059L805J01185o981o8333n2897M8685P0453k7586l1148
$$ -70674 6749 23660 -399 3406 104591 97610 29277 -23620 25065 95518 67932 36784
16328C6784M89m482L2345p3544p7133K520J76307O7659l8615n3207L6339J17962
$$ 36784 37273 32791 65136 -8408 -85541 -83021 93286 160945 122330 69123 105462 223424
16316B23424P8784m3453o0506n0474o2602n9958P0732R7580P344k4449l5625n1083
$$ 223424 302208 258755 198249 147775 85173 25215 95947 193527 200871 176422 140797 89714
16304H9714n1642p4899M8684K2872N3940L4368o2681L649K8660K21481n8230j71709
$$ 89714 38072 -36827 11857 34729 88669 123037 60356 64005 92665 314146 255916 84207
16292H4207n4397m4626O6632L4561M687Q2285l2920R4825j2123o1726n8378p6888
$$ 84207 29810 -14816 51816 86377 91064 173349 140429 235254 223131 161405 103027 26139
16280B6139j05244N0931J9344j06790q0916l8388L6792O3734R8741m9944P3064
$$ 26139 -79105 -28174 -8830 -115620 -196536 -234924 -198132 -134398 -35657 -85601 -12537
16269a2537r773L4844J5634m6008J9579n9733P6042N7898j41602n9749L7434N3108
$$ -12537 -22310 12534 28168 -17840 1739 -57994 18048 75946 -65656 -125405 -87971 -34863
16257c4863P8806K1270j05826l1851l737Q4016M5095j9997J3064K2401p1098k6578
$$ -34863 43943 65213 -40613 -72464 -76201 7815 52910 32913 45977 68378 -2720 -29298
16245b9298p320k2713k2982O6485R4972j4652K2187J02032O0225J1182j23257
$$ -29298 -36618 -59331 -82313 -15828 79144 64492 86679 188711 248936 260118 136861
16234A36861p1236N1885J09876j2749n5473N2183p4471j50360K1630Q0441O7960
$$ 136861 65625 117510 227386 214637 159164 211347 136876 -13484 8146 88587 156547
16223A56547k9226L9163m9209n2382l1479m6877R6529N1735l7910j38817r104
$$ 156547 127321 166484 117275 64893 33414 -13463 83066 134801 96891 -41926 -51030
16212e1030J02747K0772l0415p3611n6866k6608j8629M3627M9441K8735m167P404
$$ -51030 51717 72489 42074 -31537 -88403 -115011 -133640 -90013 -40572 -11837 -16004 -8600
16200h600K253r8854N062J5876R5663j5871r9638r194M5350J421M1961Q9467k3711
$$ -8600 -6347 -105201 -100139 -84263 11400 -4471 -104109 -113303 -67953 -66532 -24571 64896 41185
16187D1185R9068j78j42474j2022K0657p3182O2506k0241L3000j49011J206J61534
$$ 41185 140253 140075 -2399 -14421 6236 -66946 -4440 -24681 8319 -140692 -139486 22048
16175B2048R5846j35190j3128j474K5843K2667m9115j9099O5764K4269K054p1684
$$ 22048 117894 -17296 -30424 -31898 -6055 16612 -32503 -51602 14162 38431 40485 -31199
16163c1199p1353L1700K2297l1289k5540K4996m7023Q9014R4142j58357O7796
$$ -31199 -102552 -70852 -48555 -79844 -105384 -80388 -127411 -38397 55745 -102612 -34816
16152c4816Q0744n17k6966r4726j34693N744N2694P9522J27546r127r3621k1600
$$ -34816 45928 45411 18445 -76281 -210974 -205230 -152536 -73014 54532 45405 -48216 -69816
16140f9816R6026O6997j8858P0776o5770j27181k3216J1107L8584m0248K1438
$$ -69816 26210 93207 74349 145125 79355 -47826 -71042 -59935 -21351 -61599 -40161
16129d0161J5428k1561J4922M6043K3036L349j2276j6620o1559o7933M1626L8176
$$ -40161 -24733 -46294 -31372 14671 37707 41056 28780 12160 -49399 -117332 -75706 -37530
16117c7530M9549O1747r4474j7915R0170L9260l3465K03O5258n6362k6498O6978
$$ -37530 12019 73766 -20708 -38623 51547 90807 57342 57545 122803 66441 39943 106921
16105A06921l9377p0967N6092O0374j412r7980p2961r110M0469O6327J34829k1887
$$ 106921 67544 -3423 52669 113043 111631 13651 -59310 -68420 -27951 38376 173205 151318
16093A51318q2403r7411P0292J25163q9000J6417m6041q0266N824Q0146M4225
$$ 151318 68915 -28496 41796 166959 77959 94376 48335 -31931 -26107 54039 98264
16082I8264j02086j66340p3038J269q887k2234K2987L414J12346P6815r8980J0899
$$ 98264 -3822 -170162 -243200 -241931 -250818 -273052 -250065 -246651 -134305 -57490 -156470 -145571
16070a45571N632J5865R7687L9219J1590R006k6154N6013Q8846R416l5478l5732
$$ -145571 -139939 -124074 -26387 12832 24422 33428 7274 63287 152133 161549 126071 90339
16058I0339R7380p325n4748p2507k7148l6217M1689M6811m8880n4978N387L374
$$ 90339 187719 180394 125646 53139 25991 -10226 31463 78274 29394 -25584 -20197 -16823
16046a6823R9418j6047j05954j9123O7526M5115j39138m3261O3897q910k9107
$$ -16823 82595 66548 -39406 -58529 8997 54112 -85026 -128287 -64390 -73300 -102407
16035a02407M4404Q8087n844L4953L2217m1060O2463q6395j39728M6606J6276
$$ -102407 -58003 30084 24240 59193 91410 50350 112813 26418 -113310 -66704 -50428
16024e0428p1468R1947M3947Q850m6110j01436J51434j4188k8096M6485K2295
$$ -50428 -121896 -29949 13998 22848 -23262 -124698 26736 12548 -15548 30937 53232
16013E3232k8093M5733K513n9489j9214l2471J26023p9890K8035p807j83862k5918
$$ 53232 25139 70872 73385 13896 -5318 -37789 88234 8344 36379 28572 -155290 -181208
16001a81208J42276O7863j19523m0549N8757P2695R883J23176P6744J6528p4263
$$ -181208 -38932 28931 -90592 -131141 -72384 311 10194 133370 210114 226642 152379
15990A52379j06066q2125L0304M8788O7583l9119o8397n8761j02300J0769N9508
$$ 152379 46313 -35812 -5508 43280 110863 71744 3347 -55414 -157714 -146945 -87437
15979h7437O7849J02013l9529n1829p5820k3710n0010J9219N0375n8973K3979
$$ -87437 -19588 82425 42896 -8933 -84753 -108463 -158473 -139254 -88879 -147852 -123873
15968a23873Q2745M5936q030q6634n2386J6673N0357J37134K5960j2645J6011
$$ -123873 -41128 4808 -3222 -89856 -142242 -125569 -75212 61922 87882 75237 91248
15957I1248j8754m6421Q801O2510J8071j79718n1287N1466P0484J8219j1772r5914
$$ 91248 72494 26073 34874 97384 115455 -64263 -115550 -64084 6400 24619 12847 -83067
15945h3067N9731K2596j4036n838N4810k9999l0839p7407J20726P1335o084l1677
$$ -83067 -23336 -740 -14776 -20614 34196 4197 -26642 -104049 16677 88012 81928 50251
15933E0251p6398m9581r562R9713J38346J8689j25606k2092J1965o9764j1411
$$ 50251 -26147 -75728 -85290 14423 152769 171458 45852 23760 35725 -34039 -45450
15922d5450M7114L7656P8913o1766l6731l5028M9078K9058m307j3977j5674L5175
$$ -45450 1664 39320 118233 56467 19736 -15292 33786 62844 58537 44560 28886 64061
15910F4061J10279M7012J0996M1586M96j3724n9199j87598k2974O5841k7738M6536
$$ 64061 174340 221352 232348 273934 274430 260706 201507 13909 -9065 56776 29038 75574
15898G5574j43978m3890k5908L3770P8492M4685n3238n6683L6582J06789k6648
$$ 75574 -68404 -112294 -138202 -104432 -25940 18745 -34493 -91176 -54594 52195 25547
15887B5547K5029l5315N0591P5836K3757P6037j28600j76482n2342R654O1668
$$ 25547 50576 15261 65852 141688 165445 241482 112882 -63600 -115942 -106288 -44620
15876d4620P4962m1988m5552N2418P9706l0642j06083j7619m4612q7206K1264
$$ -44620 30342 -11646 -57198 -4780 74926 44284 -61799 -79418 -124030 -211236 -189972
15865a89972N5287M4263P5394k2084n1232n0748J2688m730n6527P065J06330M0011
$$ -189972 -134685 -90422 -15028 -37112 -88344 -139092 -126404 -131134 -187661 -180596 -74266 -34255
15853c4255M8413K8935O1187j7322k6691j1337r1940j747o3435K0137Q8504O0645
$$ -34255 14158 43093 104280 86958 60267 48930 -43010 -44757 -108192 -88055 449 61094
15841F1094M4017K5148l3236N9445j1502j40178m4669j8786L3546O3386j4920
$$ 61094 105111 130259 97023 156468 144966 4788 -39881 -58667 -25121 38265 23345
15830B3345Q1278P4204j16820m0962M6146P2431J8450j19985l5325M9605K9830
$$ 23345 104623 178827 62007 21045 67191 139622 158072 38087 2762 52367 82197
15819H2197j02612k6174L9416n041j9112j5334k1254L6861n1883M5077Q5522J06303
$$ 82197 -20415 -46589 -7173 -12214 -31326 -46660 -67914 -31053 -82936 -37859 47663 153966
15807A53966L6000q1330p0270l0566K9351m0630j11560o2244o0565K56880K40015
$$ 153966 189966 108636 38366 7800 37151 -3479 -115039 -177283 -237848 19032 259047
15796B59047r0775o2135j23845n059K9807o0581o6154o4833J33549K8754o8920
$$ 259047 168272 106137 -17708 -22767 7040 -53541 -119695 -184528 -50979 -22225 -91145
15785i1145n657N0710K2985l2419m6014R2578m5474q1476N9344J5438K6039J9034
$$ -91145 -96802 -46092 -23107 -55526 -101540 -8962 -54436 -135912 -76568 -61130 -35091 -16057
15773a6057j0836L1606M4474K2361m7714o1773M7755L7685N9730O956j06927l3332
$$ -16057 -26893 4713 49187 71548 23834 -37939 9816 47501 107231 114187 7260 -26072
15761b6072n8218K1727l5712M160O0534J12875K317o324o1519j17150M769l3244
$$ -26072 -84290 -62563 -98275 -94115 -33581 79294 81611 75287 13768 -103382 -98613 -131857
15749a31857N3140j6490J0951N8056L0534K1591K0482k4663p9302p8144j3810
$$ -131857 -78717 -95207 -84256 -26200 4334 25925 46407 21744 -57558 -135702 -149512
15738a49512j3160L1727Q69O0549P655l3888k2601J03490J36435K9723k1667j3428
$$ -149512 -162672 -130945 -130076 -69527 -61872 -95760 -118361 -14871 121564 151287 129620 116192
15726A16192j73969n5487L2397L4443L1558M3982k3572j66229k7252N1502K8755
$$ 116192 -57777 -113264 -80867 -46424 -14866 29116 5544 -160685 -187937 -136435 -107680
15715a07680P3086Q4205L5004O578r1063k6125l3673K427J2729q9046r2306P6290
$$ -107680 -34594 49611 84615 91193 130 -25995 -59668 -57241 -44512 -133558 -225864 -149574
15703a49574N2730K7507k2088M8721l947q0488n520L4049J08542k8586o748L8476
$$ -149574 -96844 -69337 -91425 -42704 -46651 -127139 -132659 -98610 9932 -18654 -25402 13074
15691A3074P231k5136j47823p7450R6920J24020N6733N0522n7068m1859j5651
$$ 13074 20305 -4831 -152654 -230104 -133184 -9164 47569 98091 41023 -836 -16487
15680a6487m3334n0668J06805Q8110M359j32314j24788J01912N0564O8718K6515
$$ -16487 -59821 -110489 -3684 84426 88785 -43529 -168317 -66405 -15841 52877 79392
15669G9392q6549n0513Q956K961M667J8843l982N3485Q1218j23981j0208K8060
$$ 79392 -7157 -57670 -48714 -45753 -41086 -22243 -26225 27260 108478 -15503 -25711 2349
15657B349o892o9124j3536J20726O5506j02859k5184k1428P6782J03185M8766
$$ 2349 -4543 -73667 -87203 33523 99029 -3830 -29014 -50442 26340 129525 178291
15646A78291p183j04334q8032n7191j1246p879Q2111J85860L344r3652O0188P1560
$$ 178291 171108 66774 -21258 -78449 -89695 -97574 -15463 170397 173741 80089 140277 211837
15634B11837k3258l3577r6265r0602k9574l0409l1274J40055Q052N1407N1986
$$ 211837 188579 155002 58737 -31865 -61439 -91848 -123122 16933 24985 76392 128378
15623A28378p5984r0082m2959N2556p9945j00128P9371P2300K9265N879K3288
$$ 128378 52394 -37688 -80647 -28091 -108036 -208164 -128793 -56493 -27228 -21349 1939
15612A939o745k2171O3799R1282J6190l7127o9972j23902k8467R5898L7137M4845
$$ 1939 -4806 -26977 36822 128104 144294 107167 37195 -86707 -115174 -19276 17861 62706
15600F2706p2672J2882n8252N4038O5377L7773j02776n4113k6676M5289l1605
$$ 62706 -9966 2916 -55336 -1298 64079 101852 -924 -55037 -81713 -36424 -68029
15589f8029J4714P5250o376j09752l7917N8203J30248M0063l5660Q5492r6646
$$ -68029 -53315 21935 15559 -94193 -132110 -73907 56341 96404 60744 146236 49590
15578D9590j10502m6453M7473N4234J5029k5421n1212m3503j059J4194R4014J888
$$ 49590 -60912 -107365 -59892 -5658 9371 -16050 -67262 -110765 -111824 -97630 -3616 -1728
15566a728l0563K7908l139J05174J248q2261p6036P8960J0866p3502R9774Q9546
$$ -1728 -32291 -4383 -7522 97652 98900 16639 -59397 19563 30429 -43073 56701 146247
15554A46247P4281p6126j71870l1398L7916j3384m3396m6060m0276Q9931N3473
$$ 146247 220528 144402 -27468 -58866 -20950 -34334 -77730 -123790 -164066 -74135 -20662
15543b0662k3943q619k2863N3399O9348p1305O0193O2229k4540l9176K3088j5183
$$ -20662 -44605 -53224 -76087 -22688 46660 -24645 35548 97777 73237 34061 57149 41966
15531D1966n157q368P5527p8395r6367p9065j38936o4594Q6421L5626L8166J34698
$$ 41966 36809 28441 103968 25573 -70794 -149859 -288795 -353389 -266968 -231342 -193176 -58478
15519e8478K2503j7001J662L5514l6008l6387r4214K0317J31820k7741k0944r775
$$ -58478 -35975 -52976 -51314 -15800 -51808 -88195 -182409 -162092 -30272 -58013 -78957 -88732
15507h8732N0081N3271K1706l9269l3792j406O3199J41652l0394o9793k1245o1802
$$ -88732 -38651 14620 36326 -2943 -36735 -38141 25058 166710 136316 66523 45278 -16524
15495a6524K4670N0104Q4832K2138k3944Q5381p7405o8414J3688l1913j12847
$$ -16524 8146 58250 143082 165220 141276 226657 149252 80838 94526 62613 -50234
15484e0234O6062J2259k6520L7507M5356j07668k8389p7209K7787N3920L9746
$$ -50234 15828 28087 1567 39074 84430 -23238 -51627 -128836 -101049 -47129 -7383
15473g383K7213l9795o8678L3755K7115j2090j3965k5645J07339J49165q727k863
$$ -7383 19830 -19965 -88643 -54888 -27773 -39863 -53828 -79473 27866 177031 168304 165441
15461A65441j9349K3099m0143m2061O0572M0394j04109n3619R2494K4682j3605
$$ 165441 146092 169191 129048 86987 147559 187953 83844 30225 122719 147401 133796
15450A33796n6937m3829O7703P982l5387r8895q8096Q2708J09018K3935n5155
$$ 133796 76859 33030 100733 108715 73328 -25567 -113663 -30955 78063 101998 46843
15439D6843n3150J5030M6794K7917o0908j04847o3846J35781N007l0504K6540
$$ 46843 -6307 8723 55517 83434 22526 -82321 -146167 -10386 -5379 -35883 -9343
15428i343O0827k5213n4759p8613Q9878P004J3915j0991j3928l7083R954J4071
$$ -9343 51484 26271 -28488 -107101 -17223 -10219 3696 -7295 -21223 -58306 -48352 -34281
15416c4281K3950Q0415N1929J5388k4663Q8895j6611r4743n3950n5825o8953n8799
$$ -34281 -10331 70084 122013 137401 112738 201633 185022 90279 36329 -19496 -88449 -147248
15404a47248M4981J76096J24650M2594K4534K3845p3627m1697r6842k2162j3590
$$ -147248 -102267 73829 198479 241073 265607 289452 215825 174128 77286 55124 41534
15393D1534o2281l2852M0688L2588n7257l8918j7428Q1069J5495l4370Q1104J53453
$$ 41534 -20747 -53599 -12911 19677 -37580 -76498 -93926 -12857 2638 -31732 49372 202825
15381B02825l0313k0847k7838p1914K4232N6660n5452j35103M4453L8254P0736
$$ 202825 172512 151665 123827 51913 76145 132805 77353 -57750 -13297 24957 95693
15370I5693K9491o7684K1015R418j5506O812j3469k76l760K0390P8498r134j35814
$$ 95693 125184 57500 78515 87933 72427 79239 65770 65494 61734 82124 160622 151488 15674
15357A5674m8344Q5574P2217l6313j8407O4381r37o4174O4199J198O241m5752
$$ 15674 -32670 52904 125121 88808 70401 134782 133845 69671 133870 135068 141309 95557
15345I5557j1N248o6325P3427j10208m362J16841r8575J2888P2049J3964q4176
$$ 95557 95546 100794 34469 107896 -2312 -6674 110167 11592 24480 96529 110493 26317
15333B6317k2404P3055L9516p3794j1662j9889Q8340l8805K6515N0834k3517r5047
$$ 26317 3913 76968 116484 42690 31028 11139 99479 60674 87189 138023 114506 19459
15321A9459J8976K8476m101m0729m4380m6799L5188O2171Q91K419P7060j3608
$$ 19459 38435 66911 62810 22081 -22299 -69098 -33910 28261 29152 31571 108631 95023
15309I5023j7868L599l123p5226j0707j9688P4237M2854N0384n0558J4067j5943
$$ 95023 77155 80754 77631 2405 -8302 -27990 46247 89101 139485 88927 102994 87051
15297H7051n8131N0424O8991r6342j03140J4254J4327M575M359Q8165R3343K5797
$$ 87051 28920 79344 148335 51993 -51147 -36893 -22566 -17991 -13632 74533 167876 193673
15285A93673O2842n4380m6835o5658o4487n7761J992M3183J19906K2422Q6606
$$ 193673 256515 202135 155300 89642 25155 -32606 -30614 12569 132475 154897 241503
15274B41503j6893k2137q2549q3249m7776L5497K6441K3233k0960Q482r770o3732
$$ 241503 224610 202473 119924 36675 -11101 24396 50837 74070 53110 61592 51822 -11910
15262a1910p0558K5525O6946N4012p2232j47875p0361O8810J1016J13271J8197
$$ -11910 -82468 -56943 10003 64015 -8217 -156092 -226453 -157643 -146627 -33356 -15159
15251a5159K1301k6346N3845J24900j01457j30282N5069J16597K4257n148m1929
$$ -15159 6142 -20204 33641 158541 57084 -73198 -18129 98468 122725 117577 75648
15240G5648j3310n6767j6262P5608K1699l949j7248n1635j44523N4295J31904
$$ 75648 62338 5571 -10691 64917 86616 82667 65419 13784 -130739 -76444 55460
15229E5460j0190k3600n9881K867J6134L9171J1042j1559O7114m7150j8777N3538
$$ 55460 45270 21670 -38211 -35344 -19210 19961 31003 19444 86558 39408 20631 74169
15217G4169o995p7765L7554O8194J6355p1620m9105k4532q0516M0700M1488j02503
$$ 74169 67174 -10591 26963 95157 111512 39892 -9213 -33745 -114261 -73561 -32073 -134576
15205a34576p8354K6643L6542J86060K8165o5124J0855M2077j4253N8853J5984
$$ -134576 -212930 -186287 -149745 36315 64480 -644 10211 52288 38035 96888 112872
15194A12872l9771j00455q887N6297J1519j10941J10583R0446p5300l9584R9063
$$ 112872 73101 -27354 -36241 20056 31575 -79366 31217 121663 46363 6779 105842
15183A05842M1751k8350l1091l0676J13896j8081r3397k1991j4946L574j5593
$$ 105842 147593 119243 88152 57476 171372 153291 59894 37903 22957 26531 10938
15172A0938j5835j29604M529L0131J41010Q1562r372M4891m8483k5815M8891o9634
$$ 10938 -4897 -134501 -129972 -99841 41169 122731 113359 158250 109767 83952 132843 63209
15160F3209j22982p613k0400j02617o351Q4154R1863L6844L8562P06j7084J0019
$$ 63209 -59773 -67386 -87786 -190403 -196754 -112600 -20737 16107 54669 55375 38291 48310
15148D8310K125l1659L0355L4518Q263n1640j14829m0021J37146R2054o041P3622
$$ 48310 50435 18776 49131 83649 91912 40272 -74557 -114578 22568 114622 108581 182203
15136A82203j5212n2265j3300L2190n6188j5912N4591L1364n5747o9911j181j7072
$$ 182203 166991 114726 101426 133616 77428 61516 116107 147471 91724 21813 20632 3560
15124C560j39451n1936K8353P245p8354P915M2971O1412o7673P354J05387O3197
$$ 3560 -135891 -187827 -159474 -152229 -230583 -222668 -179697 -118285 -185958 -178604 -73217 -10020
15112a0020R2382O609j6465o007N0412j58000r3022J00300P6052j09117n8811
$$ -10020 82362 88971 72506 66499 116911 -41089 -134111 -33811 42241 -66876 -125687
15101a25687l600J09258J9762m4080j42188L264R2603M2135j9281L7379n7485
$$ -125687 -129287 -20029 -267 -44347 -186535 -183271 -90668 -48533 -67814 -30435 -87920
15090h7920n5722l1269K0750R5082P5209Q9033P2257r0379R058J4302K2537M0233
$$ -87920 -143642 -174911 -154161 -59079 16130 105163 177420 87041 96099 110401 132938 173171
15078A73171J9803j59409j96304M1383L8189L727m2862J27721J42073N5014p016
$$ 173171 192974 33565 -162739 -121356 -83167 -79440 -122302 5419 147492 202506 195490
15067A95490o3908n3429q4024k867j436l3191n5504j07320M5042L9486Q196J3799
$$ 195490 131582 78153 -5871 -8738 -10174 -43365 -98869 -206189 -161147 -121661 -113465 -99666
15055i9666O6754o5267O5114R3387m7993m0569M8942K289L2025j2736O7908J00126
$$ -99666 -32912 -98179 -33065 60322 12329 -28240 20702 22991 55016 42280 110188 210314
15043B10314n1099o4762n567n1062k0766M4315l8008q1052l2709J9567q837j4715
$$ 210314 159215 94453 88886 37824 17058 61373 23365 -57687 -90396 -70829 -79666 -94381
15031i4381Q080R6228R0276j3735P3583J2862j6919q5896j92682n7398P5153K9424
$$ -94381 -86301 9927 100203 86468 160051 172913 155994 70098 -122584 -179982 -104829 -75405
15019g5405N5277o2928q6458l4532N9633N9535J26799k4413n4670J877N5090j69852
$$ -75405 -20128 -83056 -169514 -204046 -144413 -84878 41921 17508 -37162 -35285 19805 -150047
15007a50047j9275K24383J28439K3516j63211j22160n7633M7525M4687l9238n2633
$$ -150047 -169322 55061 183500 207016 43805 -78355 -135988 -88463 -43776 -83014 -135647
14996a35647R826L3142M1811O6920L5438p8264k6183K737J2399l8161J743L1609
$$ -135647 -125821 -92679 -50868 16052 51490 -26774 -52957 -50220 -37821 -75982 -74239 -42630
14984d2630j4220K8293m3598P9795L0907M9941m5247n2361M1086M4996m832J1131
$$ -42630 -56850 -28557 -72155 7640 38547 88488 43241 -9120 31966 76962 72130 83261
14972H3261j7861J667M4982N9590M1980p4603j37123j8807R9068j51612n2542
$$ 83261 65400 67067 112049 171639 213619 139016 1893 -16914 82154 -69458 -122000
14961a22000J13598M8786n2030j0097K4901O6849l6073Q1768p104j55517l1090
$$ -122000 -8402 40384 -11646 -21743 3158 70007 33934 115702 108598 -46919 -78009
14950g8009l3610K6845l5584J1807J49302R1183j04609r3546k4645M3467J29971
$$ -78009 -111619 -84774 -120358 -108551 40751 131934 27325 -66221 -90866 -47399 82572
14939H2572m2816j00663K6131N6683j11575Q888K6423L5286r07O8603L3151n1867
$$ 82572 39756 -60907 -34776 21907 -89668 -80780 -54357 -19071 -19978 48625 81776 29909
14927B9909J0386l346j8993m7694O462l4215Q3210l0755P232j7589n9551r1968
$$ 29909 40295 36949 17956 -29738 -23276 -57491 25719 -5036 2196 -15393 -74944 -166912
14915a66912k7344j3914P8496J19194o7315p3699Q4383R8856R5075L0123l4801
$$ -166912 -194256 -208170 -129674 -10480 -77795 -151494 -67111 31745 126820 156943 122142
14904A22142n1698r9688q0616M6619J30620k5194m5775M7699j6802o5217K2063
$$ 122142 70444 -29244 -109860 -63241 67379 42185 -3590 44109 27307 -37910 -15847
14893a5847P5506r4763j147L3800J4091O0591Q2671o5401q4648r0893O1285M2425
$$ -15847 59659 -35104 -36251 -2451 11640 72231 154902 89501 4853 -86040 -24755 17670
14881A7670K3065K3637j1529J7537o6744k0231R0172J2124k4969j4320J9137J7055
$$ 17670 40735 64372 52843 70380 3636 -16595 73577 85701 60732 46412 65549 82604
14869H2604l1746J7987k9988j03053J3143Q9098J47881n0565r0861l0368O8491
$$ 82604 50858 68845 38857 -64196 -51053 38045 185926 135361 44500 14132 82623
14858H2623l816j41513M942P5062L6864J7481l4935L36K9356O6766o6557r4029
$$ 82623 78807 -62706 -57764 17298 54162 71643 36708 37044 66400 133166 66609 -27420
14846b7420l363k0878L2151o6894l5876R2050N7696k827n9851j6506L2281J42330
$$ -27420 -30783 -51661 -19510 -86404 -122280 -30230 27466 24639 -35212 -51718 -19437 122893
14834A22893j8656j04503M2494n1940p4594J2610P0681k7587J0515J383m7904
$$ 122893 104237 -266 42228 -9712 -84306 -71696 -1015 -28602 -18087 -16704 -64608
14823f4608j0817o293o1620N0797N9809R1297N6208N4948L433O1977n3545j13764
$$ -64608 -75425 -81718 -143338 -92541 -32732 58565 114773 169721 173154 235131 181586 67822
14811F7822l6115j0941k4075M5368l4214J07875J17067o9344O0803l3276j04714
$$ 67822 31707 20766 -3309 42059 7845 115720 232787 163443 224246 190970 86256
14800H6256l386J9509r754K9055q0281j03105q6547m1122n1544O2841M4597n532
$$ 86256 82870 102379 92625 121680 41399 -61706 -148253 -189375 -240919 -178078 -133481 -139013
14788a39013M5301J47835M0287r6737r9309M0332J32307n4355p6521q5392M786
$$ -139013 -93712 54123 94410 -2327 -101636 -61304 71003 16648 -59873 -145265 -140479
14777a40479O4083L1695k4875J0280m2233r1617N4829J20320L5456n9565j8217
$$ -140479 -76396 -44701 -69576 -59296 -101529 -193146 -138317 -17997 17459 -42106 -60323
14766f0323K0688n5035P1140R9396n8453L0462p0917q108J2768k23M6997n959
$$ -60323 -39635 -94670 -23530 75866 17413 47875 -23042 -31150 -18382 -18605 28392 22433
14754B2433R712l2007J3268N6386O5522n1745n0554j9982Q945P916J8209o6901
$$ 22433 32145 138 13406 69792 135314 83569 33015 13033 21978 29894 48103 -18798
14742a8798r5686N0733R5599m4142l2048P5852j01655J5158j8344O9479L1950
$$ -18798 -114484 -63751 31848 -12294 -44342 31510 -70145 -54987 -73331 -3852 28098
14731B8098j76505Q4622O0121N1704R0083o8875o0537M0882n906k7736J6624j5582
$$ 28098 -148407 -63785 -3664 48040 138123 69248 8711 49593 43687 15951 32575 16993
14719A6993M0205M8691L1939P9183K3014j09579o0287O7618j9400K4181q3836
$$ 16993 57198 105889 137828 217011 240025 130446 70159 137777 118377 142558 58722
14708E8722m0567k1564J14668K7363q8515j11851J20477m122n1475N1803n1502
$$ 58722 18155 -3409 111259 138622 50107 -61744 58733 54611 3136 54939 3437
14697C437P615o0673Q3336O896J3707L1028r0809k4448J08421p8842m1131l9335
$$ 3437 11052 -49621 33715 40611 54318 85346 -5463 -29911 78510 -332 -41463 -80798
14685h0798K283N9653J8185M8640J1798l9296m1641L9962q2132j2756Q0714J00299
$$ -80798 -78515 -18862 -677 47963 59761 20465 -21176 18786 -63346 -76102 4612 104911
14673A04911m462l9365N48L8603J19833m5378j50275l3959j4106m1378L2572K6289
$$ 104911 100449 61084 61632 100235 220068 174690 24415 -9544 -23650 -65028 -32456 -6167
14661f167M481j26723k3882J02160O2008q5231n0572J3318M2473J04526R8470
$$ -6167 -1686 -128409 -152291 -50131 11877 -73354 -123926 -110608 -68135 36391 134861
14650A34861p7158j2406m0623M594l4828M161j3940J18913R2733j11167L1726
$$ 134861 57703 45297 4674 9268 -25560 -21399 -35339 83574 176307 65140 96866
14639I6866l3072o769j08424j3686j4844J7560L8301N4006N609m0949K1416j6948
$$ 96866 63794 57025 -51399 -65085 -79929 -62369 -24068 29938 35547 -5402 16014 -934
14627i34L6947q6197K8195p7550L5799Q8959l6225l5734Q375J6223N6636l915
$$ -934 36013 -50184 -21989 -99539 -63740 25219 -11006 -46740 -38365 -22142 34494 30579
14615C0579L4742O4829m5672k6604M0686k776n0229J1586Q6524K4739l5516k1190
$$ 30579 65321 130150 84478 57874 98560 95784 45555 57141 143665 168404 132888 111698
14603A11698l546P4370q5930J6868K7986J7921p1477r3549m0870J04815R899n728
$$ 111698 108152 182522 96592 113460 141446 159367 87890 -5659 -46529 58286 68185 62457
14591F2457m2824j2867M9677m1144k4289j18807N5939R8552M6252j34163p9636
$$ 62457 19633 6766 56443 15299 -8990 -127797 -71858 26694 72946 -61217 -140853
14580a40853J27250l0729Q5314M6228p2535J868q302j5281l4091k7330J1145J0022
$$ -140853 -13603 -44332 40982 87210 14675 16543 8241 -7040 -41131 -68461 -57316 -47294
14568d7294K5223J03911o1052r419K6178k6987j8725J592m2596Q3689M46o8040
$$ -47294 -22071 81840 20788 11369 37547 10560 -8165 -6573 -49169 34520 34966 -33074
14556c3074j2536o031P0196J14318J9925m6659o9614o6483K6995L9567j8298m5613
$$ -33074 -45610 -51641 18555 132873 152798 106139 36525 -29958 -2963 36604 18306 -27307
14544b7307j05728k9412P6959K4292k1176j0069L9030l596N644J22602R0077q228
$$ -27307 -133035 -162447 -85488 -61196 -82372 -92441 -53411 -57007 -51363 71239 161316 153088
14532A53088K4283p7474n8268j11378k1762n253J2937K6158J44520O4859k9923
$$ 153088 177371 99897 41629 -69749 -91511 -96764 -83827 -57669 86851 151710 121787
14521A21787q5842m3037k4212j0626m7609K2496M3959R3866j12224O917Q8212
$$ 121787 35945 -7092 -31304 -41930 -89539 -67043 -23084 70782 -41442 -34525 53687
14510E3687n7925K4738P095k4297L280k4478l3280M8598k9431N105r2858K3673
$$ 53687 -4238 20500 27595 3298 6578 -17900 -51180 -2582 -32013 -26908 -119766 -96093
14498i6093M0541Q594r720Q3271j5693k2852n1092J5192R7822o0175n9131q308
$$ -96093 -55552 -46958 -56678 26593 10900 -11952 -63044 -47852 49970 -10205 -69336 -77644
14486g7644p0091O3470J54891Q0866q6375k4492O1062J23159o8388k09597j1887
$$ -77644 -147735 -84265 70626 151492 65117 40625 101687 224846 156458 -53139 -65026
14475f5026j2485L3580J4659r3477J2609O0854q8015j00221Q7240O6824N1791
$$ -65026 -77511 -43931 -29272 -122749 -110140 -49286 -137301 -237522 -150282 -83458 -31667
14464c1667P0827o9820N080L6429p0854J5459J8899M3991K9032j02317k1802L8342
$$ -31667 39160 -30660 -25580 10849 -60005 -44546 -25647 18344 47376 -54941 -76743 -38401
14452c8401k0808o9635J4298P8312l7663k7198O0655P5604O3882N1201J6521J5158
$$ -38401 -59209 -128844 -114546 -36234 -73897 -101095 -40440 35164 99046 150247 166768 181926
14440A81926M121q448p3097l6571L8475k8986n4203n559L1940k0448r4179l6610
$$ 181926 186047 177599 104502 67931 106406 77420 23217 17658 49598 29150 -65029 -101639
14428a01639l928R427j5365J08043l0442k6577m1602M350R4888L1647P2483K4197
$$ -101639 -105567 -96140 -111505 -3462 -33904 -60481 -102083 -97733 -2845 28802 101285 125482
14416A25482q2209j46865l5873M0779J08110o8512j7275K9886l1137j30861k7345
$$ 125482 43273 -103592 -139465 -98686 9424 -59088 -76363 -46477 -77614 -208475 -235820
14405b35820M2220M0709O8234J820L7539K1095K219n303K47K1621o799l1775R8809
$$ -235820 -193600 -152891 -84657 -82837 -45298 -24203 -21984 -27287 -27040 -5419 -12218 -43993 54816
14392E4816q9623k2004P0699j3228q8947j0510J14209J7443K7921l1324l3624
$$ 54816 -34807 -56811 13888 660 -88287 -98797 15412 32855 60776 29452 -4172
14381d172k0251K2068N523m7422L3999n5817r5844l9638Q6805J14487Q5776Q488
$$ -4172 -24423 -2355 3168 -44254 -10255 -66072 -161916 -201554 -114749 -262 85514 94002
14369I4002K9834p4443j40662J3111P785Q9144l4939m0347n7825M6863R4677j2597
$$ 94002 123836 49393 -91269 -78158 -70373 18771 -16168 -56515 -114340 -67477 27200 14603
14357A4603K4495j12443l1237O5419n6239p7309l468J29768M0928m3195n1548
$$ 14603 39098 -73345 -104582 -39163 -95402 -172711 -176179 -46411 -5483 -48678 -100226
14346a00226J00507P7498l9114M1701n4309p2799o421m6245L4173j4089j09830
$$ -100226 281 77779 38665 80366 26057 -46742 -53163 -99408 -65235 -79324 -189154
14335a89154Q7260L2112J9481K521k6125m7558j5772j953K8909N4472M3712M5456
$$ -189154 -101894 -69782 -50301 -47780 -73905 -121463 -137235 -139188 -110279 -55807 -12095 33361
14323C3361k1185N4610p5488j14423P0267P467l3121O8830J8356k3958M1513N6592
$$ 33361 12176 66786 -8702 -123125 -52858 -45391 -78512 -9682 8674 -15284 26229 82821
14311H2821l6561m8195L4383j65Q867J5694k3011r505q5409l8868J99649P5571
$$ 82821 46260 -1935 32448 32283 41150 56844 33833 24328 -61081 -99949 99700 175271
14299A75271p4879K2796M2227n1354n4268o6935j8816N4795J7740r7463o8136
$$ 175271 100392 123188 165415 114061 59793 -7142 -25958 28837 46577 -50886 -119022
14288a19022j9147Q9903N8445L0500L6040j00164p3779j37133p6345R6998J40852
$$ -119022 -138169 -48266 10179 40679 76719 -23445 -97224 -234357 -310702 -213704 -72852
14277g2852j6824o280p1348m3802N8203R4649m7550R0082J14013j7220n9028q5206
$$ -72852 -89676 -95956 -167304 -211106 -152903 -58254 -105804 -15722 98291 81071 22043 -63163
14265f3163k5127j1879O0088p854N8910J00142P394k0888o1901M3906N3466j02149
$$ -63163 -88290 -100169 -40081 -47935 10975 111117 118511 97623 35722 79628 133094 30945
14253C0945j47779l698k8048J29912p180j05438o3889K7711J05869o1780o0465
$$ 30945 -116834 -120532 -148580 -18668 -25848 -131286 -195175 -167464 -61595 -123375 -183840
14242a83840k963Q4926k190K6989N8635j1319q9078R5473N0321R36P3683Q017
$$ -183840 -186803 -101877 -104067 -77078 -18443 -29762 -118840 -23367 26954 27890 101573 109590
14230A09590m4642k8565r7371q186N0697q1154o6370Q268J47532P2098l0909j763
$$ 109590 64948 36383 -60988 -69174 -18477 -99631 -166001 -157733 -10201 61897 30988 29225
14218B9225k7667j38397o9067m7073J13401J89728k060M3473K2620r5778o0217
$$ 29225 1558 -136839 -205906 -252979 -139578 50150 48090 91563 114183 18405 -41812
14207d1812L501J2057j1759L8174N1885m4956q0909J3309L0611Q4924N7846q6571
$$ -41812 -38311 -26254 -38013 161 52046 7090 -73819 -60510 -29899 55025 112871 26300
14195B6300k1534O4567l297L3369j5447p7413N2647M2476k9668J04930l106j29164
$$ 26300 4766 69333 66036 99405 83958 6545 59192 101668 72000 176930 173824 44660
14183D4660p275N3477j36610k4647K7980j9834k806m099J16208Q5218m0444o2602
$$ 44660 37385 90862 -45748 -70395 -42415 -62249 -65055 -69154 47054 132272 91828 29226
$$ [...]
##END NTUPLES=NMR SPECTRUM
##END=
